<svg width="211" height="176" viewBox="0 0 211 176" fill="none" xmlns="http://www.w3.org/2000/svg">
<g clip-path="url(#clip0_2179_5508)">
<path d="M57.8354 92.8916H44.3852L40.2661 85.0737C37.0717 83.8968 34.1294 82.2155 31.5235 80.114L22.7808 80.9546L15.9717 69.2697L20.5952 61.704C20.2589 59.8546 20.0908 58.0052 20.0908 56.0717C20.0908 53.4657 20.4271 50.7757 21.0996 48.2538L16.8123 40.6881L24.5462 29.6757L33.3729 30.8526C35.5585 29.3394 37.8283 28.1626 40.2661 27.2379L44.3852 19.4199H57.8354L61.5342 27.3219C64.7286 28.4988 67.6709 30.1801 70.2769 32.3657L79.1876 31.9454L85.9968 43.5462L81.1211 50.7757C81.4573 52.541 81.6255 54.3904 81.6255 56.2398C81.6255 58.9299 81.2892 61.6199 80.5326 64.2259L84.5677 72.1279L76.8338 83.1402L68.1753 81.543C66.0737 82.9721 63.888 84.149 61.5342 84.9896L57.8354 92.8916ZM45.6462 90.706H56.4904L60.0211 83.2243L60.4414 83.0562C62.8792 82.2155 65.233 80.9546 67.3346 79.4414L67.6709 79.1892L75.8251 80.6183L82.0458 71.7916L78.2629 64.31L78.347 63.8896C79.1035 61.3677 79.4398 58.6777 79.4398 56.0717C79.4398 54.2223 79.2717 52.3729 78.9354 50.6076L78.8514 50.1873L83.4749 43.3781L77.9267 34.047L69.5203 34.4673L69.184 34.2151C66.5781 32.0295 63.5518 30.2641 60.3573 29.1713L59.937 29.0032L56.4063 21.5215H45.6462L41.6952 29.0032L41.2749 29.1713C38.753 30.096 36.3992 31.2729 34.2135 32.8701L33.8773 33.1223L25.4709 32.0295L19.2502 40.8562L23.3693 48.0857L23.2852 48.506C22.6127 51.0279 22.1924 53.6339 22.1924 56.2398C22.1924 58.0892 22.3605 60.0227 22.7808 61.8721L22.8649 62.2924L18.4936 69.5219L24.0418 78.853L32.28 78.0964L32.6163 78.3486C35.2223 80.5343 38.2486 82.2155 41.443 83.3924L41.8633 83.5606L45.6462 90.706ZM50.8581 67.0841C44.8055 67.0841 39.9298 62.2084 39.9298 56.1558C39.9298 50.1032 44.8055 45.2275 50.8581 45.2275C56.9107 45.2275 61.7864 50.1032 61.7864 56.1558C61.7864 62.2084 56.9107 67.0841 50.8581 67.0841ZM50.8581 47.245C45.9824 47.245 42.0314 51.2801 42.0314 56.0717C42.0314 60.9474 45.9824 64.8984 50.8581 64.8984C55.7338 64.8984 59.6848 60.9474 59.6848 56.0717C59.6848 51.2801 55.7338 47.245 50.8581 47.245Z" fill="#5950EE"/>
<path d="M171.489 31.1887L168.631 28.7509C167.37 28.7509 165.941 28.5827 164.596 28.1624L161.318 29.8437L156.61 26.1449L157.283 22.4461C156.862 21.7736 156.526 21.1011 156.274 20.4285C155.854 19.4198 155.601 18.327 155.517 17.2341L152.659 14.8803L154.088 9.07994L157.787 8.15524C158.376 7.3146 159.048 6.47396 159.805 5.80145L160.225 2.10265L165.773 -0.0830078L168.463 2.4389C169.892 2.4389 171.237 2.60703 172.498 3.02735L175.945 1.5142L180.568 5.21301L179.728 8.82775C180.148 9.50026 180.4 10.1728 180.736 10.8453C181.157 11.854 181.409 12.9469 181.577 14.1238L184.351 16.6457L182.922 22.4461L179.307 23.2027C178.719 24.0433 178.046 24.7999 177.374 25.4724L177.122 29.1712L171.489 31.1887ZM169.22 27.3218L171.826 29.5915L175.693 28.0783L175.945 24.7158L176.197 24.5477C177.038 23.8752 177.71 23.0345 178.299 22.1939L178.467 21.9417L181.829 21.2692L182.838 17.2341L180.232 14.9644V14.7122C180.148 13.6194 179.896 12.6106 179.476 11.6019C179.223 10.9293 178.887 10.2568 178.467 9.58432L178.299 9.33213L179.055 5.88552L175.693 3.27954L172.498 4.70863L172.33 4.62456C170.985 4.20424 169.64 3.95205 168.211 4.03612H167.875L165.437 1.68233L161.57 3.19548L161.15 6.64209L160.897 6.81022C160.057 7.48273 159.384 8.32337 158.712 9.24807L158.544 9.50026L155.181 10.3409L154.172 14.376L156.778 16.5616V16.8138C156.862 17.9066 157.115 18.9154 157.535 19.9242C157.787 20.5967 158.123 21.3532 158.544 21.9417L158.712 22.1939L158.123 25.6405L161.402 28.2465L164.428 26.7333L164.68 26.8174C166.025 27.2377 167.37 27.4899 168.799 27.4058L169.22 27.3218ZM168.547 20.5126C166.614 20.5126 164.764 19.3357 164.008 17.4023C163.083 14.8803 164.26 12.1062 166.782 11.1815C169.304 10.1728 172.078 11.4337 173.003 13.9556C173.927 16.4776 172.75 19.2517 170.228 20.1764C169.724 20.3445 169.136 20.5126 168.547 20.5126ZM168.547 12.2744C168.127 12.2744 167.707 12.3584 167.286 12.5266C165.521 13.1991 164.68 15.2166 165.353 16.9819C166.025 18.7473 168.043 19.5879 169.808 18.9154C171.574 18.2429 172.414 16.2254 171.742 14.46C171.153 13.0309 169.892 12.2744 168.547 12.2744Z" fill="#A2A0EB"/>
<path d="M179.476 59.0976V147.701C179.476 149.382 178.131 150.727 176.534 150.727H50.8582C49.261 150.727 47.916 149.382 47.916 147.701V59.0976C47.916 56.2395 50.6061 53.9697 53.8005 53.9697H173.423C176.786 53.9697 179.476 56.2395 179.476 59.0976Z" fill="#1A1A1A"/>
<path d="M187.294 46.5725L182.838 45.2275L182.25 42.3693C181.829 42.0331 181.409 41.6127 180.989 41.2765C180.4 40.688 179.98 40.0155 179.56 39.343L176.87 38.5024L176.281 33.8789L178.635 32.1976C178.803 31.441 179.055 30.7685 179.392 30.096L178.635 27.3219L182.082 24.1275L184.688 25.2203C185.612 24.8841 186.621 24.6319 187.63 24.5478L189.647 22.5303L194.103 23.8753L194.523 26.6494C194.943 26.9857 195.364 27.3219 195.7 27.7422C196.288 28.3307 196.793 29.0032 197.129 29.7598L199.819 30.7685L200.492 35.392L198.138 36.9052C197.97 37.5777 197.718 38.2502 197.381 38.9227L198.222 41.6127L194.775 44.8072L192.085 43.8825C191.161 44.2187 190.152 44.4709 189.143 44.555L187.294 46.5725ZM184.015 44.1347L186.873 44.9753L188.555 43.1259H188.891C189.9 43.0418 190.908 42.7896 191.833 42.4534L192.085 42.3693L194.523 43.21L196.709 41.1924L195.868 38.6705L196.036 38.4183C196.372 37.7458 196.625 36.9892 196.793 36.2327L196.877 35.9805L198.978 34.6355L198.558 31.6932L196.12 30.7685L196.036 30.5163C195.7 29.8438 195.196 29.1713 194.691 28.5829C194.355 28.1625 193.935 27.8263 193.43 27.49L193.178 27.3219L192.758 24.8L189.9 23.9594L188.134 25.8088H187.882C186.873 25.8928 185.865 26.061 184.856 26.4813L184.604 26.5653L182.25 25.6406L180.064 27.6582L180.737 30.1801L180.569 30.4323C180.232 31.1048 179.896 31.9454 179.728 32.702L179.644 32.9542L177.542 34.4673L177.963 37.4096L180.4 38.1661L180.569 38.4183C180.905 39.0908 181.409 39.7633 181.914 40.3518C182.334 40.7721 182.754 41.1084 183.174 41.4446L183.427 41.6127L184.015 44.1347ZM188.302 38.2502C187.294 38.2502 186.285 37.8299 185.528 37.0733C184.856 36.3167 184.435 35.392 184.519 34.2992C184.519 33.2904 185.024 32.3657 185.696 31.6092C186.453 30.9366 187.462 30.5163 188.47 30.6004C189.479 30.6004 190.404 31.1048 191.161 31.7773C191.833 32.5339 192.253 33.4586 192.169 34.5514C192.169 35.5602 191.665 36.4849 190.992 37.2414C190.152 37.9139 189.227 38.2502 188.302 38.2502ZM188.302 32.0295C187.714 32.0295 187.125 32.2817 186.705 32.702C186.201 33.1223 185.949 33.7108 185.949 34.3833C185.949 35.0558 186.117 35.6442 186.621 36.0645C187.546 37.0733 189.059 37.0733 189.984 36.1486C190.488 35.7283 190.74 35.1398 190.74 34.4673C190.74 33.7948 190.572 33.2064 190.068 32.7861C189.647 32.2817 189.059 32.0295 188.386 32.0295C188.386 32.0295 188.386 32.0295 188.302 32.0295Z" fill="#A2A0EB"/>
<path d="M138.116 123.322C135.174 133.83 132.231 144.675 130.55 150.811H68.5112C67.0821 150.811 65.9893 149.466 65.9893 147.785V125.172C67.4183 121.137 68.9315 116.934 70.4446 112.814C86.6689 115.084 124.245 120.716 138.116 123.322Z" fill="#A2A0EB"/>
<path d="M145.934 94.4882C145.765 95.497 142.067 109.115 138.116 123.238C124.245 120.716 86.6686 115 70.4443 112.646C75.9085 97.4304 80.9523 83.8121 81.1204 83.728C81.7089 83.644 145.934 94.4882 145.934 94.4882Z" fill="#5950EE"/>
<path d="M139.294 21.5209C139.294 31.4404 130.803 39.5105 120.379 39.5105C109.955 39.5105 101.465 31.4404 101.465 21.5209C101.465 11.6014 109.955 3.53125 120.379 3.53125C130.887 3.53125 139.294 11.6014 139.294 21.5209Z" fill="#1A1A1A"/>
<path d="M135.342 29.9277L134.165 32.7859L133.493 34.3831L130.887 40.772L130.298 42.2851L126.767 51.0277L110.375 48.3377L113.233 39.8473C113.906 39.8473 114.578 39.5951 114.999 39.0066C115.587 38.3341 115.755 37.3253 116.007 36.4847C116.259 35.6441 116.428 34.7194 116.512 33.7947C116.596 33.2903 116.596 32.7859 116.259 32.3656C116.175 32.2815 116.175 32.2815 116.091 32.1975L118.613 31.8612L120.042 31.6931L123.657 31.2728L135.342 29.9277Z" fill="#FFC89E"/>
<path d="M134.165 32.7862L133.492 34.3834L130.886 40.7722L130.298 42.2854C129.878 42.2013 129.457 42.1172 129.121 42.0332C128.028 41.781 126.935 41.4447 125.927 40.9403C123.825 40.0156 121.892 38.6706 120.294 37.0734C119.286 35.9806 118.193 34.4674 118.445 32.9543C118.445 32.618 118.445 32.2818 118.613 31.9455C118.697 31.8614 118.697 31.7774 118.781 31.6933C119.033 31.3571 119.37 31.273 119.706 31.3571C119.874 31.3571 120.042 31.3571 120.126 31.4411C120.294 31.1889 120.631 31.0208 120.967 31.1049C121.892 31.1889 122.732 31.3571 123.573 31.4411C126.515 31.8615 129.457 32.2818 132.4 32.7021C132.988 32.618 133.576 32.618 134.165 32.7862Z" fill="#FF7E64"/>
<path d="M135.594 11.3491C132.988 11.6853 130.55 10.5084 128.028 10.2563C125.17 10.0041 122.648 11.181 119.958 12.1057C118.949 12.4419 117.856 12.61 116.932 12.0216C116.091 11.5172 115.587 10.5925 115.334 9.66781C114.998 8.49092 115.082 7.1459 115.671 6.13713C116.679 4.1196 118.277 2.2702 120.546 1.93394C121.639 1.76582 122.732 2.01801 123.657 2.60645C124.329 3.02677 124.665 2.85865 125.338 2.60645C125.758 2.43833 126.263 2.35426 126.683 2.2702C127.524 2.18614 128.448 2.2702 129.205 2.69052C129.625 2.94271 129.961 3.1949 130.214 3.61522C130.298 3.78335 130.382 4.03554 130.55 4.1196C130.718 4.20367 130.802 4.1196 131.054 4.1196C133.156 3.69928 134.837 5.46462 134.753 7.39809C135.594 7.81841 136.434 8.57498 136.771 9.41562C137.275 10.4244 136.687 11.181 135.594 11.3491Z" fill="#1A1A1A"/>
<path d="M138.536 23.7905C137.275 32.5331 130.55 37.0725 121.807 35.8116C120.042 35.5594 117.436 33.8781 115.923 33.1215C115.334 29.1705 114.578 27.9096 114.241 23.8745C113.989 20.6801 113.064 15.3 116.763 13.6188C117.184 13.4506 117.52 12.7781 117.015 12.4419C115.839 11.6853 115.082 10.1721 115.418 8.74306C115.586 8.07055 115.923 7.4821 116.427 6.97772C119.033 5.88489 121.975 5.38051 125.002 5.80083C133.744 6.97772 139.797 15.0478 138.536 23.7905Z" fill="#FFC89E"/>
<path d="M158.796 128.787C152.911 129.459 146.186 124.499 142.908 120.044C129.794 117.606 89.0228 110.461 86.8371 110.713C84.3992 110.965 72.4622 72.1276 72.4622 72.1276L73.471 69.5216C72.7144 67.9244 72.21 66.2432 71.9578 64.3938C70.949 55.8193 76.9176 48.0854 85.408 46.8244C90.1996 45.4794 98.4379 43.8822 104.743 42.7894C105.415 42.7053 106.004 42.5372 106.592 42.4531C108.021 43.4619 109.534 44.2185 110.963 44.975C116.764 47.9173 123.321 49.8507 129.878 49.5145C133.156 49.3464 136.435 48.5898 139.461 47.3288C140.049 47.581 140.638 47.8332 141.226 48.0854C147.111 50.6914 153.416 54.0539 156.526 57.5005C158.039 59.0977 159.132 60.779 160.225 62.9647C160.813 63.9734 161.234 65.0663 161.57 66.2432C163.503 71.6232 165.437 79.6934 168.883 94.1523C170.144 99.2802 171.237 103.988 171.91 107.939C172.246 109.032 172.582 110.124 172.666 111.301C173.843 119.876 167.538 127.778 158.796 128.787Z" fill="#5950EE"/>
<path d="M139.63 47.077C136.603 48.338 133.325 49.0945 130.046 49.2627C123.489 49.5989 116.932 47.7495 111.132 44.7232C109.703 43.9666 108.106 43.2101 106.761 42.2013C110.712 41.5288 113.486 41.0244 113.486 41.0244L127.945 42.6216C127.861 42.7057 133.325 44.471 139.63 47.077Z" fill="#FFC89E"/>
<path d="M114.326 23.7072C113.317 31.1048 118.445 37.998 125.927 39.0908C133.408 40.1837 140.217 34.9717 141.31 27.49C142.319 20.0924 137.191 13.1992 129.709 12.1064C122.228 11.0976 115.335 16.3096 114.326 23.7072Z" fill="#FFC89E"/>
<path d="M106.424 48.7582L106.76 49.5147L1.76464 92.7235L1.42839 91.9669C0.335557 89.3609 1.59651 86.3346 4.20249 85.3259L99.6989 45.9841C102.389 44.8912 105.331 46.1522 106.424 48.7582Z" fill="#A2A0EB"/>
<path d="M106.76 49.5146L140.218 130.636C140.89 132.233 140.302 133.915 139.041 134.419L106.592 147.785L71.958 63.8055L106.76 49.5146Z" fill="#E8EAFF"/>
<path d="M103.903 84.4854L102.978 84.9898C97.4299 77.1719 92.1338 69.1858 87.09 60.9476C87.006 60.7795 86.7538 60.6113 86.5856 60.6113C85.5769 60.9476 84.6522 61.3679 83.7275 61.9563C83.5593 62.1245 83.4753 62.4607 83.6434 62.6289C83.8115 62.797 84.0637 62.797 84.3159 62.7129C84.5681 62.5448 84.7362 62.4607 84.9884 62.2926C85.3247 69.9424 85.9131 77.5081 86.7538 85.1579C87.0059 87.3436 87.2581 89.5293 87.5944 91.7149L86.5856 92.1352C86.3334 92.2193 86.2494 92.5556 86.3334 92.8077C86.4175 93.0599 86.7538 93.144 87.006 93.0599L90.0322 91.883C90.2844 91.799 90.3685 91.4627 90.2844 91.2105C90.2004 90.9583 89.8641 90.8743 89.6119 90.9583L88.435 91.3787C87.8466 87.0073 87.3422 82.552 86.9219 78.1807L94.5717 75.1544C94.6558 75.1544 94.7398 75.0703 94.7398 74.9862C97.0936 78.5169 99.5315 82.0476 101.969 85.4942L101.465 85.8305C101.213 85.9986 101.129 86.2508 101.213 86.503C101.297 86.7552 101.633 86.8392 101.885 86.7552L102.81 86.2508C102.894 86.2508 102.978 86.1667 103.062 86.0826L104.155 85.4101C104.407 85.242 104.491 84.9898 104.407 84.7376C104.407 84.4854 104.155 84.3173 103.903 84.4854ZM94.4036 74.2297L87.006 77.0878C86.5856 72.044 86.2494 67.0002 85.9972 61.9563C86.1653 61.7882 86.3334 61.7882 86.5016 61.7042C89.1075 65.9914 91.7135 70.1105 94.4036 74.2297Z" fill="#7966F3"/>
<path d="M86.9214 93.3112C86.6692 93.3112 86.417 93.1431 86.2489 92.8909C86.1648 92.7227 86.1648 92.4706 86.2489 92.3024C86.3329 92.1343 86.417 91.9662 86.6692 91.8821L87.4258 91.5459C87.0895 89.4443 86.8373 87.2586 86.5851 85.2411C85.7445 77.9275 85.156 70.3618 84.8198 62.7961C84.7357 62.8801 84.6517 62.8801 84.4835 62.9642C84.1473 63.2164 83.727 63.1323 83.4748 62.8801C83.3066 62.712 83.3066 62.5439 83.3066 62.2917C83.3066 62.1235 83.4748 61.8714 83.5588 61.7873C84.4835 61.1988 85.4082 60.6945 86.5011 60.4423C86.8373 60.3582 87.1736 60.6104 87.3417 60.8626C92.2174 68.8486 97.5134 76.8347 103.062 84.6526L103.734 84.2323C103.902 84.1482 104.07 84.1482 104.239 84.1482C104.407 84.2323 104.659 84.3164 104.743 84.5686C104.911 84.9048 104.743 85.3251 104.407 85.5773L103.314 86.2498C103.23 86.3339 103.146 86.3339 103.062 86.418L102.221 86.9224C102.053 87.0064 101.885 87.0064 101.717 87.0064C101.548 86.9223 101.296 86.8383 101.212 86.5861C101.044 86.1658 101.212 85.7455 101.548 85.5773L101.801 85.4092C99.4469 82.1307 97.1772 78.7682 94.9074 75.4056L87.4258 78.3478C87.8461 82.6351 88.3505 86.9224 88.8548 91.0415L89.6955 90.7052C90.1158 90.5371 90.5361 90.7052 90.7043 91.0415C90.7883 91.2096 90.7883 91.4618 90.7043 91.6299C90.6202 91.798 90.5361 91.9662 90.2839 92.0502L87.2576 93.2271C87.1736 93.3112 87.0054 93.3112 86.9214 93.3112ZM85.3242 61.9554V62.3757C85.6604 70.0255 86.2489 77.7594 87.0895 85.157C87.3417 87.2586 87.5939 89.4443 87.9301 91.714V91.8821L86.7533 92.3865C86.6692 92.5546 86.6692 92.6387 86.6692 92.6387C86.7533 92.7227 86.8373 92.8068 87.0054 92.7228L90.0317 91.5459C90.1158 91.3777 90.1158 91.2937 90.1158 91.2937C90.0317 91.2096 89.9477 91.1255 89.7796 91.2096L88.3505 91.798L88.2664 91.4618C87.678 87.1745 87.1736 82.7192 86.7533 78.2638V78.0957L94.5712 74.9853C94.6552 74.9012 94.9074 74.649 94.9074 74.649L95.0756 74.9012C97.4293 78.4319 99.8672 81.9626 102.305 85.4092L102.473 85.6614L101.717 86.0817C101.633 86.1658 101.548 86.2498 101.548 86.3339C101.548 86.418 101.633 86.418 101.717 86.502C101.801 86.502 102.809 85.9136 102.809 85.9136C102.893 85.8295 104.07 85.157 104.07 85.157C104.154 85.073 104.239 84.9889 104.239 84.9048C104.239 84.8208 104.154 84.8208 104.07 84.7367C103.986 84.7367 102.893 85.4092 102.893 85.4092L102.725 85.2411C97.1772 77.4231 91.7971 69.353 86.8373 61.1988C86.7533 61.1148 86.6692 61.0307 86.5851 61.0307C85.5764 61.367 84.6517 61.7873 83.811 62.3757C83.727 62.5439 83.811 62.6279 83.811 62.6279C83.8951 62.712 83.9792 62.712 84.1473 62.6279C84.3995 62.4598 84.6517 62.3757 84.9039 62.2076L85.3242 61.9554ZM86.7533 77.5072V77.171C86.3329 72.1271 85.9967 66.9992 85.7445 62.0395L85.6604 61.7873L85.8286 61.7032C85.9967 61.6192 86.1648 61.5351 86.3329 61.5351L86.5011 61.451L86.5851 61.6192C89.1911 65.8224 91.7971 70.0255 94.5712 74.0606L94.8234 74.3969L94.4031 74.4809L86.7533 77.5072ZM86.3329 62.1235C86.5011 66.9992 86.8373 71.8749 87.2576 76.7506L94.0668 74.0606C91.4608 70.1096 88.8548 66.0745 86.3329 62.1235Z" fill="#7966F3"/>
<path d="M113.57 80.1982C113.234 80.6186 112.645 80.4504 112.309 80.1982C111.805 79.7779 111.553 79.0214 111.385 78.4329C111.132 77.6763 110.88 76.9198 110.544 76.2472C110.208 75.6588 109.871 75.0704 109.367 74.65C108.358 73.8094 106.929 74.1457 105.92 74.8182C104.996 75.4907 103.819 76.7516 104.239 77.9285C104.491 78.517 105.332 78.0966 105.08 77.5082C104.912 77.0038 105.584 76.3313 105.92 76.0791C106.341 75.6588 106.845 75.2385 107.434 75.1544C108.022 75.0704 108.61 75.1544 109.031 75.5747C109.451 76.0791 109.787 76.6676 110.04 77.3401C108.863 77.5082 107.686 77.7604 106.677 78.3488C105.668 78.9373 104.828 79.9461 104.743 81.1229C104.659 82.2158 105.164 83.3086 106.257 83.813C107.265 84.2333 108.442 84.0652 109.367 83.6449C110.544 83.1405 111.553 82.2158 112.225 81.1229C112.982 81.4592 113.906 81.3751 114.411 80.6186C114.747 80.1982 113.991 79.6939 113.57 80.1982ZM107.013 83.1405C106.173 82.9724 105.668 82.2998 105.668 81.4592C105.668 80.5345 106.257 79.6939 107.097 79.2735C108.106 78.6851 109.283 78.517 110.376 78.3488C110.628 79.1895 110.88 80.0301 111.469 80.6186C110.964 81.3751 110.376 82.0476 109.535 82.468C108.779 82.9723 107.854 83.3086 107.013 83.1405Z" fill="#7966F3"/>
<path d="M107.433 84.4007C106.929 84.4007 106.509 84.3166 106.088 84.1485C104.996 83.6441 104.323 82.4672 104.491 81.2063C104.575 80.0294 105.332 78.9365 106.593 78.18C107.517 77.5915 108.61 77.3393 109.703 77.2553C109.451 76.7509 109.199 76.2465 108.862 75.8262C108.442 75.4059 107.938 75.4059 107.517 75.4899C107.097 75.574 106.593 75.8262 106.172 76.3306C105.92 76.5828 105.332 77.1712 105.416 77.5075C105.584 77.9278 105.332 78.3481 104.911 78.5162C104.575 78.6844 104.155 78.5162 104.071 78.0959C103.65 76.8349 104.659 75.4899 105.836 74.6493C106.845 73.8927 108.442 73.5565 109.619 74.4812C110.207 74.9015 110.544 75.574 110.88 76.1624C111.216 76.8349 111.468 77.5075 111.721 78.3481C111.889 79.0206 112.141 79.6931 112.561 79.9453C112.729 80.1134 112.982 80.1975 113.234 80.1134C113.318 80.1134 113.402 80.0294 113.486 79.9453C113.654 79.7772 113.822 79.6931 113.99 79.609C114.158 79.609 114.327 79.6091 114.495 79.7772C114.663 79.8612 114.747 80.0294 114.831 80.1975C114.915 80.3656 114.831 80.6178 114.663 80.7859C114.074 81.5425 113.15 81.7106 112.393 81.4585C111.637 82.5513 110.628 83.3919 109.535 83.8963C108.778 84.2326 108.022 84.4007 107.433 84.4007ZM107.854 74.8174C108.358 74.8174 108.862 74.9855 109.199 75.4059C109.619 75.9102 109.955 76.5828 110.207 77.1712L110.376 77.5075L110.039 77.5915C108.947 77.7597 107.77 77.9278 106.761 78.5162C105.668 79.1887 104.996 80.1134 104.911 81.1222C104.827 82.215 105.332 83.1397 106.256 83.56C107.349 84.0644 108.61 83.56 109.115 83.3919C110.207 82.8875 111.216 82.0469 111.889 80.9541L111.973 80.7859L112.141 80.87C112.729 81.1222 113.57 81.1222 113.99 80.4497C114.074 80.2816 113.99 80.1975 113.906 80.1975C113.906 80.1975 113.738 80.1134 113.57 80.1975C113.402 80.3656 113.234 80.5338 112.982 80.5338C112.645 80.6178 112.225 80.4497 111.889 80.2816C111.3 79.8612 111.132 79.1047 110.88 78.5162C110.628 77.5075 110.292 76.8349 110.039 76.2465C109.703 75.6581 109.451 75.0696 108.947 74.7334C108.022 73.9768 106.677 74.313 105.836 74.9015C104.911 75.574 103.903 76.7509 104.239 77.6756C104.239 77.6756 104.323 77.8437 104.407 77.7596C104.491 77.7596 104.659 77.5915 104.575 77.4234C104.323 76.8349 104.996 76.0784 105.416 75.7421C106.004 75.1537 106.509 74.8174 107.097 74.7334C107.601 74.8174 107.686 74.8174 107.854 74.8174ZM107.433 83.476C107.265 83.476 107.097 83.476 106.929 83.3919C106.004 83.2238 105.416 82.3832 105.416 81.4585C105.416 80.5338 106.004 79.6091 106.929 79.0206C107.938 78.3481 109.199 78.18 110.292 78.0959H110.544L110.628 78.4322C110.88 79.1887 111.132 79.9453 111.552 80.5338L111.721 80.7019L111.637 80.87C111.132 81.7106 110.46 82.3832 109.619 82.8035C108.862 83.2238 108.106 83.476 107.433 83.476ZM107.013 82.8875C107.686 83.0557 108.442 82.8035 109.367 82.2991C110.039 81.8788 110.628 81.3744 111.048 80.7019C110.628 80.1134 110.376 79.3569 110.123 78.6843C109.031 78.7684 108.022 79.0206 107.181 79.525C106.341 80.0294 105.92 80.7859 105.92 81.5425C105.92 82.215 106.341 82.7194 107.013 82.8875Z" fill="#7966F3"/>
<path d="M71.9579 63.8057L106.592 147.785L38.8368 175.695C37.5758 176.199 35.9786 175.358 35.3061 173.845L1.76465 92.7236L71.9579 63.8057Z" fill="#D4D4FF"/>
<path d="M55.2293 84.7373L58.1716 91.7146C53.2118 93.8162 46.907 97.515 45.3098 102.643C42.5357 111.554 34.5497 117.606 28.6652 118.699C25.723 119.203 22.5286 120.212 20.0907 121.053L12.3568 102.895C10.4234 98.2715 12.525 93.0596 17.1485 91.0421L43.3764 79.9456C47.9999 78.0122 53.2959 80.1978 55.2293 84.7373Z" fill="white"/>
<path d="M36.3984 98.3555C38.584 103.567 36.1462 109.536 31.0183 111.722C25.8063 113.907 19.8378 111.469 17.6522 106.342C15.4665 101.13 17.9044 95.1611 23.0322 92.9754C28.2442 90.7897 34.2127 93.2276 36.3984 98.3555Z" fill="#A2A0EB"/>
<path d="M58.1707 91.7988L66.3249 111.049C68.2584 115.589 66.1568 120.885 61.5333 122.818L35.3054 133.915C30.7659 135.848 25.4699 133.747 23.5365 129.123L20.0898 121.053C22.5277 120.212 25.6381 119.204 28.6643 118.699C34.6329 117.606 42.6189 111.554 45.309 102.643C46.9062 97.5152 53.211 93.9004 58.1707 91.7988Z" fill="#A2A0EB"/>
<path d="M4.95875 86.4189C4.11811 86.7552 3.78186 87.6799 4.11811 88.5205C4.45437 89.3612 5.37907 89.6974 6.21971 89.3612C7.06034 89.0249 7.3966 88.1002 7.06034 87.2596C6.72409 86.503 5.79939 86.0827 4.95875 86.4189Z" fill="white"/>
<path d="M8.90992 84.8223C8.06928 85.1585 7.73303 86.0832 8.06928 86.9239C8.40554 87.7645 9.33024 88.1008 10.1709 87.7645C11.0115 87.4282 11.3478 86.5035 11.0115 85.6629C10.6753 84.9063 9.66649 84.486 8.90992 84.8223Z" fill="white"/>
<path d="M12.7761 83.2246C11.9355 83.5609 11.5992 84.4856 11.9355 85.3262C12.2717 86.1668 13.1965 86.5031 14.0371 86.1668C14.8777 85.8306 15.214 84.9059 14.8777 84.0652C14.5415 83.3087 13.6168 82.8884 12.7761 83.2246Z" fill="white"/>
<path d="M17.3164 118.952C15.8033 121.474 15.383 124.5 16.0555 127.358C16.1395 127.778 15.8873 128.451 15.2989 128.451C12.1045 128.283 8.40566 121.306 6.97658 118.868C4.20248 114.16 2.35307 109.116 0.839927 103.988C-0.168838 100.71 -0.925412 96.0024 2.5212 93.8167C3.78216 92.9761 5.37937 93.3123 6.13594 94.6573C6.97658 96.0864 6.80845 97.9358 6.80845 99.533C8.65786 98.4402 11.0116 98.0199 12.1885 100.29C12.3567 100.71 12.5248 101.046 12.6089 101.467C13.3654 101.803 13.9539 102.391 14.3742 103.148C15.9714 106.342 13.2814 109.2 12.1885 111.974C11.9363 112.647 11.7682 113.32 11.6001 113.992C12.1045 113.235 12.777 112.479 13.5336 111.89C15.2989 110.461 18.5774 109.284 20.1746 111.638C21.9399 114.412 18.5774 116.85 17.3164 118.952Z" fill="#FFC89E"/>
<path d="M162.159 127.862C154.089 130.72 147.364 128.114 141.647 121.809C139.882 119.792 137.192 115.252 134.334 109.872C134.081 109.452 133.829 108.947 133.661 108.527C138.789 108.107 143.665 105.165 146.355 100.709C148.793 96.59 149.213 91.5462 147.7 87.0908C148.288 87.5952 148.961 88.0996 149.549 88.604C158.292 95.6653 166.362 102.474 167.875 104.912C171.238 110.208 170.145 125.004 162.159 127.862Z" fill="#5950EE"/>
<path d="M146.355 100.709C143.749 105.164 138.789 108.107 133.661 108.527C127.776 97.0942 121.472 82.8875 121.472 82.8875L125.759 69.6895C126.936 70.7823 137.444 78.8524 147.616 87.0066C149.129 91.462 148.708 96.5899 146.355 100.709Z" fill="#FFC89E"/>
<path d="M135.174 88.9401C135.09 90.6214 134.417 92.3867 132.568 92.807C132.148 92.8911 131.727 92.8911 131.307 92.8911C130.719 93.3955 129.626 93.4795 128.869 93.4795C126.599 93.4795 124.33 92.4708 122.817 90.6214C121.976 89.5285 121.472 88.0995 120.967 86.8385C120.379 85.3254 119.874 83.8122 119.286 82.2991C118.277 79.609 117.352 76.919 116.344 74.2289C115.503 73.2202 114.662 72.3795 113.654 71.4548C112.477 70.362 110.543 69.2692 110.039 67.672C109.619 66.327 110.543 65.1501 111.804 64.8138C111.552 64.6457 111.216 64.4775 110.879 64.3094C109.534 63.6369 108.021 62.9644 107.349 61.5353C106.928 60.6947 106.844 59.6859 107.265 58.8453C106.928 58.2568 106.76 57.5003 106.844 56.8277C107.013 55.819 107.685 55.3987 108.442 55.2305C107.265 54.3899 105.836 53.3811 106.004 51.9521C106.256 50.1026 108.274 49.5983 109.871 50.0186C113.57 51.1114 116.596 54.2218 118.866 57.164C124.918 64.9819 132.568 73.2202 134.501 83.0556C134.922 84.905 135.258 86.9226 135.174 88.9401Z" fill="#FFC89E"/>
<path d="M134.67 15.4686C134.67 15.3845 134.67 15.2164 134.754 15.1323C134.754 15.0482 134.838 14.9642 134.922 14.8801C135.006 14.7961 135.09 14.7961 135.09 14.712C135.258 14.6279 135.427 14.6279 135.595 14.6279C135.679 14.6279 135.763 14.6279 135.847 14.6279C136.015 14.6279 136.183 14.712 136.267 14.7961C136.351 14.7961 136.351 14.8801 136.435 14.8801C136.687 15.1323 136.856 15.2164 137.024 15.3845C137.108 15.4686 137.192 15.5526 137.276 15.6367C137.36 15.7208 137.36 15.8048 137.36 15.9729C137.36 16.057 137.36 16.2251 137.276 16.3092C137.276 16.3933 137.192 16.4773 137.108 16.5614C137.024 16.6455 136.94 16.6455 136.94 16.7295C136.772 16.8136 136.603 16.8136 136.435 16.8136C136.351 16.8136 136.267 16.8136 136.183 16.8136C136.099 16.8136 136.015 16.8136 136.015 16.7295C135.763 16.6455 135.679 16.6455 135.511 16.5614C135.342 16.3933 135.174 16.2251 135.006 16.057C134.922 15.973 134.838 15.8889 134.754 15.8048C134.67 15.7208 134.67 15.6367 134.67 15.4686C134.754 15.4686 134.67 15.4686 134.67 15.4686Z" fill="#1A1A1A"/>
<path d="M124.497 15.6375C124.497 15.5534 124.497 15.3853 124.581 15.3013C124.581 15.2172 124.665 15.1331 124.749 15.0491C124.833 14.965 124.917 14.965 124.917 14.8809C125.086 14.7969 125.254 14.7969 125.422 14.7969C125.506 14.7969 125.59 14.7969 125.674 14.7969C125.842 14.7969 126.01 14.8809 126.094 14.965C126.178 14.965 126.178 15.0491 126.262 15.0491C126.515 15.3013 126.683 15.3853 126.851 15.5534C126.935 15.6375 127.019 15.7216 127.103 15.8056C127.187 15.8897 127.187 15.9738 127.187 16.1419C127.187 16.226 127.187 16.3941 127.103 16.4781C127.103 16.5622 127.019 16.6463 126.935 16.7303C126.851 16.8144 126.767 16.8144 126.767 16.8985C126.599 16.9825 126.431 16.9825 126.262 16.9825C126.178 16.9825 126.094 16.9825 126.01 16.9825C125.926 16.9825 125.842 16.9825 125.842 16.8985C125.59 16.8144 125.506 16.8144 125.338 16.7303C125.17 16.5622 125.001 16.3941 124.833 16.226C124.749 16.1419 124.665 16.0578 124.581 15.9738C124.497 15.8897 124.497 15.8056 124.497 15.6375C124.497 15.7216 124.497 15.7216 124.497 15.6375Z" fill="#1A1A1A"/>
<path d="M135.257 11.9377C135.005 12.1899 134.501 12.2739 134.248 12.0217C134.08 11.8536 133.828 11.8536 133.576 12.0217C133.408 12.1058 133.408 12.2739 133.324 12.442C132.819 12.358 132.399 12.358 131.895 12.442C131.895 12.0217 132.063 11.6855 132.315 11.2652C132.903 10.3405 134.416 10.0042 135.173 10.8448C135.509 11.1811 135.593 11.6014 135.257 11.9377Z" fill="#1A1A1A"/>
<path d="M141.058 11.6019C139.208 9.41629 136.182 8.91191 134.249 10.5091C133.66 11.0135 133.24 11.686 132.988 12.3585C132.651 13.1992 132.651 14.1239 132.819 15.0486C133.492 15.9733 134.417 16.7298 135.425 17.2342C135.678 17.3183 136.014 17.4864 136.266 17.5705C135.846 17.3183 135.425 16.982 135.089 16.5617C134.585 15.9733 134.249 15.2167 134.164 14.5442C133.996 13.4513 134.333 12.3585 135.173 11.6019C135.678 11.1816 136.35 11.0135 137.023 11.0135C138.115 11.0135 139.208 11.5179 140.049 12.5266C140.721 13.2832 141.058 14.292 141.058 15.2167C141.058 16.1414 140.637 16.898 140.049 17.4023C139.713 17.7386 139.208 17.9067 138.704 17.9908C138.368 18.0749 138.031 18.0749 137.611 17.9908C137.443 17.9908 137.779 18.0749 137.611 17.9908L137.191 17.9067C137.359 18.0749 137.947 18.5792 137.779 18.7474C137.611 18.9155 136.854 18.9996 136.854 19.2517C137.023 19.3358 137.191 19.3358 137.359 19.3358C137.611 19.4199 137.863 19.4199 138.199 19.4199C139.292 19.4199 140.217 19.0836 140.89 18.4952C141.814 17.7386 142.403 16.5617 142.403 15.2167C142.403 13.9557 141.898 12.6948 141.058 11.6019Z" fill="#5950EE"/>
<path d="M138.2 19.5032C138.116 19.6714 137.948 19.7554 137.864 19.9235C137.528 20.1757 137.107 20.0076 136.855 19.7554C136.771 19.6714 136.771 19.5032 136.771 19.4192C136.771 19.167 136.855 18.9988 137.107 18.8307C137.276 18.6626 137.276 18.2423 137.107 18.0741C136.855 17.906 136.603 17.822 136.435 17.7379C136.015 17.6538 135.762 17.4857 135.51 17.4016C134.501 16.8973 133.577 16.1407 132.904 15.216C132.904 15.1319 132.82 15.1319 132.82 15.0479C132.316 14.2913 131.98 13.3666 132.064 12.5259C132.4 12.4419 132.736 12.4419 133.072 12.5259C133.241 12.5259 133.325 12.5259 133.493 12.5259C133.409 12.7781 133.493 12.9463 133.493 13.1984C133.661 13.7028 133.913 14.2072 134.249 14.6275C134.586 15.0479 134.922 15.3841 135.342 15.6363C135.762 15.8885 136.183 16.1407 136.687 16.3088C137.276 16.4769 137.948 16.6451 138.368 17.1494C138.621 17.4016 138.705 17.7379 138.789 18.0741C138.705 18.5785 138.537 19.0829 138.2 19.5032Z" fill="#FF7E64"/>
<path d="M136.772 23.1181C135.931 22.95 135.006 22.8659 134.082 23.034C133.745 23.034 133.409 23.3703 133.409 23.7906C133.409 24.1269 133.745 24.4631 134.166 24.4631C134.586 24.379 135.006 24.379 135.427 24.379C135.679 24.379 135.763 24.379 135.931 24.379C136.099 24.379 136.351 24.4631 136.52 24.4631C136.856 24.5472 137.276 24.295 137.36 23.8747C137.36 23.5384 137.192 23.1181 136.772 23.1181Z" fill="#FF7E64"/>
<path d="M126.936 11.5176C124.834 10.0885 121.976 10.0045 119.959 11.5176C119.202 12.022 120.043 13.1989 120.715 12.6945C122.228 11.6017 124.414 11.5176 126.011 12.6105C126.348 12.8626 126.768 12.8626 127.02 12.5264C127.188 12.2742 127.272 11.7698 126.936 11.5176Z" fill="#1A1A1A"/>
<path d="M117.184 21.2688C117.604 21.9413 116.764 22.6978 116.175 22.1935C115.419 21.521 114.746 20.9325 114.074 20.26C114.158 21.521 114.242 22.866 114.326 23.8747C114.662 27.9098 115.082 31.8608 115.755 35.8118C109.786 32.8696 106.088 26.3126 107.012 19.3353C107.685 14.3755 110.543 10.3405 114.494 7.90263C114.998 7.31418 115.503 6.72574 116.007 6.13729C116.427 5.63291 117.436 5.96916 117.268 6.72574C116.848 8.07076 116.764 9.41578 116.848 10.7608C116.932 11.3492 117.016 11.8536 117.184 12.4421C117.352 12.6102 117.352 12.7783 117.352 12.9465C117.52 13.4508 117.52 13.8712 117.268 14.2915C117.016 14.7959 116.596 15.1321 116.343 15.7206C116.091 16.309 116.007 16.9815 116.007 17.7381C115.923 18.999 116.427 20.1759 117.184 21.2688Z" fill="#1A1A1A"/>
<path d="M115.838 37.6623C115.754 37.8304 115.67 37.9986 115.502 37.9986C115.334 38.6711 115.082 39.3436 114.746 39.848C114.325 40.3524 113.737 40.6045 113.148 40.6045L113.989 38.2508C113.905 38.1667 113.905 38.0826 113.821 37.9986C113.485 36.4854 113.317 34.9723 113.232 33.4591C113.232 32.7866 113.148 32.1141 113.232 31.4416C113.232 30.8531 113.148 30.0966 113.401 29.5922C113.737 28.9197 114.578 28.9197 115.082 29.34C115.502 29.6763 115.754 30.3488 116.007 30.8531C116.679 33.0388 116.679 35.5607 115.838 37.6623Z" fill="#1A1A1A"/>
<path d="M108.778 23.3711C108.358 26.1453 110.291 28.6672 113.065 29.0034C115.839 29.4237 118.361 27.4903 118.698 24.7162C119.118 21.9421 117.185 19.4202 114.41 19.0839C111.72 18.7476 109.198 20.6811 108.778 23.3711Z" fill="#FFC89E"/>
<path d="M117.772 23.875C116.091 22.6982 114.074 21.4372 111.888 22.1097C111.552 22.1938 111.299 22.6141 111.468 23.0344C111.552 23.3707 111.972 23.6229 112.392 23.4547C113.149 23.2025 113.905 23.3707 114.662 23.7069C115.503 24.0432 116.175 24.5476 116.932 25.0519C117.268 25.3041 117.688 25.3041 117.94 24.9679C118.109 24.6316 118.109 24.1272 117.772 23.875Z" fill="#FF7E64"/>
<path d="M121.471 69.3536C120.211 67.7564 118.445 66.6636 116.596 65.6548C114.83 64.7301 112.645 63.4692 110.543 64.2257C109.703 64.562 110.123 65.907 110.963 65.5708C112.645 64.8983 114.578 66.2433 116.091 66.9998C117.605 67.8405 119.118 68.7652 120.211 70.1102C120.799 70.8668 121.976 70.1102 121.471 69.3536Z" fill="#FF7E64"/>
<path d="M120.799 63.5526C117.773 59.5175 112.645 57.2478 107.685 57.7522C106.76 57.8362 106.845 59.2653 107.769 59.1813C112.309 58.7609 116.932 60.6944 119.622 64.3932C120.211 65.0657 121.388 64.3091 120.799 63.5526Z" fill="#FF7E64"/>
<path d="M120.379 59.1813C118.697 56.6594 116.007 54.894 113.065 54.2215C111.72 53.8853 110.039 53.7172 108.694 54.0534C106.929 54.4737 106.676 56.0709 106.929 57.5841C107.097 58.5088 108.526 58.4247 108.358 57.5C108.274 56.9956 108.105 56.2391 108.442 55.8187C108.778 55.3144 109.535 55.3984 110.039 55.3144C111.216 55.2303 112.393 55.4825 113.57 55.8187C115.839 56.4913 117.857 58.0044 119.286 59.9379C119.706 60.6944 120.883 59.9379 120.379 59.1813Z" fill="#FF7E64"/>
<path d="M20.7631 112.058C20.0906 110.629 18.4094 110.04 16.8962 110.209C15.3831 110.377 13.954 111.049 12.7771 111.974C10.5074 113.739 9.07828 116.429 8.91016 119.287C8.91016 119.708 9.33047 119.96 9.66673 119.96C10.087 119.96 10.3392 119.624 10.3392 119.203C10.5074 116.934 11.6002 114.748 13.3655 113.319C14.8787 112.058 18.3253 110.377 19.5863 112.815C19.7544 113.151 20.2588 113.235 20.595 112.983C20.9313 112.815 20.9313 112.394 20.7631 112.058Z" fill="#FF7E64"/>
<path d="M14.8794 102.138C13.7025 100.373 11.3487 101.13 10.0878 102.306C8.57462 103.651 7.31366 105.249 6.3049 107.014C5.12801 108.948 4.37143 111.133 3.86705 113.319C3.69892 114.244 5.04394 114.496 5.21207 113.571C5.88458 110.208 7.48179 107.098 9.75151 104.576C10.34 103.988 10.9284 103.315 11.6009 102.895C12.1894 102.559 13.1981 102.306 13.7025 102.979C14.1228 103.651 14.0388 104.66 13.8706 105.417C13.7025 106.257 13.3663 107.098 12.9459 107.855C12.0212 109.788 11.2647 111.806 10.9284 113.991C10.7603 114.916 12.1894 115.168 12.2734 114.244C12.4416 113.151 12.6937 111.974 13.1141 110.965C13.4503 109.956 13.9547 108.948 14.4591 107.939C15.2157 106.089 15.9722 103.82 14.8794 102.138Z" fill="#FF7E64"/>
<path d="M12.3562 101.635C11.8518 100.206 11.0952 98.6925 9.41395 98.5244C7.81673 98.3562 6.38765 99.1128 5.29482 100.206C4.20199 101.214 3.52948 102.643 2.85697 103.989C2.1004 105.502 1.34383 107.183 1.51195 108.864C1.59602 109.789 3.0251 109.705 2.94104 108.78C2.77291 107.351 3.44542 106.006 4.03387 104.745C4.53825 103.652 5.1267 102.559 5.88327 101.635C6.63984 100.794 7.56454 99.9535 8.74144 99.8694C10.1705 99.7853 10.6749 100.962 11.0952 102.055C11.2633 102.896 12.6084 102.475 12.3562 101.635Z" fill="#FF7E64"/>
<path d="M104.49 13.7875C104.406 13.1991 104.238 12.5266 104.154 11.9381C104.154 11.77 104.07 11.6019 103.902 11.4338C103.734 11.3497 103.566 11.2656 103.397 11.2656C102.977 11.3497 102.725 11.6019 102.725 12.0222C102.725 12.4425 102.725 12.7788 102.725 13.1991C102.557 13.1991 102.305 13.115 102.137 13.115C101.968 13.031 101.716 13.115 101.632 13.1991C101.464 13.2832 101.38 13.4513 101.296 13.6194C101.296 13.7875 101.296 14.0397 101.38 14.1238C101.464 14.2919 101.632 14.376 101.8 14.46C102.389 14.6282 103.061 14.7122 103.734 14.6282C103.902 14.6282 104.07 14.5441 104.238 14.376C104.406 14.1238 104.49 13.9557 104.49 13.7875Z" fill="#1A1A1A"/>
<path d="M126.515 22.6142C124.833 22.6142 123.068 21.8576 121.891 20.3445C120.882 19.1676 120.378 17.7385 120.462 16.2254C120.462 14.7122 121.135 13.4513 122.227 12.5266C124.413 10.7612 127.86 11.2656 129.877 13.7875C131.895 16.3094 131.811 19.756 129.625 21.6054C128.7 22.278 127.608 22.6142 126.515 22.6142ZM125.17 12.8628C124.413 12.8628 123.657 13.115 122.984 13.6194C122.228 14.2078 121.807 15.2166 121.723 16.2254C121.723 17.3182 122.059 18.4951 122.816 19.4198C124.329 21.2692 126.935 21.7736 128.532 20.4286C130.129 19.0835 130.129 16.4776 128.616 14.6282C127.776 13.5353 126.431 12.8628 125.17 12.8628Z" fill="#5950EE"/>
<path d="M134.921 14.6279C133.24 13.8714 131.474 14.3758 130.045 15.3845C129.709 15.6367 129.625 16.057 129.877 16.3933C130.129 16.7295 130.55 16.8136 130.886 16.5614C131.054 16.4774 131.222 16.3933 131.306 16.2252C131.39 16.1411 131.474 16.1411 131.558 16.1411C131.979 15.8889 132.315 15.8048 132.651 15.7208C132.903 15.7208 132.987 15.6367 133.072 15.6367C133.24 15.6367 133.408 15.6367 133.576 15.6367H133.744C133.828 15.6367 133.912 15.6367 133.996 15.6367C133.996 15.6367 134.248 15.7208 134.164 15.6367C134.248 15.6367 134.332 15.7208 134.417 15.7208C134.753 15.8889 135.173 15.7208 135.341 15.3845C135.425 15.2164 135.257 14.7961 134.921 14.6279Z" fill="#5950EE"/>
<path d="M117.604 85.5779C108.693 89.8652 99.6143 93.9002 90.5354 97.7672C89.6947 98.1034 90.115 99.4484 90.9557 99.1122C100.035 95.2453 109.113 91.2102 118.024 86.9229C118.865 86.5867 118.445 85.2417 117.604 85.5779Z" fill="#D4D4FF"/>
<path d="M96.5041 100.709C96.336 100.373 95.9997 100.121 95.5794 100.289C94.4866 100.709 93.4778 101.214 92.385 101.634C92.0487 101.802 91.7965 102.138 91.9646 102.559C92.1328 102.895 92.469 103.147 92.8893 102.979C93.9822 102.559 94.9909 102.054 96.0838 101.634C96.42 101.466 96.6722 101.045 96.5041 100.709Z" fill="#D4D4FF"/>
<path d="M119.202 89.6131C112.477 92.5553 105.752 95.4975 99.0266 98.4398C98.1859 98.776 98.6063 100.121 99.4469 99.7848L119.622 90.9581C120.463 90.6218 120.043 89.2768 119.202 89.6131Z" fill="#D4D4FF"/>
<path d="M108.442 99.7005C104.07 101.886 99.5308 103.904 95.0754 105.837C94.2348 106.173 94.6551 107.518 95.4957 107.182C100.035 105.249 104.491 103.231 108.862 101.045C109.703 100.625 109.282 99.2802 108.442 99.7005Z" fill="#D4D4FF"/>
<path d="M125.591 107.35C117.436 111.805 108.946 115.672 100.203 118.783C99.3627 119.119 99.783 120.464 100.624 120.128C109.534 116.933 118.109 113.066 126.347 108.527C127.188 108.107 126.431 106.93 125.591 107.35Z" fill="#D4D4FF"/>
<path d="M113.064 118.194C109.198 119.371 105.499 120.8 101.884 122.566C101.548 122.734 101.296 123.07 101.464 123.49C101.548 123.826 102.052 124.079 102.388 123.911C106.003 122.145 109.786 120.716 113.569 119.539C114.325 119.203 113.905 117.942 113.064 118.194Z" fill="#D4D4FF"/>
<path d="M127.776 111.722C123.993 113.151 120.21 114.748 116.511 116.429C115.671 116.85 116.175 118.195 116.932 117.774C120.63 116.009 124.413 114.496 128.196 113.067C129.037 112.815 128.616 111.47 127.776 111.722Z" fill="#D4D4FF"/>
<path d="M129.121 116.345C120.967 120.128 112.729 123.659 104.406 127.105C103.566 127.441 103.986 128.786 104.827 128.45C113.149 125.004 121.387 121.473 129.542 117.69C130.382 117.27 129.962 115.925 129.121 116.345Z" fill="#D4D4FF"/>
<path d="M69.0996 124.332C56.4059 129.88 43.7964 135.512 31.1028 141.061C30.2621 141.397 30.6824 142.742 31.5231 142.406C44.2167 136.857 56.8263 131.225 69.5199 125.677C70.3605 125.341 69.8561 123.996 69.0996 124.332Z" fill="#E8EAFF"/>
<path d="M42.535 142.405C39.1725 143.834 35.8099 145.179 32.5315 146.608C31.6908 146.945 32.1111 148.29 32.9518 147.953C36.3143 146.524 39.6769 145.179 42.9554 143.75C43.8801 143.414 43.3757 142.069 42.535 142.405Z" fill="#E8EAFF"/>
<path d="M69.3523 74.3134C64.981 75.8265 60.6937 77.5919 56.4065 79.3572C55.5658 79.6935 55.9861 81.0385 56.8268 80.7022C61.114 78.8528 65.4013 77.1715 69.7726 75.6584C70.6973 75.3221 70.1929 74.0612 69.3523 74.3134Z" fill="#E8EAFF"/>
<path d="M71.453 78.096C67.0817 79.9454 62.7104 81.7107 58.3391 83.5601C57.4984 83.8964 57.9188 85.2414 58.7594 84.9051C63.1307 83.0557 67.502 81.2904 71.8733 79.441C72.714 79.0207 72.2937 77.6757 71.453 78.096Z" fill="#E8EAFF"/>
<path d="M78.2627 95.2449C73.8074 97.0103 69.4361 98.7756 64.9807 100.457C64.14 100.793 64.5604 102.138 65.401 101.802C69.8564 100.037 74.2277 98.2712 78.6831 96.5899C79.5237 96.2537 79.1034 94.9087 78.2627 95.2449Z" fill="#E8EAFF"/>
<path d="M70.9494 103.148C70.6972 102.812 70.2769 102.727 69.9406 102.98C69.7725 103.064 69.6884 103.148 69.5203 103.232C69.3522 103.316 69.2681 103.316 69.2681 103.4C69.0159 103.484 68.7637 103.652 68.5116 103.736C68.0072 103.904 67.4187 104.072 66.8303 104.241C66.494 104.325 66.2418 104.829 66.41 105.165C66.5781 105.586 66.9143 105.67 67.3347 105.586C68.5116 105.333 69.6884 104.829 70.7813 104.241C71.0335 103.904 71.1175 103.4 70.9494 103.148Z" fill="#E8EAFF"/>
<path d="M80.6162 99.7014C80.5321 99.3651 80.1118 99.1129 79.6915 99.2811C77.6739 100.122 75.6564 100.878 73.6389 101.719C73.3026 101.887 73.0504 102.223 73.2186 102.644C73.3026 102.98 73.7229 103.232 74.1433 103.064C76.1608 102.223 78.1783 101.467 80.1958 100.626C80.448 100.374 80.7002 100.038 80.6162 99.7014Z" fill="#E8EAFF"/>
<path d="M81.1201 103.483C77.3373 104.744 73.6385 106.089 69.9397 107.519C69.099 107.855 69.5193 109.2 70.36 108.864C74.0588 107.434 77.7576 106.089 81.5405 104.829C82.4652 104.576 81.9608 103.231 81.1201 103.483Z" fill="#E8EAFF"/>
<path d="M87.1735 116.598C82.9703 117.943 78.8511 119.624 74.9002 121.642C74.0595 122.062 74.9002 123.239 75.6567 122.818C79.5237 120.885 83.4747 119.204 87.5938 117.943C88.4344 117.691 88.0141 116.346 87.1735 116.598Z" fill="#E8EAFF"/>
<path d="M89.3586 122.903L47.9992 140.725C47.1586 141.061 47.5789 142.406 48.4196 142.07C62.206 136.101 75.9925 130.217 89.7789 124.248C90.6196 123.828 90.1992 122.567 89.3586 122.903Z" fill="#E8EAFF"/>
<path d="M191.497 0.757442C190.656 3.53155 189.899 6.30565 189.059 8.99569C188.806 9.83633 190.152 10.2566 190.404 9.33194C191.244 6.55784 192.001 3.78374 192.842 1.0937C193.178 0.25306 191.749 -0.083195 191.497 0.757442Z" fill="#A2A0EB"/>
<path d="M195.868 10.1725C195.616 9.92035 195.111 9.92035 194.859 10.1725C194.187 10.8451 193.514 11.5176 192.841 12.2741C192.589 12.5263 192.589 13.0307 192.841 13.2829C193.094 13.5351 193.598 13.5351 193.85 13.2829C194.523 12.6104 195.195 11.9379 195.868 11.1813C196.12 10.9291 196.204 10.4247 195.868 10.1725Z" fill="#A2A0EB"/>
<path d="M210.328 14.5436C205.788 14.7958 201.165 15.1321 196.625 15.3842C195.7 15.4683 195.7 16.8133 196.625 16.8133C201.165 16.5611 205.788 16.2249 210.328 15.9727C211.252 15.8886 211.252 14.4595 210.328 14.5436Z" fill="#A2A0EB"/>
<path d="M161.906 99.1959C152.071 90.2851 141.983 81.7947 131.559 73.6405C130.886 73.052 129.962 74.1449 130.634 74.7333C141.058 82.8875 151.146 91.462 160.981 100.289C161.654 100.877 162.578 99.7843 161.906 99.1959Z" fill="#E8EAFF"/>
<path d="M146.187 75.3222C145.01 78.0122 143.833 80.7863 142.656 83.4764C142.32 84.317 143.581 84.9054 143.917 84.0648C145.094 81.3748 146.271 78.6007 147.448 75.9106C147.868 75.07 146.523 74.4815 146.187 75.3222Z" fill="#E8EAFF"/>
</g>
<defs>
<clipPath id="clip0_2179_5508">
<rect width="211" height="175.945" fill="white"/>
</clipPath>
</defs>
</svg>
