<svg width="17" height="17" viewBox="0 0 17 17" fill="none" xmlns="http://www.w3.org/2000/svg">
<path d="M1.41699 2.125H5.66699C6.41844 2.125 7.13911 2.42351 7.67046 2.95486C8.20181 3.48622 8.50033 4.20689 8.50033 4.95833V14.875C8.50033 14.3114 8.27644 13.7709 7.87793 13.3724C7.47941 12.9739 6.93891 12.75 6.37533 12.75H1.41699V2.125Z" stroke="#0F243D" stroke-width="1.42386" stroke-linecap="round" stroke-linejoin="round"/>
<path d="M15.5833 2.125H11.3333C10.5819 2.125 9.86122 2.42351 9.32986 2.95486C8.79851 3.48622 8.5 4.20689 8.5 4.95833V14.875C8.5 14.3114 8.72388 13.7709 9.1224 13.3724C9.52091 12.9739 10.0614 12.75 10.625 12.75H15.5833V2.125Z" stroke="#0F243D" stroke-width="1.42386" stroke-linecap="round" stroke-linejoin="round"/>
</svg>
