<svg width="24" height="25" viewBox="0 0 24 25" fill="none" xmlns="http://www.w3.org/2000/svg">
<path d="M12 22.8922C17.5228 22.8922 22 18.4151 22 12.8922C22 7.36936 17.5228 2.89221 12 2.89221C6.47715 2.89221 2 7.36936 2 12.8922C2 18.4151 6.47715 22.8922 12 22.8922Z" stroke="#EB5757" stroke-width="2" stroke-linecap="round" stroke-linejoin="round"/>
<path d="M12 8.89221V12.8922" stroke="#EB5757" stroke-width="2" stroke-linecap="round" stroke-linejoin="round"/>
<path d="M12 16.8922H12.01" stroke="#EB5757" stroke-width="2" stroke-linecap="round" stroke-linejoin="round"/>
</svg>
