<svg width="15" height="15" viewBox="0 0 15 15" fill="none" xmlns="http://www.w3.org/2000/svg">
<path d="M11.875 2.5H3.125C2.43464 2.5 1.875 3.05964 1.875 3.75V12.5C1.875 13.1904 2.43464 13.75 3.125 13.75H11.875C12.5654 13.75 13.125 13.1904 13.125 12.5V3.75C13.125 3.05964 12.5654 2.5 11.875 2.5Z" stroke="#737B7D" stroke-width="1.25" stroke-linecap="round" stroke-linejoin="round"/>
<path d="M10 1.25V3.75" stroke="#737B7D" stroke-width="1.25" stroke-linecap="round" stroke-linejoin="round"/>
<path d="M5 1.25V3.75" stroke="#737B7D" stroke-width="1.25" stroke-linecap="round" stroke-linejoin="round"/>
<path d="M1.875 6.25024H13.125" stroke="#737B7D" stroke-width="1.25" stroke-linecap="round" stroke-linejoin="round"/>
</svg>
