/home/aristides/NetBeansProjects/Mintic2022/src/main/java/poo/Aviones.java
/home/aristides/NetBeansProjects/Mintic2022/src/main/java/poo/Animal.java
/home/aristides/NetBeansProjects/Mintic2022/src/main/java/user/User.java
/home/aristides/NetBeansProjects/Mintic2022/src/main/java/poo/VolumenEqualizar.java
/home/aristides/NetBeansProjects/Mintic2022/src/main/java/poo/Perro.java
/home/aristides/NetBeansProjects/Mintic2022/src/main/java/poo/Herbivoro.java
/home/aristides/NetBeansProjects/Mintic2022/src/main/java/com/mycompany/mintic2022/FrmMultiplicar.java
/home/aristides/NetBeansProjects/Mintic2022/src/main/java/com/mycompany/mintic2022/Calculadora.java
/home/aristides/NetBeansProjects/Mintic2022/src/main/java/sentencias/control/flujo/Sentencias.java
/home/aristides/NetBeansProjects/Mintic2022/src/main/java/cine/TarjetaCine.java
/home/aristides/NetBeansProjects/Mintic2022/src/main/java/poo/Televisor.java
/home/aristides/NetBeansProjects/Mintic2022/src/main/java/poo/BicicletaMontania.java
/home/aristides/NetBeansProjects/Mintic2022/src/main/java/poo/Gato.java
/home/aristides/NetBeansProjects/Mintic2022/src/main/java/poo/Fecha.java
/home/aristides/NetBeansProjects/Mintic2022/src/main/java/poo/Aereopuerto.java
/home/aristides/NetBeansProjects/Mintic2022/src/main/java/poo/SerVivo.java
/home/aristides/NetBeansProjects/Mintic2022/src/main/java/poo/Intervalo.java
/home/aristides/NetBeansProjects/Mintic2022/src/main/java/arrays/Arrays.java
/home/aristides/NetBeansProjects/Mintic2022/src/main/java/com/mycompany/mintic2022/Mintic2022.java
/home/aristides/NetBeansProjects/Mintic2022/src/main/java/poo/ReproductorMusica.java
/home/aristides/NetBeansProjects/Mintic2022/src/main/java/com/mycompany/mintic2022/Reporte.java
/home/aristides/NetBeansProjects/Mintic2022/src/main/java/poo/VolumenGraduable.java
/home/aristides/NetBeansProjects/Mintic2022/src/main/java/com/mycompany/mintic2022/FrmMain.java
/home/aristides/NetBeansProjects/Mintic2022/src/main/java/variables/Variables.java
/home/aristides/NetBeansProjects/Mintic2022/src/main/java/poo/BicicletaRuta.java
/home/aristides/NetBeansProjects/Mintic2022/src/main/java/poo/Calculadora.java
/home/aristides/NetBeansProjects/Mintic2022/src/main/java/poo/Bicicleta.java
/home/aristides/NetBeansProjects/Mintic2022/src/main/java/poo/Planta.java
/home/aristides/NetBeansProjects/Mintic2022/src/main/java/poo/IntervaloNew.java
/home/aristides/NetBeansProjects/Mintic2022/src/main/java/com/mycompany/mintic2022/Cliente.java
/home/aristides/NetBeansProjects/Mintic2022/src/main/java/cine/TarjetaOro.java
/home/aristides/NetBeansProjects/Mintic2022/src/main/java/poo/Parlante.java
/home/aristides/NetBeansProjects/Mintic2022/src/main/java/poo/Carnivoro.java
/home/aristides/NetBeansProjects/Mintic2022/src/main/java/cine/TarjetaPlata.java
/home/aristides/NetBeansProjects/Mintic2022/src/main/java/operadores/Operadores.java
/home/aristides/NetBeansProjects/Mintic2022/src/main/java/arrays/ArraysParte2.java
