-- Merging decision tree log ---
application
INJECTED from /Users/macbookpro/Desktop/Flutter Projects/tracker_app/android/app/src/main/AndroidManifest.xml:2:5-32:19
MERGED from [:url_launcher_android] /Users/macbookpro/Desktop/Flutter Projects/tracker_app/build/url_launcher_android/intermediates/merged_manifest/debug/AndroidManifest.xml:9:5-14:19
MERGED from [:url_launcher_android] /Users/macbookpro/Desktop/Flutter Projects/tracker_app/build/url_launcher_android/intermediates/merged_manifest/debug/AndroidManifest.xml:9:5-14:19
MERGED from [androidx.window:window:1.0.0-beta04] /Users/macbookpro/.gradle/caches/transforms-3/25cee5f028ac2a6b79fd6278ff5b59e2/transformed/jetified-window-1.0.0-beta04/AndroidManifest.xml:24:5-31:19
MERGED from [androidx.window:window:1.0.0-beta04] /Users/macbookpro/.gradle/caches/transforms-3/25cee5f028ac2a6b79fd6278ff5b59e2/transformed/jetified-window-1.0.0-beta04/AndroidManifest.xml:24:5-31:19
MERGED from [com.google.android.gms:play-services-auth:19.2.0] /Users/macbookpro/.gradle/caches/transforms-3/5869740bfc35020cc03c9b3b8cbb03c8/transformed/jetified-play-services-auth-19.2.0/AndroidManifest.xml:22:5-38:19
MERGED from [com.google.android.gms:play-services-auth:19.2.0] /Users/macbookpro/.gradle/caches/transforms-3/5869740bfc35020cc03c9b3b8cbb03c8/transformed/jetified-play-services-auth-19.2.0/AndroidManifest.xml:22:5-38:19
MERGED from [com.google.android.gms:play-services-base:17.5.0] /Users/macbookpro/.gradle/caches/transforms-3/77a9fb5976ced9cd794a08c741bd6c31/transformed/jetified-play-services-base-17.5.0/AndroidManifest.xml:22:5-27:19
MERGED from [com.google.android.gms:play-services-base:17.5.0] /Users/macbookpro/.gradle/caches/transforms-3/77a9fb5976ced9cd794a08c741bd6c31/transformed/jetified-play-services-base-17.5.0/AndroidManifest.xml:22:5-27:19
MERGED from [com.google.android.gms:play-services-tasks:17.2.0] /Users/macbookpro/.gradle/caches/transforms-3/d9e020e53a520ce5e1addf2eb2a08e90/transformed/jetified-play-services-tasks-17.2.0/AndroidManifest.xml:7:5-20
MERGED from [com.google.android.gms:play-services-tasks:17.2.0] /Users/macbookpro/.gradle/caches/transforms-3/d9e020e53a520ce5e1addf2eb2a08e90/transformed/jetified-play-services-tasks-17.2.0/AndroidManifest.xml:7:5-20
MERGED from [com.google.android.gms:play-services-basement:17.5.0] /Users/macbookpro/.gradle/caches/transforms-3/f7a6fab5bcea4c3e4bbf76941c45d3cb/transformed/jetified-play-services-basement-17.5.0/AndroidManifest.xml:22:5-26:19
MERGED from [com.google.android.gms:play-services-basement:17.5.0] /Users/macbookpro/.gradle/caches/transforms-3/f7a6fab5bcea4c3e4bbf76941c45d3cb/transformed/jetified-play-services-basement-17.5.0/AndroidManifest.xml:22:5-26:19
MERGED from [androidx.core:core:1.10.1] /Users/macbookpro/.gradle/caches/transforms-3/c4988ff80110f75080a936fc6f044848/transformed/core-1.10.1/AndroidManifest.xml:28:5-89
MERGED from [androidx.core:core:1.10.1] /Users/macbookpro/.gradle/caches/transforms-3/c4988ff80110f75080a936fc6f044848/transformed/core-1.10.1/AndroidManifest.xml:28:5-89
MERGED from [pro.piwik:sdk-framework-android:1.2.0] /Users/macbookpro/.gradle/caches/transforms-3/c006925fdb6b0608b94e32a8e66904c1/transformed/jetified-sdk-framework-android-1.2.0/AndroidManifest.xml:13:5-14:19
MERGED from [pro.piwik:sdk-framework-android:1.2.0] /Users/macbookpro/.gradle/caches/transforms-3/c006925fdb6b0608b94e32a8e66904c1/transformed/jetified-sdk-framework-android-1.2.0/AndroidManifest.xml:13:5-14:19
MERGED from [androidx.versionedparcelable:versionedparcelable:1.1.1] /Users/macbookpro/.gradle/caches/transforms-3/47ecd4e588b99ef3b772f04d5aa6c9b7/transformed/versionedparcelable-1.1.1/AndroidManifest.xml:24:5-25:19
MERGED from [androidx.versionedparcelable:versionedparcelable:1.1.1] /Users/macbookpro/.gradle/caches/transforms-3/47ecd4e588b99ef3b772f04d5aa6c9b7/transformed/versionedparcelable-1.1.1/AndroidManifest.xml:24:5-25:19
MERGED from [com.jakewharton.timber:timber:5.0.1] /Users/macbookpro/.gradle/caches/transforms-3/abbd784e438caf9252aa4bd91fd45442/transformed/jetified-timber-5.0.1/AndroidManifest.xml:7:5-20
MERGED from [com.jakewharton.timber:timber:5.0.1] /Users/macbookpro/.gradle/caches/transforms-3/abbd784e438caf9252aa4bd91fd45442/transformed/jetified-timber-5.0.1/AndroidManifest.xml:7:5-20
	android:appComponentFactory
		ADDED from [androidx.core:core:1.10.1] /Users/macbookpro/.gradle/caches/transforms-3/c4988ff80110f75080a936fc6f044848/transformed/core-1.10.1/AndroidManifest.xml:28:18-86
	android:name
		INJECTED from /Users/macbookpro/Desktop/Flutter Projects/tracker_app/android/app/src/main/AndroidManifest.xml
manifest
ADDED from /Users/macbookpro/Desktop/Flutter Projects/tracker_app/android/app/src/main/AndroidManifest.xml:1:1-33:12
INJECTED from /Users/macbookpro/Desktop/Flutter Projects/tracker_app/android/app/src/main/AndroidManifest.xml:1:1-33:12
INJECTED from /Users/macbookpro/Desktop/Flutter Projects/tracker_app/android/app/src/main/AndroidManifest.xml:1:1-33:12
INJECTED from /Users/macbookpro/Desktop/Flutter Projects/tracker_app/android/app/src/main/AndroidManifest.xml:1:1-33:12
MERGED from /Users/macbookpro/Desktop/Flutter Projects/tracker_app/android/app/src/main/AndroidManifest.xml:1:1-33:12
MERGED from [:sms_autofill] /Users/macbookpro/Desktop/Flutter Projects/tracker_app/build/sms_autofill/intermediates/merged_manifest/debug/AndroidManifest.xml:2:1-9:12
MERGED from [:url_launcher_android] /Users/macbookpro/Desktop/Flutter Projects/tracker_app/build/url_launcher_android/intermediates/merged_manifest/debug/AndroidManifest.xml:2:1-16:12
MERGED from [:flutter_piwikpro] /Users/macbookpro/Desktop/Flutter Projects/tracker_app/build/flutter_piwikpro/intermediates/merged_manifest/debug/AndroidManifest.xml:2:1-9:12
MERGED from [androidx.window:window-java:1.0.0-beta04] /Users/macbookpro/.gradle/caches/transforms-3/ae81e06d24c799147c26814497a2a305/transformed/jetified-window-java-1.0.0-beta04/AndroidManifest.xml:17:1-23:12
MERGED from [androidx.window:window:1.0.0-beta04] /Users/macbookpro/.gradle/caches/transforms-3/25cee5f028ac2a6b79fd6278ff5b59e2/transformed/jetified-window-1.0.0-beta04/AndroidManifest.xml:17:1-33:12
MERGED from [com.google.android.gms:play-services-auth:19.2.0] /Users/macbookpro/.gradle/caches/transforms-3/5869740bfc35020cc03c9b3b8cbb03c8/transformed/jetified-play-services-auth-19.2.0/AndroidManifest.xml:17:1-40:12
MERGED from [androidx.browser:browser:1.5.0] /Users/macbookpro/.gradle/caches/transforms-3/d12883dde0390e08dd2a1192741cec1b/transformed/browser-1.5.0/AndroidManifest.xml:17:1-22:12
MERGED from [com.google.android.gms:play-services-auth-api-phone:17.0.0] /Users/macbookpro/.gradle/caches/transforms-3/bfcca1c4da35829b5c74b1d517994fff/transformed/jetified-play-services-auth-api-phone-17.0.0/AndroidManifest.xml:2:1-7:12
MERGED from [com.google.android.gms:play-services-auth-base:17.0.0] /Users/macbookpro/.gradle/caches/transforms-3/c3c404f3800947ce6794bf04f38a4287/transformed/jetified-play-services-auth-base-17.0.0/AndroidManifest.xml:2:1-7:12
MERGED from [com.google.android.gms:play-services-base:17.5.0] /Users/macbookpro/.gradle/caches/transforms-3/77a9fb5976ced9cd794a08c741bd6c31/transformed/jetified-play-services-base-17.5.0/AndroidManifest.xml:17:1-29:12
MERGED from [com.google.android.gms:play-services-tasks:17.2.0] /Users/macbookpro/.gradle/caches/transforms-3/d9e020e53a520ce5e1addf2eb2a08e90/transformed/jetified-play-services-tasks-17.2.0/AndroidManifest.xml:2:1-9:12
MERGED from [com.google.android.gms:play-services-basement:17.5.0] /Users/macbookpro/.gradle/caches/transforms-3/f7a6fab5bcea4c3e4bbf76941c45d3cb/transformed/jetified-play-services-basement-17.5.0/AndroidManifest.xml:17:1-28:12
MERGED from [androidx.fragment:fragment:1.1.0] /Users/macbookpro/.gradle/caches/transforms-3/75f94412898c7559d34d7edbbeaeb394/transformed/fragment-1.1.0/AndroidManifest.xml:17:1-24:12
MERGED from [androidx.loader:loader:1.0.0] /Users/macbookpro/.gradle/caches/transforms-3/ff65482bd388a984f10ca7f5c3c41d0d/transformed/loader-1.0.0/AndroidManifest.xml:17:1-22:12
MERGED from [androidx.viewpager:viewpager:1.0.0] /Users/macbookpro/.gradle/caches/transforms-3/83543b509ea72d197642ff197da2edd7/transformed/viewpager-1.0.0/AndroidManifest.xml:17:1-22:12
MERGED from [androidx.activity:activity:1.0.0] /Users/macbookpro/.gradle/caches/transforms-3/eb85f6cd47cafc1c47da2a37336a0e33/transformed/jetified-activity-1.0.0/AndroidManifest.xml:17:1-24:12
MERGED from [androidx.customview:customview:1.0.0] /Users/macbookpro/.gradle/caches/transforms-3/1d2f11a7d5de7a531a69c65e1d8a2026/transformed/customview-1.0.0/AndroidManifest.xml:17:1-22:12
MERGED from [androidx.core:core:1.10.1] /Users/macbookpro/.gradle/caches/transforms-3/c4988ff80110f75080a936fc6f044848/transformed/core-1.10.1/AndroidManifest.xml:17:1-30:12
MERGED from [pro.piwik:sdk-framework-android:1.2.0] /Users/macbookpro/.gradle/caches/transforms-3/c006925fdb6b0608b94e32a8e66904c1/transformed/jetified-sdk-framework-android-1.2.0/AndroidManifest.xml:2:1-16:12
MERGED from [androidx.tracing:tracing:1.0.0] /Users/macbookpro/.gradle/caches/transforms-3/cda2a1ca4d3bd6aae60d8d586ec4f3ff/transformed/jetified-tracing-1.0.0/AndroidManifest.xml:17:1-24:12
MERGED from [androidx.lifecycle:lifecycle-runtime:2.3.1] /Users/macbookpro/.gradle/caches/transforms-3/9a249567dcb8025899915ed9a2426636/transformed/lifecycle-runtime-2.3.1/AndroidManifest.xml:17:1-24:12
MERGED from [androidx.interpolator:interpolator:1.0.0] /Users/macbookpro/.gradle/caches/transforms-3/860a920bd188d8e467960610e541a595/transformed/interpolator-1.0.0/AndroidManifest.xml:17:1-22:12
MERGED from [androidx.versionedparcelable:versionedparcelable:1.1.1] /Users/macbookpro/.gradle/caches/transforms-3/47ecd4e588b99ef3b772f04d5aa6c9b7/transformed/versionedparcelable-1.1.1/AndroidManifest.xml:17:1-27:12
MERGED from [androidx.savedstate:savedstate:1.0.0] /Users/macbookpro/.gradle/caches/transforms-3/61969234c20435b339c4ea8c72dc0f22/transformed/jetified-savedstate-1.0.0/AndroidManifest.xml:17:1-24:12
MERGED from [androidx.lifecycle:lifecycle-livedata:2.0.0] /Users/macbookpro/.gradle/caches/transforms-3/7fcad9088319f1ebd7850d62df4bcaf7/transformed/lifecycle-livedata-2.0.0/AndroidManifest.xml:17:1-22:12
MERGED from [androidx.lifecycle:lifecycle-livedata-core:2.0.0] /Users/macbookpro/.gradle/caches/transforms-3/c9c1416cfdc16237773b18cd0425609e/transformed/lifecycle-livedata-core-2.0.0/AndroidManifest.xml:17:1-22:12
MERGED from [androidx.arch.core:core-runtime:2.1.0] /Users/macbookpro/.gradle/caches/transforms-3/d67fb65d423f69a271e62fa0f5833fa6/transformed/core-runtime-2.1.0/AndroidManifest.xml:17:1-24:12
MERGED from [androidx.lifecycle:lifecycle-viewmodel:2.1.0] /Users/macbookpro/.gradle/caches/transforms-3/03b9b3b952540ee8cedf6c096276d934/transformed/lifecycle-viewmodel-2.1.0/AndroidManifest.xml:17:1-22:12
MERGED from [androidx.annotation:annotation-experimental:1.3.0] /Users/macbookpro/.gradle/caches/transforms-3/937d6edc8055f6701a18eeac1a67afe6/transformed/jetified-annotation-experimental-1.3.0/AndroidManifest.xml:17:1-22:12
MERGED from [com.jakewharton.timber:timber:5.0.1] /Users/macbookpro/.gradle/caches/transforms-3/abbd784e438caf9252aa4bd91fd45442/transformed/jetified-timber-5.0.1/AndroidManifest.xml:2:1-9:12
INJECTED from /Users/macbookpro/Desktop/Flutter Projects/tracker_app/android/app/src/debug/AndroidManifest.xml:1:1-7:12
INJECTED from /Users/macbookpro/Desktop/Flutter Projects/tracker_app/android/app/src/debug/AndroidManifest.xml:1:1-7:12
INJECTED from /Users/macbookpro/Desktop/Flutter Projects/tracker_app/android/app/src/debug/AndroidManifest.xml:1:1-7:12
	package
		INJECTED from /Users/macbookpro/Desktop/Flutter Projects/tracker_app/android/app/src/main/AndroidManifest.xml
		ADDED from /Users/macbookpro/Desktop/Flutter Projects/tracker_app/android/app/src/main/AndroidManifest.xml:1:1-33:12
		INJECTED from /Users/macbookpro/Desktop/Flutter Projects/tracker_app/android/app/src/debug/AndroidManifest.xml
	android:versionName
		INJECTED from /Users/macbookpro/Desktop/Flutter Projects/tracker_app/android/app/src/main/AndroidManifest.xml
		ADDED from /Users/macbookpro/Desktop/Flutter Projects/tracker_app/android/app/src/main/AndroidManifest.xml:1:1-33:12
		INJECTED from /Users/macbookpro/Desktop/Flutter Projects/tracker_app/android/app/src/debug/AndroidManifest.xml
	android:versionCode
		INJECTED from /Users/macbookpro/Desktop/Flutter Projects/tracker_app/android/app/src/main/AndroidManifest.xml
		ADDED from /Users/macbookpro/Desktop/Flutter Projects/tracker_app/android/app/src/main/AndroidManifest.xml:1:1-33:12
		INJECTED from /Users/macbookpro/Desktop/Flutter Projects/tracker_app/android/app/src/debug/AndroidManifest.xml
	xmlns:android
		ADDED from /Users/macbookpro/Desktop/Flutter Projects/tracker_app/android/app/src/main/AndroidManifest.xml:1:11-69
uses-sdk
INJECTED from /Users/macbookpro/Desktop/Flutter Projects/tracker_app/android/app/src/main/AndroidManifest.xml reason: use-sdk injection requested
INJECTED from /Users/macbookpro/Desktop/Flutter Projects/tracker_app/android/app/src/main/AndroidManifest.xml
INJECTED from /Users/macbookpro/Desktop/Flutter Projects/tracker_app/android/app/src/main/AndroidManifest.xml
MERGED from [:sms_autofill] /Users/macbookpro/Desktop/Flutter Projects/tracker_app/build/sms_autofill/intermediates/merged_manifest/debug/AndroidManifest.xml:5:5-7:41
MERGED from [:sms_autofill] /Users/macbookpro/Desktop/Flutter Projects/tracker_app/build/sms_autofill/intermediates/merged_manifest/debug/AndroidManifest.xml:5:5-7:41
MERGED from [:url_launcher_android] /Users/macbookpro/Desktop/Flutter Projects/tracker_app/build/url_launcher_android/intermediates/merged_manifest/debug/AndroidManifest.xml:5:5-7:41
MERGED from [:url_launcher_android] /Users/macbookpro/Desktop/Flutter Projects/tracker_app/build/url_launcher_android/intermediates/merged_manifest/debug/AndroidManifest.xml:5:5-7:41
MERGED from [:flutter_piwikpro] /Users/macbookpro/Desktop/Flutter Projects/tracker_app/build/flutter_piwikpro/intermediates/merged_manifest/debug/AndroidManifest.xml:5:5-7:41
MERGED from [:flutter_piwikpro] /Users/macbookpro/Desktop/Flutter Projects/tracker_app/build/flutter_piwikpro/intermediates/merged_manifest/debug/AndroidManifest.xml:5:5-7:41
MERGED from [androidx.window:window-java:1.0.0-beta04] /Users/macbookpro/.gradle/caches/transforms-3/ae81e06d24c799147c26814497a2a305/transformed/jetified-window-java-1.0.0-beta04/AndroidManifest.xml:19:5-21:41
MERGED from [androidx.window:window-java:1.0.0-beta04] /Users/macbookpro/.gradle/caches/transforms-3/ae81e06d24c799147c26814497a2a305/transformed/jetified-window-java-1.0.0-beta04/AndroidManifest.xml:19:5-21:41
MERGED from [androidx.window:window:1.0.0-beta04] /Users/macbookpro/.gradle/caches/transforms-3/25cee5f028ac2a6b79fd6278ff5b59e2/transformed/jetified-window-1.0.0-beta04/AndroidManifest.xml:20:5-22:41
MERGED from [androidx.window:window:1.0.0-beta04] /Users/macbookpro/.gradle/caches/transforms-3/25cee5f028ac2a6b79fd6278ff5b59e2/transformed/jetified-window-1.0.0-beta04/AndroidManifest.xml:20:5-22:41
MERGED from [com.google.android.gms:play-services-auth:19.2.0] /Users/macbookpro/.gradle/caches/transforms-3/5869740bfc35020cc03c9b3b8cbb03c8/transformed/jetified-play-services-auth-19.2.0/AndroidManifest.xml:20:5-44
MERGED from [com.google.android.gms:play-services-auth:19.2.0] /Users/macbookpro/.gradle/caches/transforms-3/5869740bfc35020cc03c9b3b8cbb03c8/transformed/jetified-play-services-auth-19.2.0/AndroidManifest.xml:20:5-44
MERGED from [androidx.browser:browser:1.5.0] /Users/macbookpro/.gradle/caches/transforms-3/d12883dde0390e08dd2a1192741cec1b/transformed/browser-1.5.0/AndroidManifest.xml:20:5-44
MERGED from [androidx.browser:browser:1.5.0] /Users/macbookpro/.gradle/caches/transforms-3/d12883dde0390e08dd2a1192741cec1b/transformed/browser-1.5.0/AndroidManifest.xml:20:5-44
MERGED from [com.google.android.gms:play-services-auth-api-phone:17.0.0] /Users/macbookpro/.gradle/caches/transforms-3/bfcca1c4da35829b5c74b1d517994fff/transformed/jetified-play-services-auth-api-phone-17.0.0/AndroidManifest.xml:5:5-44
MERGED from [com.google.android.gms:play-services-auth-api-phone:17.0.0] /Users/macbookpro/.gradle/caches/transforms-3/bfcca1c4da35829b5c74b1d517994fff/transformed/jetified-play-services-auth-api-phone-17.0.0/AndroidManifest.xml:5:5-44
MERGED from [com.google.android.gms:play-services-auth-base:17.0.0] /Users/macbookpro/.gradle/caches/transforms-3/c3c404f3800947ce6794bf04f38a4287/transformed/jetified-play-services-auth-base-17.0.0/AndroidManifest.xml:5:5-44
MERGED from [com.google.android.gms:play-services-auth-base:17.0.0] /Users/macbookpro/.gradle/caches/transforms-3/c3c404f3800947ce6794bf04f38a4287/transformed/jetified-play-services-auth-base-17.0.0/AndroidManifest.xml:5:5-44
MERGED from [com.google.android.gms:play-services-base:17.5.0] /Users/macbookpro/.gradle/caches/transforms-3/77a9fb5976ced9cd794a08c741bd6c31/transformed/jetified-play-services-base-17.5.0/AndroidManifest.xml:20:5-44
MERGED from [com.google.android.gms:play-services-base:17.5.0] /Users/macbookpro/.gradle/caches/transforms-3/77a9fb5976ced9cd794a08c741bd6c31/transformed/jetified-play-services-base-17.5.0/AndroidManifest.xml:20:5-44
MERGED from [com.google.android.gms:play-services-tasks:17.2.0] /Users/macbookpro/.gradle/caches/transforms-3/d9e020e53a520ce5e1addf2eb2a08e90/transformed/jetified-play-services-tasks-17.2.0/AndroidManifest.xml:5:5-44
MERGED from [com.google.android.gms:play-services-tasks:17.2.0] /Users/macbookpro/.gradle/caches/transforms-3/d9e020e53a520ce5e1addf2eb2a08e90/transformed/jetified-play-services-tasks-17.2.0/AndroidManifest.xml:5:5-44
MERGED from [com.google.android.gms:play-services-basement:17.5.0] /Users/macbookpro/.gradle/caches/transforms-3/f7a6fab5bcea4c3e4bbf76941c45d3cb/transformed/jetified-play-services-basement-17.5.0/AndroidManifest.xml:20:5-44
MERGED from [com.google.android.gms:play-services-basement:17.5.0] /Users/macbookpro/.gradle/caches/transforms-3/f7a6fab5bcea4c3e4bbf76941c45d3cb/transformed/jetified-play-services-basement-17.5.0/AndroidManifest.xml:20:5-44
MERGED from [androidx.fragment:fragment:1.1.0] /Users/macbookpro/.gradle/caches/transforms-3/75f94412898c7559d34d7edbbeaeb394/transformed/fragment-1.1.0/AndroidManifest.xml:20:5-22:41
MERGED from [androidx.fragment:fragment:1.1.0] /Users/macbookpro/.gradle/caches/transforms-3/75f94412898c7559d34d7edbbeaeb394/transformed/fragment-1.1.0/AndroidManifest.xml:20:5-22:41
MERGED from [androidx.loader:loader:1.0.0] /Users/macbookpro/.gradle/caches/transforms-3/ff65482bd388a984f10ca7f5c3c41d0d/transformed/loader-1.0.0/AndroidManifest.xml:20:5-44
MERGED from [androidx.loader:loader:1.0.0] /Users/macbookpro/.gradle/caches/transforms-3/ff65482bd388a984f10ca7f5c3c41d0d/transformed/loader-1.0.0/AndroidManifest.xml:20:5-44
MERGED from [androidx.viewpager:viewpager:1.0.0] /Users/macbookpro/.gradle/caches/transforms-3/83543b509ea72d197642ff197da2edd7/transformed/viewpager-1.0.0/AndroidManifest.xml:20:5-44
MERGED from [androidx.viewpager:viewpager:1.0.0] /Users/macbookpro/.gradle/caches/transforms-3/83543b509ea72d197642ff197da2edd7/transformed/viewpager-1.0.0/AndroidManifest.xml:20:5-44
MERGED from [androidx.activity:activity:1.0.0] /Users/macbookpro/.gradle/caches/transforms-3/eb85f6cd47cafc1c47da2a37336a0e33/transformed/jetified-activity-1.0.0/AndroidManifest.xml:20:5-22:41
MERGED from [androidx.activity:activity:1.0.0] /Users/macbookpro/.gradle/caches/transforms-3/eb85f6cd47cafc1c47da2a37336a0e33/transformed/jetified-activity-1.0.0/AndroidManifest.xml:20:5-22:41
MERGED from [androidx.customview:customview:1.0.0] /Users/macbookpro/.gradle/caches/transforms-3/1d2f11a7d5de7a531a69c65e1d8a2026/transformed/customview-1.0.0/AndroidManifest.xml:20:5-44
MERGED from [androidx.customview:customview:1.0.0] /Users/macbookpro/.gradle/caches/transforms-3/1d2f11a7d5de7a531a69c65e1d8a2026/transformed/customview-1.0.0/AndroidManifest.xml:20:5-44
MERGED from [androidx.core:core:1.10.1] /Users/macbookpro/.gradle/caches/transforms-3/c4988ff80110f75080a936fc6f044848/transformed/core-1.10.1/AndroidManifest.xml:20:5-44
MERGED from [androidx.core:core:1.10.1] /Users/macbookpro/.gradle/caches/transforms-3/c4988ff80110f75080a936fc6f044848/transformed/core-1.10.1/AndroidManifest.xml:20:5-44
MERGED from [pro.piwik:sdk-framework-android:1.2.0] /Users/macbookpro/.gradle/caches/transforms-3/c006925fdb6b0608b94e32a8e66904c1/transformed/jetified-sdk-framework-android-1.2.0/AndroidManifest.xml:5:5-8:46
MERGED from [pro.piwik:sdk-framework-android:1.2.0] /Users/macbookpro/.gradle/caches/transforms-3/c006925fdb6b0608b94e32a8e66904c1/transformed/jetified-sdk-framework-android-1.2.0/AndroidManifest.xml:5:5-8:46
MERGED from [androidx.tracing:tracing:1.0.0] /Users/macbookpro/.gradle/caches/transforms-3/cda2a1ca4d3bd6aae60d8d586ec4f3ff/transformed/jetified-tracing-1.0.0/AndroidManifest.xml:20:5-22:41
MERGED from [androidx.tracing:tracing:1.0.0] /Users/macbookpro/.gradle/caches/transforms-3/cda2a1ca4d3bd6aae60d8d586ec4f3ff/transformed/jetified-tracing-1.0.0/AndroidManifest.xml:20:5-22:41
MERGED from [androidx.lifecycle:lifecycle-runtime:2.3.1] /Users/macbookpro/.gradle/caches/transforms-3/9a249567dcb8025899915ed9a2426636/transformed/lifecycle-runtime-2.3.1/AndroidManifest.xml:20:5-22:41
MERGED from [androidx.lifecycle:lifecycle-runtime:2.3.1] /Users/macbookpro/.gradle/caches/transforms-3/9a249567dcb8025899915ed9a2426636/transformed/lifecycle-runtime-2.3.1/AndroidManifest.xml:20:5-22:41
MERGED from [androidx.interpolator:interpolator:1.0.0] /Users/macbookpro/.gradle/caches/transforms-3/860a920bd188d8e467960610e541a595/transformed/interpolator-1.0.0/AndroidManifest.xml:20:5-44
MERGED from [androidx.interpolator:interpolator:1.0.0] /Users/macbookpro/.gradle/caches/transforms-3/860a920bd188d8e467960610e541a595/transformed/interpolator-1.0.0/AndroidManifest.xml:20:5-44
MERGED from [androidx.versionedparcelable:versionedparcelable:1.1.1] /Users/macbookpro/.gradle/caches/transforms-3/47ecd4e588b99ef3b772f04d5aa6c9b7/transformed/versionedparcelable-1.1.1/AndroidManifest.xml:20:5-22:41
MERGED from [androidx.versionedparcelable:versionedparcelable:1.1.1] /Users/macbookpro/.gradle/caches/transforms-3/47ecd4e588b99ef3b772f04d5aa6c9b7/transformed/versionedparcelable-1.1.1/AndroidManifest.xml:20:5-22:41
MERGED from [androidx.savedstate:savedstate:1.0.0] /Users/macbookpro/.gradle/caches/transforms-3/61969234c20435b339c4ea8c72dc0f22/transformed/jetified-savedstate-1.0.0/AndroidManifest.xml:20:5-22:41
MERGED from [androidx.savedstate:savedstate:1.0.0] /Users/macbookpro/.gradle/caches/transforms-3/61969234c20435b339c4ea8c72dc0f22/transformed/jetified-savedstate-1.0.0/AndroidManifest.xml:20:5-22:41
MERGED from [androidx.lifecycle:lifecycle-livedata:2.0.0] /Users/macbookpro/.gradle/caches/transforms-3/7fcad9088319f1ebd7850d62df4bcaf7/transformed/lifecycle-livedata-2.0.0/AndroidManifest.xml:20:5-44
MERGED from [androidx.lifecycle:lifecycle-livedata:2.0.0] /Users/macbookpro/.gradle/caches/transforms-3/7fcad9088319f1ebd7850d62df4bcaf7/transformed/lifecycle-livedata-2.0.0/AndroidManifest.xml:20:5-44
MERGED from [androidx.lifecycle:lifecycle-livedata-core:2.0.0] /Users/macbookpro/.gradle/caches/transforms-3/c9c1416cfdc16237773b18cd0425609e/transformed/lifecycle-livedata-core-2.0.0/AndroidManifest.xml:20:5-44
MERGED from [androidx.lifecycle:lifecycle-livedata-core:2.0.0] /Users/macbookpro/.gradle/caches/transforms-3/c9c1416cfdc16237773b18cd0425609e/transformed/lifecycle-livedata-core-2.0.0/AndroidManifest.xml:20:5-44
MERGED from [androidx.arch.core:core-runtime:2.1.0] /Users/macbookpro/.gradle/caches/transforms-3/d67fb65d423f69a271e62fa0f5833fa6/transformed/core-runtime-2.1.0/AndroidManifest.xml:20:5-22:41
MERGED from [androidx.arch.core:core-runtime:2.1.0] /Users/macbookpro/.gradle/caches/transforms-3/d67fb65d423f69a271e62fa0f5833fa6/transformed/core-runtime-2.1.0/AndroidManifest.xml:20:5-22:41
MERGED from [androidx.lifecycle:lifecycle-viewmodel:2.1.0] /Users/macbookpro/.gradle/caches/transforms-3/03b9b3b952540ee8cedf6c096276d934/transformed/lifecycle-viewmodel-2.1.0/AndroidManifest.xml:20:5-44
MERGED from [androidx.lifecycle:lifecycle-viewmodel:2.1.0] /Users/macbookpro/.gradle/caches/transforms-3/03b9b3b952540ee8cedf6c096276d934/transformed/lifecycle-viewmodel-2.1.0/AndroidManifest.xml:20:5-44
MERGED from [androidx.annotation:annotation-experimental:1.3.0] /Users/macbookpro/.gradle/caches/transforms-3/937d6edc8055f6701a18eeac1a67afe6/transformed/jetified-annotation-experimental-1.3.0/AndroidManifest.xml:20:5-44
MERGED from [androidx.annotation:annotation-experimental:1.3.0] /Users/macbookpro/.gradle/caches/transforms-3/937d6edc8055f6701a18eeac1a67afe6/transformed/jetified-annotation-experimental-1.3.0/AndroidManifest.xml:20:5-44
MERGED from [com.jakewharton.timber:timber:5.0.1] /Users/macbookpro/.gradle/caches/transforms-3/abbd784e438caf9252aa4bd91fd45442/transformed/jetified-timber-5.0.1/AndroidManifest.xml:5:5-44
MERGED from [com.jakewharton.timber:timber:5.0.1] /Users/macbookpro/.gradle/caches/transforms-3/abbd784e438caf9252aa4bd91fd45442/transformed/jetified-timber-5.0.1/AndroidManifest.xml:5:5-44
INJECTED from /Users/macbookpro/Desktop/Flutter Projects/tracker_app/android/app/src/debug/AndroidManifest.xml
INJECTED from /Users/macbookpro/Desktop/Flutter Projects/tracker_app/android/app/src/debug/AndroidManifest.xml
	tools:overrideLibrary
		ADDED from [pro.piwik:sdk-framework-android:1.2.0] /Users/macbookpro/.gradle/caches/transforms-3/c006925fdb6b0608b94e32a8e66904c1/transformed/jetified-sdk-framework-android-1.2.0/AndroidManifest.xml:8:9-43
	android:targetSdkVersion
		INJECTED from /Users/macbookpro/Desktop/Flutter Projects/tracker_app/android/app/src/main/AndroidManifest.xml
		INJECTED from /Users/macbookpro/Desktop/Flutter Projects/tracker_app/android/app/src/debug/AndroidManifest.xml
	android:minSdkVersion
		INJECTED from /Users/macbookpro/Desktop/Flutter Projects/tracker_app/android/app/src/main/AndroidManifest.xml
		INJECTED from /Users/macbookpro/Desktop/Flutter Projects/tracker_app/android/app/src/debug/AndroidManifest.xml
uses-permission#android.permission.INTERNET
ADDED from /Users/macbookpro/Desktop/Flutter Projects/tracker_app/android/app/src/debug/AndroidManifest.xml:6:5-66
MERGED from [pro.piwik:sdk-framework-android:1.2.0] /Users/macbookpro/.gradle/caches/transforms-3/c006925fdb6b0608b94e32a8e66904c1/transformed/jetified-sdk-framework-android-1.2.0/AndroidManifest.xml:10:5-67
MERGED from [pro.piwik:sdk-framework-android:1.2.0] /Users/macbookpro/.gradle/caches/transforms-3/c006925fdb6b0608b94e32a8e66904c1/transformed/jetified-sdk-framework-android-1.2.0/AndroidManifest.xml:10:5-67
	android:name
		ADDED from /Users/macbookpro/Desktop/Flutter Projects/tracker_app/android/app/src/debug/AndroidManifest.xml:6:22-64
activity#io.flutter.plugins.urllauncher.WebViewActivity
ADDED from [:url_launcher_android] /Users/macbookpro/Desktop/Flutter Projects/tracker_app/build/url_launcher_android/intermediates/merged_manifest/debug/AndroidManifest.xml:10:9-13:74
	android:exported
		ADDED from [:url_launcher_android] /Users/macbookpro/Desktop/Flutter Projects/tracker_app/build/url_launcher_android/intermediates/merged_manifest/debug/AndroidManifest.xml:12:13-37
	android:theme
		ADDED from [:url_launcher_android] /Users/macbookpro/Desktop/Flutter Projects/tracker_app/build/url_launcher_android/intermediates/merged_manifest/debug/AndroidManifest.xml:13:13-71
	android:name
		ADDED from [:url_launcher_android] /Users/macbookpro/Desktop/Flutter Projects/tracker_app/build/url_launcher_android/intermediates/merged_manifest/debug/AndroidManifest.xml:11:13-74
uses-library#androidx.window.extensions
ADDED from [androidx.window:window:1.0.0-beta04] /Users/macbookpro/.gradle/caches/transforms-3/25cee5f028ac2a6b79fd6278ff5b59e2/transformed/jetified-window-1.0.0-beta04/AndroidManifest.xml:25:9-27:40
	android:required
		ADDED from [androidx.window:window:1.0.0-beta04] /Users/macbookpro/.gradle/caches/transforms-3/25cee5f028ac2a6b79fd6278ff5b59e2/transformed/jetified-window-1.0.0-beta04/AndroidManifest.xml:27:13-37
	android:name
		ADDED from [androidx.window:window:1.0.0-beta04] /Users/macbookpro/.gradle/caches/transforms-3/25cee5f028ac2a6b79fd6278ff5b59e2/transformed/jetified-window-1.0.0-beta04/AndroidManifest.xml:26:13-54
uses-library#androidx.window.sidecar
ADDED from [androidx.window:window:1.0.0-beta04] /Users/macbookpro/.gradle/caches/transforms-3/25cee5f028ac2a6b79fd6278ff5b59e2/transformed/jetified-window-1.0.0-beta04/AndroidManifest.xml:28:9-30:40
	android:required
		ADDED from [androidx.window:window:1.0.0-beta04] /Users/macbookpro/.gradle/caches/transforms-3/25cee5f028ac2a6b79fd6278ff5b59e2/transformed/jetified-window-1.0.0-beta04/AndroidManifest.xml:30:13-37
	android:name
		ADDED from [androidx.window:window:1.0.0-beta04] /Users/macbookpro/.gradle/caches/transforms-3/25cee5f028ac2a6b79fd6278ff5b59e2/transformed/jetified-window-1.0.0-beta04/AndroidManifest.xml:29:13-51
activity#com.google.android.gms.auth.api.signin.internal.SignInHubActivity
ADDED from [com.google.android.gms:play-services-auth:19.2.0] /Users/macbookpro/.gradle/caches/transforms-3/5869740bfc35020cc03c9b3b8cbb03c8/transformed/jetified-play-services-auth-19.2.0/AndroidManifest.xml:23:9-27:75
	android:excludeFromRecents
		ADDED from [com.google.android.gms:play-services-auth:19.2.0] /Users/macbookpro/.gradle/caches/transforms-3/5869740bfc35020cc03c9b3b8cbb03c8/transformed/jetified-play-services-auth-19.2.0/AndroidManifest.xml:25:13-46
	android:exported
		ADDED from [com.google.android.gms:play-services-auth:19.2.0] /Users/macbookpro/.gradle/caches/transforms-3/5869740bfc35020cc03c9b3b8cbb03c8/transformed/jetified-play-services-auth-19.2.0/AndroidManifest.xml:26:13-37
	android:theme
		ADDED from [com.google.android.gms:play-services-auth:19.2.0] /Users/macbookpro/.gradle/caches/transforms-3/5869740bfc35020cc03c9b3b8cbb03c8/transformed/jetified-play-services-auth-19.2.0/AndroidManifest.xml:27:13-72
	android:name
		ADDED from [com.google.android.gms:play-services-auth:19.2.0] /Users/macbookpro/.gradle/caches/transforms-3/5869740bfc35020cc03c9b3b8cbb03c8/transformed/jetified-play-services-auth-19.2.0/AndroidManifest.xml:24:13-93
service#com.google.android.gms.auth.api.signin.RevocationBoundService
ADDED from [com.google.android.gms:play-services-auth:19.2.0] /Users/macbookpro/.gradle/caches/transforms-3/5869740bfc35020cc03c9b3b8cbb03c8/transformed/jetified-play-services-auth-19.2.0/AndroidManifest.xml:33:9-37:51
	android:exported
		ADDED from [com.google.android.gms:play-services-auth:19.2.0] /Users/macbookpro/.gradle/caches/transforms-3/5869740bfc35020cc03c9b3b8cbb03c8/transformed/jetified-play-services-auth-19.2.0/AndroidManifest.xml:35:13-36
	android:visibleToInstantApps
		ADDED from [com.google.android.gms:play-services-auth:19.2.0] /Users/macbookpro/.gradle/caches/transforms-3/5869740bfc35020cc03c9b3b8cbb03c8/transformed/jetified-play-services-auth-19.2.0/AndroidManifest.xml:37:13-48
	android:permission
		ADDED from [com.google.android.gms:play-services-auth:19.2.0] /Users/macbookpro/.gradle/caches/transforms-3/5869740bfc35020cc03c9b3b8cbb03c8/transformed/jetified-play-services-auth-19.2.0/AndroidManifest.xml:36:13-107
	android:name
		ADDED from [com.google.android.gms:play-services-auth:19.2.0] /Users/macbookpro/.gradle/caches/transforms-3/5869740bfc35020cc03c9b3b8cbb03c8/transformed/jetified-play-services-auth-19.2.0/AndroidManifest.xml:34:13-89
activity#com.google.android.gms.common.api.GoogleApiActivity
ADDED from [com.google.android.gms:play-services-base:17.5.0] /Users/macbookpro/.gradle/caches/transforms-3/77a9fb5976ced9cd794a08c741bd6c31/transformed/jetified-play-services-base-17.5.0/AndroidManifest.xml:23:9-26:75
	android:exported
		ADDED from [com.google.android.gms:play-services-base:17.5.0] /Users/macbookpro/.gradle/caches/transforms-3/77a9fb5976ced9cd794a08c741bd6c31/transformed/jetified-play-services-base-17.5.0/AndroidManifest.xml:25:13-37
	android:theme
		ADDED from [com.google.android.gms:play-services-base:17.5.0] /Users/macbookpro/.gradle/caches/transforms-3/77a9fb5976ced9cd794a08c741bd6c31/transformed/jetified-play-services-base-17.5.0/AndroidManifest.xml:26:13-72
	android:name
		ADDED from [com.google.android.gms:play-services-base:17.5.0] /Users/macbookpro/.gradle/caches/transforms-3/77a9fb5976ced9cd794a08c741bd6c31/transformed/jetified-play-services-base-17.5.0/AndroidManifest.xml:24:13-79
meta-data#com.google.android.gms.version
ADDED from [com.google.android.gms:play-services-basement:17.5.0] /Users/macbookpro/.gradle/caches/transforms-3/f7a6fab5bcea4c3e4bbf76941c45d3cb/transformed/jetified-play-services-basement-17.5.0/AndroidManifest.xml:23:9-25:69
	android:value
		ADDED from [com.google.android.gms:play-services-basement:17.5.0] /Users/macbookpro/.gradle/caches/transforms-3/f7a6fab5bcea4c3e4bbf76941c45d3cb/transformed/jetified-play-services-basement-17.5.0/AndroidManifest.xml:25:13-66
	android:name
		ADDED from [com.google.android.gms:play-services-basement:17.5.0] /Users/macbookpro/.gradle/caches/transforms-3/f7a6fab5bcea4c3e4bbf76941c45d3cb/transformed/jetified-play-services-basement-17.5.0/AndroidManifest.xml:24:13-58
permission#${applicationId}.DYNAMIC_RECEIVER_NOT_EXPORTED_PERMISSION
ADDED from [androidx.core:core:1.10.1] /Users/macbookpro/.gradle/caches/transforms-3/c4988ff80110f75080a936fc6f044848/transformed/core-1.10.1/AndroidManifest.xml:22:5-24:47
	android:protectionLevel
		ADDED from [androidx.core:core:1.10.1] /Users/macbookpro/.gradle/caches/transforms-3/c4988ff80110f75080a936fc6f044848/transformed/core-1.10.1/AndroidManifest.xml:24:9-44
	android:name
		ADDED from [androidx.core:core:1.10.1] /Users/macbookpro/.gradle/caches/transforms-3/c4988ff80110f75080a936fc6f044848/transformed/core-1.10.1/AndroidManifest.xml:23:9-81
permission#com.example.tracker_app.DYNAMIC_RECEIVER_NOT_EXPORTED_PERMISSION
ADDED from [androidx.core:core:1.10.1] /Users/macbookpro/.gradle/caches/transforms-3/c4988ff80110f75080a936fc6f044848/transformed/core-1.10.1/AndroidManifest.xml:22:5-24:47
	android:protectionLevel
		ADDED from [androidx.core:core:1.10.1] /Users/macbookpro/.gradle/caches/transforms-3/c4988ff80110f75080a936fc6f044848/transformed/core-1.10.1/AndroidManifest.xml:24:9-44
	android:name
		ADDED from [androidx.core:core:1.10.1] /Users/macbookpro/.gradle/caches/transforms-3/c4988ff80110f75080a936fc6f044848/transformed/core-1.10.1/AndroidManifest.xml:23:9-81
uses-permission#${applicationId}.DYNAMIC_RECEIVER_NOT_EXPORTED_PERMISSION
ADDED from [androidx.core:core:1.10.1] /Users/macbookpro/.gradle/caches/transforms-3/c4988ff80110f75080a936fc6f044848/transformed/core-1.10.1/AndroidManifest.xml:26:5-97
	android:name
		ADDED from [androidx.core:core:1.10.1] /Users/macbookpro/.gradle/caches/transforms-3/c4988ff80110f75080a936fc6f044848/transformed/core-1.10.1/AndroidManifest.xml:26:22-94
uses-permission#com.example.tracker_app.DYNAMIC_RECEIVER_NOT_EXPORTED_PERMISSION
ADDED from [androidx.core:core:1.10.1] /Users/macbookpro/.gradle/caches/transforms-3/c4988ff80110f75080a936fc6f044848/transformed/core-1.10.1/AndroidManifest.xml:26:5-97
	android:name
		ADDED from [androidx.core:core:1.10.1] /Users/macbookpro/.gradle/caches/transforms-3/c4988ff80110f75080a936fc6f044848/transformed/core-1.10.1/AndroidManifest.xml:26:22-94
uses-permission#android.permission.ACCESS_NETWORK_STATE
ADDED from [pro.piwik:sdk-framework-android:1.2.0] /Users/macbookpro/.gradle/caches/transforms-3/c006925fdb6b0608b94e32a8e66904c1/transformed/jetified-sdk-framework-android-1.2.0/AndroidManifest.xml:11:5-79
	android:name
		ADDED from [pro.piwik:sdk-framework-android:1.2.0] /Users/macbookpro/.gradle/caches/transforms-3/c006925fdb6b0608b94e32a8e66904c1/transformed/jetified-sdk-framework-android-1.2.0/AndroidManifest.xml:11:22-76
