{
    "name": "${DATABRICKS_JOB_NAME}",
    "email_notifications": {
        "on_failure": [
            "rene.wiermer@naturalis.nl", "ana.dekruif@naturalis.nl", "ward.gielis@naturalis.nl"
        ],
        "no_alert_for_skipped_runs": false
    },
    "webhook_notifications": {},
    "timeout_seconds": 0,
    "schedule": {
        "quartz_cron_expression": "43 0 23 * * ?",
        "timezone_id": "UTC",
        "pause_status": "UNPAUSED"
    },
    "max_concurrent_runs": 1,
    "tasks": [
        {
            "task_key": "run_diopsis",
            "run_if": "ALL_SUCCESS",
            "python_wheel_task": {
                "package_name": "diopsis",
                "entry_point": "run"
            },
            "job_cluster_key": "Production",
            "libraries": [
                {
                    "pypi": {
                        "package": "${PACKAGE_NAME}==${PACKAGE_VERSION}",
                        "repo": "https://gitlab.com/api/v4/groups/12875264/-/packages/pypi/simple"
                    }
                }
            ],
            "timeout_seconds": 0,
            "email_notifications": {},
            "notification_settings": {
                "no_alert_for_skipped_runs": false,
                "no_alert_for_canceled_runs": false,
                "alert_on_last_attempt": false
            }
        }
    ],
    "job_clusters": [
        {
            "job_cluster_key": "Production",
            "new_cluster": {
                "cluster_name": "",
                "spark_version": "14.3.x-scala2.12",
                "aws_attributes": {
                    "first_on_demand": 1,
                    "availability": "SPOT_WITH_FALLBACK",
                    "zone_id": "eu-west-1a",
                    "spot_bid_price_percent": 90
                },
                "node_type_id": "m7gd.large",
                "custom_tags": {
                    "environment": "prod"
                },
                "spark_env_vars": {
                    "DATABRICKS_PROFILE": "databricks",
                    "ENVIRONMENT": "PROD",
                    "LOGGING_LEVEL": 20,
                    "SPARK_ENVIRONMENT": "DATABRICKS",
                    "CAMERA_NUMBERS": "447, 417",
                    "STARTDATE_FILTER": null,
                    "ENDDATE_FILTER": null,
                    "MAX_PAYLOAD_FILES_PER_DEVICE": -1,
                    "FAUNABIT_API_URL": "https://api.faunabit.eu/api/",
                    "DIOPSIS_PAYLOAD_URL": "https://ai.naturalis.nl/v1",
                    "DIOPSIS_PAYLOAD_REQUEST_TIMEOUT_CONNECT": 60,
                    "DIOPSIS_PAYLOAD_REQUEST_TIMEOUT_RESPONSE": 60,
                    "S3_ENDPOINT": "https://s3.eu-west-1.amazonaws.com/",
                    "S3_LANDING_ZONE_BUCKET": "biocloud-core-production-landing-zone",
                    "S3_REGION_NAME": "eu-west-1",
                    "PARALLEL_DOWNLOADS": 80
                },
                "enable_elastic_disk": false,
                "data_security_mode": "SINGLE_USER",
                "runtime_engine": "PHOTON",
                "num_workers": 0
            }
        }
    ],
    "tags": {
        "ci-job-started": "Deploy started at: ${CI_JOB_STARTED_AT}",
        "last-commit-date": "Last commit on: ${CI_COMMIT_TIMESTAMP}",
        "branch": "Branch: ${CI_COMMIT_BRANCH}"
    },
    "run_as": {
        "service_principal_name": "4633199f-d8f6-4955-82ef-6c4e732413e7"
    },
    "format": "MULTI_TASK"
}
