{
    "name": "cricket-cicada-detector",
    "items": {
        "Achetadomesticus": {},
        "Aleetacurvicosta": {},
        "Atrapsaltacollina": {},
        "Atrapsaltacorticina": {},
        "Atrapsaltaencaustica": {},
        "Barbitistesyersini": {},
        "Bicoloranabicolor": {},
        "Chorthippusalbomarginatus": {},
        "Chorthippusapricarius": {},
        "Chorthippusbiguttulus": {},
        "Chorthippusbrunneus": {},
        "Chorthippusmollis": {},
        "Chorthippusvagans": {},
        "Chrysochraondispar": {},
        "Cicadaorni": {},
        "Clinopsaltaautumna": {},
        "Conocephalusdorsalis": {},
        "Conocephalusfuscus": {},
        "Cyclochilaaustralasiae": {},
        "Decticusverrucivorus": {},
        "Diceroproctaeugraphica": {},
        "Ephippigerdiurnus": {},
        "Eumodicogryllusbordigalensis": {},
        "Eupholidopteraschmidti": {},
        "Galangalabeculata": {},
        "Gampsocleisglabra": {},
        "Gomphocerippusrufus": {},
        "Gomphocerussibiricus": {},
        "Gryllusbimaculatus": {},
        "Grylluscampestris": {},
        "Leptophyespunctatissima": {},
        "Melanogryllusdesertus": {},
        "Metriopterabrachyptera": {},
        "Myrmeleotettixmaculatus": {},
        "Nemobiussylvestris": {},
        "Neotibicenpruinosus": {},
        "Oecanthuspellucens": {},
        "Omocestuspetraeus": {},
        "Omocestusrufipes": {},
        "Omocestusviridulus": {},
        "Phaneropterafalcata": {},
        "Phaneropteranana": {},
        "Pholidopteraaptera": {},
        "Pholidopteragriseoaptera": {},
        "Pholidopteralittoralis": {},
        "Platycleisalbopunctata": {},
        "Platypleuracfcatenata": {},
        "Platypleuraplumosa": {},
        "Platypleurasp10": {},
        "Platypleurasp12cfhirtipennis": {},
        "Platypleurasp13": {},
        "Popplepsaltaaeroides": {},
        "Popplepsaltanotialis": {},
        "Psaltodaplaga": {},
        "Pseudochorthippusmontanus": {},
        "Pseudochorthippusparallelus": {},
        "Roeselianaroeselii": {},
        "Ruspolianitidula": {},
        "Stauroderusscalaris": {},
        "Stenobothruslineatus": {},
        "Stenobothrusstigmaticus": {},
        "Tettigoniacantans": {},
        "Tettigoniaviridissima": {},
        "Tylopsislilifolia": {},
        "Yoyettacelis": {},
        "Yoyettarepetens": {}
    }
}
