{
  "predictions": [],
  "region_groups": [
    {
      "id": "0cb239d4-9904-42c7-85a4-933d60faae85?individual=0",
      "regions": [
        {
          "box": {},
          "media_id": "0cb239d4-9904-42c7-85a4-933d60faae85"
        }
      ],
      "individual_id": "0cb239d4-9904-42c7-85a4-933d60faae85?individual=0"
    }
  ],
  "media": [
    {
      "id": "0cb239d4-9904-42c7-85a4-933d60faae85",
      "filename": ""
    }
  ],
  "generated_by": {}
}