{
    "$comment": "",
    "api_type": "multilabel",
    "docker": "registry.gitlab.com/arise-biodiversity/dsi/algorithms/avesecho-v1/avesechov1:v1.3.0",
    "short_name": "avesecho-v1",
    "description": "Multi-label sound-based classifier for European breeding birds.",
    "version": "v1.3.0",
    "availability": "public",
    "name_ontology_uri": "https://gitlab.com/arise-biodiversity/DSI/algorithms/avesecho-v1/-/raw/v1.3.0/inputs/avesecho-v1_ontology.json",
    "geographical_coverage": {
      "country_codes": [
        "EU"
      ]
    },
    "taxonomic coverage": {
      "Custom_List": [
        "custom_list"
      ]
    },
    "input": {
      "media_modality": [
        "audio"
      ],
      "mime_types": [
        "audio/wav",
        "audio/mp3",
        "audio/ogg",
        "audio/flac"
      ],
      "multi": {
        "type": "series",
        "state": {
          "$ref": "https://schema.arise-biodiversity.nl/dsi/v0/api_output_multiple_objects.json"
        }
      },
      "batch_support": true,
      "batch_size": 64
    },
    "authors": [
      "burooj.ghani@naturalis.nl"
    ],
    "documentation": "https://gitlab.com/arise-biodiversity/DSI/algorithms/avesecho-v1",
    "citation_info": "URL to model readme",
    "inference_costs": [
      {
        "hardware_shortname": "nvidia_a40",
        "inference_time_s": 0.045
      }
    ],
    "configuration": {}
}
