{
    "short_name": "human-detection-1 test",
    "description": "Algorithm for finding humans in images (based on Detectron2).",
    "docker": "registry.gitlab.com/arise-biodiversity/dsi/algorithm-containers/images/human-detection-1:v1.1",
    "version": "v1.1",
    "name_ontology_uri": "https://gitlab.com/arise-biodiversity/DSI/algorithms/algorithm-overview/-/raw/v1.3.0/human-detection-1/ontology.json",
    "input": {
        "batch_support": true,
        "batch_size": 64
    },
    "configuration": {
        "container": {
            "infer_path": "v1/analyse",
            "infer_post_variable_name": "media",
            "port": 9976,
            "docker_runtime_parameters": "--gpus all -it -v /detectron2_detection/:/code/ --name=detectron2_container detectron2:v0.4"
        }
    }
}
