{
  "api_type": "multiclass",
  "docker": "registry.gitlab.com/arise-biodiversity/dsi/algorithms/geese-count-3/geese-counter:v1.3.0",
  "short_name": "geese-counter",
  "description": "Geese counting algorithm, developed as part of Student project, Hoge School van Amsterdam, Minor Applied Artificial Intelligence. Original creators Joey Smulders, Berat Demir, Mert Seme, Harmohat Khangura & Thimo Soet",
  "version": "v1.3.0",
  "availability": "public",
  "name_ontology_uri": "https://gitlab.com/arise-biodiversity/DSI/algorithms/algorithm-overview/-/raw/v1.3.0/geese_counter/geese_counter_ontology.json",
  "geographical_coverage": {
    "country_codes": [
      "NL"
    ]
  },
  "taxonomic coverage": {
    "https://www.catalogueoflife.org/data/taxon/V2": [
      "Biota_Animalia_Arthropoda"
    ]
  },
  "input": {
    "media_modality": [
      "image"
    ],
    "mime_types": [
      "image/jpg",
      "image/bmp"
    ],
    "multi": {
      "type": "series",
      "state": {
        "$ref": "https://schema.arise-biodiversity.nl/dsi/v0/api_output_multiple_objects.json"
      }
    },
    "batch_support": true,
    "batch_size": 128
  },
  "authors": [
    "jevansbio@gmail.com",
	"thimo.soet@hva.nl"
  ],
  "inference_costs": [
    {
      "hardware_shortname": "nvidia_v100",
      "inference_time_s": 0.015
    }
  ],
  "configuration": {
    "container": {
      "infer_post_variable_name": "image"
    }
  }
}
