<?xml version="1.0" standalone="no"?>
<!DOCTYPE svg PUBLIC "-//W3C//DTD SVG 20010904//EN"
 "http://www.w3.org/TR/2001/REC-SVG-20010904/DTD/svg10.dtd">
<svg version="1.0" xmlns="http://www.w3.org/2000/svg"
 width="700.000000pt" height="700.000000pt" viewBox="0 0 700.000000 700.000000"
 preserveAspectRatio="xMidYMid meet">
<metadata>
Created by potrace 1.14, written by Peter Selinger 2001-2017
</metadata>
<g transform="translate(0.000000,700.000000) scale(0.100000,-0.100000)"
fill="#000000" stroke="none">
<path d="M2469 6782 l-46 -3 -138 -342 c-76 -188 -180 -448 -232 -577 -52
-129 -100 -248 -108 -265 -7 -16 -45 -111 -84 -210 -40 -99 -78 -193 -85 -210
-8 -16 -45 -109 -84 -205 -139 -349 -303 -755 -312 -775 -5 -11 -29 -69 -54
-130 -123 -306 -273 -678 -413 -1025 -85 -212 -161 -398 -168 -415 -7 -16 -26
-64 -43 -105 -147 -365 -326 -811 -337 -835 -21 -49 -116 -287 -130 -326 l-13
-36 256 1 256 1 139 345 c76 190 207 516 291 725 l153 380 536 3 537 2 1 -57
c1 -32 2 -69 4 -83 1 -14 5 -64 9 -112 4 -49 9 -96 11 -106 2 -10 6 -45 9 -78
9 -80 53 -316 76 -404 135 -521 435 -993 815 -1281 207 -157 499 -292 790
-365 55 -13 114 -27 130 -29 17 -3 41 -7 55 -10 30 -6 81 -12 175 -22 87 -10
583 -10 725 -1 134 9 326 30 410 44 14 2 41 7 60 10 285 45 557 134 901 292
46 21 111 49 144 62 33 13 63 28 66 32 3 5 6 585 6 1289 l0 1279 -21 1 c-12 0
-514 1 -1117 1 l-1096 1 -21 51 c-12 28 -91 224 -177 436 -85 212 -160 394
-164 405 -5 11 -53 128 -106 260 -53 132 -114 283 -135 335 -22 52 -59 145
-84 205 l-44 110 51 33 c187 120 511 229 792 266 209 28 476 24 700 -9 359
-53 639 -160 920 -349 68 -46 125 -81 127 -77 2 3 64 60 138 126 74 66 137
122 140 125 3 3 26 24 51 47 26 22 44 45 40 50 -9 14 -245 174 -331 225 -245
143 -494 242 -715 282 -276 51 -394 61 -715 61 -220 0 -372 -7 -440 -20 -13
-3 -42 -7 -65 -11 -42 -6 -113 -19 -155 -29 -14 -3 -36 -8 -49 -11 -14 -3 -28
-7 -31 -9 -4 -2 -21 -7 -40 -10 -59 -10 -323 -102 -400 -138 -42 -20 -87 -41
-100 -47 -14 -5 -40 -19 -59 -31 -19 -11 -37 -17 -41 -12 -7 7 -256 617 -467
1143 -26 63 -49 119 -53 123 -7 8 -545 15 -641 9z m336 -614 c26 -68 53 -136
60 -153 11 -25 97 -244 299 -759 l31 -79 -86 -86 c-47 -47 -106 -111 -131
-141 -50 -61 -178 -244 -178 -255 0 -4 -8 -19 -19 -33 -19 -28 -102 -190 -141
-277 -57 -125 -137 -365 -166 -495 -4 -19 -8 -37 -9 -40 -15 -66 -18 -81 -31
-159 -3 -18 -7 -43 -10 -54 -13 -69 -31 -241 -36 -348 l-2 -46 -428 0 c-235 0
-428 3 -428 7 0 4 6 20 14 36 8 16 98 241 200 499 103 259 193 484 200 500 7
17 23 57 36 90 12 33 28 74 35 90 7 17 39 95 70 175 31 80 65 163 75 185 9 22
21 51 25 65 4 14 13 39 21 55 15 34 162 402 386 966 84 213 156 385 159 383 4
-2 28 -59 54 -126z m735 -1868 c73 -184 152 -387 177 -450 25 -63 51 -128 58
-145 26 -60 175 -446 175 -454 0 -5 -228 -8 -507 -7 l-508 1 1 30 c9 305 111
726 247 1018 72 154 203 365 217 351 5 -5 68 -160 140 -344z m911 -2240 c159
-393 290 -719 292 -725 2 -6 109 -10 290 -11 l286 -1 -21 51 c-38 99 -209 521
-218 541 -5 11 -23 56 -41 100 -17 44 -37 94 -44 110 -7 17 -37 89 -65 160
-28 72 -58 144 -65 160 -34 80 -125 308 -125 316 0 5 329 9 760 9 l760 0 -2
-897 -3 -897 -148 -58 c-286 -113 -613 -191 -892 -214 -44 -3 -93 -8 -110 -10
-42 -5 -432 -4 -480 1 -22 2 -65 7 -95 10 -98 10 -120 14 -230 36 -141 28
-344 108 -473 185 -360 217 -650 614 -782 1074 -20 69 -38 140 -41 158 -3 19
-8 43 -10 53 -10 46 -12 56 -18 94 -6 45 -16 118 -21 155 -5 37 -15 164 -20
248 l-4 72 616 -2 617 -3 287 -715z"/>
</g>
</svg>
