%YAML 1.1
%TAG !u! tag:unity3d.com,2011:
--- !u!78 &1
TagManager:
  serializedVersion: 2
  tags:
  - player
  - enemy
  - missile
  layers:
  - Default
  - TransparentFX
  - Ignore Raycast
  - 
  - Water
  - UI
  - 
  - 
  - submarine
  - enemy
  - missile
  - 
  - 
  - 
  - 
  - 
  - 
  - 
  - 
  - 
  - 
  - 
  - 
  - 
  - 
  - 
  - 
  - 
  - 
  - 
  - 
  - 
  m_SortingLayers:
  - name: Default
    uniqueID: 0
    locked: 0
  - name: background
    uniqueID: 3575171169
    locked: 0
  - name: foreground
    uniqueID: 1036723681
    locked: 0
  - name: ground
    uniqueID: 2521007623
    locked: 0
  - name: particleBack
    uniqueID: 405924043
    locked: 0
  - name: buildingBack
    uniqueID: 3884514293
    locked: 0
  - name: itemBack
    uniqueID: 187371349
    locked: 0
  - name: player
    uniqueID: 109425775
    locked: 0
  - name: playerMod
    uniqueID: 3083679653
    locked: 0
  - name: enemy
    uniqueID: 71692397
    locked: 0
  - name: enemyMod
    uniqueID: 4107263877
    locked: 0
  - name: buildingFront
    uniqueID: 1380011777
    locked: 0
  - name: itemFront
    uniqueID: 1513594411
    locked: 0
  - name: particleFront
    uniqueID: 1822641863
    locked: 0
