[gd_scene load_steps=8 format=2]

[ext_resource path="res://Scripts/enemy.gd" type="Script" id=1]
[ext_resource path="res://Assets/enemy/Bat/Png_animation/Bat2.png" type="Texture" id=2]
[ext_resource path="res://Assets/enemy/Bat/Png_animation/Bat1.png" type="Texture" id=3]
[ext_resource path="res://Assets/enemy/Bat/Png_animation/Bat3.png" type="Texture" id=4]
[ext_resource path="res://Assets/enemy/Bat/Png_animation/Bat4.png" type="Texture" id=5]

[sub_resource type="RectangleShape2D" id=1]
extents = Vector2( 26.462, 38.442 )

[sub_resource type="SpriteFrames" id=2]
animations = [ {
"frames": [ ExtResource( 2 ) ],
"loop": true,
"name": "idle",
"speed": 1.0
}, {
"frames": [ ExtResource( 3 ), ExtResource( 2 ), ExtResource( 4 ), ExtResource( 5 ) ],
"loop": true,
"name": "walk",
"speed": 5.0
} ]

[node name="enemy" type="KinematicBody2D"]
script = ExtResource( 1 )

[node name="CollisionShape2D" type="CollisionShape2D" parent="."]
shape = SubResource( 1 )

[node name="AnimatedSprite" type="AnimatedSprite" parent="."]
position = Vector2( -2, -5 )
scale = Vector2( 1.5, 1.5 )
frames = SubResource( 2 )
animation = "walk"
