[gd_scene load_steps=7 format=2]

[ext_resource path="res://Assets/Fonts/s30 bold.tres" type="DynamicFont" id=1]
[ext_resource path="res://Label.gd" type="Script" id=2]
[ext_resource path="res://Assets/Fonts/size 30.tres" type="DynamicFont" id=3]
[ext_resource path="res://Scripts/guiPower.gd" type="Script" id=4]
[ext_resource path="res://Assets/Fonts/15.res" type="DynamicFont" id=5]
[ext_resource path="res://Scripts/Label3.gd" type="Script" id=6]

[node name="GUI" type="MarginContainer"]
margin_right = 40.0
margin_bottom = 40.0

[node name="VBoxContainer" type="VBoxContainer" parent="."]
margin_right = 40.0
margin_bottom = 109.0

[node name="Label" type="Label" parent="VBoxContainer"]
margin_right = 40.0
margin_bottom = 46.0
custom_fonts/font = ExtResource( 1 )
custom_colors/font_color = Color( 0.211765, 0.623529, 0.27451, 1 )
custom_colors/font_outline_modulate = Color( 0.176471, 0.807843, 0.764706, 1 )
script = ExtResource( 2 )

[node name="Label2" type="Label" parent="VBoxContainer"]
margin_top = 50.0
margin_right = 40.0
margin_bottom = 85.0
custom_fonts/font = ExtResource( 3 )
custom_colors/font_color = Color( 0.854902, 0.847059, 0.192157, 1 )
custom_colors/font_outline_modulate = Color( 0, 0, 0, 1 )
script = ExtResource( 4 )

[node name="Label3" type="Label" parent="VBoxContainer"]
margin_top = 89.0
margin_right = 40.0
margin_bottom = 109.0
custom_fonts/font = ExtResource( 5 )
custom_colors/font_color = Color( 0.0509804, 0.0392157, 0.0392157, 1 )
script = ExtResource( 6 )
