{
  "name": "Dizmo",
  "version": "0.0.2",
  "description": "Dizmo RESTful API",
  "title": "Dizmo API",
  "url" : "localhost:3000",
  "order": [
    "GetUser",
    "PostUser"
  ],
  "template": {
  	"withCompare": true,
  	"withGenerator": true
  }
}
