{
    "api": [
        {
            "definition": {
                "endpoint": "/process/get",
                "method": "POST",
                "backend": [
                    {
                        "host": [
                            "http://127.0.0.1:9001"
                        ],
                        "url_pattern": "/process/get/",
                        "is_collection": true,
                        "mapping":{
                            "collection":"processes"
                        }
                    }
                ]
            }
        },
        {
            "definition": {
                "endpoint": "/profile/verify",
                "method": "POST",
                "backend": [
                    {
                        "host": [
                            "http://127.0.0.1:9001"
                        ],
                        "url_pattern": "/profile/verify/"
                    }
                ]
            }
        }
    ]
}