{
    "api": [
        {
            "definition": {
                "endpoint": "/user/login",
                "method": "POST",
                "backend": [
                    {
                        "host": [
                            "http://127.0.0.1:10125"
                        ],
                        "url_pattern": "/user/login/"
                    }
                ]
            }
        },
        {
            "definition": {
                "endpoint": "/user/logout",
                "method": "POST",
                "backend": [
                    {
                        "host": [
                            "http://127.0.0.1:10125"
                        ],
                        "url_pattern": "/user/logout/"
                    }
                ]
            }
        },
        {
            "definition": {
                "endpoint": "/user/verify",
                "method": "POST",
                "backend": [
                    {
                        "host": [
                            "http://127.0.0.1:10125"
                        ],
                        "url_pattern": "/user/get/byuuid/"
                    }
                ]
            }
        }
    ]
}