<svg xmlns="http://www.w3.org/2000/svg" width="67" height="65" viewBox="0 0 67 65">
    <g fill="none" fill-rule="evenodd">
        <path fill="#F49C31" d="M57.225 23.01c1.826 10.694-1.911 22.175-9.644 29.625-7.732 7.45-19.232 10.652-29.676 8.262-4.555-1.042-8.953-3.13-12.304-6.436C2.25 51.153.024 46.56.026 41.83c0-4.422 2.696-13.669 4.303-17.677C8.29 14.28 15.29 5.431 24.298 2.117c9.743-3.584 16.544-1.725 23.8 4.254 4.966 4.092 8.037 10.257 9.127 16.639z" opacity=".08"/>
        <path fill="#FE2A5C" fill-rule="nonzero" d="M46.5 35a2.5 2.5 0 1 1-5 0V17.5a2.5 2.5 0 1 1 5 0V35zm5.975-7.815a2.5 2.5 0 0 1 2.428-4.37 22.5 22.5 0 1 1-21.806 0 2.5 2.5 0 0 1 2.425 4.37 17.5 17.5 0 1 0 16.956 0h-.003z"/>
    </g>
</svg>
