<svg width="60" height="60" fill="none" xmlns="http://www.w3.org/2000/svg">
    <g clip-path="url(#a)">
        <path d="M48.542 16.698C51.117 19.433 52.5 22.5 52.5 27.471c0 8.75-6.142 16.593-15.075 20.47l-2.232-3.444c8.337-4.51 9.967-10.363 10.617-14.053-1.343.695-3.1.938-4.823.777-4.51-.417-8.065-4.12-8.065-8.722a8.75 8.75 0 0 1 8.75-8.75c2.683 0 5.248 1.225 6.87 2.948Zm-25 0C26.117 19.433 27.5 22.5 27.5 27.471c0 8.75-6.142 16.593-15.075 20.47l-2.232-3.444c8.337-4.51 9.967-10.363 10.617-14.053-1.342.695-3.1.938-4.822.777-4.51-.417-8.066-4.12-8.066-8.722a8.75 8.75 0 0 1 8.75-8.75c2.683 0 5.248 1.225 6.87 2.948Z" fill="#BCC1C7"/>
    </g>
    <defs>
        <clipPath id="a">
            <path fill="#fff" transform="rotate(180 30 30)" d="M0 0h60v60H0z"/>
        </clipPath>
    </defs>
</svg>
