current directory: /Users/Ari/Documents/Bibit/ios/vendor/bundle/ruby/3.1.0/gems/json-2.6.3/ext/json
/Users/Ari/.rbenv/versions/3.1.0/bin/ruby -I /Users/Ari/.rbenv/versions/3.1.0/lib/ruby/3.1.0 -r ./siteconf20230210-68206-ulvcyw.rb extconf.rb
creating Makefile

current directory: /Users/Ari/Documents/Bibit/ios/vendor/bundle/ruby/3.1.0/gems/json-2.6.3/ext/json
make DESTDIR\= clean

current directory: /Users/Ari/Documents/Bibit/ios/vendor/bundle/ruby/3.1.0/gems/json-2.6.3/ext/json
make DESTDIR\=
make: Nothing to be done for `all'.

current directory: /Users/Ari/Documents/Bibit/ios/vendor/bundle/ruby/3.1.0/gems/json-2.6.3/ext/json
make DESTDIR\= install
