current directory: /Volumes/workspace/repository/vendor/bundle/ruby/2.6.0/gems/json-2.6.2/ext/json
/System/Library/Frameworks/Ruby.framework/Versions/2.6/usr/bin/ruby -I /System/Library/Frameworks/Ruby.framework/Versions/2.6/usr/lib/ruby/2.6.0 -r ./siteconf20230214-5023-8y7kgo.rb extconf.rb
creating Makefile

current directory: /Volumes/workspace/repository/vendor/bundle/ruby/2.6.0/gems/json-2.6.2/ext/json
make "DESTDIR=" clean

current directory: /Volumes/workspace/repository/vendor/bundle/ruby/2.6.0/gems/json-2.6.2/ext/json
make "DESTDIR="
make: Nothing to be done for `all'.

current directory: /Volumes/workspace/repository/vendor/bundle/ruby/2.6.0/gems/json-2.6.2/ext/json
make "DESTDIR=" install
