// Jest Snapshot v1, https://goo.gl/fbAQLP

exports[`button-Bottom default 1`] = `
<body>
  <div>
    <div
      class="bottom svelte-jfhm8j"
      data-testid="button-bottom-tid"
    >
      <button
        class="button primary svelte-1l3b8gm"
        data-testid="button-tid"
      >
        Button
      </button>
    </div>
  </div>
</body>
`;
