// Jest Snapshot v1, https://goo.gl/fbAQLP

exports[`button default 1`] = `
<button
  class="button primary svelte-1l3b8gm"
  data-testid="button-tid"
>
  
</button>
`;

exports[`button disabled 1`] = `
<button
  class=" svelte-1l3b8gm"
  data-testid="button-tid"
  disabled=""
>
  
</button>
`;

exports[`button loading 1`] = `
<button
  class=" svelte-1l3b8gm"
  data-testid="button-tid"
>
  <div>
    <i
      class="spinner animate-spin"
    />
  </div>
</button>
`;

exports[`button primary 1`] = `
<button
  class="button primary svelte-1l3b8gm"
  data-testid="button-tid"
>
  
</button>
`;

exports[`button secondary 1`] = `
<button
  class="button secondary svelte-1l3b8gm"
  data-testid="button-tid"
>
  
</button>
`;

exports[`button title 1`] = `
<button
  class=" svelte-1l3b8gm"
  data-testid="button-tid"
>
  Button Title
</button>
`;

exports[`button transparent 1`] = `
<button
  class="button transparent svelte-1l3b8gm"
  data-testid="button-tid"
>
  
</button>
`;

exports[`button undefined 1`] = `
<button
  class="button primary svelte-1l3b8gm"
  data-testid="button-tid"
>
  
</button>
`;
