// Jest Snapshot v1, https://goo.gl/fbAQLP

exports[`accordion-Header close 1`] = `
<div
  class="header svelte-19fxw1j"
  data-testid="accordion-header-tid-1"
  id="accordion-header-tid-1"
>
  Header
   
  <span
    class="arrowDown svelte-19fxw1j"
    data-testid="accordion-header-arrow-tid-1"
  />
</div>
`;

exports[`accordion-Header open 1`] = `
<div
  class="header svelte-19fxw1j"
  data-testid="accordion-header-tid-1"
  id="accordion-header-tid-1"
>
  Header
   
  <span
    class="arrowUp svelte-19fxw1j"
    data-testid="accordion-header-arrow-tid-1"
  />
</div>
`;
