Project, Description
Nodejs Simple, A simple nodejs todo app as backend
Reactjs Simple, A simple reactjs todo app as frontend
Deploy, We keep all the devops role about the our backend and frontend services and the argocd synks itself with this repo all time
Kubernetes, We only have keep our initial commands and also this README file