<?xml version="1.0" encoding="UTF-8" standalone="no"?>
<!-- Created with Inkscape (http://www.inkscape.org/) -->

<svg
   xmlns:dc="http://purl.org/dc/elements/1.1/"
   xmlns:cc="http://creativecommons.org/ns#"
   xmlns:rdf="http://www.w3.org/1999/02/22-rdf-syntax-ns#"
   xmlns:svg="http://www.w3.org/2000/svg"
   xmlns="http://www.w3.org/2000/svg"
   xmlns:sodipodi="http://sodipodi.sourceforge.net/DTD/sodipodi-0.dtd"
   xmlns:inkscape="http://www.inkscape.org/namespaces/inkscape"
   version="1.1"
   id="svg4504"
   xml:space="preserve"
   width="592.70312"
   height="320.73505"
   viewBox="0 0 555.6592 300.68908"
   sodipodi:docname="PorticoIdealGls.svg"
   inkscape:version="0.92.1 r15371"><metadata
     id="metadata4510"><rdf:RDF><cc:Work
         rdf:about=""><dc:format>image/svg+xml</dc:format><dc:type
           rdf:resource="http://purl.org/dc/dcmitype/StillImage" /><dc:title></dc:title></cc:Work></rdf:RDF></metadata><defs
     id="defs4508"><marker
       inkscape:stockid="Arrow2Mend"
       orient="auto"
       refY="0"
       refX="0"
       id="marker1899"
       style="overflow:visible"
       inkscape:isstock="true"><path
         id="path1897"
         style="fill:#000000;fill-opacity:1;fill-rule:evenodd;stroke:#000000;stroke-width:0.625;stroke-linejoin:round;stroke-opacity:1"
         d="M 8.7185878,4.0337352 -2.2072895,0.01601326 8.7185884,-4.0017078 c -1.7454984,2.3720609 -1.7354408,5.6174519 -6e-7,8.035443 z"
         transform="scale(-0.6)"
         inkscape:connector-curvature="0" /></marker><marker
       inkscape:stockid="Arrow2Mend"
       orient="auto"
       refY="0"
       refX="0"
       id="marker1661"
       style="overflow:visible"
       inkscape:isstock="true"><path
         id="path1659"
         style="fill:#000000;fill-opacity:1;fill-rule:evenodd;stroke:#000000;stroke-width:0.625;stroke-linejoin:round;stroke-opacity:1"
         d="M 8.7185878,4.0337352 -2.2072895,0.01601326 8.7185884,-4.0017078 c -1.7454984,2.3720609 -1.7354408,5.6174519 -6e-7,8.035443 z"
         transform="scale(-0.6)"
         inkscape:connector-curvature="0" /></marker><marker
       inkscape:stockid="Arrow2Mend"
       orient="auto"
       refY="0"
       refX="0"
       id="marker1201"
       style="overflow:visible"
       inkscape:isstock="true"><path
         id="path1199"
         style="fill:#000000;fill-opacity:1;fill-rule:evenodd;stroke:#000000;stroke-width:0.625;stroke-linejoin:round;stroke-opacity:1"
         d="M 8.7185878,4.0337352 -2.2072895,0.01601326 8.7185884,-4.0017078 c -1.7454984,2.3720609 -1.7354408,5.6174519 -6e-7,8.035443 z"
         transform="scale(-0.6)"
         inkscape:connector-curvature="0" /></marker><clipPath
       clipPathUnits="userSpaceOnUse"
       id="clipPath4522"><path
         d="m 720,969.602 h 6980.4 v 4010.4 H 720 Z"
         id="path4520"
         inkscape:connector-curvature="0" /></clipPath><marker
       inkscape:isstock="true"
       style="overflow:visible"
       id="marker5745-0-6-8-2-5"
       refX="0"
       refY="0"
       orient="auto"
       inkscape:stockid="Arrow2Mend"><path
         inkscape:connector-curvature="0"
         transform="scale(-0.6)"
         d="M 8.7185878,4.0337352 -2.2072895,0.01601326 8.7185884,-4.0017078 c -1.7454984,2.3720609 -1.7354408,5.6174519 -6e-7,8.035443 z"
         style="fill:#000000;fill-opacity:1;fill-rule:evenodd;stroke:#000000;stroke-width:0.625;stroke-linejoin:round;stroke-opacity:1"
         id="path5743-9-0-7-2-2" /></marker><marker
       inkscape:isstock="true"
       style="overflow:visible"
       id="marker5745-0-6-89-6"
       refX="0"
       refY="0"
       orient="auto"
       inkscape:stockid="Arrow2Mend"><path
         inkscape:connector-curvature="0"
         transform="scale(-0.6)"
         d="M 8.7185878,4.0337352 -2.2072895,0.01601326 8.7185884,-4.0017078 c -1.7454984,2.3720609 -1.7354408,5.6174519 -6e-7,8.035443 z"
         style="fill:#000000;fill-opacity:1;fill-rule:evenodd;stroke:#000000;stroke-width:0.625;stroke-linejoin:round;stroke-opacity:1"
         id="path5743-9-0-73-5" /></marker><marker
       inkscape:isstock="true"
       style="overflow:visible"
       id="marker5745-6-6-8"
       refX="0"
       refY="0"
       orient="auto"
       inkscape:stockid="Arrow2Mend"><path
         inkscape:connector-curvature="0"
         transform="scale(-0.6)"
         d="M 8.7185878,4.0337352 -2.2072895,0.01601326 8.7185884,-4.0017078 c -1.7454984,2.3720609 -1.7354408,5.6174519 -6e-7,8.035443 z"
         style="fill:#000000;fill-opacity:1;fill-rule:evenodd;stroke:#000000;stroke-width:0.625;stroke-linejoin:round;stroke-opacity:1"
         id="path5743-2-12-7" /></marker><marker
       inkscape:isstock="true"
       style="overflow:visible"
       id="marker5745-0-9-9"
       refX="0"
       refY="0"
       orient="auto"
       inkscape:stockid="Arrow2Mend"><path
         inkscape:connector-curvature="0"
         transform="scale(-0.6)"
         d="M 8.7185878,4.0337352 -2.2072895,0.01601326 8.7185884,-4.0017078 c -1.7454984,2.3720609 -1.7354408,5.6174519 -6e-7,8.035443 z"
         style="fill:#000000;fill-opacity:1;fill-rule:evenodd;stroke:#000000;stroke-width:0.625;stroke-linejoin:round;stroke-opacity:1"
         id="path5743-9-3-6" /></marker><marker
       inkscape:isstock="true"
       style="overflow:visible"
       id="marker5745-0-2-1"
       refX="0"
       refY="0"
       orient="auto"
       inkscape:stockid="Arrow2Mend"><path
         inkscape:connector-curvature="0"
         transform="scale(-0.6)"
         d="M 8.7185878,4.0337352 -2.2072895,0.01601326 8.7185884,-4.0017078 c -1.7454984,2.3720609 -1.7354408,5.6174519 -6e-7,8.035443 z"
         style="fill:#000000;fill-opacity:1;fill-rule:evenodd;stroke:#000000;stroke-width:0.625;stroke-linejoin:round;stroke-opacity:1"
         id="path5743-9-7-0" /></marker><marker
       inkscape:isstock="true"
       style="overflow:visible"
       id="marker5745-0-6-8-3-8"
       refX="0"
       refY="0"
       orient="auto"
       inkscape:stockid="Arrow2Mend"><path
         inkscape:connector-curvature="0"
         transform="scale(-0.6)"
         d="M 8.7185878,4.0337352 -2.2072895,0.01601326 8.7185884,-4.0017078 c -1.7454984,2.3720609 -1.7354408,5.6174519 -6e-7,8.035443 z"
         style="fill:#000000;fill-opacity:1;fill-rule:evenodd;stroke:#000000;stroke-width:0.625;stroke-linejoin:round;stroke-opacity:1"
         id="path5743-9-0-7-5-7" /></marker><marker
       inkscape:isstock="true"
       style="overflow:visible"
       id="marker5745-0-6-6-9"
       refX="0"
       refY="0"
       orient="auto"
       inkscape:stockid="Arrow2Mend"><path
         inkscape:connector-curvature="0"
         transform="scale(-0.6)"
         d="M 8.7185878,4.0337352 -2.2072895,0.01601326 8.7185884,-4.0017078 c -1.7454984,2.3720609 -1.7354408,5.6174519 -6e-7,8.035443 z"
         style="fill:#000000;fill-opacity:1;fill-rule:evenodd;stroke:#000000;stroke-width:0.625;stroke-linejoin:round;stroke-opacity:1"
         id="path5743-9-0-2-2" /></marker><marker
       inkscape:isstock="true"
       style="overflow:visible"
       id="marker5745-6-9-0"
       refX="0"
       refY="0"
       orient="auto"
       inkscape:stockid="Arrow2Mend"><path
         inkscape:connector-curvature="0"
         transform="scale(-0.6)"
         d="M 8.7185878,4.0337352 -2.2072895,0.01601326 8.7185884,-4.0017078 c -1.7454984,2.3720609 -1.7354408,5.6174519 -6e-7,8.035443 z"
         style="fill:#000000;fill-opacity:1;fill-rule:evenodd;stroke:#000000;stroke-width:0.625;stroke-linejoin:round;stroke-opacity:1"
         id="path5743-2-1-2" /></marker><marker
       inkscape:isstock="true"
       style="overflow:visible"
       id="marker5745-0-2-3"
       refX="0"
       refY="0"
       orient="auto"
       inkscape:stockid="Arrow2Mend"><path
         inkscape:connector-curvature="0"
         transform="scale(-0.6)"
         d="M 8.7185878,4.0337352 -2.2072895,0.01601326 8.7185884,-4.0017078 c -1.7454984,2.3720609 -1.7354408,5.6174519 -6e-7,8.035443 z"
         style="fill:#000000;fill-opacity:1;fill-rule:evenodd;stroke:#000000;stroke-width:0.625;stroke-linejoin:round;stroke-opacity:1"
         id="path5743-9-7-7" /></marker><marker
       inkscape:isstock="true"
       style="overflow:visible"
       id="marker5745-0-6-8-2"
       refX="0"
       refY="0"
       orient="auto"
       inkscape:stockid="Arrow2Mend"><path
         inkscape:connector-curvature="0"
         transform="scale(-0.6)"
         d="M 8.7185878,4.0337352 -2.2072895,0.01601326 8.7185884,-4.0017078 c -1.7454984,2.3720609 -1.7354408,5.6174519 -6e-7,8.035443 z"
         style="fill:#000000;fill-opacity:1;fill-rule:evenodd;stroke:#000000;stroke-width:0.625;stroke-linejoin:round;stroke-opacity:1"
         id="path5743-9-0-7-2" /></marker><marker
       inkscape:isstock="true"
       style="overflow:visible"
       id="marker5745-0-6-89"
       refX="0"
       refY="0"
       orient="auto"
       inkscape:stockid="Arrow2Mend"><path
         inkscape:connector-curvature="0"
         transform="scale(-0.6)"
         d="M 8.7185878,4.0337352 -2.2072895,0.01601326 8.7185884,-4.0017078 c -1.7454984,2.3720609 -1.7354408,5.6174519 -6e-7,8.035443 z"
         style="fill:#000000;fill-opacity:1;fill-rule:evenodd;stroke:#000000;stroke-width:0.625;stroke-linejoin:round;stroke-opacity:1"
         id="path5743-9-0-73" /></marker><marker
       inkscape:isstock="true"
       style="overflow:visible"
       id="marker5745-6-6"
       refX="0"
       refY="0"
       orient="auto"
       inkscape:stockid="Arrow2Mend"><path
         inkscape:connector-curvature="0"
         transform="scale(-0.6)"
         d="M 8.7185878,4.0337352 -2.2072895,0.01601326 8.7185884,-4.0017078 c -1.7454984,2.3720609 -1.7354408,5.6174519 -6e-7,8.035443 z"
         style="fill:#000000;fill-opacity:1;fill-rule:evenodd;stroke:#000000;stroke-width:0.625;stroke-linejoin:round;stroke-opacity:1"
         id="path5743-2-12" /></marker><marker
       inkscape:isstock="true"
       style="overflow:visible"
       id="marker5745-0-9"
       refX="0"
       refY="0"
       orient="auto"
       inkscape:stockid="Arrow2Mend"><path
         inkscape:connector-curvature="0"
         transform="scale(-0.6)"
         d="M 8.7185878,4.0337352 -2.2072895,0.01601326 8.7185884,-4.0017078 c -1.7454984,2.3720609 -1.7354408,5.6174519 -6e-7,8.035443 z"
         style="fill:#000000;fill-opacity:1;fill-rule:evenodd;stroke:#000000;stroke-width:0.625;stroke-linejoin:round;stroke-opacity:1"
         id="path5743-9-3" /></marker><marker
       inkscape:isstock="true"
       style="overflow:visible"
       id="marker5745-1"
       refX="0"
       refY="0"
       orient="auto"
       inkscape:stockid="Arrow2Mend"><path
         inkscape:connector-curvature="0"
         transform="scale(-0.6)"
         d="M 8.7185878,4.0337352 -2.2072895,0.01601326 8.7185884,-4.0017078 c -1.7454984,2.3720609 -1.7354408,5.6174519 -6e-7,8.035443 z"
         style="fill:#000000;fill-opacity:1;fill-rule:evenodd;stroke:#000000;stroke-width:0.625;stroke-linejoin:round;stroke-opacity:1"
         id="path5743-94" /></marker><marker
       inkscape:isstock="true"
       style="overflow:visible"
       id="marker5745-0-6-8-3"
       refX="0"
       refY="0"
       orient="auto"
       inkscape:stockid="Arrow2Mend"><path
         inkscape:connector-curvature="0"
         transform="scale(-0.6)"
         d="M 8.7185878,4.0337352 -2.2072895,0.01601326 8.7185884,-4.0017078 c -1.7454984,2.3720609 -1.7354408,5.6174519 -6e-7,8.035443 z"
         style="fill:#000000;fill-opacity:1;fill-rule:evenodd;stroke:#000000;stroke-width:0.625;stroke-linejoin:round;stroke-opacity:1"
         id="path5743-9-0-7-5" /></marker><marker
       inkscape:isstock="true"
       style="overflow:visible"
       id="marker5745-0-6-6"
       refX="0"
       refY="0"
       orient="auto"
       inkscape:stockid="Arrow2Mend"><path
         inkscape:connector-curvature="0"
         transform="scale(-0.6)"
         d="M 8.7185878,4.0337352 -2.2072895,0.01601326 8.7185884,-4.0017078 c -1.7454984,2.3720609 -1.7354408,5.6174519 -6e-7,8.035443 z"
         style="fill:#000000;fill-opacity:1;fill-rule:evenodd;stroke:#000000;stroke-width:0.625;stroke-linejoin:round;stroke-opacity:1"
         id="path5743-9-0-2" /></marker><marker
       inkscape:isstock="true"
       style="overflow:visible"
       id="marker5745-6-9"
       refX="0"
       refY="0"
       orient="auto"
       inkscape:stockid="Arrow2Mend"><path
         inkscape:connector-curvature="0"
         transform="scale(-0.6)"
         d="M 8.7185878,4.0337352 -2.2072895,0.01601326 8.7185884,-4.0017078 c -1.7454984,2.3720609 -1.7354408,5.6174519 -6e-7,8.035443 z"
         style="fill:#000000;fill-opacity:1;fill-rule:evenodd;stroke:#000000;stroke-width:0.625;stroke-linejoin:round;stroke-opacity:1"
         id="path5743-2-1" /></marker><marker
       inkscape:isstock="true"
       style="overflow:visible"
       id="marker5745-0-2"
       refX="0"
       refY="0"
       orient="auto"
       inkscape:stockid="Arrow2Mend"><path
         inkscape:connector-curvature="0"
         transform="scale(-0.6)"
         d="M 8.7185878,4.0337352 -2.2072895,0.01601326 8.7185884,-4.0017078 c -1.7454984,2.3720609 -1.7354408,5.6174519 -6e-7,8.035443 z"
         style="fill:#000000;fill-opacity:1;fill-rule:evenodd;stroke:#000000;stroke-width:0.625;stroke-linejoin:round;stroke-opacity:1"
         id="path5743-9-7" /></marker><marker
       inkscape:isstock="true"
       style="overflow:visible"
       id="marker5745-09"
       refX="0"
       refY="0"
       orient="auto"
       inkscape:stockid="Arrow2Mend"><path
         inkscape:connector-curvature="0"
         transform="scale(-0.6)"
         d="M 8.7185878,4.0337352 -2.2072895,0.01601326 8.7185884,-4.0017078 c -1.7454984,2.3720609 -1.7354408,5.6174519 -6e-7,8.035443 z"
         style="fill:#000000;fill-opacity:1;fill-rule:evenodd;stroke:#000000;stroke-width:0.625;stroke-linejoin:round;stroke-opacity:1"
         id="path5743-3" /></marker><marker
       inkscape:isstock="true"
       style="overflow:visible"
       id="marker5745-0-6-8"
       refX="0"
       refY="0"
       orient="auto"
       inkscape:stockid="Arrow2Mend"><path
         inkscape:connector-curvature="0"
         transform="scale(-0.6)"
         d="M 8.7185878,4.0337352 -2.2072895,0.01601326 8.7185884,-4.0017078 c -1.7454984,2.3720609 -1.7354408,5.6174519 -6e-7,8.035443 z"
         style="fill:#000000;fill-opacity:1;fill-rule:evenodd;stroke:#000000;stroke-width:0.625;stroke-linejoin:round;stroke-opacity:1"
         id="path5743-9-0-7" /></marker><marker
       inkscape:isstock="true"
       style="overflow:visible"
       id="marker5745-0-6"
       refX="0"
       refY="0"
       orient="auto"
       inkscape:stockid="Arrow2Mend"><path
         inkscape:connector-curvature="0"
         transform="scale(-0.6)"
         d="M 8.7185878,4.0337352 -2.2072895,0.01601326 8.7185884,-4.0017078 c -1.7454984,2.3720609 -1.7354408,5.6174519 -6e-7,8.035443 z"
         style="fill:#000000;fill-opacity:1;fill-rule:evenodd;stroke:#000000;stroke-width:0.625;stroke-linejoin:round;stroke-opacity:1"
         id="path5743-9-0" /></marker><marker
       inkscape:isstock="true"
       style="overflow:visible"
       id="marker5745-6"
       refX="0"
       refY="0"
       orient="auto"
       inkscape:stockid="Arrow2Mend"><path
         inkscape:connector-curvature="0"
         transform="scale(-0.6)"
         d="M 8.7185878,4.0337352 -2.2072895,0.01601326 8.7185884,-4.0017078 c -1.7454984,2.3720609 -1.7354408,5.6174519 -6e-7,8.035443 z"
         style="fill:#000000;fill-opacity:1;fill-rule:evenodd;stroke:#000000;stroke-width:0.625;stroke-linejoin:round;stroke-opacity:1"
         id="path5743-2" /></marker><marker
       inkscape:isstock="true"
       style="overflow:visible"
       id="marker5745-0"
       refX="0"
       refY="0"
       orient="auto"
       inkscape:stockid="Arrow2Mend"><path
         inkscape:connector-curvature="0"
         transform="scale(-0.6)"
         d="M 8.7185878,4.0337352 -2.2072895,0.01601326 8.7185884,-4.0017078 c -1.7454984,2.3720609 -1.7354408,5.6174519 -6e-7,8.035443 z"
         style="fill:#000000;fill-opacity:1;fill-rule:evenodd;stroke:#000000;stroke-width:0.625;stroke-linejoin:round;stroke-opacity:1"
         id="path5743-9" /></marker><marker
       inkscape:isstock="true"
       style="overflow:visible"
       id="marker5745"
       refX="0"
       refY="0"
       orient="auto"
       inkscape:stockid="Arrow2Mend"><path
         inkscape:connector-curvature="0"
         transform="scale(-0.6)"
         d="M 8.7185878,4.0337352 -2.2072895,0.01601326 8.7185884,-4.0017078 c -1.7454984,2.3720609 -1.7354408,5.6174519 -6e-7,8.035443 z"
         style="fill:#000000;fill-opacity:1;fill-rule:evenodd;stroke:#000000;stroke-width:0.625;stroke-linejoin:round;stroke-opacity:1"
         id="path5743" /></marker><marker
       inkscape:isstock="true"
       style="overflow:visible"
       id="marker5745-0-6-8-2-5-9"
       refX="0"
       refY="0"
       orient="auto"
       inkscape:stockid="Arrow2Mend"><path
         inkscape:connector-curvature="0"
         transform="scale(-0.6)"
         d="M 8.7185878,4.0337352 -2.2072895,0.01601326 8.7185884,-4.0017078 c -1.7454984,2.3720609 -1.7354408,5.6174519 -6e-7,8.035443 z"
         style="fill:#000000;fill-opacity:1;fill-rule:evenodd;stroke:#000000;stroke-width:0.625;stroke-linejoin:round;stroke-opacity:1"
         id="path5743-9-0-7-2-2-1" /></marker><marker
       inkscape:isstock="true"
       style="overflow:visible"
       id="marker5745-0-6-89-6-2"
       refX="0"
       refY="0"
       orient="auto"
       inkscape:stockid="Arrow2Mend"><path
         inkscape:connector-curvature="0"
         transform="scale(-0.6)"
         d="M 8.7185878,4.0337352 -2.2072895,0.01601326 8.7185884,-4.0017078 c -1.7454984,2.3720609 -1.7354408,5.6174519 -6e-7,8.035443 z"
         style="fill:#000000;fill-opacity:1;fill-rule:evenodd;stroke:#000000;stroke-width:0.625;stroke-linejoin:round;stroke-opacity:1"
         id="path5743-9-0-73-5-7" /></marker><marker
       inkscape:isstock="true"
       style="overflow:visible"
       id="marker5745-6-6-8-0"
       refX="0"
       refY="0"
       orient="auto"
       inkscape:stockid="Arrow2Mend"><path
         inkscape:connector-curvature="0"
         transform="scale(-0.6)"
         d="M 8.7185878,4.0337352 -2.2072895,0.01601326 8.7185884,-4.0017078 c -1.7454984,2.3720609 -1.7354408,5.6174519 -6e-7,8.035443 z"
         style="fill:#000000;fill-opacity:1;fill-rule:evenodd;stroke:#000000;stroke-width:0.625;stroke-linejoin:round;stroke-opacity:1"
         id="path5743-2-12-7-9" /></marker><marker
       inkscape:isstock="true"
       style="overflow:visible"
       id="marker5745-0-9-9-3"
       refX="0"
       refY="0"
       orient="auto"
       inkscape:stockid="Arrow2Mend"><path
         inkscape:connector-curvature="0"
         transform="scale(-0.6)"
         d="M 8.7185878,4.0337352 -2.2072895,0.01601326 8.7185884,-4.0017078 c -1.7454984,2.3720609 -1.7354408,5.6174519 -6e-7,8.035443 z"
         style="fill:#000000;fill-opacity:1;fill-rule:evenodd;stroke:#000000;stroke-width:0.625;stroke-linejoin:round;stroke-opacity:1"
         id="path5743-9-3-6-6" /></marker><marker
       inkscape:isstock="true"
       style="overflow:visible"
       id="marker5745-1-0-0"
       refX="0"
       refY="0"
       orient="auto"
       inkscape:stockid="Arrow2Mend"><path
         inkscape:connector-curvature="0"
         transform="scale(-0.6)"
         d="M 8.7185878,4.0337352 -2.2072895,0.01601326 8.7185884,-4.0017078 c -1.7454984,2.3720609 -1.7354408,5.6174519 -6e-7,8.035443 z"
         style="fill:#000000;fill-opacity:1;fill-rule:evenodd;stroke:#000000;stroke-width:0.625;stroke-linejoin:round;stroke-opacity:1"
         id="path5743-94-4-6" /></marker><marker
       inkscape:isstock="true"
       style="overflow:visible"
       id="marker5745-0-2-1-2"
       refX="0"
       refY="0"
       orient="auto"
       inkscape:stockid="Arrow2Mend"><path
         inkscape:connector-curvature="0"
         transform="scale(-0.6)"
         d="M 8.7185878,4.0337352 -2.2072895,0.01601326 8.7185884,-4.0017078 c -1.7454984,2.3720609 -1.7354408,5.6174519 -6e-7,8.035443 z"
         style="fill:#000000;fill-opacity:1;fill-rule:evenodd;stroke:#000000;stroke-width:0.625;stroke-linejoin:round;stroke-opacity:1"
         id="path5743-9-7-0-6" /></marker><marker
       inkscape:isstock="true"
       style="overflow:visible"
       id="marker5745-09-4-1"
       refX="0"
       refY="0"
       orient="auto"
       inkscape:stockid="Arrow2Mend"><path
         inkscape:connector-curvature="0"
         transform="scale(-0.6)"
         d="M 8.7185878,4.0337352 -2.2072895,0.01601326 8.7185884,-4.0017078 c -1.7454984,2.3720609 -1.7354408,5.6174519 -6e-7,8.035443 z"
         style="fill:#000000;fill-opacity:1;fill-rule:evenodd;stroke:#000000;stroke-width:0.625;stroke-linejoin:round;stroke-opacity:1"
         id="path5743-3-8-8" /></marker><marker
       inkscape:isstock="true"
       style="overflow:visible"
       id="marker5745-0-9-9-2"
       refX="0"
       refY="0"
       orient="auto"
       inkscape:stockid="Arrow2Mend"><path
         inkscape:connector-curvature="0"
         transform="scale(-0.6)"
         d="M 8.7185878,4.0337352 -2.2072895,0.01601326 8.7185884,-4.0017078 c -1.7454984,2.3720609 -1.7354408,5.6174519 -6e-7,8.035443 z"
         style="fill:#000000;fill-opacity:1;fill-rule:evenodd;stroke:#000000;stroke-width:0.625;stroke-linejoin:round;stroke-opacity:1"
         id="path5743-9-3-6-8" /></marker><marker
       inkscape:isstock="true"
       style="overflow:visible"
       id="marker5745-1-0-9"
       refX="0"
       refY="0"
       orient="auto"
       inkscape:stockid="Arrow2Mend"><path
         inkscape:connector-curvature="0"
         transform="scale(-0.6)"
         d="M 8.7185878,4.0337352 -2.2072895,0.01601326 8.7185884,-4.0017078 c -1.7454984,2.3720609 -1.7354408,5.6174519 -6e-7,8.035443 z"
         style="fill:#000000;fill-opacity:1;fill-rule:evenodd;stroke:#000000;stroke-width:0.625;stroke-linejoin:round;stroke-opacity:1"
         id="path5743-94-4-7" /></marker><marker
       inkscape:stockid="Arrow2Mend"
       orient="auto"
       refY="0"
       refX="0"
       id="marker1201-5"
       style="overflow:visible"
       inkscape:isstock="true"><path
         id="path1199-3"
         style="fill:#000000;fill-opacity:1;fill-rule:evenodd;stroke:#000000;stroke-width:0.625;stroke-linejoin:round;stroke-opacity:1"
         d="M 8.7185878,4.0337352 -2.2072895,0.01601326 8.7185884,-4.0017078 c -1.7454984,2.3720609 -1.7354408,5.6174519 -6e-7,8.035443 z"
         transform="scale(-0.6)"
         inkscape:connector-curvature="0" /></marker><marker
       inkscape:isstock="true"
       style="overflow:visible"
       id="marker5745-0-6-8-6"
       refX="0"
       refY="0"
       orient="auto"
       inkscape:stockid="Arrow2Mend"><path
         inkscape:connector-curvature="0"
         transform="scale(-0.6)"
         d="M 8.7185878,4.0337352 -2.2072895,0.01601326 8.7185884,-4.0017078 c -1.7454984,2.3720609 -1.7354408,5.6174519 -6e-7,8.035443 z"
         style="fill:#000000;fill-opacity:1;fill-rule:evenodd;stroke:#000000;stroke-width:0.625;stroke-linejoin:round;stroke-opacity:1"
         id="path5743-9-0-7-29" /></marker><marker
       inkscape:isstock="true"
       style="overflow:visible"
       id="marker5745-0-6-8-6-1"
       refX="0"
       refY="0"
       orient="auto"
       inkscape:stockid="Arrow2Mend"><path
         inkscape:connector-curvature="0"
         transform="scale(-0.6)"
         d="M 8.7185878,4.0337352 -2.2072895,0.01601326 8.7185884,-4.0017078 c -1.7454984,2.3720609 -1.7354408,5.6174519 -6e-7,8.035443 z"
         style="fill:#000000;fill-opacity:1;fill-rule:evenodd;stroke:#000000;stroke-width:0.625;stroke-linejoin:round;stroke-opacity:1"
         id="path5743-9-0-7-29-2" /></marker><marker
       inkscape:stockid="Arrow2Mend"
       orient="auto"
       refY="0"
       refX="0"
       id="marker1201-5-7"
       style="overflow:visible"
       inkscape:isstock="true"><path
         id="path1199-3-0"
         style="fill:#000000;fill-opacity:1;fill-rule:evenodd;stroke:#000000;stroke-width:0.625;stroke-linejoin:round;stroke-opacity:1"
         d="M 8.7185878,4.0337352 -2.2072895,0.01601326 8.7185884,-4.0017078 c -1.7454984,2.3720609 -1.7354408,5.6174519 -6e-7,8.035443 z"
         transform="scale(-0.6)"
         inkscape:connector-curvature="0" /></marker><marker
       inkscape:stockid="Arrow2Mend"
       orient="auto"
       refY="0"
       refX="0"
       id="marker1201-9"
       style="overflow:visible"
       inkscape:isstock="true"><path
         id="path1199-36"
         style="fill:#000000;fill-opacity:1;fill-rule:evenodd;stroke:#000000;stroke-width:0.625;stroke-linejoin:round;stroke-opacity:1"
         d="M 8.7185878,4.0337352 -2.2072895,0.01601326 8.7185884,-4.0017078 c -1.7454984,2.3720609 -1.7354408,5.6174519 -6e-7,8.035443 z"
         transform="scale(-0.6)"
         inkscape:connector-curvature="0" /></marker><marker
       inkscape:isstock="true"
       style="overflow:visible"
       id="marker5745-0-6-8-6-6"
       refX="0"
       refY="0"
       orient="auto"
       inkscape:stockid="Arrow2Mend"><path
         inkscape:connector-curvature="0"
         transform="scale(-0.6)"
         d="M 8.7185878,4.0337352 -2.2072895,0.01601326 8.7185884,-4.0017078 c -1.7454984,2.3720609 -1.7354408,5.6174519 -6e-7,8.035443 z"
         style="fill:#000000;fill-opacity:1;fill-rule:evenodd;stroke:#000000;stroke-width:0.625;stroke-linejoin:round;stroke-opacity:1"
         id="path5743-9-0-7-29-1" /></marker><marker
       inkscape:stockid="Arrow2Mend"
       orient="auto"
       refY="0"
       refX="0"
       id="marker1201-5-8"
       style="overflow:visible"
       inkscape:isstock="true"><path
         id="path1199-3-7"
         style="fill:#000000;fill-opacity:1;fill-rule:evenodd;stroke:#000000;stroke-width:0.625;stroke-linejoin:round;stroke-opacity:1"
         d="M 8.7185878,4.0337352 -2.2072895,0.01601326 8.7185884,-4.0017078 c -1.7454984,2.3720609 -1.7354408,5.6174519 -6e-7,8.035443 z"
         transform="scale(-0.6)"
         inkscape:connector-curvature="0" /></marker><marker
       inkscape:stockid="Arrow2Mend"
       orient="auto"
       refY="0"
       refX="0"
       id="marker1201-92"
       style="overflow:visible"
       inkscape:isstock="true"><path
         id="path1199-0"
         style="fill:#000000;fill-opacity:1;fill-rule:evenodd;stroke:#000000;stroke-width:0.625;stroke-linejoin:round;stroke-opacity:1"
         d="M 8.7185878,4.0337352 -2.2072895,0.01601326 8.7185884,-4.0017078 c -1.7454984,2.3720609 -1.7354408,5.6174519 -6e-7,8.035443 z"
         transform="scale(-0.6)"
         inkscape:connector-curvature="0" /></marker><marker
       inkscape:stockid="Arrow2Mend"
       orient="auto"
       refY="0"
       refX="0"
       id="marker1201-92-5"
       style="overflow:visible"
       inkscape:isstock="true"><path
         id="path1199-0-9"
         style="fill:#000000;fill-opacity:1;fill-rule:evenodd;stroke:#000000;stroke-width:0.625;stroke-linejoin:round;stroke-opacity:1"
         d="M 8.7185878,4.0337352 -2.2072895,0.01601326 8.7185884,-4.0017078 c -1.7454984,2.3720609 -1.7354408,5.6174519 -6e-7,8.035443 z"
         transform="scale(-0.6)"
         inkscape:connector-curvature="0" /></marker><marker
       inkscape:stockid="Arrow2Mend"
       orient="auto"
       refY="0"
       refX="0"
       id="marker1201-5-8-2"
       style="overflow:visible"
       inkscape:isstock="true"><path
         id="path1199-3-7-2"
         style="fill:#000000;fill-opacity:1;fill-rule:evenodd;stroke:#000000;stroke-width:0.625;stroke-linejoin:round;stroke-opacity:1"
         d="M 8.7185878,4.0337352 -2.2072895,0.01601326 8.7185884,-4.0017078 c -1.7454984,2.3720609 -1.7354408,5.6174519 -6e-7,8.035443 z"
         transform="scale(-0.6)"
         inkscape:connector-curvature="0" /></marker><marker
       inkscape:isstock="true"
       style="overflow:visible"
       id="marker5745-0-6-8-6-6-8"
       refX="0"
       refY="0"
       orient="auto"
       inkscape:stockid="Arrow2Mend"><path
         inkscape:connector-curvature="0"
         transform="scale(-0.6)"
         d="M 8.7185878,4.0337352 -2.2072895,0.01601326 8.7185884,-4.0017078 c -1.7454984,2.3720609 -1.7354408,5.6174519 -6e-7,8.035443 z"
         style="fill:#000000;fill-opacity:1;fill-rule:evenodd;stroke:#000000;stroke-width:0.625;stroke-linejoin:round;stroke-opacity:1"
         id="path5743-9-0-7-29-1-9" /></marker><marker
       inkscape:isstock="true"
       style="overflow:visible"
       id="marker5745-0-6-8-36-3-2"
       refX="0"
       refY="0"
       orient="auto"
       inkscape:stockid="Arrow2Mend"><path
         inkscape:connector-curvature="0"
         transform="scale(-0.6)"
         d="M 8.7185878,4.0337352 -2.2072895,0.01601326 8.7185884,-4.0017078 c -1.7454984,2.3720609 -1.7354408,5.6174519 -6e-7,8.035443 z"
         style="fill:#000000;fill-opacity:1;fill-rule:evenodd;stroke:#000000;stroke-width:0.625;stroke-linejoin:round;stroke-opacity:1"
         id="path5743-9-0-7-7-5-7" /></marker><marker
       inkscape:isstock="true"
       style="overflow:visible"
       id="marker5745-0-6-8-36-0"
       refX="0"
       refY="0"
       orient="auto"
       inkscape:stockid="Arrow2Mend"><path
         inkscape:connector-curvature="0"
         transform="scale(-0.6)"
         d="M 8.7185878,4.0337352 -2.2072895,0.01601326 8.7185884,-4.0017078 c -1.7454984,2.3720609 -1.7354408,5.6174519 -6e-7,8.035443 z"
         style="fill:#000000;fill-opacity:1;fill-rule:evenodd;stroke:#000000;stroke-width:0.625;stroke-linejoin:round;stroke-opacity:1"
         id="path5743-9-0-7-7-9" /></marker></defs><sodipodi:namedview
     pagecolor="#ffffff"
     bordercolor="#666666"
     borderopacity="1"
     objecttolerance="10"
     gridtolerance="10"
     guidetolerance="10"
     inkscape:pageopacity="0"
     inkscape:pageshadow="2"
     inkscape:window-width="1680"
     inkscape:window-height="988"
     id="namedview4506"
     showgrid="false"
     fit-margin-left="1"
     fit-margin-top="1"
     fit-margin-right="1"
     fit-margin-bottom="1"
     inkscape:zoom="1.4162707"
     inkscape:cx="373.30672"
     inkscape:cy="226.11529"
     inkscape:window-x="0"
     inkscape:window-y="25"
     inkscape:window-maximized="1"
     inkscape:current-layer="g4512"
     inkscape:object-paths="true"
     inkscape:snap-intersection-paths="true"
     inkscape:object-nodes="true"
     inkscape:snap-smooth-nodes="true"
     inkscape:snap-global="false" /><g
     id="g4512"
     inkscape:groupmode="layer"
     inkscape:label="ink_ext_XXXXXX"
     transform="matrix(0,1.3333333,1.3333333,0,-142.75411,-351.08942)"><text
       xml:space="preserve"
       style="font-style:normal;font-variant:normal;font-weight:normal;font-stretch:normal;line-height:0%;font-family:'Century Schoolbook L';-inkscape-font-specification:'Century Schoolbook L';letter-spacing:0px;word-spacing:0px;fill:#000000;fill-opacity:1;stroke:none"
       x="210.41843"
       y="464.9191"
       id="text5092"
       transform="matrix(0,1,1,0,0,0)"><tspan
         sodipodi:role="line"
         id="tspan5090"
         x="210.41843"
         y="464.9191"
         style="font-size:12px;line-height:1.25">Lv</tspan></text>
<path
       inkscape:connector-curvature="0"
       id="path4550"
       style="fill:none;stroke:#000000;stroke-width:2.25;stroke-linecap:butt;stroke-linejoin:miter;stroke-miterlimit:10;stroke-dasharray:none;stroke-opacity:1"
       d="M 301.70318,161.05319 V 411.80151" /><path
       inkscape:connector-curvature="0"
       id="path4552"
       style="fill:none;stroke:#000000;stroke-width:2.25;stroke-linecap:butt;stroke-linejoin:miter;stroke-miterlimit:10;stroke-dasharray:none;stroke-opacity:1"
       d="M 301.70319,161.0532 H 408.86468" /><g
       id="g3060"
       transform="matrix(1.4919119,0,0,1.4919119,-239.98029,-419.33134)"><path
         d="m 435.16689,378.80034 v 20.129"
         style="fill:none;stroke:#0000ff;stroke-width:1.00542128;stroke-linecap:butt;stroke-linejoin:miter;stroke-miterlimit:10;stroke-dasharray:none;stroke-opacity:1"
         id="path4616"
         inkscape:connector-curvature="0" /><path
         d="m 435.16689,382.82634 4.024,-4.026"
         style="fill:none;stroke:#0000ff;stroke-width:1.00542128;stroke-linecap:butt;stroke-linejoin:miter;stroke-miterlimit:10;stroke-dasharray:none;stroke-opacity:1"
         id="path4618"
         inkscape:connector-curvature="0" /><path
         d="m 435.16689,386.85234 4.024,-4.026"
         style="fill:none;stroke:#0000ff;stroke-width:1.00542128;stroke-linecap:butt;stroke-linejoin:miter;stroke-miterlimit:10;stroke-dasharray:none;stroke-opacity:1"
         id="path4620"
         inkscape:connector-curvature="0" /><path
         d="m 435.16689,390.87834 4.024,-4.026"
         style="fill:none;stroke:#0000ff;stroke-width:1.00542128;stroke-linecap:butt;stroke-linejoin:miter;stroke-miterlimit:10;stroke-dasharray:none;stroke-opacity:1"
         id="path4622"
         inkscape:connector-curvature="0" /><path
         d="m 435.16689,394.90434 4.024,-4.026"
         style="fill:none;stroke:#0000ff;stroke-width:1.00542128;stroke-linecap:butt;stroke-linejoin:miter;stroke-miterlimit:10;stroke-dasharray:none;stroke-opacity:1"
         id="path4624"
         inkscape:connector-curvature="0" /><path
         d="m 435.16689,398.93034 4.024,-4.026"
         style="fill:none;stroke:#0000ff;stroke-width:1.00542128;stroke-linecap:butt;stroke-linejoin:miter;stroke-miterlimit:10;stroke-dasharray:none;stroke-opacity:1"
         id="path4626"
         inkscape:connector-curvature="0" /></g><path
       inkscape:connector-curvature="0"
       id="path4552-3"
       style="fill:none;stroke:#000000;stroke-width:2.25;stroke-linecap:butt;stroke-linejoin:miter;stroke-miterlimit:10;stroke-dasharray:none;stroke-opacity:1"
       d="M 301.70318,411.80151 H 408.86467" /><g
       id="g3060-6"
       transform="matrix(1.4919119,0,0,1.4919119,-239.98029,-168.58304)"><path
         d="m 435.16689,378.80034 v 20.129"
         style="fill:none;stroke:#0000ff;stroke-width:1.00542128;stroke-linecap:butt;stroke-linejoin:miter;stroke-miterlimit:10;stroke-dasharray:none;stroke-opacity:1"
         id="path4616-7"
         inkscape:connector-curvature="0" /><path
         d="m 435.16689,382.82634 4.024,-4.026"
         style="fill:none;stroke:#0000ff;stroke-width:1.00542128;stroke-linecap:butt;stroke-linejoin:miter;stroke-miterlimit:10;stroke-dasharray:none;stroke-opacity:1"
         id="path4618-5"
         inkscape:connector-curvature="0" /><path
         d="m 435.16689,386.85234 4.024,-4.026"
         style="fill:none;stroke:#0000ff;stroke-width:1.00542128;stroke-linecap:butt;stroke-linejoin:miter;stroke-miterlimit:10;stroke-dasharray:none;stroke-opacity:1"
         id="path4620-3"
         inkscape:connector-curvature="0" /><path
         d="m 435.16689,390.87834 4.024,-4.026"
         style="fill:none;stroke:#0000ff;stroke-width:1.00542128;stroke-linecap:butt;stroke-linejoin:miter;stroke-miterlimit:10;stroke-dasharray:none;stroke-opacity:1"
         id="path4622-5"
         inkscape:connector-curvature="0" /><path
         d="m 435.16689,394.90434 4.024,-4.026"
         style="fill:none;stroke:#0000ff;stroke-width:1.00542128;stroke-linecap:butt;stroke-linejoin:miter;stroke-miterlimit:10;stroke-dasharray:none;stroke-opacity:1"
         id="path4624-6"
         inkscape:connector-curvature="0" /><path
         d="m 435.16689,398.93034 4.024,-4.026"
         style="fill:none;stroke:#0000ff;stroke-width:1.00542128;stroke-linecap:butt;stroke-linejoin:miter;stroke-miterlimit:10;stroke-dasharray:none;stroke-opacity:1"
         id="path4626-2"
         inkscape:connector-curvature="0" /></g><path
       style="fill:none;stroke:#000000;stroke-width:1.32874012;stroke-linecap:butt;stroke-linejoin:miter;stroke-miterlimit:4;stroke-dasharray:none;stroke-opacity:1;marker-end:url(#marker1201)"
       d="M 443.50937,160.59901 H 419.77458"
       id="path5711-7-8-2-3"
       inkscape:connector-curvature="0" /><path
       inkscape:connector-curvature="0"
       id="path4576"
       style="fill:none;stroke:#4c4c4c;stroke-width:0.79724407;stroke-linecap:butt;stroke-linejoin:miter;stroke-miterlimit:10;stroke-dasharray:none;stroke-opacity:1"
       d="m 448.1595,161.0532 h 39.97125" /><path
       inkscape:connector-curvature="0"
       id="path4578"
       style="fill:none;stroke:#4c4c4c;stroke-width:0.79724407;stroke-linecap:butt;stroke-linejoin:miter;stroke-miterlimit:10;stroke-dasharray:none;stroke-opacity:1"
       d="m 448.15952,411.56748 h 39.97125" /><path
       inkscape:connector-curvature="0"
       id="path4580"
       style="fill:none;stroke:#4c4c4c;stroke-width:0.79724407;stroke-linecap:butt;stroke-linejoin:miter;stroke-miterlimit:10;stroke-dasharray:none;stroke-opacity:1"
       d="M 482.09608,161.0532 V 411.56748" /><path
       inkscape:connector-curvature="0"
       id="path4598"
       style="fill:none;stroke:#4c4c4c;stroke-width:0.79724407;stroke-linecap:butt;stroke-linejoin:miter;stroke-miterlimit:10;stroke-dasharray:none;stroke-opacity:1"
       d="m 479.83199,170.11226 2.26407,-9.05906" /><path
       inkscape:connector-curvature="0"
       id="path4600"
       style="fill:none;stroke:#4c4c4c;stroke-width:0.79724407;stroke-linecap:butt;stroke-linejoin:miter;stroke-miterlimit:10;stroke-dasharray:none;stroke-opacity:1"
       d="m 484.35916,170.11226 -2.2631,-9.05906" /><path
       inkscape:connector-curvature="0"
       id="path4602"
       style="fill:none;stroke:#4c4c4c;stroke-width:0.79724407;stroke-linecap:butt;stroke-linejoin:miter;stroke-miterlimit:10;stroke-dasharray:none;stroke-opacity:1"
       d="m 479.83201,402.50842 2.26407,9.05906" /><path
       inkscape:connector-curvature="0"
       id="path4604"
       style="fill:none;stroke:#4c4c4c;stroke-width:0.79724407;stroke-linecap:butt;stroke-linejoin:miter;stroke-miterlimit:10;stroke-dasharray:none;stroke-opacity:1"
       d="m 484.35918,402.50842 -2.2631,9.05906" /><path
       inkscape:connector-curvature="0"
       id="path4576-1"
       style="fill:none;stroke:#4c4c4c;stroke-width:0.79724401;stroke-linecap:butt;stroke-linejoin:miter;stroke-miterlimit:10;stroke-dasharray:none;stroke-opacity:1"
       d="m 409.25036,429.08792 v 76.79804" /><path
       inkscape:connector-curvature="0"
       id="path4578-2"
       style="fill:none;stroke:#4c4c4c;stroke-width:0.79724407;stroke-linecap:butt;stroke-linejoin:miter;stroke-miterlimit:10;stroke-dasharray:none;stroke-opacity:1"
       d="m 301.70318,464.95482 v 39.97125" /><path
       inkscape:connector-curvature="0"
       id="path4580-9"
       style="fill:none;stroke:#4c4c4c;stroke-width:0.79724407;stroke-linecap:butt;stroke-linejoin:miter;stroke-miterlimit:10;stroke-dasharray:none;stroke-opacity:1"
       d="M 409.25037,498.89138 H 301.70318" /><path
       inkscape:connector-curvature="0"
       id="path4598-3"
       style="fill:none;stroke:#4c4c4c;stroke-width:0.79724407;stroke-linecap:butt;stroke-linejoin:miter;stroke-miterlimit:10;stroke-dasharray:none;stroke-opacity:1"
       d="m 400.19131,496.62731 9.05906,2.26407" /><path
       inkscape:connector-curvature="0"
       id="path4600-1"
       style="fill:none;stroke:#4c4c4c;stroke-width:0.79724407;stroke-linecap:butt;stroke-linejoin:miter;stroke-miterlimit:10;stroke-dasharray:none;stroke-opacity:1"
       d="m 400.19131,501.15448 9.05906,-2.2631" /><path
       inkscape:connector-curvature="0"
       id="path4602-9"
       style="fill:none;stroke:#4c4c4c;stroke-width:0.79724407;stroke-linecap:butt;stroke-linejoin:miter;stroke-miterlimit:10;stroke-dasharray:none;stroke-opacity:1"
       d="m 310.76224,496.62731 -9.05906,2.26407" /><path
       inkscape:connector-curvature="0"
       id="path4604-4"
       style="fill:none;stroke:#4c4c4c;stroke-width:0.79724407;stroke-linecap:butt;stroke-linejoin:miter;stroke-miterlimit:10;stroke-dasharray:none;stroke-opacity:1"
       d="m 310.76224,501.15448 -9.05906,-2.2631" /><text
       xml:space="preserve"
       style="font-style:normal;font-variant:normal;font-weight:normal;font-stretch:normal;line-height:0%;font-family:'Century Schoolbook L';-inkscape-font-specification:'Century Schoolbook L';letter-spacing:0px;word-spacing:0px;fill:#000000;fill-opacity:1;stroke:none"
       x="508.67123"
       y="361.13379"
       id="text5092-78"
       transform="matrix(0,1,1,0,0,0)"><tspan
         sodipodi:role="line"
         id="tspan5090-4"
         x="508.67123"
         y="361.13379"
         style="font-size:12px;line-height:1.25">Lp</tspan></text>
<circle
       style="color:#000000;display:inline;overflow:visible;visibility:visible;opacity:1;fill:#000000;fill-opacity:1;fill-rule:nonzero;stroke:none;stroke-width:2.25;stroke-linecap:butt;stroke-linejoin:round;stroke-miterlimit:10;stroke-dasharray:none;stroke-dashoffset:0;stroke-opacity:1;marker:none;enable-background:accumulate"
       id="path2807"
       cx="160.99115"
       cy="301.70319"
       r="2.358196"
       transform="matrix(0,1,1,0,0,0)" /><circle
       style="color:#000000;display:inline;overflow:visible;visibility:visible;opacity:1;fill:#000000;fill-opacity:1;fill-rule:nonzero;stroke:none;stroke-width:2.25;stroke-linecap:butt;stroke-linejoin:round;stroke-miterlimit:10;stroke-dasharray:none;stroke-dashoffset:0;stroke-opacity:1;marker:none;enable-background:accumulate"
       id="path2807-3"
       cx="411.85403"
       cy="301.67749"
       r="2.358196"
       transform="matrix(0,1,1,0,0,0)" /><circle
       style="color:#000000;display:inline;overflow:visible;visibility:visible;opacity:1;fill:#000000;fill-opacity:1;fill-rule:nonzero;stroke:none;stroke-width:2.25;stroke-linecap:butt;stroke-linejoin:round;stroke-miterlimit:10;stroke-dasharray:none;stroke-dashoffset:0;stroke-opacity:1;marker:none;enable-background:accumulate"
       id="path2807-6"
       cx="160.9557"
       cy="408.86533"
       r="2.358196"
       transform="matrix(0,1,1,0,0,0)" /><circle
       style="color:#000000;display:inline;overflow:visible;visibility:visible;opacity:1;fill:#000000;fill-opacity:1;fill-rule:nonzero;stroke:none;stroke-width:2.25;stroke-linecap:butt;stroke-linejoin:round;stroke-miterlimit:10;stroke-dasharray:none;stroke-dashoffset:0;stroke-opacity:1;marker:none;enable-background:accumulate"
       id="path2807-3-7"
       cx="411.81857"
       cy="408.83963"
       r="2.358196"
       transform="matrix(0,1,1,0,0,0)" /><path
       style="fill:none;stroke:#000000;stroke-width:1.32874012;stroke-linecap:butt;stroke-linejoin:miter;stroke-miterlimit:4;stroke-dasharray:none;stroke-opacity:1;marker-end:url(#marker1201-5)"
       d="m 409.08797,117.87439 v 23.73479"
       id="path5711-7-8-2-3-5"
       inkscape:connector-curvature="0" /><path
       style="fill:none;fill-rule:evenodd;stroke:#000000;stroke-width:1.32874024;stroke-linecap:butt;stroke-linejoin:miter;stroke-miterlimit:4;stroke-dasharray:none;stroke-opacity:1;marker-end:url(#marker5745-0-6-8-6)"
       d="m 400.50491,172.13834 c -17.45246,1.39702 -20.04044,-22.24687 -2.85469,-23.05969 0.58824,-0.0278 -1.49778,0.32684 2.85499,-0.88015"
       id="path6953"
       inkscape:connector-curvature="0"
       sodipodi:nodetypes="csc" /><path
       style="fill:none;stroke:#000000;stroke-width:1.32874012;stroke-linecap:butt;stroke-linejoin:miter;stroke-miterlimit:4;stroke-dasharray:none;stroke-opacity:1;marker-end:url(#marker1201-9)"
       d="M 443.39623,411.83295 H 419.66144"
       id="path5711-7-8-2-3-0"
       inkscape:connector-curvature="0" /><path
       style="fill:none;stroke:#000000;stroke-width:1.32874012;stroke-linecap:butt;stroke-linejoin:miter;stroke-miterlimit:4;stroke-dasharray:none;stroke-opacity:1;marker-end:url(#marker1201-5-7)"
       d="m 408.97483,369.10832 v 23.7348"
       id="path5711-7-8-2-3-5-6"
       inkscape:connector-curvature="0" /><path
       style="fill:none;fill-rule:evenodd;stroke:#000000;stroke-width:1.32874024;stroke-linecap:butt;stroke-linejoin:miter;stroke-miterlimit:4;stroke-dasharray:none;stroke-opacity:1;marker-end:url(#marker5745-0-6-8-6-1)"
       d="m 400.39177,423.37228 c -17.45246,1.39702 -20.04044,-22.24687 -2.85469,-23.05969 0.58824,-0.0278 -1.49778,0.32684 2.85499,-0.88015"
       id="path6953-2"
       inkscape:connector-curvature="0"
       sodipodi:nodetypes="csc" /><path
       style="fill:none;stroke:#000000;stroke-width:1.32874012;stroke-linecap:butt;stroke-linejoin:miter;stroke-miterlimit:4;stroke-dasharray:none;stroke-opacity:1;marker-end:url(#marker1201-92)"
       d="M 297.83548,160.73315 H 274.10069"
       id="path5711-7-8-2-3-2"
       inkscape:connector-curvature="0" /><path
       style="fill:none;stroke:#000000;stroke-width:1.32874012;stroke-linecap:butt;stroke-linejoin:miter;stroke-miterlimit:4;stroke-dasharray:none;stroke-opacity:1;marker-end:url(#marker1201-5-8)"
       d="m 301.32768,130.82191 v 23.7348"
       id="path5711-7-8-2-3-5-3"
       inkscape:connector-curvature="0" /><path
       style="fill:none;fill-rule:evenodd;stroke:#000000;stroke-width:1.32874024;stroke-linecap:butt;stroke-linejoin:miter;stroke-miterlimit:4;stroke-dasharray:none;stroke-opacity:1;marker-end:url(#marker5745-0-6-8-6-6)"
       d="m 308.13626,149.49562 c 17.45246,-1.39702 20.04044,22.24687 2.85469,23.05969 -0.58824,0.0278 1.49778,-0.32684 -2.85499,0.88015"
       id="path6953-7"
       inkscape:connector-curvature="0"
       sodipodi:nodetypes="csc" /><path
       style="fill:none;stroke:#000000;stroke-width:1.32874012;stroke-linecap:butt;stroke-linejoin:miter;stroke-miterlimit:4;stroke-dasharray:none;stroke-opacity:1;marker-end:url(#marker1201-92-5)"
       d="M 297.78596,411.65957 H 274.05117"
       id="path5711-7-8-2-3-2-7"
       inkscape:connector-curvature="0" /><path
       style="fill:none;stroke:#000000;stroke-width:1.32874012;stroke-linecap:butt;stroke-linejoin:miter;stroke-miterlimit:4;stroke-dasharray:none;stroke-opacity:1;marker-end:url(#marker1201-5-8-2)"
       d="m 301.52639,415.50776 v 23.73481"
       id="path5711-7-8-2-3-5-3-3"
       inkscape:connector-curvature="0" /><path
       style="fill:none;fill-rule:evenodd;stroke:#000000;stroke-width:1.32874024;stroke-linecap:butt;stroke-linejoin:miter;stroke-miterlimit:4;stroke-dasharray:none;stroke-opacity:1;marker-end:url(#marker5745-0-6-8-6-6-8)"
       d="m 308.08674,400.42204 c 17.45246,-1.39702 20.04044,22.24687 2.85469,23.05969 -0.58824,0.0278 1.49778,-0.32684 -2.85499,0.88015"
       id="path6953-7-6"
       inkscape:connector-curvature="0"
       sodipodi:nodetypes="csc" /><text
       xml:space="preserve"
       style="font-style:normal;font-variant:normal;font-weight:normal;font-stretch:normal;font-size:11.99999905px;line-height:0%;font-family:'Century Schoolbook L';-inkscape-font-specification:'Century Schoolbook L';letter-spacing:0px;word-spacing:0px;fill:#000000;fill-opacity:1;stroke:none;stroke-width:1"
       x="116.12664"
       y="292.07156"
       id="text9611-7-1"
       transform="matrix(0,1.0015848,0.9984177,0,0,0)"><tspan
         sodipodi:role="line"
         id="tspan9609-9-2"
         x="116.12664"
         y="292.07156"
         style="font-size:18.75px;line-height:1.25;stroke-width:1">u</tspan></text>
<text
       xml:space="preserve"
       style="font-style:normal;font-variant:normal;font-weight:normal;font-stretch:normal;font-size:13.12499905px;line-height:125%;font-family:'Century Schoolbook L';-inkscape-font-specification:'Century Schoolbook L';letter-spacing:0px;word-spacing:0px;fill:#000000;fill-opacity:1;stroke:none;stroke-width:0.703125px;stroke-linecap:butt;stroke-linejoin:miter;stroke-opacity:1"
       x="127.85164"
       y="296.51733"
       id="text7222-9"
       transform="matrix(0,1,1,0,0,0)"><tspan
         sodipodi:role="line"
         id="tspan7220-3"
         x="127.85164"
         y="296.51733"
         style="stroke-width:0.703125px">1</tspan></text>
<text
       xml:space="preserve"
       style="font-style:normal;font-variant:normal;font-weight:normal;font-stretch:normal;font-size:11.99999905px;line-height:0%;font-family:'Century Schoolbook L';-inkscape-font-specification:'Century Schoolbook L';letter-spacing:0px;word-spacing:0px;fill:#000000;fill-opacity:1;stroke:none;stroke-width:1"
       x="165.19864"
       y="273.17612"
       id="text9611-7-19"
       transform="matrix(0,1.0015848,0.9984177,0,0,0)"><tspan
         sodipodi:role="line"
         id="tspan9609-9-4"
         x="165.19864"
         y="273.17612"
         style="font-size:18.75px;line-height:1.25;stroke-width:1">u</tspan></text>
<text
       xml:space="preserve"
       style="font-style:normal;font-variant:normal;font-weight:normal;font-stretch:normal;font-size:13.12499905px;line-height:125%;font-family:'Century Schoolbook L';-inkscape-font-specification:'Century Schoolbook L';letter-spacing:0px;word-spacing:0px;fill:#000000;fill-opacity:1;stroke:none;stroke-width:0.703125px;stroke-linecap:butt;stroke-linejoin:miter;stroke-opacity:1"
       x="177.00142"
       y="277.65176"
       id="text7222-7"
       transform="matrix(0,1,1,0,0,0)"><tspan
         sodipodi:role="line"
         id="tspan7220-8"
         x="177.00142"
         y="277.65176"
         style="stroke-width:0.703125px">2</tspan></text>
<text
       xml:space="preserve"
       style="font-style:normal;font-variant:normal;font-weight:normal;font-stretch:normal;font-size:11.99999905px;line-height:0%;font-family:'Century Schoolbook L';-inkscape-font-specification:'Century Schoolbook L';letter-spacing:0px;word-spacing:0px;fill:#000000;fill-opacity:1;stroke:none;stroke-width:1"
       x="173.62514"
       y="331.85153"
       id="text9611-7-4"
       transform="matrix(0,1.0015848,0.9984177,0,0,0)"><tspan
         sodipodi:role="line"
         id="tspan9609-9-5"
         x="173.62514"
         y="331.85153"
         style="font-size:18.75px;line-height:1.25;stroke-width:1">u</tspan></text>
<text
       xml:space="preserve"
       style="font-style:normal;font-variant:normal;font-weight:normal;font-stretch:normal;font-size:13.12499905px;line-height:125%;font-family:'Century Schoolbook L';-inkscape-font-specification:'Century Schoolbook L';letter-spacing:0px;word-spacing:0px;fill:#000000;fill-opacity:1;stroke:none;stroke-width:0.703125px;stroke-linecap:butt;stroke-linejoin:miter;stroke-opacity:1"
       x="185.44128"
       y="336.23431"
       id="text7222-0"
       transform="matrix(0,1,1,0,0,0)"><tspan
         sodipodi:role="line"
         id="tspan7220-36"
         x="185.44128"
         y="336.23431"
         style="stroke-width:0.703125px">3</tspan></text>
<text
       xml:space="preserve"
       style="font-style:normal;font-variant:normal;font-weight:normal;font-stretch:normal;font-size:11.99999905px;line-height:0%;font-family:'Century Schoolbook L';-inkscape-font-specification:'Century Schoolbook L';letter-spacing:0px;word-spacing:0px;fill:#000000;fill-opacity:1;stroke:none;stroke-width:1"
       x="442.28192"
       y="300.52481"
       id="text9611-7-10"
       transform="matrix(0,1.0015848,0.9984177,0,0,0)"><tspan
         sodipodi:role="line"
         id="tspan9609-9-6"
         x="442.28192"
         y="300.52481"
         style="font-size:18.75px;line-height:1.25;stroke-width:1">u</tspan></text>
<text
       xml:space="preserve"
       style="font-style:normal;font-variant:normal;font-weight:normal;font-stretch:normal;font-size:13.12499905px;line-height:125%;font-family:'Century Schoolbook L';-inkscape-font-specification:'Century Schoolbook L';letter-spacing:0px;word-spacing:0px;fill:#000000;fill-opacity:1;stroke:none;stroke-width:0.703125px;stroke-linecap:butt;stroke-linejoin:miter;stroke-opacity:1"
       x="454.52383"
       y="304.95718"
       id="text7222-3"
       transform="matrix(0,1,1,0,0,0)"><tspan
         sodipodi:role="line"
         id="tspan7220-2"
         x="454.52383"
         y="304.95718"
         style="stroke-width:0.703125px">4</tspan></text>
<text
       xml:space="preserve"
       style="font-style:normal;font-variant:normal;font-weight:normal;font-stretch:normal;font-size:11.99999905px;line-height:0%;font-family:'Century Schoolbook L';-inkscape-font-specification:'Century Schoolbook L';letter-spacing:0px;word-spacing:0px;fill:#000000;fill-opacity:1;stroke:none;stroke-width:1"
       x="415.01971"
       y="273.17612"
       id="text9611-7-0"
       transform="matrix(0,1.0015848,0.9984177,0,0,0)"><tspan
         sodipodi:role="line"
         id="tspan9609-9-61"
         x="415.01971"
         y="273.17612"
         style="font-size:18.75px;line-height:1.25;stroke-width:1">u</tspan></text>
<text
       xml:space="preserve"
       style="font-style:normal;font-variant:normal;font-weight:normal;font-stretch:normal;font-size:13.12499905px;line-height:125%;font-family:'Century Schoolbook L';-inkscape-font-specification:'Century Schoolbook L';letter-spacing:0px;word-spacing:0px;fill:#000000;fill-opacity:1;stroke:none;stroke-width:0.703125px;stroke-linecap:butt;stroke-linejoin:miter;stroke-opacity:1"
       x="427.21841"
       y="277.65176"
       id="text7222-5"
       transform="matrix(0,1,1,0,0,0)"><tspan
         sodipodi:role="line"
         id="tspan7220-5"
         x="427.21841"
         y="277.65176"
         style="stroke-width:0.703125px">5</tspan></text>
<text
       xml:space="preserve"
       style="font-style:normal;font-variant:normal;font-weight:normal;font-stretch:normal;font-size:11.99999905px;line-height:0%;font-family:'Century Schoolbook L';-inkscape-font-specification:'Century Schoolbook L';letter-spacing:0px;word-spacing:0px;fill:#000000;fill-opacity:1;stroke:none;stroke-width:1"
       x="422.45486"
       y="330.35977"
       id="text9611-7-47"
       transform="matrix(0,1.0015848,0.9984177,0,0,0)"><tspan
         sodipodi:role="line"
         id="tspan9609-9-65"
         x="422.45486"
         y="330.35977"
         style="font-size:18.75px;line-height:1.25;stroke-width:1">u</tspan></text>
<text
       xml:space="preserve"
       style="font-style:normal;font-variant:normal;font-weight:normal;font-stretch:normal;font-size:13.12499905px;line-height:125%;font-family:'Century Schoolbook L';-inkscape-font-specification:'Century Schoolbook L';letter-spacing:0px;word-spacing:0px;fill:#000000;fill-opacity:1;stroke:none;stroke-width:0.703125px;stroke-linecap:butt;stroke-linejoin:miter;stroke-opacity:1"
       x="434.66534"
       y="334.7449"
       id="text7222-6"
       transform="matrix(0,1,1,0,0,0)"><tspan
         sodipodi:role="line"
         id="tspan7220-9"
         x="434.66534"
         y="334.7449"
         style="stroke-width:0.703125px">6</tspan></text>
<text
       xml:space="preserve"
       style="font-style:normal;font-variant:normal;font-weight:normal;font-stretch:normal;font-size:11.99999905px;line-height:0%;font-family:'Century Schoolbook L';-inkscape-font-specification:'Century Schoolbook L';letter-spacing:0px;word-spacing:0px;fill:#000000;fill-opacity:1;stroke:none;stroke-width:1"
       x="107.20444"
       y="397.4884"
       id="text9611-7-3"
       transform="matrix(0,1.0015848,0.9984177,0,0,0)"><tspan
         sodipodi:role="line"
         id="tspan9609-9-7"
         x="107.20444"
         y="397.4884"
         style="font-size:18.75px;line-height:1.25;stroke-width:1">u</tspan></text>
<text
       xml:space="preserve"
       style="font-style:normal;font-variant:normal;font-weight:normal;font-stretch:normal;font-size:13.12499905px;line-height:125%;font-family:'Century Schoolbook L';-inkscape-font-specification:'Century Schoolbook L';letter-spacing:0px;word-spacing:0px;fill:#000000;fill-opacity:1;stroke:none;stroke-width:0.703125px;stroke-linecap:butt;stroke-linejoin:miter;stroke-opacity:1"
       x="118.91531"
       y="401.76733"
       id="text7222-4"
       transform="matrix(0,1,1,0,0,0)"><tspan
         sodipodi:role="line"
         id="tspan7220-52"
         x="118.91531"
         y="401.76733"
         style="stroke-width:0.703125px">7</tspan></text>
<text
       xml:space="preserve"
       style="font-style:normal;font-variant:normal;font-weight:normal;font-stretch:normal;font-size:11.99999905px;line-height:0%;font-family:'Century Schoolbook L';-inkscape-font-specification:'Century Schoolbook L';letter-spacing:0px;word-spacing:0px;fill:#000000;fill-opacity:1;stroke:none;stroke-width:1"
       x="164.20728"
       y="447.71054"
       id="text9611-7-5"
       transform="matrix(0,1.0015848,0.9984177,0,0,0)"><tspan
         sodipodi:role="line"
         id="tspan9609-9-47"
         x="164.20728"
         y="447.71054"
         style="font-size:18.75px;line-height:1.25;stroke-width:1">u</tspan></text>
<text
       xml:space="preserve"
       style="font-style:normal;font-variant:normal;font-weight:normal;font-stretch:normal;font-size:13.12499905px;line-height:125%;font-family:'Century Schoolbook L';-inkscape-font-specification:'Century Schoolbook L';letter-spacing:0px;word-spacing:0px;fill:#000000;fill-opacity:1;stroke:none;stroke-width:0.703125px;stroke-linecap:butt;stroke-linejoin:miter;stroke-opacity:1"
       x="176.0085"
       y="451.91003"
       id="text7222-44"
       transform="matrix(0,1,1,0,0,0)"><tspan
         sodipodi:role="line"
         id="tspan7220-30"
         x="176.0085"
         y="451.91003"
         style="stroke-width:0.703125px">8</tspan></text>
<text
       xml:space="preserve"
       style="font-style:normal;font-variant:normal;font-weight:normal;font-stretch:normal;font-size:11.99999905px;line-height:0%;font-family:'Century Schoolbook L';-inkscape-font-specification:'Century Schoolbook L';letter-spacing:0px;word-spacing:0px;fill:#000000;fill-opacity:1;stroke:none;stroke-width:1"
       x="172.13811"
       y="386.05167"
       id="text9611-7-7"
       transform="matrix(0,1.0015848,0.9984177,0,0,0)"><tspan
         sodipodi:role="line"
         id="tspan9609-9-8"
         x="172.13811"
         y="386.05167"
         style="font-size:18.75px;line-height:1.25;stroke-width:1">u</tspan></text>
<text
       xml:space="preserve"
       style="font-style:normal;font-variant:normal;font-weight:normal;font-stretch:normal;font-size:13.12499905px;line-height:125%;font-family:'Century Schoolbook L';-inkscape-font-specification:'Century Schoolbook L';letter-spacing:0px;word-spacing:0px;fill:#000000;fill-opacity:1;stroke:none;stroke-width:0.703125px;stroke-linecap:butt;stroke-linejoin:miter;stroke-opacity:1"
       x="183.95187"
       y="390.34869"
       id="text7222-68"
       transform="matrix(0,1,1,0,0,0)"><tspan
         sodipodi:role="line"
         id="tspan7220-84"
         x="183.95187"
         y="390.34869"
         style="stroke-width:0.703125px">9</tspan></text>
<text
       xml:space="preserve"
       style="font-style:normal;font-variant:normal;font-weight:normal;font-stretch:normal;font-size:11.99999905px;line-height:0%;font-family:'Century Schoolbook L';-inkscape-font-specification:'Century Schoolbook L';letter-spacing:0px;word-spacing:0px;fill:#000000;fill-opacity:1;stroke:none;stroke-width:1"
       x="357.02551"
       y="400.47186"
       id="text9611-7-31"
       transform="matrix(0,1.0015848,0.9984177,0,0,0)"><tspan
         sodipodi:role="line"
         id="tspan9609-9-49"
         x="357.02551"
         y="400.47186"
         style="font-size:18.75px;line-height:1.25;stroke-width:1">u</tspan></text>
<text
       xml:space="preserve"
       style="font-style:normal;font-variant:normal;font-weight:normal;font-stretch:normal;font-size:13.12499905px;line-height:125%;font-family:'Century Schoolbook L';-inkscape-font-specification:'Century Schoolbook L';letter-spacing:0px;word-spacing:0px;fill:#000000;fill-opacity:1;stroke:none;stroke-width:0.703125px;stroke-linecap:butt;stroke-linejoin:miter;stroke-opacity:1"
       x="369.13232"
       y="404.74609"
       id="text7222-2"
       transform="matrix(0,1,1,0,0,0)"><tspan
         sodipodi:role="line"
         id="tspan7220-0"
         x="369.13232"
         y="404.74609"
         style="stroke-width:0.703125px">10</tspan></text>
<text
       xml:space="preserve"
       style="font-style:normal;font-variant:normal;font-weight:normal;font-stretch:normal;font-size:11.99999905px;line-height:0%;font-family:'Century Schoolbook L';-inkscape-font-specification:'Century Schoolbook L';letter-spacing:0px;word-spacing:0px;fill:#000000;fill-opacity:1;stroke:none;stroke-width:1"
       x="415.51541"
       y="446.21881"
       id="text9611-7-6"
       transform="matrix(0,1.0015848,0.9984177,0,0,0)"><tspan
         sodipodi:role="line"
         id="tspan9609-9-89"
         x="415.51541"
         y="446.21881"
         style="font-size:18.75px;line-height:1.25;stroke-width:1">u</tspan></text>
<text
       xml:space="preserve"
       style="font-style:normal;font-variant:normal;font-weight:normal;font-stretch:normal;font-size:13.12499905px;line-height:125%;font-family:'Century Schoolbook L';-inkscape-font-specification:'Century Schoolbook L';letter-spacing:0px;word-spacing:0px;fill:#000000;fill-opacity:1;stroke:none;stroke-width:0.703125px;stroke-linecap:butt;stroke-linejoin:miter;stroke-opacity:1"
       x="427.71487"
       y="450.42062"
       id="text7222-26"
       transform="matrix(0,1,1,0,0,0)"><tspan
         sodipodi:role="line"
         id="tspan7220-6"
         x="427.71487"
         y="450.42062"
         style="stroke-width:0.703125px">11</tspan></text>
<text
       xml:space="preserve"
       style="font-style:normal;font-variant:normal;font-weight:normal;font-stretch:normal;font-size:11.99999905px;line-height:0%;font-family:'Century Schoolbook L';-inkscape-font-specification:'Century Schoolbook L';letter-spacing:0px;word-spacing:0px;fill:#000000;fill-opacity:1;stroke:none;stroke-width:1"
       x="422.45486"
       y="383.06818"
       id="text9611-7-49"
       transform="matrix(0,1.0015848,0.9984177,0,0,0)"><tspan
         sodipodi:role="line"
         id="tspan9609-9-50"
         x="422.45486"
         y="383.06818"
         style="font-size:18.75px;line-height:1.25;stroke-width:1">u</tspan></text>
<text
       xml:space="preserve"
       style="font-style:normal;font-variant:normal;font-weight:normal;font-stretch:normal;font-size:13.12499905px;line-height:125%;font-family:'Century Schoolbook L';-inkscape-font-specification:'Century Schoolbook L';letter-spacing:0px;word-spacing:0px;fill:#000000;fill-opacity:1;stroke:none;stroke-width:0.703125px;stroke-linecap:butt;stroke-linejoin:miter;stroke-opacity:1"
       x="434.66534"
       y="387.36993"
       id="text7222-48"
       transform="matrix(0,1,1,0,0,0)"><tspan
         sodipodi:role="line"
         id="tspan7220-7"
         x="434.66534"
         y="387.36993"
         style="stroke-width:0.703125px">12</tspan></text>
<path
       style="fill:none;fill-rule:evenodd;stroke:#000000;stroke-width:1.32874024;stroke-linecap:butt;stroke-linejoin:miter;stroke-miterlimit:4;stroke-dasharray:none;stroke-dashoffset:0;stroke-opacity:1;marker-end:url(#marker5745-0-6-8-36-0)"
       d="M 409.25037,286.3303 H 341.43298"
       id="path5711-3-1-9-5-3"
       inkscape:connector-curvature="0" /><path
       style="fill:none;fill-rule:evenodd;stroke:#000000;stroke-width:1.32874024;stroke-linecap:butt;stroke-linejoin:miter;stroke-miterlimit:4;stroke-dasharray:none;stroke-dashoffset:0;stroke-opacity:1;marker-end:url(#marker5745-0-6-8-36-3-2)"
       d="M 409.25037,286.32539 V 344.9779"
       id="path5711-3-1-9-5-6-6"
       inkscape:connector-curvature="0" /><text
       xml:space="preserve"
       style="font-style:normal;font-variant:normal;font-weight:normal;font-stretch:normal;font-size:21.31536102px;line-height:125%;font-family:'Century Schoolbook L';-inkscape-font-specification:'Century Schoolbook L';letter-spacing:0px;word-spacing:0px;fill:#000000;fill-opacity:1;stroke:none;stroke-width:1.14189446px;stroke-linecap:butt;stroke-linejoin:miter;stroke-opacity:1"
       x="268.00589"
       y="345.9982"
       id="text9611-2-0"
       transform="matrix(0,1,1,0,0,0)"><tspan
         sodipodi:role="line"
         id="tspan9609-9-6-1"
         x="268.00589"
         y="345.9982"
         style="stroke-width:1.14189446px">Y</tspan></text>
<text
       xml:space="preserve"
       style="font-style:normal;font-variant:normal;font-weight:normal;font-stretch:normal;font-size:21.31536102px;line-height:125%;font-family:'Century Schoolbook L';-inkscape-font-specification:'Century Schoolbook L';letter-spacing:0px;word-spacing:0px;fill:#000000;fill-opacity:1;stroke:none;stroke-width:1.32874024;stroke-linecap:butt;stroke-linejoin:miter;stroke-miterlimit:4;stroke-dasharray:none;stroke-opacity:1"
       x="325.5788"
       y="403.26486"
       id="text9611-1-2"
       transform="matrix(0,1,1,0,0,0)"><tspan
         sodipodi:role="line"
         id="tspan9609-2-6"
         x="325.5788"
         y="403.26486"
         style="stroke-width:1.32874024;stroke-miterlimit:4;stroke-dasharray:none">X</tspan></text>
<path
       inkscape:connector-curvature="0"
       id="path4578-7"
       style="fill:none;stroke:#4c4c4c;stroke-width:0.79724407;stroke-linecap:butt;stroke-linejoin:miter;stroke-miterlimit:10;stroke-dasharray:none;stroke-opacity:1"
       d="m 412.06287,286.3303 h 74.72539" /><path
       inkscape:connector-curvature="0"
       id="path4602-2"
       style="fill:none;stroke:#4c4c4c;stroke-width:0.79724407;stroke-linecap:butt;stroke-linejoin:miter;stroke-miterlimit:10;stroke-dasharray:none;stroke-opacity:1"
       d="m 479.83201,277.27124 2.26407,9.05906" /><path
       inkscape:connector-curvature="0"
       id="path4604-7"
       style="fill:none;stroke:#4c4c4c;stroke-width:0.79724407;stroke-linecap:butt;stroke-linejoin:miter;stroke-miterlimit:10;stroke-dasharray:none;stroke-opacity:1"
       d="m 484.35918,277.27124 -2.2631,9.05906" /><path
       inkscape:connector-curvature="0"
       id="path4598-2"
       style="fill:none;stroke:#4c4c4c;stroke-width:0.79724407;stroke-linecap:butt;stroke-linejoin:miter;stroke-miterlimit:10;stroke-dasharray:none;stroke-opacity:1"
       d="m 479.83201,295.38936 2.26407,-9.05906" /><path
       inkscape:connector-curvature="0"
       id="path4600-2"
       style="fill:none;stroke:#4c4c4c;stroke-width:0.79724407;stroke-linecap:butt;stroke-linejoin:miter;stroke-miterlimit:10;stroke-dasharray:none;stroke-opacity:1"
       d="m 484.35918,295.38936 -2.2631,-9.05906" /><path
       style="fill:none;fill-rule:evenodd;stroke:#000000;stroke-width:0.703125px;stroke-linecap:butt;stroke-linejoin:miter;stroke-opacity:1"
       d="m 466.81448,210.05606 v 14.3974"
       id="path13032"
       inkscape:connector-curvature="0" /><text
       xml:space="preserve"
       style="font-style:normal;font-variant:normal;font-weight:normal;font-stretch:normal;font-size:13.125px;line-height:125%;font-family:'Century Schoolbook L';-inkscape-font-specification:'Century Schoolbook L';letter-spacing:0px;word-spacing:0px;fill:#000000;fill-opacity:1;stroke:none;stroke-width:0.703125px;stroke-linecap:butt;stroke-linejoin:miter;stroke-opacity:1"
       x="213.40718"
       y="478.35724"
       id="text13036"
       transform="matrix(0,1,1,0,0,0)"><tspan
         sodipodi:role="line"
         id="tspan13034"
         x="213.40718"
         y="478.35724"
         style="stroke-width:0.703125px">2</tspan></text>
<text
       xml:space="preserve"
       style="font-style:normal;font-variant:normal;font-weight:normal;font-stretch:normal;font-size:11.99999905px;line-height:0%;font-family:'Century Schoolbook L';-inkscape-font-specification:'Century Schoolbook L';letter-spacing:0px;word-spacing:0px;fill:#000000;fill-opacity:1;stroke:none;stroke-width:1"
       x="349.64194"
       y="465.54443"
       id="text5092-6"
       transform="matrix(0,1,1,0,0,0)"><tspan
         sodipodi:role="line"
         id="tspan5090-1"
         x="349.64194"
         y="465.54443"
         style="font-size:11.99999905px;line-height:1.25;stroke-width:1">Lv</tspan></text>
<path
       style="fill:none;fill-rule:evenodd;stroke:#000000;stroke-width:0.703125px;stroke-linecap:butt;stroke-linejoin:miter;stroke-opacity:1"
       d="m 467.43983,349.27956 v 14.3974"
       id="path13032-0"
       inkscape:connector-curvature="0" /><text
       xml:space="preserve"
       style="font-style:normal;font-variant:normal;font-weight:normal;font-stretch:normal;font-size:13.12499905px;line-height:125%;font-family:'Century Schoolbook L';-inkscape-font-specification:'Century Schoolbook L';letter-spacing:0px;word-spacing:0px;fill:#000000;fill-opacity:1;stroke:none;stroke-width:0.703125px;stroke-linecap:butt;stroke-linejoin:miter;stroke-opacity:1"
       x="352.63068"
       y="478.98257"
       id="text13036-6"
       transform="matrix(0,1,1,0,0,0)"><tspan
         sodipodi:role="line"
         id="tspan13034-1"
         x="352.63068"
         y="478.98257"
         style="stroke-width:0.703125px">2</tspan></text>
<text
       xml:space="preserve"
       style="font-style:normal;font-variant:normal;font-weight:normal;font-stretch:normal;font-size:15.89951992px;line-height:0%;font-family:'Century Schoolbook L';-inkscape-font-specification:'Century Schoolbook L';letter-spacing:0px;word-spacing:0px;fill:#000000;fill-opacity:1;stroke:none;stroke-width:0.703125px;stroke-linecap:butt;stroke-linejoin:miter;stroke-opacity:1"
       x="183.65248"
       y="415.80624"
       id="text5453-9-7"
       transform="matrix(0,1,1,0,0,0)"><tspan
         sodipodi:role="line"
         id="tspan5451-1-3"
         x="183.65248"
         y="415.80624"
         style="font-size:21.19935608px;line-height:1.25;stroke-width:0.703125px">1</tspan></text>
<circle
       style="color:#000000;display:inline;overflow:visible;visibility:visible;opacity:1;fill:none;fill-opacity:1;fill-rule:nonzero;stroke:#000000;stroke-width:0.703125;stroke-linecap:square;stroke-linejoin:round;stroke-miterlimit:4;stroke-dasharray:1.40624999, 0.703125;stroke-dashoffset:0;stroke-opacity:1;marker:none;enable-background:accumulate"
       id="path4593-7"
       cx="189.7581"
       cy="409.25037"
       r="9.701766"
       transform="matrix(0,1,1,0,0,0)" /><text
       xml:space="preserve"
       style="font-style:normal;font-variant:normal;font-weight:normal;font-stretch:normal;font-size:15.89951992px;line-height:0%;font-family:'Century Schoolbook L';-inkscape-font-specification:'Century Schoolbook L';letter-spacing:0px;word-spacing:0px;fill:#000000;fill-opacity:1;stroke:none;stroke-width:0.703125px;stroke-linecap:butt;stroke-linejoin:miter;stroke-opacity:1"
       x="170.46468"
       y="296.57144"
       id="text5453-9-7-3"
       transform="matrix(0,1,1,0,0,0)"><tspan
         sodipodi:role="line"
         id="tspan5451-1-3-6"
         x="170.46468"
         y="296.57144"
         style="font-size:21.19935608px;line-height:1.25;stroke-width:0.703125px">2</tspan></text>
<circle
       style="color:#000000;display:inline;overflow:visible;visibility:visible;opacity:1;fill:none;fill-opacity:1;fill-rule:nonzero;stroke:#000000;stroke-width:0.703125;stroke-linecap:square;stroke-linejoin:round;stroke-miterlimit:4;stroke-dasharray:1.40624996, 0.70312499;stroke-dashoffset:0;stroke-opacity:1;marker:none;enable-background:accumulate"
       id="path4593-7-7"
       cx="176.5703"
       cy="290.01556"
       r="9.701766"
       transform="matrix(0,1,1,0,0,0)" /><text
       xml:space="preserve"
       style="font-style:normal;font-variant:normal;font-weight:normal;font-stretch:normal;font-size:15.89951992px;line-height:0%;font-family:'Century Schoolbook L';-inkscape-font-specification:'Century Schoolbook L';letter-spacing:0px;word-spacing:0px;fill:#000000;fill-opacity:1;stroke:none;stroke-width:0.703125px;stroke-linecap:butt;stroke-linejoin:miter;stroke-opacity:1"
       x="389.90103"
       y="295.31549"
       id="text5453-9-7-5"
       transform="matrix(0,1,1,0,0,0)"><tspan
         sodipodi:role="line"
         id="tspan5451-1-3-3"
         x="389.90103"
         y="295.31549"
         style="font-size:21.19935608px;line-height:1.25;stroke-width:0.703125px">3</tspan></text>
<circle
       style="color:#000000;display:inline;overflow:visible;visibility:visible;opacity:1;fill:none;fill-opacity:1;fill-rule:nonzero;stroke:#000000;stroke-width:0.703125;stroke-linecap:square;stroke-linejoin:round;stroke-miterlimit:4;stroke-dasharray:1.40624996, 0.70312499;stroke-dashoffset:0;stroke-opacity:1;marker:none;enable-background:accumulate"
       id="path4593-7-5"
       cx="396.00665"
       cy="288.75961"
       r="9.701766"
       transform="matrix(0,1,1,0,0,0)" /><text
       xml:space="preserve"
       style="font-style:normal;font-variant:normal;font-weight:normal;font-stretch:normal;font-size:15.89951992px;line-height:0%;font-family:'Century Schoolbook L';-inkscape-font-specification:'Century Schoolbook L';letter-spacing:0px;word-spacing:0px;fill:#000000;fill-opacity:1;stroke:none;stroke-width:0.703125px;stroke-linecap:butt;stroke-linejoin:miter;stroke-opacity:1"
       x="429.61801"
       y="430.84967"
       id="text5453-9-7-6"
       transform="matrix(0,1,1,0,0,0)"><tspan
         sodipodi:role="line"
         id="tspan5451-1-3-2"
         x="429.61801"
         y="430.84967"
         style="font-size:21.19935608px;line-height:1.25;stroke-width:0.703125px">4</tspan></text>
<circle
       style="color:#000000;display:inline;overflow:visible;visibility:visible;opacity:1;fill:none;fill-opacity:1;fill-rule:nonzero;stroke:#000000;stroke-width:0.703125;stroke-linecap:square;stroke-linejoin:round;stroke-miterlimit:4;stroke-dasharray:1.40624996, 0.70312499;stroke-dashoffset:0;stroke-opacity:1;marker:none;enable-background:accumulate"
       id="path4593-7-9"
       cx="435.72363"
       cy="424.29379"
       r="9.701766"
       transform="matrix(0,1,1,0,0,0)" /></g></svg>