[
    {
        "category_name": "dress-mini",
        "product_list": [
            {
                "product_id": 1,
                "product_name": "Dress Mini Cantik 1",
                "product_path": "",
                "product_price": "200.000",
                "product_size": [],
                "product_image": "https://imager-next.freetls.fastly.net/images/resized/480/896d171c-6641-417c-a886-06ebfda78110",
                "product_image_list": [
                    {
                        "product_image_id": 1,
                        "product_image": "https://imager-next.freetls.fastly.net/images/resized/480/896d171c-6641-417c-a886-06ebfda78110"
                    },
                    {
                        "product_image_id": 2,
                        "product_image": "https://imager-next.freetls.fastly.net/images/resized/480/a76b985a-a3a3-4321-b212-284bce616fdd"
                    },
                    {
                        "product_image_id": 3,
                        "product_image": "https://imager-next.freetls.fastly.net/images/resized/480/d155534c-e619-4be4-b7b7-7447375a38a3"
                    },
                    {
                        "product_image_id": 4,
                        "product_image": "https://imager-next.freetls.fastly.net/images/resized/480/d30dd206-70ab-4814-aa0c-68c1711ce749"
                    },
                    {
                        "product_image_id": 5,
                        "product_image": "https://imager-next.freetls.fastly.net/images/resized/480/0093c538-2c2e-4914-94c9-d023c3286389"
                    }
                ]
            },
            {
                "product_id": 2,
                "product_name": "Dress Mini Cantik 2",
                "product_path": "",
                "product_price": "200.000",
                "product_size": [],
                "product_image": "https://imager-next.freetls.fastly.net/images/resized/480/a76b985a-a3a3-4321-b212-284bce616fdd",
                "product_image_list": [
                    {
                        "product_image_id": 1,
                        "product_image": "https://imager-next.freetls.fastly.net/images/resized/480/a76b985a-a3a3-4321-b212-284bce616fdd"
                    },
                    {
                        "product_image_id": 2,
                        "product_image": "https://imager-next.freetls.fastly.net/images/resized/480/a76b985a-a3a3-4321-b212-284bce616fdd"
                    },
                    {
                        "product_image_id": 3,
                        "product_image": "https://imager-next.freetls.fastly.net/images/resized/480/d155534c-e619-4be4-b7b7-7447375a38a3"
                    },
                    {
                        "product_image_id": 4,
                        "product_image": "https://imager-next.freetls.fastly.net/images/resized/480/d30dd206-70ab-4814-aa0c-68c1711ce749"
                    },
                    {
                        "product_image_id": 5,
                        "product_image": "https://imager-next.freetls.fastly.net/images/resized/480/0093c538-2c2e-4914-94c9-d023c3286389"
                    }
                ]
            },
            {
                "product_id": 3,
                "product_name": "Dress Mini Cantik 3",
                "product_path": "",
                "product_price": "200.000",
                "product_size": [],
                "product_image": "https://imager-next.freetls.fastly.net/images/resized/480/d155534c-e619-4be4-b7b7-7447375a38a3",
                "product_image_list": [
                    {
                        "product_image_id": 1,
                        "product_image": "https://imager-next.freetls.fastly.net/images/resized/480/d155534c-e619-4be4-b7b7-7447375a38a3"
                    },
                    {
                        "product_image_id": 2,
                        "product_image": "https://imager-next.freetls.fastly.net/images/resized/480/a76b985a-a3a3-4321-b212-284bce616fdd"
                    },
                    {
                        "product_image_id": 3,
                        "product_image": "https://imager-next.freetls.fastly.net/images/resized/480/d155534c-e619-4be4-b7b7-7447375a38a3"
                    },
                    {
                        "product_image_id": 4,
                        "product_image": "https://imager-next.freetls.fastly.net/images/resized/480/d30dd206-70ab-4814-aa0c-68c1711ce749"
                    },
                    {
                        "product_image_id": 5,
                        "product_image": "https://imager-next.freetls.fastly.net/images/resized/480/0093c538-2c2e-4914-94c9-d023c3286389"
                    }
                ]
            },
            {
                "product_id": 4,
                "product_name": "Dress Mini Cantik 4",
                "product_path": "",
                "product_price": "200.000",
                "product_size": [],
                "product_image": "https://imager-next.freetls.fastly.net/images/resized/480/d30dd206-70ab-4814-aa0c-68c1711ce749",
                "product_image_list": [
                    {
                        "product_image_id": 1,
                        "product_image": "https://imager-next.freetls.fastly.net/images/resized/480/d30dd206-70ab-4814-aa0c-68c1711ce749"
                    },
                    {
                        "product_image_id": 2,
                        "product_image": "https://imager-next.freetls.fastly.net/images/resized/480/a76b985a-a3a3-4321-b212-284bce616fdd"
                    },
                    {
                        "product_image_id": 3,
                        "product_image": "https://imager-next.freetls.fastly.net/images/resized/480/d155534c-e619-4be4-b7b7-7447375a38a3"
                    },
                    {
                        "product_image_id": 4,
                        "product_image": "https://imager-next.freetls.fastly.net/images/resized/480/d30dd206-70ab-4814-aa0c-68c1711ce749"
                    },
                    {
                        "product_image_id": 5,
                        "product_image": "https://imager-next.freetls.fastly.net/images/resized/480/0093c538-2c2e-4914-94c9-d023c3286389"
                    }
                ]
            }
        ]
    },
    {
        "category_name": "dress-midi",
        "product_list": [
            {
                "product_id": 5,
                "product_name": "Dress Midi Cantik 5",
                "product_path": "",
                "product_price": "200.000",
                "product_size": [],
                "product_image": "https://imager-next.freetls.fastly.net/images/resized/480/0093c538-2c2e-4914-94c9-d023c3286389",
                "product_image_list": [
                    {
                        "product_image_id": 1,
                        "product_image": "https://imager-next.freetls.fastly.net/images/resized/480/0093c538-2c2e-4914-94c9-d023c3286389"
                    },
                    {
                        "product_image_id": 2,
                        "product_image": "https://imager-next.freetls.fastly.net/images/resized/480/a76b985a-a3a3-4321-b212-284bce616fdd"
                    },
                    {
                        "product_image_id": 3,
                        "product_image": "https://imager-next.freetls.fastly.net/images/resized/480/d155534c-e619-4be4-b7b7-7447375a38a3"
                    },
                    {
                        "product_image_id": 4,
                        "product_image": "https://imager-next.freetls.fastly.net/images/resized/480/d30dd206-70ab-4814-aa0c-68c1711ce749"
                    },
                    {
                        "product_image_id": 5,
                        "product_image": "https://imager-next.freetls.fastly.net/images/resized/480/0093c538-2c2e-4914-94c9-d023c3286389"
                    }
                ]
            },
            {
                "product_id": 6,
                "product_name": "Dress Midi Cantik 6",
                "product_path": "",
                "product_price": "200.000",
                "product_size": [],
                "product_image": "https://imager-next.freetls.fastly.net/images/resized/480/b83d22cb-2120-4cdc-bfc7-eb2666784799",
                "product_image_list": [
                    {
                        "product_image_id": 1,
                        "product_image": "https://imager-next.freetls.fastly.net/images/resized/480/b83d22cb-2120-4cdc-bfc7-eb2666784799"
                    },
                    {
                        "product_image_id": 2,
                        "product_image": "https://imager-next.freetls.fastly.net/images/resized/480/a76b985a-a3a3-4321-b212-284bce616fdd"
                    },
                    {
                        "product_image_id": 3,
                        "product_image": "https://imager-next.freetls.fastly.net/images/resized/480/d155534c-e619-4be4-b7b7-7447375a38a3"
                    },
                    {
                        "product_image_id": 4,
                        "product_image": "https://imager-next.freetls.fastly.net/images/resized/480/d30dd206-70ab-4814-aa0c-68c1711ce749"
                    },
                    {
                        "product_image_id": 5,
                        "product_image": "https://imager-next.freetls.fastly.net/images/resized/480/0093c538-2c2e-4914-94c9-d023c3286389"
                    }
                ]
            },
            {
                "product_id": 7,
                "product_name": "Dress Midi Cantik 7",
                "product_path": "",
                "product_price": "200.000",
                "product_size": [],
                "product_image": "https://imager-next.freetls.fastly.net/images/resized/480/44497f91-2f67-49c5-807e-5b8cd4f33628",
                "product_image_list": [
                    {
                        "product_image_id": 1,
                        "product_image": "https://imager-next.freetls.fastly.net/images/resized/480/44497f91-2f67-49c5-807e-5b8cd4f33628"
                    },
                    {
                        "product_image_id": 2,
                        "product_image": "https://imager-next.freetls.fastly.net/images/resized/480/a76b985a-a3a3-4321-b212-284bce616fdd"
                    },
                    {
                        "product_image_id": 3,
                        "product_image": "https://imager-next.freetls.fastly.net/images/resized/480/d155534c-e619-4be4-b7b7-7447375a38a3"
                    },
                    {
                        "product_image_id": 4,
                        "product_image": "https://imager-next.freetls.fastly.net/images/resized/480/d30dd206-70ab-4814-aa0c-68c1711ce749"
                    },
                    {
                        "product_image_id": 5,
                        "product_image": "https://imager-next.freetls.fastly.net/images/resized/480/0093c538-2c2e-4914-94c9-d023c3286389"
                    }
                ]
            },
            {
                "product_id": 8,
                "product_name": "Dress Midi Cantik 8",
                "product_path": "",
                "product_price": "200.000",
                "product_size": [],
                "product_image": "https://imager-next.freetls.fastly.net/images/resized/480/272322e2-9b3d-462c-89f3-b655f70969cc",
                "product_image_list": [
                    {
                        "product_image_id": 1,
                        "product_image": "https://imager-next.freetls.fastly.net/images/resized/480/272322e2-9b3d-462c-89f3-b655f70969cc"
                    },
                    {
                        "product_image_id": 2,
                        "product_image": "https://imager-next.freetls.fastly.net/images/resized/480/a76b985a-a3a3-4321-b212-284bce616fdd"
                    },
                    {
                        "product_image_id": 3,
                        "product_image": "https://imager-next.freetls.fastly.net/images/resized/480/d155534c-e619-4be4-b7b7-7447375a38a3"
                    },
                    {
                        "product_image_id": 4,
                        "product_image": "https://imager-next.freetls.fastly.net/images/resized/480/d30dd206-70ab-4814-aa0c-68c1711ce749"
                    },
                    {
                        "product_image_id": 5,
                        "product_image": "https://imager-next.freetls.fastly.net/images/resized/480/0093c538-2c2e-4914-94c9-d023c3286389"
                    }
                ]
            }
        ]
    },
    {
        "category_name": "dress-maxi",
        "product_list": [
            {
                "product_id": 9,
                "product_name": "Dress Maxi Cantik 9",
                "product_path": "",
                "product_price": "200.000",
                "product_size": [],
                "product_image": "https://imager-next.freetls.fastly.net/images/resized/480/53b01391-dd6b-4cf5-830f-84d93291acfe",
                "product_image_list": [
                    {
                        "product_image_id": 1,
                        "product_image": "https://imager-next.freetls.fastly.net/images/resized/480/53b01391-dd6b-4cf5-830f-84d93291acfe"
                    },
                    {
                        "product_image_id": 2,
                        "product_image": "https://imager-next.freetls.fastly.net/images/resized/480/a76b985a-a3a3-4321-b212-284bce616fdd"
                    },
                    {
                        "product_image_id": 3,
                        "product_image": "https://imager-next.freetls.fastly.net/images/resized/480/d155534c-e619-4be4-b7b7-7447375a38a3"
                    },
                    {
                        "product_image_id": 4,
                        "product_image": "https://imager-next.freetls.fastly.net/images/resized/480/d30dd206-70ab-4814-aa0c-68c1711ce749"
                    },
                    {
                        "product_image_id": 5,
                        "product_image": "https://imager-next.freetls.fastly.net/images/resized/480/0093c538-2c2e-4914-94c9-d023c3286389"
                    }
                ]
            },
            {
                "product_id": 10,
                "product_name": "Dress Maxi Cantik 10",
                "product_path": "",
                "product_price": "200.000",
                "product_size": [],
                "product_image": "https://imager-next.freetls.fastly.net/images/resized/480/14dbeca1-6bf5-4769-b920-993e5f357e68",
                "product_image_list": [
                    {
                        "product_image_id": 1,
                        "product_image": "https://imager-next.freetls.fastly.net/images/resized/480/14dbeca1-6bf5-4769-b920-993e5f357e68"
                    },
                    {
                        "product_image_id": 2,
                        "product_image": "https://imager-next.freetls.fastly.net/images/resized/480/a76b985a-a3a3-4321-b212-284bce616fdd"
                    },
                    {
                        "product_image_id": 3,
                        "product_image": "https://imager-next.freetls.fastly.net/images/resized/480/d155534c-e619-4be4-b7b7-7447375a38a3"
                    },
                    {
                        "product_image_id": 4,
                        "product_image": "https://imager-next.freetls.fastly.net/images/resized/480/d30dd206-70ab-4814-aa0c-68c1711ce749"
                    },
                    {
                        "product_image_id": 5,
                        "product_image": "https://imager-next.freetls.fastly.net/images/resized/480/0093c538-2c2e-4914-94c9-d023c3286389"
                    }
                ]
            },
            {
                "product_id": 11,
                "product_name": "Dress Maxi Cantik 11",
                "product_path": "",
                "product_price": "200.000",
                "product_size": [],
                "product_image": "https://imager-next.freetls.fastly.net/images/resized/480/843324dd-00ee-4ff8-a6a4-8a07ad4fba37",
                "product_image_list": [
                    {
                        "product_image_id": 1,
                        "product_image": "https://imager-next.freetls.fastly.net/images/resized/480/843324dd-00ee-4ff8-a6a4-8a07ad4fba37"
                    },
                    {
                        "product_image_id": 2,
                        "product_image": "https://imager-next.freetls.fastly.net/images/resized/480/a76b985a-a3a3-4321-b212-284bce616fdd"
                    },
                    {
                        "product_image_id": 3,
                        "product_image": "https://imager-next.freetls.fastly.net/images/resized/480/d155534c-e619-4be4-b7b7-7447375a38a3"
                    },
                    {
                        "product_image_id": 4,
                        "product_image": "https://imager-next.freetls.fastly.net/images/resized/480/d30dd206-70ab-4814-aa0c-68c1711ce749"
                    },
                    {
                        "product_image_id": 5,
                        "product_image": "https://imager-next.freetls.fastly.net/images/resized/480/0093c538-2c2e-4914-94c9-d023c3286389"
                    }
                ]
            },
            {
                "product_id": 12,
                "product_name": "Dress Maxi Cantik 12",
                "product_path": "",
                "product_price": "200.000",
                "product_size": [],
                "product_image": "https://imager-next.freetls.fastly.net/images/resized/480/2128ef54-dbc1-428d-af55-c0ef139af178",
                "product_image_list": [
                    {
                        "product_image_id": 1,
                        "product_image": "https://imager-next.freetls.fastly.net/images/resized/480/2128ef54-dbc1-428d-af55-c0ef139af178"
                    },
                    {
                        "product_image_id": 2,
                        "product_image": "https://imager-next.freetls.fastly.net/images/resized/480/a76b985a-a3a3-4321-b212-284bce616fdd"
                    },
                    {
                        "product_image_id": 3,
                        "product_image": "https://imager-next.freetls.fastly.net/images/resized/480/d155534c-e619-4be4-b7b7-7447375a38a3"
                    },
                    {
                        "product_image_id": 4,
                        "product_image": "https://imager-next.freetls.fastly.net/images/resized/480/d30dd206-70ab-4814-aa0c-68c1711ce749"
                    },
                    {
                        "product_image_id": 5,
                        "product_image": "https://imager-next.freetls.fastly.net/images/resized/480/0093c538-2c2e-4914-94c9-d023c3286389"
                    }
                ]
            }
        ]
    }
]