^C:\USERS\PMYLS\DESKTOP\ZORTIK\RAMP-UP 02\CALCULATOR\CMAKELISTS.TXT
C:\PROGRAM FILES\MICROSOFT VISUAL STUDIO\2022\COMMUNITY\COMMON7\IDE\COMMONEXTENSIONS\MICROSOFT\CMAKE\CMAKE\SHARE\CMAKE-3.27\MODULES\CMAKECINFORMATION.CMAKE
C:\PROGRAM FILES\MICROSOFT VISUAL STUDIO\2022\COMMUNITY\COMMON7\IDE\COMMONEXTENSIONS\MICROSOFT\CMAKE\CMAKE\SHARE\CMAKE-3.27\MODULES\CMAKECXXINFORMATION.CMAKE
C:\PROGRAM FILES\MICROSOFT VISUAL STUDIO\2022\COMMUNITY\COMMON7\IDE\COMMONEXTENSIONS\MICROSOFT\CMAKE\CMAKE\SHARE\CMAKE-3.27\MODULES\CMAKECOMMONLANGUAGEINCLUDE.CMAKE
C:\PROGRAM FILES\MICROSOFT VISUAL STUDIO\2022\COMMUNITY\COMMON7\IDE\COMMONEXTENSIONS\MICROSOFT\CMAKE\CMAKE\SHARE\CMAKE-3.27\MODULES\CMAKEGENERICSYSTEM.CMAKE
C:\PROGRAM FILES\MICROSOFT VISUAL STUDIO\2022\COMMUNITY\COMMON7\IDE\COMMONEXTENSIONS\MICROSOFT\CMAKE\CMAKE\SHARE\CMAKE-3.27\MODULES\CMAKEINITIALIZECONFIGS.CMAKE
C:\PROGRAM FILES\MICROSOFT VISUAL STUDIO\2022\COMMUNITY\COMMON7\IDE\COMMONEXTENSIONS\MICROSOFT\CMAKE\CMAKE\SHARE\CMAKE-3.27\MODULES\CMAKELANGUAGEINFORMATION.CMAKE
C:\PROGRAM FILES\MICROSOFT VISUAL STUDIO\2022\COMMUNITY\COMMON7\IDE\COMMONEXTENSIONS\MICROSOFT\CMAKE\CMAKE\SHARE\CMAKE-3.27\MODULES\CMAKERCINFORMATION.CMAKE
C:\PROGRAM FILES\MICROSOFT VISUAL STUDIO\2022\COMMUNITY\COMMON7\IDE\COMMONEXTENSIONS\MICROSOFT\CMAKE\CMAKE\SHARE\CMAKE-3.27\MODULES\CMAKESYSTEMSPECIFICINFORMATION.CMAKE
C:\PROGRAM FILES\MICROSOFT VISUAL STUDIO\2022\COMMUNITY\COMMON7\IDE\COMMONEXTENSIONS\MICROSOFT\CMAKE\CMAKE\SHARE\CMAKE-3.27\MODULES\CMAKESYSTEMSPECIFICINITIALIZE.CMAKE
C:\PROGRAM FILES\MICROSOFT VISUAL STUDIO\2022\COMMUNITY\COMMON7\IDE\COMMONEXTENSIONS\MICROSOFT\CMAKE\CMAKE\SHARE\CMAKE-3.27\MODULES\COMPILER\CMAKECOMMONCOMPILERMACROS.CMAKE
C:\PROGRAM FILES\MICROSOFT VISUAL STUDIO\2022\COMMUNITY\COMMON7\IDE\COMMONEXTENSIONS\MICROSOFT\CMAKE\CMAKE\SHARE\CMAKE-3.27\MODULES\COMPILER\MSVC-C.CMAKE
C:\PROGRAM FILES\MICROSOFT VISUAL STUDIO\2022\COMMUNITY\COMMON7\IDE\COMMONEXTENSIONS\MICROSOFT\CMAKE\CMAKE\SHARE\CMAKE-3.27\MODULES\COMPILER\MSVC-CXX.CMAKE
C:\PROGRAM FILES\MICROSOFT VISUAL STUDIO\2022\COMMUNITY\COMMON7\IDE\COMMONEXTENSIONS\MICROSOFT\CMAKE\CMAKE\SHARE\CMAKE-3.27\MODULES\COMPILER\MSVC.CMAKE
C:\PROGRAM FILES\MICROSOFT VISUAL STUDIO\2022\COMMUNITY\COMMON7\IDE\COMMONEXTENSIONS\MICROSOFT\CMAKE\CMAKE\SHARE\CMAKE-3.27\MODULES\PLATFORM\WINDOWS-INITIALIZE.CMAKE
C:\PROGRAM FILES\MICROSOFT VISUAL STUDIO\2022\COMMUNITY\COMMON7\IDE\COMMONEXTENSIONS\MICROSOFT\CMAKE\CMAKE\SHARE\CMAKE-3.27\MODULES\PLATFORM\WINDOWS-MSVC-C.CMAKE
C:\PROGRAM FILES\MICROSOFT VISUAL STUDIO\2022\COMMUNITY\COMMON7\IDE\COMMONEXTENSIONS\MICROSOFT\CMAKE\CMAKE\SHARE\CMAKE-3.27\MODULES\PLATFORM\WINDOWS-MSVC-CXX.CMAKE
C:\PROGRAM FILES\MICROSOFT VISUAL STUDIO\2022\COMMUNITY\COMMON7\IDE\COMMONEXTENSIONS\MICROSOFT\CMAKE\CMAKE\SHARE\CMAKE-3.27\MODULES\PLATFORM\WINDOWS-MSVC.CMAKE
C:\PROGRAM FILES\MICROSOFT VISUAL STUDIO\2022\COMMUNITY\COMMON7\IDE\COMMONEXTENSIONS\MICROSOFT\CMAKE\CMAKE\SHARE\CMAKE-3.27\MODULES\PLATFORM\WINDOWS.CMAKE
C:\PROGRAM FILES\MICROSOFT VISUAL STUDIO\2022\COMMUNITY\COMMON7\IDE\COMMONEXTENSIONS\MICROSOFT\CMAKE\CMAKE\SHARE\CMAKE-3.27\MODULES\PLATFORM\WINDOWSPATHS.CMAKE
C:\USERS\PMYLS\DESKTOP\ZORTIK\RAMP-UP 02\CALCULATOR\BUILD\CMAKEFILES\3.27.2-MSVC1\CMAKECCOMPILER.CMAKE
C:\USERS\PMYLS\DESKTOP\ZORTIK\RAMP-UP 02\CALCULATOR\BUILD\CMAKEFILES\3.27.2-MSVC1\CMAKECXXCOMPILER.CMAKE
C:\USERS\PMYLS\DESKTOP\ZORTIK\RAMP-UP 02\CALCULATOR\BUILD\CMAKEFILES\3.27.2-MSVC1\CMAKERCCOMPILER.CMAKE
C:\USERS\PMYLS\DESKTOP\ZORTIK\RAMP-UP 02\CALCULATOR\BUILD\CMAKEFILES\3.27.2-MSVC1\CMAKESYSTEM.CMAKE
