{
 "compilerOptions": {
  "baseUrl": ".",
  "paths": {
   "*": [
    "../../../../../.cache/hugo_cache/modules/filecache/modules/pkg/mod/github.com/wowchemy/wowchemy-hugo-themes/modules/wowchemy/v5@v5.8.1-0.20230812165002-59b648791d3f/assets/*"
   ]
  }
 }
}