0	106	0.189655	52
1	41	0.0357143	178
2	64	0.0989011	52
3	27	0.25	76
4	123	0.117647	52
5	163	0.048048	150
6	167	0.0382353	150
7	133	0.0364742	150
8	135	0.0306748	150
9	1	1	-9
10	275	0.134752	73
11	282	0.16	73
12	274	0.116822	73
13	1	1	-9
14	1	1	-9
15	279	0.130435	83
16	42	0.707692	108
17	10	0.0481928	-9
18	282	0.0522088	73
19	272	0.113636	73
20	257	0.0606061	8
21	2	1	0
22	31	0.584906	108
23	266	0.0754717	73
24	231	0.05	73
25	45	1	1
26	15	0.414634	13
27	278	0.130045	73
28	9	1	2
29	5	1	3
30	276	0.15	10
31	34	0.181818	108
32	9	1	4
33	270	0.205298	10
34	37	0.27451	108
35	274	0.079096	10
36	283	0.151751	73
37	279	0.165289	73
38	279	0.0987654	83
39	9	0.292135	-9
40	280	0.164251	83
41	255	0.0333333	73
42	15	0.6	17
43	502	0.0857143	142
44	275	0.112583	73
45	138	0.168421	52
46	268	0.044586	8
47	78	0.225	52
48	95	0.339286	52
49	3	0.764706	3
50	257	0.0588235	83
51	114	0.0760234	106
52	78	0	135
53	7	1	5
54	115	0.111111	106
55	78	0.0322581	135
56	115	0.0617284	106
57	7	1	6
58	115	0.0490798	106
59	78	0.0689655	135
60	268	0.0506329	73
61	269	0.0494505	73
62	273	0.139073	83
63	274	0.113636	73
64	33	0.271605	151
65	101	0.245283	52
66	95	0.255319	52
67	33	0.478261	76
68	124	0.178571	77
69	125	0.326087	77
70	100	0.0813008	52
71	279	0.111888	83
72	35	0.142857	108
73	51	0.0777778	64
74	71	0.139706	64
75	29	0.283333	-9
76	51	0.0948276	64
77	76	0.135593	64
78	16	0.242424	51
79	63	0.0894309	64
80	50	0.10989	64
81	71	0.139535	64
82	69	0.162162	64
83	17	0.37037	51
84	28	0.111111	151
85	124	0.119565	52
86	41	0.0232558	99
87	60	0.0777778	52
88	74	0.0265487	52
89	41	0.0392157	99
90	45	1	7
91	102	0.146341	77
92	57	0.311828	83
93	278	0.168459	83
94	280	0.105263	73
95	537	0.0184049	142
96	522	0.0316456	142
97	535	0.0348469	142
98	529	0.0237838	142
99	529	0.0340136	142
100	515	0.0334572	142
101	529	0.0327869	142
102	530	0.0370763	142
103	530	0.0371945	142
104	530	0.0336842	142
105	533	0.0297619	142
106	529	0.0413493	142
107	529	0.0333704	142
108	519	0.0397196	142
109	524	0.0383275	142
110	523	0.0421546	142
111	530	0.0143443	142
112	527	0.0387685	142
113	526	0.0341786	142
114	527	0.0180587	142
115	525	0.0395738	142
116	22	0.223684	-9
117	71	0.284091	142
118	66	0.107955	142
119	514	0.0629371	142
120	539	0.0321337	142
121	525	0.0358515	142
122	524	0.0188679	142
123	530	0.0258264	142
124	527	0.0870647	142
125	504	0.0313725	142
126	526	0.0263459	142
127	531	0.00900901	142
128	521	0.0362812	142
129	529	0.035753	142
130	532	0.0387513	142
131	528	0.0447598	142
132	528	0.0401691	142
133	527	0.028481	142
134	529	0.0327696	142
135	521	0.0503282	142
136	519	0.0353201	142
137	530	0.0371945	142
138	530	0.0458811	142
139	530	0.0289256	142
140	110	0.174312	52
141	288	1	8
142	287	0.207746	73
143	100	0.218182	52
144	172	0.109333	150
145	286	0.188272	73
146	285	0.149502	73
147	98	0.21875	52
148	45	1	9
149	29	0.565217	76
150	26	0.890909	-9
151	279	0.0909091	83
152	44	0.137255	9
153	25	0.290909	-9
154	27	0.52	76
155	66	0.428571	52
156	23	0.407407	-9
157	107	0.156522	77
158	44	0.0909091	9
159	101	0.119266	77
160	279	0.171171	73
161	36	0.428571	108
162	275	0.14094	83
163	288	1	10
164	268	0.101796	73
165	280	0.0598291	73
166	276	0.155689	10
167	198	0.0344828	83
168	252	0.09375	83
169	259	0.0437956	8
170	4	1	11
171	4	0.206897	175
172	117	0.264706	73
173	108	0.286822	77
174	44	0.242424	9
175	268	0.146893	73
176	216	0.171429	8
177	25	0.3125	1
178	273	0.134752	10
179	4	0.529412	175
180	262	0.130435	83
181	159	0.0645161	73
182	198	0.142857	83
183	152	0	73
184	9	1	12
185	216	0	10
186	9	0.333333	-9
187	277	0.111765	10
188	528	0.0335498	142
189	527	0.0281385	142
190	282	0.204	73
191	38	0.431579	1
192	261	0.16	8
193	16	1	13
194	34	0.27907	108
195	277	0.125	83
196	276	0.142857	10
197	34	0.15625	1
198	277	0.137255	73
199	278	0.187166	10
200	269	0.125	83
201	275	0.142857	10
202	536	0.0195072	142
203	1	1	-9
204	533	0.0337079	142
205	267	0.165138	83
206	37	0.268657	1
207	270	0.0702703	73
208	140	0.0606061	73
209	33	0.438202	1
210	14	0.481481	17
211	277	0.118721	73
212	1	1	-9
213	255	0.157895	83
214	30	0.583333	108
215	11	0.402439	-9
216	23	0.4375	108
217	237	0.222222	83
218	97	0.24359	77
219	198	0.0289855	73
220	15	0.3875	17
221	255	0.0610687	73
222	15	0.484848	17
223	266	0.219298	83
224	44	0.653846	1
225	78	0.277778	52
226	274	0.120879	73
227	139	0.030303	73
228	234	0.0172414	73
229	15	0.647059	17
230	47	0.211864	148
231	266	0.233333	83
232	2	1	14
233	1	1	-9
234	25	0.427273	-9
235	103	0.174312	77
236	103	0.0325203	52
237	1	1	-9
238	106	0.100917	77
239	269	0.126582	73
240	35	0.176471	1
241	276	0.159509	73
242	99	0.0894309	77
243	100	0.116667	52
244	257	0.0434783	73
245	1	1	-9
246	104	0.142857	52
247	1	1	-9
248	99	0.15942	52
249	28	0.5	76
250	273	0.198675	73
251	278	0.141176	10
252	278	0.158879	73
253	1	1	-9
254	277	0.143498	73
255	90	0.269841	52
256	100	0.173913	52
257	24	0.35	76
258	277	0.145228	73
259	131	0.12963	52
260	125	0.205357	52
261	1	1	-9
262	89	0.245902	52
263	1	1	-9
264	29	0.488889	76
265	24	0.22807	-9
266	96	0.283333	52
267	45	1	15
268	24	0.227273	-9
269	18	0.447368	-9
270	131	0.254386	52
271	33	0.24	76
272	83	0.212766	52
273	1	0.941176	-9
274	19	0.362832	-9
275	12	0.5	76
276	15	0.333333	76
277	45	1	16
278	98	0.311111	52
279	95	0.115789	77
280	5	0.0952381	-9
281	26	0.0933333	7
282	103	0.137615	77
283	262	0.137931	73
284	279	0.185455	73
285	16	1	17
286	102	0.0787402	52
287	23	0.6	-9
288	36	0.619048	178
289	285	0.193333	73
290	286	0.190141	83
291	275	0.14557	83
292	30	0.366667	1
293	9	1	18
294	255	0.217391	83
295	39	0.240506	1
296	209	0.586777	83
297	18	0.294118	108
298	283	0.215139	83
299	102	0.100917	52
300	266	0.0382166	73
301	278	0.13245	83
302	276	0.167702	83
303	543	0.0701581	142
304	539	0.0635246	142
305	67	0.0698644	46
306	26	0.151644	-9
307	526	0.025731	142
308	537	0.0225269	142
309	170	0.0328767	150
310	2	0	56
311	4	0.571429	69
312	1	1	-9
313	1	0.941176	-9
314	1	1	-9
315	20	0.99115	-9
316	5	0.714286	-9
317	7	0.157895	37
318	527	0.0252747	142
319	5	0.285714	-9
320	3	1	19
321	107	0.136612	130
322	33	1	20
323	115	0.0748663	106
324	79	1	21
325	533	0.0208768	142
326	46	0.684315	176
327	1	1	-9
328	541	0.022541	142
329	16	0.0985915	106
330	7	1	22
331	64	0.206897	95
332	256	0.0612245	73
333	20	0.16129	160
334	86	0.132812	58
335	29	0.197368	151
336	6	1	23
337	8	1	24
338	64	0.172973	64
339	519	0.0241692	142
340	521	0.0395257	142
341	142	0.0680272	150
342	51	0.133333	64
343	31	0.037037	-9
344	11	0.0727273	-9
345	14	1	25
346	1	1	-9
347	2	0.826087	114
348	1	1	-9
349	3	0.958333	-9
350	277	0.0588235	10
351	11	0.255663	-9
352	1	0.944119	-9
353	1	0.986607	-9
354	2	1	26
355	1	1	-9
356	1	1	-9
357	2	1	27
358	1	0.980583	-9
359	505	0.0655067	142
360	255	0.116667	73
361	16	1	28
362	40	0.371795	1
363	270	0.175258	83
364	271	0.222892	73
365	9	1	29
366	42	0.227273	1
367	49	0.413333	52
368	23	0.328358	-9
369	101	0.100917	77
370	44	0.272727	15
371	280	0.118705	73
372	532	0.0351406	142
373	79	0.108333	64
374	110	0.259843	130
375	524	0.0405117	142
376	520	0.0186335	142
377	161	0.0550725	150
378	30	0.225	156
379	529	0.0375691	142
380	11	0.632075	-9
381	521	0.0289555	142
382	7	0.276596	-9
383	19	0.131579	-9
384	2	1	30
385	40	0.119565	-9
386	7	1	31
387	115	0.0969697	106
388	78	0	135
389	536	0.0187696	142
390	526	0.0357918	142
391	76	0.524823	64
392	88	0.241379	64
393	123	0.0333333	150
394	527	0.033526	142
395	70	0.153846	64
396	530	0.0176166	142
397	529	0.0351438	142
398	528	0.0383772	142
399	532	0.0275634	142
400	2	1	32
401	85	0	142
402	131	0.0308642	150
403	84	0.16129	150
404	23	0.217166	-9
405	5	0.416107	22
406	529	0.0363636	142
407	64	0.0714286	130
408	102	0.142857	130
409	7	0.842105	-9
410	2	0.166667	55
411	3	1	33
412	3	0.666667	-9
413	2	0	56
414	2	1	34
415	3	1	35
416	1	1	-9
417	1	1	-9
418	527	0.0258137	142
419	500	0.03125	142
420	504	0.00942285	142
421	203	0.0454545	-9
422	112	0	-9
423	473	0.117647	142
424	24	0.18018	46
425	48	0.147368	-9
426	19	0	-9
427	532	0.042328	142
428	8	0.858696	-9
429	66	0.0903156	-9
430	48	0.0643275	-9
431	1	1	-9
432	1	1	-9
433	1	1	-9
434	1	1	-9
435	1	1	-9
436	1	1	-9
437	1	1	-9
438	1	1	-9
439	5	0.1	37
440	2	0	-9
441	1	1	-9
442	3	0	37
443	3	0	37
444	2	0	167
445	5	0.333333	37
446	4	0	37
447	2	0	19
448	1	1	-9
449	1	1	-9
450	1	1	-9
451	1	1	-9
452	2	0	167
453	2	0	-9
454	1	1	-9
455	2	0	19
456	529	0.0485116	142
457	1	1	-9
458	38	0.41791	130
459	1	1	-9
460	2	1	36
461	77	0.0691548	142
462	170	0.486486	150
463	18	0.15894	171
464	13	0.0294118	171
465	19	0.111111	20
466	15	0.319149	171
467	16	0.125	20
468	529	0.0424242	142
469	530	0.0323232	142
470	10	1	37
471	74	0.153226	64
472	58	0.201835	64
473	530	0.0311804	142
474	3	0.711111	-9
475	5	1	38
476	525	0.0240437	142
477	31	0.261097	46
478	535	0.0193089	142
479	2	0.282609	-9
480	1	1	-9
481	526	0.0329437	142
482	2	1	39
483	6	0.576923	-9
484	122	0.0266667	150
485	163	0.14346	150
486	143	0.0429448	150
487	2	0.0952381	41
488	1	1	-9
489	126	0.0134228	150
490	2	0.888889	41
491	2	1	40
492	1	1	-9
493	529	0.0365854	142
494	3	1	41
495	2	1	42
496	127	0.0522876	150
497	525	0.0188261	142
498	540	0.0223301	142
499	172	0.0889488	150
500	41	0.161538	64
501	7	0.645161	-9
502	22	1	43
503	6	1	44
504	66	0.125	95
505	263	0.0869565	83
506	86	0.333333	58
507	11	0.404762	-9
508	8	0.345455	25
509	1	1	-9
510	66	0.0506329	95
511	87	0.193548	58
512	105	0.0526316	150
513	76	0.48	-9
514	536	0.00999001	142
515	73	0.60989	64
516	62	0	-9
517	24	0.178082	-9
518	21	0.137931	-9
519	42	0.230769	-9
520	1	1	-9
521	7	0.666667	-9
522	534	0.0202634	142
523	19	0.191257	-9
524	1	1	-9
525	4	0.678363	-9
526	1	1	-9
527	527	0.0217155	142
528	1	1	-9
529	17	0.186047	-9
530	5	0.428571	-9
531	2	1	45
532	124	0.0316456	150
533	513	0.0383693	142
534	68	0.174334	46
535	1	1	-9
536	1	1	-9
537	1	1	-9
538	1	1	-9
539	30	0.19898	-9
540	1	1	-9
541	1	1	-9
542	526	0.0133333	142
543	58	0.115741	46
544	20	0.12766	-9
545	63	0.128205	95
546	1	1	-9
547	85	0.230769	58
548	54	0.160494	64
549	44	0.253614	176
550	6	0.872261	-9
551	83	1	46
552	130	0.021148	150
553	1	1	-9
554	1	1	-9
555	73	0.149701	64
556	71	0.106557	64
557	53	0.185484	64
558	8	1	47
559	35	0.259259	-9
560	528	0.0185996	142
561	15	1	48
562	18	0.555556	51
563	69	0.136986	64
564	198	0.0784314	-9
565	522	0.039196	142
566	45	0.61297	176
567	6	0.839955	-9
568	87	0.0350877	52
569	530	0.0350109	142
570	30	0.342105	151
571	21	0.25	156
572	5	0.333333	-9
573	14	0.166667	151
574	87	0.192771	52
575	11	0.261006	-9
576	530	0.0188261	142
577	163	0.113281	150
578	38	0.163934	-9
579	532	0.0262881	142
580	115	0.068323	106
581	535	0.0193483	142
582	526	0.0286976	142
583	90	0.327586	64
584	84	0.125	150
585	116	0.0190476	150
586	91	0	107
587	71	0.0714286	150
588	159	0.0439883	150
589	1	1	-9
590	533	0.0242105	142
591	540	0.027027	142
592	159	0.0607477	150
593	118	0.0689655	106
594	527	0.0279642	142
595	102	0.406504	77
596	58	0.236842	95
597	84	0.291667	58
598	116	0.103093	106
599	128	0.0608108	150
600	124	0.0408163	150
601	117	0.0650888	106
602	96	0.0714286	150
603	99	0.0555556	150
604	31	0.24	-9
605	43	0.559575	176
606	51	0.0795455	64
607	525	0.0300334	142
608	89	0.0842266	-9
609	536	0.0194076	142
610	65	0.0666667	95
611	20	0.0967742	60
612	270	0.171875	83
613	80	0.403361	58
614	66	0.206897	95
615	21	0.0588235	66
616	264	0.115385	73
617	82	0.422535	58
618	529	0.0356394	142
619	18	0.22449	51
620	6	1	49
621	54	0.125	95
622	11	0.333333	-9
623	525	0.0227531	142
624	11	0.136842	-9
625	5	0.285714	-9
626	271	0.272727	73
627	159	0.101382	150
628	53	0.113636	-9
629	153	0.0872093	150
630	166	0.0517241	150
631	16	0.159763	106
632	528	0.0280172	142
633	525	0.0227531	142
634	124	0.0533333	150
635	122	0.028169	150
636	155	0.116402	150
637	127	0.0544218	150
638	134	0.0289389	150
639	529	0.0323929	142
640	526	0.0262258	142
641	535	0.0280083	142
642	7	1	50
643	116	0.0787879	106
644	78	0.0333333	135
645	1	1	-9
646	1	1	-9
647	1	1	-9
648	1	1	-9
649	1	1	-9
650	58	0.162162	64
651	54	0.0989011	-9
652	19	1	51
653	30	0.405498	171
654	14	0.284644	48
655	29	0.210526	-9
656	10	0.630435	-9
657	532	0.0406091	142
658	143	1	52
659	520	0.0221932	142
660	530	0.0174482	142
661	533	0.0143296	142
662	130	0.0443038	150
663	536	0.00968992	142
664	528	0.0373932	142
665	535	0.0121212	142
666	58	0.301205	95
667	84	0.28022	58
668	30	0.365979	-9
669	12	0.0776699	-9
670	10	0	-9
671	1	1	-9
672	6	0	-9
673	15	0.222222	-9
674	5	0.5	-9
675	10	0.333333	-9
676	6	0	-9
677	1	0.923077	-9
678	5	0	-9
679	1	1	-9
680	530	0.0253968	142
681	7	0.675	-9
682	67	0.133333	95
683	19	0.08	160
684	87	0.297297	58
685	264	0.174603	83
686	6	1	53
687	123	0.04	150
688	533	0.0237389	142
689	1	1	-9
690	2	1	54
691	1	1	-9
692	16	0.12426	106
693	4	0.571429	-9
694	7	0.630952	-9
695	4	0.653846	-9
696	64	0.115044	64
697	535	0.0329218	142
698	4	0.347826	-9
699	1	1	-9
700	5	0.5	25
701	2	0.5	-9
702	1	1	-9
703	3	1	55
704	3	0.5	33
705	1	1	-9
706	3	1	56
707	2	1	57
708	4	0.222222	69
709	2	0	-9
710	3	0.166667	25
711	1	1	-9
712	2	0	-9
713	2	0	35
714	2	0.25	35
715	1	1	-9
716	2	0	-9
717	5	0.275862	138
718	3	0.766667	112
719	6	0.833333	112
720	62	0.135802	95
721	19	0.133333	160
722	89	1	58
723	126	0.0422961	150
724	18	0.428571	-9
725	528	0.030426	142
726	34	0.102804	156
727	90	0.31746	64
728	133	0.03003	150
729	11	0.283019	-9
730	29	0.511111	-9
731	13	0.131579	20
732	19	0.183544	171
733	13	0.0909091	171
734	11	0	171
735	13	0.0344828	20
736	10	0.0769231	20
737	2	0	-9
738	7	0	20
739	10	0.333333	20
740	4	0	20
741	8	0	20
742	2	0	-9
743	3	0.666667	-9
744	3	0	-9
745	1	1	-9
746	1	1	-9
747	1	1	-9
748	1	1	-9
749	84	0.114035	52
750	159	0.116751	150
751	531	0.0263435	142
752	276	0.101796	10
753	70	0.0931478	46
754	526	0.037889	142
755	518	0.0291971	142
756	504	0.0164835	142
757	73	0.161905	64
758	529	0.0186335	142
759	529	0.0402062	142
760	8	0.512821	90
761	21	0.0120482	-9
762	83	0.122807	52
763	42	0.0625	99
764	83	0.226667	58
765	535	0.0357555	142
766	4	0.72973	90
767	5	1	59
768	526	0.0280374	142
769	118	0.132353	106
770	78	0.0222222	135
771	61	0.292683	95
772	51	0.12037	64
773	36	0.40678	-9
774	62	0.590164	-9
775	64	0.106667	95
776	22	1	60
777	255	0.102041	73
778	84	0.296296	58
779	13	0.0291262	-9
780	13	0.0542636	-9
781	537	0.0217865	142
782	132	0.0536913	150
783	76	0.0714286	64
784	34	0.269231	-9
785	50	0.06	64
786	8	1	61
787	48	0.0169051	-9
788	42	0.04	-9
789	33	0.0833333	-9
790	17	0.458333	-9
791	12	0	-9
792	57	0.147727	-9
793	8	0.15873	-9
794	34	0.652616	176
795	13	0.760488	100
796	122	1	62
797	108	0.19685	130
798	527	0.0228365	142
799	161	0.144578	150
800	6	0.338409	136
801	151	0.0505952	150
802	11	0.273585	-9
803	42	0.457627	-9
804	527	0.6	142
805	14	0.0330579	-9
806	2	1	63
807	534	0.0210632	142
808	92	1	64
809	530	0.0448792	142
810	53	0.130081	64
811	51	0.111111	64
812	52	0.172043	-9
813	107	0.146789	130
814	78	0.0472009	142
815	15	0.0895522	-9
816	8	0.615385	90
817	19	0.0206186	-9
818	536	0.0316384	142
819	6	1	65
820	64	0.243243	95
821	22	1	66
822	271	0.25	73
823	49	0.787879	58
824	50	0.0940171	64
825	62	0.1625	64
826	1	1	-9
827	5	0.126316	-9
828	3	0	-9
829	3	0	-9
830	7	0.104762	-9
831	3	0	-9
832	18	0	-9
833	20	0.25	-9
834	4	0	-9
835	4	0.5	-9
836	2	0	-9
837	5	0	-9
838	7	0.538462	-9
839	3	0.666667	-9
840	1	1	-9
841	1	1	-9
842	4	0	-9
843	14	0.5	-9
844	124	0.0506329	150
845	534	0.0171544	142
846	165	0.158301	150
847	164	0.0410557	150
848	87	0.166667	107
849	83	0.130208	58
850	6	1	67
851	64	0.149254	95
852	22	1	68
853	265	0.148148	73
854	86	0.22973	58
855	152	0.116279	150
856	50	0.0615385	64
857	49	0.334135	46
858	53	0.524064	46
859	63	0.189189	64
860	125	0.0123457	150
861	82	0.0714286	150
862	48	0	107
863	64	0	107
864	2	0.970588	169
865	9	0.5	51
866	73	0.130081	64
867	536	0.0298047	142
868	517	0.0161663	142
869	522	0.0234742	142
870	69	0.127869	46
871	30	0.27451	151
872	1	0.979167	-9
873	5	1	69
874	1	1	-9
875	51	0.133929	64
876	59	0.171271	-9
877	30	0.22	-9
878	7	0.218182	25
879	252	0.0243902	73
880	255	0	83
881	256	0	8
882	142	0.333333	8
883	531	0.0284153	142
884	1	0.972477	-9
885	509	0.0243902	142
886	60	0.158654	46
887	516	0.0295203	142
888	7	0.7	61
889	64	0.101124	64
890	174	0.110512	150
891	16	0.12426	106
892	526	0.0501636	142
893	539	0.0440123	142
894	536	0.036036	142
895	82	0.172414	64
896	43	0.551045	176
897	529	0.0217166	142
898	63	0.0732759	46
899	118	0.0432432	106
900	5	0.142857	-9
901	1	1	-9
902	1	0.932584	-9
903	36	0.527778	76
904	8	0.615385	90
905	9	0.16129	-9
906	21	0.0149254	-9
907	1	1	-9
908	3	0.31746	-9
909	4	0.116667	-9
910	1	1	-9
911	1	1	-9
912	1	1	-9
913	1	1	-9
914	1	1	-9
915	1	1	-9
916	2	0.871287	22
917	2	0.808824	22
918	1	1	-9
919	1	1	-9
920	1	1	-9
921	3	0	22
922	2	1	70
923	3	0.333333	22
924	1	1	-9
925	1	1	-9
926	1	1	-9
927	2	0	22
928	2	0	-9
929	1	1	-9
930	526	0.0301676	142
931	1	1	-9
932	130	0.16092	52
933	63	0.0240964	52
934	40	0.0333333	178
935	31	0.190476	76
936	5	0	-9
937	7	0.0892857	25
938	11	0.526316	25
939	512	0.0436548	-9
940	7	1	71
941	76	0.173228	137
942	2	1	72
943	76	0.350877	137
944	48	0	21
945	76	0	142
946	533	0.0252632	142
947	2	0.818182	-9
948	18	0.273256	-9
949	35	0.651163	99
950	113	0.586957	52
951	269	0.0318471	73
952	1	0.941176	-9
953	101	0.125	52
954	275	0.0378788	83
955	283	0.231373	73
956	1	1	-9
957	288	1	73
958	106	0.13913	77
959	62	0.2	52
960	2	1	74
961	275	0.161491	73
962	275	0.0909091	73
963	276	0.0962567	73
964	287	0.217252	8
965	135	0.233645	52
966	8	0.454545	76
967	98	0.153846	77
968	40	0.152174	84
969	27	0.111111	84
970	287	0.0811518	83
971	287	0.21118	73
972	1	1	-9
973	285	0.156463	83
974	2	1	75
975	108	0.230769	52
976	28	0.105263	84
977	255	0.0763359	73
978	278	0.130631	73
979	278	0.119171	83
980	43	0.363636	1
981	277	0.148	73
982	79	0.306452	52
983	282	0.187726	73
984	118	0.211111	77
985	60	0.103448	52
986	105	0.2	52
987	28	0.4	76
988	287	0.282282	73
989	40	0.0952381	7
990	103	0.146789	77
991	135	0.201754	52
992	20	0.307692	-9
993	38	1	76
994	98	0.265306	52
995	44	0.115385	84
996	19	0.194805	-9
997	5	0.4	119
998	26	0.564103	76
999	9	0.813953	-9
1000	143	1	77
1001	4	0.18	-9
1002	43	0.0704225	82
1003	100	0.122807	52
1004	21	0.147727	-9
1005	8	0.392857	-9
1006	216	0.0531915	8
1007	15	0.482759	17
1008	285	0.133094	73
1009	284	0.212687	73
1010	45	1	78
1011	103	0.217822	52
1012	17	0.0793651	-9
1013	34	0.521739	76
1014	109	0.291339	52
1015	22	0.404762	-9
1016	281	0.18705	73
1017	2	0.772727	-9
1018	277	0.0947368	83
1019	279	0.166667	73
1020	24	0.291667	108
1021	267	0.0625	73
1022	283	0.156	73
1023	1	1	-9
1024	1	1	-9
1025	277	0.11875	10
1026	275	0.192308	73
1027	235	0.163265	83
1028	1	1	-9
1029	278	0.158103	73
1030	10	0.272	-9
1031	31	0.285714	108
1032	34	0.26087	108
1033	274	0.187919	10
1034	286	0.232472	83
1035	280	0.055794	73
1036	279	0.141079	73
1037	281	0.130802	73
1038	1	1	-9
1039	240	0.230769	83
1040	31	0.25	108
1041	2	1	79
1042	185	0.222222	83
1043	22	0.25	1
1044	6	0.521739	-9
1045	35	0.694444	76
1046	263	0.0431655	8
1047	15	0.666667	13
1048	275	0.126582	73
1049	124	0.207547	52
1050	277	0.0987124	73
1051	276	0.152941	73
1052	269	0.0540541	73
1053	263	0.0609756	73
1054	102	0.117117	52
1055	30	0.590909	76
1056	43	0.318182	1
1057	256	0.142857	83
1058	1	1	-9
1059	1	1	-9
1060	279	0.155556	73
1061	229	0.307692	73
1062	278	0.125749	10
1063	12	0.6	-9
1064	5	0.181818	119
1065	3	1	80
1066	30	0.190476	1
1067	28	0.318182	1
1068	271	0.0822785	83
1069	34	0.435897	76
1070	19	0.433962	-9
1071	2	0.74359	-9
1072	1	1	-9
1073	287	0.220544	8
1074	286	0.218954	73
1075	266	0.0493827	73
1076	9	1	81
1077	263	0.252525	73
1078	39	0.318182	1
1079	531	0.0308839	142
1080	96	0.298246	52
1081	263	0.0893855	73
1082	1	1	-9
1083	1	1	-9
1084	279	0.141079	73
1085	267	0.24	73
1086	1	1	-9
1087	38	0.227273	1
1088	43	0.146341	-9
1089	266	0.047619	73
1090	122	0.16092	52
1091	281	0.176923	73
1092	110	0.238095	52
1093	24	0.454545	76
1094	277	0.156863	73
1095	131	0.27193	77
1096	8	0.857143	-9
1097	97	0.21875	52
1098	9	0.772727	-9
1099	279	0.118721	73
1100	243	0.042735	73
1101	15	0.509804	17
1102	81	0.2	52
1103	25	0.62963	-9
1104	101	0.327273	77
1105	1	1	-9
1106	101	0.0930233	77
1107	118	0.162162	52
1108	279	0.134694	73
1109	280	0.149573	73
1110	275	0.132075	83
1111	273	0.173913	73
1112	26	0.323529	108
1113	275	0.0988372	10
1114	1	1	-9
1115	1	1	-9
1116	45	1	82
1117	103	0.19802	77
1118	288	1	83
1119	45	1	84
1120	97	0.180556	52
1121	11	0.231707	-9
1122	274	0.10241	10
1123	1	1	-9
1124	1	1	-9
1125	1	1	-9
1126	278	0.122363	73
1127	9	1	85
1128	274	0.13245	73
1129	37	0.214286	108
1130	189	0.153846	73
1131	5	0.354167	17
1132	286	0.269231	73
1133	533	0.0244681	142
1134	121	0.28	83
1135	9	1	86
1136	273	0.0298507	83
1137	229	0.00980392	73
1138	4	0.190476	-9
1139	43	0.12	9
1140	105	0.0825688	77
1141	281	0.194444	83
1142	240	0.221154	73
1143	1	1	-9
1144	274	0.125	73
1145	277	0.111111	73
1146	275	0.13986	83
1147	2	1	87
1148	270	0.0609756	73
1149	282	0.115702	73
1150	276	0.14433	73
1151	64	0.325	52
1152	116	0.195402	52
1153	35	0.451613	76
1154	276	0.177966	83
1155	256	0.057377	8
1156	15	0.514286	17
1157	278	0.147541	73
1158	277	0.148148	73
1159	276	0.107784	10
1160	122	0.333333	83
1161	40	0.156627	1
1162	1	0.979592	-9
1163	11	0.27957	-9
1164	2	1	88
1165	277	0.182353	83
1166	115	0.25	52
1167	30	0.285714	76
1168	19	0.322581	-9
1169	3	1	89
1170	109	0.255556	77
1171	44	0.137255	15
1172	102	0.100917	52
1173	10	0.439655	-9
1174	107	0.283019	62
1175	31	0.210728	20
1176	9	1	90
1177	5	0.785714	-9
1178	21	0.950617	-9
1179	537	0.0416667	142
1180	19	0.0974026	-9
1181	23	0.258373	113
1182	16	0.473684	139
1183	20	0.405405	105
1184	14	0.06	-9
1185	21	0.214286	-9
1186	28	0.307692	76
1187	28	0.0441989	171
1188	15	0	20
1189	16	0.0232558	171
1190	4	0.792857	-9
1191	12	0.166667	-9
1192	10	0.357664	-9
1193	7	0.354167	-9
1194	6	1	91
1195	1	0.969231	-9
1196	5	1	92
1197	117	0.472637	62
1198	102	0.117188	130
1199	34	0.103371	-9
1200	10	1	93
1201	1	1	-9
1202	1	1	-9
1203	1	1	-9
1204	1	1	-9
1205	115	0.101695	106
1206	78	0.0606061	21
1207	115	0.0756757	106
1208	116	0.115385	106
1209	77	0.0909091	135
1210	91	0.245902	-9
1211	173	0.107735	150
1212	528	0.038674	142
1213	19	0.642857	-9
1214	17	0.370833	113
1215	119	0.240602	130
1216	76	0.213415	137
1217	1	1	-9
1218	1	1	-9
1219	1	1	-9
1220	121	0.305195	130
1221	56	0.64	52
1222	1	1	-9
1223	17	0.0753968	-9
1224	1	1	-9
1225	116	0.0784314	150
1226	3	0.785714	11
1227	108	0.15894	62
1228	499	0.024735	142
1229	7	1	94
1230	115	0.0802469	106
1231	78	0.0357143	135
1232	38	0.656794	176
1233	28	0.722969	100
1234	110	0.304054	130
1235	525	0.0308031	142
1236	528	0.0321543	142
1237	117	0.0547945	106
1238	110	0.227273	106
1239	109	0	106
1240	78	0	135
1241	1	1	-9
1242	1	1	-9
1243	1	1	-9
1244	7	0.25	-9
1245	4	0	113
1246	3	0	113
1247	4	0	113
1248	4	0	113
1249	3	0	-9
1250	5	0	-9
1251	3	0	113
1252	3	0	113
1253	5	0	-9
1254	2	0	-9
1255	4	0	-9
1256	4	0	-9
1257	5	0	113
1258	4	0	-9
1259	166	0.08	150
1260	536	0.0387029	142
1261	105	0.280303	130
1262	25	0.628339	100
1263	117	0.267606	130
1264	538	0.0332997	142
1265	115	0.0898876	106
1266	77	0.125	135
1267	527	0.0296053	142
1268	113	0.197368	130
1269	114	0.212766	130
1270	115	0.0631579	106
1271	119	0.0789474	106
1272	538	0.0156098	142
1273	538	0.0208333	142
1274	115	0.0930233	106
1275	119	0.0701754	106
1276	540	0.0519618	142
1277	130	0.238938	52
1278	86	0.275862	64
1279	50	0.0860215	64
1280	69	0.227273	64
1281	162	0.0557103	150
1282	116	0.375622	62
1283	536	0.0205681	142
1284	1	1	-9
1285	114	0.207143	130
1286	2	0.894737	-9
1287	97	0.349315	62
1288	54	0.229885	-9
1289	10	0.230769	-9
1290	74	0.259615	62
1291	75	0.321739	62
1292	532	0.041206	142
1293	197	0.0645161	-9
1294	108	0.0651466	150
1295	118	0.078125	106
1296	541	0.0319149	142
1297	101	0.300448	62
1298	106	0.282051	130
1299	536	0.0145985	142
1300	23	0.45614	-9
1301	60	0.060241	52
1302	536	0.0220662	142
1303	60	0.27027	46
1304	41	0.653061	62
1305	3	0	-9
1306	1	1	-9
1307	1	1	-9
1308	4	0.5	-9
1309	2	0	-9
1310	1	1	-9
1311	1	1	-9
1312	114	0	142
1313	20	0	-9
1314	242	0	142
1315	280	0	142
1316	244	0	142
1317	102	0	142
1318	253	0	142
1319	126	0	142
1320	13	0	142
1321	5	0.444444	-9
1322	210	0.0988142	-9
1323	68	1	95
1324	155	0.12605	150
1325	65	0.234234	95
1326	241	0.128205	73
1327	87	0.433071	58
1328	4	0.307143	-9
1329	537	0.0153218	142
1330	115	0.4	130
1331	527	0.0482315	142
1332	79	0.0884956	52
1333	31	0.121622	-9
1334	14	0	-9
1335	109	0.378738	62
1336	15	0.139785	-9
1337	524	0.0338624	142
1338	533	0.0300752	142
1339	64	0.131929	46
1340	33	0.0505618	-9
1341	162	0.181435	150
1342	118	0.0696517	106
1343	77	0.030303	135
1344	13	0.290909	113
1345	11	0.0720721	113
1346	11	0.0655738	113
1347	8	0.0833333	113
1348	6	0	-9
1349	1	1	-9
1350	1	1	-9
1351	1	1	-9
1352	1	1	-9
1353	5	1	96
1354	539	0.0185547	142
1355	64	0.112069	95
1356	12	0.5	103
1357	257	0.150943	73
1358	87	0.330709	58
1359	85	0.522727	62
1360	539	0.0166178	142
1361	134	0.0273556	150
1362	128	0.0324484	150
1363	4	0.5	-9
1364	535	0.0255591	142
1365	109	0.310811	130
1366	91	0.40404	130
1367	66	0.396226	130
1368	118	0.0291262	106
1369	36	0.0454545	106
1370	77	0.0238095	135
1371	104	0.481481	52
1372	124	0	142
1373	120	0.163043	106
1374	536	0.0205761	142
1375	165	0.0736544	150
1376	76	0.0588235	150
1377	93	0.166667	150
1378	62	0.134921	64
1379	34	0.717949	-9
1380	93	0.304813	62
1381	1	1	-9
1382	115	0.272727	130
1383	532	0.022335	142
1384	122	0.0533333	150
1385	533	0.018981	142
1386	541	0.0166667	142
1387	95	0.315789	62
1388	26	0.716405	100
1389	113	0.341463	130
1390	93	0.516556	62
1391	87	0.243446	62
1392	5	1	97
1393	30	0.202381	-9
1394	116	0.0584795	106
1395	78	0	135
1396	532	0.0323929	142
1397	160	0.163866	150
1398	113	0.0869565	106
1399	117	0.056338	106
1400	77	0.0227273	135
1401	79	0.0450549	142
1402	116	0.0698925	106
1403	78	0.0697674	135
1404	30	0.822035	100
1405	526	0.0405862	142
1406	51	0.0555556	64
1407	114	0.0967742	106
1408	77	0.103448	135
1409	145	0.0368098	107
1410	116	0.0786517	106
1411	77	0.193548	21
1412	105	0.12	130
1413	102	0.375	130
1414	534	0.0253432	142
1415	118	0.092233	106
1416	78	0	124
1417	163	0.0433526	150
1418	78	0.166667	137
1419	153	0.0455927	150
1420	116	0.300459	62
1421	535	0.0320171	142
1422	4	0.492958	102
1423	107	0.247557	62
1424	19	0.571429	-9
1425	115	0.0731707	106
1426	49	0.104762	-9
1427	66	0.0932203	95
1428	239	0.0681818	83
1429	87	0.328767	58
1430	116	0.246479	130
1431	27	0.126168	-9
1432	501	0.0282686	142
1433	133	0.141509	142
1434	531	0.0323974	142
1435	145	0.111111	150
1436	138	0.0526316	150
1437	526	0.0495156	142
1438	72	0.487179	62
1439	92	0.2103	62
1440	526	0.0620321	142
1441	121	0.0290698	130
1442	67	0.0834225	-9
1443	80	0.36075	46
1444	116	0.0726257	106
1445	78	0.0243902	135
1446	122	0.419162	130
1447	137	0.0241546	150
1448	9	0.708995	-9
1449	538	0.0145833	142
1450	11	0.65903	-9
1451	73	0.123288	64
1452	78	0.194093	137
1453	131	0.0498534	150
1454	17	0.55	-9
1455	100	0.0651466	150
1456	78	0.285714	145
1457	527	0.02897	142
1458	527	0.0674847	-9
1459	110	0.291667	130
1460	533	0.0288154	142
1461	70	0.178082	64
1462	1	1	-9
1463	120	0.245509	130
1464	527	0.045354	142
1465	2	1	98
1466	74	0.221328	46
1467	101	0.306122	130
1468	119	0.155844	130
1469	128	0.0277778	150
1470	116	0.12973	106
1471	78	0.0571429	135
1472	35	0.114155	-9
1473	123	0.0625	150
1474	532	0.0356768	142
1475	80	0.409586	-9
1476	108	0.246914	130
1477	16	0.114504	95
1478	87	0.554745	58
1479	45	1	99
1480	68	0.1	52
1481	21	0.684211	-9
1482	1	1	-9
1483	10	0.205128	-9
1484	2	0.454545	-9
1485	17	0.0588235	139
1486	534	0.015984	142
1487	78	0.0539326	142
1488	116	0.393939	130
1489	17	0.146154	-9
1490	10	0.217391	-9
1491	9	0.541667	-9
1492	3	0.434783	91
1493	138	0.0479042	150
1494	118	0.318584	130
1495	9	0.402174	-9
1496	3	0.22293	-9
1497	47	1	100
1498	536	0.0221932	142
1499	25	0.443925	-9
1500	37	0.365385	-9
1501	4	0.65	-9
1502	18	0.301802	-9
1503	1	1	-9
1504	1	1	-9
1505	1	1	-9
1506	1	1	-9
1507	1	1	-9
1508	1	1	-9
1509	1	1	-9
1510	1	1	-9
1511	1	1	-9
1512	1	1	-9
1513	1	1	-9
1514	1	1	-9
1515	1	1	-9
1516	1	1	-9
1517	1	1	-9
1518	1	1	-9
1519	1	1	-9
1520	517	0.0727273	142
1521	74	0.0769231	142
1522	34	0.134409	46
1523	534	0.0253293	142
1524	70	0.108836	46
1525	109	0.0945946	130
1526	536	0.0335782	142
1527	528	0.0255864	142
1528	508	0.0396825	142
1529	534	0.0289017	142
1530	35	0.118182	-9
1531	526	0.039916	142
1532	5	0.241071	102
1533	111	0.310345	130
1534	35	0.282452	-9
1535	533	0.0842788	142
1536	530	0.0398323	142
1537	5	0.965517	-9
1538	6	0.725	-9
1539	1	1	-9
1540	538	0.0470016	142
1541	524	0.0469729	142
1542	531	0.0425532	142
1543	530	0.0269107	142
1544	100	0.450331	62
1545	12	0.0416667	-9
1546	16	0	-9
1547	512	0.0921986	142
1548	531	0.0467128	142
1549	1	0.928571	-9
1550	1	1	-9
1551	1	1	-9
1552	171	0.0918919	150
1553	547	0.334112	142
1554	537	0.0542231	142
1555	16	0.5	105
1556	535	0.013468	142
1557	8	0.508532	-9
1558	522	0.0242718	142
1559	536	0.0332661	142
1560	528	0.0358025	142
1561	486	0.0712366	-9
1562	532	0.0279441	142
1563	5	0.711443	-9
1564	62	0.166667	95
1565	85	0.269231	58
1566	260	0.0869565	10
1567	1	0.928571	-9
1568	5	0.238095	127
1569	1	1	-9
1570	144	0.0422961	150
1571	4	1	101
1572	7	1	102
1573	515	0.0321101	142
1574	1	1	-9
1575	1	1	-9
1576	44	0	-9
1577	2	0.666667	-9
1578	1	1	-9
1579	1	1	-9
1580	1	1	-9
1581	1	1	-9
1582	125	0.41129	130
1583	16	0.0847458	113
1584	18	0.214286	139
1585	106	0.151786	130
1586	96	0.213333	130
1587	61	0.189189	95
1588	22	1	103
1589	1	1	-9
1590	261	0.0784314	73
1591	86	0.254902	58
1592	156	0.138655	150
1593	8	0.0808081	-9
1594	86	0.268657	58
1595	16	0.281746	113
1596	109	0.1875	130
1597	91	0.230769	130
1598	85	0.136364	130
1599	147	0.0790514	-9
1600	62	0.09375	95
1601	266	0.119048	73
1602	84	0.307692	58
1603	527	0.0356768	142
1604	513	0.0276243	142
1605	27	0.771028	-9
1606	29	0.297297	-9
1607	31	0.445946	130
1608	121	0.352273	130
1609	119	0.0608696	106
1610	113	0.127907	106
1611	77	0.0588235	135
1612	539	0.0461384	142
1613	60	0.0401837	142
1614	52	0.12037	64
1615	70	0.278481	64
1616	16	0.99679	127
1617	10	0.359223	-9
1618	13	0.28	-9
1619	4	0	-9
1620	7	0.75	-9
1621	2	0	-9
1622	6	0	-9
1623	6	0	-9
1624	13	0	-9
1625	100	0.272727	130
1626	52	0.159091	64
1627	23	0.503531	176
1628	3	0.827219	-9
1629	3	0.899189	-9
1630	5	0.56822	-9
1631	46	0.676854	176
1632	21	0.420118	176
1633	35	0.802656	100
1634	5	0.863349	-9
1635	21	0.428571	64
1636	18	0.48	139
1637	527	0.0364964	142
1638	124	0.313514	106
1639	528	0.032294	142
1640	63	0.0449438	52
1641	125	0.0875	52
1642	64	0.118182	95
1643	73	0.623077	58
1644	1	1	-9
1645	61	0.189189	64
1646	15	0.234375	-9
1647	523	0.0232558	142
1648	529	0.0187166	142
1649	77	0.151515	142
1650	1	1	-9
1651	1	1	-9
1652	1	1	-9
1653	1	1	-9
1654	117	0.294118	130
1655	2	1	104
1656	1	1	-9
1657	77	0.302752	137
1658	65	0.0368217	46
1659	55	0.0494297	-9
1660	81	0.141892	142
1661	62	0.0840237	46
1662	534	0.0212993	142
1663	2	0.857143	-9
1664	1	1	-9
1665	114	0.125749	106
1666	54	0.0214844	-9
1667	87	0.158879	52
1668	61	0.152672	64
1669	12	0.717949	-9
1670	79	0.433071	62
1671	106	0.197861	62
1672	60	0.203125	95
1673	83	0.302752	58
1674	1	1	-9
1675	3	0.65625	-9
1676	527	0.0370752	142
1677	121	0.0495356	150
1678	11	0.25	-9
1679	18	0.179487	139
1680	72	0.0288066	46
1681	68	0.176761	46
1682	60	0.21875	95
1683	82	0.12037	58
1684	44	0.280702	64
1685	40	0.17	-9
1686	5	0.808511	91
1687	51	0	142
1688	11	0.128205	-9
1689	15	0.148936	-9
1690	9	0.826087	-9
1691	9	0.431373	-9
1692	6	0.672414	119
1693	96	0.212598	77
1694	49	0.0261569	-9
1695	43	0.0250482	-9
1696	53	0.336842	62
1697	10	0.46	-9
1698	80	0.376812	62
1699	66	0.16129	62
1700	64	0.195122	62
1701	18	0.285714	139
1702	119	0.0409091	106
1703	64	0.8125	-9
1704	540	0.0412169	142
1705	69	0.111111	46
1706	524	0.0644809	142
1707	62	0.313953	64
1708	16	0.0625	51
1709	33	0.444444	-9
1710	104	0.153846	52
1711	34	0.144928	130
1712	66	0.1	52
1713	41	0	99
1714	119	0.0657895	52
1715	28	0.307692	76
1716	11	0.388889	48
1717	84	0	142
1718	38	0.25	-9
1719	64	0.121359	46
1720	32	0.238462	130
1721	120	0.340278	130
1722	46	0.251908	-9
1723	27	0.316667	-9
1724	8	0.513228	-9
1725	79	0.197065	-9
1726	530	0.0351438	142
1727	534	0.0378788	142
1728	1	1	-9
1729	66	0.137931	62
1730	55	0.0434783	62
1731	5	0	62
1732	24	0.461538	62
1733	15	0.777778	62
1734	7	0.611111	-9
1735	34	0.247875	-9
1736	50	0.206897	130
1737	531	0.0208955	142
1738	98	0.0714286	52
1739	54	0.0428571	52
1740	40	0	178
1741	27	0.24	76
1742	26	0.571429	-9
1743	70	0.0972516	46
1744	21	1	105
1745	53	0.304878	52
1746	23	0.259259	-9
1747	43	0.163265	99
1748	1	1	-9
1749	1	1	-9
1750	7	0	-9
1751	13	0	-9
1752	2	0	-9
1753	8	0	-9
1754	33	0	62
1755	34	0	62
1756	9	0	-9
1757	6	0	62
1758	10	0	-9
1759	1	1	-9
1760	44	0	62
1761	15	0	-9
1762	1	1	-9
1763	1	1	-9
1764	2	0.894737	112
1765	10	0.290323	-9
1766	83	0.280992	58
1767	109	0.265403	62
1768	118	0.0366972	106
1769	110	0.430464	130
1770	134	0.042042	150
1771	158	0.107143	150
1772	525	0.030543	142
1773	526	0.0254507	142
1774	4	0.85	-9
1775	6	0.214286	-9
1776	109	0.170616	62
1777	51	0.12381	64
1778	52	0.314607	-9
1779	1	1	-9
1780	510	0.0228311	142
1781	10	0.0634038	-9
1782	7	0.327273	-9
1783	533	0.0227498	142
1784	111	0.030303	150
1785	11	0.238095	113
1786	114	0.0483871	106
1787	115	0.2	106
1788	78	0.0434783	135
1789	115	0.0879121	106
1790	26	0.121849	46
1791	29	0.13843	46
1792	74	0.155963	64
1793	57	0.12931	64
1794	30	0.395062	-9
1795	162	0.264228	150
1796	159	0.103004	150
1797	532	0.0488565	142
1798	4	0.55	149
1799	5	0.631579	149
1800	73	0.423077	62
1801	8	0.458824	-9
1802	68	0.114035	62
1803	116	0.0824176	150
1804	118	0.181347	106
1805	78	0.0714286	135
1806	25	0.140187	-9
1807	11	0	-9
1808	65	0.241935	95
1809	213	0.0882353	73
1810	88	0.379747	58
1811	162	0.232653	150
1812	72	0.191176	-9
1813	1	0.95	-9
1814	11	0.321101	48
1815	64	0.0625	95
1816	4	0.303797	-9
1817	1	1	-9
1818	1	1	-9
1819	1	1	-9
1820	107	0.237443	62
1821	527	0.04	142
1822	7	0.490741	-9
1823	15	0.00840336	-9
1824	92	0.0571429	150
1825	113	0.0264151	150
1826	2	0.843137	-9
1827	1	0.9	-9
1828	8	0.4	-9
1829	8	0.390909	-9
1830	50	0.158416	64
1831	59	0.166667	64
1832	70	0	142
1833	535	0.019833	142
1834	125	0.0559006	150
1835	1	1	-9
1836	116	0.0634921	106
1837	77	0	135
1838	76	0	135
1839	50	0.203704	130
1840	6	0.391892	-9
1841	3	0.646552	-9
1842	114	0.105882	52
1843	42	0.0612245	99
1844	31	0.571429	76
1845	526	0.0179775	142
1846	117	0.0904523	106
1847	77	0.0512821	135
1848	77	0.139357	-9
1849	529	0.0214823	142
1850	25	0.28972	-9
1851	50	0.0463054	-9
1852	63	0.128205	95
1853	242	0.1	10
1854	84	0.252632	58
1855	93	0.109091	130
1856	123	0.0680272	150
1857	1	1	-9
1858	43	0.108696	99
1859	137	0.0990099	52
1860	84	0.554545	62
1861	6	0.5875	-9
1862	80	0.0664414	142
1863	4	0.742857	-9
1864	3	0.568182	-9
1865	100	0.339535	62
1866	96	0.373134	62
1867	535	0.0181818	142
1868	9	0.325843	127
1869	112	0.333333	62
1870	55	0.107143	95
1871	21	0.418605	103
1872	87	0.417722	58
1873	239	0.0588235	73
1874	531	0.0193133	142
1875	25	0.364486	-9
1876	117	0.163043	106
1877	78	0.0454545	135
1878	24	0	46
1879	21	0.0909091	46
1880	19	0.104167	46
1881	9	0	-9
1882	21	0.208333	46
1883	13	0	46
1884	24	0.222222	46
1885	18	0	46
1886	19	0.125	46
1887	21	0	46
1888	17	0	46
1889	1	1	-9
1890	8	0	-9
1891	9	0	46
1892	14	0	46
1893	6	0	-9
1894	2	0	-9
1895	1	1	-9
1896	5	0	-9
1897	57	0.0565832	-9
1898	70	0.149667	46
1899	125	1	106
1900	1	1	-9
1901	525	0.0235018	142
1902	28	0.177398	-9
1903	100	0	142
1904	1	0.97	-9
1905	527	0.0163361	142
1906	112	0.254545	130
1907	171	0.32	142
1908	528	0.0140998	142
1909	22	0.164179	-9
1910	15	0.0938967	-9
1911	8	0.1	-9
1912	1	1	-9
1913	79	0.176471	148
1914	264	0.126984	83
1915	66	0.182927	148
1916	116	0.166667	83
1917	256	0.102151	83
1918	81	0.182741	148
1919	265	0.146667	83
1920	83	0.238095	148
1921	109	0.228571	130
1922	260	0.209677	73
1923	83	0.171717	148
1924	27	0.536429	176
1925	79	0.0283203	46
1926	528	0.0402299	142
1927	80	0.210227	148
1928	92	0.111111	83
1929	537	0.0220126	142
1930	65	0.183824	64
1931	533	0.037871	142
1932	70	0.111111	64
1933	525	0.0385027	142
1934	527	0.0298047	142
1935	118	0.247706	52
1936	97	0	142
1937	62	0	-9
1938	1	1	-9
1939	1	1	-9
1940	1	1	-9
1941	16	0.111111	139
1942	18	0.0434783	139
1943	6	0	105
1944	7	0	105
1945	104	0.477876	62
1946	30	0.378378	-9
1947	17	0.104167	51
1948	117	0.0606061	106
1949	531	0.0200803	142
1950	64	0.0934579	95
1951	87	0.303797	58
1952	267	0.130435	10
1953	67	0.132231	46
1954	108	0.161765	130
1955	47	0.152778	130
1956	514	0.0591806	142
1957	537	0.0239583	142
1958	64	0.0657895	95
1959	265	0.142857	10
1960	85	0.4	58
1961	532	0.0215054	142
1962	115	0.304878	130
1963	116	0.0594059	106
1964	78	0.0512821	135
1965	101	0.278351	130
1966	100	0.136842	130
1967	73	0.367347	62
1968	73	0.149068	62
1969	69	0.132794	46
1970	524	0.0460385	142
1971	33	0.0552995	-9
1972	78	0.198312	137
1973	175	1	107
1974	67	0.0821468	46
1975	59	0.0555556	-9
1976	157	0.107143	150
1977	64	0.121622	95
1978	83	0.485714	58
1979	26	0.611546	176
1980	26	0.657846	176
1981	23	0.636086	100
1982	7	0.888971	-9
1983	27	0.583555	176
1984	529	0.0387597	142
1985	164	0.0371429	150
1986	117	0.0517241	106
1987	527	0.0446137	142
1988	117	0.317881	130
1989	524	0.053787	142
1990	116	0.120219	106
1991	76	0.0588235	135
1992	77	0	135
1993	1	1	-9
1994	116	0.0928571	106
1995	78	0	135
1996	58	0.147727	95
1997	271	0.0985915	83
1998	86	0.268657	58
1999	116	0.0595238	106
2000	78	0	135
2001	531	0.174843	142
2002	98	0.0365854	130
2003	55	0.396552	130
2004	529	0.0144444	142
2005	149	0.136986	150
2006	40	0.0322581	99
2007	1	1	-9
2008	1	1	-9
2009	1	1	-9
2010	121	0.159091	52
2011	537	0.0267094	142
2012	39	0.216216	46
2013	31	0.142857	46
2014	51	0.046875	-9
2015	36	0	46
2016	39	0.333333	-9
2017	529	0.0384615	142
2018	526	0.0247578	142
2019	10	0.302469	48
2020	118	0.0360825	150
2021	1	1	-9
2022	26	0.125	-9
2023	4	0.695652	-9
2024	8	0.777778	-9
2025	533	0.0254842	142
2026	115	0.0733945	106
2027	78	0.0465116	135
2028	532	0.00991189	142
2029	102	0.0972222	130
2030	1	1	-9
2031	1	1	-9
2032	1	1	-9
2033	1	1	-9
2034	529	0.0344468	142
2035	269	0.202532	83
2036	45	1	108
2037	532	0.0254144	142
2038	4	1	109
2039	2	0.898256	109
2040	117	0.0642857	106
2041	113	0.0408163	106
2042	77	0	135
2043	1	1	-9
2044	34	0.138603	46
2045	540	0.0758342	142
2046	533	0.0349345	142
2047	2	1	110
2048	74	0.101713	-9
2049	277	0.164894	73
2050	173	0.0807799	107
2051	35	0.170507	-9
2052	19	0.227273	113
2053	508	0.0731707	142
2054	99	0.204082	52
2055	24	0.705882	9
2056	17	0.271429	-9
2057	23	0.292683	-9
2058	32	0.59322	76
2059	89	0.037037	62
2060	73	0.133333	62
2061	58	0.155172	64
2062	17	0.333333	51
2063	34	0.361446	-9
2064	542	0.0958498	142
2065	31	0.155172	-9
2066	4	0.62069	-9
2067	50	0.102041	64
2068	2	0.576923	-9
2069	55	0.575758	64
2070	7	0.266667	24
2071	4	0.766667	51
2072	35	0.548872	-9
2073	530	0.0369198	142
2074	108	0.264706	130
2075	37	0.272727	-9
2076	52	0.155556	64
2077	66	0.194444	64
2078	532	0.0280843	142
2079	7	0.723404	-9
2080	18	0.603604	-9
2081	41	0.0444444	95
2082	275	0.170455	83
2083	12	0.423913	-9
2084	527	0.0293194	142
2085	10	0.5	-9
2086	534	0.0263158	142
2087	78	0.12	73
2088	3	1	111
2089	119	0.0406091	150
2090	530	0.0255319	142
2091	48	0.240741	130
2092	104	0.133333	130
2093	118	0.102041	106
2094	77	0.030303	135
2095	526	0.0343348	142
2096	69	0.101617	46
2097	58	0.253012	95
2098	73	0.576923	58
2099	541	0.30812	142
2100	115	0.0572917	106
2101	50	0.331522	106
2102	535	0.039627	142
2103	54	0.123457	52
2104	43	0.08	99
2105	99	0.205128	52
2106	10	0.526316	-9
2107	18	0.3	139
2108	535	0.0333692	142
2109	531	0.0357143	142
2110	119	0.0780488	106
2111	77	0.0810811	135
2112	533	0.0397074	142
2113	77	0.0615034	142
2114	88	0.428571	130
2115	1	1	-9
2116	7	0.7	112
2117	3	0.758621	138
2118	531	0.0193878	142
2119	15	0.188976	-9
2120	5	0.363636	119
2121	27	0.2	-9
2122	110	0.267516	130
2123	541	0.0366972	142
2124	49	0.0839695	95
2125	86	0.164706	58
2126	14	0.4375	48
2127	22	0.213731	-9
2128	117	0.0621469	106
2129	78	0.0357143	135
2130	1	1	-9
2131	1	1	-9
2132	112	0.353293	62
2133	28	0.749178	176
2134	7	0.831189	100
2135	24	0.756904	176
2136	52	0.0235294	142
2137	53	0.0542169	142
2138	54	0.156342	142
2139	540	0.0174757	142
2140	108	0.125984	77
2141	64	0.027027	95
2142	257	0.133333	73
2143	85	0.153846	58
2144	524	0.0376569	142
2145	542	0.0918972	142
2146	11	0.364486	-9
2147	2	0.769231	49
2148	60	0.149123	64
2149	25	0.0833333	-9
2150	56	0.186992	64
2151	1	1	-9
2152	2	0	-9
2153	1	1	-9
2154	7	0	-9
2155	3	0	62
2156	3	0	-9
2157	1	1	-9
2158	2	0	-9
2159	4	0	-9
2160	4	0	62
2161	1	1	-9
2162	26	0	62
2163	7	0	-9
2164	3	0	-9
2165	16	0.5	-9
2166	1	1	-9
2167	1	1	-9
2168	3	0	-9
2169	1	1	-9
2170	64	0.12069	95
2171	85	0.335294	58
2172	523	0.0110865	142
2173	1	1	-9
2174	2	0.993151	72
2175	20	0	137
2176	1	1	-9
2177	168	0.0814607	150
2178	4	0.631736	-9
2179	29	0.579845	176
2180	4	0.707904	-9
2181	33	0.426594	176
2182	41	0.6093	176
2183	531	0.0337995	142
2184	529	0.0269687	142
2185	532	0.0252898	142
2186	2	0.888889	-9
2187	2	0.82	-9
2188	3	0.893617	49
2189	538	0.0534979	142
2190	117	0.0904523	106
2191	538	0.0201005	142
2192	527	0.0382572	142
2193	91	0.0952381	150
2194	529	0.0232804	142
2195	63	0.240506	95
2196	258	0.0980392	73
2197	86	0.115385	148
2198	43	0.692308	58
2199	547	0.260514	142
2200	537	0.0309278	142
2201	158	0.119658	150
2202	508	0.0509804	142
2203	12	0.333333	171
2204	24	0.232558	171
2205	7	0	20
2206	11	0.0769231	20
2207	7	0	20
2208	14	0.315789	20
2209	2	0	171
2210	532	0.038105	142
2211	121	0.395349	130
2212	5	0.794872	149
2213	90	0.323171	62
2214	71	0.211957	62
2215	81	0.39548	62
2216	58	0.407407	150
2217	19	0.3	-9
2218	532	0.0337423	142
2219	119	0.541284	62
2220	5	0.77551	-9
2221	8	1	112
2222	535	0.019937	142
2223	78	0.107143	145
2224	3	0.824561	96
2225	1	1	-9
2226	1	1	-9
2227	2	0.882353	96
2228	1	1	-9
2229	2	0	96
2230	2	0	96
2231	116	0.121387	106
2232	3	0.72043	-9
2233	2	0.25	114
2234	2	0	-9
2235	3	0.714286	-9
2236	2	0	-9
2237	3	0.5	-9
2238	2	0.5	114
2239	3	0.6875	-9
2240	1	1	-9
2241	1	1	-9
2242	1	1	-9
2243	1	1	-9
2244	6	0.117647	-9
2245	24	1	113
2246	18	0.0847458	113
2247	14	0.638365	-9
2248	1	0.928304	-9
2249	2	0.886734	-9
2250	4	1	114
2251	33	0.184615	-9
2252	18	0.190476	51
2253	23	0.297872	95
2254	85	0.343284	58
2255	116	0.541353	62
2256	169	0.0566572	150
2257	23	0.301075	95
2258	85	0.343284	58
2259	538	0.0609358	142
2260	67	0.116201	46
2261	117	0.0465116	106
2262	1	0.995327	-9
2263	86	0.0947368	52
2264	529	0.0238871	142
2265	530	0.0274262	142
2266	118	0.0725389	106
2267	82	0.244318	148
2268	257	0.231183	83
2269	534	0.020429	142
2270	121	0.349398	130
2271	6	0.666667	112
2272	2	0.826087	115
2273	1	1	-9
2274	57	0.0689655	64
2275	5	0.65	61
2276	5	0.86067	-9
2277	39	0.364055	-9
2278	63	0	142
2279	90	0.242991	62
2280	95	0.311881	62
2281	1	0.996885	-9
2282	527	0.0357518	142
2283	74	0.507143	62
2284	103	0.268595	62
2285	61	0.0159011	46
2286	46	0.335714	-9
2287	47	0.0540541	-9
2288	51	0.0217391	46
2289	47	0.00961538	-9
2290	15	0.5	-9
2291	36	0.125	46
2292	9	0.692308	127
2293	21	0	-9
2294	3	0	-9
2295	32	0.26087	46
2296	23	0.5	-9
2297	155	0.097561	150
2298	127	0.0636364	150
2299	54	0.0972222	-9
2300	53	0.0277393	-9
2301	51	0.10101	64
2302	536	0.0141557	142
2303	165	0.0458453	150
2304	67	0.11985	46
2305	112	0.346154	62
2306	59	0.156627	52
2307	107	0.181818	52
2308	5	0.5	-9
2309	41	0.145833	99
2310	1	0.90625	-9
2311	17	0.727273	1
2312	60	0.0230769	95
2313	273	0.231707	83
2314	87	0.522727	58
2315	3	1	115
2316	81	0.460938	62
2317	97	0.0486891	62
2318	530	0.0369588	142
2319	116	0.0459184	106
2320	78	0.125	135
2321	1	1	-9
2322	1	1	-9
2323	1	1	-9
2324	1	1	-9
2325	2	0	102
2326	1	1	-9
2327	2	0.8	102
2328	2	0.875	102
2329	1	1	-9
2330	1	1	-9
2331	1	1	-9
2332	1	1	-9
2333	1	1	-9
2334	2	0	-9
2335	1	1	-9
2336	1	1	-9
2337	1	1	-9
2338	1	1	-9
2339	62	0.161376	46
2340	62	0.0625	95
2341	88	0.545455	58
2342	538	0.028866	142
2343	51	0.6875	-9
2344	66	0.134454	64
2345	118	0.376923	130
2346	2	0.222222	115
2347	60	0.0495868	95
2348	268	0.16129	73
2349	86	0.447761	58
2350	1	1	-9
2351	531	0.0488798	142
2352	63	0.131313	95
2353	85	0.230769	58
2354	6	0.888889	149
2355	111	0.335616	62
2356	146	0	-9
2357	24	0.373913	-9
2358	20	0.377778	-9
2359	5	1	116
2360	2	0.277778	-9
2361	12	0.521739	103
2362	61	0.04	95
2363	255	0.142857	73
2364	85	0.230769	58
2365	2	1	117
2366	15	0	-9
2367	16	0.2	-9
2368	19	0.0909091	-9
2369	16	0.0909091	-9
2370	12	0	-9
2371	17	0	-9
2372	19	0.153846	-9
2373	18	0.12	-9
2374	11	0	-9
2375	15	0	-9
2376	9	0	-9
2377	2	0	-9
2378	526	0.0325843	142
2379	95	0.245283	130
2380	107	0.133333	130
2381	131	0.04	150
2382	2	1	118
2383	20	0.486486	105
2384	529	0.0263692	142
2385	172	0.105121	150
2386	117	0.0809249	106
2387	528	0.0393258	142
2388	80	0.0765766	142
2389	530	0.0263158	142
2390	28	0.325581	-9
2391	118	0.102941	106
2392	169	0.0736544	150
2393	88	0.107143	107
2394	6	0.684932	-9
2395	119	0.0923077	106
2396	78	0.0588235	135
2397	1	1	-9
2398	1	1	-9
2399	2	0.333333	-9
2400	5	0	-9
2401	2	0	-9
2402	3	0	113
2403	4	0	113
2404	3	0	-9
2405	3	0	-9
2406	2	0	-9
2407	4	0	-9
2408	4	0	-9
2409	1	1	-9
2410	2	0	-9
2411	1	1	-9
2412	2	0	-9
2413	4	0	-9
2414	9	0.293103	48
2415	9	0.310345	48
2416	1	1	-9
2417	9	0.286713	48
2418	7	1	119
2419	67	0.155405	64
2420	535	0.0143003	142
2421	536	0.0400822	142
2422	6	0.465839	-9
2423	11	0.0196078	-9
2424	24	0.16051	-9
2425	156	0.229167	150
2426	2	1	120
2427	170	0.0533708	150
2428	168	0.0481586	150
2429	532	0.019802	142
2430	67	0.122951	95
2431	84	0.401639	58
2432	532	0.0293225	142
2433	115	0.0765306	106
2434	6	0.484848	-9
2435	117	0.0659341	106
2436	78	0	135
2437	116	0.369231	130
2438	116	0.108434	106
2439	78	0.047619	145
2440	163	0.0494186	150
2441	527	0.0378378	142
2442	17	0.277778	51
2443	110	0.247059	130
2444	2	1	121
2445	15	0.836687	100
2446	111	0.375	130
2447	116	0.0505618	106
2448	22	0.252101	-9
2449	19	0.232323	-9
2450	14	0.614286	-9
2451	161	0.21374	150
2452	50	0.0833333	-9
2453	70	0.0909091	-9
2454	117	0.108808	106
2455	114	0.363905	62
2456	14	0.204724	-9
2457	78	0.0884956	52
2458	6	0.279251	136
2459	5	0.291971	136
2460	6	0.44898	136
2461	108	0.195652	130
2462	89	0.305882	130
2463	115	0.0662651	106
2464	78	0.0625	135
2465	90	0.174825	73
2466	528	0.0441324	142
2467	92	0.178082	130
2468	107	0.442623	130
2469	65	0.144737	95
2470	253	0.1	10
2471	87	0.297101	58
2472	165	0.059322	150
2473	526	0.0516333	142
2474	69	0.156812	46
2475	69	0.0412027	46
2476	99	0.138462	130
2477	43	0.178571	130
2478	95	0.2	130
2479	66	0.0579065	46
2480	10	0.5	127
2481	527	0.017094	142
2482	1	1	-9
2483	24	0	-9
2484	3	0	-9
2485	14	0	-9
2486	18	0	-9
2487	1	1	-9
2488	1	1	-9
2489	1	1	-9
2490	1	1	-9
2491	1	1	-9
2492	1	1	-9
2493	6	0	-9
2494	1	1	-9
2495	1	1	-9
2496	1	1	-9
2497	1	1	-9
2498	25	0.766355	-9
2499	61	0.0928218	142
2500	156	0.111111	150
2501	3	0.835938	-9
2502	38	0.604079	176
2503	1	0.920846	-9
2504	112	0.311688	130
2505	44	0.70902	176
2506	5	0.99359	-9
2507	119	0.0192926	150
2508	13	0.31746	-9
2509	528	0.0502618	142
2510	110	0.0689655	106
2511	116	0.0892857	106
2512	77	0.05	135
2513	534	0.0201485	142
2514	103	0.269663	52
2515	537	0.0123584	142
2516	2	1	122
2517	114	0.0755814	106
2518	79	1	123
2519	117	0.0710059	106
2520	78	0.0357143	135
2521	117	0.113636	106
2522	77	0	135
2523	115	0.0869565	106
2524	79	1	124
2525	163	0.0479042	150
2526	115	0.0487805	106
2527	78	0.0384615	135
2528	5	1	125
2529	527	0.044181	142
2530	1	1	-9
2531	65	0.138761	46
2532	11	0.386986	-9
2533	54	0	-9
2534	461	0.102618	-9
2535	2	1	126
2536	18	0.423077	105
2537	101	0.159091	130
2538	1	0.985915	-9
2539	80	0.0576307	142
2540	1	0.938272	-9
2541	16	1	127
2542	99	0.037037	52
2543	532	0.0143149	142
2544	530	0.0494092	142
2545	533	0.0142566	142
2546	5	1	128
2547	1	1	-9
2548	115	0.0612245	106
2549	77	0.0606061	135
2550	13	0.476562	127
2551	97	0.193182	130
2552	525	0.0418848	142
2553	7	0.243421	127
2554	67	0.0819113	142
2555	103	0.198198	52
2556	2	0.882353	-9
2557	66	0.178571	52
2558	29	0.307692	76
2559	2	1	129
2560	526	0.030837	142
2561	61	0.03125	95
2562	87	0.439189	58
2563	535	0.0205405	142
2564	31	0.2	151
2565	114	0.0982659	106
2566	78	0	135
2567	170	0.10585	150
2568	90	0.483871	150
2569	4	0.724138	101
2570	4	0.689655	101
2571	1	1	-9
2572	110	0.29661	130
2573	74	0.170068	64
2574	116	0.25	130
2575	526	0.0408805	142
2576	530	0.0337909	142
2577	30	0.222222	156
2578	27	0.176471	151
2579	527	0.0337197	142
2580	528	0.0349576	142
2581	17	0.404959	51
2582	53	0.722772	64
2583	70	0.283186	130
2584	99	0.147541	130
2585	532	0.0307692	142
2586	7	0.6	-9
2587	63	0.0810811	95
2588	244	0.1	73
2589	84	0.301075	58
2590	47	0.380531	130
2591	528	0.039019	142
2592	127	1	130
2593	35	0.538462	76
2594	8	0.5	-9
2595	35	0.623188	76
2596	528	0.0606061	142
2597	539	0.161905	142
2598	3	0.333333	128
2599	524	0.168966	142
2600	529	0.0381837	142
2601	453	0.0737813	-9
2602	8	0.666667	-9
2603	526	0.0670391	142
2604	525	0.0373216	142
2605	117	0.0483092	106
2606	79	1	131
2607	47	0.192	-9
2608	1	1	-9
2609	60	0.0283688	46
2610	528	0.0410095	142
2611	539	0.0305263	142
2612	2	1	132
2613	9	0.362069	-9
2614	1	1	-9
2615	1	1	-9
2616	496	0.0546139	142
2617	518	0.0305981	142
2618	527	0.0379877	142
2619	5	1	133
2620	1	1	-9
2621	2	1	134
2622	515	0.0351562	142
2623	535	0.0304348	142
2624	533	0.0368809	142
2625	1	1	-9
2626	516	0.0542636	142
2627	529	0.034632	142
2628	1	1	-9
2629	1	1	-9
2630	1	1	-9
2631	1	1	-9
2632	525	0.0636364	142
2633	75	0.266667	142
2634	529	0.0518764	142
2635	2	0.815789	-9
2636	4	0.230769	127
2637	9	0.432432	127
2638	531	0.0302703	142
2639	529	0.0304302	142
2640	136	0.0242718	150
2641	528	0.0521173	142
2642	533	0.012685	142
2643	98	0.0740741	130
2644	53	0.37037	130
2645	97	0.0188679	130
2646	115	0.041958	106
2647	115	0.0526316	106
2648	79	1	135
2649	4	0.857143	146
2650	5	0.88	-9
2651	66	0.169231	62
2652	117	0.0520833	106
2653	78	0.0512821	135
2654	117	0.119048	106
2655	78	0.0384615	135
2656	7	0.705882	-9
2657	41	0.166667	62
2658	72	0.204082	62
2659	539	0.0217617	142
2660	124	0.450331	130
2661	115	0.079096	106
2662	55	0.0223084	-9
2663	8	1	136
2664	89	0.232877	62
2665	527	0.0269058	142
2666	528	0.0355603	142
2667	34	0.0935961	-9
2668	35	0	46
2669	58	0.152174	46
2670	45	0.119565	-9
2671	5	0.23913	119
2672	41	0.027027	99
2673	7	0.4375	-9
2674	58	0.0547945	52
2675	88	0.353846	77
2676	20	0.297297	-9
2677	20	0.027027	105
2678	1	1	-9
2679	4	0.166667	141
2680	20	0.0909091	-9
2681	9	0.247382	-9
2682	1	1	-9
2683	1	1	-9
2684	1	1	-9
2685	1	1	-9
2686	1	1	-9
2687	1	1	-9
2688	1	1	-9
2689	1	1	-9
2690	1	1	-9
2691	2	0	-9
2692	1	1	-9
2693	1	1	-9
2694	1	1	-9
2695	8	0	-9
2696	1	1	-9
2697	1	1	-9
2698	1	1	-9
2699	4	0.157895	-9
2700	2	0.666667	-9
2701	1	1	-9
2702	3	0	48
2703	2	0.666667	48
2704	3	0	48
2705	4	0.16	48
2706	2	0	-9
2707	3	0	-9
2708	1	1	-9
2709	1	1	-9
2710	4	0	127
2711	5	0	48
2712	1	1	-9
2713	1	1	-9
2714	1	1	-9
2715	52	0.031746	52
2716	62	0.101528	46
2717	53	0.0706667	-9
2718	42	0.159292	-9
2719	54	0.0815217	-9
2720	28	0.428571	-9
2721	77	0.0903226	8
2722	12	0.0928571	95
2723	85	0.269231	58
2724	24	0.286813	-9
2725	61	0.12	95
2726	233	0.0384615	73
2727	252	0.176471	73
2728	86	0.0601093	58
2729	531	0.0230126	142
2730	25	0.401869	-9
2731	69	0.144219	46
2732	117	0.113514	106
2733	78	0.0277778	135
2734	20	0.79239	100
2735	112	0.245509	130
2736	124	0.0348101	150
2737	36	0.145455	-9
2738	78	0.142857	124
2739	79	1	137
2740	169	0.0534125	150
2741	1	1	-9
2742	1	1	-9
2743	529	0.0463362	142
2744	117	0.121547	106
2745	56	0.0235294	-9
2746	116	0.233083	130
2747	528	0.0255556	142
2748	31	0.583333	-9
2749	3	0.767442	49
2750	119	0.085	106
2751	1	0.944444	-9
2752	64	0.0512821	95
2753	233	0.0588235	73
2754	87	0.223881	58
2755	38	0.666667	-9
2756	112	0.351266	62
2757	530	0.0302115	142
2758	4	0.863636	-9
2759	68	0.163152	46
2760	123	0.0890208	150
2761	4	0.347826	116
2762	3	0.869565	116
2763	1	0.985294	-9
2764	6	0.766667	112
2765	5	0.519481	-9
2766	6	1	138
2767	5	0.6	-9
2768	532	0.0314795	142
2769	51	0.164557	64
2770	9	0.793651	-9
2771	65	0.229167	64
2772	49	0.44898	-9
2773	10	0.692308	51
2774	527	0.0338798	142
2775	36	0.292035	-9
2776	67	0.163484	46
2777	46	0.102564	62
2778	77	0.292683	62
2779	90	0.267516	62
2780	539	0.042042	142
2781	49	0.435897	62
2782	79	0.286822	62
2783	88	0.22695	62
2784	111	0.340426	62
2785	17	0.47099	-9
2786	24	0.254545	-9
2787	28	0.155914	-9
2788	10	0.5	-9
2789	8	0	-9
2790	21	1	139
2791	119	0.0659898	106
2792	77	0	142
2793	533	0.0221704	142
2794	119	0.0829016	106
2795	115	0.349593	130
2796	7	0.386598	127
2797	5	0.643172	127
2798	531	0.0215827	142
2799	71	0.0356394	142
2800	113	0.280899	130
2801	1	1	-9
2802	3	0	-9
2803	24	0	62
2804	5	0.75	-9
2805	52	0.333333	62
2806	17	0.333333	62
2807	36	0	62
2808	2	0.8	-9
2809	46	0	62
2810	2	0	-9
2811	51	0	62
2812	26	0	62
2813	6	0	-9
2814	18	0	-9
2815	64	0.225352	95
2816	77	0.483146	58
2817	81	0.245455	62
2818	43	0.25	62
2819	71	0.130435	62
2820	56	0.181818	62
2821	25	0	-9
2822	33	0	62
2823	68	0.25	62
2824	67	0.2	62
2825	66	0.15	62
2826	71	0	62
2827	52	0	62
2828	75	0	62
2829	40	0	62
2830	60	0.285714	62
2831	42	0	62
2832	32	0.6	62
2833	440	0.0883234	-9
2834	252	0.241228	-9
2835	37	0.704323	176
2836	28	0.672073	100
2837	15	0.0486111	-9
2838	19	0.75	113
2839	84	0.05	73
2840	87	0.448669	148
2841	9	0.645777	-9
2842	69	0.0676606	46
2843	60	0.177914	148
2844	177	0.0776699	83
2845	78	0.223529	148
2846	260	0.137566	83
2847	100	0.0769231	77
2848	533	0.024948	142
2849	52	0.325	130
2850	58	0.484848	130
2851	107	0.481928	130
2852	1	0.943425	-9
2853	4	0.890479	100
2854	538	0.0245478	142
2855	506	0.0409511	142
2856	521	0.021164	142
2857	519	0.0867679	142
2858	2	1	140
2859	527	0.294643	142
2860	84	0.262069	130
2861	64	0.342105	130
2862	52	0.328877	46
2863	64	0.0930233	95
2864	79	0.202247	58
2865	504	0.101266	142
2866	528	0.0214395	142
2867	67	0.114286	52
2868	113	0.1	52
2869	41	0.0555556	178
2870	34	0.478261	76
2871	7	0	-9
2872	2	0	-9
2873	13	0	-9
2874	147	0	142
2875	218	0	142
2876	121	0.5	142
2877	1	1	-9
2878	31	0	-9
2879	314	0	142
2880	15	0	-9
2881	34	0	142
2882	4	0	-9
2883	362	0	142
2884	2	0	-9
2885	2	0	-9
2886	7	0	-9
2887	14	0	-9
2888	1	1	-9
2889	14	0	-9
2890	518	0.0795181	142
2891	532	0.0411523	142
2892	1	1	-9
2893	10	0	-9
2894	6	0	-9
2895	1	1	-9
2896	4	0	-9
2897	2	0	-9
2898	4	0	-9
2899	25	0	-9
2900	3	0	-9
2901	10	0	-9
2902	12	0	-9
2903	15	0	-9
2904	9	0	-9
2905	31	0	-9
2906	1	1	-9
2907	519	0.0468085	142
2908	546	0.209953	142
2909	530	0.034662	142
2910	540	0.036036	142
2911	517	0.0694669	142
2912	532	0.0159574	142
2913	5	1	141
2914	3	0.833333	133
2915	538	0.0249187	142
2916	570	20	142
2917	530	0.0474383	142
2918	483	0.138614	142
2919	539	0.0569444	142
2920	1	1	-9
2921	54	0.184783	46
2922	497	0.35	142
2923	33	0.136364	-9
2924	112	0.348703	62
2925	528	0.0311284	142
2926	1	1	-9
2927	20	0.238889	-9
2928	490	0.121076	142
2929	517	0.138889	142
2930	514	0.0108225	142
2931	517	0.0676507	142
2932	524	0.0344168	142
2933	131	0	142
2934	476	0.06	142
2935	65	0.184615	142
2936	522	0.0553435	142
2937	46	0.08	-9
2938	529	0.0488771	142
2939	529	0.0454545	142
2940	503	0.40625	142
2941	78	0.293478	62
2942	81	0.231481	62
2943	517	0.0755814	142
2944	55	0	-9
2945	521	0.0321489	142
2946	523	0.0214797	142
2947	1	1	-9
2948	77	0.144144	52
2949	66	0.0782509	46
2950	39	0.416667	46
2951	29	0.198831	176
2952	33	0.664002	176
2953	25	0.236544	-9
2954	43	0.121951	99
2955	133	0.121212	52
2956	30	0.368421	76
2957	66	0.1875	64
2958	529	0.0221774	142
2959	535	0.0165119	142
2960	539	0.0201149	142
2961	84	0.140351	52
2962	41	0.0606061	16
2963	33	0.388889	76
2964	111	0.282051	130
2965	109	0.269841	130
2966	525	0.0562633	142
2967	6	0.227723	-9
2968	84	0.227979	58
2969	33	0.617046	100
2970	32	0.642273	176
2971	534	0.0400411	142
2972	71	0.274336	130
2973	40	0.283333	130
2974	4	0.793651	-9
2975	533	0.0340909	142
2976	536	0.0297556	142
2977	62	0.0769231	95
2978	272	0.291139	83
2979	85	0.220238	58
2980	115	0.134078	106
2981	77	0.0294118	135
2982	534	0.0147368	142
2983	41	0.0425532	99
2984	140	0.212389	52
2985	525	0.0557377	142
2986	529	0.0465357	142
2987	115	0.0437956	106
2988	116	0.0508475	106
2989	78	0.0571429	135
2990	525	0.0229508	142
2991	117	0.0362694	150
2992	3	1	143
2993	521	0.0150943	142
2994	63	0.157303	46
2995	117	0.0860215	106
2996	78	0	135
2997	538	0.012513	142
2998	93	0.486301	62
2999	87	0.199074	62
3000	80	0.390411	62
3001	535	0.0115668	142
3002	252	0.136612	83
3003	88	0.605405	148
3004	535	0.0238871	142
3005	79	0.202128	148
3006	168	0.0882353	83
3007	27	0.208955	148
3008	21	0.209677	148
3009	107	0.219828	62
3010	19	0.383085	-9
3011	42	0.164516	107
3012	537	0.0414079	142
3013	20	0.190476	-9
3014	536	0.018648	142
3015	53	0.0862069	142
3016	3	1	144
3017	121	0.0507614	150
3018	533	0.031679	142
3019	5	0.71831	-9
3020	97	0.4	62
3021	172	0.0463768	107
3022	143	0.111111	150
3023	530	0.0526316	142
3024	101	0.358306	62
3025	51	0.239583	64
3026	15	0.338983	-9
3027	67	0.113507	46
3028	531	0.0667362	142
3029	528	0.0703463	142
3030	1	1	-9
3031	1	1	-9
3032	2	0.952381	98
3033	526	0.0490405	142
3034	117	0.128049	106
3035	79	1	145
3036	4	0.833333	125
3037	4	0.571429	97
3038	5	1	146
3039	4	0.75	97
3040	157	0.0479042	150
3041	72	0.587413	62
3042	113	0.245509	130
3043	5	0.5	112
3044	527	0.0406674	142
3045	128	0.0460123	150
3046	59	0.05	95
3047	59	0.0625	95
3048	230	0.102564	8
3049	87	0.253521	58
3050	116	0.0655738	106
3051	78	0.148148	135
3052	77	0.025	135
3053	91	0.333333	62
3054	1	1	-9
3055	29	0.21466	-9
3056	2	0.352941	-9
3057	531	0.0411622	142
3058	5	0.866667	138
3059	3	0.214286	-9
3060	8	0.848485	-9
3061	22	0.161398	-9
3062	1	1	-9
3063	15	0.235294	105
3064	16	0.0909091	139
3065	10	0	105
3066	106	0.0833333	130
3067	97	0.386364	130
3068	40	0.338667	-9
3069	5	1	147
3070	1	1	-9
3071	532	0.0360111	142
3072	525	0.0819462	142
3073	18	0.172352	-9
3074	523	0.0275591	142
3075	522	0.0211132	142
3076	515	0.04039	142
3077	25	0.1	-9
3078	517	0.0507152	142
3079	528	0.0341686	142
3080	530	0.0318602	142
3081	4	0.424242	-9
3082	3	0.652174	-9
3083	530	0.0475504	142
3084	513	0.0366848	142
3085	521	0.026087	142
3086	524	0.0360111	142
3087	497	0.0816327	142
3088	538	0.134228	142
3089	527	0.0286299	142
3090	112	0.353448	130
3091	82	0.160839	73
3092	29	0	-9
3093	1	1	-9
3094	532	0.021601	142
3095	32	0.123288	-9
3096	540	0.0145833	142
3097	38	0.146635	46
3098	528	0.0409924	142
3099	25	0.651652	-9
3100	68	0.126126	64
3101	18	0.27027	51
3102	527	0.0275132	142
3103	528	0.0349345	142
3104	512	0.0597345	142
3105	3	0.103448	-9
3106	89	1	148
3107	531	0.0331197	142
3108	527	0.0350242	142
3109	532	0.0428894	142
3110	8	0.561798	-9
3111	1	0.913043	-9
3112	6	0.5	127
3113	24	0.126547	-9
3114	125	0.0416667	150
3115	164	0.220217	150
3116	1	0.962733	-9
3117	530	0.0110011	142
3118	511	0.0692308	142
3119	24	0.205945	-9
3120	62	0.277262	-9
3121	542	0.055336	142
3122	79	0.297297	62
3123	6	1	149
3124	9	0.717391	48
3125	530	0.0675105	142
3126	520	0.0378788	142
3127	2	0.976471	172
3128	4	0.526316	116
3129	472	0.05386	142
3130	85	0.0526316	142
3131	529	0.0442177	142
3132	529	0.0379965	142
3133	523	0.239513	142
3134	515	0.0492813	142
3135	525	0.00816327	142
3136	25	0.752637	176
3137	3	0.875785	-9
3138	175	1	150
3139	110	0.246445	62
3140	116	0	142
3141	8	0.989726	136
3142	118	0.0972973	106
3143	107	0.107143	130
3144	30	0.0677618	-9
3145	1	1	-9
3146	1	1	-9
3147	1	1	-9
3148	103	0.159664	130
3149	535	0.0168317	142
3150	22	0.177665	171
3151	13	0.153846	171
3152	14	0	20
3153	8	0	20
3154	14	0.282051	20
3155	7	0	-9
3156	8	0.583333	-9
3157	21	0.25	-9
3158	17	0.25	51
3159	65	0.05	64
3160	56	0.103093	64
3161	171	0.0293333	150
3162	69	0.0935738	46
3163	24	0.384868	176
3164	39	0.450968	176
3165	117	0.079096	106
3166	4	0.415094	-9
3167	537	0.0175439	142
3168	34	0.226562	-9
3169	12	0.615385	-9
3170	11	0.0815217	-9
3171	9	0.617886	-9
3172	19	0.993197	51
3173	1	1	-9
3174	528	0.0420259	142
3175	35	1	151
3176	12	0.0172414	-9
3177	58	0.126761	64
3178	29	0.0574713	156
3179	5	0.886792	-9
3180	54	0.192308	130
3181	29	0.182581	-9
3182	5	0.182609	-9
3183	36	0.265306	-9
3184	27	0.0746269	156
3185	19	0.275362	156
3186	6	1	152
3187	7	1	153
3188	115	0.1125	106
3189	78	0.0625	135
3190	116	0.116129	106
3191	71	0.103373	46
3192	527	0.031927	142
3193	15	0.0558659	106
3194	82	0.382022	62
3195	80	0.304348	62
3196	530	0.0421166	142
3197	537	0.0173647	142
3198	30	0.25	156
3199	528	0.0357542	142
3200	154	0.0429448	150
3201	530	0.0339343	142
3202	526	0.0298343	142
3203	12	0.307692	25
3204	530	0.0388769	142
3205	160	0.0571429	150
3206	6	1	154
3207	61	0.13253	95
3208	260	0.166667	73
3209	20	0.142857	160
3210	87	0.109091	58
3211	65	0.138462	95
3212	22	1	155
3213	258	0.0851064	73
3214	87	0.382716	58
3215	533	0.0228013	142
3216	71	0.145161	64
3217	115	0.0647059	106
3218	527	0.0168675	142
3219	20	0.274336	-9
3220	13	0.5	127
3221	35	1	156
3222	42	0.666012	176
3223	530	0.0438972	142
3224	29	0.047619	156
3225	17	0.337662	156
3226	6	1	157
3227	51	0.191919	64
3228	60	0.225352	64
3229	5	0.733333	-9
3230	17	0.0645161	51
3231	62	0.166667	95
3232	260	0.142857	73
3233	20	0.225806	160
3234	86	0.0613497	58
3235	79	0.0857143	52
3236	9	0.102564	25
3237	11	0.0689655	-9
3238	6	1	158
3239	2	1	159
3240	4	0.490566	-9
3241	1	1	-9
3242	51	0.133333	64
3243	535	0.0179325	142
3244	536	0.0307692	142
3245	532	0.0227498	142
3246	1	1	-9
3247	1	1	-9
3248	143	0.0588235	150
3249	415	0.629454	142
3250	10	0.0677966	25
3251	527	0.0413136	142
3252	43	0.0714286	-9
3253	41	0.0322581	178
3254	22	0.318182	-9
3255	29	0.686275	52
3256	537	0.0174897	142
3257	67	0.179688	95
3258	22	1	160
3259	266	0.118644	83
3260	86	0.246914	58
3261	528	0.041989	142
3262	530	0.0197917	142
3263	87	0.566879	-9
3264	1	1	-9
3265	96	0.510526	62
3266	528	0.0379198	142
3267	1	1	-9
3268	1	1	-9
3269	1	1	-9
3270	2	1	161
3271	20	0.380165	156
3272	10	0.804348	-9
3273	16	0.158192	106
3274	169	0.0553936	150
3275	535	0.0189621	142
3276	532	0.0311111	142
3277	528	0.0339367	142
3278	4	0.931034	101
3279	540	0.0317919	142
3280	502	0.194175	142
3281	538	0.0178571	142
3282	32	0.183673	151
3283	11	0.1375	-9
3284	539	0.0162524	142
3285	74	0.0500556	-9
3286	29	0.149425	156
3287	41	0.190476	-9
3288	168	0.0421053	150
3289	534	0.0258264	142
3290	1	1	-9
3291	10	0.587629	-9
3292	22	0.183432	106
3293	4	0.648649	90
3294	109	0.0786517	150
3295	5	1	162
3296	1	1	-9
3297	1	1	-9
3298	1	1	-9
3299	18	0.214286	-9
3300	92	0.129412	150
3301	2	1	163
3302	2	1	164
3303	15	0.169231	156
3304	1	1	-9
3305	89	0.113636	150
3306	40	0.0163934	-9
3307	44	0.275862	99
3308	4	0.27027	119
3309	50	0.097561	46
3310	34	0.114679	46
3311	49	0.140625	46
3312	2	0	-9
3313	2	0.785714	11
3314	1	1	-9
3315	66	0.0630631	95
3316	86	0.212963	58
3317	61	0.278481	58
3318	28	0.182927	156
3319	34	0.3	156
3320	17	0.137441	51
3321	6	0.616667	61
3322	4	0.894737	-9
3323	36	0.25	-9
3324	1	1	-9
3325	1	1	-9
3326	1	1	-9
3327	6	0.542857	-9
3328	1	1	-9
3329	5	0.5	-9
3330	1	1	-9
3331	4	0.590909	-9
3332	2	0	-9
3333	2	0.857143	-9
3334	10	0.75	-9
3335	1	1	-9
3336	3	0.857143	-9
3337	1	1	-9
3338	88	0.267241	64
3339	51	0.0526316	64
3340	43	0.277174	106
3341	2	1	165
3342	113	0.344828	130
3343	8	0.99841	136
3344	30	0.219178	156
3345	17	0.2	156
3346	30	0.375	151
3347	7	0.354167	-9
3348	6	1	166
3349	392	0.110294	142
3350	529	0.0281849	142
3351	519	0.0345679	142
3352	531	0.0364583	142
3353	517	0.0277427	142
3354	529	0.0476695	142
3355	83	0.103448	52
3356	533	0.022412	142
3357	1	1	-9
3358	129	0.0463576	150
3359	528	0.0242105	142
3360	57	0.173913	130
3361	4	0.333333	102
3362	125	0.0266667	150
3363	537	0.0140987	142
3364	93	0.227273	150
3365	4	0.0666667	-9
3366	6	0.857143	37
3367	8	0.380952	37
3368	3	1	167
3369	5	0.435897	149
3370	107	0.340611	62
3371	101	0.358491	150
3372	123	0.173913	106
3373	33	0.0995261	-9
3374	532	0.0323253	142
3375	36	0.308824	-9
3376	171	0.0596206	150
3377	528	0.0360767	142
3378	11	0.0689655	-9
3379	11	0.236364	25
3380	1	1	-9
3381	1	1	-9
3382	1	1	-9
3383	9	0.0746269	-9
3384	21	0.142857	160
3385	84	0.136842	58
3386	2	1	168
3387	33	0.118483	-9
3388	8	0.25641	90
3389	127	0.0333333	150
3390	113	0.0239044	150
3391	84	0.0740741	107
3392	5	0.638298	-9
3393	71	0.1	150
3394	2	1	169
3395	112	0.261438	150
3396	1	1	-9
3397	538	0.0641822	142
3398	1	1	-9
3399	1	1	-9
3400	13	0.224138	-9
3401	7	0.727273	-9
3402	36	0.204082	-9
3403	7	0.333333	24
3404	1	1	-9
3405	527	0.0378788	142
3406	526	0.0231278	142
3407	2	1	170
3408	119	0.0772947	106
3409	1	0.9	71
3410	78	0	124
3411	78	0.147059	135
3412	520	0.00808314	142
3413	79	0.379747	62
3414	109	0.125	106
3415	78	0.0633333	142
3416	76	0.114094	46
3417	35	0.537313	-9
3418	3	0.968	-9
3419	6	0.789474	-9
3420	1	0.991597	-9
3421	44	0.0708955	-9
3422	50	0.0112219	-9
3423	4	0.54878	-9
3424	510	0.02977	142
3425	65	0.371429	46
3426	33	1	171
3427	7	0.254545	25
3428	532	0.0285401	142
3429	11	0.238994	-9
3430	527	0.0300107	142
3431	7	0.378425	136
3432	91	0.328704	62
3433	73	0.349206	62
3434	69	0.0936455	46
3435	7	0.08	-9
3436	2	1	172
3437	4	0.809524	116
3438	1	1	-9
3439	21	0.290323	160
3440	38	0.22973	95
3441	88	0.260638	58
3442	88	0.0879121	150
3443	19	0.178571	-9
3444	128	0.0413793	150
3445	524	0.0264741	142
3446	12	0.264151	127
3447	11	0.169231	25
3448	11	0.153846	25
3449	138	0.0886076	150
3450	14	0.0972222	113
3451	2	0	-9
3452	10	0.4	113
3453	3	0.142857	69
3454	3	0.5	69
3455	528	0.0349243	142
3456	126	0.0275862	150
3457	126	0.0196078	150
3458	1	1	-9
3459	538	0.0343035	142
3460	117	0.247312	52
3461	1	1	-9
3462	258	0.04	83
3463	11	0.714286	108
3464	273	0.147651	83
3465	35	0.181818	1
3466	96	0.196721	77
3467	83	0.306452	52
3468	88	0	83
3469	278	0.164502	73
3470	38	0.435897	1
3471	116	0.108434	106
3472	267	0.10084	73
3473	271	0.138211	73
3474	88	0	83
3475	274	0.183673	73
3476	268	0.192771	83
3477	282	0.167421	73
3478	278	0.237288	73
3479	282	0.250923	73
3480	206	0.233766	83
3481	9	1	173
3482	285	0.195572	73
3483	526	0.0260771	142
3484	143	0.0783133	83
3485	42	0.177215	148
3486	85	0.319588	58
3487	6	1	174
3488	7	0.702703	-9
3489	62	0.133333	95
3490	20	0.181818	60
3491	255	0.0980392	73
3492	85	0.168421	58
3493	7	0.410714	-9
3494	74	0.171429	58
3495	81	0.221053	58
3496	20	0.193548	160
3497	62	0.129412	95
3498	260	0.145833	73
3499	88	0.215569	58
3500	20	0.129032	160
3501	67	0.126582	95
3502	260	0.142857	73
3503	87	0.0674847	58
3504	99	0.153153	77
3505	1	0.961538	-9
3506	15	0.142857	-9
3507	1	0.974359	-9
3508	263	0.06	73
3509	200	0.025974	73
3510	269	0.0471698	73
3511	219	0.156863	83
3512	5	1	175
3513	201	0.229167	73
3514	267	0.0547945	10
3515	35	0.217391	1
3516	250	0.102804	8
3517	36	0.324074	1
3518	15	0.219512	13
3519	265	0.0753425	73
3520	15	0.321429	17
3521	9	0.897436	90
3522	157	0.119048	150
3523	141	0.0604027	150
3524	8	0.205128	90
3525	142	0.0764331	150
3526	7	0.0540541	-9
3527	150	0.0280374	150
3528	149	0.132075	150
3529	127	0.0457516	150
3530	134	0.0331126	150
3531	124	0.0197368	150
3532	160	0.0964912	150
3533	30	0.791977	100
3534	3	0.881747	-9
3535	19	0.694195	100
3536	47	1	176
3537	46	0.221661	176
3538	44	0.319109	176
3539	6	0.845897	-9
3540	44	0.45859	176
3541	24	0.150794	-9
3542	261	0.0263158	83
3543	212	0	73
3544	271	0.0789474	83
3545	99	0.0944882	77
3546	282	0.209125	73
3547	32	0.323529	1
3548	276	0.129213	83
3549	527	0.0382572	142
3550	107	0.256757	130
3551	79	0.302158	-9
3552	113	0.323171	130
3553	107	0.25	130
3554	110	0.251969	130
3555	107	0.25	130
3556	112	0.354331	130
3557	107	0.25641	130
3558	102	0.213483	52
3559	32	0.217391	76
3560	30	0.229885	156
3561	27	0.0909091	156
3562	34	0.181818	156
3563	30	0.252874	156
3564	20	0.122807	156
3565	6	1	177
3566	29	0.172043	156
3567	275	0.175325	83
3568	39	0.325	108
3569	219	0.245614	83
3570	40	0.0983607	1
3571	278	0.11413	8
3572	88	0.209677	52
3573	271	0.0789474	10
3574	275	0.130435	10
3575	282	0.187251	73
3576	281	0.20339	83
3577	24	0.397727	-9
3578	37	0.666667	76
3579	5	0.794872	-9
3580	268	0.25	73
3581	268	0.0666667	73
3582	103	0.100917	77
3583	45	1	178
3584	93	0.173333	77
3585	16	0.444444	-9
3586	1	1	-9
3587	20	0.361702	-9
3588	20	0.416667	76
3589	21	0.4	76
3590	3	1	179
3591	278	0.130802	73
3592	276	0.0948905	10
