GUT_GENOME083148_01610
GUT_GENOME268596_00299
GUT_GENOME260010_00816
GUT_GENOME127497_00415
GUT_GENOME096246_02860
GUT_GENOME125029_00967
GUT_GENOME069753_01311
GUT_GENOME112871_00472
GUT_GENOME164118_01011
GUT_GENOME157332_00111
GUT_GENOME191951_00428
GUT_GENOME138675_00881
GUT_GENOME111943_00210
GUT_GENOME109639_01237
GUT_GENOME010748_00395
GUT_GENOME054214_00924
GUT_GENOME243391_00607
A0A059KGE6
GUT_GENOME029626_00831
GUT_GENOME072425_01151
GUT_GENOME020690_00167
GUT_GENOME262275_01297
GUT_GENOME000862_00760
GUT_GENOME100889_00902
A0A061QKZ5
A0A072NZE4
A0A067MWV3
GUT_GENOME158108_00647
A0A068YYJ1
A0A062XVG0
A0A061SC95
A0A072VRH3
A0A066W7U0
A0A062V2D0
GUT_GENOME276768_01455
A0A068SEG9
GUT_GENOME038201_03168
A0A073L1U1
A0A074Z4C5
A0A074LN42
A0A075R8Q9
A0A068RY45
GUT_GENOME194674_00935
A0A074ZAV2
GUT_GENOME237421_01087
GUT_GENOME225779_01118
GUT_GENOME204010_02172
A0A061DCV2
A0A060Y4Y0
A0A060T362
GUT_GENOME104668_00481
GUT_GENOME093124_00323
A0A068RG13
A0A061QZS1
A0A061RY02
GUT_GENOME049765_00889
GUT_GENOME109437_01470
GUT_GENOME140099_00727
GUT_GENOME026334_00237
GUT_GENOME265784_01651
GUT_GENOME245262_00428
GUT_GENOME082593_01038
GUT_GENOME145993_00779
GUT_GENOME014807_00392
GUT_GENOME155991_03585
GUT_GENOME107774_01229
A0A067NAF8
A0A063YJS4
GUT_GENOME156647_00138
GUT_GENOME011256_01490
A0A073AZG0
GUT_GENOME254341_00549
GUT_GENOME147550_01511
GUT_GENOME090046_02141
GUT_GENOME062891_03080
A0A077WGY2
A0A074RYG2
A0A077X3C7
A0A075MMF6
GUT_GENOME230531_02016
GUT_GENOME253029_00283
GUT_GENOME033957_01309
A0A075MPD3
GUT_GENOME052570_01286
A0A075TYQ0
A0A077AXS2
A0A077LZG3
GUT_GENOME149179_01246
A0A076FMQ5
GUT_GENOME011701_00031
GUT_GENOME064129_00387
A0A086CGH0
A0A076I8S8
GUT_GENOME237471_00509
GUT_GENOME133742_00945
A0A087BZB2
A0A078AG78
A0A080ZEQ9
A0A077ZIH0
A0A085MIR4
A0A087SI36
A0A014QDJ7
A0A087H791
A0A078GJ37
A0A017T793
A0A090K883
GUT_GENOME103736_00457
A0A024TJ45
A0A017TDE0
A0A093ZE14
A0A088QXQ4
A0A090IGP2
A0A059LRB9
A0A059Y8M0
A0A024HL15
A0A087BPS2
GUT_GENOME168359_01150
A0A010RVR3
GUT_GENOME168176_00924
GUT_GENOME076851_02668
A0A061CZG9
GUT_GENOME095982_00933
GUT_GENOME087940_00533
GUT_GENOME004577_01048
A0A078GIJ5
A0A060PUD8
GUT_GENOME227620_02918
A0A069T019
GUT_GENOME225884_00604
A0A060JKV5
A0A067QLZ3
GUT_GENOME017499_01604
A0A066VMM9
GUT_GENOME213840_00184
GUT_GENOME080363_03060
GUT_GENOME137929_00596
GUT_GENOME134994_02895
GUT_GENOME018750_01292
A0A077X1J6
A0A061H9U6
A0A060RZD6
A0A077MG90
A0A078GDU5
GUT_GENOME240048_01792
GUT_GENOME182432_02265
GUT_GENOME211787_00651
GUT_GENOME188319_00102
A0A061NN85
A0A091EMU3
GUT_GENOME000982_02400
A0A078H1Z4
A0A087SBY1
A0A087HRY4
A0A087H7D5
GUT_GENOME135597_00288
A0A078MCU1
A0A062XZA2
A0A017S1C8
GUT_GENOME018648_01952
A0A086T096
GUT_GENOME238905_00628
GUT_GENOME058885_03386
GUT_GENOME186027_01153
A0A061H4H4
GUT_GENOME247863_01997
A0A084JIR1
GUT_GENOME121767_02623
GUT_GENOME139875_00497
A0A060XIN6
A0A081UT36
A0A091DSU0
A0A087SKI8
A0A060UUZ7
A0A024UE03
A0A090MYR1
A0A081PTD7
GUT_GENOME111392_00907
A0A058ZDV5
A0A086PXD6
A0A088T259
A0A076MTV8
GUT_GENOME022948_00877
GUT_GENOME099237_01434
A0A031IGS0
A0A058ZIQ8
GUT_GENOME096543_00895
A0A061AC63
GUT_GENOME224543_01995
GUT_GENOME046951_01827
GUT_GENOME057810_01215
GUT_GENOME251407_01322
GUT_GENOME203749_01500
GUT_GENOME064010_01217
GUT_GENOME164996_00349
A0A017T7K1
A0A077ZGW8
A0A094AV48
GUT_GENOME000598_02331
GUT_GENOME111124_01195
GUT_GENOME049482_00446
