13 23 155 11
15 2 135 11
27 145 261 11
28 167 289 11
68 16 158 11
87 45 165 11
18 438 531 12
51 278 372 12
59 1756 1832 12
80 432 533 12
18 534 742 13
24 645 855 13
80 542 754 13
24 278 409 25
59 1492 1609 25
75 59 170 25
86 68 185 25
95 153 265 25
2 123 421 34
17 299 627 34
56 315 580 34
61 279 609 34
72 210 535 34
73 432 725 34
74 60 396 34
91 468 798 34
99 142 446 34
