52
7
52
76
52
107
107
107
107
-9
8
8
8
-9
-9
8
1
-9
8
8
8
0
1
8
8
1
13
8
2
3
8
1
2
8
1
8
8
8
8
-9
8
8
13
142
8
52
8
52
52
3
8
106
21
5
106
21
106
5
106
21
8
8
8
8
151
52
52
76
52
52
52
8
1
64
64
-9
64
64
51
64
64
64
64
51
151
52
7
52
52
7
7
52
8
8
8
142
142
142
142
142
142
142
142
142
142
142
142
142
142
142
142
142
142
142
142
142
-9
142
142
142
142
142
142
142
142
142
142
142
142
142
142
142
142
142
142
142
142
142
142
142
52
8
8
52
107
8
8
52
7
76
-9
8
7
-9
76
52
-9
52
7
52
8
1
8
8
8
8
8
8
8
8
11
3
8
52
7
8
8
1
8
3
8
8
8
8
2
8
-9
8
142
142
8
1
8
13
1
8
8
1
8
8
8
8
142
-9
142
8
1
8
8
1
13
8
-9
8
1
-9
1
8
52
8
13
8
13
8
1
52
8
8
8
13
58
8
14
-9
-9
52
52
-9
52
8
1
8
52
52
8
-9
52
-9
52
76
8
8
8
-9
8
52
52
76
8
52
52
-9
52
-9
76
-9
52
7
-9
-9
52
76
52
-9
-9
76
76
7
52
52
-9
7
52
8
8
13
52
-9
7
8
8
8
1
2
8
1
8
1
8
52
8
8
8
142
142
46
-9
142
142
107
56
69
-9
-9
-9
-9
-9
37
142
-9
19
130
20
106
21
142
100
-9
142
106
22
95
8
43
58
151
23
24
64
142
142
107
64
-9
-9
25
-9
114
-9
-9
8
-9
-9
-9
26
-9
-9
26
-9
142
8
13
1
8
8
2
1
52
-9
52
7
8
142
64
130
142
142
107
151
142
-9
142
-9
-9
30
-9
5
106
21
142
142
64
64
107
142
64
142
142
142
142
32
142
107
107
-9
22
142
130
130
-9
55
33
-9
56
34
35
-9
-9
142
142
142
-9
-9
142
46
-9
-9
142
-9
-9
-9
-9
-9
-9
-9
-9
-9
-9
-9
37
-9
-9
37
37
167
37
37
19
-9
-9
-9
-9
167
-9
-9
19
142
-9
130
-9
36
142
107
20
20
20
20
20
142
142
37
64
64
142
-9
38
142
46
142
-9
-9
142
36
-9
107
107
107
41
-9
107
41
40
-9
142
41
40
107
142
142
107
64
-9
43
44
95
8
58
-9
25
-9
95
58
107
-9
142
64
-9
-9
-9
-9
-9
-9
142
-9
-9
-9
-9
142
-9
-9
-9
30
107
142
46
-9
-9
-9
-9
-9
-9
-9
142
46
-9
95
-9
58
64
100
-9
46
107
-9
-9
64
64
64
24
-9
142
48
51
64
-9
142
100
-9
52
142
151
151
-9
151
52
-9
142
107
-9
142
106
142
142
64
107
107
107
107
107
-9
142
142
107
106
142
52
95
58
106
107
107
106
107
107
-9
100
64
142
-9
142
95
43
8
58
95
43
8
58
142
51
49
95
-9
142
-9
-9
8
107
-9
107
107
106
142
142
107
107
107
107
107
142
142
142
5
106
21
-9
-9
-9
-9
-9
64
-9
51
20
48
-9
-9
142
52
142
142
142
107
142
142
142
95
58
-9
-9
-9
-9
-9
-9
-9
-9
-9
-9
-9
-9
142
-9
95
43
58
8
44
107
142
-9
32
-9
106
-9
-9
-9
64
142
-9
-9
25
-9
-9
55
33
-9
56
34
69
-9
25
-9
-9
35
35
-9
-9
138
112
112
95
43
58
107
-9
142
151
64
107
-9
-9
20
20
20
20
20
20
-9
20
20
20
20
-9
-9
-9
-9
-9
-9
-9
52
107
142
8
46
142
142
142
64
142
142
90
-9
52
7
58
142
90
38
142
106
21
95
64
-9
-9
95
43
8
58
-9
-9
142
107
64
-9
64
24
-9
-9
-9
-9
-9
-9
-9
100
100
62
130
142
107
136
107
-9
-9
142
-9
63
142
64
142
64
64
-9
130
142
-9
90
-9
142
44
95
43
8
58
64
64
-9
-9
-9
-9
-9
-9
-9
-9
-9
-9
-9
-9
-9
-9
-9
-9
-9
-9
107
142
107
107
107
58
44
95
43
8
58
107
64
46
46
64
107
107
107
107
169
51
64
142
142
142
46
151
-9
69
-9
64
-9
-9
25
8
8
8
8
142
-9
142
46
142
24
64
107
106
142
142
142
64
100
142
46
106
-9
-9
-9
76
90
-9
-9
-9
-9
-9
-9
-9
-9
-9
-9
-9
22
22
-9
-9
-9
22
70
22
-9
-9
-9
22
-9
-9
142
-9
52
52
7
76
-9
25
25
-9
5
21
72
21
21
142
142
-9
-9
7
52
8
-9
52
8
8
-9
8
52
52
74
8
8
8
8
52
76
52
7
7
8
8
-9
8
75
52
7
8
8
8
1
8
52
8
52
52
52
76
8
7
52
52
-9
76
52
7
-9
119
76
-9
52
-9
7
52
-9
-9
8
13
8
8
7
52
-9
76
52
-9
8
-9
8
8
1
8
8
-9
-9
8
8
8
-9
8
-9
1
1
8
8
8
8
8
-9
8
1
0
8
1
-9
76
8
13
8
52
8
8
8
8
52
76
1
8
-9
-9
8
8
8
-9
119
80
1
1
8
76
-9
-9
-9
8
8
8
2
8
1
142
52
8
-9
-9
8
8
-9
1
-9
8
52
8
52
76
8
52
-9
52
-9
8
8
13
52
-9
52
-9
52
52
8
8
8
8
1
8
-9
-9
7
52
8
7
52
-9
8
-9
-9
-9
8
2
8
1
8
13
8
142
8
2
8
8
-9
7
52
8
8
-9
8
8
8
74
8
8
8
52
52
76
8
8
13
8
8
8
8
1
-9
-9
75
8
52
76
-9
80
52
7
52
-9
62
20
90
-9
-9
142
-9
113
105
105
-9
-9
76
20
20
20
-9
-9
-9
-9
91
-9
38
62
130
-9
37
-9
-9
-9
-9
106
21
106
106
21
-9
107
142
-9
113
130
21
-9
-9
-9
130
52
-9
-9
-9
107
11
62
142
5
106
21
100
100
130
142
142
106
106
106
21
-9
-9
-9
-9
113
113
113
113
-9
-9
113
113
-9
-9
-9
-9
113
-9
107
142
130
100
130
142
106
21
142
130
130
106
106
142
142
106
106
142
52
64
64
64
107
62
142
-9
130
-9
62
-9
-9
62
62
142
-9
107
106
142
62
130
142
-9
52
142
46
62
-9
-9
-9
-9
-9
-9
-9
142
-9
142
142
142
142
142
142
142
-9
-9
95
107
95
8
58
-9
142
130
142
52
-9
-9
62
-9
142
142
46
-9
107
106
21
113
113
113
113
-9
-9
-9
-9
-9
96
142
95
43
8
58
62
142
107
107
-9
142
130
130
130
106
106
21
52
142
106
142
107
107
107
64
-9
62
-9
130
142
107
142
142
62
100
130
62
62
97
-9
106
21
142
107
106
106
21
142
106
21
100
142
64
106
21
107
106
21
130
130
142
106
21
107
21
107
62
142
102
62
-9
106
-9
95
8
58
130
-9
142
142
142
107
107
142
62
62
142
130
-9
46
106
21
130
107
-9
142
-9
64
21
107
-9
107
21
142
-9
130
142
64
-9
130
142
98
46
130
130
107
106
21
-9
107
142
-9
130
95
58
7
52
-9
-9
-9
-9
105
142
142
130
-9
-9
-9
91
107
130
-9
-9
100
142
-9
-9
-9
-9
-9
-9
-9
-9
-9
-9
-9
-9
-9
-9
-9
-9
-9
-9
-9
-9
-9
142
142
46
142
46
130
142
142
142
142
-9
142
102
130
-9
142
142
-9
-9
-9
142
142
142
142
62
-9
-9
142
142
-9
-9
-9
107
142
142
105
142
-9
142
142
142
-9
142
-9
95
58
8
-9
127
-9
107
101
102
142
-9
-9
-9
-9
-9
-9
-9
-9
130
113
105
130
130
95
43
-9
8
58
107
-9
58
113
130
130
130
-9
95
8
58
142
142
-9
-9
130
130
106
106
21
142
142
64
64
127
-9
-9
-9
-9
-9
-9
-9
-9
130
64
100
-9
-9
-9
100
100
100
-9
64
105
142
106
142
52
52
95
58
-9
64
-9
142
142
142
-9
-9
-9
-9
130
104
-9
21
46
-9
142
46
142
-9
-9
106
-9
52
64
-9
62
62
95
58
-9
-9
142
107
-9
105
46
46
95
58
64
-9
91
142
-9
-9
-9
-9
119
52
-9
-9
62
-9
62
62
62
105
106
-9
142
46
142
64
51
-9
52
130
52
7
52
76
48
142
-9
46
130
130
-9
-9
-9
-9
142
142
-9
62
62
62
62
62
-9
-9
130
142
52
52
7
76
-9
46
105
52
-9
7
-9
-9
-9
-9
-9
-9
62
62
-9
62
-9
-9
62
-9
-9
-9
112
-9
58
62
106
130
107
107
142
142
-9
-9
62
64
-9
-9
142
-9
-9
142
107
113
106
106
21
106
46
46
64
64
-9
107
107
142
149
149
62
-9
62
107
106
21
-9
-9
95
8
58
107
-9
-9
48
95
-9
-9
-9
-9
62
142
-9
-9
107
107
-9
-9
-9
-9
64
64
142
142
107
-9
106
21
21
130
-9
-9
52
7
76
142
106
21
-9
142
-9
-9
95
8
58
130
107
-9
7
52
62
-9
142
-9
-9
62
62
142
127
62
95
43
58
8
142
-9
106
21
46
46
46
-9
46
46
46
46
46
46
46
-9
-9
46
46
-9
-9
-9
-9
-9
46
106
-9
142
-9
142
-9
142
130
142
142
-9
-9
-9
-9
58
8
58
8
8
58
8
58
130
8
58
100
46
142
58
8
142
64
142
64
142
142
52
142
-9
-9
-9
-9
105
105
105
105
62
-9
51
106
142
95
58
8
46
130
130
142
142
95
8
58
142
130
106
21
130
130
62
62
46
142
-9
21
107
46
-9
107
95
58
100
100
100
-9
100
142
107
106
142
130
142
106
21
21
-9
106
21
95
8
58
106
21
142
130
130
142
107
7
-9
-9
-9
52
142
46
46
-9
46
-9
142
142
48
107
-9
-9
-9
-9
142
106
21
142
130
-9
-9
-9
-9
142
8
1
142
11
11
106
106
21
-9
46
142
142
110
-9
8
107
-9
113
142
52
7
-9
-9
76
62
62
64
51
-9
142
-9
-9
64
-9
64
24
51
-9
142
130
-9
64
64
142
-9
-9
95
8
-9
142
-9
142
8
111
107
142
130
130
106
21
142
46
95
58
142
106
106
142
52
7
52
-9
105
142
142
106
21
142
142
130
-9
112
138
142
-9
119
-9
130
142
95
58
48
-9
106
21
-9
-9
62
100
100
100
142
142
142
142
52
95
8
58
142
142
-9
49
64
-9
64
-9
-9
-9
-9
62
-9
-9
-9
-9
62
-9
62
-9
-9
-9
-9
-9
-9
-9
95
58
142
-9
72
21
-9
107
-9
100
-9
100
100
142
142
142
-9
-9
49
142
106
142
142
107
142
95
8
58
58
142
142
107
142
20
20
20
20
20
20
20
142
130
149
62
62
62
107
-9
142
62
-9
112
142
21
96
-9
-9
96
-9
96
96
106
-9
114
-9
-9
-9
-9
114
-9
-9
-9
-9
-9
-9
113
113
-9
-9
-9
114
-9
51
95
58
62
107
95
58
142
46
106
-9
52
142
142
106
58
8
142
130
112
115
-9
64
24
-9
-9
142
62
62
-9
142
62
62
46
-9
-9
46
-9
-9
46
127
-9
-9
46
-9
107
107
-9
-9
64
142
107
46
62
52
52
-9
7
-9
1
95
8
58
115
62
62
142
106
21
-9
-9
-9
-9
102
-9
102
102
-9
-9
-9
-9
-9
-9
-9
-9
-9
-9
46
95
58
142
-9
64
130
115
95
8
58
-9
142
95
58
149
62
-9
-9
-9
116
-9
43
95
8
58
70
-9
-9
-9
-9
-9
-9
-9
-9
-9
-9
-9
-9
142
130
130
107
118
105
142
107
106
142
142
142
-9
106
107
107
-9
106
21
-9
-9
-9
-9
-9
113
113
-9
-9
-9
-9
-9
-9
-9
-9
-9
-9
48
48
-9
48
119
64
142
142
-9
-9
-9
107
14
107
107
142
95
58
142
106
-9
106
21
130
106
21
107
142
51
130
104
100
130
106
-9
-9
-9
107
-9
-9
106
62
-9
52
136
136
136
130
130
106
21
8
142
130
130
95
8
58
107
142
46
46
130
130
130
46
127
142
-9
-9
-9
-9
-9
-9
-9
-9
-9
-9
-9
-9
-9
-9
-9
-9
-9
142
107
-9
100
-9
130
100
-9
107
-9
142
106
106
21
142
52
142
110
106
21
106
21
106
21
106
21
107
106
21
97
142
-9
46
-9
-9
-9
118
105
130
-9
142
-9
127
52
142
142
142
128
-9
106
21
127
130
142
127
142
52
-9
52
76
129
142
95
58
142
151
106
21
107
107
101
101
-9
130
64
130
142
142
151
151
142
142
51
64
130
130
142
-9
95
8
58
130
142
130
76
-9
76
142
142
128
142
142
-9
-9
142
142
106
21
-9
-9
46
142
142
132
-9
-9
-9
142
142
142
128
-9
132
142
142
142
-9
142
142
-9
-9
-9
-9
142
142
142
-9
127
127
142
142
107
142
142
130
130
130
106
106
21
97
-9
62
106
21
106
21
-9
62
62
142
130
106
-9
136
62
142
142
-9
46
46
-9
119
7
-9
52
52
-9
105
-9
128
-9
-9
-9
-9
-9
-9
-9
-9
-9
-9
-9
-9
-9
-9
-9
-9
-9
-9
-9
-9
-9
-9
48
48
48
48
-9
-9
-9
-9
127
48
-9
-9
-9
52
46
-9
-9
-9
-9
8
95
58
-9
95
8
8
58
142
-9
46
106
21
100
130
107
-9
21
21
107
-9
-9
142
106
-9
130
142
-9
49
106
-9
95
8
58
-9
62
142
-9
46
107
116
116
-9
112
-9
138
-9
142
64
-9
64
-9
51
142
-9
46
62
62
62
142
62
62
62
62
-9
-9
-9
-9
-9
105
106
142
142
106
130
127
127
142
142
130
-9
-9
62
-9
62
62
62
-9
62
-9
62
62
-9
-9
95
58
62
62
62
62
-9
62
62
62
62
62
62
62
62
62
62
62
-9
-9
100
100
-9
113
8
58
-9
46
58
8
58
8
52
142
130
130
130
-9
100
142
142
142
142
129
142
130
130
46
95
58
142
142
52
52
7
76
-9
-9
-9
142
142
142
-9
-9
142
-9
142
-9
142
-9
-9
-9
-9
-9
-9
142
142
-9
-9
-9
-9
-9
-9
-9
-9
-9
-9
-9
-9
-9
-9
-9
142
142
142
142
142
142
128
128
142
142
142
142
142
-9
46
142
-9
62
142
-9
-9
142
142
142
142
142
142
142
142
142
-9
142
142
142
62
62
142
-9
142
142
-9
52
46
46
100
100
-9
7
52
76
64
142
142
142
52
7
76
130
130
142
-9
58
100
100
142
130
130
-9
142
142
95
8
58
106
21
142
7
52
142
142
106
106
21
142
107
111
142
46
106
21
142
62
62
62
142
8
58
142
58
8
58
58
62
-9
107
142
-9
142
142
111
107
142
-9
62
107
107
142
62
64
-9
46
142
142
-9
-9
98
142
106
21
97
97
97
97
107
62
130
112
142
107
95
95
8
58
106
21
21
62
-9
-9
-9
142
138
-9
-9
-9
-9
105
105
105
130
130
-9
38
-9
142
142
-9
142
142
142
-9
142
142
142
-9
-9
142
142
142
142
142
142
142
130
8
-9
-9
142
-9
142
46
142
-9
64
51
142
142
142
-9
58
142
142
142
-9
-9
127
-9
107
107
-9
142
142
-9
-9
142
62
149
48
142
142
172
116
142
142
142
142
142
142
142
100
-9
107
62
142
136
106
130
-9
-9
-9
-9
130
142
20
20
20
20
20
-9
-9
-9
51
64
64
107
46
100
100
106
-9
142
-9
-9
-9
-9
51
-9
142
151
-9
64
151
-9
130
-9
-9
-9
151
151
23
5
106
21
106
46
142
106
62
62
142
142
151
142
107
142
142
25
142
107
44
95
8
43
58
95
43
8
58
142
64
106
142
-9
127
151
100
142
151
151
23
64
64
-9
51
95
8
43
58
52
25
-9
23
159
-9
-9
64
142
142
142
-9
-9
107
142
25
142
-9
7
-9
52
142
95
43
8
58
142
142
-9
-9
62
142
-9
-9
-9
161
151
-9
106
107
142
142
142
101
142
142
142
151
-9
142
-9
151
-9
107
142
-9
-9
106
90
107
38
-9
-9
-9
-9
107
63
161
151
-9
107
-9
7
119
46
46
46
-9
11
-9
95
58
58
151
151
51
24
-9
-9
-9
-9
-9
-9
-9
-9
-9
-9
-9
-9
-9
-9
-9
-9
64
64
106
159
130
136
151
151
151
-9
23
142
142
142
142
142
142
52
142
-9
107
142
130
102
107
142
107
-9
37
37
167
149
62
107
106
-9
142
-9
107
142
-9
25
-9
-9
-9
-9
43
58
168
-9
90
107
107
107
-9
107
169
107
-9
142
-9
-9
-9
-9
-9
24
-9
142
142
168
106
5
21
21
142
62
106
142
46
-9
-9
-9
-9
-9
-9
-9
142
46
20
25
142
-9
142
136
62
62
46
-9
172
116
-9
43
95
58
107
-9
107
142
127
25
25
107
113
-9
113
69
69
142
107
107
-9
142
52
-9
8
1
8
1
52
52
8
8
1
106
8
8
8
8
8
8
8
8
8
2
8
142
8
58
58
44
-9
95
43
8
58
-9
58
58
43
95
8
58
43
95
8
58
52
-9
-9
-9
8
8
8
8
3
8
8
1
8
1
13
8
13
90
107
107
90
107
-9
107
107
107
107
107
107
100
-9
100
100
100
100
-9
100
-9
8
8
8
52
8
1
8
142
130
-9
130
130
130
130
130
130
52
76
151
151
151
151
151
23
151
8
1
8
1
8
52
8
8
8
8
-9
76
-9
8
8
52
7
52
-9
-9
-9
76
76
80
8
8
