#MC N_sequences average_length std_deviation_AL
0 18 327.778 11.7405
1 19 579.632 88.3588
3 5 118.6 7.14423
5 19 107.211 14.8593
10 8 220.25 28.1192
11 3 329.333 30.0259
13 9 30.4444 2.11403
14 8 326.125 20.8772
18 6 128.5 8.93961
26 50 76.44 8.21744
30 4 92 9.19239
