48 278 409 3
103 1492 1609 3
154 59 170 3
174 68 185 3
178 153 265 3
18 29 156 5
25 16 111 5
38 17 111 5
49 523 623 5
54 84 217 5
55 101 191 5
67 365 488 5
71 3 118 5
86 16 124 5
92 11 95 5
101 290 380 5
102 6 116 5
106 8 100 5
118 342 441 5
131 554 663 5
140 823 941 5
153 254 363 5
170 3 93 5
197 387 519 5
36 613 823 10
44 774 1042 10
103 1212 1426 10
114 805 1023 10
133 1025 1208 10
164 923 1105 10
175 724 951 10
178 934 1186 10
31 336 673 11
36 306 594 11
103 863 1223 11
27 138 167 13
49 432 459 13
67 8 35 13
76 4 33 13
101 209 237 13
131 217 246 13
140 666 697 13
158 31 65 13
197 131 162 13
27 127 448 14
49 432 725 14
67 248 611 14
76 60 396 14
78 123 421 14
131 463 800 14
158 210 535 14
197 299 627 14
111 2 135 18
128 45 165 18
142 23 155 18
148 16 158 18
176 167 289 18
196 145 261 18
26 238 308 26
30 645 734 26
31 839 917 26
33 1379 1473 26
34 165 235 26
36 728 813 26
39 676 740 26
40 246 317 26
41 251 321 26
44 947 1020 26
48 1077 1163 26
50 967 1067 26
79 196 281 26
83 193 259 26
85 236 303 26
87 267 333 26
89 670 748 26
96 220 305 26
97 740 816 26
98 803 879 26
99 517 586 26
103 1331 1409 26
104 1027 1096 26
105 688 779 26
109 885 963 26
110 1959 2028 26
111 255 321 26
112 495 575 26
114 927 1003 26
115 647 723 26
116 215 298 26
128 269 354 26
130 252 331 26
133 1111 1188 26
141 1107 1178 26
142 255 335 26
143 747 819 26
148 248 320 26
156 228 293 26
164 1009 1086 26
166 633 708 26
174 826 902 26
175 856 929 26
176 388 451 26
178 1087 1155 26
180 229 296 26
181 285 350 26
184 230 302 26
187 221 304 26
196 361 429 26
42 278 372 30
50 432 533 30
103 1756 1832 30
141 438 531 30
