    997 -9
    570 1
    289 2
    175 3
    145 4
    127 5
    125 6
    122 7
     92 8
     90 9
     83 10
     79 11
     68 12
     49 13
     46 14
     45 15
     38 16
     35 17
     34 18
     24 19
     22 20
     21 21
     19 22
     16 23
     16 24
     15 25
     14 26
     10 27
      9 28
      9 29
      8 30
      8 31
      8 32
      8 33
      7 34
      7 35
      7 36
      6 38
      6 39
      4 40
      3 41
      4 42
      6 43
      5 46
      5 47
      5 48
      5 49
      7 50
      5 51
      6 52
      5 53
      4 54
      4 55
      3 56
      2 57
      3 58
      3 59
      2 60
      3 61
      3 62
      3 63
      3 64
      3 65
      2 66
      2 67
      2 68
      2 69
      2 70
      2 71
      2 72
      2 74
      2 76
      2 77
      2 78
      2 79
      2 80
      2 81
      2 82
      2 83
      2 84
      2 85
      2 86
      2 88
      2 89
      2 90
      2 91
      2 92
