2600
3100
3300
3303
3601
3800
4000
4101
4400
4900
5000
5002
5400
7600
7601
8501
8701
9200
9601
9700
9900
10100
10400
11001
11101
11400
11600
11601
12801
13000
13300
14101
14201
14300
14801
15601
16402
17501
17600
18001
18101
18401
19600
19700
19701
