22
26
29
30
33
54
58
91
142
149
164
171
185
194
233
268
278
286
294
321
323
325
331
337
338
346
355
358
362
366
385
387
401
412
415
416
461
471
476
483
492
495
496
503
504
532
552
559
562
621
643
653
659
687
691
704
707
708
723
768
777
787
797
807
809
820
822
851
853
874
923
941
943
958
961
975
994
1001
1011
1042
1066
1077
1117
1119
1120
1128
1136
1148
1165
1170
1177
1195
1197
1201
1230
1324
1354
1393
1466
1480
1498
1572
1573
1589
1656
1745
1900
1974
2037
2039
2048
2089
2222
2246
2251
2316
2360
2366
2383
2419
2427
2445
2517
2519
2525
2529
2536
2542
2547
2560
2593
2607
2613
2620
2622
2649
2664
2740
2767
2791
2859
2914
2917
2993
3017
3036
3039
3070
3107
3124
3139
3176
3187
3188
3207
3213
3222
3227
3239
3240
3259
3271
3296
3302
3303
3342
3349
3369
3387
3395
3408
3427
3437
3482
3488
3513
3537
3566
3584
3591
