2500	7	0.538462	5
2600	17	1	0
2601	27	0.25	26
2602	21	0.363636	26
2700	6	0.2	14
3000	30	0.444444	26
3001	7	0.4	-9
3100	18	1	1
3101	18	0.230769	-9
3300	18	1	1
3302	29	0.444444	26
3303	4	1	3
3400	33	0.541667	26
3600	20	0.428571	-9
3601	18	1	1
3800	8	1	5
3900	36	0.59375	26
4000	17	1	0
4001	21	0.444444	26
4002	24	0.333333	-9
4100	21	0.111111	26
4101	17	1	0
4400	18	1	1
4401	24	0.307692	26
4402	3	0.6	3
4800	19	0.384615	-9
4801	15	0.555556	1
4802	2	0.125	10
4803	2	0.8	3
4900	8	1	5
5000	3	1	10
5001	26	0.384615	26
5002	2	1	11
5400	8	1	5
6700	4	0.714286	13
6701	6	0.6	14
7100	2	0.833333	-9
7600	7	1	13
7601	7	1	14
7800	6	0.2	14
7801	4	0.25	13
7900	45	0.533333	26
8300	39	0.387097	26
8500	34	0.25	26
8501	17	1	0
8700	32	0.307692	26
8701	17	1	0
8900	15	0.117647	1
8901	30	0.25	26
9200	8	1	5
9600	44	0.210526	26
9601	2	1	18
9602	19	0.692308	-9
9700	18	1	1
9701	30	0.428571	26
9800	25	0.333333	26
9801	14	0.307692	1
9900	17	1	0
9901	35	0.285714	26
10100	8	1	5
10300	4	0.75	-9
10400	18	1	1
10402	25	0.375	26
10500	16	0.538462	1
10501	14	0.333333	-9
10800	22	0.285714	26
10900	31	0.384615	26
11000	33	0.352941	26
11001	18	1	1
11002	3	0.4	3
11100	34	0.375	26
11101	17	1	0
11102	25	0.555556	26
11200	8	0.75	-9
11400	18	1	1
11401	10	0.272727	-9
11500	20	0.142857	26
11501	31	0.230769	26
11600	46	20	26
11601	2	1	18
11800	3	0.8	14
12800	23	0.444444	26
12801	17	1	0
13000	17	1	0
13001	30	0.363636	26
13100	6	0.5	14
13300	2	1	30
13301	15	0.470588	1
13302	14	0.538462	-9
14000	6	0.555556	13
14001	7	0.571429	5
14003	5	0.25	13
14100	3	0.888889	10
14101	2	1	11
14102	33	0.444444	26
14200	21	0.4375	26
14201	17	1	0
14300	18	1	1
14301	27	0.2	26
14800	29	0.375	26
14801	17	1	0
14802	17	0.333333	26
15600	28	0.142857	26
15601	17	1	0
15800	6	0.4	14
15801	4	0.4	13
16400	14	0.142857	1
16401	23	0.272727	-9
16402	2	1	30
16600	7	0.5	-9
16601	28	0.538462	26
17400	26	0.277778	26
17401	14	0.222222	1
17500	35	0.444444	26
17501	18	1	1
17600	17	1	0
17601	36	0.125	26
17800	15	0.363636	1
17801	39	0.666667	26
18000	41	0.466667	26
18001	17	1	0
18100	33	0.363636	26
18101	17	1	0
18400	28	0.142857	26
18401	17	1	0
18402	28	0.0833333	26
18700	39	0.666667	26
19600	17	1	0
19601	36	0.333333	26
19700	7	1	13
19701	8	1	5
