1 46 356 0
3 10 356 0
4 320 623 0
11 13 332 0
13 23 356 0
15 13 345 0
27 145 464 0
28 168 501 0
29 9 324 0
35 26 346 0
37 16 355 0
54 19 330 0
55 44 380 0
68 9 352 0
83 8 344 0
84 21 350 0
87 37 368 0
97 24 351 0
10 359 951 3
23 757 1207 3
24 452 1176 3
30 566 1123 3
34 1469 2054 3
36 203 822 3
38 301 766 3
46 291 835 3
48 898 1488 3
57 463 1027 3
59 1505 2300 3
64 654 1105 3
70 471 1022 3
76 341 931 3
77 230 898 3
85 245 840 3
86 262 925 3
93 263 783 3
95 710 1182 3
