100	32	0.307692	10
101	17	1	0
200	6	0.2	34
201	5	0.2	7
300	17	1	0
301	19	0.142857	10
302	25	0.25	-9
400	17	1	0
401	42	0.555556	10
500	36	0.444444	10
600	44	0.533333	10
700	20	0.142857	10
701	33	0.230769	10
800	40	0.387097	10
1000	37	0.444444	10
1001	18	1	3
1100	41	0.466667	10
1101	17	1	0
1300	22	0.4375	10
1301	17	1	0
1500	35	0.411765	10
1501	17	1	0
1700	7	1	7
1701	8	1	8
1800	5	0.8	-9
1801	2	1	9
1802	32	0.222222	10
1900	47	20	10
1901	2	1	11
2100	6	0.555556	7
2101	7	0.571429	8
2103	5	0.25	7
2300	2	1	12
2301	15	0.470588	3
2302	16	0.4	10
2303	2	1	13
2304	32	0.25	-9
2305	10	0.4	-9
2400	18	0.333333	-9
2401	15	0.555556	3
2402	2	0.125	-9
2403	2	0.8	25
2700	17	1	0
2701	30	0.3	10
2800	17	1	0
2801	36	0.222222	10
2900	43	0.695652	10
3000	18	1	3
3001	2	1	13
3002	22	0.3	10
3100	8	1	8
3400	35	0.352941	10
3401	18	1	3
3402	3	0.4	25
3500	36	0.5	10
3501	17	1	0
3600	21	0.375	-9
3601	18	1	3
3700	23	0.470588	10
3701	17	1	0
3800	15	0.117647	3
3801	32	0.25	10
3900	7	0.538462	8
4400	31	0.444444	10
4401	6	0.4	-9
4500	21	0.285714	10
4600	18	1	3
4601	32	0.428571	10
4800	18	1	3
4802	32	0.333333	10
4803	4	1	25
4804	27	0.625	-9
4900	8	1	8
5200	3	0.636364	-9
5400	27	0.142857	10
5401	17	1	0
5402	29	0.0833333	10
5500	34	0.363636	10
5501	17	1	0
5600	4	0.8	34
5700	18	1	3
5701	29	0.266667	10
5702	3	0.6	25
5900	4	0.764706	-9
6100	4	0.75	7
6101	6	0.4	34
6200	4	0.857143	34
6300	7	0.470588	-9
6301	29	0.538462	10
6400	14	0.142857	3
6401	24	0.125	-9
6402	2	1	12
6403	24	0.666667	10
6800	31	0.333333	10
6801	17	1	0
6802	15	0.384615	10
6900	44	0.263158	10
6901	2	1	11
7000	18	1	3
7001	13	0.272727	-9
7100	34	0.541667	10
7200	7	1	34
7201	5	0.4	7
7300	8	1	8
7400	7	1	7
7401	7	1	34
7600	18	1	3
7601	18	0.230769	-9
7700	26	0.125	10
7701	14	0.307692	3
7900	8	0.764706	-9
8000	28	0.384615	10
8001	3	0.846154	-9
8002	2	1	9
8200	31	0.307692	10
8300	30	0.222222	10
8301	17	1	0
8400	17	1	0
8401	28	0.363636	10
8500	18	1	3
8501	28	0.3	10
8600	28	0.222222	10
8601	14	0.222222	3
8700	23	0.555556	10
8701	17	1	0
9100	6	0.5	34
9300	16	0.538462	3
9301	17	0.333333	10
9500	15	0.363636	3
9501	41	0.666667	10
9700	17	1	0
9701	28	0.307692	10
9702	19	0.272727	10
9800	8	1	8
9900	6	0.2	34
10000	8	1	8
