%YAML 1.1
%TAG !u! tag:unity3d.com,2011:
--- !u!1 &2257417175697356026
GameObject:
  m_ObjectHideFlags: 0
  m_CorrespondingSourceObject: {fileID: 0}
  m_PrefabInstance: {fileID: 0}
  m_PrefabAsset: {fileID: 0}
  serializedVersion: 6
  m_Component:
  - component: {fileID: 1891623787769919580}
  - component: {fileID: 1027041959524009390}
  m_Layer: 31
  m_Name: Dungeon
  m_TagString: Untagged
  m_Icon: {fileID: 0}
  m_NavMeshLayer: 0
  m_StaticEditorFlags: 0
  m_IsActive: 1
--- !u!4 &1891623787769919580
Transform:
  m_ObjectHideFlags: 0
  m_CorrespondingSourceObject: {fileID: 0}
  m_PrefabInstance: {fileID: 0}
  m_PrefabAsset: {fileID: 0}
  m_GameObject: {fileID: 2257417175697356026}
  m_LocalRotation: {x: 0, y: 0, z: 0, w: 1}
  m_LocalPosition: {x: 0, y: 0, z: 0}
  m_LocalScale: {x: 1, y: 1, z: 1}
  m_Children:
  - {fileID: 4788727243720549147}
  m_Father: {fileID: 0}
  m_RootOrder: 0
  m_LocalEulerAnglesHint: {x: 0, y: 0, z: 0}
--- !u!156049354 &1027041959524009390
Grid:
  m_ObjectHideFlags: 0
  m_CorrespondingSourceObject: {fileID: 0}
  m_PrefabInstance: {fileID: 0}
  m_PrefabAsset: {fileID: 0}
  m_GameObject: {fileID: 2257417175697356026}
  m_Enabled: 1
  m_CellSize: {x: 0.8888889, y: 1.1111112, z: 0}
  m_CellGap: {x: 0, y: 0, z: 0}
  m_CellLayout: 0
  m_CellSwizzle: 0
--- !u!1 &7470910209640489841
GameObject:
  m_ObjectHideFlags: 0
  m_CorrespondingSourceObject: {fileID: 0}
  m_PrefabInstance: {fileID: 0}
  m_PrefabAsset: {fileID: 0}
  serializedVersion: 6
  m_Component:
  - component: {fileID: 4788727243720549147}
  - component: {fileID: 7458322017919058358}
  - component: {fileID: 7443165282308616874}
  m_Layer: 31
  m_Name: Layer1
  m_TagString: Untagged
  m_Icon: {fileID: 0}
  m_NavMeshLayer: 0
  m_StaticEditorFlags: 0
  m_IsActive: 1
--- !u!4 &4788727243720549147
Transform:
  m_ObjectHideFlags: 0
  m_CorrespondingSourceObject: {fileID: 0}
  m_PrefabInstance: {fileID: 0}
  m_PrefabAsset: {fileID: 0}
  m_GameObject: {fileID: 7470910209640489841}
  m_LocalRotation: {x: -0, y: -0, z: -0, w: 1}
  m_LocalPosition: {x: 0, y: 0, z: 0}
  m_LocalScale: {x: 1, y: 1, z: 1}
  m_Children: []
  m_Father: {fileID: 1891623787769919580}
  m_RootOrder: 0
  m_LocalEulerAnglesHint: {x: 0, y: 0, z: 0}
--- !u!1839735485 &7458322017919058358
Tilemap:
  m_ObjectHideFlags: 0
  m_CorrespondingSourceObject: {fileID: 0}
  m_PrefabInstance: {fileID: 0}
  m_PrefabAsset: {fileID: 0}
  m_GameObject: {fileID: 7470910209640489841}
  m_Enabled: 1
  m_Tiles:
  - first: {x: -13, y: -9, z: 0}
    second:
      serializedVersion: 2
      m_TileIndex: 39
      m_TileSpriteIndex: 10
      m_TileMatrixIndex: 0
      m_TileColorIndex: 0
      m_TileObjectToInstantiateIndex: 65535
      m_AllTileFlags: 1073741825
  - first: {x: -5, y: -9, z: 0}
    second:
      serializedVersion: 2
      m_TileIndex: 13
      m_TileSpriteIndex: 17
      m_TileMatrixIndex: 0
      m_TileColorIndex: 0
      m_TileObjectToInstantiateIndex: 65535
      m_AllTileFlags: 1073741825
  - first: {x: -4, y: -9, z: 0}
    second:
      serializedVersion: 2
      m_TileIndex: 12
      m_TileSpriteIndex: 31
      m_TileMatrixIndex: 0
      m_TileColorIndex: 0
      m_TileObjectToInstantiateIndex: 65535
      m_AllTileFlags: 1073741825
  - first: {x: 5, y: -9, z: 0}
    second:
      serializedVersion: 2
      m_TileIndex: 32
      m_TileSpriteIndex: 32
      m_TileMatrixIndex: 0
      m_TileColorIndex: 0
      m_TileObjectToInstantiateIndex: 65535
      m_AllTileFlags: 1073741825
  - first: {x: -10, y: -8, z: 0}
    second:
      serializedVersion: 2
      m_TileIndex: 37
      m_TileSpriteIndex: 36
      m_TileMatrixIndex: 0
      m_TileColorIndex: 0
      m_TileObjectToInstantiateIndex: 65535
      m_AllTileFlags: 1073741825
  - first: {x: -5, y: -8, z: 0}
    second:
      serializedVersion: 2
      m_TileIndex: 11
      m_TileSpriteIndex: 9
      m_TileMatrixIndex: 0
      m_TileColorIndex: 0
      m_TileObjectToInstantiateIndex: 65535
      m_AllTileFlags: 1073741825
  - first: {x: -4, y: -8, z: 0}
    second:
      serializedVersion: 2
      m_TileIndex: 10
      m_TileSpriteIndex: 7
      m_TileMatrixIndex: 0
      m_TileColorIndex: 0
      m_TileObjectToInstantiateIndex: 65535
      m_AllTileFlags: 1073741825
  - first: {x: -1, y: -8, z: 0}
    second:
      serializedVersion: 2
      m_TileIndex: 31
      m_TileSpriteIndex: 39
      m_TileMatrixIndex: 0
      m_TileColorIndex: 0
      m_TileObjectToInstantiateIndex: 65535
      m_AllTileFlags: 1073741825
  - first: {x: -14, y: -6, z: 0}
    second:
      serializedVersion: 2
      m_TileIndex: 14
      m_TileSpriteIndex: 21
      m_TileMatrixIndex: 0
      m_TileColorIndex: 0
      m_TileObjectToInstantiateIndex: 65535
      m_AllTileFlags: 1073741825
  - first: {x: 3, y: -6, z: 0}
    second:
      serializedVersion: 2
      m_TileIndex: 38
      m_TileSpriteIndex: 38
      m_TileMatrixIndex: 0
      m_TileColorIndex: 0
      m_TileObjectToInstantiateIndex: 65535
      m_AllTileFlags: 1073741825
  - first: {x: 5, y: -6, z: 0}
    second:
      serializedVersion: 2
      m_TileIndex: 40
      m_TileSpriteIndex: 40
      m_TileMatrixIndex: 0
      m_TileColorIndex: 0
      m_TileObjectToInstantiateIndex: 65535
      m_AllTileFlags: 1073741825
  - first: {x: -2, y: -5, z: 0}
    second:
      serializedVersion: 2
      m_TileIndex: 36
      m_TileSpriteIndex: 37
      m_TileMatrixIndex: 0
      m_TileColorIndex: 0
      m_TileObjectToInstantiateIndex: 65535
      m_AllTileFlags: 1073741825
  - first: {x: -1, y: -5, z: 0}
    second:
      serializedVersion: 2
      m_TileIndex: 35
      m_TileSpriteIndex: 35
      m_TileMatrixIndex: 0
      m_TileColorIndex: 0
      m_TileObjectToInstantiateIndex: 65535
      m_AllTileFlags: 1073741825
  - first: {x: -14, y: -4, z: 0}
    second:
      serializedVersion: 2
      m_TileIndex: 15
      m_TileSpriteIndex: 16
      m_TileMatrixIndex: 0
      m_TileColorIndex: 0
      m_TileObjectToInstantiateIndex: 65535
      m_AllTileFlags: 1073741825
  - first: {x: -12, y: -4, z: 0}
    second:
      serializedVersion: 2
      m_TileIndex: 16
      m_TileSpriteIndex: 14
      m_TileMatrixIndex: 0
      m_TileColorIndex: 0
      m_TileObjectToInstantiateIndex: 65535
      m_AllTileFlags: 1073741825
  - first: {x: 2, y: -4, z: 0}
    second:
      serializedVersion: 2
      m_TileIndex: 30
      m_TileSpriteIndex: 30
      m_TileMatrixIndex: 0
      m_TileColorIndex: 0
      m_TileObjectToInstantiateIndex: 65535
      m_AllTileFlags: 1073741825
  - first: {x: -8, y: -3, z: 0}
    second:
      serializedVersion: 2
      m_TileIndex: 23
      m_TileSpriteIndex: 24
      m_TileMatrixIndex: 0
      m_TileColorIndex: 0
      m_TileObjectToInstantiateIndex: 65535
      m_AllTileFlags: 1073741825
  - first: {x: -5, y: -3, z: 0}
    second:
      serializedVersion: 2
      m_TileIndex: 28
      m_TileSpriteIndex: 28
      m_TileMatrixIndex: 0
      m_TileColorIndex: 0
      m_TileObjectToInstantiateIndex: 65535
      m_AllTileFlags: 1073741825
  - first: {x: -2, y: -3, z: 0}
    second:
      serializedVersion: 2
      m_TileIndex: 24
      m_TileSpriteIndex: 22
      m_TileMatrixIndex: 0
      m_TileColorIndex: 0
      m_TileObjectToInstantiateIndex: 65535
      m_AllTileFlags: 1073741825
  - first: {x: -1, y: -3, z: 0}
    second:
      serializedVersion: 2
      m_TileIndex: 27
      m_TileSpriteIndex: 29
      m_TileMatrixIndex: 0
      m_TileColorIndex: 0
      m_TileObjectToInstantiateIndex: 65535
      m_AllTileFlags: 1073741825
  - first: {x: -13, y: -2, z: 0}
    second:
      serializedVersion: 2
      m_TileIndex: 9
      m_TileSpriteIndex: 15
      m_TileMatrixIndex: 0
      m_TileColorIndex: 0
      m_TileObjectToInstantiateIndex: 65535
      m_AllTileFlags: 1073741825
  - first: {x: -2, y: -2, z: 0}
    second:
      serializedVersion: 2
      m_TileIndex: 25
      m_TileSpriteIndex: 23
      m_TileMatrixIndex: 0
      m_TileColorIndex: 0
      m_TileObjectToInstantiateIndex: 65535
      m_AllTileFlags: 1073741825
  - first: {x: -1, y: -2, z: 0}
    second:
      serializedVersion: 2
      m_TileIndex: 29
      m_TileSpriteIndex: 27
      m_TileMatrixIndex: 0
      m_TileColorIndex: 0
      m_TileObjectToInstantiateIndex: 65535
      m_AllTileFlags: 1073741825
  - first: {x: 2, y: -2, z: 0}
    second:
      serializedVersion: 2
      m_TileIndex: 34
      m_TileSpriteIndex: 34
      m_TileMatrixIndex: 0
      m_TileColorIndex: 0
      m_TileObjectToInstantiateIndex: 65535
      m_AllTileFlags: 1073741825
  - first: {x: 3, y: -2, z: 0}
    second:
      serializedVersion: 2
      m_TileIndex: 33
      m_TileSpriteIndex: 33
      m_TileMatrixIndex: 0
      m_TileColorIndex: 0
      m_TileObjectToInstantiateIndex: 65535
      m_AllTileFlags: 1073741825
  - first: {x: -13, y: -1, z: 0}
    second:
      serializedVersion: 2
      m_TileIndex: 6
      m_TileSpriteIndex: 11
      m_TileMatrixIndex: 0
      m_TileColorIndex: 0
      m_TileObjectToInstantiateIndex: 65535
      m_AllTileFlags: 1073741825
  - first: {x: -8, y: -1, z: 0}
    second:
      serializedVersion: 2
      m_TileIndex: 8
      m_TileSpriteIndex: 13
      m_TileMatrixIndex: 0
      m_TileColorIndex: 0
      m_TileObjectToInstantiateIndex: 65535
      m_AllTileFlags: 1073741825
  - first: {x: -7, y: -1, z: 0}
    second:
      serializedVersion: 2
      m_TileIndex: 7
      m_TileSpriteIndex: 12
      m_TileMatrixIndex: 0
      m_TileColorIndex: 0
      m_TileObjectToInstantiateIndex: 65535
      m_AllTileFlags: 1073741825
  - first: {x: 3, y: -1, z: 0}
    second:
      serializedVersion: 2
      m_TileIndex: 26
      m_TileSpriteIndex: 26
      m_TileMatrixIndex: 0
      m_TileColorIndex: 0
      m_TileObjectToInstantiateIndex: 65535
      m_AllTileFlags: 1073741825
  - first: {x: -8, y: 0, z: 0}
    second:
      serializedVersion: 2
      m_TileIndex: 5
      m_TileSpriteIndex: 8
      m_TileMatrixIndex: 0
      m_TileColorIndex: 0
      m_TileObjectToInstantiateIndex: 65535
      m_AllTileFlags: 1073741825
  - first: {x: -7, y: 0, z: 0}
    second:
      serializedVersion: 2
      m_TileIndex: 4
      m_TileSpriteIndex: 6
      m_TileMatrixIndex: 0
      m_TileColorIndex: 0
      m_TileObjectToInstantiateIndex: 65535
      m_AllTileFlags: 1073741825
  - first: {x: -3, y: 0, z: 0}
    second:
      serializedVersion: 2
      m_TileIndex: 22
      m_TileSpriteIndex: 25
      m_TileMatrixIndex: 0
      m_TileColorIndex: 0
      m_TileObjectToInstantiateIndex: 65535
      m_AllTileFlags: 1073741825
  - first: {x: -1, y: 0, z: 0}
    second:
      serializedVersion: 2
      m_TileIndex: 21
      m_TileSpriteIndex: 18
      m_TileMatrixIndex: 0
      m_TileColorIndex: 0
      m_TileObjectToInstantiateIndex: 65535
      m_AllTileFlags: 1073741825
  - first: {x: 2, y: 0, z: 0}
    second:
      serializedVersion: 2
      m_TileIndex: 20
      m_TileSpriteIndex: 20
      m_TileMatrixIndex: 0
      m_TileColorIndex: 0
      m_TileObjectToInstantiateIndex: 65535
      m_AllTileFlags: 1073741825
  - first: {x: 3, y: 0, z: 0}
    second:
      serializedVersion: 2
      m_TileIndex: 19
      m_TileSpriteIndex: 19
      m_TileMatrixIndex: 0
      m_TileColorIndex: 0
      m_TileObjectToInstantiateIndex: 65535
      m_AllTileFlags: 1073741825
  m_AnimatedTiles: {}
  m_TileAssetArray:
  - m_RefCount: 0
    m_Data: {fileID: 0}
  - m_RefCount: 0
    m_Data: {fileID: 0}
  - m_RefCount: 0
    m_Data: {fileID: 0}
  - m_RefCount: 0
    m_Data: {fileID: 0}
  - m_RefCount: 1
    m_Data: {fileID: 11400000, guid: f451d7f9590eae04986cb2721ad0ca4b, type: 2}
  - m_RefCount: 1
    m_Data: {fileID: 11400000, guid: 5e25263881db6ab44aa94722ecff6a5c, type: 2}
  - m_RefCount: 1
    m_Data: {fileID: 11400000, guid: ff249c89ce5a3094893b574ca0e23908, type: 2}
  - m_RefCount: 1
    m_Data: {fileID: 11400000, guid: bdf1299a01e389c4f9e16aafbda4b347, type: 2}
  - m_RefCount: 1
    m_Data: {fileID: 11400000, guid: 1012060573bbd8f43aff1000e8d4c414, type: 2}
  - m_RefCount: 1
    m_Data: {fileID: 11400000, guid: af73c59eb6e632145a1aae6d594cae6a, type: 2}
  - m_RefCount: 1
    m_Data: {fileID: 11400000, guid: f751281bbe17ab0439defecbc7619bce, type: 2}
  - m_RefCount: 1
    m_Data: {fileID: 11400000, guid: 20cb9fc8f257f27488d5d517ebf08e39, type: 2}
  - m_RefCount: 1
    m_Data: {fileID: 11400000, guid: 06ce546ed92d0894db86aaba9c7e73a2, type: 2}
  - m_RefCount: 1
    m_Data: {fileID: 11400000, guid: b2588876844071e4faace212cf987d52, type: 2}
  - m_RefCount: 1
    m_Data: {fileID: 11400000, guid: f68ddfab5d50fc949a587bb38aa91304, type: 2}
  - m_RefCount: 1
    m_Data: {fileID: 11400000, guid: ca0aca6b8a420c14abf019ba78517dcb, type: 2}
  - m_RefCount: 1
    m_Data: {fileID: 11400000, guid: 84da792de0b4b5f4da20f055dc46a76e, type: 2}
  - m_RefCount: 0
    m_Data: {fileID: 0}
  - m_RefCount: 0
    m_Data: {fileID: 0}
  - m_RefCount: 1
    m_Data: {fileID: 11400000, guid: 06b4d56fa0ef2d1499e3cee938146d57, type: 2}
  - m_RefCount: 1
    m_Data: {fileID: 11400000, guid: 37b0c26914a014349b1f5d598e9c353a, type: 2}
  - m_RefCount: 1
    m_Data: {fileID: 11400000, guid: f05f615205660cc4bbd2ebdf65734faa, type: 2}
  - m_RefCount: 1
    m_Data: {fileID: 11400000, guid: 66d649f1f1b51a7439896ecfab902647, type: 2}
  - m_RefCount: 1
    m_Data: {fileID: 11400000, guid: ef901f2a4a716cf4ebcb87100593c9bd, type: 2}
  - m_RefCount: 1
    m_Data: {fileID: 11400000, guid: ac58996b9361076489dc25dfaab169e8, type: 2}
  - m_RefCount: 1
    m_Data: {fileID: 11400000, guid: 4ce616c5dea643c4db38cb28c59257a0, type: 2}
  - m_RefCount: 1
    m_Data: {fileID: 11400000, guid: e844c37e41eb3c844b2cfa2763835209, type: 2}
  - m_RefCount: 1
    m_Data: {fileID: 11400000, guid: 3fa21fa12bda4b44c9617573d0c9dd69, type: 2}
  - m_RefCount: 1
    m_Data: {fileID: 11400000, guid: 2efc0051446beda458d16e49a884ad44, type: 2}
  - m_RefCount: 1
    m_Data: {fileID: 11400000, guid: e4f63cec9b4142e458ce564111430e12, type: 2}
  - m_RefCount: 1
    m_Data: {fileID: 11400000, guid: 0a519c2d1cc60bb4bb8614f626187a6f, type: 2}
  - m_RefCount: 1
    m_Data: {fileID: 11400000, guid: 5ed4c6e11f6f37d4b8567af7b546962f, type: 2}
  - m_RefCount: 1
    m_Data: {fileID: 11400000, guid: e00c24162120e4c418bb7495db45fc29, type: 2}
  - m_RefCount: 1
    m_Data: {fileID: 11400000, guid: 9bf15ea50eae6724dbddf00b3b6f6f59, type: 2}
  - m_RefCount: 1
    m_Data: {fileID: 11400000, guid: 1579cb4d5d2d3564cbd6d3ead960c283, type: 2}
  - m_RefCount: 1
    m_Data: {fileID: 11400000, guid: 3eb4a54ae4bc8d342b739755a0deeff3, type: 2}
  - m_RefCount: 1
    m_Data: {fileID: 11400000, guid: 191df5822a9a25b4095076106773c96c, type: 2}
  - m_RefCount: 1
    m_Data: {fileID: 11400000, guid: d4c57ec8971ce5141a072462771bb647, type: 2}
  - m_RefCount: 1
    m_Data: {fileID: 11400000, guid: 5f09475cd83aa0a45acaa9bd387a0579, type: 2}
  - m_RefCount: 1
    m_Data: {fileID: 11400000, guid: 762b84366bbf7af47923b642381bda2c, type: 2}
  - m_RefCount: 1
    m_Data: {fileID: 11400000, guid: 152b55d8aff65994bbf54d27f6f2e6f2, type: 2}
  m_TileSpriteArray:
  - m_RefCount: 0
    m_Data: {fileID: 0}
  - m_RefCount: 0
    m_Data: {fileID: 0}
  - m_RefCount: 0
    m_Data: {fileID: 0}
  - m_RefCount: 0
    m_Data: {fileID: 0}
  - m_RefCount: 0
    m_Data: {fileID: 0}
  - m_RefCount: 0
    m_Data: {fileID: 0}
  - m_RefCount: 1
    m_Data: {fileID: -8746033620184659114, guid: a340e6c0da7229341b7c20e67f163c70,
      type: 3}
  - m_RefCount: 1
    m_Data: {fileID: -3230975458514250041, guid: a340e6c0da7229341b7c20e67f163c70,
      type: 3}
  - m_RefCount: 1
    m_Data: {fileID: 1084784950523803941, guid: a340e6c0da7229341b7c20e67f163c70,
      type: 3}
  - m_RefCount: 1
    m_Data: {fileID: 2728243367429221048, guid: a340e6c0da7229341b7c20e67f163c70,
      type: 3}
  - m_RefCount: 1
    m_Data: {fileID: 6436560349361112449, guid: a340e6c0da7229341b7c20e67f163c70,
      type: 3}
  - m_RefCount: 1
    m_Data: {fileID: 6420404250380019895, guid: a340e6c0da7229341b7c20e67f163c70,
      type: 3}
  - m_RefCount: 1
    m_Data: {fileID: 1794310841801812479, guid: a340e6c0da7229341b7c20e67f163c70,
      type: 3}
  - m_RefCount: 1
    m_Data: {fileID: 4558597556851542799, guid: a340e6c0da7229341b7c20e67f163c70,
      type: 3}
  - m_RefCount: 1
    m_Data: {fileID: 1270211227817927925, guid: a340e6c0da7229341b7c20e67f163c70,
      type: 3}
  - m_RefCount: 1
    m_Data: {fileID: 6971619310513607880, guid: a340e6c0da7229341b7c20e67f163c70,
      type: 3}
  - m_RefCount: 1
    m_Data: {fileID: -6093401293372397660, guid: a340e6c0da7229341b7c20e67f163c70,
      type: 3}
  - m_RefCount: 1
    m_Data: {fileID: 4545685854912230521, guid: a340e6c0da7229341b7c20e67f163c70,
      type: 3}
  - m_RefCount: 1
    m_Data: {fileID: -8060929843619916789, guid: a340e6c0da7229341b7c20e67f163c70,
      type: 3}
  - m_RefCount: 1
    m_Data: {fileID: -5624414064620405630, guid: a340e6c0da7229341b7c20e67f163c70,
      type: 3}
  - m_RefCount: 1
    m_Data: {fileID: -8199437182966303622, guid: a340e6c0da7229341b7c20e67f163c70,
      type: 3}
  - m_RefCount: 1
    m_Data: {fileID: -5058788211806469395, guid: a340e6c0da7229341b7c20e67f163c70,
      type: 3}
  - m_RefCount: 1
    m_Data: {fileID: -4354237494524392354, guid: a340e6c0da7229341b7c20e67f163c70,
      type: 3}
  - m_RefCount: 1
    m_Data: {fileID: -257014355559042649, guid: a340e6c0da7229341b7c20e67f163c70,
      type: 3}
  - m_RefCount: 1
    m_Data: {fileID: 2108976282551558751, guid: a340e6c0da7229341b7c20e67f163c70,
      type: 3}
  - m_RefCount: 1
    m_Data: {fileID: 8960572527511170056, guid: a340e6c0da7229341b7c20e67f163c70,
      type: 3}
  - m_RefCount: 1
    m_Data: {fileID: 2609174863554348470, guid: a340e6c0da7229341b7c20e67f163c70,
      type: 3}
  - m_RefCount: 1
    m_Data: {fileID: 290047839109599427, guid: a340e6c0da7229341b7c20e67f163c70, type: 3}
  - m_RefCount: 1
    m_Data: {fileID: -2917350023695644350, guid: a340e6c0da7229341b7c20e67f163c70,
      type: 3}
  - m_RefCount: 1
    m_Data: {fileID: 2664481278081565330, guid: a340e6c0da7229341b7c20e67f163c70,
      type: 3}
  - m_RefCount: 1
    m_Data: {fileID: 3610339231219930621, guid: a340e6c0da7229341b7c20e67f163c70,
      type: 3}
  - m_RefCount: 1
    m_Data: {fileID: -3023061875091369103, guid: a340e6c0da7229341b7c20e67f163c70,
      type: 3}
  - m_RefCount: 1
    m_Data: {fileID: -1967943382963979276, guid: a340e6c0da7229341b7c20e67f163c70,
      type: 3}
  - m_RefCount: 1
    m_Data: {fileID: 4810687501681150605, guid: a340e6c0da7229341b7c20e67f163c70,
      type: 3}
  - m_RefCount: 1
    m_Data: {fileID: 3283300695089771475, guid: a340e6c0da7229341b7c20e67f163c70,
      type: 3}
  - m_RefCount: 1
    m_Data: {fileID: -1313345583907432619, guid: a340e6c0da7229341b7c20e67f163c70,
      type: 3}
  - m_RefCount: 1
    m_Data: {fileID: -1622683439983695371, guid: a340e6c0da7229341b7c20e67f163c70,
      type: 3}
  - m_RefCount: 1
    m_Data: {fileID: 8930077307140411828, guid: a340e6c0da7229341b7c20e67f163c70,
      type: 3}
  - m_RefCount: 1
    m_Data: {fileID: -5745523329672321289, guid: a340e6c0da7229341b7c20e67f163c70,
      type: 3}
  - m_RefCount: 1
    m_Data: {fileID: 6765227283418963874, guid: a340e6c0da7229341b7c20e67f163c70,
      type: 3}
  - m_RefCount: 1
    m_Data: {fileID: -1776575400403690255, guid: a340e6c0da7229341b7c20e67f163c70,
      type: 3}
  m_TileMatrixArray:
  - m_RefCount: 35
    m_Data:
      e00: 1
      e01: 0
      e02: 0
      e03: 0
      e10: 0
      e11: 1
      e12: 0
      e13: 0
      e20: 0
      e21: 0
      e22: 1
      e23: 0
      e30: 0
      e31: 0
      e32: 0
      e33: 1
  m_TileColorArray:
  - m_RefCount: 35
    m_Data: {r: 1, g: 1, b: 1, a: 1}
  m_TileObjectToInstantiateArray: []
  m_AnimationFrameRate: 1
  m_Color: {r: 1, g: 1, b: 1, a: 1}
  m_Origin: {x: -14, y: -9, z: 0}
  m_Size: {x: 28, y: 17, z: 1}
  m_TileAnchor: {x: 0.5, y: 0.5, z: 0}
  m_TileOrientation: 0
  m_TileOrientationMatrix:
    e00: 1
    e01: 0
    e02: 0
    e03: 0
    e10: 0
    e11: 1
    e12: 0
    e13: 0
    e20: 0
    e21: 0
    e22: 1
    e23: 0
    e30: 0
    e31: 0
    e32: 0
    e33: 1
--- !u!483693784 &7443165282308616874
TilemapRenderer:
  m_ObjectHideFlags: 0
  m_CorrespondingSourceObject: {fileID: 0}
  m_PrefabInstance: {fileID: 0}
  m_PrefabAsset: {fileID: 0}
  m_GameObject: {fileID: 7470910209640489841}
  m_Enabled: 0
  m_CastShadows: 0
  m_ReceiveShadows: 0
  m_DynamicOccludee: 0
  m_MotionVectors: 1
  m_LightProbeUsage: 0
  m_ReflectionProbeUsage: 0
  m_RayTracingMode: 0
  m_RenderingLayerMask: 1
  m_RendererPriority: 0
  m_Materials:
  - {fileID: 10754, guid: 0000000000000000f000000000000000, type: 0}
  m_StaticBatchInfo:
    firstSubMesh: 0
    subMeshCount: 0
  m_StaticBatchRoot: {fileID: 0}
  m_ProbeAnchor: {fileID: 0}
  m_LightProbeVolumeOverride: {fileID: 0}
  m_ScaleInLightmap: 1
  m_ReceiveGI: 1
  m_PreserveUVs: 0
  m_IgnoreNormalsForChartDetection: 0
  m_ImportantGI: 0
  m_StitchLightmapSeams: 1
  m_SelectedEditorRenderState: 0
  m_MinimumChartSize: 4
  m_AutoUVMaxDistance: 0.5
  m_AutoUVMaxAngle: 89
  m_LightmapParameters: {fileID: 0}
  m_SortingLayerID: 0
  m_SortingLayer: 0
  m_SortingOrder: 0
  m_ChunkSize: {x: 32, y: 32, z: 32}
  m_ChunkCullingBounds: {x: 0.61111116, y: 0.7777778, z: 0}
  m_MaxChunkCount: 16
  m_MaxFrameAge: 16
  m_SortOrder: 0
  m_Mode: 0
  m_DetectChunkCullingBounds: 0
  m_MaskInteraction: 0
--- !u!114 &4626804143359688166
MonoBehaviour:
  m_ObjectHideFlags: 0
  m_CorrespondingSourceObject: {fileID: 0}
  m_PrefabInstance: {fileID: 0}
  m_PrefabAsset: {fileID: 0}
  m_GameObject: {fileID: 0}
  m_Enabled: 1
  m_EditorHideFlags: 0
  m_Script: {fileID: 12395, guid: 0000000000000000e000000000000000, type: 0}
  m_Name: Palette Settings
  m_EditorClassIdentifier: 
  cellSizing: 0
