<?xml version="1.0"?>
<robot xmlns:xacro="http://www.ros.org/wiki/xacro" name="kuka_lwr4plus">

  <xacro:macro name="rbc_kuka_lwr_arm_joint" params="joint_num">

<!-- data_in names must match msg fields -->
      <rbc_data_from_robot data_in="position torque" data_out="q effort" data_out_extra="qd qdd"/>
      <!-- data_out names must match msg fields -->
      <rbc_data_to_robot data_in="q_ref stiffness damping" data_out="angle stiffness kp" data_in_extra="qd_ref"/>
      <rbc_ros2_node name="kuka_lwr4plus_sim"/>
      <rbc_ros2_topic name_from_robot="kuka_lwr4plus_sim/out" name_to_robot="kuka_lwr4plus_sim/in"/>
      <rbc_ros2_topic_pos pos_from_robot="${joint_num}" pos_to_robot="${joint_num}"/>
      <rbc_ros2_topic_msg from_robot="ArmStatus" to_robot="ArmCommand"/>

  </xacro:macro>

</robot>
