@startuml api_components

!define AWSPuml https://raw.githubusercontent.com/awslabs/aws-icons-for-plantuml/v15.0/dist
!include AWSPuml/AWSCommon.puml
!include AWSPuml/ApplicationIntegration/APIGateway.puml
!include AWSPuml/SecurityIdentityCompliance/Cognito.puml
!include AWSPuml/Compute/Lambda.puml
!include AWSPuml/Compute/EC2Instance.puml

' Uncomment the following line to create simplified view
'!include AWSPuml/AWSSimplified.puml

APIGateway(archie_api_gw,"Archie","regional")
Lambda(api_gateway_authorizer,"API Gateway Athorizer","Python")
Cognito(archie_users_pool,"Archie Users Pool","")
Lambda(ingest_files_lambda,"Ingest Files","Python")
Lambda(edit_doc_lambda,"Edit Doc","Python")
Lambda(delete_doc_lambda,"Delete Doc","Python")
Lambda(reports_lambda,"Reports Generator","Python")
Lambda(folder_browser_lambda,"Folder Browser","Python")
EC2Instance(apache_solr,"Apache Solr","Java search platform")

archie_api_gw -> api_gateway_authorizer
api_gateway_authorizer -> archie_users_pool
archie_api_gw --> apache_solr: http integration
archie_api_gw --> ingest_files_lambda
archie_api_gw --> edit_doc_lambda
archie_api_gw --> delete_doc_lambda
archie_api_gw --> reports_lambda
archie_api_gw --> folder_browser_lambda

@enduml