[
  {
    "outputFileName": "js/libs/backbone/backbone.js",
    "inputFiles": [
      "js/libs/backbone/backbone.js"
    ]
  },
  {
    "outputFileName": "js/libs/plugins/owl.carousel.js",
    "inputFiles": [
      "js/libs/plugins/owl.carousel.js"
    ]
  },
  {
    "outputFileName": "js/libs/lazy/lazy-bundle.js",
    "inputFiles": [
      "js/libs/lazy/lazy.js",
      "js/libs/lazy/lazy-builder.js",
      "js/libs/lazy/promise-adaptor-jquery.js"
    ]
  },
  {
    "outputFileName": "js/libs/bootstrap/bootstrap-validator.js",
    "inputFiles": [
      "js/libs/bootstrap/bootstrap-validator.js"
    ]
  },
  {
    "outputFileName": "css/libs/owl-bundle.css",
    "inputFiles": [
      "css/libs/owl.carousel.css",
      "css/libs/owl.theme.css",
      "css/libs/owl.transitions.css"
    ]
  },
  {
    "outputFileName": "css/libs/bundle.css",
    "inputFiles": [
      "css/libs/bootstrap.css",
      "css/libs/bootstrap-table.css",
      "css/libs/bootstrap-star-rating.css",
      "css/libs/bootstrap-datetimepicker.css",
      "css/libs/select2.min.css",
      "css/libs/bars-movie.css",
      "css/libs/fontawesome-stars.css",
      "css/libs/summernote.css",
      "css/libs/jquery.circliful.css",
      "css/libs/loader.css"
    ],
    "sourceMap": true
  },
  {
    "outputFileName": "js/libs/bootstrap/bootstrap-table.min.js",
    "inputFiles": [
      "js/libs/bootstrap/bootstrap-table.js"
    ]
  }
]
