# WaveFront *.obj file (generated by Autodesk ATF)

mtllib Piedra Porosa.mtl

g Solid1

v 0.000000 0.000000 -19.000000
v 0.638278 0.000000 -18.989276
v 1.275836 0.000000 -18.957116
v 1.911954 0.000000 -18.903556
v 2.545913 0.000000 -18.828657
v 3.176999 0.000000 -18.732503
v 3.804498 0.000000 -18.615203
v 4.427702 0.000000 -18.476890
v 5.045908 0.000000 -18.317718
v 5.658418 0.000000 -18.137869
v 6.264541 0.000000 -17.937545
v 6.863592 0.000000 -17.716972
v 7.454895 0.000000 -17.476400
v 8.037782 0.000000 -17.216099
v 8.611596 0.000000 -16.936364
v 9.175689 0.000000 -16.637510
v 9.729424 0.000000 -16.319875
v 10.272176 0.000000 -15.983817
v 10.803332 0.000000 -15.629716
v 11.322292 0.000000 -15.257972
v 11.828472 0.000000 -14.869003
v 12.321299 0.000000 -14.463250
v 12.800217 0.000000 -14.041169
v 13.264686 0.000000 -13.603239
v 13.714181 0.000000 -13.149952
v 14.148194 0.000000 -12.681821
v 14.566237 0.000000 -12.199375
v 14.967836 0.000000 -11.703157
v 15.352539 0.000000 -11.193728
v 15.719911 0.000000 -10.671663
v 16.069538 0.000000 -10.137551
v 16.401025 0.000000 -9.591995
v 16.713998 0.000000 -9.035612
v 17.008103 0.000000 -8.469029
v 17.283008 0.000000 -7.892885
v 17.538403 0.000000 -7.307832
v 17.774001 0.000000 -6.714529
v 17.989534 0.000000 -6.113647
v 18.184759 0.000000 -5.505863
v 18.359457 0.000000 -4.891863
v 18.513430 0.000000 -4.272342
v 18.646504 0.000000 -3.647998
v 18.758529 0.000000 -3.019536
v 18.849378 0.000000 -2.387665
v 18.918949 0.000000 -1.753099
v 18.967164 0.000000 -1.116554
v 18.993967 0.000000 -0.478748
v 18.999330 0.000000 0.159598
v 18.983245 0.000000 0.797764
v 18.945730 0.000000 1.435029
v 18.886829 0.000000 2.070674
v 18.806607 0.000000 2.703982
v 18.705156 0.000000 3.334237
v 18.582589 0.000000 3.960729
v 18.439046 0.000000 4.582750
v 18.274687 0.000000 5.199597
v 18.089699 0.000000 5.810575
v 17.884291 0.000000 6.414993
v 17.658694 0.000000 7.012170
v 17.413163 0.000000 7.601431
v 17.147975 0.000000 8.182112
v 16.863430 0.000000 8.753556
v 16.559848 0.000000 9.315118
v 16.237573 0.000000 9.866165
v 15.896968 0.000000 10.406075
v 15.538418 0.000000 10.934238
v 15.162327 0.000000 11.450058
v 14.769121 0.000000 11.952953
v 14.359242 0.000000 12.442354
v 13.933154 0.000000 12.917710
v 13.491337 0.000000 13.378484
v 13.034291 0.000000 13.824155
v 12.562531 0.000000 14.254221
v 12.076590 0.000000 14.668196
v 11.577016 0.000000 15.065613
v 11.064373 0.000000 15.446024
v 10.539241 0.000000 15.808998
v 10.002211 0.000000 16.154126
v 9.453890 0.000000 16.481018
v 8.894898 0.000000 16.789306
v 8.325864 0.000000 17.078641
v 7.747432 0.000000 17.348697
v 7.160254 0.000000 17.599170
v 6.564993 0.000000 17.829775
v 5.962321 0.000000 18.040253
v 5.352919 0.000000 18.230366
v 4.737474 0.000000 18.399901
v 4.116681 0.000000 18.548664
v 3.491241 0.000000 18.676489
v 2.861860 0.000000 18.783231
v 2.229248 0.000000 18.868769
v 1.594120 0.000000 18.933008
v 0.957192 0.000000 18.975874
v 0.319184 0.000000 18.997319
v -0.319184 0.000000 18.997319
v -0.957192 0.000000 18.975874
v -1.594120 0.000000 18.933008
v -2.229248 0.000000 18.868769
v -2.861860 0.000000 18.783231
v -3.491241 0.000000 18.676489
v -4.116681 0.000000 18.548664
v -4.737474 0.000000 18.399901
v -5.352919 0.000000 18.230366
v -5.962321 0.000000 18.040253
v -6.564993 0.000000 17.829775
v -7.160254 0.000000 17.599170
v -7.747432 0.000000 17.348697
v -8.325864 0.000000 17.078641
v -8.894898 0.000000 16.789306
v -9.453890 0.000000 16.481018
v -10.002211 0.000000 16.154126
v -10.539241 0.000000 15.808998
v -11.064373 0.000000 15.446024
v -11.577016 0.000000 15.065613
v -12.076590 0.000000 14.668196
v -12.562531 0.000000 14.254221
v -13.034291 0.000000 13.824155
v -13.491337 0.000000 13.378484
v -13.933154 0.000000 12.917710
v -14.359242 0.000000 12.442354
v -14.769121 0.000000 11.952953
v -15.162327 0.000000 11.450058
v -15.538418 0.000000 10.934238
v -15.896968 0.000000 10.406075
v -16.237573 0.000000 9.866165
v -16.559848 0.000000 9.315118
v -16.863430 0.000000 8.753556
v -17.147975 0.000000 8.182112
v -17.413163 0.000000 7.601431
v -17.658694 0.000000 7.012170
v -17.884291 0.000000 6.414993
v -18.089699 0.000000 5.810575
v -18.274687 0.000000 5.199597
v -18.439046 0.000000 4.582750
v -18.582589 0.000000 3.960729
v -18.705156 0.000000 3.334237
v -18.806607 0.000000 2.703982
v -18.886829 0.000000 2.070674
v -18.945730 0.000000 1.435029
v -18.983245 0.000000 0.797764
v -18.999330 0.000000 0.159598
v -18.993967 0.000000 -0.478748
v -18.967164 0.000000 -1.116554
v -18.918949 0.000000 -1.753099
v -18.849378 0.000000 -2.387665
v -18.758529 0.000000 -3.019536
v -18.646504 0.000000 -3.647998
v -18.513430 0.000000 -4.272342
v -18.359457 0.000000 -4.891863
v -18.184759 0.000000 -5.505863
v -17.989534 0.000000 -6.113647
v -17.774001 0.000000 -6.714529
v -17.538403 0.000000 -7.307832
v -17.283008 0.000000 -7.892885
v -17.008103 0.000000 -8.469029
v -16.713998 0.000000 -9.035612
v -16.401025 0.000000 -9.591995
v -16.069538 0.000000 -10.137551
v -15.719911 0.000000 -10.671663
v -15.352539 0.000000 -11.193728
v -14.967836 0.000000 -11.703157
v -14.566237 0.000000 -12.199375
v -14.148194 0.000000 -12.681821
v -13.714181 0.000000 -13.149952
v -13.264686 0.000000 -13.603239
v -12.800217 0.000000 -14.041169
v -12.321299 0.000000 -14.463250
v -11.828472 0.000000 -14.869003
v -11.322292 0.000000 -15.257972
v -10.803332 0.000000 -15.629716
v -10.272176 0.000000 -15.983817
v -9.729424 0.000000 -16.319875
v -9.175689 0.000000 -16.637510
v -8.611596 0.000000 -16.936364
v -8.037782 0.000000 -17.216099
v -7.454895 0.000000 -17.476400
v -6.863592 0.000000 -17.716972
v -6.264541 0.000000 -17.937545
v -5.658418 0.000000 -18.137869
v -5.045908 0.000000 -18.317718
v -4.427702 0.000000 -18.476890
v -3.804498 0.000000 -18.615203
v -3.176999 0.000000 -18.732503
v -2.545913 0.000000 -18.828657
v -1.911954 0.000000 -18.903556
v -1.275836 0.000000 -18.957116
v -0.638278 0.000000 -18.989276
v 0.000000 4.000000 -19.000000
v -0.638278 4.000000 -18.989276
v -1.275836 4.000000 -18.957116
v -1.911954 4.000000 -18.903556
v -2.545913 4.000000 -18.828657
v -3.176999 4.000000 -18.732503
v -3.804498 4.000000 -18.615203
v -4.427702 4.000000 -18.476890
v -5.045908 4.000000 -18.317718
v -5.658418 4.000000 -18.137869
v -6.264541 4.000000 -17.937545
v -6.863592 4.000000 -17.716972
v -7.454895 4.000000 -17.476400
v -8.037782 4.000000 -17.216099
v -8.611596 4.000000 -16.936364
v -9.175689 4.000000 -16.637510
v -9.729424 4.000000 -16.319875
v -10.272176 4.000000 -15.983817
v -10.803332 4.000000 -15.629716
v -11.322292 4.000000 -15.257972
v -11.828472 4.000000 -14.869003
v -12.321299 4.000000 -14.463250
v -12.800217 4.000000 -14.041169
v -13.264686 4.000000 -13.603239
v -13.714181 4.000000 -13.149952
v -14.148194 4.000000 -12.681821
v -14.566237 4.000000 -12.199375
v -14.967836 4.000000 -11.703157
v -15.352539 4.000000 -11.193728
v -15.719911 4.000000 -10.671663
v -16.069538 4.000000 -10.137551
v -16.401025 4.000000 -9.591995
v -16.713998 4.000000 -9.035612
v -17.008103 4.000000 -8.469029
v -17.283008 4.000000 -7.892885
v -17.538403 4.000000 -7.307832
v -17.774001 4.000000 -6.714529
v -17.989534 4.000000 -6.113647
v -18.184759 4.000000 -5.505863
v -18.359457 4.000000 -4.891863
v -18.513430 4.000000 -4.272342
v -18.646504 4.000000 -3.647998
v -18.758529 4.000000 -3.019536
v -18.849378 4.000000 -2.387665
v -18.918949 4.000000 -1.753099
v -18.967164 4.000000 -1.116554
v -18.993967 4.000000 -0.478748
v -18.999330 4.000000 0.159598
v -18.983245 4.000000 0.797764
v -18.945730 4.000000 1.435029
v -18.886829 4.000000 2.070674
v -18.806607 4.000000 2.703982
v -18.705156 4.000000 3.334237
v -18.582589 4.000000 3.960729
v -18.439046 4.000000 4.582750
v -18.274687 4.000000 5.199597
v -18.089699 4.000000 5.810575
v -17.884291 4.000000 6.414993
v -17.658694 4.000000 7.012170
v -17.413163 4.000000 7.601431
v -17.147975 4.000000 8.182112
v -16.863430 4.000000 8.753556
v -16.559848 4.000000 9.315118
v -16.237573 4.000000 9.866165
v -15.896968 4.000000 10.406075
v -15.538418 4.000000 10.934238
v -15.162327 4.000000 11.450058
v -14.769121 4.000000 11.952953
v -14.359242 4.000000 12.442354
v -13.933154 4.000000 12.917710
v -13.491337 4.000000 13.378484
v -13.034291 4.000000 13.824155
v -12.562531 4.000000 14.254221
v -12.076590 4.000000 14.668196
v -11.577016 4.000000 15.065613
v -11.064373 4.000000 15.446024
v -10.539241 4.000000 15.808998
v -10.002211 4.000000 16.154126
v -9.453890 4.000000 16.481018
v -8.894898 4.000000 16.789306
v -8.325864 4.000000 17.078641
v -7.747432 4.000000 17.348697
v -7.160254 4.000000 17.599170
v -6.564993 4.000000 17.829775
v -5.962321 4.000000 18.040253
v -5.352919 4.000000 18.230366
v -4.737474 4.000000 18.399901
v -4.116681 4.000000 18.548664
v -3.491241 4.000000 18.676489
v -2.861860 4.000000 18.783231
v -2.229248 4.000000 18.868769
v -1.594120 4.000000 18.933008
v -0.957192 4.000000 18.975874
v -0.319184 4.000000 18.997319
v 0.319184 4.000000 18.997319
v 0.957192 4.000000 18.975874
v 1.594120 4.000000 18.933008
v 2.229248 4.000000 18.868769
v 2.861860 4.000000 18.783231
v 3.491241 4.000000 18.676489
v 4.116681 4.000000 18.548664
v 4.737474 4.000000 18.399901
v 5.352919 4.000000 18.230366
v 5.962321 4.000000 18.040253
v 6.564993 4.000000 17.829775
v 7.160254 4.000000 17.599170
v 7.747432 4.000000 17.348697
v 8.325864 4.000000 17.078641
v 8.894898 4.000000 16.789306
v 9.453890 4.000000 16.481018
v 10.002211 4.000000 16.154126
v 10.539241 4.000000 15.808998
v 11.064373 4.000000 15.446024
v 11.577016 4.000000 15.065613
v 12.076590 4.000000 14.668196
v 12.562531 4.000000 14.254221
v 13.034291 4.000000 13.824155
v 13.491337 4.000000 13.378484
v 13.933154 4.000000 12.917710
v 14.359242 4.000000 12.442354
v 14.769121 4.000000 11.952953
v 15.162327 4.000000 11.450058
v 15.538418 4.000000 10.934238
v 15.896968 4.000000 10.406075
v 16.237573 4.000000 9.866165
v 16.559848 4.000000 9.315118
v 16.863430 4.000000 8.753556
v 17.147975 4.000000 8.182112
v 17.413163 4.000000 7.601431
v 17.658694 4.000000 7.012170
v 17.884291 4.000000 6.414993
v 18.089699 4.000000 5.810575
v 18.274687 4.000000 5.199597
v 18.439046 4.000000 4.582750
v 18.582589 4.000000 3.960729
v 18.705156 4.000000 3.334237
v 18.806607 4.000000 2.703982
v 18.886829 4.000000 2.070674
v 18.945730 4.000000 1.435029
v 18.983245 4.000000 0.797764
v 18.999330 4.000000 0.159598
v 18.993967 4.000000 -0.478748
v 18.967164 4.000000 -1.116554
v 18.918949 4.000000 -1.753099
v 18.849378 4.000000 -2.387665
v 18.758529 4.000000 -3.019536
v 18.646504 4.000000 -3.647998
v 18.513430 4.000000 -4.272342
v 18.359457 4.000000 -4.891863
v 18.184759 4.000000 -5.505863
v 17.989534 4.000000 -6.113647
v 17.774001 4.000000 -6.714529
v 17.538403 4.000000 -7.307832
v 17.283008 4.000000 -7.892885
v 17.008103 4.000000 -8.469029
v 16.713998 4.000000 -9.035612
v 16.401025 4.000000 -9.591995
v 16.069538 4.000000 -10.137551
v 15.719911 4.000000 -10.671663
v 15.352539 4.000000 -11.193728
v 14.967836 4.000000 -11.703157
v 14.566237 4.000000 -12.199375
v 14.148194 4.000000 -12.681821
v 13.714181 4.000000 -13.149952
v 13.264686 4.000000 -13.603239
v 12.800217 4.000000 -14.041169
v 12.321299 4.000000 -14.463250
v 11.828472 4.000000 -14.869003
v 11.322292 4.000000 -15.257972
v 10.803332 4.000000 -15.629716
v 10.272176 4.000000 -15.983817
v 9.729424 4.000000 -16.319875
v 9.175689 4.000000 -16.637510
v 8.611596 4.000000 -16.936364
v 8.037782 4.000000 -17.216099
v 7.454895 4.000000 -17.476400
v 6.863592 4.000000 -17.716972
v 6.264541 4.000000 -17.937545
v 5.658418 4.000000 -18.137869
v 5.045908 4.000000 -18.317718
v 4.427702 4.000000 -18.476890
v 3.804498 4.000000 -18.615203
v 3.176999 4.000000 -18.732503
v 2.545913 4.000000 -18.828657
v 1.911954 4.000000 -18.903556
v 1.275836 4.000000 -18.957116
v 0.638278 4.000000 -18.989276
vt 1.898928 0.063828 0.000000
vt -1.899732 0.031918 0.000000
vt 1.900000 0.000000 0.000000
vt -1.899732 -0.031918 0.000000
vt 1.898928 -0.063828 0.000000
vt -1.897587 -0.095719 0.000000
vt 1.895712 -0.127584 0.000000
vt -1.893301 -0.159412 0.000000
vt 1.890356 -0.191195 0.000000
vt -1.886877 -0.222925 0.000000
vt 1.882866 -0.254591 0.000000
vt -1.878323 -0.286186 0.000000
vt 1.873250 -0.317700 0.000000
vt -1.867649 -0.349124 0.000000
vt 1.861520 -0.380450 0.000000
vt -1.854866 -0.411668 0.000000
vt 1.847689 -0.442770 0.000000
vt -1.839990 -0.473747 0.000000
vt 1.831772 -0.504591 0.000000
vt -1.823037 -0.535292 0.000000
vt 1.813787 -0.565842 0.000000
vt -1.804025 -0.596232 0.000000
vt 1.793755 -0.626454 0.000000
vt -1.782977 -0.656499 0.000000
vt 1.771697 -0.686359 0.000000
vt -1.759917 -0.716025 0.000000
vt 1.747640 -0.745489 0.000000
vt -1.734870 -0.774743 0.000000
vt 1.721610 -0.803778 0.000000
vt -1.707864 -0.832586 0.000000
vt 1.693636 -0.861160 0.000000
vt -1.678931 -0.889490 0.000000
vt 1.663751 -0.917569 0.000000
vt -1.648102 -0.945389 0.000000
vt 1.631987 -0.972942 0.000000
vt -1.615413 -1.000221 0.000000
vt 1.598382 -1.027218 0.000000
vt -1.580900 -1.053924 0.000000
vt 1.562972 -1.080333 0.000000
vt -1.544602 -1.106437 0.000000
vt 1.525797 -1.132229 0.000000
vt -1.506561 -1.157702 0.000000
vt 1.486900 -1.182847 0.000000
vt -1.466820 -1.207659 0.000000
vt 1.446325 -1.232130 0.000000
vt -1.425422 -1.256253 0.000000
vt 1.404117 -1.280022 0.000000
vt -1.382415 -1.303429 0.000000
vt 1.360324 -1.326469 0.000000
vt -1.337848 -1.349134 0.000000
vt 1.314995 -1.371418 0.000000
vt -1.291771 -1.393315 0.000000
vt 1.268182 -1.414819 0.000000
vt -1.244235 -1.435924 0.000000
vt 1.219937 -1.456624 0.000000
vt -1.195295 -1.476912 0.000000
vt 1.170316 -1.496784 0.000000
vt -1.145006 -1.516233 0.000000
vt 1.119373 -1.535254 0.000000
vt -1.093424 -1.553842 0.000000
vt 1.067166 -1.571991 0.000000
vt -1.040608 -1.589697 0.000000
vt 1.013755 -1.606954 0.000000
vt -0.986617 -1.623757 0.000000
vt 0.959200 -1.640103 0.000000
vt -0.931512 -1.655985 0.000000
vt 0.903561 -1.671400 0.000000
vt -0.875356 -1.686343 0.000000
vt 0.846903 -1.700810 0.000000
vt -0.818211 -1.714798 0.000000
vt 0.789289 -1.728301 0.000000
vt -0.760143 -1.741316 0.000000
vt 0.730783 -1.753840 0.000000
vt -0.701217 -1.765869 0.000000
vt 0.671453 -1.777400 0.000000
vt -0.641499 -1.788429 0.000000
vt 0.611365 -1.798953 0.000000
vt -0.581057 -1.808970 0.000000
vt 0.550586 -1.818476 0.000000
vt -0.519960 -1.827469 0.000000
vt 0.489186 -1.835946 0.000000
vt -0.458275 -1.843905 0.000000
vt 0.427234 -1.851343 0.000000
vt -0.396073 -1.858259 0.000000
vt 0.364800 -1.864650 0.000000
vt -0.333424 -1.870516 0.000000
vt 0.301954 -1.875853 0.000000
vt -0.270398 -1.880661 0.000000
vt 0.238766 -1.884938 0.000000
vt -0.207067 -1.888683 0.000000
vt 0.175310 -1.891895 0.000000
vt -0.143503 -1.894573 0.000000
vt 0.111655 -1.896716 0.000000
vt -0.079776 -1.898324 0.000000
vt 0.047875 -1.899397 0.000000
vt -0.015960 -1.899933 0.000000
vt -1.897587 0.095719 0.000000
vt 1.895712 0.127584 0.000000
vt -1.893301 0.159412 0.000000
vt 1.890356 0.191195 0.000000
vt -1.886877 0.222925 0.000000
vt 1.882866 0.254591 0.000000
vt -1.878323 0.286186 0.000000
vt 1.873250 0.317700 0.000000
vt -1.867649 0.349124 0.000000
vt 1.861520 0.380450 0.000000
vt -1.854866 0.411668 0.000000
vt 1.847689 0.442770 0.000000
vt -1.839990 0.473747 0.000000
vt 1.831772 0.504591 0.000000
vt -1.823037 0.535292 0.000000
vt 1.813787 0.565842 0.000000
vt -1.804025 0.596232 0.000000
vt 1.793755 0.626454 0.000000
vt -1.782977 0.656499 0.000000
vt 1.771697 0.686359 0.000000
vt -1.759917 0.716025 0.000000
vt 1.747640 0.745489 0.000000
vt -1.734870 0.774743 0.000000
vt 1.721610 0.803778 0.000000
vt -1.707864 0.832586 0.000000
vt 1.693636 0.861160 0.000000
vt -1.678931 0.889490 0.000000
vt 1.663751 0.917569 0.000000
vt -1.648102 0.945389 0.000000
vt 1.631987 0.972942 0.000000
vt -1.615413 1.000221 0.000000
vt 1.598382 1.027218 0.000000
vt -1.580900 1.053924 0.000000
vt 1.562972 1.080333 0.000000
vt -1.544602 1.106437 0.000000
vt 1.525797 1.132229 0.000000
vt -1.506561 1.157702 0.000000
vt 1.486900 1.182847 0.000000
vt -1.466820 1.207659 0.000000
vt 1.446325 1.232130 0.000000
vt -1.425422 1.256253 0.000000
vt 1.404117 1.280022 0.000000
vt -1.382415 1.303429 0.000000
vt 1.360324 1.326469 0.000000
vt -1.337848 1.349134 0.000000
vt 1.314995 1.371418 0.000000
vt -1.291771 1.393315 0.000000
vt 1.268182 1.414819 0.000000
vt -1.244235 1.435924 0.000000
vt 1.219937 1.456624 0.000000
vt -1.195295 1.476912 0.000000
vt 1.170316 1.496784 0.000000
vt -1.145006 1.516233 0.000000
vt 1.119373 1.535254 0.000000
vt -1.093424 1.553842 0.000000
vt 1.067166 1.571991 0.000000
vt -1.040608 1.589697 0.000000
vt 1.013755 1.606954 0.000000
vt -0.986617 1.623757 0.000000
vt 0.959200 1.640103 0.000000
vt -0.931512 1.655985 0.000000
vt 0.903561 1.671400 0.000000
vt -0.875356 1.686343 0.000000
vt 0.846903 1.700810 0.000000
vt -0.818211 1.714798 0.000000
vt 0.789289 1.728301 0.000000
vt -0.760143 1.741316 0.000000
vt 0.730783 1.753840 0.000000
vt -0.701217 1.765869 0.000000
vt 0.671453 1.777400 0.000000
vt -0.641499 1.788429 0.000000
vt 0.611365 1.798953 0.000000
vt -0.581057 1.808970 0.000000
vt 0.550586 1.818476 0.000000
vt -0.519960 1.827469 0.000000
vt 0.489186 1.835946 0.000000
vt -0.458275 1.843905 0.000000
vt 0.427234 1.851343 0.000000
vt -0.396073 1.858259 0.000000
vt 0.364800 1.864650 0.000000
vt -0.333424 1.870516 0.000000
vt 0.301954 1.875853 0.000000
vt -0.270398 1.880661 0.000000
vt 0.238766 1.884938 0.000000
vt -0.207067 1.888683 0.000000
vt 0.175310 1.891895 0.000000
vt -0.143503 1.894573 0.000000
vt 0.111655 1.896716 0.000000
vt -0.079776 1.898324 0.000000
vt 0.047875 1.899397 0.000000
vt -0.015960 1.899933 0.000000
vt 0.001072 -0.063828 0.000000
vt 3.799732 -0.031918 0.000000
vt 0.000000 0.000000 0.000000
vt 3.799732 0.031918 0.000000
vt 0.001072 0.063828 0.000000
vt 3.797587 0.095719 0.000000
vt 0.004288 0.127584 0.000000
vt 3.793301 0.159412 0.000000
vt 0.009644 0.191195 0.000000
vt 3.786877 0.222925 0.000000
vt 0.017134 0.254591 0.000000
vt 3.778323 0.286186 0.000000
vt 0.026750 0.317700 0.000000
vt 3.767649 0.349124 0.000000
vt 0.038480 0.380450 0.000000
vt 3.754866 0.411668 0.000000
vt 0.052311 0.442770 0.000000
vt 3.739990 0.473747 0.000000
vt 0.068228 0.504591 0.000000
vt 3.723037 0.535292 0.000000
vt 0.086213 0.565842 0.000000
vt 3.704025 0.596232 0.000000
vt 0.106245 0.626454 0.000000
vt 3.682977 0.656499 0.000000
vt 0.128303 0.686359 0.000000
vt 3.659917 0.716025 0.000000
vt 0.152360 0.745489 0.000000
vt 3.634870 0.774743 0.000000
vt 0.178390 0.803778 0.000000
vt 3.607864 0.832586 0.000000
vt 0.206364 0.861160 0.000000
vt 3.578931 0.889490 0.000000
vt 0.236249 0.917569 0.000000
vt 3.548102 0.945389 0.000000
vt 0.268013 0.972942 0.000000
vt 3.515413 1.000221 0.000000
vt 0.301618 1.027218 0.000000
vt 3.480900 1.053924 0.000000
vt 0.337028 1.080333 0.000000
vt 3.444602 1.106437 0.000000
vt 0.374203 1.132229 0.000000
vt 3.406561 1.157702 0.000000
vt 0.413100 1.182847 0.000000
vt 3.366820 1.207659 0.000000
vt 0.453675 1.232130 0.000000
vt 3.325422 1.256253 0.000000
vt 0.495883 1.280022 0.000000
vt 3.282415 1.303429 0.000000
vt 0.539676 1.326469 0.000000
vt 3.237848 1.349134 0.000000
vt 0.585005 1.371418 0.000000
vt 3.191771 1.393315 0.000000
vt 0.631818 1.414819 0.000000
vt 3.144235 1.435924 0.000000
vt 0.680063 1.456624 0.000000
vt 3.095295 1.476912 0.000000
vt 0.729684 1.496784 0.000000
vt 3.045006 1.516233 0.000000
vt 0.780627 1.535254 0.000000
vt 2.993424 1.553842 0.000000
vt 0.832834 1.571991 0.000000
vt 2.940608 1.589697 0.000000
vt 0.886245 1.606954 0.000000
vt 2.886617 1.623757 0.000000
vt 0.940800 1.640103 0.000000
vt 2.831512 1.655985 0.000000
vt 0.996439 1.671400 0.000000
vt 2.775356 1.686343 0.000000
vt 1.053097 1.700810 0.000000
vt 2.718211 1.714798 0.000000
vt 1.110711 1.728301 0.000000
vt 2.660143 1.741316 0.000000
vt 1.169217 1.753840 0.000000
vt 2.601217 1.765869 0.000000
vt 1.228547 1.777400 0.000000
vt 2.541499 1.788429 0.000000
vt 1.288635 1.798953 0.000000
vt 2.481057 1.808970 0.000000
vt 1.349414 1.818476 0.000000
vt 2.419960 1.827469 0.000000
vt 1.410814 1.835946 0.000000
vt 2.358275 1.843905 0.000000
vt 1.472766 1.851343 0.000000
vt 2.296073 1.858259 0.000000
vt 1.535200 1.864650 0.000000
vt 2.233424 1.870516 0.000000
vt 1.598046 1.875853 0.000000
vt 2.170398 1.880661 0.000000
vt 1.661234 1.884938 0.000000
vt 2.107067 1.888683 0.000000
vt 1.724690 1.891895 0.000000
vt 2.043503 1.894573 0.000000
vt 1.788345 1.896716 0.000000
vt 1.979776 1.898324 0.000000
vt 1.852125 1.899397 0.000000
vt 1.915960 1.899933 0.000000
vt 3.797587 -0.095719 0.000000
vt 0.004288 -0.127584 0.000000
vt 3.793301 -0.159412 0.000000
vt 0.009644 -0.191195 0.000000
vt 3.786877 -0.222925 0.000000
vt 0.017134 -0.254591 0.000000
vt 3.778323 -0.286186 0.000000
vt 0.026750 -0.317700 0.000000
vt 3.767649 -0.349124 0.000000
vt 0.038480 -0.380450 0.000000
vt 3.754866 -0.411668 0.000000
vt 0.052311 -0.442770 0.000000
vt 3.739990 -0.473747 0.000000
vt 0.068228 -0.504591 0.000000
vt 3.723037 -0.535292 0.000000
vt 0.086213 -0.565842 0.000000
vt 3.704025 -0.596232 0.000000
vt 0.106245 -0.626454 0.000000
vt 3.682977 -0.656499 0.000000
vt 0.128303 -0.686359 0.000000
vt 3.659917 -0.716025 0.000000
vt 0.152360 -0.745489 0.000000
vt 3.634870 -0.774743 0.000000
vt 0.178390 -0.803778 0.000000
vt 3.607864 -0.832586 0.000000
vt 0.206364 -0.861160 0.000000
vt 3.578931 -0.889490 0.000000
vt 0.236249 -0.917569 0.000000
vt 3.548102 -0.945389 0.000000
vt 0.268013 -0.972942 0.000000
vt 3.515413 -1.000221 0.000000
vt 0.301618 -1.027218 0.000000
vt 3.480900 -1.053924 0.000000
vt 0.337028 -1.080333 0.000000
vt 3.444602 -1.106437 0.000000
vt 0.374203 -1.132229 0.000000
vt 3.406561 -1.157702 0.000000
vt 0.413100 -1.182847 0.000000
vt 3.366820 -1.207659 0.000000
vt 0.453675 -1.232130 0.000000
vt 3.325422 -1.256253 0.000000
vt 0.495883 -1.280022 0.000000
vt 3.282415 -1.303429 0.000000
vt 0.539676 -1.326469 0.000000
vt 3.237848 -1.349134 0.000000
vt 0.585005 -1.371418 0.000000
vt 3.191771 -1.393315 0.000000
vt 0.631818 -1.414819 0.000000
vt 3.144235 -1.435924 0.000000
vt 0.680063 -1.456624 0.000000
vt 3.095295 -1.476912 0.000000
vt 0.729684 -1.496784 0.000000
vt 3.045006 -1.516233 0.000000
vt 0.780627 -1.535254 0.000000
vt 2.993424 -1.553842 0.000000
vt 0.832834 -1.571991 0.000000
vt 2.940608 -1.589697 0.000000
vt 0.886245 -1.606954 0.000000
vt 2.886617 -1.623757 0.000000
vt 0.940800 -1.640103 0.000000
vt 2.831512 -1.655985 0.000000
vt 0.996439 -1.671400 0.000000
vt 2.775356 -1.686343 0.000000
vt 1.053097 -1.700810 0.000000
vt 2.718211 -1.714798 0.000000
vt 1.110711 -1.728301 0.000000
vt 2.660143 -1.741316 0.000000
vt 1.169217 -1.753840 0.000000
vt 2.601217 -1.765869 0.000000
vt 1.228547 -1.777400 0.000000
vt 2.541499 -1.788429 0.000000
vt 1.288635 -1.798953 0.000000
vt 2.481057 -1.808970 0.000000
vt 1.349414 -1.818476 0.000000
vt 2.419960 -1.827469 0.000000
vt 1.410814 -1.835946 0.000000
vt 2.358275 -1.843905 0.000000
vt 1.472766 -1.851343 0.000000
vt 2.296073 -1.858259 0.000000
vt 1.535200 -1.864650 0.000000
vt 2.233424 -1.870516 0.000000
vt 1.598046 -1.875853 0.000000
vt 2.170398 -1.880661 0.000000
vt 1.661234 -1.884938 0.000000
vt 2.107067 -1.888683 0.000000
vt 1.724690 -1.891895 0.000000
vt 2.043503 -1.894573 0.000000
vt 1.788345 -1.896716 0.000000
vt 1.979776 -1.898324 0.000000
vt 1.852125 -1.899397 0.000000
vt 1.915960 -1.899933 0.000000
vt 0.200000 0.063840 0.000000
vt -0.200000 0.000000 0.000000
vt 0.200000 0.000000 0.000000
vt -0.200000 -0.063840 0.000000
vt 0.200000 -0.063840 0.000000
vt -0.200000 -0.127680 0.000000
vt 0.200000 -0.127680 0.000000
vt -0.200000 -0.191520 0.000000
vt 0.200000 -0.191520 0.000000
vt -0.200000 -0.255359 0.000000
vt 0.200000 -0.255359 0.000000
vt -0.200000 -0.319199 0.000000
vt 0.200000 -0.319199 0.000000
vt -0.200000 -0.383039 0.000000
vt 0.200000 -0.383039 0.000000
vt -0.200000 -0.446879 0.000000
vt 0.200000 -0.446879 0.000000
vt -0.200000 -0.510719 0.000000
vt 0.200000 -0.510719 0.000000
vt -0.200000 -0.574559 0.000000
vt 0.200000 -0.574559 0.000000
vt -0.200000 -0.638399 0.000000
vt 0.200000 -0.638399 0.000000
vt -0.200000 -0.702238 0.000000
vt 0.200000 -0.702238 0.000000
vt -0.200000 -0.766078 0.000000
vt 0.200000 -0.766078 0.000000
vt -0.200000 -0.829918 0.000000
vt 0.200000 -0.829918 0.000000
vt -0.200000 -0.893758 0.000000
vt 0.200000 -0.893758 0.000000
vt -0.200000 -0.957598 0.000000
vt 0.200000 -0.957598 0.000000
vt -0.200000 -1.021438 0.000000
vt 0.200000 -1.021438 0.000000
vt -0.200000 -1.085277 0.000000
vt 0.200000 -1.085277 0.000000
vt -0.200000 -1.149117 0.000000
vt 0.200000 -1.149117 0.000000
vt -0.200000 -1.212957 0.000000
vt 0.200000 -1.212957 0.000000
vt -0.200000 -1.276797 0.000000
vt 0.200000 -1.276797 0.000000
vt -0.200000 -1.340637 0.000000
vt 0.200000 -1.340637 0.000000
vt -0.200000 -1.404477 0.000000
vt 0.200000 -1.404477 0.000000
vt -0.200000 -1.468317 0.000000
vt 0.200000 -1.468317 0.000000
vt -0.200000 -1.532156 0.000000
vt 0.200000 -1.532156 0.000000
vt -0.200000 -1.595996 0.000000
vt 0.200000 -1.595996 0.000000
vt -0.200000 -1.659836 0.000000
vt 0.200000 -1.659836 0.000000
vt -0.200000 -1.723676 0.000000
vt 0.200000 -1.723676 0.000000
vt -0.200000 -1.787516 0.000000
vt 0.200000 -1.787516 0.000000
vt -0.200000 -1.851356 0.000000
vt 0.200000 -1.851356 0.000000
vt -0.200000 -1.915196 0.000000
vt 0.200000 -1.915196 0.000000
vt -0.200000 -1.979035 0.000000
vt 0.200000 -1.979035 0.000000
vt -0.200000 -2.042875 0.000000
vt 0.200000 -2.042875 0.000000
vt -0.200000 -2.106715 0.000000
vt 0.200000 -2.106715 0.000000
vt -0.200000 -2.170555 0.000000
vt 0.200000 -2.170555 0.000000
vt -0.200000 -2.234395 0.000000
vt 0.200000 -2.234395 0.000000
vt -0.200000 -2.298235 0.000000
vt 0.200000 -2.298235 0.000000
vt -0.200000 -2.362074 0.000000
vt 0.200000 -2.362074 0.000000
vt -0.200000 -2.425914 0.000000
vt 0.200000 -2.425914 0.000000
vt -0.200000 -2.489754 0.000000
vt 0.200000 -2.489754 0.000000
vt -0.200000 -2.553594 0.000000
vt 0.200000 -2.553594 0.000000
vt -0.200000 -2.617434 0.000000
vt 0.200000 -2.617434 0.000000
vt -0.200000 -2.681274 0.000000
vt 0.200000 -2.681274 0.000000
vt -0.200000 -2.745114 0.000000
vt 0.200000 -2.745114 0.000000
vt -0.200000 -2.808953 0.000000
vt 0.200000 -2.808953 0.000000
vt -0.200000 -2.872793 0.000000
vt 0.200000 -2.872793 0.000000
vt -0.200000 -2.936633 0.000000
vt 0.200000 -2.936633 0.000000
vt -0.200000 -3.000473 0.000000
vt 0.200000 -3.000473 0.000000
vt -0.200000 -3.064313 0.000000
vt 0.200000 -3.064313 0.000000
vt -0.200000 -3.128153 0.000000
vt 0.200000 -3.128153 0.000000
vt -0.200000 -3.191993 0.000000
vt 0.200000 -3.191993 0.000000
vt -0.200000 -3.255832 0.000000
vt 0.200000 -3.255832 0.000000
vt -0.200000 -3.319672 0.000000
vt 0.200000 -3.319672 0.000000
vt -0.200000 -3.383512 0.000000
vt 0.200000 -3.383512 0.000000
vt -0.200000 -3.447352 0.000000
vt 0.200000 -3.447352 0.000000
vt -0.200000 -3.511192 0.000000
vt 0.200000 -3.511192 0.000000
vt -0.200000 -3.575032 0.000000
vt 0.200000 -3.575032 0.000000
vt -0.200000 -3.638871 0.000000
vt 0.200000 -3.638871 0.000000
vt -0.200000 -3.702711 0.000000
vt 0.200000 -3.702711 0.000000
vt -0.200000 -3.766551 0.000000
vt 0.200000 -3.766551 0.000000
vt -0.200000 -3.830391 0.000000
vt 0.200000 -3.830391 0.000000
vt -0.200000 -3.894231 0.000000
vt 0.200000 -3.894231 0.000000
vt -0.200000 -3.958071 0.000000
vt 0.200000 -3.958071 0.000000
vt -0.200000 -4.021911 0.000000
vt 0.200000 -4.021911 0.000000
vt -0.200000 -4.085750 0.000000
vt 0.200000 -4.085750 0.000000
vt -0.200000 -4.149590 0.000000
vt 0.200000 -4.149590 0.000000
vt -0.200000 -4.213430 0.000000
vt 0.200000 -4.213430 0.000000
vt -0.200000 -4.277270 0.000000
vt 0.200000 -4.277270 0.000000
vt -0.200000 -4.341110 0.000000
vt 0.200000 -4.341110 0.000000
vt -0.200000 -4.404950 0.000000
vt 0.200000 -4.404950 0.000000
vt -0.200000 -4.468790 0.000000
vt 0.200000 -4.468790 0.000000
vt -0.200000 -4.532629 0.000000
vt 0.200000 -4.532629 0.000000
vt -0.200000 -4.596469 0.000000
vt 0.200000 -4.596469 0.000000
vt -0.200000 -4.660309 0.000000
vt 0.200000 -4.660309 0.000000
vt -0.200000 -4.724149 0.000000
vt 0.200000 -4.724149 0.000000
vt -0.200000 -4.787989 0.000000
vt 0.200000 -4.787989 0.000000
vt -0.200000 -4.851829 0.000000
vt 0.200000 -4.851829 0.000000
vt -0.200000 -4.915669 0.000000
vt 0.200000 -4.915669 0.000000
vt -0.200000 -4.979508 0.000000
vt 0.200000 -4.979508 0.000000
vt -0.200000 -5.043348 0.000000
vt 0.200000 -5.043348 0.000000
vt -0.200000 -5.107188 0.000000
vt 0.200000 -5.107188 0.000000
vt -0.200000 -5.171028 0.000000
vt 0.200000 -5.171028 0.000000
vt -0.200000 -5.234868 0.000000
vt 0.200000 -5.234868 0.000000
vt -0.200000 -5.298708 0.000000
vt 0.200000 -5.298708 0.000000
vt -0.200000 -5.362547 0.000000
vt 0.200000 -5.362547 0.000000
vt -0.200000 -5.426387 0.000000
vt 0.200000 -5.426387 0.000000
vt -0.200000 -5.490227 0.000000
vt 0.200000 -5.490227 0.000000
vt -0.200000 -5.554067 0.000000
vt 0.200000 -5.554067 0.000000
vt -0.200000 -5.617907 0.000000
vt 0.200000 -5.617907 0.000000
vt -0.200000 -5.681747 0.000000
vt 0.200000 -5.681747 0.000000
vt -0.200000 -5.745587 0.000000
vt 0.200000 -5.745587 0.000000
vt -0.200000 -5.809426 0.000000
vt 0.200000 -5.809426 0.000000
vt -0.200000 -5.873266 0.000000
vt 0.200000 -5.873266 0.000000
vt -0.200000 -5.937106 0.000000
vt 0.200000 -5.937106 0.000000
vt 0.200000 6.000946 0.000000
vt -0.200000 6.000946 0.000000
vt -0.200000 5.937106 0.000000
vt 0.200000 5.937106 0.000000
vt -0.200000 5.873266 0.000000
vt 0.200000 5.873266 0.000000
vt -0.200000 5.809426 0.000000
vt 0.200000 5.809426 0.000000
vt -0.200000 5.745587 0.000000
vt 0.200000 5.745587 0.000000
vt -0.200000 5.681747 0.000000
vt 0.200000 5.681747 0.000000
vt -0.200000 5.617907 0.000000
vt 0.200000 5.617907 0.000000
vt -0.200000 5.554067 0.000000
vt 0.200000 5.554067 0.000000
vt -0.200000 5.490227 0.000000
vt 0.200000 5.490227 0.000000
vt -0.200000 5.426387 0.000000
vt 0.200000 5.426387 0.000000
vt -0.200000 5.362547 0.000000
vt 0.200000 5.362547 0.000000
vt -0.200000 5.298708 0.000000
vt 0.200000 5.298708 0.000000
vt -0.200000 5.234868 0.000000
vt 0.200000 5.234868 0.000000
vt -0.200000 5.171028 0.000000
vt 0.200000 5.171028 0.000000
vt -0.200000 5.107188 0.000000
vt 0.200000 5.107188 0.000000
vt -0.200000 5.043348 0.000000
vt 0.200000 5.043348 0.000000
vt -0.200000 4.979508 0.000000
vt 0.200000 4.979508 0.000000
vt -0.200000 4.915669 0.000000
vt 0.200000 4.915669 0.000000
vt -0.200000 4.851829 0.000000
vt 0.200000 4.851829 0.000000
vt -0.200000 4.787989 0.000000
vt 0.200000 4.787989 0.000000
vt -0.200000 4.724149 0.000000
vt 0.200000 4.724149 0.000000
vt -0.200000 4.660309 0.000000
vt 0.200000 4.660309 0.000000
vt -0.200000 4.596469 0.000000
vt 0.200000 4.596469 0.000000
vt -0.200000 4.532629 0.000000
vt 0.200000 4.532629 0.000000
vt -0.200000 4.468790 0.000000
vt 0.200000 4.468790 0.000000
vt -0.200000 4.404950 0.000000
vt 0.200000 4.404950 0.000000
vt -0.200000 4.341110 0.000000
vt 0.200000 4.341110 0.000000
vt -0.200000 4.277270 0.000000
vt 0.200000 4.277270 0.000000
vt -0.200000 4.213430 0.000000
vt 0.200000 4.213430 0.000000
vt -0.200000 4.149590 0.000000
vt 0.200000 4.149590 0.000000
vt -0.200000 4.085750 0.000000
vt 0.200000 4.085750 0.000000
vt -0.200000 4.021911 0.000000
vt 0.200000 4.021911 0.000000
vt -0.200000 3.958071 0.000000
vt 0.200000 3.958071 0.000000
vt -0.200000 3.894231 0.000000
vt 0.200000 3.894231 0.000000
vt -0.200000 3.830391 0.000000
vt 0.200000 3.830391 0.000000
vt -0.200000 3.766551 0.000000
vt 0.200000 3.766551 0.000000
vt -0.200000 3.702711 0.000000
vt 0.200000 3.702711 0.000000
vt -0.200000 3.638871 0.000000
vt 0.200000 3.638871 0.000000
vt -0.200000 3.575032 0.000000
vt 0.200000 3.575032 0.000000
vt -0.200000 3.511192 0.000000
vt 0.200000 3.511192 0.000000
vt -0.200000 3.447352 0.000000
vt 0.200000 3.447352 0.000000
vt -0.200000 3.383512 0.000000
vt 0.200000 3.383512 0.000000
vt -0.200000 3.319672 0.000000
vt 0.200000 3.319672 0.000000
vt -0.200000 3.255832 0.000000
vt 0.200000 3.255832 0.000000
vt -0.200000 3.191993 0.000000
vt 0.200000 3.191993 0.000000
vt -0.200000 3.128153 0.000000
vt 0.200000 3.128153 0.000000
vt -0.200000 3.064313 0.000000
vt 0.200000 3.064313 0.000000
vt -0.200000 3.000473 0.000000
vt 0.200000 3.000473 0.000000
vt -0.200000 2.936633 0.000000
vt 0.200000 2.936633 0.000000
vt -0.200000 2.872793 0.000000
vt 0.200000 2.872793 0.000000
vt -0.200000 2.808953 0.000000
vt 0.200000 2.808953 0.000000
vt -0.200000 2.745114 0.000000
vt 0.200000 2.745114 0.000000
vt -0.200000 2.681274 0.000000
vt 0.200000 2.681274 0.000000
vt -0.200000 2.617434 0.000000
vt 0.200000 2.617434 0.000000
vt -0.200000 2.553594 0.000000
vt 0.200000 2.553594 0.000000
vt -0.200000 2.489754 0.000000
vt 0.200000 2.489754 0.000000
vt -0.200000 2.425914 0.000000
vt 0.200000 2.425914 0.000000
vt -0.200000 2.362074 0.000000
vt 0.200000 2.362074 0.000000
vt -0.200000 2.298235 0.000000
vt 0.200000 2.298235 0.000000
vt -0.200000 2.234395 0.000000
vt 0.200000 2.234395 0.000000
vt -0.200000 2.170555 0.000000
vt 0.200000 2.170555 0.000000
vt -0.200000 2.106715 0.000000
vt 0.200000 2.106715 0.000000
vt -0.200000 2.042875 0.000000
vt 0.200000 2.042875 0.000000
vt -0.200000 1.979035 0.000000
vt 0.200000 1.979035 0.000000
vt -0.200000 1.915196 0.000000
vt 0.200000 1.915196 0.000000
vt -0.200000 1.851356 0.000000
vt 0.200000 1.851356 0.000000
vt -0.200000 1.787516 0.000000
vt 0.200000 1.787516 0.000000
vt -0.200000 1.723676 0.000000
vt 0.200000 1.723676 0.000000
vt -0.200000 1.659836 0.000000
vt 0.200000 1.659836 0.000000
vt -0.200000 1.595996 0.000000
vt 0.200000 1.595996 0.000000
vt -0.200000 1.532156 0.000000
vt 0.200000 1.532156 0.000000
vt -0.200000 1.468317 0.000000
vt 0.200000 1.468317 0.000000
vt -0.200000 1.404477 0.000000
vt 0.200000 1.404477 0.000000
vt -0.200000 1.340637 0.000000
vt 0.200000 1.340637 0.000000
vt -0.200000 1.276797 0.000000
vt 0.200000 1.276797 0.000000
vt -0.200000 1.212957 0.000000
vt 0.200000 1.212957 0.000000
vt -0.200000 1.149117 0.000000
vt 0.200000 1.149117 0.000000
vt -0.200000 1.085277 0.000000
vt 0.200000 1.085277 0.000000
vt -0.200000 1.021438 0.000000
vt 0.200000 1.021438 0.000000
vt -0.200000 0.957598 0.000000
vt 0.200000 0.957598 0.000000
vt -0.200000 0.893758 0.000000
vt 0.200000 0.893758 0.000000
vt -0.200000 0.829918 0.000000
vt 0.200000 0.829918 0.000000
vt -0.200000 0.766078 0.000000
vt 0.200000 0.766078 0.000000
vt -0.200000 0.702238 0.000000
vt 0.200000 0.702238 0.000000
vt -0.200000 0.638399 0.000000
vt 0.200000 0.638399 0.000000
vt -0.200000 0.574559 0.000000
vt 0.200000 0.574559 0.000000
vt -0.200000 0.510719 0.000000
vt 0.200000 0.510719 0.000000
vt -0.200000 0.446879 0.000000
vt 0.200000 0.446879 0.000000
vt -0.200000 0.383039 0.000000
vt 0.200000 0.383039 0.000000
vt -0.200000 0.319199 0.000000
vt 0.200000 0.319199 0.000000
vt -0.200000 0.255359 0.000000
vt 0.200000 0.255359 0.000000
vt -0.200000 0.191520 0.000000
vt 0.200000 0.191520 0.000000
vt -0.200000 0.127680 0.000000
vt 0.200000 0.127680 0.000000
vt -0.200000 0.063840 0.000000
vn 0.000000 -0.100000 0.000000
vn 0.000000 -0.100000 0.000000
vn 0.000000 -0.100000 0.000000
vn 0.000000 -0.100000 0.000000
vn 0.000000 -0.100000 0.000000
vn 0.000000 -0.100000 0.000000
vn 0.000000 -0.100000 0.000000
vn 0.000000 -0.100000 0.000000
vn 0.000000 -0.100000 0.000000
vn 0.000000 -0.100000 0.000000
vn 0.000000 -0.100000 0.000000
vn 0.000000 -0.100000 0.000000
vn 0.000000 -0.100000 0.000000
vn 0.000000 -0.100000 0.000000
vn 0.000000 -0.100000 0.000000
vn 0.000000 -0.100000 0.000000
vn 0.000000 -0.100000 0.000000
vn 0.000000 -0.100000 0.000000
vn 0.000000 -0.100000 0.000000
vn 0.000000 -0.100000 0.000000
vn 0.000000 -0.100000 0.000000
vn 0.000000 -0.100000 0.000000
vn 0.000000 -0.100000 0.000000
vn 0.000000 -0.100000 0.000000
vn 0.000000 -0.100000 0.000000
vn 0.000000 -0.100000 0.000000
vn 0.000000 -0.100000 0.000000
vn 0.000000 -0.100000 0.000000
vn 0.000000 -0.100000 0.000000
vn 0.000000 -0.100000 0.000000
vn 0.000000 -0.100000 0.000000
vn 0.000000 -0.100000 0.000000
vn 0.000000 -0.100000 0.000000
vn 0.000000 -0.100000 0.000000
vn 0.000000 -0.100000 0.000000
vn 0.000000 -0.100000 0.000000
vn 0.000000 -0.100000 0.000000
vn 0.000000 -0.100000 0.000000
vn 0.000000 -0.100000 0.000000
vn 0.000000 -0.100000 0.000000
vn 0.000000 -0.100000 0.000000
vn 0.000000 -0.100000 0.000000
vn 0.000000 -0.100000 0.000000
vn 0.000000 -0.100000 0.000000
vn 0.000000 -0.100000 0.000000
vn 0.000000 -0.100000 0.000000
vn 0.000000 -0.100000 0.000000
vn 0.000000 -0.100000 0.000000
vn 0.000000 -0.100000 0.000000
vn 0.000000 -0.100000 0.000000
vn 0.000000 -0.100000 0.000000
vn 0.000000 -0.100000 0.000000
vn 0.000000 -0.100000 0.000000
vn 0.000000 -0.100000 0.000000
vn 0.000000 -0.100000 0.000000
vn 0.000000 -0.100000 0.000000
vn 0.000000 -0.100000 0.000000
vn 0.000000 -0.100000 0.000000
vn 0.000000 -0.100000 0.000000
vn 0.000000 -0.100000 0.000000
vn 0.000000 -0.100000 0.000000
vn 0.000000 -0.100000 0.000000
vn 0.000000 -0.100000 0.000000
vn 0.000000 -0.100000 0.000000
vn 0.000000 -0.100000 0.000000
vn 0.000000 -0.100000 0.000000
vn 0.000000 -0.100000 0.000000
vn 0.000000 -0.100000 0.000000
vn 0.000000 -0.100000 0.000000
vn 0.000000 -0.100000 0.000000
vn 0.000000 -0.100000 0.000000
vn 0.000000 -0.100000 0.000000
vn 0.000000 -0.100000 0.000000
vn 0.000000 -0.100000 0.000000
vn 0.000000 -0.100000 0.000000
vn 0.000000 -0.100000 0.000000
vn 0.000000 -0.100000 0.000000
vn 0.000000 -0.100000 0.000000
vn 0.000000 -0.100000 0.000000
vn 0.000000 -0.100000 0.000000
vn 0.000000 -0.100000 0.000000
vn 0.000000 -0.100000 0.000000
vn 0.000000 -0.100000 0.000000
vn 0.000000 -0.100000 0.000000
vn 0.000000 -0.100000 0.000000
vn 0.000000 -0.100000 0.000000
vn 0.000000 -0.100000 0.000000
vn 0.000000 -0.100000 0.000000
vn 0.000000 -0.100000 0.000000
vn 0.000000 -0.100000 0.000000
vn 0.000000 -0.100000 0.000000
vn 0.000000 -0.100000 0.000000
vn 0.000000 -0.100000 0.000000
vn 0.000000 -0.100000 0.000000
vn 0.000000 -0.100000 0.000000
vn 0.000000 -0.100000 0.000000
vn 0.000000 -0.100000 0.000000
vn 0.000000 -0.100000 0.000000
vn 0.000000 -0.100000 0.000000
vn 0.000000 -0.100000 0.000000
vn 0.000000 -0.100000 0.000000
vn 0.000000 -0.100000 0.000000
vn 0.000000 -0.100000 0.000000
vn 0.000000 -0.100000 0.000000
vn 0.000000 -0.100000 0.000000
vn 0.000000 -0.100000 0.000000
vn 0.000000 -0.100000 0.000000
vn 0.000000 -0.100000 0.000000
vn 0.000000 -0.100000 0.000000
vn 0.000000 -0.100000 0.000000
vn 0.000000 -0.100000 0.000000
vn 0.000000 -0.100000 0.000000
vn 0.000000 -0.100000 0.000000
vn 0.000000 -0.100000 0.000000
vn 0.000000 -0.100000 0.000000
vn 0.000000 -0.100000 0.000000
vn 0.000000 -0.100000 0.000000
vn 0.000000 -0.100000 0.000000
vn 0.000000 -0.100000 0.000000
vn 0.000000 -0.100000 0.000000
vn 0.000000 -0.100000 0.000000
vn 0.000000 -0.100000 0.000000
vn 0.000000 -0.100000 0.000000
vn 0.000000 -0.100000 0.000000
vn 0.000000 -0.100000 0.000000
vn 0.000000 -0.100000 0.000000
vn 0.000000 -0.100000 0.000000
vn 0.000000 -0.100000 0.000000
vn 0.000000 -0.100000 0.000000
vn 0.000000 -0.100000 0.000000
vn 0.000000 -0.100000 0.000000
vn 0.000000 -0.100000 0.000000
vn 0.000000 -0.100000 0.000000
vn 0.000000 -0.100000 0.000000
vn 0.000000 -0.100000 0.000000
vn 0.000000 -0.100000 0.000000
vn 0.000000 -0.100000 0.000000
vn 0.000000 -0.100000 0.000000
vn 0.000000 -0.100000 0.000000
vn 0.000000 -0.100000 0.000000
vn 0.000000 -0.100000 0.000000
vn 0.000000 -0.100000 0.000000
vn 0.000000 -0.100000 0.000000
vn 0.000000 -0.100000 0.000000
vn 0.000000 -0.100000 0.000000
vn 0.000000 -0.100000 0.000000
vn 0.000000 -0.100000 0.000000
vn 0.000000 -0.100000 0.000000
vn 0.000000 -0.100000 0.000000
vn 0.000000 -0.100000 0.000000
vn 0.000000 -0.100000 0.000000
vn 0.000000 -0.100000 0.000000
vn 0.000000 -0.100000 0.000000
vn 0.000000 -0.100000 0.000000
vn 0.000000 -0.100000 0.000000
vn 0.000000 -0.100000 0.000000
vn 0.000000 -0.100000 0.000000
vn 0.000000 -0.100000 0.000000
vn 0.000000 -0.100000 0.000000
vn 0.000000 -0.100000 0.000000
vn 0.000000 -0.100000 0.000000
vn 0.000000 -0.100000 0.000000
vn 0.000000 -0.100000 0.000000
vn 0.000000 -0.100000 0.000000
vn 0.000000 -0.100000 0.000000
vn 0.000000 -0.100000 0.000000
vn 0.000000 -0.100000 0.000000
vn 0.000000 -0.100000 0.000000
vn 0.000000 -0.100000 0.000000
vn 0.000000 -0.100000 0.000000
vn 0.000000 -0.100000 0.000000
vn 0.000000 -0.100000 0.000000
vn 0.000000 -0.100000 0.000000
vn 0.000000 -0.100000 0.000000
vn 0.000000 -0.100000 0.000000
vn 0.000000 -0.100000 0.000000
vn 0.000000 -0.100000 0.000000
vn 0.000000 -0.100000 0.000000
vn 0.000000 -0.100000 0.000000
vn 0.000000 -0.100000 0.000000
vn 0.000000 -0.100000 0.000000
vn 0.000000 -0.100000 0.000000
vn 0.000000 -0.100000 0.000000
vn 0.000000 -0.100000 0.000000
vn 0.000000 -0.100000 0.000000
vn 0.000000 -0.100000 0.000000
vn 0.000000 -0.100000 0.000000
vn -0.000000 0.100000 -0.000000
vn -0.000000 0.100000 -0.000000
vn -0.000000 0.100000 -0.000000
vn -0.000000 0.100000 -0.000000
vn -0.000000 0.100000 -0.000000
vn -0.000000 0.100000 -0.000000
vn -0.000000 0.100000 -0.000000
vn -0.000000 0.100000 -0.000000
vn -0.000000 0.100000 -0.000000
vn -0.000000 0.100000 -0.000000
vn -0.000000 0.100000 -0.000000
vn -0.000000 0.100000 -0.000000
vn -0.000000 0.100000 -0.000000
vn -0.000000 0.100000 -0.000000
vn -0.000000 0.100000 -0.000000
vn -0.000000 0.100000 -0.000000
vn -0.000000 0.100000 -0.000000
vn -0.000000 0.100000 -0.000000
vn -0.000000 0.100000 -0.000000
vn -0.000000 0.100000 -0.000000
vn -0.000000 0.100000 -0.000000
vn -0.000000 0.100000 -0.000000
vn -0.000000 0.100000 -0.000000
vn -0.000000 0.100000 -0.000000
vn -0.000000 0.100000 -0.000000
vn -0.000000 0.100000 -0.000000
vn -0.000000 0.100000 -0.000000
vn -0.000000 0.100000 -0.000000
vn -0.000000 0.100000 -0.000000
vn -0.000000 0.100000 -0.000000
vn -0.000000 0.100000 -0.000000
vn -0.000000 0.100000 -0.000000
vn -0.000000 0.100000 -0.000000
vn -0.000000 0.100000 -0.000000
vn -0.000000 0.100000 -0.000000
vn -0.000000 0.100000 -0.000000
vn -0.000000 0.100000 -0.000000
vn -0.000000 0.100000 -0.000000
vn -0.000000 0.100000 -0.000000
vn -0.000000 0.100000 -0.000000
vn -0.000000 0.100000 -0.000000
vn -0.000000 0.100000 -0.000000
vn -0.000000 0.100000 -0.000000
vn -0.000000 0.100000 -0.000000
vn -0.000000 0.100000 -0.000000
vn -0.000000 0.100000 -0.000000
vn -0.000000 0.100000 -0.000000
vn -0.000000 0.100000 -0.000000
vn -0.000000 0.100000 -0.000000
vn -0.000000 0.100000 -0.000000
vn -0.000000 0.100000 -0.000000
vn -0.000000 0.100000 -0.000000
vn -0.000000 0.100000 -0.000000
vn -0.000000 0.100000 -0.000000
vn -0.000000 0.100000 -0.000000
vn -0.000000 0.100000 -0.000000
vn -0.000000 0.100000 -0.000000
vn -0.000000 0.100000 -0.000000
vn -0.000000 0.100000 -0.000000
vn -0.000000 0.100000 -0.000000
vn -0.000000 0.100000 -0.000000
vn -0.000000 0.100000 -0.000000
vn -0.000000 0.100000 -0.000000
vn -0.000000 0.100000 -0.000000
vn -0.000000 0.100000 -0.000000
vn -0.000000 0.100000 -0.000000
vn -0.000000 0.100000 -0.000000
vn -0.000000 0.100000 -0.000000
vn -0.000000 0.100000 -0.000000
vn -0.000000 0.100000 -0.000000
vn -0.000000 0.100000 -0.000000
vn -0.000000 0.100000 -0.000000
vn -0.000000 0.100000 -0.000000
vn -0.000000 0.100000 -0.000000
vn -0.000000 0.100000 -0.000000
vn -0.000000 0.100000 -0.000000
vn -0.000000 0.100000 -0.000000
vn -0.000000 0.100000 -0.000000
vn -0.000000 0.100000 -0.000000
vn -0.000000 0.100000 -0.000000
vn -0.000000 0.100000 -0.000000
vn -0.000000 0.100000 -0.000000
vn -0.000000 0.100000 -0.000000
vn -0.000000 0.100000 -0.000000
vn -0.000000 0.100000 -0.000000
vn -0.000000 0.100000 -0.000000
vn -0.000000 0.100000 -0.000000
vn -0.000000 0.100000 -0.000000
vn -0.000000 0.100000 -0.000000
vn -0.000000 0.100000 -0.000000
vn -0.000000 0.100000 -0.000000
vn -0.000000 0.100000 -0.000000
vn -0.000000 0.100000 -0.000000
vn -0.000000 0.100000 -0.000000
vn -0.000000 0.100000 -0.000000
vn -0.000000 0.100000 -0.000000
vn -0.000000 0.100000 -0.000000
vn -0.000000 0.100000 -0.000000
vn -0.000000 0.100000 -0.000000
vn -0.000000 0.100000 -0.000000
vn -0.000000 0.100000 -0.000000
vn -0.000000 0.100000 -0.000000
vn -0.000000 0.100000 -0.000000
vn -0.000000 0.100000 -0.000000
vn -0.000000 0.100000 -0.000000
vn -0.000000 0.100000 -0.000000
vn -0.000000 0.100000 -0.000000
vn -0.000000 0.100000 -0.000000
vn -0.000000 0.100000 -0.000000
vn -0.000000 0.100000 -0.000000
vn -0.000000 0.100000 -0.000000
vn -0.000000 0.100000 -0.000000
vn -0.000000 0.100000 -0.000000
vn -0.000000 0.100000 -0.000000
vn -0.000000 0.100000 -0.000000
vn -0.000000 0.100000 -0.000000
vn -0.000000 0.100000 -0.000000
vn -0.000000 0.100000 -0.000000
vn -0.000000 0.100000 -0.000000
vn -0.000000 0.100000 -0.000000
vn -0.000000 0.100000 -0.000000
vn -0.000000 0.100000 -0.000000
vn -0.000000 0.100000 -0.000000
vn -0.000000 0.100000 -0.000000
vn -0.000000 0.100000 -0.000000
vn -0.000000 0.100000 -0.000000
vn -0.000000 0.100000 -0.000000
vn -0.000000 0.100000 -0.000000
vn -0.000000 0.100000 -0.000000
vn -0.000000 0.100000 -0.000000
vn -0.000000 0.100000 -0.000000
vn -0.000000 0.100000 -0.000000
vn -0.000000 0.100000 -0.000000
vn -0.000000 0.100000 -0.000000
vn -0.000000 0.100000 -0.000000
vn -0.000000 0.100000 -0.000000
vn -0.000000 0.100000 -0.000000
vn -0.000000 0.100000 -0.000000
vn -0.000000 0.100000 -0.000000
vn -0.000000 0.100000 -0.000000
vn -0.000000 0.100000 -0.000000
vn -0.000000 0.100000 -0.000000
vn -0.000000 0.100000 -0.000000
vn -0.000000 0.100000 -0.000000
vn -0.000000 0.100000 -0.000000
vn -0.000000 0.100000 -0.000000
vn -0.000000 0.100000 -0.000000
vn -0.000000 0.100000 -0.000000
vn -0.000000 0.100000 -0.000000
vn -0.000000 0.100000 -0.000000
vn -0.000000 0.100000 -0.000000
vn -0.000000 0.100000 -0.000000
vn -0.000000 0.100000 -0.000000
vn -0.000000 0.100000 -0.000000
vn -0.000000 0.100000 -0.000000
vn -0.000000 0.100000 -0.000000
vn -0.000000 0.100000 -0.000000
vn -0.000000 0.100000 -0.000000
vn -0.000000 0.100000 -0.000000
vn -0.000000 0.100000 -0.000000
vn -0.000000 0.100000 -0.000000
vn -0.000000 0.100000 -0.000000
vn -0.000000 0.100000 -0.000000
vn -0.000000 0.100000 -0.000000
vn -0.000000 0.100000 -0.000000
vn -0.000000 0.100000 -0.000000
vn -0.000000 0.100000 -0.000000
vn -0.000000 0.100000 -0.000000
vn -0.000000 0.100000 -0.000000
vn -0.000000 0.100000 -0.000000
vn -0.000000 0.100000 -0.000000
vn -0.000000 0.100000 -0.000000
vn -0.000000 0.100000 -0.000000
vn -0.000000 0.100000 -0.000000
vn -0.000000 0.100000 -0.000000
vn -0.000000 0.100000 -0.000000
vn -0.000000 0.100000 -0.000000
vn -0.000000 0.100000 -0.000000
vn -0.000000 0.100000 -0.000000
vn -0.000000 0.100000 -0.000000
vn -0.000000 0.100000 -0.000000
vn -0.000000 0.100000 -0.000000
vn -0.000000 0.100000 -0.000000
vn -0.000000 0.100000 -0.000000
vn -0.000000 0.100000 -0.000000
vn -0.000000 0.100000 -0.000000
vn -0.000000 0.100000 -0.000000
vn 0.003359 0.000000 -0.099944
vn 0.000000 0.000000 -0.100000
vn 0.000000 0.000000 -0.100000
vn -0.003359 0.000000 -0.099944
vn -0.003359 0.000000 -0.099944
vn -0.006715 0.000000 -0.099774
vn -0.006715 0.000000 -0.099774
vn -0.010063 0.000000 -0.099492
vn -0.010063 0.000000 -0.099492
vn -0.013400 0.000000 -0.099098
vn -0.013400 0.000000 -0.099098
vn -0.016721 0.000000 -0.098592
vn -0.016721 0.000000 -0.098592
vn -0.020024 0.000000 -0.097975
vn -0.020024 0.000000 -0.097975
vn -0.023304 0.000000 -0.097247
vn -0.023304 0.000000 -0.097247
vn -0.026557 0.000000 -0.096409
vn -0.026557 0.000000 -0.096409
vn -0.029781 0.000000 -0.095462
vn -0.029781 0.000000 -0.095462
vn -0.032971 0.000000 -0.094408
vn -0.032971 0.000000 -0.094408
vn -0.036124 0.000000 -0.093247
vn -0.036124 0.000000 -0.093247
vn -0.039236 0.000000 -0.091981
vn -0.039236 0.000000 -0.091981
vn -0.042304 0.000000 -0.090611
vn -0.042304 0.000000 -0.090611
vn -0.045324 0.000000 -0.089139
vn -0.045324 0.000000 -0.089139
vn -0.048293 0.000000 -0.087566
vn -0.048293 0.000000 -0.087566
vn -0.051207 0.000000 -0.085894
vn -0.051207 0.000000 -0.085894
vn -0.054064 0.000000 -0.084125
vn -0.054064 0.000000 -0.084125
vn -0.056860 0.000000 -0.082262
vn -0.056860 0.000000 -0.082262
vn -0.059591 0.000000 -0.080305
vn -0.059591 0.000000 -0.080305
vn -0.062255 0.000000 -0.078258
vn -0.062255 0.000000 -0.078258
vn -0.064849 0.000000 -0.076122
vn -0.064849 0.000000 -0.076122
vn -0.067370 0.000000 -0.073901
vn -0.067370 0.000000 -0.073901
vn -0.069814 0.000000 -0.071596
vn -0.069814 0.000000 -0.071596
vn -0.072180 0.000000 -0.069210
vn -0.072180 0.000000 -0.069210
vn -0.074464 0.000000 -0.066746
vn -0.074464 0.000000 -0.066746
vn -0.076664 0.000000 -0.064207
vn -0.076664 0.000000 -0.064207
vn -0.078778 0.000000 -0.061596
vn -0.078778 0.000000 -0.061596
vn -0.080803 0.000000 -0.058914
vn -0.080803 0.000000 -0.058914
vn -0.082736 0.000000 -0.056167
vn -0.082736 0.000000 -0.056167
vn -0.084577 0.000000 -0.053356
vn -0.084577 0.000000 -0.053356
vn -0.086321 0.000000 -0.050484
vn -0.086321 0.000000 -0.050484
vn -0.087968 0.000000 -0.047556
vn -0.087968 0.000000 -0.047556
vn -0.089516 0.000000 -0.044574
vn -0.089516 0.000000 -0.044574
vn -0.090963 0.000000 -0.041542
vn -0.090963 0.000000 -0.041542
vn -0.092307 0.000000 -0.038462
vn -0.092307 0.000000 -0.038462
vn -0.093547 0.000000 -0.035340
vn -0.093547 0.000000 -0.035340
vn -0.094682 0.000000 -0.032177
vn -0.094682 0.000000 -0.032177
vn -0.095709 0.000000 -0.028978
vn -0.095709 0.000000 -0.028978
vn -0.096629 0.000000 -0.025747
vn -0.096629 0.000000 -0.025747
vn -0.097439 0.000000 -0.022486
vn -0.097439 0.000000 -0.022486
vn -0.098139 0.000000 -0.019200
vn -0.098139 0.000000 -0.019200
vn -0.098729 0.000000 -0.015892
vn -0.098729 0.000000 -0.015892
vn -0.099207 0.000000 -0.012567
vn -0.099207 0.000000 -0.012567
vn -0.099573 0.000000 -0.009227
vn -0.099573 0.000000 -0.009227
vn -0.099827 0.000000 -0.005877
vn -0.099827 0.000000 -0.005877
vn -0.099968 0.000000 -0.002520
vn -0.099968 0.000000 -0.002520
vn -0.099996 0.000000 0.000840
vn -0.099996 0.000000 0.000840
vn -0.099912 0.000000 0.004199
vn -0.099912 0.000000 0.004199
vn -0.099714 0.000000 0.007553
vn -0.099714 0.000000 0.007553
vn -0.099404 0.000000 0.010898
vn -0.099404 0.000000 0.010898
vn -0.098982 0.000000 0.014231
vn -0.098982 0.000000 0.014231
vn -0.098448 0.000000 0.017549
vn -0.098448 0.000000 0.017549
vn -0.097803 0.000000 0.020846
vn -0.097803 0.000000 0.020846
vn -0.097048 0.000000 0.024120
vn -0.097048 0.000000 0.024120
vn -0.096183 0.000000 0.027366
vn -0.096183 0.000000 0.027366
vn -0.095209 0.000000 0.030582
vn -0.095209 0.000000 0.030582
vn -0.094128 0.000000 0.033763
vn -0.094128 0.000000 0.033763
vn -0.092940 0.000000 0.036906
vn -0.092940 0.000000 0.036906
vn -0.091648 0.000000 0.040008
vn -0.091648 0.000000 0.040008
vn -0.090253 0.000000 0.043064
vn -0.090253 0.000000 0.043064
vn -0.088755 0.000000 0.046071
vn -0.088755 0.000000 0.046071
vn -0.087157 0.000000 0.049027
vn -0.087157 0.000000 0.049027
vn -0.085461 0.000000 0.051927
vn -0.085461 0.000000 0.051927
vn -0.083668 0.000000 0.054769
vn -0.083668 0.000000 0.054769
vn -0.081781 0.000000 0.057549
vn -0.081781 0.000000 0.057549
vn -0.079802 0.000000 0.060263
vn -0.079802 0.000000 0.060263
vn -0.077732 0.000000 0.062910
vn -0.077732 0.000000 0.062910
vn -0.075575 0.000000 0.065486
vn -0.075575 0.000000 0.065486
vn -0.073332 0.000000 0.067988
vn -0.073332 0.000000 0.067988
vn -0.071007 0.000000 0.070413
vn -0.071007 0.000000 0.070413
vn -0.068602 0.000000 0.072759
vn -0.068602 0.000000 0.072759
vn -0.066119 0.000000 0.075022
vn -0.066119 0.000000 0.075022
vn -0.063561 0.000000 0.077201
vn -0.063561 0.000000 0.077201
vn -0.060932 0.000000 0.079293
vn -0.060932 0.000000 0.079293
vn -0.058234 0.000000 0.081295
vn -0.058234 0.000000 0.081295
vn -0.055470 0.000000 0.083205
vn -0.055470 0.000000 0.083205
vn -0.052643 0.000000 0.085022
vn -0.052643 0.000000 0.085022
vn -0.049757 0.000000 0.086742
vn -0.049757 0.000000 0.086742
vn -0.046815 0.000000 0.088365
vn -0.046815 0.000000 0.088365
vn -0.043820 0.000000 0.089888
vn -0.043820 0.000000 0.089888
vn -0.040776 0.000000 0.091309
vn -0.040776 0.000000 0.091309
vn -0.037686 0.000000 0.092627
vn -0.037686 0.000000 0.092627
vn -0.034553 0.000000 0.093841
vn -0.034553 0.000000 0.093841
vn -0.031381 0.000000 0.094949
vn -0.031381 0.000000 0.094949
vn -0.028173 0.000000 0.095949
vn -0.028173 0.000000 0.095949
vn -0.024934 0.000000 0.096842
vn -0.024934 0.000000 0.096842
vn -0.021667 0.000000 0.097625
vn -0.021667 0.000000 0.097625
vn -0.018375 0.000000 0.098297
vn -0.018375 0.000000 0.098297
vn -0.015062 0.000000 0.098859
vn -0.015062 0.000000 0.098859
vn -0.011733 0.000000 0.099309
vn -0.011733 0.000000 0.099309
vn -0.008390 0.000000 0.099647
vn -0.008390 0.000000 0.099647
vn -0.005038 0.000000 0.099873
vn -0.005038 0.000000 0.099873
vn -0.001680 0.000000 0.099986
vn -0.001680 0.000000 0.099986
vn 0.001680 0.000000 0.099986
vn 0.001680 0.000000 0.099986
vn 0.005038 0.000000 0.099873
vn 0.005038 0.000000 0.099873
vn 0.008390 0.000000 0.099647
vn 0.008390 0.000000 0.099647
vn 0.011733 0.000000 0.099309
vn 0.011733 0.000000 0.099309
vn 0.015062 0.000000 0.098859
vn 0.015062 0.000000 0.098859
vn 0.018375 0.000000 0.098297
vn 0.018375 0.000000 0.098297
vn 0.021667 0.000000 0.097625
vn 0.021667 0.000000 0.097625
vn 0.024934 0.000000 0.096842
vn 0.024934 0.000000 0.096842
vn 0.028173 0.000000 0.095949
vn 0.028173 0.000000 0.095949
vn 0.031381 0.000000 0.094949
vn 0.031381 0.000000 0.094949
vn 0.034553 0.000000 0.093841
vn 0.034553 0.000000 0.093841
vn 0.037686 0.000000 0.092627
vn 0.037686 0.000000 0.092627
vn 0.040776 0.000000 0.091309
vn 0.040776 0.000000 0.091309
vn 0.043820 0.000000 0.089888
vn 0.043820 0.000000 0.089888
vn 0.046815 0.000000 0.088365
vn 0.046815 0.000000 0.088365
vn 0.049757 0.000000 0.086742
vn 0.049757 0.000000 0.086742
vn 0.052643 0.000000 0.085022
vn 0.052643 0.000000 0.085022
vn 0.055470 0.000000 0.083205
vn 0.055470 0.000000 0.083205
vn 0.058234 0.000000 0.081295
vn 0.058234 0.000000 0.081295
vn 0.060932 0.000000 0.079293
vn 0.060932 0.000000 0.079293
vn 0.063561 0.000000 0.077201
vn 0.063561 0.000000 0.077201
vn 0.066119 0.000000 0.075022
vn 0.066119 0.000000 0.075022
vn 0.068602 0.000000 0.072759
vn 0.068602 0.000000 0.072759
vn 0.071007 0.000000 0.070413
vn 0.071007 0.000000 0.070413
vn 0.073332 0.000000 0.067988
vn 0.073332 0.000000 0.067988
vn 0.075575 0.000000 0.065486
vn 0.075575 0.000000 0.065486
vn 0.077732 0.000000 0.062910
vn 0.077732 0.000000 0.062910
vn 0.079802 0.000000 0.060263
vn 0.079802 0.000000 0.060263
vn 0.081781 0.000000 0.057549
vn 0.081781 0.000000 0.057549
vn 0.083668 0.000000 0.054769
vn 0.083668 0.000000 0.054769
vn 0.085461 0.000000 0.051927
vn 0.085461 0.000000 0.051927
vn 0.087157 0.000000 0.049027
vn 0.087157 0.000000 0.049027
vn 0.088755 0.000000 0.046071
vn 0.088755 0.000000 0.046071
vn 0.090253 0.000000 0.043064
vn 0.090253 0.000000 0.043064
vn 0.091648 0.000000 0.040008
vn 0.091648 0.000000 0.040008
vn 0.092940 0.000000 0.036906
vn 0.092940 0.000000 0.036906
vn 0.094128 0.000000 0.033763
vn 0.094128 0.000000 0.033763
vn 0.095209 0.000000 0.030582
vn 0.095209 0.000000 0.030582
vn 0.096183 0.000000 0.027366
vn 0.096183 0.000000 0.027366
vn 0.097048 0.000000 0.024120
vn 0.097048 0.000000 0.024120
vn 0.097803 0.000000 0.020846
vn 0.097803 0.000000 0.020846
vn 0.098448 0.000000 0.017549
vn 0.098448 0.000000 0.017549
vn 0.098982 0.000000 0.014231
vn 0.098982 0.000000 0.014231
vn 0.099404 0.000000 0.010898
vn 0.099404 0.000000 0.010898
vn 0.099714 0.000000 0.007553
vn 0.099714 0.000000 0.007553
vn 0.099912 0.000000 0.004199
vn 0.099912 0.000000 0.004199
vn 0.099996 0.000000 0.000840
vn 0.099996 0.000000 0.000840
vn 0.099968 0.000000 -0.002520
vn 0.099968 0.000000 -0.002520
vn 0.099827 0.000000 -0.005877
vn 0.099827 0.000000 -0.005877
vn 0.099573 0.000000 -0.009227
vn 0.099573 0.000000 -0.009227
vn 0.099207 0.000000 -0.012567
vn 0.099207 0.000000 -0.012567
vn 0.098729 0.000000 -0.015892
vn 0.098729 0.000000 -0.015892
vn 0.098139 0.000000 -0.019200
vn 0.098139 0.000000 -0.019200
vn 0.097439 0.000000 -0.022486
vn 0.097439 0.000000 -0.022486
vn 0.096629 0.000000 -0.025747
vn 0.096629 0.000000 -0.025747
vn 0.095709 0.000000 -0.028978
vn 0.095709 0.000000 -0.028978
vn 0.094682 0.000000 -0.032177
vn 0.094682 0.000000 -0.032177
vn 0.093547 0.000000 -0.035340
vn 0.093547 0.000000 -0.035340
vn 0.092307 0.000000 -0.038462
vn 0.092307 0.000000 -0.038462
vn 0.090963 0.000000 -0.041542
vn 0.090963 0.000000 -0.041542
vn 0.089516 0.000000 -0.044574
vn 0.089516 0.000000 -0.044574
vn 0.087968 0.000000 -0.047556
vn 0.087968 0.000000 -0.047556
vn 0.086321 0.000000 -0.050484
vn 0.086321 0.000000 -0.050484
vn 0.084577 0.000000 -0.053356
vn 0.084577 0.000000 -0.053356
vn 0.082736 0.000000 -0.056167
vn 0.082736 0.000000 -0.056167
vn 0.080803 0.000000 -0.058914
vn 0.080803 0.000000 -0.058914
vn 0.078778 0.000000 -0.061596
vn 0.078778 0.000000 -0.061596
vn 0.076664 0.000000 -0.064207
vn 0.076664 0.000000 -0.064207
vn 0.074464 0.000000 -0.066746
vn 0.074464 0.000000 -0.066746
vn 0.072180 0.000000 -0.069210
vn 0.072180 0.000000 -0.069210
vn 0.069814 0.000000 -0.071596
vn 0.069814 0.000000 -0.071596
vn 0.067370 0.000000 -0.073901
vn 0.067370 0.000000 -0.073901
vn 0.064849 0.000000 -0.076122
vn 0.064849 0.000000 -0.076122
vn 0.062255 0.000000 -0.078258
vn 0.062255 0.000000 -0.078258
vn 0.059591 0.000000 -0.080305
vn 0.059591 0.000000 -0.080305
vn 0.056860 0.000000 -0.082262
vn 0.056860 0.000000 -0.082262
vn 0.054064 0.000000 -0.084125
vn 0.054064 0.000000 -0.084125
vn 0.051207 0.000000 -0.085894
vn 0.051207 0.000000 -0.085894
vn 0.048293 0.000000 -0.087566
vn 0.048293 0.000000 -0.087566
vn 0.045324 0.000000 -0.089139
vn 0.045324 0.000000 -0.089139
vn 0.042304 0.000000 -0.090611
vn 0.042304 0.000000 -0.090611
vn 0.039236 0.000000 -0.091981
vn 0.039236 0.000000 -0.091981
vn 0.036124 0.000000 -0.093247
vn 0.036124 0.000000 -0.093247
vn 0.032971 0.000000 -0.094408
vn 0.032971 0.000000 -0.094408
vn 0.029781 0.000000 -0.095462
vn 0.029781 0.000000 -0.095462
vn 0.026557 0.000000 -0.096409
vn 0.026557 0.000000 -0.096409
vn 0.023304 0.000000 -0.097247
vn 0.023304 0.000000 -0.097247
vn 0.020024 0.000000 -0.097975
vn 0.020024 0.000000 -0.097975
vn 0.016721 0.000000 -0.098592
vn 0.016721 0.000000 -0.098592
vn 0.013400 0.000000 -0.099098
vn 0.013400 0.000000 -0.099098
vn 0.010063 0.000000 -0.099492
vn 0.010063 0.000000 -0.099492
vn 0.006715 0.000000 -0.099774
vn 0.006715 0.000000 -0.099774
vn 0.003359 0.000000 -0.099944
usemtl 191,191,191
f 2/1/1 94/2/2 1/3/3
f 1/3/3 94/2/2 95/4/4
f 1/3/3 95/4/4 187/5/5
f 187/5/5 95/4/4 96/6/6
f 187/5/5 96/6/6 186/7/7
f 186/7/7 96/6/6 97/8/8
f 186/7/7 97/8/8 185/9/9
f 185/9/9 97/8/8 98/10/10
f 185/9/9 98/10/10 184/11/11
f 184/11/11 98/10/10 99/12/12
f 184/11/11 99/12/12 183/13/13
f 183/13/13 99/12/12 100/14/14
f 183/13/13 100/14/14 182/15/15
f 182/15/15 100/14/14 101/16/16
f 182/15/15 101/16/16 181/17/17
f 181/17/17 101/16/16 102/18/18
f 181/17/17 102/18/18 180/19/19
f 180/19/19 102/18/18 103/20/20
f 180/19/19 103/20/20 179/21/21
f 179/21/21 103/20/20 104/22/22
f 179/21/21 104/22/22 178/23/23
f 178/23/23 104/22/22 105/24/24
f 178/23/23 105/24/24 177/25/25
f 177/25/25 105/24/24 106/26/26
f 177/25/25 106/26/26 176/27/27
f 176/27/27 106/26/26 107/28/28
f 176/27/27 107/28/28 175/29/29
f 175/29/29 107/28/28 108/30/30
f 175/29/29 108/30/30 174/31/31
f 174/31/31 108/30/30 109/32/32
f 174/31/31 109/32/32 173/33/33
f 173/33/33 109/32/32 110/34/34
f 173/33/33 110/34/34 172/35/35
f 172/35/35 110/34/34 111/36/36
f 172/35/35 111/36/36 171/37/37
f 171/37/37 111/36/36 112/38/38
f 171/37/37 112/38/38 170/39/39
f 170/39/39 112/38/38 113/40/40
f 170/39/39 113/40/40 169/41/41
f 169/41/41 113/40/40 114/42/42
f 169/41/41 114/42/42 168/43/43
f 168/43/43 114/42/42 115/44/44
f 168/43/43 115/44/44 167/45/45
f 167/45/45 115/44/44 116/46/46
f 167/45/45 116/46/46 166/47/47
f 166/47/47 116/46/46 117/48/48
f 166/47/47 117/48/48 165/49/49
f 165/49/49 117/48/48 118/50/50
f 165/49/49 118/50/50 164/51/51
f 164/51/51 118/50/50 119/52/52
f 164/51/51 119/52/52 163/53/53
f 163/53/53 119/52/52 120/54/54
f 163/53/53 120/54/54 162/55/55
f 162/55/55 120/54/54 121/56/56
f 162/55/55 121/56/56 161/57/57
f 161/57/57 121/56/56 122/58/58
f 161/57/57 122/58/58 160/59/59
f 160/59/59 122/58/58 123/60/60
f 160/59/59 123/60/60 159/61/61
f 159/61/61 123/60/60 124/62/62
f 159/61/61 124/62/62 158/63/63
f 158/63/63 124/62/62 125/64/64
f 158/63/63 125/64/64 157/65/65
f 157/65/65 125/64/64 126/66/66
f 157/65/65 126/66/66 156/67/67
f 156/67/67 126/66/66 127/68/68
f 156/67/67 127/68/68 155/69/69
f 155/69/69 127/68/68 128/70/70
f 155/69/69 128/70/70 154/71/71
f 154/71/71 128/70/70 129/72/72
f 154/71/71 129/72/72 153/73/73
f 153/73/73 129/72/72 130/74/74
f 153/73/73 130/74/74 152/75/75
f 152/75/75 130/74/74 131/76/76
f 152/75/75 131/76/76 151/77/77
f 151/77/77 131/76/76 132/78/78
f 151/77/77 132/78/78 150/79/79
f 150/79/79 132/78/78 133/80/80
f 150/79/79 133/80/80 149/81/81
f 149/81/81 133/80/80 134/82/82
f 149/81/81 134/82/82 148/83/83
f 148/83/83 134/82/82 135/84/84
f 148/83/83 135/84/84 147/85/85
f 147/85/85 135/84/84 136/86/86
f 147/85/85 136/86/86 146/87/87
f 146/87/87 136/86/86 137/88/88
f 146/87/87 137/88/88 145/89/89
f 145/89/89 137/88/88 138/90/90
f 145/89/89 138/90/90 144/91/91
f 144/91/91 138/90/90 139/92/92
f 144/91/91 139/92/92 143/93/93
f 143/93/93 139/92/92 140/94/94
f 143/93/93 140/94/94 142/95/95
f 142/95/95 140/94/94 141/96/96
f 94/2/2 2/1/1 93/97/97
f 93/97/97 2/1/1 3/98/98
f 93/97/97 3/98/98 92/99/99
f 92/99/99 3/98/98 4/100/100
f 92/99/99 4/100/100 91/101/101
f 91/101/101 4/100/100 5/102/102
f 91/101/101 5/102/102 90/103/103
f 90/103/103 5/102/102 6/104/104
f 90/103/103 6/104/104 89/105/105
f 89/105/105 6/104/104 7/106/106
f 89/105/105 7/106/106 88/107/107
f 88/107/107 7/106/106 8/108/108
f 88/107/107 8/108/108 87/109/109
f 87/109/109 8/108/108 9/110/110
f 87/109/109 9/110/110 86/111/111
f 86/111/111 9/110/110 10/112/112
f 86/111/111 10/112/112 85/113/113
f 85/113/113 10/112/112 11/114/114
f 85/113/113 11/114/114 84/115/115
f 84/115/115 11/114/114 12/116/116
f 84/115/115 12/116/116 83/117/117
f 83/117/117 12/116/116 13/118/118
f 83/117/117 13/118/118 82/119/119
f 82/119/119 13/118/118 14/120/120
f 82/119/119 14/120/120 81/121/121
f 81/121/121 14/120/120 15/122/122
f 81/121/121 15/122/122 80/123/123
f 80/123/123 15/122/122 16/124/124
f 80/123/123 16/124/124 79/125/125
f 79/125/125 16/124/124 17/126/126
f 79/125/125 17/126/126 78/127/127
f 78/127/127 17/126/126 18/128/128
f 78/127/127 18/128/128 77/129/129
f 77/129/129 18/128/128 19/130/130
f 77/129/129 19/130/130 76/131/131
f 76/131/131 19/130/130 20/132/132
f 76/131/131 20/132/132 75/133/133
f 75/133/133 20/132/132 21/134/134
f 75/133/133 21/134/134 74/135/135
f 74/135/135 21/134/134 22/136/136
f 74/135/135 22/136/136 73/137/137
f 73/137/137 22/136/136 23/138/138
f 73/137/137 23/138/138 72/139/139
f 72/139/139 23/138/138 24/140/140
f 72/139/139 24/140/140 71/141/141
f 71/141/141 24/140/140 25/142/142
f 71/141/141 25/142/142 70/143/143
f 70/143/143 25/142/142 26/144/144
f 70/143/143 26/144/144 69/145/145
f 69/145/145 26/144/144 27/146/146
f 69/145/145 27/146/146 68/147/147
f 68/147/147 27/146/146 28/148/148
f 68/147/147 28/148/148 67/149/149
f 67/149/149 28/148/148 29/150/150
f 67/149/149 29/150/150 66/151/151
f 66/151/151 29/150/150 30/152/152
f 66/151/151 30/152/152 65/153/153
f 65/153/153 30/152/152 31/154/154
f 65/153/153 31/154/154 64/155/155
f 64/155/155 31/154/154 32/156/156
f 64/155/155 32/156/156 63/157/157
f 63/157/157 32/156/156 33/158/158
f 63/157/157 33/158/158 62/159/159
f 62/159/159 33/158/158 34/160/160
f 62/159/159 34/160/160 61/161/161
f 61/161/161 34/160/160 35/162/162
f 61/161/161 35/162/162 60/163/163
f 60/163/163 35/162/162 36/164/164
f 60/163/163 36/164/164 59/165/165
f 59/165/165 36/164/164 37/166/166
f 59/165/165 37/166/166 58/167/167
f 58/167/167 37/166/166 38/168/168
f 58/167/167 38/168/168 57/169/169
f 57/169/169 38/168/168 39/170/170
f 57/169/169 39/170/170 56/171/171
f 56/171/171 39/170/170 40/172/172
f 56/171/171 40/172/172 55/173/173
f 55/173/173 40/172/172 41/174/174
f 55/173/173 41/174/174 54/175/175
f 54/175/175 41/174/174 42/176/176
f 54/175/175 42/176/176 53/177/177
f 53/177/177 42/176/176 43/178/178
f 53/177/177 43/178/178 52/179/179
f 52/179/179 43/178/178 44/180/180
f 52/179/179 44/180/180 51/181/181
f 51/181/181 44/180/180 45/182/182
f 51/181/181 45/182/182 50/183/183
f 50/183/183 45/182/182 46/184/184
f 50/183/183 46/184/184 49/185/185
f 49/185/185 46/184/184 47/186/186
f 49/185/185 47/186/186 48/187/187
f 189/188/188 281/189/189 188/190/190
f 188/190/190 281/189/189 282/191/191
f 188/190/190 282/191/191 374/192/192
f 374/192/192 282/191/191 283/193/193
f 374/192/192 283/193/193 373/194/194
f 373/194/194 283/193/193 284/195/195
f 373/194/194 284/195/195 372/196/196
f 372/196/196 284/195/195 285/197/197
f 372/196/196 285/197/197 371/198/198
f 371/198/198 285/197/197 286/199/199
f 371/198/198 286/199/199 370/200/200
f 370/200/200 286/199/199 287/201/201
f 370/200/200 287/201/201 369/202/202
f 369/202/202 287/201/201 288/203/203
f 369/202/202 288/203/203 368/204/204
f 368/204/204 288/203/203 289/205/205
f 368/204/204 289/205/205 367/206/206
f 367/206/206 289/205/205 290/207/207
f 367/206/206 290/207/207 366/208/208
f 366/208/208 290/207/207 291/209/209
f 366/208/208 291/209/209 365/210/210
f 365/210/210 291/209/209 292/211/211
f 365/210/210 292/211/211 364/212/212
f 364/212/212 292/211/211 293/213/213
f 364/212/212 293/213/213 363/214/214
f 363/214/214 293/213/213 294/215/215
f 363/214/214 294/215/215 362/216/216
f 362/216/216 294/215/215 295/217/217
f 362/216/216 295/217/217 361/218/218
f 361/218/218 295/217/217 296/219/219
f 361/218/218 296/219/219 360/220/220
f 360/220/220 296/219/219 297/221/221
f 360/220/220 297/221/221 359/222/222
f 359/222/222 297/221/221 298/223/223
f 359/222/222 298/223/223 358/224/224
f 358/224/224 298/223/223 299/225/225
f 358/224/224 299/225/225 357/226/226
f 357/226/226 299/225/225 300/227/227
f 357/226/226 300/227/227 356/228/228
f 356/228/228 300/227/227 301/229/229
f 356/228/228 301/229/229 355/230/230
f 355/230/230 301/229/229 302/231/231
f 355/230/230 302/231/231 354/232/232
f 354/232/232 302/231/231 303/233/233
f 354/232/232 303/233/233 353/234/234
f 353/234/234 303/233/233 304/235/235
f 353/234/234 304/235/235 352/236/236
f 352/236/236 304/235/235 305/237/237
f 352/236/236 305/237/237 351/238/238
f 351/238/238 305/237/237 306/239/239
f 351/238/238 306/239/239 350/240/240
f 350/240/240 306/239/239 307/241/241
f 350/240/240 307/241/241 349/242/242
f 349/242/242 307/241/241 308/243/243
f 349/242/242 308/243/243 348/244/244
f 348/244/244 308/243/243 309/245/245
f 348/244/244 309/245/245 347/246/246
f 347/246/246 309/245/245 310/247/247
f 347/246/246 310/247/247 346/248/248
f 346/248/248 310/247/247 311/249/249
f 346/248/248 311/249/249 345/250/250
f 345/250/250 311/249/249 312/251/251
f 345/250/250 312/251/251 344/252/252
f 344/252/252 312/251/251 313/253/253
f 344/252/252 313/253/253 343/254/254
f 343/254/254 313/253/253 314/255/255
f 343/254/254 314/255/255 342/256/256
f 342/256/256 314/255/255 315/257/257
f 342/256/256 315/257/257 341/258/258
f 341/258/258 315/257/257 316/259/259
f 341/258/258 316/259/259 340/260/260
f 340/260/260 316/259/259 317/261/261
f 340/260/260 317/261/261 339/262/262
f 339/262/262 317/261/261 318/263/263
f 339/262/262 318/263/263 338/264/264
f 338/264/264 318/263/263 319/265/265
f 338/264/264 319/265/265 337/266/266
f 337/266/266 319/265/265 320/267/267
f 337/266/266 320/267/267 336/268/268
f 336/268/268 320/267/267 321/269/269
f 336/268/268 321/269/269 335/270/270
f 335/270/270 321/269/269 322/271/271
f 335/270/270 322/271/271 334/272/272
f 334/272/272 322/271/271 323/273/273
f 334/272/272 323/273/273 333/274/274
f 333/274/274 323/273/273 324/275/275
f 333/274/274 324/275/275 332/276/276
f 332/276/276 324/275/275 325/277/277
f 332/276/276 325/277/277 331/278/278
f 331/278/278 325/277/277 326/279/279
f 331/278/278 326/279/279 330/280/280
f 330/280/280 326/279/279 327/281/281
f 330/280/280 327/281/281 329/282/282
f 329/282/282 327/281/281 328/283/283
f 281/189/189 189/188/188 280/284/284
f 280/284/284 189/188/188 190/285/285
f 280/284/284 190/285/285 279/286/286
f 279/286/286 190/285/285 191/287/287
f 279/286/286 191/287/287 278/288/288
f 278/288/288 191/287/287 192/289/289
f 278/288/288 192/289/289 277/290/290
f 277/290/290 192/289/289 193/291/291
f 277/290/290 193/291/291 276/292/292
f 276/292/292 193/291/291 194/293/293
f 276/292/292 194/293/293 275/294/294
f 275/294/294 194/293/293 195/295/295
f 275/294/294 195/295/295 274/296/296
f 274/296/296 195/295/295 196/297/297
f 274/296/296 196/297/297 273/298/298
f 273/298/298 196/297/297 197/299/299
f 273/298/298 197/299/299 272/300/300
f 272/300/300 197/299/299 198/301/301
f 272/300/300 198/301/301 271/302/302
f 271/302/302 198/301/301 199/303/303
f 271/302/302 199/303/303 270/304/304
f 270/304/304 199/303/303 200/305/305
f 270/304/304 200/305/305 269/306/306
f 269/306/306 200/305/305 201/307/307
f 269/306/306 201/307/307 268/308/308
f 268/308/308 201/307/307 202/309/309
f 268/308/308 202/309/309 267/310/310
f 267/310/310 202/309/309 203/311/311
f 267/310/310 203/311/311 266/312/312
f 266/312/312 203/311/311 204/313/313
f 266/312/312 204/313/313 265/314/314
f 265/314/314 204/313/313 205/315/315
f 265/314/314 205/315/315 264/316/316
f 264/316/316 205/315/315 206/317/317
f 264/316/316 206/317/317 263/318/318
f 263/318/318 206/317/317 207/319/319
f 263/318/318 207/319/319 262/320/320
f 262/320/320 207/319/319 208/321/321
f 262/320/320 208/321/321 261/322/322
f 261/322/322 208/321/321 209/323/323
f 261/322/322 209/323/323 260/324/324
f 260/324/324 209/323/323 210/325/325
f 260/324/324 210/325/325 259/326/326
f 259/326/326 210/325/325 211/327/327
f 259/326/326 211/327/327 258/328/328
f 258/328/328 211/327/327 212/329/329
f 258/328/328 212/329/329 257/330/330
f 257/330/330 212/329/329 213/331/331
f 257/330/330 213/331/331 256/332/332
f 256/332/332 213/331/331 214/333/333
f 256/332/332 214/333/333 255/334/334
f 255/334/334 214/333/333 215/335/335
f 255/334/334 215/335/335 254/336/336
f 254/336/336 215/335/335 216/337/337
f 254/336/336 216/337/337 253/338/338
f 253/338/338 216/337/337 217/339/339
f 253/338/338 217/339/339 252/340/340
f 252/340/340 217/339/339 218/341/341
f 252/340/340 218/341/341 251/342/342
f 251/342/342 218/341/341 219/343/343
f 251/342/342 219/343/343 250/344/344
f 250/344/344 219/343/343 220/345/345
f 250/344/344 220/345/345 249/346/346
f 249/346/346 220/345/345 221/347/347
f 249/346/346 221/347/347 248/348/348
f 248/348/348 221/347/347 222/349/349
f 248/348/348 222/349/349 247/350/350
f 247/350/350 222/349/349 223/351/351
f 247/350/350 223/351/351 246/352/352
f 246/352/352 223/351/351 224/353/353
f 246/352/352 224/353/353 245/354/354
f 245/354/354 224/353/353 225/355/355
f 245/354/354 225/355/355 244/356/356
f 244/356/356 225/355/355 226/357/357
f 244/356/356 226/357/357 243/358/358
f 243/358/358 226/357/357 227/359/359
f 243/358/358 227/359/359 242/360/360
f 242/360/360 227/359/359 228/361/361
f 242/360/360 228/361/361 241/362/362
f 241/362/362 228/361/361 229/363/363
f 241/362/362 229/363/363 240/364/364
f 240/364/364 229/363/363 230/365/365
f 240/364/364 230/365/365 239/366/366
f 239/366/366 230/365/365 231/367/367
f 239/366/366 231/367/367 238/368/368
f 238/368/368 231/367/367 232/369/369
f 238/368/368 232/369/369 237/370/370
f 237/370/370 232/369/369 233/371/371
f 237/370/370 233/371/371 236/372/372
f 236/372/372 233/371/371 234/373/373
f 236/372/372 234/373/373 235/374/374
f 374/375/375 1/376/376 188/377/377
f 188/377/377 1/376/376 187/378/378
f 188/377/377 187/378/378 189/379/379
f 189/379/379 187/378/378 186/380/380
f 189/379/379 186/380/380 190/381/381
f 190/381/381 186/380/380 185/382/382
f 190/381/381 185/382/382 191/383/383
f 191/383/383 185/382/382 184/384/384
f 191/383/383 184/384/384 192/385/385
f 192/385/385 184/384/384 183/386/386
f 192/385/385 183/386/386 193/387/387
f 193/387/387 183/386/386 182/388/388
f 193/387/387 182/388/388 194/389/389
f 194/389/389 182/388/388 181/390/390
f 194/389/389 181/390/390 195/391/391
f 195/391/391 181/390/390 180/392/392
f 195/391/391 180/392/392 196/393/393
f 196/393/393 180/392/392 179/394/394
f 196/393/393 179/394/394 197/395/395
f 197/395/395 179/394/394 178/396/396
f 197/395/395 178/396/396 198/397/397
f 198/397/397 178/396/396 177/398/398
f 198/397/397 177/398/398 199/399/399
f 199/399/399 177/398/398 176/400/400
f 199/399/399 176/400/400 200/401/401
f 200/401/401 176/400/400 175/402/402
f 200/401/401 175/402/402 201/403/403
f 201/403/403 175/402/402 174/404/404
f 201/403/403 174/404/404 202/405/405
f 202/405/405 174/404/404 173/406/406
f 202/405/405 173/406/406 203/407/407
f 203/407/407 173/406/406 172/408/408
f 203/407/407 172/408/408 204/409/409
f 204/409/409 172/408/408 171/410/410
f 204/409/409 171/410/410 205/411/411
f 205/411/411 171/410/410 170/412/412
f 205/411/411 170/412/412 206/413/413
f 206/413/413 170/412/412 169/414/414
f 206/413/413 169/414/414 207/415/415
f 207/415/415 169/414/414 168/416/416
f 207/415/415 168/416/416 208/417/417
f 208/417/417 168/416/416 167/418/418
f 208/417/417 167/418/418 209/419/419
f 209/419/419 167/418/418 166/420/420
f 209/419/419 166/420/420 210/421/421
f 210/421/421 166/420/420 165/422/422
f 210/421/421 165/422/422 211/423/423
f 211/423/423 165/422/422 164/424/424
f 211/423/423 164/424/424 212/425/425
f 212/425/425 164/424/424 163/426/426
f 212/425/425 163/426/426 213/427/427
f 213/427/427 163/426/426 162/428/428
f 213/427/427 162/428/428 214/429/429
f 214/429/429 162/428/428 161/430/430
f 214/429/429 161/430/430 215/431/431
f 215/431/431 161/430/430 160/432/432
f 215/431/431 160/432/432 216/433/433
f 216/433/433 160/432/432 159/434/434
f 216/433/433 159/434/434 217/435/435
f 217/435/435 159/434/434 158/436/436
f 217/435/435 158/436/436 218/437/437
f 218/437/437 158/436/436 157/438/438
f 218/437/437 157/438/438 219/439/439
f 219/439/439 157/438/438 156/440/440
f 219/439/439 156/440/440 220/441/441
f 220/441/441 156/440/440 155/442/442
f 220/441/441 155/442/442 221/443/443
f 221/443/443 155/442/442 154/444/444
f 221/443/443 154/444/444 222/445/445
f 222/445/445 154/444/444 153/446/446
f 222/445/445 153/446/446 223/447/447
f 223/447/447 153/446/446 152/448/448
f 223/447/447 152/448/448 224/449/449
f 224/449/449 152/448/448 151/450/450
f 224/449/449 151/450/450 225/451/451
f 225/451/451 151/450/450 150/452/452
f 225/451/451 150/452/452 226/453/453
f 226/453/453 150/452/452 149/454/454
f 226/453/453 149/454/454 227/455/455
f 227/455/455 149/454/454 148/456/456
f 227/455/455 148/456/456 228/457/457
f 228/457/457 148/456/456 147/458/458
f 228/457/457 147/458/458 229/459/459
f 229/459/459 147/458/458 146/460/460
f 229/459/459 146/460/460 230/461/461
f 230/461/461 146/460/460 145/462/462
f 230/461/461 145/462/462 231/463/463
f 231/463/463 145/462/462 144/464/464
f 231/463/463 144/464/464 232/465/465
f 232/465/465 144/464/464 143/466/466
f 232/465/465 143/466/466 233/467/467
f 233/467/467 143/466/466 142/468/468
f 233/467/467 142/468/468 234/469/469
f 234/469/469 142/468/468 141/470/470
f 234/469/469 141/470/470 235/471/471
f 235/471/471 141/470/470 140/472/472
f 235/471/471 140/472/472 236/473/473
f 236/473/473 140/472/472 139/474/474
f 236/473/473 139/474/474 237/475/475
f 237/475/475 139/474/474 138/476/476
f 237/475/475 138/476/476 238/477/477
f 238/477/477 138/476/476 137/478/478
f 238/477/477 137/478/478 239/479/479
f 239/479/479 137/478/478 136/480/480
f 239/479/479 136/480/480 240/481/481
f 240/481/481 136/480/480 135/482/482
f 240/481/481 135/482/482 241/483/483
f 241/483/483 135/482/482 134/484/484
f 241/483/483 134/484/484 242/485/485
f 242/485/485 134/484/484 133/486/486
f 242/485/485 133/486/486 243/487/487
f 243/487/487 133/486/486 132/488/488
f 243/487/487 132/488/488 244/489/489
f 244/489/489 132/488/488 131/490/490
f 244/489/489 131/490/490 245/491/491
f 245/491/491 131/490/490 130/492/492
f 245/491/491 130/492/492 246/493/493
f 246/493/493 130/492/492 129/494/494
f 246/493/493 129/494/494 247/495/495
f 247/495/495 129/494/494 128/496/496
f 247/495/495 128/496/496 248/497/497
f 248/497/497 128/496/496 127/498/498
f 248/497/497 127/498/498 249/499/499
f 249/499/499 127/498/498 126/500/500
f 249/499/499 126/500/500 250/501/501
f 250/501/501 126/500/500 125/502/502
f 250/501/501 125/502/502 251/503/503
f 251/503/503 125/502/502 124/504/504
f 251/503/503 124/504/504 252/505/505
f 252/505/505 124/504/504 123/506/506
f 252/505/505 123/506/506 253/507/507
f 253/507/507 123/506/506 122/508/508
f 253/507/507 122/508/508 254/509/509
f 254/509/509 122/508/508 121/510/510
f 254/509/509 121/510/510 255/511/511
f 255/511/511 121/510/510 120/512/512
f 255/511/511 120/512/512 256/513/513
f 256/513/513 120/512/512 119/514/514
f 256/513/513 119/514/514 257/515/515
f 257/515/515 119/514/514 118/516/516
f 257/515/515 118/516/516 258/517/517
f 258/517/517 118/516/516 117/518/518
f 258/517/517 117/518/518 259/519/519
f 259/519/519 117/518/518 116/520/520
f 259/519/519 116/520/520 260/521/521
f 260/521/521 116/520/520 115/522/522
f 260/521/521 115/522/522 261/523/523
f 261/523/523 115/522/522 114/524/524
f 261/523/523 114/524/524 262/525/525
f 262/525/525 114/524/524 113/526/526
f 262/525/525 113/526/526 263/527/527
f 263/527/527 113/526/526 112/528/528
f 263/527/527 112/528/528 264/529/529
f 264/529/529 112/528/528 111/530/530
f 264/529/529 111/530/530 265/531/531
f 265/531/531 111/530/530 110/532/532
f 265/531/531 110/532/532 266/533/533
f 266/533/533 110/532/532 109/534/534
f 266/533/533 109/534/534 267/535/535
f 267/535/535 109/534/534 108/536/536
f 267/535/535 108/536/536 268/537/537
f 268/537/537 108/536/536 107/538/538
f 268/537/537 107/538/538 269/539/539
f 269/539/539 107/538/538 106/540/540
f 269/539/539 106/540/540 270/541/541
f 270/541/541 106/540/540 105/542/542
f 270/541/541 105/542/542 271/543/543
f 271/543/543 105/542/542 104/544/544
f 271/543/543 104/544/544 272/545/545
f 272/545/545 104/544/544 103/546/546
f 272/545/545 103/546/546 273/547/547
f 273/547/547 103/546/546 102/548/548
f 273/547/547 102/548/548 274/549/549
f 274/549/549 102/548/548 101/550/550
f 274/549/549 101/550/550 275/551/551
f 275/551/551 101/550/550 100/552/552
f 275/551/551 100/552/552 276/553/553
f 276/553/553 100/552/552 99/554/554
f 276/553/553 99/554/554 277/555/555
f 277/555/555 99/554/554 98/556/556
f 277/555/555 98/556/556 278/557/557
f 278/557/557 98/556/556 97/558/558
f 278/557/557 97/558/558 279/559/559
f 279/559/559 97/558/558 96/560/560
f 279/559/559 96/560/560 280/561/561
f 280/561/561 96/560/560 95/562/562
f 280/561/561 95/562/562 281/563/563
f 281/564/563 95/565/562 94/566/564
f 281/564/563 94/566/564 282/567/565
f 282/567/565 94/566/564 93/568/566
f 282/567/565 93/568/566 283/569/567
f 283/569/567 93/568/566 92/570/568
f 283/569/567 92/570/568 284/571/569
f 284/571/569 92/570/568 91/572/570
f 284/571/569 91/572/570 285/573/571
f 285/573/571 91/572/570 90/574/572
f 285/573/571 90/574/572 286/575/573
f 286/575/573 90/574/572 89/576/574
f 286/575/573 89/576/574 287/577/575
f 287/577/575 89/576/574 88/578/576
f 287/577/575 88/578/576 288/579/577
f 288/579/577 88/578/576 87/580/578
f 288/579/577 87/580/578 289/581/579
f 289/581/579 87/580/578 86/582/580
f 289/581/579 86/582/580 290/583/581
f 290/583/581 86/582/580 85/584/582
f 290/583/581 85/584/582 291/585/583
f 291/585/583 85/584/582 84/586/584
f 291/585/583 84/586/584 292/587/585
f 292/587/585 84/586/584 83/588/586
f 292/587/585 83/588/586 293/589/587
f 293/589/587 83/588/586 82/590/588
f 293/589/587 82/590/588 294/591/589
f 294/591/589 82/590/588 81/592/590
f 294/591/589 81/592/590 295/593/591
f 295/593/591 81/592/590 80/594/592
f 295/593/591 80/594/592 296/595/593
f 296/595/593 80/594/592 79/596/594
f 296/595/593 79/596/594 297/597/595
f 297/597/595 79/596/594 78/598/596
f 297/597/595 78/598/596 298/599/597
f 298/599/597 78/598/596 77/600/598
f 298/599/597 77/600/598 299/601/599
f 299/601/599 77/600/598 76/602/600
f 299/601/599 76/602/600 300/603/601
f 300/603/601 76/602/600 75/604/602
f 300/603/601 75/604/602 301/605/603
f 301/605/603 75/604/602 74/606/604
f 301/605/603 74/606/604 302/607/605
f 302/607/605 74/606/604 73/608/606
f 302/607/605 73/608/606 303/609/607
f 303/609/607 73/608/606 72/610/608
f 303/609/607 72/610/608 304/611/609
f 304/611/609 72/610/608 71/612/610
f 304/611/609 71/612/610 305/613/611
f 305/613/611 71/612/610 70/614/612
f 305/613/611 70/614/612 306/615/613
f 306/615/613 70/614/612 69/616/614
f 306/615/613 69/616/614 307/617/615
f 307/617/615 69/616/614 68/618/616
f 307/617/615 68/618/616 308/619/617
f 308/619/617 68/618/616 67/620/618
f 308/619/617 67/620/618 309/621/619
f 309/621/619 67/620/618 66/622/620
f 309/621/619 66/622/620 310/623/621
f 310/623/621 66/622/620 65/624/622
f 310/623/621 65/624/622 311/625/623
f 311/625/623 65/624/622 64/626/624
f 311/625/623 64/626/624 312/627/625
f 312/627/625 64/626/624 63/628/626
f 312/627/625 63/628/626 313/629/627
f 313/629/627 63/628/626 62/630/628
f 313/629/627 62/630/628 314/631/629
f 314/631/629 62/630/628 61/632/630
f 314/631/629 61/632/630 315/633/631
f 315/633/631 61/632/630 60/634/632
f 315/633/631 60/634/632 316/635/633
f 316/635/633 60/634/632 59/636/634
f 316/635/633 59/636/634 317/637/635
f 317/637/635 59/636/634 58/638/636
f 317/637/635 58/638/636 318/639/637
f 318/639/637 58/638/636 57/640/638
f 318/639/637 57/640/638 319/641/639
f 319/641/639 57/640/638 56/642/640
f 319/641/639 56/642/640 320/643/641
f 320/643/641 56/642/640 55/644/642
f 320/643/641 55/644/642 321/645/643
f 321/645/643 55/644/642 54/646/644
f 321/645/643 54/646/644 322/647/645
f 322/647/645 54/646/644 53/648/646
f 322/647/645 53/648/646 323/649/647
f 323/649/647 53/648/646 52/650/648
f 323/649/647 52/650/648 324/651/649
f 324/651/649 52/650/648 51/652/650
f 324/651/649 51/652/650 325/653/651
f 325/653/651 51/652/650 50/654/652
f 325/653/651 50/654/652 326/655/653
f 326/655/653 50/654/652 49/656/654
f 326/655/653 49/656/654 327/657/655
f 327/657/655 49/656/654 48/658/656
f 327/657/655 48/658/656 328/659/657
f 328/659/657 48/658/656 47/660/658
f 328/659/657 47/660/658 329/661/659
f 329/661/659 47/660/658 46/662/660
f 329/661/659 46/662/660 330/663/661
f 330/663/661 46/662/660 45/664/662
f 330/663/661 45/664/662 331/665/663
f 331/665/663 45/664/662 44/666/664
f 331/665/663 44/666/664 332/667/665
f 332/667/665 44/666/664 43/668/666
f 332/667/665 43/668/666 333/669/667
f 333/669/667 43/668/666 42/670/668
f 333/669/667 42/670/668 334/671/669
f 334/671/669 42/670/668 41/672/670
f 334/671/669 41/672/670 335/673/671
f 335/673/671 41/672/670 40/674/672
f 335/673/671 40/674/672 336/675/673
f 336/675/673 40/674/672 39/676/674
f 336/675/673 39/676/674 337/677/675
f 337/677/675 39/676/674 38/678/676
f 337/677/675 38/678/676 338/679/677
f 338/679/677 38/678/676 37/680/678
f 338/679/677 37/680/678 339/681/679
f 339/681/679 37/680/678 36/682/680
f 339/681/679 36/682/680 340/683/681
f 340/683/681 36/682/680 35/684/682
f 340/683/681 35/684/682 341/685/683
f 341/685/683 35/684/682 34/686/684
f 341/685/683 34/686/684 342/687/685
f 342/687/685 34/686/684 33/688/686
f 342/687/685 33/688/686 343/689/687
f 343/689/687 33/688/686 32/690/688
f 343/689/687 32/690/688 344/691/689
f 344/691/689 32/690/688 31/692/690
f 344/691/689 31/692/690 345/693/691
f 345/693/691 31/692/690 30/694/692
f 345/693/691 30/694/692 346/695/693
f 346/695/693 30/694/692 29/696/694
f 346/695/693 29/696/694 347/697/695
f 347/697/695 29/696/694 28/698/696
f 347/697/695 28/698/696 348/699/697
f 348/699/697 28/698/696 27/700/698
f 348/699/697 27/700/698 349/701/699
f 349/701/699 27/700/698 26/702/700
f 349/701/699 26/702/700 350/703/701
f 350/703/701 26/702/700 25/704/702
f 350/703/701 25/704/702 351/705/703
f 351/705/703 25/704/702 24/706/704
f 351/705/703 24/706/704 352/707/705
f 352/707/705 24/706/704 23/708/706
f 352/707/705 23/708/706 353/709/707
f 353/709/707 23/708/706 22/710/708
f 353/709/707 22/710/708 354/711/709
f 354/711/709 22/710/708 21/712/710
f 354/711/709 21/712/710 355/713/711
f 355/713/711 21/712/710 20/714/712
f 355/713/711 20/714/712 356/715/713
f 356/715/713 20/714/712 19/716/714
f 356/715/713 19/716/714 357/717/715
f 357/717/715 19/716/714 18/718/716
f 357/717/715 18/718/716 358/719/717
f 358/719/717 18/718/716 17/720/718
f 358/719/717 17/720/718 359/721/719
f 359/721/719 17/720/718 16/722/720
f 359/721/719 16/722/720 360/723/721
f 360/723/721 16/722/720 15/724/722
f 360/723/721 15/724/722 361/725/723
f 361/725/723 15/724/722 14/726/724
f 361/725/723 14/726/724 362/727/725
f 362/727/725 14/726/724 13/728/726
f 362/727/725 13/728/726 363/729/727
f 363/729/727 13/728/726 12/730/728
f 363/729/727 12/730/728 364/731/729
f 364/731/729 12/730/728 11/732/730
f 364/731/729 11/732/730 365/733/731
f 365/733/731 11/732/730 10/734/732
f 365/733/731 10/734/732 366/735/733
f 366/735/733 10/734/732 9/736/734
f 366/735/733 9/736/734 367/737/735
f 367/737/735 9/736/734 8/738/736
f 367/737/735 8/738/736 368/739/737
f 368/739/737 8/738/736 7/740/738
f 368/739/737 7/740/738 369/741/739
f 369/741/739 7/740/738 6/742/740
f 369/741/739 6/742/740 370/743/741
f 370/743/741 6/742/740 5/744/742
f 370/743/741 5/744/742 371/745/743
f 371/745/743 5/744/742 4/746/744
f 371/745/743 4/746/744 372/747/745
f 372/747/745 4/746/744 3/748/746
f 372/747/745 3/748/746 373/749/747
f 373/749/747 3/748/746 2/750/748
f 373/749/747 2/750/748 374/375/375
f 374/375/375 2/750/748 1/376/376

# 374 vertices
# 750 texture params
# 748 normals
# 744 facets

# 1 groups
