# Blender v2.92.0 OBJ File: ''
# www.blender.org
mtllib Filtro1.mtl
o Cylinder
v 0.000000 1.000000 -1.000000
v 0.195090 1.000000 -0.980785
v 0.382683 1.000000 -0.923880
v 0.555570 1.000000 -0.831470
v 0.707107 1.000000 -0.707107
v 0.831470 1.000000 -0.555570
v 0.923880 1.000000 -0.382683
v 0.980785 1.000000 -0.195090
v 1.000000 1.000000 -0.000000
v 0.980785 1.000000 0.195090
v 0.923880 1.000000 0.382683
v 0.831470 1.000000 0.555570
v 0.707107 1.000000 0.707107
v 0.555570 1.000000 0.831470
v 0.382683 1.000000 0.923880
v 0.195090 1.000000 0.980785
v -0.000000 1.000000 1.000000
v -0.195091 1.000000 0.980785
v -0.382684 1.000000 0.923879
v -0.555571 1.000000 0.831469
v -0.707107 1.000000 0.707106
v -0.831470 1.000000 0.555570
v -0.923880 1.000000 0.382683
v -0.980785 1.000000 0.195089
v -1.000000 1.000000 -0.000001
v -0.980785 1.000000 -0.195091
v -0.923879 1.000000 -0.382684
v -0.831469 1.000000 -0.555571
v -0.707106 1.000000 -0.707108
v -0.555569 1.000000 -0.831470
v -0.382682 1.000000 -0.923880
v -0.195089 1.000000 -0.980786
v 0.000000 -0.919121 -1.000000
v 0.195090 -0.919121 -0.980785
v 0.382683 -0.919121 -0.923880
v 0.555570 -0.919121 -0.831470
v 0.707107 -0.919121 -0.707107
v 0.831470 -0.919121 -0.555570
v 0.923880 -0.919121 -0.382683
v 0.980785 -0.919121 -0.195090
v 0.980785 -0.919121 0.195090
v 0.923880 -0.919121 0.382683
v 0.831470 -0.919121 0.555570
v 0.707107 -0.919121 0.707107
v 0.555570 -0.919121 0.831470
v 0.382683 -0.919121 0.923880
v 0.195090 -0.919121 0.980785
v -0.000000 -0.919121 1.000000
v -0.195091 -0.919121 0.980785
v -0.382684 -0.919121 0.923879
v -0.555571 -0.919121 0.831469
v -0.707107 -0.919121 0.707106
v -0.831470 -0.919121 0.555570
v -0.923880 -0.919121 0.382683
v -0.980785 -0.919121 0.195089
v -0.980785 -0.919121 -0.195091
v -0.923879 -0.919121 -0.382684
v -0.831469 -0.919121 -0.555571
v -0.707106 -0.919121 -0.707108
v -0.555569 -0.919121 -0.831470
v -0.382682 -0.919121 -0.923880
v -0.195089 -0.919121 -0.980786
vt 1.000000 0.750000
vt 1.000000 1.000000
vt 0.968750 1.000000
vt 0.968750 0.750000
vt 0.937500 1.000000
vt 0.937500 0.750000
vt 0.906250 0.750000
vt 0.906250 1.000000
vt 0.875000 1.000000
vt 0.875000 0.750000
vt 0.843750 1.000000
vt 0.843750 0.750000
vt 0.812500 1.000000
vt 0.812500 0.750000
vt 0.781250 1.000000
vt 0.781250 0.750000
vt 0.718750 0.750000
vt 0.718750 1.000000
vt 0.687500 1.000000
vt 0.687500 0.750000
vt 0.656250 1.000000
vt 0.656250 0.750000
vt 0.625000 1.000000
vt 0.625000 0.750000
vt 0.593750 1.000000
vt 0.593750 0.750000
vt 0.562500 0.750000
vt 0.562500 1.000000
vt 0.531250 1.000000
vt 0.531250 0.750000
vt 0.500000 1.000000
vt 0.500000 0.750000
vt 0.468750 1.000000
vt 0.468750 0.750000
vt 0.437500 1.000000
vt 0.437500 0.750000
vt 0.406250 0.750000
vt 0.406250 1.000000
vt 0.375000 1.000000
vt 0.375000 0.750000
vt 0.343750 1.000000
vt 0.343750 0.750000
vt 0.312500 1.000000
vt 0.312500 0.750000
vt 0.281250 1.000000
vt 0.281250 0.750000
vt 0.218750 0.750000
vt 0.218750 1.000000
vt 0.187500 1.000000
vt 0.187500 0.750000
vt 0.156250 1.000000
vt 0.156250 0.750000
vt 0.125000 1.000000
vt 0.125000 0.750000
vt 0.093750 1.000000
vt 0.093750 0.750000
vt 0.296822 0.485388
vt 0.250000 0.490000
vt 0.203179 0.485389
vt 0.158156 0.471731
vt 0.116663 0.449553
vt 0.080295 0.419706
vt 0.050447 0.383337
vt 0.028269 0.341844
vt 0.014612 0.296822
vt 0.010000 0.250000
vt 0.014611 0.203179
vt 0.028269 0.158156
vt 0.050447 0.116663
vt 0.080294 0.080294
vt 0.116663 0.050447
vt 0.158156 0.028269
vt 0.203178 0.014612
vt 0.250000 0.010000
vt 0.296822 0.014612
vt 0.341844 0.028269
vt 0.383337 0.050447
vt 0.419706 0.080294
vt 0.449553 0.116663
vt 0.471731 0.158156
vt 0.485388 0.203178
vt 0.490000 0.250000
vt 0.485388 0.296822
vt 0.471731 0.341844
vt 0.449553 0.383337
vt 0.419706 0.419706
vt 0.383337 0.449553
vt 0.341844 0.471731
vt 0.062500 0.750000
vt 0.062500 1.000000
vt 0.031250 1.000000
vt 0.031250 0.750000
vt 0.000000 1.000000
vt 0.000000 0.750000
vn 0.0980 0.0000 -0.9952
vn 0.2903 0.0000 -0.9569
vn 0.6344 0.0000 -0.7730
vn 0.7730 0.0000 -0.6344
vn 0.8819 0.0000 -0.4714
vn 0.9569 0.0000 -0.2903
vn 0.9569 0.0000 0.2903
vn 0.8819 0.0000 0.4714
vn 0.7730 0.0000 0.6344
vn 0.6344 0.0000 0.7730
vn 0.2903 0.0000 0.9569
vn 0.0980 0.0000 0.9952
vn -0.0980 0.0000 0.9952
vn -0.2903 0.0000 0.9569
vn -0.6344 0.0000 0.7730
vn -0.7730 0.0000 0.6344
vn -0.8819 0.0000 0.4714
vn -0.9569 0.0000 0.2903
vn -0.9569 0.0000 -0.2903
vn -0.8819 0.0000 -0.4714
vn -0.7730 0.0000 -0.6344
vn -0.6344 0.0000 -0.7730
vn 0.0000 1.0000 0.0000
vn -0.2903 0.0000 -0.9569
vn -0.0980 0.0000 -0.9952
usemtl None
s off
f 33/1/1 1/2/1 2/3/1 34/4/1
f 34/4/2 2/3/2 3/5/2 35/6/2
f 36/7/3 4/8/3 5/9/3 37/10/3
f 37/10/4 5/9/4 6/11/4 38/12/4
f 38/12/5 6/11/5 7/13/5 39/14/5
f 39/14/6 7/13/6 8/15/6 40/16/6
f 41/17/7 10/18/7 11/19/7 42/20/7
f 42/20/8 11/19/8 12/21/8 43/22/8
f 43/22/9 12/21/9 13/23/9 44/24/9
f 44/24/10 13/23/10 14/25/10 45/26/10
f 46/27/11 15/28/11 16/29/11 47/30/11
f 47/30/12 16/29/12 17/31/12 48/32/12
f 48/32/13 17/31/13 18/33/13 49/34/13
f 49/34/14 18/33/14 19/35/14 50/36/14
f 51/37/15 20/38/15 21/39/15 52/40/15
f 52/40/16 21/39/16 22/41/16 53/42/16
f 53/42/17 22/41/17 23/43/17 54/44/17
f 54/44/18 23/43/18 24/45/18 55/46/18
f 56/47/19 26/48/19 27/49/19 57/50/19
f 57/50/20 27/49/20 28/51/20 58/52/20
f 58/52/21 28/51/21 29/53/21 59/54/21
f 59/54/22 29/53/22 30/55/22 60/56/22
f 2/57/23 1/58/23 32/59/23 31/60/23 30/61/23 29/62/23 28/63/23 27/64/23 26/65/23 25/66/23 24/67/23 23/68/23 22/69/23 21/70/23 20/71/23 19/72/23 18/73/23 17/74/23 16/75/23 15/76/23 14/77/23 13/78/23 12/79/23 11/80/23 10/81/23 9/82/23 8/83/23 7/84/23 6/85/23 5/86/23 4/87/23 3/88/23
f 61/89/24 31/90/24 32/91/24 62/92/24
f 62/92/25 32/91/25 1/93/25 33/94/25
