[I 16:22:20.223 NotebookApp] [nb_conda_kernels] enabled, 1 kernels found
[I 16:22:20.325 NotebookApp] Authentication of /metrics is OFF, since other authentication is disabled.
[W 16:22:20.505 NotebookApp] All authentication is disabled.  Anyone who can connect to this server will be able to run code.
Traceback (most recent call last):
  File "/opt/conda/bin/jupyter-notebook", line 10, in <module>
    sys.exit(main())
  File "/opt/conda/lib/python3.7/site-packages/jupyter_core/application.py", line 254, in launch_instance
    return super(JupyterApp, cls).launch_instance(argv=argv, **kwargs)
  File "/opt/conda/lib/python3.7/site-packages/traitlets/config/application.py", line 845, in launch_instance
    app.initialize(argv)
  File "/opt/conda/lib/python3.7/site-packages/traitlets/config/application.py", line 88, in inner
    return method(app, *args, **kwargs)
  File "/opt/conda/lib/python3.7/site-packages/notebook/notebookapp.py", line 2127, in initialize
    self.init_server_extensions()
  File "/opt/conda/lib/python3.7/site-packages/notebook/notebookapp.py", line 2027, in init_server_extensions
    mod = importlib.import_module(modulename)
  File "/opt/conda/lib/python3.7/importlib/__init__.py", line 127, in import_module
    return _bootstrap._gcd_import(name[level:], package, level)
  File "<frozen importlib._bootstrap>", line 1006, in _gcd_import
  File "<frozen importlib._bootstrap>", line 983, in _find_and_load
  File "<frozen importlib._bootstrap>", line 967, in _find_and_load_unlocked
  File "<frozen importlib._bootstrap>", line 677, in _load_unlocked
  File "<frozen importlib._bootstrap_external>", line 728, in exec_module
  File "<frozen importlib._bootstrap>", line 219, in _call_with_frames_removed
  File "/opt/conda/lib/python3.7/site-packages/caip_notebooks_serverextension/__init__.py", line 23, in <module>
    import caip_notebooks_serverextension.gcsfilebrowser.handlers as gcsfilebrowser_handlers
  File "/opt/conda/lib/python3.7/site-packages/caip_notebooks_serverextension/gcsfilebrowser/handlers.py", line 20, in <module>
    import caip_notebooks_serverextension.gcsfilebrowser.gcs_operations as operations
  File "/opt/conda/lib/python3.7/site-packages/caip_notebooks_serverextension/gcsfilebrowser/gcs_operations.py", line 24, in <module>
    from google.cloud import storage  # used for connecting to GCS
  File "/opt/conda/lib/python3.7/site-packages/google/cloud/storage/__init__.py", line 37, in <module>
    from google.cloud.storage.bucket import Bucket
  File "/opt/conda/lib/python3.7/site-packages/google/cloud/storage/bucket.py", line 379, in <module>
    _default = object()
KeyboardInterrupt
