{
    "appId": "io.ionic.starter",
    "appName": "MD Wallet",
    "bundledWebRuntime": false,
    "npmClient": "npm",
    "webDir": "www",
    "plugins": {
        "SplashScreen": {
            "launchShowDuration": 0
        }
    },
    "cordova": {}
}
