# Blender MTL File: 'None'
# Material Count: 1

newmtl SVGMat.014
Ns 323.999994
Ka 1.000000 1.000000 1.000000
Kd 0.013702 0.026241 0.046665
Ks 0.500000 0.500000 0.500000
Ke 0.0 0.0 0.0
Ni 1.000000
d 1.000000
illum 2
