# Blender MTL File: 'map.blend'
# Material Count: 31

newmtl SVGMat.006
Ns 323.999994
Ka 1.000000 1.000000 1.000000
Kd 0.982251 0.439657 0.029557
Ks 0.500000 0.500000 0.500000
Ke 0.0 0.0 0.0
Ni 1.000000
d 1.000000
illum 2

newmtl SVGMat.007
Ns 323.999994
Ka 1.000000 1.000000 1.000000
Kd 0.982251 0.439657 0.029557
Ks 0.500000 0.500000 0.500000
Ke 0.0 0.0 0.0
Ni 1.000000
d 1.000000
illum 2

newmtl SVGMat.008
Ns 323.999994
Ka 1.000000 1.000000 1.000000
Kd 0.982251 0.439657 0.029557
Ks 0.500000 0.500000 0.500000
Ke 0.0 0.0 0.0
Ni 1.000000
d 1.000000
illum 2

newmtl SVGMat.039
Ns 323.999994
Ka 1.000000 1.000000 1.000000
Kd 0.015996 0.001821 0.278894
Ks 0.500000 0.500000 0.500000
Ke 0.0 0.0 0.0
Ni 1.000000
d 1.000000
illum 2

newmtl SVGMat.040
Ns 323.999994
Ka 1.000000 1.000000 1.000000
Kd 0.514918 0.039546 0.234551
Ks 0.500000 0.500000 0.500000
Ke 0.0 0.0 0.0
Ni 1.000000
d 1.000000
illum 2

newmtl SVGMat.041
Ns 323.999994
Ka 1.000000 1.000000 1.000000
Kd 0.194618 0.000607 0.391572
Ks 0.500000 0.500000 0.500000
Ke 0.0 0.0 0.0
Ni 1.000000
d 1.000000
illum 2

newmtl SVGMat.042
Ns 323.999994
Ka 1.000000 1.000000 1.000000
Kd 0.351533 0.010330 0.332452
Ks 0.500000 0.500000 0.500000
Ke 0.0 0.0 0.0
Ni 1.000000
d 1.000000
illum 2

newmtl SVGMat.043
Ns 323.999994
Ka 1.000000 1.000000 1.000000
Kd 0.679542 0.093059 0.149960
Ks 0.500000 0.500000 0.500000
Ke 0.0 0.0 0.0
Ni 1.000000
d 1.000000
illum 2

newmtl SVGMat.044
Ns 323.999994
Ka 1.000000 1.000000 1.000000
Kd 0.242281 0.002125 0.381326
Ks 0.500000 0.500000 0.500000
Ke 0.0 0.0 0.0
Ni 1.000000
d 1.000000
illum 2

newmtl SVGMat.046
Ns 323.999994
Ka 1.000000 1.000000 1.000000
Kd 0.623960 0.072272 0.174647
Ks 0.500000 0.500000 0.500000
Ke 0.0 0.0 0.0
Ni 1.000000
d 1.000000
illum 2

newmtl SVGMat.047
Ns 323.999994
Ka 1.000000 1.000000 1.000000
Kd 0.830770 0.177888 0.093059
Ks 0.500000 0.500000 0.500000
Ke 0.0 0.0 0.0
Ni 1.000000
d 1.000000
illum 2

newmtl SVGMat.048
Ns 323.999994
Ka 1.000000 1.000000 1.000000
Kd 0.871367 0.215861 0.076185
Ks 0.500000 0.500000 0.500000
Ke 0.0 0.0 0.0
Ni 1.000000
d 1.000000
illum 2

newmtl SVGMat.049
Ns 323.999994
Ka 1.000000 1.000000 1.000000
Kd 0.947307 0.715693 0.017642
Ks 0.500000 0.500000 0.500000
Ke 0.0 0.0 0.0
Ni 1.000000
d 1.000000
illum 2

newmtl SVGMat.050
Ns 323.999994
Ka 1.000000 1.000000 1.000000
Kd 0.730461 0.119538 0.127438
Ks 0.500000 0.500000 0.500000
Ke 0.0 0.0 0.0
Ni 1.000000
d 1.000000
illum 2

newmtl SVGMat.051
Ns 323.999994
Ka 1.000000 1.000000 1.000000
Kd 0.783538 0.144128 0.109462
Ks 0.500000 0.500000 0.500000
Ke 0.0 0.0 0.0
Ni 1.000000
d 1.000000
illum 2

newmtl SVGMat.062
Ns 323.999994
Ka 1.000000 1.000000 1.000000
Kd 0.991102 0.514918 0.023153
Ks 0.500000 0.500000 0.500000
Ke 0.0 0.0 0.0
Ni 1.000000
d 1.000000
illum 2

newmtl SVGMat.063
Ns 323.999994
Ka 1.000000 1.000000 1.000000
Kd 0.456411 0.027321 0.266356
Ks 0.500000 0.500000 0.500000
Ke 0.0 0.0 0.0
Ni 1.000000
d 1.000000
illum 2

newmtl SVGMat.064
Ns 323.999994
Ka 1.000000 1.000000 1.000000
Kd 0.056128 0.000911 0.341914
Ks 0.500000 0.500000 0.500000
Ke 0.0 0.0 0.0
Ni 1.000000
d 1.000000
illum 2

newmtl SVGMat.065
Ns 323.999994
Ka 1.000000 1.000000 1.000000
Kd 0.004025 0.002428 0.242281
Ks 0.500000 0.500000 0.500000
Ke 0.0 0.0 0.0
Ni 1.000000
d 1.000000
illum 2

newmtl SVGMat.066
Ns 323.999994
Ka 1.000000 1.000000 1.000000
Kd 0.004025 0.002428 0.242281
Ks 0.500000 0.500000 0.500000
Ke 0.0 0.0 0.0
Ni 1.000000
d 1.000000
illum 2

newmtl SVGMat.067
Ns 323.999994
Ka 1.000000 1.000000 1.000000
Kd 0.033105 0.001518 0.309469
Ks 0.500000 0.500000 0.500000
Ke 0.0 0.0 0.0
Ni 1.000000
d 1.000000
illum 2

newmtl SVGMat.068
Ns 323.999994
Ka 1.000000 1.000000 1.000000
Kd 0.149960 0.000000 0.391572
Ks 0.500000 0.500000 0.500000
Ke 0.0 0.0 0.0
Ni 1.000000
d 1.000000
illum 2

newmtl SVGMat.069
Ns 323.999994
Ka 1.000000 1.000000 1.000000
Kd 0.116971 0.000304 0.381326
Ks 0.500000 0.500000 0.500000
Ke 0.0 0.0 0.0
Ni 1.000000
d 1.000000
illum 2

newmtl SVGMat.070
Ns 323.999994
Ka 1.000000 1.000000 1.000000
Kd 0.116971 0.000304 0.381326
Ks 0.500000 0.500000 0.500000
Ke 0.0 0.0 0.0
Ni 1.000000
d 1.000000
illum 2

newmtl SVGMat.072
Ns 323.999994
Ka 1.000000 1.000000 1.000000
Kd 0.407240 0.017642 0.296138
Ks 0.500000 0.500000 0.500000
Ke 0.0 0.0 0.0
Ni 1.000000
d 1.000000
illum 2

newmtl SVGMat.073
Ns 323.999994
Ka 1.000000 1.000000 1.000000
Kd 0.571125 0.054480 0.201556
Ks 0.500000 0.500000 0.500000
Ke 0.0 0.0 0.0
Ni 1.000000
d 1.000000
illum 2

newmtl SVGMat.074
Ns 323.999994
Ka 1.000000 1.000000 1.000000
Kd 0.947307 0.313989 0.048172
Ks 0.500000 0.500000 0.500000
Ke 0.0 0.0 0.0
Ni 1.000000
d 1.000000
illum 2

newmtl SVGMat.075
Ns 323.999994
Ka 1.000000 1.000000 1.000000
Kd 0.913099 0.830770 0.020289
Ks 0.500000 0.500000 0.500000
Ke 0.0 0.0 0.0
Ni 1.000000
d 1.000000
illum 2

newmtl SVGMat.076
Ns 323.999994
Ka 1.000000 1.000000 1.000000
Kd 0.871367 0.947307 0.015209
Ks 0.500000 0.500000 0.500000
Ke 0.0 0.0 0.0
Ni 1.000000
d 1.000000
illum 2

newmtl SVGMat.077
Ns 323.999994
Ka 1.000000 1.000000 1.000000
Kd 0.913099 0.262251 0.061246
Ks 0.500000 0.500000 0.500000
Ke 0.0 0.0 0.0
Ni 1.000000
d 1.000000
illum 2

newmtl SVGMat.078
Ns 323.999994
Ka 1.000000 1.000000 1.000000
Kd 0.973445 0.376262 0.038204
Ks 0.500000 0.500000 0.500000
Ke 0.0 0.0 0.0
Ni 1.000000
d 1.000000
illum 2
