,Al,mu,std
0,LSTMPredictor,35426743.96119021,9807528.409547323
1,LinearRegressionPredictor,45811449.55228492,18285986.546383433
2,RNNPredictor,34684397.443950154,9124688.814609358
3,RandomForestRegressorPredictor,35300300.3018316,10169799.704543076
4,SVRPredictor,35302891.9060962,9700512.507507233
5,XGBRegressorPredictor,37687816.81825289,15264938.061121987
