{
    "menus": [
        {
            "id": "a0",
            "type": "buttonList",
            "filaName": "MainMenu.json"
        },
        {
            "id": "b0",
            "type": "buttonList",
            "filaName": "Subsystem1.json"
        },
        {
            "id": "b1",
            "type": "buttonList",
            "filaName": "Subsystem2.json"
        },
        {
            "id": "b2",
            "type": "buttonList",
            "filaName": "ImageMenu.json"
        }
    ]
}
