<svg xmlns="http://www.w3.org/2000/svg" width="25" height="25" viewBox="0 0 25 25">
    <path fill="#222" fill-rule="nonzero" d="M12.5 0C5.596 0 0 5.596 0 12.5S5.596 25 12.5 25 25 19.404 25 12.5 19.404 0 12.5 0zm0 1.613c5.981 0 10.887 4.841 10.887 10.887 0 2.313-.724 4.465-1.962 6.234a4.85 4.85 0 0 0-4.253-3.397 6.407 6.407 0 0 0 1.78-4.45A6.448 6.448 0 0 0 12.5 4.435a6.448 6.448 0 0 0-6.452 6.452c0 1.67.631 3.245 1.78 4.45a4.85 4.85 0 0 0-4.254 3.4A10.827 10.827 0 0 1 1.613 12.5c0-5.981 4.841-10.887 10.887-10.887zm-4.839 9.274a4.839 4.839 0 1 1 9.678 0 4.839 4.839 0 0 1-9.678 0zm-2.688 9.479c0-2.208 1.602-3.43 3.226-3.43h2.047a6.496 6.496 0 0 0 4.508 0H16.8c1.65 0 3.226 1.243 3.226 3.43-4.205 4.028-10.84 4.03-15.054 0z"/>
</svg>
