<svg xmlns="http://www.w3.org/2000/svg" xmlns:xlink="http://www.w3.org/1999/xlink" width="511" height="368" viewBox="0 0 511 368">
    <defs>
        <path id="a" d="M0 .793h326.298V208H0z"/>
        <path id="c" d="M0 .924h179.56v312.793H0z"/>
    </defs>
    <g fill="none" fill-rule="evenodd">
        <g transform="translate(184 160)">
            <mask id="b" fill="#fff">
                <use xlink:href="#a"/>
            </mask>
            <path fill="#000" d="M20.296 108c2.275-.97 4.466-2.056 6.139-4.535-2.872.861-4.76 2.353-6.139 4.534zm142.788-29.406c-.897 1.223-1.958 2.673-3.282 4.483 3.032.073 5.539.573 8.422-.154l-5.14-4.33zM69.944 64.59c-.562-3.51-1.061-6.44-2.375-9.427-2.094 1.88-2.605 3.913-2.101 6.306 1.358.95 2.708 1.89 4.476 3.12zM21.34 158.606c-2.318 1.262-4.086 2.574-5.476 4.382 1.984 2.448 3.988 3.68 6.115 3.671-.201-2.542-.401-5.068-.64-8.053zm156.627-76.452c-3.13-3.847-6.527-7.157-9.853-10.84-1.047 1.586-1.884 2.847-2.847 4.301.661.845 1.22 1.732 1.944 2.448 1.086 1.078 2.4 1.94 3.419 3.07 2.067 2.29 4.402 2.199 7.337 1.021zm-65.007-49.818c-.425 3.42-1.283 6.686-.106 10.232 3.824-3.606 7.338-7.155 10.826-11.357-4.068-.64-7.443.352-10.72 1.125zM28.478 152.47c-2.657.656-4.886 2.944-4.92 5.21-.04 3.057.195 6.118.312 9.178.103 2.706 2.067 3.882 4.35 5.44-.129-6.836 1.14-13.204.258-19.828zm144.647-88.465c-.8 1.22-1.513 2.108-1.987 3.113-.226.478-.224 1.34.069 1.74 2.97 4.057 5.978 8.116 9.737 11.481 1.944 1.743 4.291 2.534 7.074.758-4.536-5.928-9.081-11.78-14.893-17.092zm-93.44 5.44l.628-.379L75.635 47.8c-2.263 1.796-4.72 2.717-6.13 4.545l3.643 11.479c.533.154 1.201.35 1.953.57.05.948.093 1.814.144 2.8 1.479.748 2.96 1.5 4.44 2.251zM41.102 98.75c-1.008.532-1.843.981-2.685 1.417-4.074 2.114-8.45 3.717-11.782 7.08-.45.455-1.058.748-1.568 1.148-4.836 3.783-9.656 7.585-14.508 11.35-.823.637-1.708 1.29-2.672 1.627-1.728.61-2.126 2.11-2.664 3.523-.103.267.14.848.398 1.021.258.173.803.134 1.105-.03.563-.303 1.042-.762 1.555-1.16 4.198-3.266 8.296-6.668 12.618-9.76 4.255-3.042 8.795-5.683 13.095-8.665 2.565-1.78 4.912-3.873 7.35-5.836.816-.654.612-1.216-.242-1.715zm162.532-19.69c-1.172-1.628-2.24-3.03-3.214-4.494-1.204-1.816-2.348-3.672-3.478-5.534-.96-1.587-1.763-3.277-2.81-4.8-2.244-3.264-4.622-6.437-6.904-9.674-1.292-1.834-2.502-3.726-3.948-5.89-.897 1.2-1.731 2.313-2.565 3.43 1.23 1.566 2.434 2.883 3.392 4.36 1.578 2.43 2.87 5.051 4.516 7.43 2.529 3.652 5.247 7.174 7.906 10.734.58.776 1.116 1.766 1.915 2.148 1.154.549 1.966 1.256 2.627 2.31.616.983 1.439.754 2.563-.02zM83.671 42.984c-1.25.523-1.984.84-2.724 1.141-1.217.496-1.72 1.483-1.662 2.7.091 2.015.118 4.057.498 6.026.95 4.917 1.976 9.826 3.183 14.686.646 2.61 2.383 4.98 5.737 4.672-.27-1.403-.527-2.791-.807-4.172-.91-4.507-1.851-9.007-2.736-13.518a101.007 101.007 0 0 1-1.032-6.196c-.22-1.635-.288-3.293-.457-5.339zm112.72 37.445c-.136-.354-.194-.681-.365-.93-1.926-2.802-3.717-5.712-5.842-8.353-3.207-3.983-6.025-8.213-8.773-12.505-.758-1.183-1.51-2.461-3.09-3.204-.938 1.599-1.824 3.104-2.783 4.736 2.476 3.06 4.915 6.064 7.337 9.08 2.585 3.213 5.258 6.364 7.69 9.692 1.606 2.197 3.464 2.322 5.826 1.484zm20.937-38.437l-.381.492c.174.356.287.763.532 1.062 3.277 3.98 5.5 8.576 7.773 13.148.32.644.76 1.234 1.192 1.812a783.608 783.608 0 0 0 6.14 8.104c.375.485.9.852 1.494 1.403.845-1.514 1.813-2.791 1.613-4.385-.35-2.83-1.357-5.356-2.96-7.83-1.94-2.99-4.21-5.477-7.086-7.496-.258-.18-.41-.504-.65-.718-1.572-1.396-3.094-2.854-4.751-4.135-.845-.652-1.937-.981-2.916-1.457zM36.768 178.538c0-3.088-.007-5.567.002-8.046.01-2.991-.008-5.98.06-8.97.107-4.851.283-9.7.396-14.55.01-.504-.226-1.011-.396-1.73-.909.515-1.583.923-2.277 1.29-2.316 1.23-3.277 3.118-3.217 5.76.056 2.503-.252 5.015-.35 7.525-.117 2.906-.219 5.814-.233 8.723-.004.673.172 1.701.616 1.956 1.413.809 1.039 2.03 1.113 3.198.044.7-.043 1.658.36 2.04 1.034.97 2.309 1.684 3.926 2.804zm7.864-40.003c-.25-.067-.501-.136-.752-.205-1.635 1.183-3.244 2.284-3.452 4.718-.546 6.437-.975 12.878-.924 19.342.023 2.82-.006 5.654.249 8.458.256 2.828-.44 5.869 1.54 8.391.086.111.042.318.064.478.33 2.281.645 2.53 3.413 2.436 0-2.697.037-5.413-.007-8.126-.1-6.141-.334-12.28-.33-18.42.003-4.52-.377-9.055.454-13.566.203-1.114-.155-2.335-.255-3.506zm47.46-64.5c2.072 2.22 4.871 1.428 7.629 2.198-1.108-4.832-2.113-9.236-3.13-13.634-1.624-7.015-3.952-13.874-4.61-21.103-.074-.816-.542-1.596-.88-2.541l-3.975 1.899c0 1.845-.047 3.448.01 5.047.068 1.852.05 3.733.382 5.543.832 4.542 1.811 9.058 2.796 13.57.343 1.572.554 3.319 1.406 4.598.998 1.496 1.141 2.766.373 4.424zm100.8-38.719c-.154.173-.31.344-.467.517.74 1.597 1.326 3.289 2.25 4.774 2.383 3.844 4.904 7.602 7.388 11.384 2.027 3.088 4.09 6.154 6.11 9.247 1.632 2.5 3.138 5.085 4.862 7.517 1.072 1.506 2.533 2.731 3.665 4.203 1.431 1.86 3.64 2.283 5.804.825-.885-1.03-1.895-1.959-2.612-3.078-3.234-5.03-6.357-10.134-9.57-15.176a630.92 630.92 0 0 0-7.173-10.966c-1.74-2.611-3.551-5.176-5.519-8.036l-4.738-1.21zm9.867 1.63c.575 1.29.797 1.994 1.173 2.6 2.34 3.772 4.68 7.545 7.085 11.276 3.281 5.09 6.576 10.174 9.955 15.201 1.203 1.792 2.593 3.473 4.05 5.065.461.505 1.557.925 2.129.723 1.126-.4 2.09-1.26 3.264-2.024-.968-1.427-1.716-2.56-2.496-3.675-1.894-2.708-4.044-5.274-5.646-8.147-2.24-4.02-4.225-8.162-7.18-11.757-1.06-1.292-1.754-2.891-2.594-4.362-.908-1.588-1.682-3.291-3.974-3.204-.438.017-.878-.407-1.341-.538-1.284-.363-2.582-.68-4.425-1.157zm-93.5 42.815c-.088-1.129-.068-1.536-.157-1.918-.995-4.249-1.97-8.501-3.025-12.738-1.47-5.888-3.048-11.75-4.492-17.647-.865-3.527-2.077-6.993-2.208-10.68-.009-.27-.3-.53-.577-.99l-3.752 1.426c-.029 5.543.77 10.744 1.98 15.873 1.616 6.853 3.36 13.678 5.124 20.495.316 1.22.683 2.747 1.567 3.436 1.468 1.143 3.374 1.718 5.54 2.743zm9.072-8.522c3.393-1.981 32.175-36.173 33.706-40.219-1.41-.26-2.807-.516-4.278-.785-.383 1.39-.996 2.428-2.463 2.786-.471.115-.856.709-1.214 1.14-7.612 9.145-15.225 18.292-22.808 27.46-1.143 1.383-2.207 2.78-4.602 2.561.59 2.515 1.116 4.745 1.659 7.057zm-.378 10.36c-.73-2.745-1.443-4.986-1.91-7.272-1.347-6.587-2.566-13.2-3.9-19.79-.528-2.617-1.2-5.209-1.847-7.802-1.098-4.405-1.844-8.845-1.274-13.445-6.605.914-6.71.958-5.86 7.064.677 4.869 2.114 9.634 3.237 14.44 1.215 5.203 2.407 10.413 3.71 15.594.692 2.745 1.58 5.443 2.425 8.15.236.76.528 1.659 1.577 1.555.926-.09 1.468.224 1.998.976.229.326.963.298 1.844.53zM52.233 185.58c.13-6.18.302-12.158.367-18.137.067-5.916.051-11.835.027-17.753-.021-5.923-.098-11.845-.15-17.843-3.445 1.098-4.453 2.494-4.538 5.621-.066 2.42-.28 4.835-.495 7.246-.158 1.769-.61 3.526-.603 5.285.015 4.373.25 8.744.336 13.116.108 5.264.13 10.525.247 15.786.026 1.162-.087 2.486 1.592 2.877.285.066.472.954.543 1.485.26 1.945.234 1.946 2.674 2.317zM142.9 30.262c-.417-.087-.648-.189-.868-.17-2.65.217-4.56 2.058-6.298 3.612-5.728 5.118-10.915 10.77-14.937 17.402-.81 1.336-2.018 2.433-3.005 3.598-2.587-1.263-2.777-2.191-1.023-4.003 1.014-1.047 2.048-2.083 2.99-3.195 3.18-3.751 6.294-7.557 9.49-11.294 1.654-1.937 3.429-3.774 5.422-5.952-2.69-.523-4.814-.501-6.51 1.202-3.425 3.436-6.785 6.94-10.136 10.45-.665.696-1.192 1.528-1.753 2.319-.863 1.214-1.699 2.448-2.714 3.914 1.226 3.851 1.157 8.295 2.677 12.55 2.139-.77 3.425-2.238 4.695-3.66 3.386-3.796 6.781-7.585 10.031-11.494 3.83-4.607 7.514-9.336 11.247-14.023.27-.342.43-.772.692-1.256zm71.891 46.504c-.405-.686-.568-1.164-.892-1.48-3.159-3.091-5.359-6.871-7.711-10.559-4.222-6.613-8.548-13.163-12.837-19.735-1.128-1.728-2.285-3.438-3.58-5.387l-1.51 1.985c-1.234 1.623-1.648 3.293-1.208 5.418.557 2.69 2.232 4.656 3.618 6.808 2.587 4.009 5.454 7.84 7.956 11.898 1.662 2.699 3.486 5.232 5.41 7.74 1.13 1.472 3.306 2.208 3.379 4.511.005.175.832.54 1.191.456 2.013-.474 4-1.057 6.184-1.655zM177.164 33.45c-.453.758-.729 1.46-1.205 1.975-2.402 2.597-4.892 5.113-7.276 7.726-1.36 1.49-2.581 3.108-3.856 4.676-2.651 3.264-5.358 6.483-7.928 9.809-3.708 4.794-7.316 9.666-10.966 14.506-1.697 2.248-3.451 4.458-5.07 6.763-.71 1.012-1.15 2.213-1.864 3.633 2.405.176 4.39.323 6.38.47l-.22-.496c.676-.814 1.332-1.648 2.039-2.431.65-.722 1.435-1.33 2.027-2.092 2.578-3.31 5.192-6.597 7.632-10.009 3.19-4.46 6.26-9.007 9.325-13.552 2.98-4.427 5.882-8.909 8.841-13.35 1.548-2.321 3.149-4.606 4.753-6.948l-2.612-.68zm-21.87 49.744c.894-1.19 1.414-1.968 2.022-2.672 1.11-1.287 2.377-2.45 3.394-3.802 2.523-3.357 5.012-6.742 7.381-10.206 2.645-3.87 5.134-7.842 7.705-11.76 1.415-2.161 2.892-4.284 4.283-6.461 1.959-3.06 3.97-6.094 5.735-9.264.59-1.054.88-2.193 2.008-2.878.274-.166.267-.79.405-1.258-1.28-.282-2.383-.478-3.459-.772-1.444-.397-1.76-.242-2.002 1.343-.176 1.157-.507 2.111-1.54 2.875-.82.607-1.41 1.548-2.024 2.4-2.743 3.808-5.454 7.643-8.186 11.46-2.447 3.42-4.954 6.8-7.352 10.255-2.307 3.324-4.473 6.744-6.773 10.073-1.33 1.927-2.857 3.717-4.198 5.638-1.075 1.545-2.006 3.193-3.146 5.029h5.747zm127.27 20.547c-.156-.238-.212-.423-.334-.492-3.433-1.965-7.214-3.06-10.921-4.331-.514-.176-1.248-.35-1.646-.118-1.839 1.057-3.448.027-5.138-.364-1.173-.272-2.389-.776-3.535-.661-1.59.158-3.44.289-4.313 2.002-1.166 2.292-2.18 4.664-3.188 6.85 1.457 1.66 2.796 3.264 4.222 4.789 1.617 1.728 3.304 3.488 5.971 3.142 1.49-.19 3.067-.425 4.393-1.07 3.41-1.665 6.734-3.519 9.74-5.865 1.618-1.26 3.589-2.108 4.75-3.882zm-226.661 24.67c.132.88.376 1.593.321 2.284-.234 2.971-.308 5.985-.899 8.89-1.083 5.324-.28 10.649-.405 15.968-.176 7.442-.073 14.892-.042 22.338.007 1.908.195 3.813.296 5.666l2.244.135c-.145 1.368-.273 2.551-.409 3.813.422.198.761.425 1.136.521 1.378.355 1.762.068 1.842-1.323.016-.323-.013-.65-.015-.974-.02-5.428-.185-10.86-.02-16.282.187-6.146.838-12.276.978-18.42.174-7.685.047-15.372.012-23.058-.003-1.018-.225-2.036-.385-3.388-2.23.813-3.399 2.31-4.654 3.83zm11.078 62.223c.238-1.555.625-3.126.688-4.707.17-4.205.22-8.414.278-12.622.044-3.07.033-6.135.03-9.205-.004-2.084-.12-4.174-.037-6.255.24-6.148.649-12.291.807-18.44.098-3.79-.4-7.59.392-11.37.107-.511-.34-1.21-.676-1.727-.701-1.083-1.48-2.12-2.267-3.143-.22-.285-.581-.456-1.108-.854-.338.882-.763 1.52-.807 2.181-.272 4.111-.547 8.227-.654 12.344-.118 4.449.048 8.909-.096 13.356-.203 6.31-.685 12.614-.85 18.928-.15 5.66-.015 11.326-.04 16.989-.011 2.77 1.21 4.165 4.34 4.525zm-52.542-29.222c.801-.565 1.386-.866 1.828-1.308 1.767-1.768 3.44-3.635 5.245-5.365a398.224 398.224 0 0 1 8.518-7.915c1.678-1.517 3.488-2.89 5.166-4.407 2.438-2.203 4.77-4.534 7.229-6.713 3.633-3.217 7.3-6.4 11.027-9.502 2.53-2.108 4.407-4.967 7.52-6.417.577-.267.904-1.07 1.335-1.608-.23-.447-.39-.722-.52-1.01-1.168-2.583-1.639-2.707-3.802-.915-.985.816-1.806 1.923-2.91 2.486-1.563.8-2.727 1.972-3.946 3.14-.932.895-1.846 1.834-2.893 2.576-2.507 1.776-4.855 3.724-7.025 5.897-1.028 1.03-2.027 2.105-3.144 3.032-4.162 3.453-8.433 6.777-12.539 10.295-3.924 3.36-7.717 6.88-11.514 10.387-.757.696-1.375 1.603-1.858 2.515-.26.489-.336 1.345-.073 1.785.632 1.065 1.511 1.984 2.356 3.047zm111.629-79.429c2.427.624 6.604.462 8.08-.26.922-.45 1.82-.89 2.357-1.955.536-1.067 1.411-1.968 2.169-2.919 3.12-3.909 6.32-7.76 9.363-11.731 3.237-4.22 6.206-8.653 9.516-12.814 4.765-5.99 9.312-12.155 14.326-17.947.245-.284.427-.624.657-.963-3.453-1.305-5.906-.736-8.04 1.704-1.008 1.153-2.155 2.181-3.15 3.342-1.79 2.089-3.579 4.18-5.241 6.369-1.417 1.862-2.613 3.892-3.988 5.79-.9 1.241-1.975 2.35-2.914 3.564-3.02 3.905-5.911 7.913-9.045 11.724-3.181 3.869-6.593 7.55-9.903 11.317-1.324 1.506-2.643 3.016-4.187 4.78zM77.1 193.184c.181-2.7.447-5.112.483-7.528.042-2.822-.11-5.648-.187-8.472-.244-8.822-.47-17.647-.745-26.469-.144-4.609-.396-9.214.4-13.8.087-.5.029-1.264-.286-1.558-1.427-1.333-2.972-2.54-4.825-4.082-.218 5.748-.412 10.98-.615 16.213-.022.563-.082 1.128-.117 1.692-.156 2.415-.434 4.832-.428 7.247.005 3.235.37 6.472.34 9.703-.057 5.909-.14 11.826-.513 17.718-.193 3.012.667 5.692 1.53 8.431.118.369.632.832.993.865 1.254.106 2.522.04 3.97.04zm79.668-161.506c-.556 1.861-2.242 2.984-3.862 4.204-.769.578-1.457 1.297-2.062 2.05-2.527 3.135-4.94 6.362-7.523 9.45a352.303 352.303 0 0 1-9.276 10.623c-3.971 4.372-7.89 8.787-11.118 13.756-.93 1.43-1.724 2.884-4.148 2.09 1.238 2.83 1.047 5.775 3.427 7.87 3.311-3.556 6.572-6.824 9.563-10.32 4.303-5.029 8.38-10.252 12.61-15.346 4.13-4.97 7.322-10.638 11.706-15.428 1.89-2.067 3.34-4.536 5.02-6.8.482-.655 1.066-1.237 1.865-2.149h-6.202zm-98.164 79.994c-1.144-2.208-1.936-3.794-2.781-5.352-1.31-2.419-2.62-4.838-3.997-7.219-.85-1.466-1.444-1.432-2.589-.249a15.688 15.688 0 0 1-2.743 2.252c-1.956 1.258-4.056 2.301-5.973 3.615-3.263 2.243-6.311 4.812-9.666 6.895-3.77 2.34-7.661 4.48-11.138 7.253-2.778 2.216-5.472 4.537-8.25 6.75-2.08 1.658-4.12 3.424-6.405 4.747-1.123.647-2.266.923-2.122 2.437.105 1.122-.409 2.472.892 3.282.314-.096.581-.109.76-.243 6.241-4.607 12.503-9.189 18.696-13.858 4.458-3.358 8.835-6.826 13.231-10.266 2.678-2.097 5.5-4.057 7.92-6.421a15.26 15.26 0 0 1 4.987-3.28c1.494-.616 2.386-.302 2.874.812.395.9-.018 1.812-1.26 2.566-1.174.713-2.43 1.29-3.583 2.032-2.712 1.734-5.472 3.413-8.048 5.332-2.841 2.118-5.419 4.591-8.262 6.706-3.304 2.461-6.825 4.63-10.153 7.06-3.446 2.516-6.81 5.146-10.137 7.818a92.785 92.785 0 0 0-6.131 5.419c-.504.482-.89 1.458-.785 2.12.218 1.38.52 2.863 2.12 3.814.605-.46 1.255-.898 1.838-1.41 1.69-1.494 3.223-3.206 5.052-4.502 6.542-4.636 12.784-9.632 18.601-15.154 1.167-1.106 2.304-2.25 3.543-3.267 4.678-3.844 9.83-7.1 14.04-11.522a12.745 12.745 0 0 1 3.282-2.485c.672-.35 1.767-.33 2.463-.016.41.185.749 1.436.518 1.92-.34.715-1.128 1.41-1.882 1.693-2.438.921-4.262 2.559-5.97 4.441-1.132 1.25-2.429 2.269-3.962 3.128-2.523 1.414-4.907 3.153-7.129 5.018-3.09 2.593-5.964 5.441-8.954 8.153-2.158 1.957-4.118 4.282-6.589 5.723-5.14 2.997-8.833 7.587-13.325 11.282-.416.342-.807 1.207-.66 1.647.378 1.132.987 2.219 1.673 3.202.202.287 1.036.338 1.483.194.592-.19 1.14-.617 1.613-1.046 3.28-2.994 6.533-6.014 9.8-9.02 1.363-1.258 2.58-2.772 4.141-3.706 3.212-1.923 5.833-4.534 8.653-6.91 2.28-1.919 4.33-4.101 6.562-6.08 5.259-4.664 10.562-9.28 15.86-13.902.606-.529 1.293-.963 1.892-1.403zm227.923-10.512c2.225-2.718 4.285-5.195 6.3-7.709a424.657 424.657 0 0 0 5.534-7.07c1.322-1.717 2.91-3.247 3.455-5.492.222-.916.856-1.728 1.286-2.597.71-1.432 1.63-2.81 2.053-4.323.538-1.918.797-3.944.92-5.938.074-1.21-.415-2.399-1.732-2.958-1.11-.475-2.176-1.07-3.321-1.436-1.611-.516-3.317-1.34-4.91-1.2-4.166.366-8.317 1.053-12.425 1.863-3.655.722-6.947 2.457-10.122 4.376-.41.248-.863.491-1.154.85-.995 1.228-1.618 2.845-3.562 2.981-.254.017-.522.577-.692.93-.278.583-.469 1.204-.718 1.802-1.858 4.478-3.726 8.956-5.58 13.438-.578 1.396-1.118 2.806-1.71 4.298.523.162.82.269 1.12.345 2.56.638 5.313.424 7.712 1.803.377.216.974.21 1.421.106 2.662-.617 5.038.227 7.416 1.268a31.536 31.536 0 0 0 4.102 1.46c1.293.36 2.409.874 3.208 2.006.263.374.709.62 1.399 1.197zm-46.044 26.13c.295.199.426.36.555.359.4-.006.815-.015 1.197-.124 2.863-.814 5.559-.487 8.24.844 1.121.558 2.483.84 3.742.861 2.567.042 5.14-.138 7.707-.296 3.664-.227 7.217-1.169 10.431-2.823 4.236-2.18 8.279-4.752 12.328-7.282 1.904-1.187 3.655-2.63 5.432-4.016 3.315-2.588 6.676-5.124 9.864-7.86 2.191-1.88 4.122-4.06 6.166-6.109 1.254-1.256 2.805-2.337 3.675-3.818 1.305-2.22 3.158-3.986 4.46-6.243 1.866-3.23 3.544-6.537 4.756-10.005 1.274-3.642 2.042-7.487 2.752-11.295.789-4.223 1.277-8.523-.161-12.718-.569-1.66-1.724-3.137-2.19-4.814-.63-2.27-2.243-3.488-4.034-4.582-2.967-1.808-6.266-1.955-9.62-1.688-1.282.104-2.566.194-3.85.262-.708.036-1.445-.115-2.126.027-5.538 1.152-10.978 2.577-16.347 4.454-4.064 1.423-7.196 3.908-10.337 6.567-.29.245-.579.618-.65.976-.48 2.404-.9 4.82-1.388 7.509.867-.25 1.372-.298 1.773-.525 2.929-1.667 5.913-3.21 9.109-4.287.974-.33 2.022-.486 3.05-.598 2.08-.228 4.217-.155 6.246-.595 3.719-.805 7.365-.883 10.998.257 1.382.434 2.834.817 4.057 1.552 3.064 1.842 3.895 3.435 3.482 7.315-.608 5.75-3.228 10.78-5.802 15.816-.037.073-.09.137-.14.2-3.594 4.571-7.089 9.225-10.817 13.685-2.114 2.53-4.514 4.845-6.956 7.07-3.954 3.598-8.364 6.619-12.956 9.341-2.996 1.776-6.095 3.426-9.696 3.564-1.015.04-2.074-.129-3.06-.396-2.508-.685-4.272-2.57-6.228-4.113-1.613-1.272-3.577-1.446-4.952.026-1.201 1.283-2.159 2.802-3.152 4.265-.587.865-1.007 1.84-1.55 2.735-1.297 2.138-2.623 4.258-4.008 6.501zM46.076 42.632c3.027 7.486 8.513 12.157 14.928 16.199.68-1.04 1.677-1.681 1.497-3.006-.03-.208.28-.478.463-.693.51-.594 1.048-1.163 1.555-1.759.783-.921 1.457-1.963 2.346-2.764 1.682-1.512 3.353-3.11 5.273-4.271 2.322-1.403 4.077-3.593 6.77-4.496 1.969-.662 3.798-1.738 5.678-2.656 3.55-1.728 7.06-3.542 10.648-5.183 1.531-.701 3.204-1.11 4.837-1.56 2.028-.553 4.1-.944 6.119-1.526 6.484-1.866 13.05-3.15 19.829-3.15 1.312 0 2.51-.29 3.504-1.335 1.188-1.249 2.022-1.278 3.308-.107.667.607 1.278.723 2.137.796 3.253.27 6.44-.177 9.657-.498 1.653-.166 3.376.19 5.045.441 1.753.264 3.472.915 5.223.995 5.243.24 10.511.072 15.663 1.357.233.056.485.016.727.044 2.643.3 5.292.572 7.932.912 5.222.674 10.44 1.374 15.656 2.09 1.675.23 3.337.545 5.003.827 2.076.349 4.169.62 6.222 1.074 3.066.678 6.111 1.463 9.148 2.26.524.137.96.586 1.45.864 1.404.793 2.74 1.792 4.24 2.308 2.945 1.01 5.189 2.864 7.192 5.136.805.909 1.554 2.025 2.582 2.55 3.332 1.701 4.474 5.272 6.905 7.722.353.356.323 1.069.56 1.574 1.03 2.206 1.455 4.538 1.502 6.955.005.216.194.429.407.872 1.172-.568 2.305-1.144 3.46-1.675.95-.436 1.89-.965 2.895-1.198 1.985-.458 3.706-1.285 5.362-2.515 1.997-1.481 4.313-2.526 6.388-3.915 2.876-1.924 5.731-3.896 8.447-6.035 1.595-1.256 1.55-2.825.41-4.48-.437-.634-1.035-1.432-.966-2.096.295-2.795-1.128-4.781-2.78-6.719-.471-.552-1.149-1.045-1.352-1.686-.56-1.76-1.866-2.895-3.221-3.857-4.302-3.05-8.008-6.771-11.967-10.208-1.573-1.365-3.095-2.871-5.226-3.437-4.282-1.134-8.553-2.311-12.837-3.44-1.704-.447-3.615-.47-5.105-1.288-2.897-1.59-6.095-1.478-9.143-2.145-2.912-.636-5.886-.998-8.836-1.447-2.16-.327-4.326-.62-6.491-.883-2.407-.296-4.827-.489-7.227-.818-3.851-.523-7.677-1.295-11.541-1.643-4.191-.378-8.413-.372-12.62-.572-4.522-.216-9.039-.589-13.562-.685-3.633-.077-7.276.103-10.91.269-5.981.272-11.962.563-17.935.963-4.031.269-8.075.562-12.065 1.169-4.64.705-9.201 1.933-13.843 2.62-3.967.59-7.737 1.745-11.428 3.186-5.2 2.028-10.352 4.176-15.49 6.352-2.519 1.067-5.02 2.206-7.43 3.504-3.424 1.843-6.398 4.338-9.46 6.731-3.632 2.837-6.299 6.025-6.455 10.841-.056 1.734-.832 2.919-3.078 3.135zm191.185 89.532l-.336-.323c-.78.82-1.663 1.563-2.32 2.471-3.461 4.78-7.708 8.74-12.583 12.004-2.952 1.978-5.958 3.922-9.68 4.267-.842.079-1.634.673-2.45 1.024-1.331.574-2.62 1.319-4.007 1.677-3.05.787-6.155 1.356-9.229 2.056-4.332.983-8.649 2.031-12.985 2.993-2.918.649-5.846 1.272-8.795 1.76-3.417.57-6.9.468-10.28 1.616-2.162.735-4.615.755-6.943.824-4.106.12-8.22.032-12.328.036-.162 0-.322.051-.482.07-4.282.537-8.57.423-12.778-.4-3.646-.715-7.438-.611-10.964-2.002-2.02-.796-4.07-1.517-6.127-2.21-2.996-1.008-5.87-2.206-8.352-4.252-2.621-2.163-5.377-4.122-8.536-5.505-1.379-.605-2.814-1.474-3.744-2.614-1.118-1.37-2.536-1.917-4.004-2.577-2.431-1.094-4.829-2.26-7.249-3.376-.755-.347-1.54-.63-2.35-.958-1.241 4.076-1.401 7.984-1.356 11.848.091 7.36.523 14.713.71 22.072.135 5.265.104 10.532.14 15.798.011 1.525.002 3.05.002 4.611.858.209 1.39.358 1.931.463 2.055.406 4.111.806 6.172 1.193 1.972.372 3.938.837 5.93 1.063 2.815.318 5.684.263 8.472.714 5.04.812 10.037 1.89 15.055 2.839 1.268.24 2.545.449 3.828.587 3.386.363 6.776.672 10.164 1.018 3.544.36 7.081.794 10.63 1.083 2.744.225 5.515.158 8.252.429 6.199.609 12.37 1.646 18.577 1.94 5.56.264 11.158-.152 16.734-.421 4.449-.213 8.921-.418 13.325-1.045 6.627-.943 13.22-2.16 19.794-3.442 3.487-.678 6.99-1.249 10.437-2.245 5.436-1.57 11.07-2.451 16.521-3.972 4.818-1.343 9.603-2.921 14.214-4.844 3.548-1.48 6.827-3.62 10.184-5.543a430.578 430.578 0 0 0 10.63-6.292c1.858-1.137 3.596-2.466 5.435-3.636.948-.602 2.06-.953 2.99-1.574 4.193-2.802 7.59-6.512 11.196-9.98 1.27-1.219 2.64-2.342 3.82-3.641.974-1.07 1.8-2.289 2.567-3.519.59-.947.783-2.204 1.51-2.991 1.804-1.956 2.013-4.36 2.29-6.765.132-1.12.06-2.26.14-3.387.293-4.078.064-8.144-1.042-12.06-.505-1.787-1.46-3.657-2.745-4.97-2.947-3.018-5.775-6.071-7.723-9.851-.209-.406-.58-.727-.98-1.214-.934.503-1.856.854-2.602 1.428-2.754 2.13-5.423 4.371-8.182 6.496a33.26 33.26 0 0 1-4.044 2.664c-2.934 1.64-6.01 3.048-8.86 4.818-1.455.903-2.85 1.843-4.504 2.273-2.416.63-4.847 1.2-7.283 1.734-1.573.347-3.157.7-4.756.845-1.519.14-3.075-.107-4.594.04-1.495.146-2.894.11-4.226-.636-2.632-1.472-5.415-1.247-8.247-.8-1.31.208-2.655.2-3.984.291zM44.754 48.398c-.216 1.712-.427 2.806-.476 3.907-.094 2.096.01 4.204-.156 6.29-.516 6.483.674 12.74 2.343 18.941.505 1.878.845 3.853 1.69 5.572 3.824 7.762 6.814 15.932 11.434 23.308 1.242 1.985 2.22 4.133 3.417 6.149.885 1.486 1.57 3.21 3.859 3.185.993-.012 1.251 1.07.92 1.876-.486 1.19.05 2.014.636 2.913 2.446 3.755 5.33 7.137 8.517 10.281 2.667 2.634 5.54 4.933 9.005 6.487a137.936 137.936 0 0 1 9.343 4.65c1.406.762 2.491 2.163 3.93 2.814 3.947 1.786 7.435 4.205 10.709 6.991a6.567 6.567 0 0 0 1.858 1.103c2.642 1.018 5.345 1.889 7.961 2.966 5.525 2.285 11.276 3.053 17.218 3.259 3.472.12 6.924.374 10.406.17 3.221-.188 6.457-.123 9.685-.234 2.102-.07 4.202-.209 6.295-.403 1.106-.1 2.142-.273 3.043-1.236.534-.574 1.716-.589 2.628-.74.45-.072.958.235 1.412.17 5.435-.791 10.858-1.616 16.177-3.092 3.176-.88 6.475-1.521 9.754-1.752 3.203-.225 6.204-1.092 9.218-1.956 3.866-1.108 7.355-3.19 11.147-4.563 4.645-1.68 8.18-5.12 11.47-8.72 1.31-1.434 2.462-3.01 3.657-4.542 2.625-3.37 5.276-6.724 7.821-10.155.852-1.15 1.38-2.534 2.106-3.78 2.387-4.113 5.938-7.426 7.87-11.888 1.438-3.324 3.504-6.368 5.051-9.65 3.543-7.515 6.777-15.168 9.574-22.998.65-1.819 1.063-3.743 1.879-5.48 1.084-2.307 1.816-4.653 2.09-7.185.202-1.848.671-3.67.833-5.518.083-.96-.244-1.959-.42-3.176-.792.414-1.282.554-1.615.863-2.267 2.108-4.972 3.544-7.572 5.17-2.207 1.38-4.832 2.152-6.56 4.293-.281.35-.797.578-1.25.716-4.133 1.26-7.898 3.311-11.7 5.303-1.427.745-2.975 1.178-4.032 2.563-.392.512-1.23.738-1.907.972-2.297.796-4.488 1.748-6.391 3.319-.65.538-1.457.97-2.264 1.223-2.772.867-5.588 1.6-8.366 2.451-2.078.637-4.095 1.498-6.193 2.047-2.5.652-5.056 1.101-7.597 1.592-1.186.229-2.427.223-3.586.538-2.364.641-5.069-.155-7.16 1.69-.172.153-.62.07-.913-.004-2.68-.654-5.274-.474-7.81.647-.416.184-.934.191-1.406.195-1.445.013-2.896.05-4.335-.05-1.459-.1-2.512.793-3.737 1.198-1.177.39-2.756-.676-4.133-.601-5.651.303-11.285-.316-16.96.047-4.873.31-9.816-.532-14.73-.829-2.663-.158-5.33-.25-7.997-.352-1.775-.067-3.55-.133-5.324-.117-.678.008-1.452.079-2.013.408-1.779 1.045-1.946 1.085-3.568-.266-1.666-1.386-3.417-1.396-5.134-.029-1.274 1.018-2.29.985-2.925-.498-.72-1.68-1.976-1.897-3.462-2.084-2.802-.351-5.8-.173-7.816-2.808-.234-.306-.888-.313-1.359-.41-4.143-.868-8.135-2.173-11.902-4.134-1.083-.563-2.204-.905-3.512-.66-.612.115-1.384-.245-1.995-.561-1.711-.883-3.342-1.917-5.063-2.78-2.094-1.05-4.32-1.85-6.353-3-2.249-1.268-4.345-2.802-6.503-4.23-3.441-2.276-6.933-4.478-10.292-6.87-2.17-1.547-4.269-3.22-5.691-5.597-.627-1.05-1.575-1.905-2.778-3.319zm228.422 4.125c2.38-1.39 4.733-2.757 7.076-4.136.343-.203.614-.6.976-.698 6.405-1.717 12.813-3.438 19.242-5.063 1.073-.273 2.26-.082 3.395-.13 1.619-.066 3.24-.257 4.854-.206 1.593.052 3.192.263 4.764.543 1.328.236 2.748.434 3.905 1.06 3.481 1.882 5.897 4.845 7.076 8.583 1.063 3.37 2.158 6.819 1.744 10.443-.33 2.884-.797 5.756-1.302 8.616a61.367 61.367 0 0 1-1.294 5.67c-1.497 5.405-3.379 10.654-6.549 15.356-.76 1.125-1.219 2.48-2.089 3.502-2.15 2.52-4.433 4.932-6.709 7.346-2.044 2.166-4.15 4.276-6.255 6.442 1.09 2.743 2.807 4.924 4.67 7.086 2.522 2.928 5.108 5.869 6.583 9.545 1.266 3.153 1.397 6.52 1.488 9.821.094 3.464-.173 6.956-.545 10.407-.168 1.555-.914 3.066-1.506 4.554-.478 1.2-1.12 2.334-1.69 3.495-1.339 2.735-3.172 5.05-5.595 6.933-1.201.934-2.18 2.148-3.308 3.184-2.558 2.354-5.054 4.791-7.754 6.974-2.125 1.717-4.498 3.138-6.8 4.632a224.355 224.355 0 0 1-6.978 4.342 431.443 431.443 0 0 1-8.558 4.978c-3.306 1.875-6.64 3.704-9.957 5.556-.283.158-.52.45-.816.523-4.485 1.092-8.447 3.786-13.123 4.29-.402.04-.816.075-1.192.204-3.977 1.382-8.02 2.398-12.19 3.12-5.337.92-10.56 2.502-15.878 3.558-5.471 1.086-10.989 1.979-16.511 2.773-3.437.494-6.924.625-10.384.958-3.305.32-6.604.716-9.908 1.03-1.356.13-2.725.216-4.084.176-3.8-.112-7.603-.245-11.398-.48-1.857-.114-3.691-.55-5.548-.697-8.315-.66-16.654-1.083-24.947-1.947-7.403-.772-14.77-1.939-22.134-3.067-4.716-.724-9.394-1.718-14.097-2.54a17.745 17.745 0 0 0-3.385-.254c-3.695.073-7.24-.592-10.749-1.734-1.72-.56-3.528-1.237-5.448-.712-.055.84.11 1.721-.214 2.348-.322.62-1.083 1.2-1.757 1.363-.304.075-1.007-.845-1.266-1.432-.32-.716-.365-1.554-.538-2.39-.474-.102-.86-.263-1.243-.258-3.259.044-6.429-.249-9.357-1.908-1.221-.693-2.473-.967-3.85.02-.977.7-2.089.314-2.325-.798-.56-2.624-2.74-2.45-4.507-2.666-1.018-.124-1.728-.378-2.582-.922-1.49-.946-3.135-1.804-4.832-2.217-1.379-.334-2.489-.905-3.695-1.58-1.508-.842-3.272-1.273-4.965-1.737-.889-.241-1.642-.401-2.147-1.33-.366-.667-1.049-1.198-1.675-1.681a56.835 56.835 0 0 0-3.563-2.528c-2.065-1.348-4.255-2.317-6.803-2.328-1.993-.01-2.288-.365-2.527-2.417-.038-.324-.153-.653-.115-.965.178-1.48-.565-2.157-1.89-2.67-2.842-1.105-5.004-3.186-7.17-5.28-1.883-1.824-3.564-3.727-4.396-6.264-.047-.145-.183-.27-.303-.374-5.56-4.853-6.693-11.614-7.821-18.338-.427-2.548-.92-5.194-.65-7.715.343-3.242 1.19-6.424 2.748-9.437 3.163-6.118 7.534-11.116 12.893-15.345 1.773-1.4 3.39-3 5.181-4.372 4.013-3.08 8.597-5.213 13.155-7.27 4.085-1.846 8.178-3.92 12.816-4.202.371-.021.725-.272 1.32-.51-.842-1.923-1.7-3.717-2.422-5.565-2.039-5.227-3.17-10.677-4.213-16.18-.938-4.94-.442-9.862-.534-14.785-.05-2.633.548-5.276.815-7.918.213-2.092.371-4.188.547-6.283.027-.324-.034-.669.055-.97.746-2.53 1.518-5.051 2.376-7.879 1.037.487 1.718.805 2.463 1.154a63.215 63.215 0 0 1 17.299-14.106c3.01-1.676 6.283-2.888 9.47-4.235 2.512-1.061 5.065-2.03 7.615-3.002 3.923-1.496 7.84-3.01 11.796-4.406 1.355-.478 2.823-.634 4.242-.923.316-.063.648-.049.966-.107 5.88-1.087 11.745-2.255 17.644-3.237 2.629-.438 5.32-.492 7.984-.741 6.69-.627 13.37-1.3 20.118-1.022 2.652.111 5.324-.378 7.986-.358 3.804.027 7.608.255 11.41.43 4.122.186 8.24.455 12.365.602 5.186.188 10.304.797 15.412 1.769 4.21.801 8.533.994 12.786 1.595 4.32.611 8.633 1.309 12.92 2.118 4.128.778 8.339 1.388 12.293 2.728 4.302 1.457 8.795 2.008 13.095 3.402 2.64.856 4.776 2.406 6.78 4.14 3.17 2.742 6.024 5.837 9.456 8.302 1.696 1.217 3.428 2.52 4.74 4.116 3.335 4.062 6.278 8.422 8.201 13.362.64 1.642 1.049 3.384 1.447 5.108.116.498-.073 1.132-.295 1.63-.398.902-.416 1.705.17 2.428z" mask="url(#b)"/>
        </g>
        <g transform="translate(.779 -.924)">
            <mask id="d" fill="#fff">
                <use xlink:href="#c"/>
            </mask>
            <path fill="#000" d="M148.076 56.286c-.5.705-1.533 1.054-1.524 2.35 1.342-.392 1.408-1.401 1.524-2.35zM29.688 61.643c.642 1.837 1.219 3.444 3.072 4.686v-7.24c-.836 1.334-1.354 2.593-3.072 2.554zm29.534 8.788l-.39.223c.21 1.59.394 3.183.652 4.765.05.31.327.712.603.83.722.314.83.819.754 1.505-.076.693.296.985.986 1.045 2.146.186 4.287.436 6.433.614.32.027.663-.2 1.266-.397L59.222 70.43zm63.456-34.298l-.307.389c1.905 2.81 3.809 5.623 5.742 8.476l5.169-5.816c-3.297-2.318-6.883-2.922-10.604-3.05zm4.465 35.177c1.969.023 4.138-1.202 4.797-2.42.316-.584.696-1.171 1.173-1.623.85-.804 1.852-1.448 2.684-2.268.742-.73 1.314-1.63 2.005-2.415 1.1-1.251 2.278-2.435 3.347-3.711 1.907-2.28 3.76-4.603 5.628-6.916.86-1.064.805-1.431-.266-2.561-1.251 1.172-2.518 2.334-3.754 3.527-.668.645-1.335 1.303-1.913 2.027-1.773 2.218-3.497 4.475-5.254 6.707a50.638 50.638 0 0 1-1.88 2.254c-1.215 1.374-2.46 2.72-3.68 4.09-.921 1.036-1.824 2.09-2.887 3.309zm-13.73-35.942c-.646 1.158.224 1.895.634 2.629 1.078 1.93 2.303 3.782 3.5 5.645a234.398 234.398 0 0 0 3.982 6.034c.242.354.743.53 1.125.789l-.222-.5 3.135-2.454c-1.07-1.27-2.117-2.412-3.045-3.645-1.14-1.514-2.088-3.177-3.287-4.637-.975-1.186-2.168-2.186-2.213-3.861h-3.608zM40.608 50.796c-.916.655-1.548 1.096-2.17 1.552-1.842 1.35-3.224 2.926-2.652 5.456.04.175-.014.37-.013.558.003 2.544-.01 5.089.023 7.633.012.924-.038 1.922 1.175 2.275.167.048.34.374.357.583.062.82.395 1.376 1.186 1.727.634.282 1.192.734 1.89 1.178.127-1.858.3-3.441.322-5.026.02-1.361-.141-2.724-.207-4.087-.061-1.242-.157-2.485-.14-3.726.037-2.542.139-5.082.229-8.123zm62.69-15.825c.195 1.342.764 2.418 1.42 3.48 1.863 3.015 3.649 6.077 5.54 9.07a193.85 193.85 0 0 0 5.038 7.564c.584.835.979 1.909 2.153 2.332.706-.808 1.46-1.558 2.06-2.415.227-.324.31-1.064.1-1.33-2.12-2.673-3.871-5.58-5.648-8.482-1.773-2.895-3.653-5.74-5.152-8.778-.792-1.606-1.837-2.007-3.385-1.81-.672.087-1.337.23-2.125.369zM55.85 77.136c0-1.341.037-2.442-.008-3.54-.076-1.867-.364-3.74-.275-5.595.185-3.853.659-7.693.826-11.547.147-3.388-.16-6.788.079-10.181.099-1.41.186-2.82.278-4.24-2.236.194-3.195 1.052-3.654 2.977-.39 1.634-.713 3.252-.694 4.95.04 3.416-.08 6.834-.021 10.248.05 2.854.249 5.705.41 8.556.045.79.192 1.574.28 2.262 1.989.716 2.012.737 1.585 2.599-.205.892-.47 1.77-.744 2.792l1.938.719zm53.263-.281c.407-1.313.55-2.377 1.052-3.231.522-.888 1.355-1.607 2.113-2.337 1.022-.982 2.14-1.865 3.147-2.863.873-.867 1.632-1.846 2.467-2.753a977.714 977.714 0 0 1 5.193-5.574c.76-.813 1.633-1.54 2.289-2.428 1.359-1.84 2.6-3.765 3.906-5.645.136-.196.38-.313.553-.488 1.468-1.495 2.949-2.977 4.389-4.497 1.055-1.113 2.063-2.271 3.075-3.424.469-.534.898-1.103 1.33-1.64-.67-.786-1.174-.907-1.902-.392-2.304 1.632-4.303 3.55-5.886 5.895-.204.304-.425.61-.694.853-2.168 1.963-4.677 3.492-6.283 6.137-1.501 2.47-3.525 4.627-5.353 6.893-1.91 2.366-3.807 4.743-5.805 7.033-1.835 2.105-3.8 4.097-5.698 6.147-.643.695-1.257 1.418-1.884 2.128l.193.4c1.32-.074 2.64-.15 3.798-.214zm-49.254-18.29c-.171.034-.343.068-.515.1l-.48 6.875c1.286.718 2.469 1.22 3.467 1.969 1.825 1.369 3.553 2.869 5.297 4.343 1.356 1.147 2.7 2.312 3.999 3.524.579.54 1.003 1.243 1.55 1.82.535.565 1.077 1.415 1.72 1.526 1.834.314 3.72.317 5.587.442l.18-.354c-.387-.447-.726-.95-1.171-1.33-1.026-.875-2.204-1.593-3.14-2.551-1.685-1.726-3.256-3.566-4.837-5.392-.64-.74-1.108-1.63-1.773-2.342-2.998-3.22-6.533-5.817-9.884-8.63zm55.672 16.732c3.415-.666 3.412-.67 5.469-3.08.24-.281.548-.506.817-.766 1.158-1.12 2.363-2.194 3.456-3.373 1.217-1.312 2.302-2.743 3.496-4.077 1.597-1.782 3.36-3.404 4.704-5.425a78.04 78.04 0 0 1 4.418-5.991c1.485-1.828 3.16-3.501 4.705-5.283.515-.594.882-1.316 1.318-1.984-1.405-.864-2.261-.776-3.386.38-2.037 2.096-4.098 4.175-6.024 6.372-2.082 2.376-3.998 4.896-6.033 7.314-.753.896-1.668 1.653-2.456 2.522-3.047 3.359-6.118 6.699-9.072 10.14-.715.833-1.575 1.782-1.412 3.25zM48.82 45.457c-.603.27-1.201.533-1.793.807-1.264.583-1.833 1.565-2.242 2.929-1 3.334-.913 6.766-1.086 10.147-.165 3.205.29 6.44.44 9.664.034.715.103 1.263.852 1.676.69.38.96 1.1.568 1.94-.14.3-.13.67-.187 1.003l4.2 1.314c-.096-1.513-.296-2.86-.246-4.195.207-5.545-.22-11.064-.483-16.593-.132-2.782-.023-5.576-.023-8.691zm65.94 15.469c-.613-.58-1.175-.93-1.483-1.433-.931-1.52-1.705-3.138-2.648-4.65-2.031-3.26-4.13-6.477-6.198-9.714a977.483 977.483 0 0 1-3.275-5.158c-.693-1.1-1.258-2.301-2.074-3.298-1.741-2.126-2.948-2.507-5.787-1.75.303.624.554 1.234.884 1.799.683 1.172 1.426 2.31 2.11 3.48.472.805.852 1.663 1.334 2.459a675.91 675.91 0 0 0 5.333 8.693c2.307 3.684 4.626 7.362 7.008 10.997.44.672 1.204 1.13 1.987 1.839l2.81-3.264zm-55.367-7.127c2.089-.364 2.85.857 3.816 1.945 1.377 1.554 2.804 3.137 4.475 4.339a28.604 28.604 0 0 1 6.33 6.249c.99 1.334 2.202 2.516 3.396 3.683 1.417 1.387 2.939 2.666 4.38 4.027 1.132 1.068 2.116 2.313 3.336 3.258 1.5 1.162 3.009 2.663 5.508 1.54-1.245-1.497-2.344-2.946-3.58-4.268-1.056-1.131-2.35-2.042-3.395-3.181-2.26-2.46-4.813-4.61-6.871-7.3-2.75-3.594-5.928-6.857-8.857-10.317-2.114-2.497-4.386-4.876-5.994-7.775-.328-.591-.965-1.011-1.46-1.51l-.446.159-.638 9.15zm42.349 21.56c.76-1.206.696-1.978.058-2.962-1.482-2.287-2.97-4.572-4.414-6.884-2.657-4.253-5.225-8.562-7.946-12.773-1.683-2.605-3.151-5.308-4.467-8.105a10.246 10.246 0 0 0-.935-1.61c-1.51-2.108-3.132-4.115-4.96-5.971-.574-.585-1.088-.84-1.768-.67-1.42.355-2.815.812-4.175 1.213-.025 1.218.766 1.728 1.305 2.384 1.693 2.058 3.428 4.082 5.072 6.179 1.377 1.756 2.632 3.608 3.972 5.394 1.257 1.673 2.594 3.288 3.825 4.98 1.125 1.549 2.109 3.2 3.237 4.747a191.38 191.38 0 0 0 5.029 6.629c1.96 2.458 4.007 4.848 6.167 7.449zm6.779-7.69c-1.22-1.906-2.376-3.644-3.46-5.426-.964-1.59-1.856-3.223-2.77-4.842-1.705-3.028-3.334-6.102-5.126-9.08-1.668-2.77-3.484-5.453-5.283-8.143-.583-.873-1.187-1.835-2.02-2.412-1.032-.712-1.75-1.497-1.907-2.825-1.411.207-2.772-.082-4.25.57.44.76.77 1.414 1.176 2.016 1.67 2.482 3.232 5.02 4.389 7.794.403.967.818 1.947 1.377 2.826a303.734 303.734 0 0 0 4.923 7.44c.766 1.13 1.684 2.16 2.418 3.31 1.56 2.445 2.979 4.985 4.59 7.395.977 1.462 2.206 2.754 2.885 3.588l3.058-2.21zM97.8 77.437c-.17-.421-.213-.682-.36-.861-1.676-2.067-3.391-4.102-5.046-6.187-.828-1.043-1.522-2.191-2.328-3.253-1.7-2.242-3.674-4.288-4.791-6.942-.26-.615-.72-1.154-1.123-1.701-1.541-2.092-3.271-4.068-4.612-6.281-2.794-4.607-6.673-8.257-10.231-12.2-1.067-1.183-2.116-1.537-3.597-.83-.708.337-1.574.33-2.35.548-.365.102-.684.366-1.195.652 1.964 1.782 3.416 3.687 4.488 5.872.16.329.432.61.675.893 2.06 2.394 4.126 4.786 6.193 7.175 1.404 1.623 2.807 3.247 4.222 4.86 1.02 1.163 2.074 2.296 3.086 3.466.565.654.94 1.647 1.64 1.972 1.27.59 1.943 1.7 2.877 2.575a66.758 66.758 0 0 1 2.393 2.336c1.808 1.869 3.795 3.61 5.32 5.69 1.042 1.42 2.574 1.554 3.825 2.357.152.098.472-.065.914-.141zM5.529 39.258c-.31 1.193-.8 2.199-.79 3.2.034 3.486-.245 6.934-.568 10.403-.31 3.333-.107 6.717-.081 10.077.008 1.175.178 2.347.244 3.522.137 2.425.337 4.85.35 7.276.01 1.859-.227 3.719-.35 5.579-.117 1.805-.35 3.613-.32 5.416.07 4.04.416 8.078.39 12.115-.037 6.163-.307 12.323-.452 18.485-.102 4.354-.353 8.718-.17 13.06.134 3.16.802 6.32 2.92 8.91.466.568 1.019 1.068 1.454 1.656 1.055 1.424 1.94 2.995 3.12 4.3 2.056 2.273 4.013 4.597 5.066 7.505a63.479 63.479 0 0 1 1.99 6.594c.35 1.439.369 2.957.56 4.436.183 1.41.438 2.813.582 4.226.126 1.228.106 2.47.215 3.7.436 4.934.914 9.863 1.344 14.797.28 3.215.522 6.433.746 9.653.172 2.475.297 4.954.43 7.432.133 2.417.25 4.835.373 7.253.038.745.07 1.489.119 2.232.083 1.303.259 2.604.25 3.906-.035 5.356-.14 10.71-.188 16.067-.018 1.984.084 3.969.063 5.954a535.052 535.052 0 0 1-.194 9.307c-.061 2.175-.167 4.349-.263 6.522-.118 2.66-.477 5.335-.3 7.973.149 2.196-.125 4.295-.367 6.433-.104.92-.091 1.86-.051 2.79.105 2.409.6 4.77.62 7.214.017 1.918.319 3.948 1.326 5.77 1.402 2.535 3.56 4.304 5.78 5.999 3.143 2.402 6.385 4.675 9.574 7.017 2.639 1.938 5.169 4.042 8.403 4.993 4.586 1.348 9.158 2.743 13.737 4.112.236.07.493.07.736.123 1.85.41 3.826.188 5.563 1.193 2.087 1.209 4.46 1.474 6.776 1.863 1.46.246 2.96.453 4.434.404 3.738-.122 7.3-1.271 10.928-2.056 3.043-.66 5.916-1.73 8.71-3.064 1.235-.59 2.468-1.19 3.723-1.738 1.579-.688 3.15-1.407 4.776-1.97 2.23-.77 3.982-2.38 6.21-3.242 2.436-.944 4.745-2.298 7.202-3.28.863-.344 1.677-.84 2.562-1.098 3.038-.885 5.845-2.235 8.486-3.964.772-.506 1.538-1.123 2.399-1.37 2.154-.616 3.835-2.011 5.653-3.176 1.25-.801 2.385-1.783 3.618-2.614.86-.58 1.803-1.041 2.709-1.555l.278.43-2.674 1.969c2.238-.293 4.86-1.851 4.58-2.657l-1.342-.078c.315-.388.427-.652.618-.74 1.259-.576 1.994-1.617 2.654-2.772.73-1.277 1.066-2.814 2.446-3.685.27-.17.419-.626.502-.98.443-1.877.922-3.751 1.24-5.652.247-1.466.302-2.968.393-4.46.132-2.163.222-4.331.325-6.497.055-1.181.073-2.365.152-3.544.286-4.215.6-8.43.883-12.644.083-1.238.359-2.542.087-3.707-.612-2.612-.36-5.196-.19-7.796.163-2.475.365-4.946.558-7.418.174-2.228.46-4.454.514-6.685.062-2.533-.08-5.071-.131-7.606-.045-2.223-.098-4.446-.124-6.668-.011-.935-.024-1.877.075-2.804.156-1.466.574-2.922.585-4.384a65.5 65.5 0 0 1 1.865-15.14c.398-1.63.833-3.272 1.474-4.816 1.305-3.142 2.718-6.241 4.175-9.316.633-1.338 1.486-2.571 2.235-3.854.187-.321.412-.632.53-.977.742-2.158 1.46-4.324 2.183-6.488 1.083-3.243 1.939-6.535 2.183-9.966.313-4.401.679-8.8.968-13.202.038-.577-.15-1.22-.397-1.755-.541-1.17-.803-2.36-.588-3.631.34-2.008.678-4.018 1.068-6.016.239-1.221.583-2.406-.031-3.633-.133-.266.08-.701.119-1.06.093-.862.233-1.725.25-2.59.034-1.612-.093-3.23.003-4.835.154-2.548.33-5.103.689-7.628.656-4.621.42-9.317 1.246-13.918.033-.183.033-.374.035-.561.016-2.258-.001-4.517.053-6.774.085-3.478.252-6.954.32-10.433.062-3.11.07-6.222.04-9.333-.021-2.17-.196-4.338-.213-6.508-.017-2.052-.035-4.116.158-6.155.34-3.605-.921-6.99-1.288-10.494-.077-.74-.176-1.672-1.121-2.474-.21 1.39-.51 2.478-.51 3.567 0 2.276-.738 4.399-1.201 6.574-.281 1.316-.801 2.596-1.33 3.843-1.233 2.91-2.657 5.747-3.763 8.704-.62 1.652-1.441 3.145-2.386 4.593-1.652 2.532-3.301 5.068-5.046 7.535-1.144 1.617-2.45 3.119-3.694 4.664-.154.19-.37.336-.563.493-1.013.816-1.996 1.675-3.052 2.432-1.755 1.259-3.285 2.84-5.36 3.649-.974.38-1.88.937-2.815 1.417-1.49.764-2.936 1.628-4.474 2.275-2.683 1.128-5.422 2.125-8.14 3.174-.464.18-.923.385-1.402.514-3.091.827-6.34.909-9.371 2.08-1.136.438-2.43.48-3.656.67-1.78.278-3.598.389-5.337.822-2.2.549-4.388.715-6.642.66-2.172-.05-4.364-.011-6.523.22-4.572.488-9.115 1.36-13.696 1.638-4.653.282-9.34.097-14.01-.004-2.22-.047-4.442-.217-6.603-.908-1.09-.348-2.276-.554-3.417-.547-4.347.028-8.41-1.288-12.493-2.503-2.085-.62-4.184-1.248-6.177-2.104-2.207-.948-4.487-1.775-6.372-3.403-1.291-1.115-2.692-2.263-4.25-2.865-1.612-.625-2.871-1.645-4.196-2.61-.835-.607-1.416-1.562-2.246-2.178-1.785-1.324-3.353-2.88-4.797-4.53-2.034-2.325-3.825-4.865-5.87-7.18-1.044-1.182-2.107-2.254-2.244-3.914-.061-.744-.205-1.49-.182-2.232.05-1.61.16-3.22.287-4.826.199-2.518.425-5.035.66-7.55.029-.302.112-.668.308-.87.327-.336.736-.725 1.164-.807 1.63-.313 2.977.876 2.782 2.519-.264 2.209-.565 4.426-1.054 6.594-.703 3.116-.026 5.986 1.669 8.5 1.55 2.298 3.499 4.334 5.348 6.419 1.114 1.256 2.472 2.302 3.544 3.589 2.104 2.527 4.567 4.536 7.548 5.933.726.34 1.38.84 2.045 1.3 2.696 1.87 5.48 3.593 8.597 4.666 2.523.868 5.076 1.659 7.645 2.377 2.036.569 4.11.997 6.18 1.44.63.136 1.326.262 1.939-.381-.245-.21-.406-.45-.616-.505-.638-.17-1.311-.217-1.942-.406-1.705-.512-3.398-1.065-5.091-1.614-2.003-.65-4.002-1.31-6.002-1.971-1.988-.657-4.047-1.161-5.942-2.022-2.301-1.045-4.48-2.365-6.676-3.628-1.01-.581-1.942-1.302-2.895-1.98a14.356 14.356 0 0 1-1.284-1.036c-.545-.49-1.04-1.038-1.597-1.511-1.295-1.1-1.878-2.557-2.106-4.174-.155-1.1-.15-2.224-.31-3.324-.142-.965.466-2.428 1.345-2.45 1.89-.044 2.428-1.538 3.404-2.67a102.413 102.413 0 0 1 5.712-6.11c1.669-1.637 3.996-2.514 5.393-4.504.087-.124.329-.133.49-.211 2.228-1.061 4.622-1.877 6.638-3.25 2.62-1.783 5.62-2.627 8.443-3.831 2.878-1.228 6.092-1.676 9.166-2.436 2.222-.548 4.463-1.015 6.68-1.58 3.01-.766 5.968-1.726 9.102-1.964 2.723-.206 5.428-.682 8.153-.853 3.164-.198 6.34-.216 9.512-.27 1.857-.031 3.715.025 5.573.033 1.486.006 2.98-.104 4.455.02 2.902.247 5.793.89 8.687.877 4.2-.021 8.265.659 12.322 1.546 1.19.26 2.315.707 3.442 1.269 1.26.626 2.688 1.57 4.345.337 1.019-.757 2.509-.105 2.859 1.055.174.577-.058 1.276-.124 2.154.646.044 1.29.123 1.936.127 1.3.006 2.7.574 2.919 1.624.292 1.4 1.269 1.892 2.07 2.679 2.068 2.029 4.429 3.849 4.825 7.026.014.115.114.22.177.328 2.039 3.553.11 8.299-2.037 11.116-1.758 2.307-4.337 3.637-6.594 5.35-4.324 3.286-8.973 6.042-13.774 8.549-.932.486-2.094.595-2.928 1.188-1.896 1.347-4.171 1.542-6.262 2.215-2.575.829-5.3 1.232-7.983 1.674-2.691.443-5.335 1.25-8.106 1.153-.367-.013-.858-.022-1.086.189-.943.87-1.874.702-2.908.222-.303-.141-.742-.041-1.108.016-3.547.554-7.086 1.166-10.64 1.669-2.023.287-4.074.59-6.108.558-5.207-.085-10.408-.528-15.623-.225-1.812.105-3.606.079-5.376-.463-.55-.17-1.28-.494-1.892.318.476.152.818.307 1.176.37 2.662.468 5.215 1.344 8.018 1.273 4.01-.1 8.032.358 12.05.38 3.659.023 7.236-.981 10.912-1.07 2.638-.062 5.214-.885 7.903-.831 1.916.039 3.838-.315 5.76-.466 1.539-.12 3.103-.07 4.618-.321 3.785-.627 7.566-1.298 11.315-2.106 4.716-1.015 9.446-2.031 13.74-4.4.64-.354 1.38-.525 2.037-.857 1.027-.521 1.964-1.287 3.042-1.625 2.04-.641 3.77-1.756 5.437-3.021.979-.745 1.999-1.455 2.876-2.307 1.95-1.895 3.924-3.784 5.697-5.84 1.41-1.637 2.635-3.46 3.769-5.306 1.162-1.893 2.616-3.604 3.284-5.824.495-1.642 1.459-3.14 2.18-4.72.692-1.513 1.476-3.004 1.973-4.583.709-2.25 1.327-4.545 1.736-6.864.408-2.313.786-4.693.67-7.02-.121-2.428-.832-4.83-1.325-7.235-.055-.27-.392-.471-.548-.735-.778-1.32-2.275-1.68-3.375-2.563-3.44-2.765-7.106-5.181-11.045-7.165-1.212-.61-2.504-1.088-3.8-1.498-.696-.22-1.565.02-2.208-.272-2.373-1.083-4.948-.996-7.425-1.453-1.521-.28-3.241-.134-4.541-.812-2.326-1.216-4.804-.905-7.2-1.302-.883-.146-1.903.446-2.761.255-2.66-.59-5.293-.45-7.974-.295-1.843.107-3.715-.363-5.57-.324-2.04.044-4.071.412-6.112.573-4.382.345-8.8.42-13.143 1.028-4.952.692-9.998.65-14.875 1.937-1.367.36-2.804.449-4.2.71-3.173.598-6.29 1.406-9.396 2.305-4.826 1.396-9.786 2.348-14.567 3.868-3.884 1.235-7.857 2.319-11.482 4.3-1.015.555-2.174.844-3.22 1.35-1.67.809-3.336 1.635-4.938 2.568-2.401 1.4-4.7 2.982-7.124 4.339-4.853 2.717-9.382 5.827-12.906 10.2-.827 1.025-1.742 1.553-3.372 1.2zm12.608 237.477c-.19-2.486-.4-5.28-.617-8.073-.216-2.783-.445-5.565-.656-8.35-.018-.242-.04-.575.097-.724 1.339-1.464.735-3.333 1.04-5.001.313-1.708.393-3.462.529-5.2.163-2.102.305-4.205.405-6.312.08-1.728.1-3.461.123-5.191.022-1.778-.011-3.556.025-5.332.049-2.418.21-4.836.198-7.254-.031-5.4-.131-10.8-.221-16.2-.054-3.23-.1-6.462-.235-9.69-.061-1.424-.367-2.836-.508-4.26-.18-1.795-.3-3.597-.453-5.396-.273-3.214-.536-6.43-.83-9.642-.34-3.716-.691-7.43-1.067-11.142-.244-2.404-.727-4.8-.767-7.203-.048-2.924-1.197-5.557-1.883-8.293-.466-1.86-1.556-3.64-2.681-5.232-1.131-1.6-2.581-3-4.018-4.351-1.66-1.56-2.522-3.66-3.926-5.371C.27 135.568.32 132.1.122 128.55c-.211-3.813-.162-7.584.252-11.361.91-8.3.883-16.63.582-24.947-.102-2.822.284-5.658-.232-8.484-.181-.991.21-2.077.278-3.124.2-3.095.373-6.192.55-9.29a3.161 3.161 0 0 0-.033-.746c-.931-5.13-.3-10.313-.5-15.468-.056-1.478.265-2.97.37-4.457.075-1.04.143-2.087.095-3.126-.088-1.934.226-3.805.756-5.646.793-2.754 2.344-4.924 4.51-6.881 1.648-1.491 3.174-3.118 5.012-4.4 1.876-1.308 3.698-2.703 5.636-3.912a590.106 590.106 0 0 1 13.137-7.957c1.21-.711 2.599-1.113 3.89-1.692.905-.406 1.786-.866 2.672-1.313.166-.083.29-.256.459-.318 2.26-.826 4.498-1.725 6.794-2.433 2.652-.818 5.36-1.455 8.038-2.193 1.438-.396 2.856-.868 4.296-1.255 3.457-.932 6.902-1.915 10.388-2.725 3.362-.781 6.74-1.521 10.164-2.01 2.695-.383 5.39-.772 8.086-1.16 2.266-.327 4.532-.656 6.797-.985.124-.018.249-.093.365-.078 3.36.465 6.654-.506 9.993-.46 3.17.046 6.236-.696 9.34-1.167.836-.126 1.724.1 2.589.153.854.052 1.709.12 2.564.129 2.856.028 5.71.009 8.565.059 1.55.027 3.104.097 4.645.257 2.099.217 4.2.466 6.276.832 2.909.515 5.799 1.135 8.69 1.739 2.228.465 4.469.892 6.659 1.5 1.163.324 2.256.949 3.334 1.526 1.957 1.045 3.903 2.112 5.808 3.247 2.444 1.457 4.875 2.943 7.247 4.512 1.02.675 1.993 1.495 2.789 2.419a86.62 86.62 0 0 1 4.367 5.552c1.515 2.079 1.734 4.705 2.74 7.016.622 1.427.585 3.146.82 4.737.503 3.395.384 6.798.306 10.22-.083 3.663.227 7.334.34 11.003.022.68-.076 1.364-.112 2.047-.24 4.539-.31 9.095-.775 13.61-.336 3.254.38 6.45.04 9.69-.39 3.71-.501 7.45-.82 11.17-.246 2.897-.648 5.778-.93 8.67-.095.99-.03 1.997-.04 2.996-.028 2.293-.058 4.586-.083 6.878-.003.249-.074.568.05.735 1.185 1.6.277 3.24.049 4.824-.241 1.676-.21 3.32-.202 5 .015 3.16-.262 6.323-.46 9.482-.247 3.972-.452 7.95-.842 11.909-.21 2.124-.66 4.242-1.2 6.31-.672 2.574-1.432 5.139-2.38 7.622-.676 1.775-1.775 3.386-2.595 5.113-1.385 2.914-2.686 5.868-4.044 8.795-1.786 3.853-3.071 7.859-3.465 12.096-.361 3.877-.428 7.786-.884 11.65-.797 6.753-.083 13.533-.556 20.284-.148 2.11-.404 4.215-.651 6.317-.553 4.708-.772 9.424-.431 14.16.054.746.057 1.498.036 2.246-.091 3.348-.15 6.699-.326 10.043-.071 1.356-.51 2.69-.608 4.048a59.27 59.27 0 0 0-.144 5.733c.09 3.703-.391 7.343-1.047 10.968-.386 2.129-.686 4.292-1.312 6.352-.735 2.419-1.78 4.744-2.7 7.106-.065.17-.173.406-.313.45-2.057.66-3.211 2.769-5.481 3.22-1.396.277-2.656 1.25-3.972 1.919-1.476.753-2.891 1.662-4.43 2.247-3.142 1.193-6.1 2.663-8.666 4.856-.138.118-.31.259-.474.272-3.044.259-5.711 1.642-8.287 3.066-1.986 1.096-4.16 1.593-6.165 2.545-2.285 1.085-4.508 2.3-6.772 3.43a154.99 154.99 0 0 1-4.85 2.323c-.845.386-1.764.616-2.596 1.026-4.14 2.045-8.441 3.613-12.957 4.604-2.125.465-4.256.94-6.332 1.58-1.957.604-3.891.46-5.854.248-.186-.021-.398-.116-.552-.057-2.401.929-4.237-.784-6.304-1.363-2.74-.77-5.447-1.657-8.161-2.516-1.476-.467-2.933-.99-4.406-1.465-1.184-.381-2.368-.765-3.568-1.086-3.166-.844-6.34-1.696-9.271-3.175a37.142 37.142 0 0 1-5.091-3.127c-3.2-2.332-6.327-4.765-9.444-7.207-1.81-1.416-3.54-2.93-5.307-4.401-.142-.118-.265-.298-.428-.345-2.194-.646-2.941-2.524-3.757-4.355-1.043-2.343-2.078-4.683-1.55-7.671z" mask="url(#d)"/>
        </g>
        <path fill="#000" d="M10.59 78.05c.063.535.169.942.149 1.342-.14 2.856-.126 5.683.506 8.51.335 1.5.286 3.097.32 4.652.05 2.303-.033 4.609.043 6.91.073 2.226.376 4.447.396 6.67.026 2.855.005 5.722-.24 8.563-.298 3.493-.356 6.939.527 10.36.17.66.289 1.342.363 2.02a12.744 12.744 0 0 0 4.303 8.264c3.19 2.805 6.237 5.828 9.928 8.05 2.168 1.306 4.194 2.847 6.355 4.165.937.57 2.079.793 3.083 1.269 1.828.867 3.614 1.82 5.43 2.708 1.61.786 3.24 1.532 4.86 2.296.723.34 1.469.64 2.162 1.034 1.72.976 3.417 1.996 5.125 2.996.105.062.224.144.336.143 2.768-.02 4.745 2.003 7.204 2.799 1.455.47 2.797 1.277 4.228 1.836.68.266 1.467.493 2.173.419 4.198-.441 8.317-1.233 12.163-3.098.602-.293 1.294-.543 1.95-.56 3.157-.076 6.314-.065 9.47-.083.429-.003.856.013 1.284.014 2.297.004 4.593-.002 6.89.014.492.003.982.099 1.473.118 1.79.068 3.616-.08 5.359.234 1.919.344 3.752.562 5.666.039 1.065-.291 2.202-.31 3.298-.495.349-.06.669-.273 1.01-.388 1.345-.45 2.703-.862 4.035-1.343.692-.25 1.413-.52 1.996-.95 2.313-1.702 4.925-2.88 7.383-4.327 2.134-1.258 4.197-2.637 6.304-3.941 1.633-1.01 3.323-1.932 4.919-2.996 1.748-1.167 3.418-2.451 5.119-3.686.449-.327.856-.727 1.34-.983 1.806-.953 3.45-2.006 4.959-3.492 1.437-1.418 3.133-2.598 4.38-4.244.296-.39.623-.754.938-1.127.32-.38.576-.863.977-1.118 1.614-1.03 3.268-1.996 4.92-2.963.316-.185.682-.351 1.038-.384 1.054-.098 1.765.812 1.46 1.83-.07.232-.223.439-.343.655-.863 1.56-2.271 2.768-2.735 4.617-.171.68-.983 1.274-1.621 1.75-2.53 1.89-5.098 3.729-7.665 5.568-.882.63-1.631 1.39-2.624 1.938-3.014 1.666-5.896 3.569-8.824 5.389-.792.493-1.555 1.033-2.35 1.523-2.001 1.234-4.021 2.44-6.02 3.678-1.628 1.009-3.211 2.09-4.862 3.06-1.287.757-2.647 1.39-3.975 2.077-.331.17-.695.297-.992.515-4.02 2.952-8.664 3.73-13.493 4.238-2.54.268-4.88-.504-7.328-.493-2.636.012-5.272-.665-7.908.013-.178.046-.381.119-.547.077-3.267-.837-6.55.2-9.806-.077-2.99-.255-5.611.743-8.29 1.806-1.245.495-2.645.616-3.984.86-1.948.354-3.904.664-5.857.999-2.773.476-5.176-.668-7.392-2.01-2.326-1.408-4.587-2.952-7.155-3.83-2.145-.731-3.932-2.07-5.95-2.993-1.006-.462-2.017-.917-2.996-1.433-2.19-1.153-4.336-2.388-6.544-3.501-1.261-.635-2.61-1.1-3.921-1.633-.628-.256-1.317-.406-1.886-.755-2.118-1.301-4.302-2.531-6.262-4.045-1.704-1.317-3.564-2.398-5.202-3.852-1.403-1.246-2.85-2.525-4.401-3.634-1.47-1.052-2.537-2.45-3.645-3.87-1.836-2.355-2.395-5.098-3.074-7.865-1.272-5.185-1.474-10.373-.548-15.637.518-2.938.37-5.921.272-8.898-.104-3.11-.043-6.224-.15-9.333a48.627 48.627 0 0 0-.493-5.373c-.41-2.806-.458-5.564.437-8.3.38-1.16 1.03-1.958 2.552-2.307M95.49 291.303c-.425-.293-.875-.614-1.338-.917-.644-.42-.872-.976-.77-1.756.329-2.495.246-4.965-.545-7.389-.105-.322.04-.726.067-1.093.032-.43.205-.913.067-1.28-.912-2.433-.275-4.953-.451-7.423-.211-2.969-.07-5.962-.221-8.938-.22-4.347-.002-8.668.36-12.998.212-2.533.683-5.072.245-7.634-.344-2.012.339-3.935.53-5.902.19-1.976.375-3.953.469-5.936.037-.786-.312-1.596-.245-2.376.119-1.357.42-2.699.65-4.045.376-2.194.342-4.419.7-6.632.789-4.852 1.686-9.682 3.164-14.354.773-2.444 2.28-4.65 3.394-6.994 1.752-3.69 4.567-6.654 6.76-10.039 1.528-2.357 3.68-3.984 5.917-5.563.605-.426 1.02-1.324 1.649-1.475 1.619-.389 3.119-1.469 4.67-1.499 2.035-.039 4.162-.115 6.198.663 1.419.542 2.292 1.642 3.247 2.617 3.276 3.344 4.787 7.543 5.733 12.06.453 2.165 1.495 4.204 2.227 6.316 1.103 3.183 1.692 6.48 2.097 9.815.517 4.26 1.115 8.511 1.545 12.78.248 2.465.202 4.958.346 7.434.143 2.47.185 4.963.589 7.394.412 2.48.592 4.942.603 7.446.009 2.106.255 4.208.31 6.315.05 1.848.208 3.736-.084 5.542-.466 2.886-.016 5.692.279 8.52.156 1.49.419 2.924-.254 4.4-.396.868-.414 1.905-.663 2.85-.092.348-.322.678-.554.965-.478.594-1.016 1.128-1.885.99-.894-.143-1.116-.85-1.387-1.577-.67-1.795-.46-3.657-.475-5.497-.02-2.106.058-4.215.098-6.32.008-.437-.06-.899.063-1.302.764-2.519.48-5.038.204-7.59-.16-1.464.005-2.972.123-4.452.184-2.306.224-4.578-.437-6.84-.236-.808-.16-1.709-.228-2.566-.33-4.07-.876-8.138-.904-12.21-.014-2.102-.46-4.047-.772-6.062-.14-.896.159-1.853.079-2.768-.205-2.33-.468-4.658-.79-6.974-.28-2.022-.64-4.035-1.025-6.04-.15-.779-.473-1.522-.705-2.286-.814-2.674-1.562-5.37-2.453-8.02-.74-2.2-1.395-4.493-2.56-6.465-.95-1.606-2.595-2.802-3.946-4.167a.75.75 0 0 0-.511-.21c-1.921.107-3.896-.713-5.763.32-.381.21-.728.508-1.131.645-3.13 1.067-4.98 3.447-6.795 6.061-1.582 2.277-3.138 4.554-4.617 6.903a101.439 101.439 0 0 0-3.255 5.545c-.374.687-.538 1.488-.79 2.24-.098.291-.11.63-.267.88-1.42 2.226-1.717 4.767-2.126 7.287-.568 3.496-1.215 6.977-1.784 10.471-.267 1.646-.501 3.302-.63 4.963a526.777 526.777 0 0 0-.725 11.09c-.084 1.494-.162 3.003-.044 4.49.309 3.875-.65 7.648-.811 11.482-.057 1.363-.15 2.734-.074 4.092.242 4.4.072 8.806.233 13.2.126 3.452.75 6.884 1.115 10.331.234 2.211.429 4.426.575 6.645.087 1.32-.503 1.99-2.29 2.837M69.827 291.445c-2.408-1.495-3.32-3.457-3.41-5.907-.048-1.365-.19-2.727-.268-4.09-.03-.495-.06-1.004.016-1.49.477-3.09.25-6.18.13-9.282-.094-2.481.045-4.98.226-7.46.3-4.114 0-8.198-.295-12.297-.191-2.66-.043-5.343-.082-8.014-.017-1.18-.162-2.355-.181-3.532-.052-3.233-.004-6.467-.123-9.697-.068-1.855-.343-3.707-.6-5.55-.317-2.275-1.055-4.548-1-6.807.098-4.056-1.242-7.96-.957-12.003-.781-2.165-.486-4.557-1.433-6.697-.243-.55-.246-1.21-.337-1.823-.037-.245.056-.527-.031-.744-1.397-3.488-1.814-7.325-4.134-10.504-1.375-1.886-2.675-3.767-4.832-4.738-1.533-.691-4.638-1.513-6.353-.4-2.337 1.519-4.89 2.973-6.074 5.612a50 50 0 0 0-2.967 8.585c-.746 3.062-1.034 6.236-1.494 9.365-.706 4.799-1.48 9.59-2.042 14.407-.265 2.27-.26 4.599-.112 6.885.278 4.27.802 8.525 1.113 12.794.117 1.602-.133 3.228-.112 4.84.037 2.864.15 5.727.236 8.59.005.187.075.38.045.558-.524 3.122.2 6.192.367 9.286.082 1.51-.48 2.385-1.593 2.428-1.288.049-2.636-1.121-2.636-2.386.002-2.532.1-5.064.09-7.595-.007-2.054-.26-4.117-.138-6.16.117-1.964-.028-3.92.169-5.9.364-3.643-.001-7.303-.792-10.903-.17-.772-.19-1.58-.25-2.374-.045-.622.022-1.258-.074-1.87-.566-3.61-.28-7.152.422-10.733.597-3.046.797-6.17 1.169-9.258.015-.122-.018-.251-.003-.374.28-2.277.432-4.58.877-6.825.809-4.082 1.692-8.156 2.734-12.184.81-3.134 2.467-5.1 5.465-7.98 3.33-3.2 7.24-4.11 11.646-3.43.71.109 1.377.496 2.066.746.58.21 1.204.339 1.739.63.692.375 1.486.748 1.934 1.347a49.63 49.63 0 0 1 3.143 4.809c.77 1.333 1.369 2.767 2.033 4.162 1.469 3.085 2.127 6.427 2.976 9.699.497 1.913.71 3.912.919 5.886.357 3.394.52 6.809.932 10.194.415 3.419 1.21 6.799 1.518 10.225.376 4.19.469 8.41.586 12.62.08 2.905-.012 5.814-.017 8.72-.001.746.037 1.493.06 2.239.116 3.772.27 7.542.338 11.315.05 2.794-.058 5.589-.014 8.384.047 2.979.228 5.956.279 8.936.054 3.17.23 6.318.689 9.468.313 2.143-.038 4.286-1.563 6.277"/>
    </g>
</svg>
