<svg xmlns="http://www.w3.org/2000/svg" width="699" height="747" viewBox="0 0 699 747">
    <path fill="#4CCEAC" fill-rule="evenodd" d="M15.565 447.76C70.708 41.839 774.624-101.821 1006.25 72.646c124.035 93.427 284.949 395.686 217.295 569.933-121.447 312.796-683.011 345.925-821.098 336.455-358.53-24.589-442.025-125.35-386.882-531.272z" opacity=".338"/>
</svg>
