<svg width="27" height="36" viewBox="0 0 27 36" fill="none" xmlns="http://www.w3.org/2000/svg">
<path d="M16.7273 18.2273C16.7273 21.1142 14.3869 23.4545 11.5 23.4545C8.61304 23.4545 6.27271 21.1142 6.27271 18.2273C6.27271 15.3403 8.61304 13 11.5 13C14.3869 13 16.7273 15.3403 16.7273 18.2273Z" fill="#151515"/>
<path d="M11.5 23.4545C5.14871 23.4545 0 29.0713 0 36H23C23 29.0713 17.8513 23.4545 11.5 23.4545Z" fill="#151515"/>
<path d="M21.0014 0C20.6072 0 20.2044 0.0342779 19.8017 0.119972C17.4365 0.574153 15.5512 2.48514 15.1056 4.8503C14.6943 7.08693 15.5169 9.1436 17.008 10.4719C17.3765 10.7975 17.5736 11.2517 17.5736 11.7316V13.7111C17.5736 14.6537 18.3449 15.425 19.2875 15.425H19.5274C19.8274 15.9392 20.3673 16.2819 21.0014 16.2819C21.6355 16.2819 22.184 15.9392 22.4753 15.425H22.7153C23.6579 15.425 24.4292 14.6537 24.4292 13.7111V11.7316C24.4292 11.2602 24.6177 10.7975 24.9776 10.4804C26.2202 9.38354 27 7.78105 27 5.99861C27 2.68224 24.3178 0 21.0014 0ZM22.7153 13.7111H19.2875V12.8542H22.7153V13.7111ZM22.7153 11.9972H19.2875V11.1403H22.7153V11.9972ZM21.4299 7.2069V9.42639H20.5729V7.2069L19.0047 5.64726L19.6131 5.03883L21.0014 6.42708L22.3896 5.03883L22.9981 5.64726L21.4299 7.2069Z" fill="#FF4FE3"/>
</svg>
