<svg width="36" height="44" viewBox="0 0 36 44" fill="none" xmlns="http://www.w3.org/2000/svg">
<path d="M29.7273 26.2273C29.7273 29.1142 27.3869 31.4545 24.5 31.4545C21.613 31.4545 19.2727 29.1142 19.2727 26.2273C19.2727 23.3403 21.613 21 24.5 21C27.3869 21 29.7273 23.3403 29.7273 26.2273Z" fill="#818181"/>
<path d="M24.5 31.4545C18.1487 31.4545 13 37.0713 13 44H36C36 37.0713 30.8513 31.4545 24.5 31.4545Z" fill="#818181"/>
<path d="M16.7273 26.2273C16.7273 29.1142 14.3869 31.4545 11.5 31.4545C8.61304 31.4545 6.27271 29.1142 6.27271 26.2273C6.27271 23.3403 8.61304 21 11.5 21C14.3869 21 16.7273 23.3403 16.7273 26.2273Z" fill="#151515"/>
<path d="M11.5 31.4545C5.14871 31.4545 0 37.0713 0 44H23C23 37.0713 17.8513 31.4545 11.5 31.4545Z" fill="#151515"/>
<path d="M17.899 2.60779C17.5042 2.56479 17.2 2.25037 17.2 1.88044C17.2 0.91944 16.0381 0.438169 15.3586 1.1177L13.8485 2.62775C13.2237 3.25259 13.2237 4.26565 13.8485 4.89049L15.3586 6.40054C16.0381 7.08007 17.2 6.5988 17.2 5.6378C17.2 5.25363 17.5072 4.97085 17.8468 5.02067C20.646 5.4313 22.8 7.84734 22.8 10.7591C22.8 11.4713 22.6715 12.157 22.4337 12.7865C22.2497 13.2738 22.3148 13.8568 22.7047 14.2467C23.255 14.7969 24.2193 14.7184 24.5456 13.9556C24.965 12.9752 25.2 11.8951 25.2 10.7591C25.2 6.53244 22.0062 3.05529 17.899 2.60779ZM16.8 15.8804C16.8 16.2646 16.4928 16.5474 16.1532 16.4976C13.354 16.0869 11.2 13.6709 11.2 10.7591C11.2 10.047 11.3285 9.36123 11.5663 8.73174C11.7503 8.2444 11.6852 7.66148 11.2953 7.27153C10.745 6.72132 9.78071 6.79979 9.4544 7.5626C9.03497 8.54308 8.8 9.62314 8.8 10.7591C8.8 14.9858 11.9938 18.4629 16.101 18.9104C16.4958 18.9535 16.8 19.2679 16.8 19.6378C16.8 20.5988 17.9619 21.0801 18.6414 20.4005L20.1515 18.8905C20.7763 18.2657 20.7763 17.2526 20.1515 16.6277L18.6414 15.1177C17.9619 14.4382 16.8 14.9194 16.8 15.8804Z" fill="#92B0FF" stroke="#92B0FF" stroke-width="0.4"/>
</svg>
