<svg width="43" height="38" viewBox="0 0 43 38" fill="none" xmlns="http://www.w3.org/2000/svg">
<path fill-rule="evenodd" clip-rule="evenodd" d="M13 0.759277C10.7909 0.759277 9 2.55014 9 4.75927V14.3889C9 16.598 10.7909 18.3889 13 18.3889H19.5622L10.889 36.0185L12.3931 36.7232L21.4131 18.3889H39C41.2091 18.3889 43 16.598 43 14.3889V4.75928C43 2.55014 41.2091 0.759277 39 0.759277H13ZM21.4131 18.3889L23.7453 13.6484L24.5852 15.2241C24.7437 15.6626 25.2199 15.8857 25.6488 15.7223C26.0777 15.5589 26.297 15.071 26.1385 14.6324L24.6059 11.1397C24.4474 10.7011 23.9712 10.478 23.5423 10.6414L19.6314 11.9567C19.2024 12.1201 18.9832 12.6081 19.1416 13.0466C19.3001 13.4852 19.7763 13.7082 20.2052 13.5449L22.2411 12.9437L19.5622 18.3889H21.4131Z" fill="#FFD335"/>
<path d="M16.7273 20.2273C16.7273 23.1142 14.3869 25.4545 11.5 25.4545C8.61304 25.4545 6.27271 23.1142 6.27271 20.2273C6.27271 17.3403 8.61304 15 11.5 15C14.3869 15 16.7273 17.3403 16.7273 20.2273Z" fill="#151515"/>
<path d="M11.5 25.4545C5.14871 25.4545 0 31.0713 0 38H23C23 31.0713 17.8513 25.4545 11.5 25.4545Z" fill="#151515"/>
</svg>
