<svg width="57" height="58" viewBox="0 0 57 58" fill="none" xmlns="http://www.w3.org/2000/svg">
<path fill-rule="evenodd" clip-rule="evenodd" d="M1.93008e-06 49.9997L49 0.999733L56.0711 8.0708L7.07107 57.0708L1.93008e-06 49.9997Z" fill="#151515"/>
<path fill-rule="evenodd" clip-rule="evenodd" d="M49 56.9998L0 7.99978L7.07107 0.928711L56.0711 49.9287L49 56.9998Z" fill="#151515"/>
</svg>
