<svg width="30" height="15" viewBox="0 0 30 15" fill="none" xmlns="http://www.w3.org/2000/svg">
<path fill-rule="evenodd" clip-rule="evenodd" d="M23.1136 0.298306L29.697 6.77983C30.101 7.17757 30.101 7.82243 29.697 8.22017L23.1136 14.7017C22.7096 15.0994 22.0546 15.0994 21.6506 14.7017C21.2466 14.304 21.2466 13.6591 21.6506 13.2614L26.4681 8.51847L-7.44709e-07 8.51847L-5.66633e-07 6.48153L26.4681 6.48153L21.6506 1.73865C21.2466 1.34091 21.2466 0.696045 21.6506 0.298306C22.0546 -0.0994328 22.7096 -0.0994327 23.1136 0.298306Z" fill="#151515"/>
</svg>
