<svg width="41" height="33" viewBox="0 0 41 33" fill="none" xmlns="http://www.w3.org/2000/svg">
<path d="M14.8642 30.4578C14.7563 30.868 14.6753 31.2836 14.6214 31.7046C14.5674 32.1256 14.5296 32.5574 14.508 33C13.1263 32.8381 11.8094 32.5142 10.5572 32.0285C9.30499 31.5427 8.14457 30.922 7.0759 30.1663C6.00723 29.4107 5.03571 28.5363 4.16134 27.5432C3.28697 26.55 2.54214 25.4706 1.92685 24.3047C1.31155 23.1389 0.836586 21.9082 0.501952 20.6129C0.167317 19.3175 0 17.9735 0 16.581C0 15.0589 0.194304 13.5908 0.582911 12.1766C0.971519 10.7625 1.52744 9.44014 2.25069 8.20952C2.97393 6.9789 3.8375 5.86163 4.8414 4.8577C5.84531 3.85378 6.96795 2.99019 8.20934 2.26693C9.45072 1.54367 10.7677 0.987733 12.1602 0.599117C13.5527 0.2105 15.0262 0.0107949 16.5806 0C18.1026 0 19.5653 0.194308 20.9686 0.582924C22.3719 0.971541 23.6943 1.53288 24.9357 2.26693C26.177 3.00098 27.2943 3.86457 28.2874 4.8577C29.2805 5.85083 30.1495 6.9735 30.8943 8.22571C31.6391 9.47792 32.1951 10.7949 32.5621 12.1766C32.9291 13.5584 33.1288 15.0265 33.1612 16.581H32.0116C31.8604 16.3327 31.7039 16.0898 31.542 15.8523C31.3801 15.6148 31.1912 15.3881 30.9753 15.1722C30.9105 14.2331 30.7432 13.3209 30.4733 12.4357H10.6381C10.5518 13.1266 10.487 13.8121 10.4438 14.4921C10.4007 15.1722 10.3737 15.8685 10.3629 16.581C10.3629 17.2826 10.3845 17.9735 10.4276 18.6536C10.4708 19.3337 10.541 20.0245 10.6381 20.7262H16.5806C16.5806 21.0716 16.6076 21.4171 16.6616 21.7625C16.7155 22.1079 16.7857 22.4534 16.872 22.7988H10.9944C11.1239 23.4141 11.2966 24.0888 11.5125 24.8229C11.7284 25.5569 11.9983 26.2748 12.3221 26.9764C12.6459 27.6781 13.0184 28.3366 13.4393 28.9519C13.8603 29.5672 14.3353 30.0692 14.8642 30.4578ZM29.6799 10.3631C29.2589 9.48871 28.7624 8.6683 28.1902 7.90186C27.6181 7.13543 26.9705 6.43376 26.2472 5.79686C25.524 5.15996 24.7575 4.59323 23.9479 4.09666C23.1383 3.6001 22.264 3.19529 21.3248 2.88224C21.7135 3.42198 22.0589 3.99411 22.3611 4.59863C22.6634 5.20314 22.9386 5.82385 23.1869 6.46075C23.4352 7.09764 23.6457 7.74534 23.8184 8.40383C23.9911 9.06232 24.1423 9.71541 24.2718 10.3631H29.6799ZM16.5806 2.07262C16.0409 2.07262 15.5443 2.21835 15.0909 2.50981C14.6376 2.80128 14.2166 3.18449 13.828 3.65947C13.4393 4.13445 13.0939 4.66879 12.7917 5.26251C12.4894 5.85623 12.2142 6.46614 11.9659 7.09225C11.7176 7.71835 11.5179 8.31207 11.3668 8.87341C11.2156 9.43474 11.0915 9.9313 10.9944 10.3631H22.1668C22.0805 9.9421 21.9563 9.44553 21.7944 8.87341C21.6325 8.30128 21.4328 7.70756 21.1953 7.09225C20.9578 6.47694 20.688 5.87242 20.3857 5.2787C20.0835 4.68499 19.738 4.14524 19.3494 3.65947C18.9608 3.1737 18.5344 2.79048 18.0703 2.50981C17.6061 2.22915 17.1095 2.08342 16.5806 2.07262ZM11.8525 2.86605C10.935 3.1791 10.0606 3.57851 9.22943 4.06428C8.39824 4.55005 7.62642 5.11678 6.91398 5.76447C6.20153 6.41217 5.55385 7.11923 4.97094 7.88567C4.38803 8.65211 3.89147 9.47792 3.48128 10.3631H8.8894C9.00814 9.76938 9.15387 9.13788 9.32658 8.4686C9.4993 7.79931 9.71519 7.13003 9.97426 6.46075C10.2333 5.79146 10.514 5.14917 10.8162 4.53386C11.1185 3.91855 11.4639 3.36261 11.8525 2.86605ZM2.07257 16.581C2.07257 18.0167 2.27228 19.3984 2.67168 20.7262H8.54937C8.46301 20.0353 8.39824 19.3499 8.35506 18.6698C8.31189 17.9897 8.2903 17.2934 8.2903 16.581C8.2903 15.8793 8.31189 15.1884 8.35506 14.5083C8.39824 13.8283 8.46301 13.1374 8.54937 12.4357H2.67168C2.27228 13.7635 2.07257 15.1452 2.07257 16.581ZM3.44889 22.7988C3.86988 23.6732 4.36644 24.4936 4.93856 25.2601C5.51067 26.0265 6.15835 26.7336 6.88159 27.3813C7.60484 28.0289 8.38205 28.5903 9.21324 29.0653C10.0444 29.5402 10.9188 29.945 11.8363 30.2797C11.4477 29.7399 11.1023 29.1678 10.8001 28.5633C10.4978 27.9588 10.2225 27.3381 9.97426 26.7012C9.72599 26.0643 9.51549 25.4166 9.34278 24.7581C9.17006 24.0996 9.01354 23.4465 8.87321 22.7988H3.44889Z" fill="#0ABDE4"/>
<circle cx="16.1085" cy="16.5743" r="4.75599" fill="#151515"/>
<path d="M16.1082 21.3306C10.3295 21.3306 5.64502 26.441 5.64502 32.7449H26.5714C26.5714 26.441 21.8868 21.3306 16.1082 21.3306Z" fill="#151515"/>
<circle cx="30.2845" cy="16.5743" r="4.75599" fill="#151515"/>
<path d="M30.2842 21.3306C24.5056 21.3306 19.821 26.441 19.821 32.7449H40.7474C40.7474 26.441 36.0629 21.3306 30.2842 21.3306Z" fill="#151515"/>
</svg>
