<svg width="33" height="33" viewBox="0 0 33 33" fill="none" xmlns="http://www.w3.org/2000/svg">
<path fill-rule="evenodd" clip-rule="evenodd" d="M29.5 0.759277V16.8593H33V20.3093C33 22.2183 31.4367 23.7593 29.5 23.7593H15.5C13.5633 23.7593 12 22.2183 12 20.3093V0.759277H29.5ZM15.5 21.4593C14.8583 21.4593 14.3333 20.9418 14.3333 20.3093V4.20928H27.1667V16.8593H16.6667V20.3093C16.6667 20.9418 16.1417 21.4593 15.5 21.4593Z" fill="#287DFD"/>
<path d="M26 9.95928H19V12.2593H26V9.95928Z" fill="#287DFD"/>
<path d="M17.8333 9.95928H15.5V12.2593H17.8333V9.95928Z" fill="#287DFD"/>
<path d="M17.8333 6.50928H15.5V8.80928H17.8333V6.50928Z" fill="#287DFD"/>
<path d="M26 6.50928H19V8.80928H26V6.50928Z" fill="#287DFD"/>
<path d="M16.7273 15.2273C16.7273 18.1142 14.3869 20.4545 11.5 20.4545C8.61304 20.4545 6.27271 18.1142 6.27271 15.2273C6.27271 12.3403 8.61304 10 11.5 10C14.3869 10 16.7273 12.3403 16.7273 15.2273Z" fill="#151515"/>
<path d="M11.5 20.4545C5.14871 20.4545 0 26.0713 0 33H23C23 26.0713 17.8513 20.4545 11.5 20.4545Z" fill="#151515"/>
</svg>
