{
  "self": "https://nosad.se/api/events/event-nosad-20220503",
  "title": "Mer datadriven utveckling genom den nationella datastrategin och europeiska dataområden",
  "date": "2022-05-03",
  "description": "Nu finns tillfälle att förstå det strategiska landskapet för ökad delning och nytta av data och varför man pratar om data som en strategisk resurs. Välkommen att diskutera med EU kommissionen, infrastrukturdepartementet och projektledarna för de olika regeringsuppdrag som ingår i den nationella datastrategin.",
  "recording": "https://data.jobtechdev.se/videos/nosad-20220503-datadriven-utveckling-nationella-datastrategin-europeiska-dataomraden_2256x1444.mp4",
  "presentations": [{
      "id": "https://nosad.se/api/events/event-nosad-20220503/presentation/1",
      "material": {
        "title": "Agenda",
        "source": "https://gitlab.com/open-data-knowledge-sharing/wiki/-/wikis/uploads/5c65cee8c073def6846f7f25d997450e/NOSAD_3_maj.pptx"
      },
      "person": {
        "id": "",
        "namn": "Maria"
      }
    },
    {
      "id": "https://nosad.se/api/events/event-nosad-20220503/presentation/2",
      "material": {
        "title": "Kompetensförsörjning och livslång lärande",
        "source": "https://gitlab.com/open-data-knowledge-sharing/wiki/-/wikis/uploads/46717745ba8735d7aeba7c35e9491598/3_maj_RU_KLL.pptx"
      },
      "person": {
        "id": "https://www.wikidata.org/wiki/Q114314849",
        "namn": "Erik"
      }
    },
    {
      "id": "https://nosad.se/api/events/event-nosad-20220503/presentation/3",
      "material": {
        "title": "Nationellt rymddatalabb-fas II",
        "source": "https://gitlab.com/open-data-knowledge-sharing/wiki/-/wikis/uploads/f32da15b0948ecd1ed19af3460f5e0a9/Nationellt_rymddatalabb_-fas_II_NOSAD.pptx"
      },
      "person": {
        "id": "",
        "namn": "Tobias"
      }
    },
    {
      "id": "https://nosad.se/api/events/event-nosad-20220503/presentation/4",
      "material": {
        "title": "Data för smart statistik",
        "source": "https://gitlab.com/open-data-knowledge-sharing/wiki/-/wikis/uploads/5c6c06bb9b8ae5ea9fe37f3739b1552a/Data_f%C3%B6r_smart_statistik_NOSAD_2022-05-03.pptx"
      },
      "person": {
        "id": "",
        "namn": "Marie"
      }
    }
  ]
}
