{
  "about": "Mjao",
  "openapi": "3.0.3",
  "info": {
    "version": "1.0.0",
    "title": "Annotation exempel api",
    "description": "Annotation exempel api är ett påhittat api som använder sig av annotations för att skapa metadata för DCAT-AP-SE.",
    "x-dcat": {
      "dcat-dataset": {
        "about": "https://www.example.se/#datasetYrkebenämningar",
        "title-sv": "Yrkesbenämningar",
        "title-en": "Occupations", 
        "title": "Occupations",       
        "description-sv": "Datamängden innehåller yrkesbenämningar utan några kopplingar till andra concept. Yrkesbenämningarna i datamängden är skapade och uppdateras kontinuerligt i samråd med aktörerna på arbetsmarknaden. De är kategoriserade enligt SSYK, Svensk standard för yrkesklassificering som bygger på den internationella yrkesklassificeringen ISCO, International Standard Classification of Occupation. Den nuvarande versionen är SSYK-2012.",        
        "description-en": "The dataset contains occupations without any connections to other concepts. Occupations in the data set are created and continuously updated in consultation with stakeholders in the labor market. They are categorized according to SSYK, Swedish Standard Classification of Occupations, which is based on ISCO, the International Standard Classification of Occupation. The current version is SSYK 2012.", 
              
        "contactPoint": {
          "about": "https://www.example.se/#contactYrkesbenämningar",
          "name": "Arbetsförmedlingen",
          "type": "Organization",
          "email": "opendata@arbetsformedlingen.se",
          "address": "Elektrogatan 4; 171 54; Solna; Sverige"          
        },
        "keyword-sv": "Taxonomi, Yrke, SSYK, Arbetsmarknad, Matchning",
        "keyword-en": "Occupation",   
        "theme": "GOVE",        
        "spatialUrl": "https://www.geonames.org/6695072/european-union.html",        
        "landingPage": "atlas.jobtechdev.se",
        "accrualPeriodicity":"http://publications.europa.eu/resource/authority/frequency/MONTHLY", 
        "licenseurl": "http://creativecommons.org/publicdomain/zero/1.0/",                       
              
        "accessRights": "Public",        
       
        "distribution": {
          "about": "https://www.example.se/#distributionYrkesbenämningar",
          "title-sv": "Yrkesbenämningar",
          "title-en" : "Occupations",
          "title" : "Occupations",       
          "description-sv": "Datamängden innehåller yrkesbenämningar utan några kopplingar till andra concept.",
          "description-en":"The dataset contains occupations without any connections to other concepts.",
          "accessURL": "https://data.arbetsformedlingen.se/taxonomy/Yrkesbenämningar/Yrkesbenämningar.json",
          "downloadURL": "https://data.arbetsformedlingen.se/taxonomy/Yrkesbenämningar/Yrkesbenämningar.json",
          "formatMedia": "application/json",  
          "status": "Completed",
          "availability": "Stable",
          "licenseurl": "http://creativecommons.org/publicdomain/zero/1.0/"
          
        }
      }
      
    }
  },
  "paths": {
    "/users": {
      "get": {
        "description": "Fake API description. Only in this file to show where the rest of the api definition would be located.",
        "responses": {
          "200": {
            "description": "Fake 200 response"
          }
        }
      }
    }
  }
}
