{
    "title-sv": "Hackingfilm",
    "description-sv": "Tisdagshacking sker",
    "issued": "2021-03-05",
    "distribution": {
        "accessURL": "https://data-develop.jobtechdev.se/videos/calamari-hacking-part001.mkv",
        "downloadURL": "https://data-develop.jobtechdev.se/videos/calamari-hacking-part001.mkv"
    }
}
