{
  "Z38Q_kQS_W8a": [
    "http://data.europa.eu/esco/skill/1a080b07-406e-4a2e-b316-fc766f2e6e2d"
  ],
  "tYmW_Y78_yBt": [
    "http://data.europa.eu/esco/skill/6430eb0d-c6de-46b7-a7fc-3dd2e8e62a69"
  ],
  "v5gC_68g_J2R": [
    "http://data.europa.eu/esco/skill/9b04cd15-b9c4-442d-9bbb-32e1b2058dca"
  ],
  "Fr8Z_SVz_1Gf": [
    "http://data.europa.eu/esco/skill/ac6e266a-5362-4690-8937-b71a2d9311d1"
  ],
  "m5yx_wHx_kVR": [
    "http://data.europa.eu/esco/skill/eed2447e-13a2-4583-9066-cdb38d90c808"
  ],
  "M6Q7_tQ8_w2Q": [
    "http://data.europa.eu/esco/skill/c0ccbd15-36f3-4515-ae0b-b4062d225ee2"
  ],
  "qjsN_zZ2_KwE": [
    "http://data.europa.eu/esco/skill/a9c1a772-8ef6-4dd7-93a4-c6bbf3293688"
  ],
  "qXBs_ALp_yFY": [
    "http://data.europa.eu/esco/skill/daefc625-d439-4602-9009-de6a0ae34774"
  ],
  "dpBU_3E1_JAx": [
    "http://data.europa.eu/esco/skill/0ad6d5e8-593f-4191-843c-439b23a468ca"
  ],
  "5AC4_y1Q_qLq": [
    "http://data.europa.eu/esco/skill/13d96098-2ff0-46b8-b326-b7c0e18cc1f1"
  ],
  "Fc9g_7KS_Rw7": [
    "http://data.europa.eu/esco/skill/844f46e1-1fe3-4975-a788-54d2b36ed0af"
  ],
  "q7yb_wcm_uFb": [
    "http://data.europa.eu/esco/skill/d8567009-7c6f-43fb-82fb-7154ed8ebca9"
  ],
  "QsnC_qc3_pxb": [
    "http://data.europa.eu/esco/skill/9f644d04-ab55-4881-a592-aeecda9c4874"
  ],
  "c2YE_oK3_f1u": [
    "http://data.europa.eu/esco/skill/9b9662e0-100a-4314-9bdc-8146a7105c3d"
  ],
  "GLUa_Sxn_Uqx": [
    "http://data.europa.eu/esco/skill/7234e847-451d-499a-9c7b-0050a4e758d6"
  ],
  "sGky_Wqy_QvZ": [
    "http://data.europa.eu/esco/skill/e54ff029-1ce9-447d-a5b2-eb7283a23e6e"
  ],
  "tYTv_fLA_EV5": [
    "http://data.europa.eu/esco/skill/db0ff520-6ee1-420d-b9a3-3487cdb00e7c"
  ],
  "z3Ln_9aJ_DqN": [
    "http://data.europa.eu/esco/skill/300d432b-f457-4cd3-9cb1-1858c7d14954"
  ],
  "LLQd_jDh_gdd": [
    "http://data.europa.eu/esco/skill/3c03ee71-4a23-448f-b79e-81fd75d27dca"
  ],
  "9G4J_YEw_Uis": [
    "http://data.europa.eu/esco/skill/f414dc08-35bd-4bc7-846d-88a3844d057c"
  ],
  "GchS_5vD_Zr5": [
    "http://data.europa.eu/esco/skill/9263f0d8-7266-4782-b0ee-38f62656e97e"
  ],
  "YsdN_Q9t_kTY": [
    "http://data.europa.eu/esco/skill/affb720b-98e7-4ae6-b833-b12e94fa8987"
  ],
  "SpRR_JX9_6o6": [
    "http://data.europa.eu/esco/skill/a006ac4c-3585-43e9-ac1d-a89b80d28e1d"
  ],
  "DLBo_TAb_Qet": [
    "http://data.europa.eu/esco/skill/7d5ff73e-7bea-436d-974f-3a51ce24a138"
  ],
  "eBgZ_cwn_FN8": [
    "http://data.europa.eu/esco/skill/966f2fd3-3de6-42da-b87c-da924c6d7960"
  ],
  "avP6_rGH_Fgc": [
    "http://data.europa.eu/esco/skill/24554d47-70d2-4153-bb27-84e338e76792"
  ],
  "egj8_qhY_1bN": [
    "http://data.europa.eu/esco/skill/e46291c7-52b9-4174-bd59-178884861038"
  ],
  "zCai_NdW_3qn": [
    "http://data.europa.eu/esco/skill/6074be26-466d-4df7-b845-4c44157a2529"
  ],
  "gjd2_JSR_AeG": [
    "http://data.europa.eu/esco/skill/725d9429-3c9d-4484-8a42-27a7367c0519"
  ],
  "XZs8_QZL_VwL": [
    "http://data.europa.eu/esco/skill/3af687cb-8c7a-46ea-a730-32dbaed040c6"
  ],
  "bVFo_qRN_cKd": [
    "http://data.europa.eu/esco/skill/2fb96d29-7d8a-455a-b54a-1f67757751c7"
  ],
  "3Z9i_jNu_wnT": [
    "http://data.europa.eu/esco/skill/6d1532b4-b649-4089-b665-cf80debf159b"
  ],
  "m4ij_Bjw_6ik": [
    "http://data.europa.eu/esco/skill/5dbbeadb-45a7-404b-ba3c-eeaa045c4e64"
  ],
  "8tYq_EXD_Xwm": [
    "http://data.europa.eu/esco/skill/3c8c9fe5-bbc6-4a0b-8cf2-a839aeef585c"
  ],
  "dwm2_1V3_MpP": [
    "http://data.europa.eu/esco/skill/e8dd9cc1-c83d-45ec-a7b0-e3727ab90336"
  ],
  "JxuB_Xi5_Yqw": [
    "http://data.europa.eu/esco/skill/38828bb5-f321-4523-af5f-d404cb7a0a24"
  ],
  "TFQD_onf_Tid": [
    "http://data.europa.eu/esco/skill/db36f7f1-5900-45bd-9ffb-f2b19c4362ac"
  ],
  "4diN_yo6_SHM": [
    "http://data.europa.eu/esco/skill/0037c821-2898-4919-b96e-7ed1cd89554c"
  ],
  "nVax_pj9_CrG": [
    "http://data.europa.eu/esco/skill/8ca08a35-2d2e-46f5-b440-8fc8ce736287"
  ],
  "WyA4_g1g_jS4": [
    "http://data.europa.eu/esco/skill/6e66e6ad-348c-46de-97d8-7cca68940ee4"
  ],
  "YYdi_Fqb_834": [
    "http://data.europa.eu/esco/skill/b09df20a-51b9-438d-9745-696b02156470"
  ],
  "X4EU_ZC7_QmK": [
    "http://data.europa.eu/esco/skill/47d2f266-aaf2-4852-9c66-607e76b1fa8b"
  ],
  "fAqU_cCM_mJz": [
    "http://data.europa.eu/esco/skill/76731933-dad3-4053-aba3-d3ed6160b580"
  ],
  "uwX1_vsc_ERP": [
    "http://data.europa.eu/esco/skill/f8d4a24c-fb62-444e-9525-7aa5662f440d"
  ],
  "HHvf_bfE_wK9": [
    "http://data.europa.eu/esco/skill/40164510-2450-48a3-b31e-1a04db2bfde0"
  ],
  "854B_a1L_phG": [
    "http://data.europa.eu/esco/skill/1acf32e9-3cc6-4b3d-9d02-7cdf307743c3"
  ],
  "mb59_QW5_Ho2": [
    "http://data.europa.eu/esco/skill/274ba318-ab30-4d16-87fd-58af75cd6a22"
  ],
  "SZh8_D7y_Gqy": [
    "http://data.europa.eu/esco/skill/b8af36ab-f4ec-425b-8263-2a12ab3f4e51"
  ],
  "ZuMC_5GQ_9jw": [
    "http://data.europa.eu/esco/skill/a8c14569-704d-4615-bfb3-b1ecfd721bb3"
  ],
  "oaiv_GsB_AFK": [
    "http://data.europa.eu/esco/skill/b34e2ba1-9080-48c9-9b42-ee9192a4d3f1"
  ],
  "9i47_8CB_jBe": [
    "http://data.europa.eu/esco/skill/99c90174-eb03-4221-b1b6-1ad8b7035e15"
  ],
  "cZe5_zc1_v8j": [
    "http://data.europa.eu/esco/skill/172020d1-e151-445b-8173-e2a5fb16fe51"
  ],
  "kW8G_uc8_Mqm": [
    "http://data.europa.eu/esco/skill/338c6957-d0c7-49dd-8cdc-42e8d2921781"
  ],
  "NfDv_1zP_NsD": [
    "http://data.europa.eu/esco/skill/5da42cfd-1da8-4e4f-b68e-4f821d005fc5"
  ],
  "91Ef_58Y_jX4": [
    "http://data.europa.eu/esco/skill/7903f946-aeff-4024-b146-8e48018d4eb9"
  ],
  "5Gmv_EZs_BPe": [
    "http://data.europa.eu/esco/skill/2b92a5b2-6758-4ee3-9fb4-b6387a55cc8f"
  ],
  "N4Jk_Sz1_n9Z": [
    "http://data.europa.eu/esco/skill/c7282ec3-9153-4b4b-b7de-777e3207b04e"
  ],
  "i9fn_XPE_R1K": [
    "http://data.europa.eu/esco/skill/7655b81b-0fff-4c04-927a-25c6662d31a8"
  ],
  "moSc_5RL_aYx": [
    "http://data.europa.eu/esco/skill/6c2182f9-9068-42e8-8855-31252d62fbb0"
  ],
  "f8Sz_Xaf_TEU": [
    "http://data.europa.eu/esco/skill/2f5846c1-1271-44aa-9cd8-4a99cb74cc8f"
  ],
  "E8uW_GK1_AQi": [
    "http://data.europa.eu/esco/skill/945b8655-5577-4c3a-946a-842d4527afa8"
  ],
  "Dddv_JRP_MMh": [
    "http://data.europa.eu/esco/skill/a28b6c54-f452-41e6-b5b2-60fd6244310e"
  ],
  "6md5_wPp_d4S": [
    "http://data.europa.eu/esco/skill/c669c40c-d8dc-4eff-8e06-7043ff4a860c"
  ],
  "Z62p_8do_ctd": [
    "http://data.europa.eu/esco/skill/b115cabc-c030-45b2-ac8e-922d45716183"
  ],
  "BKRi_T8q_VUy": [
    "http://data.europa.eu/esco/skill/1de3942b-99d8-41e8-9ef0-fbc9e9f6307b"
  ],
  "eox4_5Lc_W7C": [
    "http://data.europa.eu/esco/skill/384ed14c-bf1f-4a65-aef6-6e711f43c4ce"
  ],
  "UiN1_VDs_An3": [
    "http://data.europa.eu/esco/skill/7c455b13-bc86-40bc-bedb-4f7c35e685b4"
  ],
  "Leez_v3g_kU1": [
    "http://data.europa.eu/esco/skill/143769cb-b61e-47d8-a61e-eedfbec1016c"
  ],
  "8GzZ_PU4_1oC": [
    "http://data.europa.eu/esco/skill/ae04aae5-968e-4b05-ae3a-a38d61964528"
  ],
  "BkCz_fjg_Am7": [
    "http://data.europa.eu/esco/skill/f8413360-6114-40de-a276-c59b764b9913"
  ],
  "xxeG_XxB_sqG": [
    "http://data.europa.eu/esco/skill/1236128d-9bb4-4d94-bc1e-40fd14824280"
  ],
  "FjqL_Fvy_iwc": [
    "http://data.europa.eu/esco/skill/b324bb7c-ad3e-4bca-9003-f5ebc5afa74f"
  ],
  "nfdN_dwW_6PE": [
    "http://data.europa.eu/esco/skill/29312151-0805-41c8-a111-0109a7e932f0"
  ],
  "9uX1_5vL_LR3": [
    "http://data.europa.eu/esco/skill/2ac4ff3f-ac25-4db4-9c7d-c1715f0f5920"
  ],
  "MXh6_9Aj_u7j": [
    "http://data.europa.eu/esco/skill/40164510-2450-48a3-b31e-1a04db2bfde0"
  ],
  "2RRg_yhu_5u7": [
    "http://data.europa.eu/esco/skill/60fb1a08-82d0-4d96-a176-9ad68bf74761"
  ],
  "ad5t_3Go_CeS": [
    "http://data.europa.eu/esco/skill/506ed653-1dce-4f69-a692-d67d4a66fac7"
  ],
  "Uebh_9f1_YJy": [
    "http://data.europa.eu/esco/skill/4c5d616e-f6d8-4fb4-8ce6-89a4b048b916"
  ],
  "yZLc_azr_4mL": [
    "http://data.europa.eu/esco/skill/895564f3-951b-4e89-b136-72f5bc7988bb"
  ],
  "E13X_ZF3_PAb": [
    "http://data.europa.eu/esco/skill/c0a7e5ca-8be0-4fb2-89e2-4be65d53b119"
  ],
  "EUFp_soZ_qMe": [
    "http://data.europa.eu/esco/skill/52845dce-98ba-48b5-8abc-09a2c580be28"
  ],
  "XF7L_iJZ_C2W": [
    "http://data.europa.eu/esco/skill/1bfeddc8-44be-4559-af64-2b2d41ceae65"
  ],
  "Vjui_Ghy_zA9": [
    "http://data.europa.eu/esco/skill/c42a92b2-a802-4cf6-a645-3904004bbdbe"
  ],
  "myz9_nz9_hTL": [
    "http://data.europa.eu/esco/skill/0dcea846-04b4-4ffc-8c75-a35c991454b1"
  ],
  "AwhJ_eLD_xpG": [
    "http://data.europa.eu/esco/skill/d6e800ae-bbbb-453f-8ac6-19973a8ecea9"
  ],
  "E25i_PEi_rQh": [
    "http://data.europa.eu/esco/skill/cc94f454-56d1-41b9-a82e-2aed9ed4f72e"
  ],
  "xShN_Vkr_s7D": [
    "http://data.europa.eu/esco/skill/14b4a40e-da80-452a-86d6-88a959052219"
  ],
  "H3Kv_rjA_mhk": [
    "http://data.europa.eu/esco/skill/47e349cb-b0a8-4877-b368-c30a2ee4668b"
  ],
  "9zje_a2z_uzX": [
    "http://data.europa.eu/esco/skill/ab0bc977-8b71-48f7-bfcc-a8f92ec03e34"
  ],
  "BC1U_Xti_GK9": [
    "http://data.europa.eu/esco/skill/e3423f86-0e6b-4bec-a354-1d21fe8597b6"
  ],
  "NxXp_SSf_Vaa": [
    "http://data.europa.eu/esco/skill/7c455b13-bc86-40bc-bedb-4f7c35e685b4"
  ],
  "nRHk_Nkv_zqk": [
    "http://data.europa.eu/esco/skill/8a9e00a5-b795-4cde-b744-ec2f2ce4ed88"
  ],
  "B4fG_pK5_84H": [
    "http://data.europa.eu/esco/skill/8acf5d5e-2ba1-4880-adf5-61746253ec44"
  ],
  "2qWx_WKP_XYH": [
    "http://data.europa.eu/esco/skill/c6c37f68-190e-4482-905c-93007a64ed61"
  ],
  "8KkD_r8p_w2M": [
    "http://data.europa.eu/esco/skill/962cac82-4172-4676-b9e1-5955d0e46a8f"
  ],
  "uGJt_4qS_3RF": [
    "http://data.europa.eu/esco/skill/d915420b-3083-4740-b196-32749111069e"
  ],
  "irju_S7Y_Xbr": [
    "http://data.europa.eu/esco/skill/f7464f30-662b-4177-85a0-3df9693e9e58"
  ],
  "yuRa_gmr_9J6": [
    "http://data.europa.eu/esco/skill/758ddaf4-c2c0-4681-8724-d685de5ace17"
  ],
  "eA4L_AMV_QZg": [
    "http://data.europa.eu/esco/skill/43032597-223c-4559-bdf9-abf0a312839a"
  ],
  "EuVK_o4G_CkD": [
    "http://data.europa.eu/esco/skill/e043aeeb-78f5-4049-afbf-12bba52225bc"
  ],
  "EHzQ_qjx_TGL": [
    "http://data.europa.eu/esco/skill/190be8c6-69a6-4aff-8320-473aee68d4c8"
  ],
  "h65W_AEU_vjL": [
    "http://data.europa.eu/esco/skill/6f4ea676-cb82-428f-949b-629747a34366"
  ],
  "i9ha_brW_zLJ": [
    "http://data.europa.eu/esco/skill/f88d8667-d476-43bb-980f-2dbd01ae00cf"
  ],
  "C334_qvU_FEA": [
    "http://data.europa.eu/esco/skill/112a2d79-fff0-4b9b-92e9-7fe40cd6104b"
  ],
  "LMx4_LbA_vxB": [
    "http://data.europa.eu/esco/skill/cf4a497e-7e4d-4dc8-9f06-31234b1510fb"
  ],
  "GQ9E_49a_gD8": [
    "http://data.europa.eu/esco/skill/50e313a8-01fc-48a0-9270-f25102adb8bc"
  ],
  "qwHa_w4A_tTc": [
    "http://data.europa.eu/esco/skill/4327690a-e639-4b58-98b5-d078d6b90b07"
  ],
  "QB7Z_7mE_fx2": [
    "http://data.europa.eu/esco/skill/9f1bd2a4-91af-4b60-aeb3-0fe1f4434966"
  ],
  "j13L_B4B_Ucu": [
    "http://data.europa.eu/esco/skill/e439742d-558d-4f52-885e-afdc740b48cf"
  ],
  "hU3K_vj2_1tK": [
    "http://data.europa.eu/esco/skill/3f4dab51-572b-4e2c-85ef-3b4c3f7094e1"
  ],
  "faxn_t27_sGY": [
    "http://data.europa.eu/esco/skill/7e1f9657-ab4e-407c-842f-b846197060e3"
  ],
  "EcuE_BY7_mc4": [
    "http://data.europa.eu/esco/skill/3982571a-e9ce-442a-a4a0-fdfc97727091"
  ],
  "csA4_uVB_N8C": [
    "http://data.europa.eu/esco/skill/b52d040e-0f04-4ba5-8d1c-71db7dd7e8a6"
  ],
  "xAbn_Wt7_ySS": [
    "http://data.europa.eu/esco/skill/02e235f4-a30a-412a-a06e-1c471ad28678"
  ],
  "pTEm_Nhr_fFq": [
    "http://data.europa.eu/esco/skill/0ee94af1-b445-4973-9c3f-459fab250342"
  ],
  "Fo6h_Y3m_zJe": [
    "http://data.europa.eu/esco/skill/d5c6e438-2e6d-4919-8f1b-17cf93080b4b"
  ],
  "xPKu_a6v_Yuo": [
    "http://data.europa.eu/esco/skill/b7b1d2aa-c489-41c2-9fe3-9b237c0a79c3"
  ],
  "DBn6_6G2_316": [
    "http://data.europa.eu/esco/skill/3a5b7435-c262-4a9d-893d-ee6c19bd9d92"
  ],
  "oR43_qGa_kwk": [
    "http://data.europa.eu/esco/skill/a6aa15be-1d6b-4361-9eaf-bb6be5eb6f10"
  ],
  "C69V_W4p_i5E": [
    "http://data.europa.eu/esco/skill/6b3afb82-c4ea-4f14-be54-a757fb762663"
  ],
  "3qke_qKV_BMk": [
    "http://data.europa.eu/esco/skill/62c7900c-bc78-469e-9011-cec20a93e555"
  ],
  "83VF_fdF_VXp": [
    "http://data.europa.eu/esco/skill/f1ac5772-5f0b-4a8d-9a78-b623c3cbc0a2"
  ],
  "o6h8_hBG_QHm": [
    "http://data.europa.eu/esco/skill/04e52ec7-5107-455b-a943-8004015d5b26"
  ],
  "2RDK_rgU_P6R": [
    "http://data.europa.eu/esco/skill/7e305865-5b6d-4225-a4f7-ee5c10aaa134"
  ],
  "7Zdv_HXJ_6Dg": [
    "http://data.europa.eu/esco/skill/4ce4dd33-7429-4e65-a055-6e46a34cb19b"
  ],
  "fksd_G23_wke": [
    "http://data.europa.eu/esco/skill/a4d46d86-9de5-4734-881c-5b2059b9fccf"
  ],
  "WsSF_NZT_sNQ": [
    "http://data.europa.eu/esco/skill/d32db06e-bd06-4415-a7ab-1b0ee68caa9a"
  ],
  "2wd8_VUk_YSq": [
    "http://data.europa.eu/esco/skill/31c83903-8fc8-4bd8-9ca4-7a98a9c31eae"
  ],
  "LzrR_Kpb_s64": [
    "http://data.europa.eu/esco/skill/c3a9d357-2279-4d9d-92e2-e4280b8a61c6"
  ],
  "4y7C_Lsh_EPM": [
    "http://data.europa.eu/esco/skill/d83cba15-8511-4d07-b89a-9fde0d1d8241"
  ],
  "Xuhg_PcG_kq2": [
    "http://data.europa.eu/esco/skill/fa7be6bf-f906-4b8e-857d-48a9a7da901c"
  ],
  "XQet_5J6_HGj": [
    "http://data.europa.eu/esco/skill/048affec-04db-4bd5-b7a6-c666d16c0fef"
  ],
  "MXGG_RL9_ZPB": [
    "http://data.europa.eu/esco/skill/3d913cd3-4ba3-4be9-8b35-4ad0de5ccb60"
  ],
  "eGDx_hg4_CTe": [
    "http://data.europa.eu/esco/skill/0cd6dcf1-5778-42a5-b685-4d01ae4a4871"
  ],
  "ganz_mXo_NCv": [
    "http://data.europa.eu/esco/skill/3659c733-e366-4a2f-86c6-304ab01481cc"
  ],
  "EK82_anj_cWV": [
    "http://data.europa.eu/esco/skill/e8bae3fe-6d8d-457e-a20b-6f8eea4d5402"
  ],
  "qukw_pxR_7qM": [
    "http://data.europa.eu/esco/skill/03d988af-2e63-4151-bb5e-950f366e2c64"
  ],
  "pQbF_zp2_3so": [
    "http://data.europa.eu/esco/skill/9ec3d3ec-14b4-4def-906d-41823355df0a"
  ],
  "KEdX_Wjn_XHn": [
    "http://data.europa.eu/esco/skill/0fad7d54-a1ac-412e-84d5-3740ba5cb7a1"
  ],
  "26DW_RVn_42Q": [
    "http://data.europa.eu/esco/skill/705ec490-d4e8-4792-a230-82182f53d14a"
  ],
  "KR1C_w1G_BYY": [
    "http://data.europa.eu/esco/skill/eba6af23-2bab-4201-bcff-2332274fca87"
  ],
  "nVJB_JB5_rr5": [
    "http://data.europa.eu/esco/skill/4b244020-5f28-4e20-b74f-1c2dcb6f15cb"
  ],
  "qtGi_73q_Fem": [
    "http://data.europa.eu/esco/skill/ec4de8aa-9ba4-412b-832d-93361210eae3"
  ],
  "5yDE_FiQ_bMn": [
    "http://data.europa.eu/esco/skill/5330b70e-16f5-43a7-a6de-18fd6a4bd063"
  ],
  "Ggo3_fkg_smB": [
    "http://data.europa.eu/esco/skill/1bcc8d7a-c875-4c6b-829a-5d3f5098802a"
  ],
  "Bh9h_t3B_M8h": [
    "http://data.europa.eu/esco/skill/0415142d-6921-4f8d-832b-6271382b8193"
  ],
  "QnvA_akR_Rd7": [
    "http://data.europa.eu/esco/skill/0a244ad8-4aa0-4ae5-9f7d-f11931028687"
  ],
  "YHb7_uwj_7NG": [
    "http://data.europa.eu/esco/skill/142f3f7f-f15f-412e-a5fe-f75755b5dbe0"
  ],
  "G117_cFe_ufg": [
    "http://data.europa.eu/esco/skill/4e09e2d2-e317-47d2-bf5e-1d6c66be3efc"
  ],
  "GeeT_jCR_c55": [
    "http://data.europa.eu/esco/skill/78cce04d-1a0d-455e-ae52-b4d5715a3e8e"
  ],
  "jv2V_UoY_8XH": [
    "http://data.europa.eu/esco/skill/30281a0e-a82a-4d13-bd74-4b0fd9964e02"
  ],
  "qgx7_uNq_F3m": [
    "http://data.europa.eu/esco/skill/fef20fea-bb6d-4423-9b19-c28e225081a8"
  ],
  "yMp7_AwC_zqx": [
    "http://data.europa.eu/esco/skill/d86babea-bf8b-4552-81a8-daf706066ad6"
  ],
  "3Sj1_uuL_y1A": [
    "http://data.europa.eu/esco/skill/b13e0689-636d-42d0-86c3-df9d6f85a882"
  ],
  "nea3_HCX_9xn": [
    "http://data.europa.eu/esco/skill/2bd1b194-6700-4e60-b769-83d439475c55"
  ],
  "i4NX_CUm_hgF": [
    "http://data.europa.eu/esco/skill/4f992952-f3ea-473b-9562-183194966704"
  ],
  "7eJ1_N62_5VZ": [
    "http://data.europa.eu/esco/skill/5bdb8e03-04ab-4869-a48f-3b013b5a2c3c"
  ],
  "SEKb_8gv_cAz": [
    "http://data.europa.eu/esco/skill/ed07ed44-969f-4942-84ae-77283f53f99b"
  ],
  "wZpC_X9a_xzG": [
    "http://data.europa.eu/esco/skill/a181e89d-44ae-40e7-8d37-177071237c74"
  ],
  "ph2f_wuM_ae1": [
    "http://data.europa.eu/esco/skill/bc54eee1-a858-4f80-afdc-0442a617ef50"
  ],
  "CCfU_AZc_PLk": [
    "http://data.europa.eu/esco/skill/2708b88d-e849-48a5-a2b7-50b79d91b675"
  ],
  "rftJ_MnF_teZ": [
    "http://data.europa.eu/esco/skill/9a922e78-dcbb-4d95-908b-0ba34fc06449"
  ],
  "vFfP_5jY_SZG": [
    "http://data.europa.eu/esco/skill/748c2921-e878-4ebd-98d4-36a6b692add7"
  ],
  "wAQ9_vmK_Fua": [
    "http://data.europa.eu/esco/skill/01267c89-b27f-4de0-b555-3683c5a5d66e"
  ],
  "ZKLQ_YPa_zHs": [
    "http://data.europa.eu/esco/skill/1e186b86-9ef9-405b-94d0-73593c5f6dc2"
  ],
  "NRxg_Kvo_HrM": [
    "http://data.europa.eu/esco/skill/ea3f280c-ec1c-41dd-910a-1ae3c3d0eeb6"
  ],
  "Y6zg_1oi_cDZ": [
    "http://data.europa.eu/esco/skill/0ad58425-0691-4da4-b89b-eaa15c09c142"
  ],
  "n6GW_QHy_LBm": [
    "http://data.europa.eu/esco/skill/cb886ee9-c4e4-4d3b-9961-228e9f283a69"
  ],
  "nKjx_3Qa_hrr": [
    "http://data.europa.eu/esco/skill/47269d03-c3e5-47f6-90cf-5657fdcbdedc"
  ],
  "Pe1w_N3Z_hJ5": [
    "http://data.europa.eu/esco/skill/47269d03-c3e5-47f6-90cf-5657fdcbdedc"
  ],
  "cEuD_8pg_yYF": [
    "http://data.europa.eu/esco/skill/da802060-ddcf-499d-ba4e-d04c5804e84d"
  ],
  "ryxY_Uwr_pkw": [
    "http://data.europa.eu/esco/skill/b469a01e-2d3c-4143-8af8-687630fb4ee5"
  ],
  "n2Xz_UYL_JYV": [
    "http://data.europa.eu/esco/skill/d6f40152-c00d-44fa-a48f-55e39f08c14e"
  ],
  "eThQ_HCv_mY6": [
    "http://data.europa.eu/esco/skill/124a7276-1598-46dc-bd4e-f2dff7377cc9"
  ],
  "tdhw_3o8_eVR": [
    "http://data.europa.eu/esco/skill/74dc2276-263f-4d84-b354-547b9ccbcf4c"
  ],
  "cpPa_vTq_Vwu": [
    "http://data.europa.eu/esco/skill/f1e122e5-24a8-44c0-bf3f-90044e72370c"
  ],
  "Uytu_hWi_5nh": [
    "http://data.europa.eu/esco/skill/6468e5fb-f3be-4025-87be-4b6556755c61"
  ],
  "AepF_hH2_pT7": [
    "http://data.europa.eu/esco/skill/71477613-b6f6-4179-a56d-7a937e099b5f"
  ],
  "aSt1_LXQ_MCx": [
    "http://data.europa.eu/esco/skill/203083ca-b051-4c28-8986-fc8731bacee5"
  ],
  "3TSx_fJE_Z26": [
    "http://data.europa.eu/esco/skill/7111b95d-0ce3-441a-9d92-4c75d05c4388"
  ],
  "Pk2j_jXV_Y3j": [
    "http://data.europa.eu/esco/skill/3c76296d-4bbd-44ba-8eaa-95bf275f79b7"
  ],
  "WK5N_8ga_bTa": [
    "http://data.europa.eu/esco/skill/643ae006-5b49-4ec6-9e7c-7b8bc157ae15"
  ],
  "YSTT_c61_xv3": [
    "http://data.europa.eu/esco/skill/90cf93e8-5714-4be9-8fc8-c9e9f68e6c6d"
  ],
  "hCoN_BA4_Vie": [
    "http://data.europa.eu/esco/skill/b60660e8-316f-4ef1-a951-118a4ab00107"
  ],
  "MVKv_XXk_XAi": [
    "http://data.europa.eu/esco/skill/8eab4e4f-03f8-4a66-a830-ec4e5db43253"
  ],
  "i7kk_zcd_MiW": [
    "http://data.europa.eu/esco/skill/35718973-913e-447b-a968-83e66e6c8872"
  ],
  "SkzU_qDQ_Lho": [
    "http://data.europa.eu/esco/skill/bde6d525-01e0-4d50-ac46-a6314274c1d6"
  ],
  "CVyh_JMe_u8R": [
    "http://data.europa.eu/esco/skill/1c70f577-4c90-4fa9-9fc8-ac594c19dd52"
  ],
  "L7X3_qqn_RBr": [
    "http://data.europa.eu/esco/skill/5f97fac8-2001-4b81-ae8b-22f9062d921a"
  ],
  "itDT_5bK_hjR": [
    "http://data.europa.eu/esco/skill/e4a57b51-16d7-4dfc-bb47-6aa401e39b2e"
  ],
  "aHCV_VsV_LiD": [
    "http://data.europa.eu/esco/skill/68b6ef08-d823-489d-a95c-752ae6f6e6a7"
  ],
  "p7YQ_Hke_wXv": [
    "http://data.europa.eu/esco/skill/14ef75cd-ca1f-49c9-9478-ee611b7778fc"
  ],
  "Aq3R_8eq_XHA": [
    "http://data.europa.eu/esco/skill/95930ceb-4d39-44d1-a361-b60bad7df2e5"
  ],
  "Co7V_AQ3_AJn": [
    "http://data.europa.eu/esco/skill/b185c555-f3c7-454e-b1e2-a61ad355351a"
  ],
  "467D_aM6_q3G": [
    "http://data.europa.eu/esco/skill/4eba4667-402e-4aea-a15d-c9fb82da60dd"
  ],
  "SQ5j_FkT_zJY": [
    "http://data.europa.eu/esco/skill/e5a6e1e0-1b07-4432-83ba-77d593b2cb47"
  ],
  "xKTb_Ger_HCf": [
    "http://data.europa.eu/esco/skill/d3e9b00a-0891-4fa8-836d-8240ec3d2758"
  ],
  "w9kF_5oy_ySz": [
    "http://data.europa.eu/esco/skill/243ffeb4-3395-4e39-9cf0-695be5b142aa"
  ],
  "pERs_YHa_Ssv": [
    "http://data.europa.eu/esco/skill/5be12b90-774f-4105-a44f-f3937c1c53f1"
  ],
  "XaJV_v7o_vgX": [
    "http://data.europa.eu/esco/skill/08881cb7-5331-4b11-9442-4d7c9fce749e"
  ],
  "E9eu_hC6_nue": [
    "http://data.europa.eu/esco/skill/e6c6da92-cc13-4c83-bce8-2e0bd2a27f15"
  ],
  "Utw1_tLL_sS2": [
    "http://data.europa.eu/esco/skill/ca73ac82-867a-4afa-9732-834aebe896ff"
  ],
  "KFyd_zgS_6aw": [
    "http://data.europa.eu/esco/skill/aa7062ed-ebfb-4876-8fa5-a7c72c8b6ffb"
  ],
  "DJgE_2TP_mJj": [
    "http://data.europa.eu/esco/skill/8ef1b45e-8499-4b1b-91f7-f8278bbb7767"
  ],
  "LwTt_3Ns_mGH": [
    "http://data.europa.eu/esco/skill/0eb3807c-acdf-47fe-8853-32a29c7bba27"
  ],
  "bw5i_aVL_h7e": [
    "http://data.europa.eu/esco/skill/343dd8e6-225f-460b-99e4-2e24ecbfd7ed"
  ],
  "qD53_dVu_cnU": [
    "http://data.europa.eu/esco/skill/ea451251-71ab-4f89-8c0d-53344ef7004f"
  ],
  "6CXz_QqA_9SW": [
    "http://data.europa.eu/esco/skill/6ecf8396-cc15-4be7-b5f8-c19dcab2e137"
  ],
  "1kW6_GKK_Uxp": [
    "http://data.europa.eu/esco/skill/a9ead737-a7cd-4046-adea-1ff7326db09f"
  ],
  "VF7G_q33_456": [
    "http://data.europa.eu/esco/skill/3d83ffe1-acbd-4494-9275-412559f64940"
  ],
  "cPrZ_ijm_eEe": [
    "http://data.europa.eu/esco/skill/e17f4cea-7e52-4228-93b2-84df2a733cde"
  ],
  "mz5y_hoY_H7C": [
    "http://data.europa.eu/esco/skill/a453d1fa-e494-4e39-96e5-bbc5c730d0d3"
  ],
  "2FAo_yky_ogG": [
    "http://data.europa.eu/esco/skill/1df7bd8e-b961-4d6e-b2f3-db92b14dd460"
  ],
  "3W8b_L9H_Lh8": [
    "http://data.europa.eu/esco/skill/23370aae-b3fa-4724-9b3f-6437747b5df8"
  ],
  "zmyW_iDd_Yac": [
    "http://data.europa.eu/esco/skill/e44a0396-77e2-4d57-8c80-36796238f80c"
  ],
  "agUF_zx8_iKE": [
    "http://data.europa.eu/esco/skill/530cb489-d900-46ab-9350-4d50ccd49eea"
  ],
  "jjpw_CXh_2es": [
    "http://data.europa.eu/esco/skill/415a2d8e-9923-4ace-818b-37cee1f5096a"
  ],
  "mPE9_cBb_5ua": [
    "http://data.europa.eu/esco/skill/2a3a96a3-709e-4d60-81f6-d247d6933f13"
  ],
  "tDd3_iB1_Vgt": [
    "http://data.europa.eu/esco/skill/2b3f7869-49db-418f-b32f-a7d8102a0b4a"
  ],
  "AEgv_4gP_ndv": [
    "http://data.europa.eu/esco/skill/3d64b8fd-bb09-4d13-a3cf-300ed8909088"
  ],
  "qh6a_8VG_LLs": [
    "http://data.europa.eu/esco/skill/13f56e40-eb4c-41d4-82e4-850f6f356581"
  ],
  "xuZD_yBH_aZD": [
    "http://data.europa.eu/esco/skill/b811231c-9398-4996-bd14-48b15a3caaeb"
  ],
  "kfYc_q1X_SZ5": [
    "http://data.europa.eu/esco/skill/52b38e90-3d05-4042-a9e2-d19dec8dd7c1"
  ],
  "wuJq_zrd_SKb": [
    "http://data.europa.eu/esco/skill/a3b7b8ec-794b-4821-8c6b-465fe2c7a691"
  ],
  "1L4q_b6t_eaQ": [
    "http://data.europa.eu/esco/skill/df0612db-366c-4ff5-b106-40b9e385195c"
  ],
  "jbG1_Nhp_f5Z": [
    "http://data.europa.eu/esco/skill/3fe9d11d-eae3-4e89-82ef-bf2187808b32"
  ],
  "zpw7_qhZ_XhW": [
    "http://data.europa.eu/esco/skill/8034a1ea-5ee0-4a84-8fd3-16411c8d86fb"
  ],
  "N7Xw_LmJ_TYe": [
    "http://data.europa.eu/esco/skill/2e2e0231-b8d7-4819-be7b-8e453bf5f0f7"
  ],
  "CeDL_st5_5WY": [
    "http://data.europa.eu/esco/skill/87f1f098-1f36-42bc-99c0-a8bc3f4042ab"
  ],
  "SmZd_Jaa_BeY": [
    "http://data.europa.eu/esco/skill/9b862976-aa05-4bde-8ed6-8f39790edd0f"
  ],
  "US4W_Foa_CSg": [
    "http://data.europa.eu/esco/skill/efa7a6e9-3018-4125-8ac5-5b5d513bcba7"
  ],
  "tSVJ_LjY_mdw": [
    "http://data.europa.eu/esco/skill/3d294b92-1024-48bc-999e-5c5d687659d9"
  ],
  "USwc_mJ5_1wV": [
    "http://data.europa.eu/esco/skill/ad649b0b-ced2-48b6-be0a-0c35e07a445f"
  ],
  "5xsd_oFo_RXw": [
    "http://data.europa.eu/esco/skill/1ad64d80-9350-42a7-9f86-37ef1501b0f1"
  ],
  "HdYx_psN_F8h": [
    "http://data.europa.eu/esco/skill/7d77f9d8-4f9e-4b8f-aa93-bcc1c8ac2173"
  ],
  "MxmZ_gDv_gMS": [
    "http://data.europa.eu/esco/skill/f5750c05-7b15-4e0b-8591-f9a1bb95aaac"
  ],
  "un4e_o8o_W1p": [
    "http://data.europa.eu/esco/skill/b4bd4b00-be51-4631-b202-dcb0e33c0899"
  ],
  "EL7g_UQG_QVd": [
    "http://data.europa.eu/esco/skill/72356ffc-c63c-430a-93ea-457473fb6e11"
  ],
  "Giw8_cWm_RWU": [
    "http://data.europa.eu/esco/skill/6d289e8b-2cc1-4eda-ab1f-ad1090ef98f0"
  ],
  "nMBj_4GR_csR": [
    "http://data.europa.eu/esco/skill/f7dcf2e2-95f6-4061-a977-8d4c16dbceb2"
  ],
  "5LhV_Kg4_hCv": [
    "http://data.europa.eu/esco/skill/5239e378-23c6-424d-9a9b-775653f22d04"
  ],
  "xNTz_SeC_WRw": [
    "http://data.europa.eu/esco/skill/be973dc1-6aa9-4aed-954c-644affe78639"
  ],
  "VLda_kLB_zC5": [
    "http://data.europa.eu/esco/skill/98d1f42a-dcfe-4c9f-9abb-e72aedeaa26b"
  ],
  "MZjE_ZRx_WQT": [
    "http://data.europa.eu/esco/skill/72aaca6d-e12c-4a07-9ed0-a3ccf7827372"
  ],
  "SLAe_RtF_RJZ": [
    "http://data.europa.eu/esco/skill/fd8c0029-9dc7-4b54-845b-ed30c61ba0f8"
  ],
  "6ign_5EU_MUw": [
    "http://data.europa.eu/esco/skill/6b2f8802-0cbf-436e-a37f-ca55ede41bbc"
  ],
  "pGBH_BkG_qJa": [
    "http://data.europa.eu/esco/skill/9fcf9918-fdef-49c3-aedc-518eb1e7e1f5"
  ],
  "7Y6d_qDZ_Eyt": [
    "http://data.europa.eu/esco/skill/6c80d53c-d8c9-41fe-998f-091fca208834"
  ],
  "CPkF_611_wtC": [
    "http://data.europa.eu/esco/skill/b8ac179c-4a29-4467-9177-031daf1321d6"
  ],
  "TMVb_DnH_etF": [
    "http://data.europa.eu/esco/skill/dba46f87-0831-49cd-a1c7-340a653c0221"
  ],
  "d4EY_PCu_S8T": [
    "http://data.europa.eu/esco/skill/05b70efb-6b80-4f04-9a25-67cd317daf37"
  ],
  "ong5_Wb8_dTU": [
    "http://data.europa.eu/esco/skill/938973e2-c084-4c34-9dd4-382128caee6d"
  ],
  "4njf_PjQ_o88": [
    "http://data.europa.eu/esco/skill/350d5fc0-67d4-4b75-8d28-85b325cf23fd"
  ],
  "U81H_Lqc_2SV": [
    "http://data.europa.eu/esco/skill/3c9fc332-97e4-409a-8c32-e81fa552e882"
  ],
  "GfYd_hDy_ZVZ": [
    "http://data.europa.eu/esco/skill/64d8077e-d231-47f7-883a-568b8b9d5fc5"
  ],
  "H89g_Bxx_cV9": [
    "http://data.europa.eu/esco/skill/1638fad2-6858-477d-8ee9-2aa463870602"
  ],
  "kzZC_1vp_8U3": [
    "http://data.europa.eu/esco/skill/f597f772-24d3-4cec-813c-cf5a7027c794"
  ],
  "Uob5_C6Z_q6m": [
    "http://data.europa.eu/esco/skill/1bba98a7-92b9-450b-9235-e0c905f8f3c4"
  ],
  "fNce_6z3_G4v": [
    "http://data.europa.eu/esco/skill/0ea5d4a5-3a7c-4fd0-a62f-992074c85a6c"
  ],
  "avhR_bp1_DMZ": [
    "http://data.europa.eu/esco/skill/8ceaad7f-1d37-41e6-a1fe-4ab9707a959b"
  ],
  "1gdf_dsH_cFZ": [
    "http://data.europa.eu/esco/skill/0a776a56-6ec1-4790-84b3-46d0be706806"
  ],
  "oDP7_ReX_a9j": [
    "http://data.europa.eu/esco/skill/5dfd1b83-8b77-444b-94cd-72f8e13472fa"
  ],
  "sDc5_i8t_jRg": [
    "http://data.europa.eu/esco/skill/2bbdea06-a265-42b5-bb4f-7241b661f069"
  ],
  "RU6V_bcD_cG7": [
    "http://data.europa.eu/esco/skill/41de7eb8-be07-4822-ba85-b76e9b8d6e4e"
  ],
  "ZsuU_rPA_r6g": [
    "http://data.europa.eu/esco/skill/ab6265f2-a9bf-49e8-a9a5-67cbab4de38b"
  ],
  "vyBi_zni_dWA": [
    "http://data.europa.eu/esco/skill/86153127-aaf3-4886-8c19-fec492a4a853"
  ],
  "CwqU_sXy_aGK": [
    "http://data.europa.eu/esco/skill/6962058d-9808-4820-a6bc-d7cabce60cde"
  ],
  "MpNv_4Kx_Vu5": [
    "http://data.europa.eu/esco/skill/0200e5e6-218d-4dae-b1ab-250382250ecb"
  ],
  "E2ZW_X4f_Tub": [
    "http://data.europa.eu/esco/skill/ffc1e455-ced2-4e67-bdb3-1c50f9683859"
  ],
  "kxkP_ZUV_Wy9": [
    "http://data.europa.eu/esco/skill/116083f9-8d05-4b2e-a15f-287b18de5f67"
  ],
  "jfmZ_FfR_NFm": [
    "http://data.europa.eu/esco/skill/5ae07007-1348-4068-ab55-e6f420fa3874"
  ],
  "dpH3_oqg_AHa": [
    "http://data.europa.eu/esco/skill/01e66e1c-97d9-4829-bee1-f3ab649161e8"
  ],
  "kraG_fcm_3Mo": [
    "http://data.europa.eu/esco/skill/6014921e-1d25-4039-adc2-04852d61880e"
  ],
  "uHrY_uuQ_Req": [
    "http://data.europa.eu/esco/skill/30dce29d-0518-4f5d-aeb0-2b5b49e3afbe"
  ],
  "SMBG_57e_nu7": [
    "http://data.europa.eu/esco/skill/d81b58ba-52e4-45fa-9f7c-f59b87fa6041"
  ],
  "QP1q_fXF_b6H": [
    "http://data.europa.eu/esco/skill/04f1b938-d4d4-4cb1-a863-982af76b9d93"
  ],
  "WhiP_TFR_goh": [
    "http://data.europa.eu/esco/skill/541cdc23-1eec-4520-81fc-3392eaf538ed"
  ],
  "5q4a_wi4_WYk": [
    "http://data.europa.eu/esco/skill/bd14968e-e409-45af-b362-3495ed7b10e0"
  ],
  "GyKr_ZV1_Jpt": [
    "http://data.europa.eu/esco/skill/096d7dd5-3f16-4741-b965-1be1f899ffa2"
  ],
  "kmBX_uX9_oQF": [
    "http://data.europa.eu/esco/skill/186da517-9a3e-41cd-9158-4001e3694459"
  ],
  "TGFT_7y2_ryH": [
    "http://data.europa.eu/esco/skill/0aa38c07-644b-4f81-8014-924ea3cc8dc5"
  ],
  "i2z8_u7i_U9U": [
    "http://data.europa.eu/esco/skill/5da8018b-ae85-4cde-ad93-0394369018f3"
  ],
  "4QSD_1eQ_oRq": [
    "http://data.europa.eu/esco/skill/25c4cb91-d64b-48d1-a350-3527334a360d"
  ],
  "q6QD_6et_rcJ": [
    "http://data.europa.eu/esco/skill/86f7126d-97fd-4da5-be96-d1cf6ecd54e6"
  ],
  "gSAz_16e_oTu": [
    "http://data.europa.eu/esco/skill/572cb305-4ffd-488d-bdba-c60195b41f06"
  ],
  "AdgQ_txR_S3M": [
    "http://data.europa.eu/esco/skill/de0be6e8-644c-4cc9-9c8d-925dd98dda56"
  ],
  "ax2t_Yyg_2Sy": [
    "http://data.europa.eu/esco/skill/33784b61-bd86-4451-8a89-741ada5f8475"
  ],
  "f75i_b24_Wop": [
    "http://data.europa.eu/esco/skill/fca5849d-f92a-4a1b-a8c1-af6836200caf"
  ],
  "zYHW_Mtu_jqq": [
    "http://data.europa.eu/esco/skill/a0bf9b9d-e53f-418c-a839-5d99eff718fe"
  ],
  "E6xZ_ZMJ_77a": [
    "http://data.europa.eu/esco/skill/a86de57d-a754-474d-aa9d-989efc3d6e59"
  ],
  "nYAH_rZC_a2F": [
    "http://data.europa.eu/esco/skill/43ec6db6-33f7-449b-a566-5779a7e8997a"
  ],
  "sQgp_BKY_n43": [
    "http://data.europa.eu/esco/skill/2b34764d-637c-48f5-aa70-31e15c965db6"
  ],
  "UXtR_iqA_B8J": [
    "http://data.europa.eu/esco/skill/ca8fae74-46ff-4e1b-94ef-ce22393e02e7"
  ],
  "XEhm_7YA_qKM": [
    "http://data.europa.eu/esco/skill/3a2d5b45-56e4-4f5a-a55a-4a4a65afdc43"
  ],
  "LbC6_UqD_bN5": [
    "http://data.europa.eu/esco/skill/5f5c4314-deae-4e5d-a378-32f55682735e"
  ],
  "madj_KDg_KQq": [
    "http://data.europa.eu/esco/skill/0037c821-2898-4919-b96e-7ed1cd89554c"
  ],
  "7xYo_gc8_9Bm": [
    "http://data.europa.eu/esco/skill/ccde26f3-e822-4b6a-94a1-39af4ae41fed"
  ],
  "tqRJ_2Ds_GJG": [
    "http://data.europa.eu/esco/skill/3c1622fc-6c95-4b51-98da-1814ebe6e889"
  ],
  "ZNwx_7vr_Sg4": [
    "http://data.europa.eu/esco/skill/53780150-1581-4ae6-b435-34068c172caf"
  ],
  "KrCL_cXP_A2d": [
    "http://data.europa.eu/esco/skill/839f05ab-c8e0-4893-8b41-9fcae53e71f3"
  ],
  "1dVh_cZS_Exw": [
    "http://data.europa.eu/esco/skill/4d97e3c3-f335-47cc-a4ee-0d779fd42222"
  ],
  "PHC9_9uW_Bcv": [
    "http://data.europa.eu/esco/skill/aba2e61d-ef78-45bd-a9bc-392a718d4877"
  ],
  "k8ng_1vy_ffT": [
    "http://data.europa.eu/esco/skill/cbfec25e-6ea6-47a6-b0ca-e04e15074491"
  ],
  "on1Q_YPq_eww": [
    "http://data.europa.eu/esco/skill/be149bed-a789-48ee-832b-620ccf776af9"
  ],
  "t8dE_o19_GFz": [
    "http://data.europa.eu/esco/skill/13e1c0a2-b90d-46f4-be51-11730360b38d"
  ],
  "WBHW_i3f_fUd": [
    "http://data.europa.eu/esco/skill/9889b795-d755-41b2-8afd-2e3c87a65a38"
  ],
  "BQqf_7nu_gN5": [
    "http://data.europa.eu/esco/skill/dda745dd-b8d6-45d8-8c74-e05495ce90f5"
  ],
  "U5pM_1wB_8nc": [
    "http://data.europa.eu/esco/skill/25b291b5-8245-4d9d-b391-86a8a31d7109"
  ],
  "QWcX_MAo_CV5": [
    "http://data.europa.eu/esco/skill/156f8c5b-894a-4ccc-a70e-37a2726f3f00"
  ],
  "Nksx_4oe_fEQ": [
    "http://data.europa.eu/esco/skill/db9050db-ae5d-4be8-8114-c26f272c3bda"
  ],
  "6thd_xZq_KsU": [
    "http://data.europa.eu/esco/skill/c33dd5ae-ae72-49d7-8dcf-8bc72e59fe78"
  ],
  "17Uy_FAd_BRr": [
    "http://data.europa.eu/esco/skill/fb82ae25-b59f-43fd-aacf-a8308afbe85e"
  ],
  "MD7y_HEd_aEE": [
    "http://data.europa.eu/esco/skill/ba04b19b-0b18-4d5c-b799-4db31a98e58d"
  ],
  "4U6r_qYQ_Qea": [
    "http://data.europa.eu/esco/skill/c43457a0-3958-4ef9-8b33-2f56a06a63ba"
  ],
  "nazp_hfT_zjJ": [
    "http://data.europa.eu/esco/skill/7fafdbcc-01e5-41df-b269-37dffc49c678"
  ],
  "UyaU_1zF_Ktb": [
    "http://data.europa.eu/esco/skill/0f2eee6f-2203-4cc8-9d79-854d2d5d8131"
  ],
  "Uzqv_VCN_BQq": [
    "http://data.europa.eu/esco/skill/efb523d0-c998-440d-8639-cd14ba841c4c"
  ],
  "hdcx_LQy_E9z": [
    "http://data.europa.eu/esco/skill/6c6f0d6e-1f31-4413-b2ee-dabe135b29a7"
  ],
  "HNWi_rbd_nPS": [
    "http://data.europa.eu/esco/skill/4aacf6a5-9740-48f9-8ed5-11c1cfce722a"
  ],
  "kdSa_Bi6_q6E": [
    "http://data.europa.eu/esco/skill/001d46db-035e-4b92-83a3-ed8771e0c123"
  ],
  "b9pR_edy_Huz": [
    "http://data.europa.eu/esco/skill/c5422318-3218-4ce9-9bdd-f38b93ff63a3"
  ],
  "r78c_Y6B_h6r": [
    "http://data.europa.eu/esco/skill/ba8b530e-8f6f-4667-b734-3358797c0595"
  ],
  "eTDK_F6v_6yX": [
    "http://data.europa.eu/esco/skill/77f109c4-3107-4d2a-a512-5160ac103933"
  ],
  "RbAC_iio_PDs": [
    "http://data.europa.eu/esco/skill/db42e620-c163-4c9e-9a54-df1b29578e82"
  ],
  "5UMW_9C8_tEJ": [
    "http://data.europa.eu/esco/skill/75ffb6d4-0b48-4471-b3c9-731b01ee1b47"
  ],
  "V5EN_xw2_itk": [
    "http://data.europa.eu/esco/skill/5f5e9350-1d13-4391-b9e1-07f6b2047fc5"
  ],
  "UJcF_SrQ_Jvw": [
    "http://data.europa.eu/esco/skill/09f4c52b-ac72-4f0e-a8ae-78bb1d7bffba"
  ],
  "NV36_AEH_r8D": [
    "http://data.europa.eu/esco/skill/3b4f2a64-9884-4f3d-8020-44dc95919a7c"
  ],
  "j3wL_CdZ_Rz6": [
    "http://data.europa.eu/esco/skill/5063a99f-975b-4a7c-85e3-69ecb375b4d3"
  ],
  "NQmD_sAK_eFA": [
    "http://data.europa.eu/esco/skill/d9eaf831-9348-4330-a83e-b7c099cdc8f6"
  ],
  "1xQq_Do4_ujS": [
    "http://data.europa.eu/esco/skill/0a30e5a8-60a8-4fda-9f89-8e9cee38da5a"
  ],
  "SdUN_U1M_aqG": [
    "http://data.europa.eu/esco/skill/748780fa-b879-4a5b-80ca-7d018e6e1e6f"
  ],
  "QQuL_2Pe_YDE": [
    "http://data.europa.eu/esco/skill/3446d034-aa08-4706-ba05-e9cb0d01b5b1"
  ],
  "oLd3_61W_b7r": [
    "http://data.europa.eu/esco/skill/08a65612-a801-4b84-933b-192bc8378e64"
  ],
  "RNB5_tQp_hYD": [
    "http://data.europa.eu/esco/skill/0fbaceff-df05-4ef7-b735-188dc183b56b"
  ],
  "MfhP_thz_DH6": [
    "http://data.europa.eu/esco/skill/075c68d7-efe4-4466-be4a-9acc726504df"
  ],
  "bHSo_36W_Y7K": [
    "http://data.europa.eu/esco/skill/7193cb6d-8334-494f-86e5-21e6d03a47c3"
  ],
  "bhJU_7hb_8pQ": [
    "http://data.europa.eu/esco/skill/9fd32e78-6277-4a8c-b020-ad109f92ba4f"
  ],
  "jjkC_sJJ_ZT3": [
    "http://data.europa.eu/esco/skill/df64a7cc-2e96-4304-95d3-56fe0ac2dd39"
  ],
  "Ush1_k4m_xnP": [
    "http://data.europa.eu/esco/skill/25a599ff-27ab-4853-9a04-6174a0bd03b3"
  ],
  "Ev5U_yQH_AU8": [
    "http://data.europa.eu/esco/skill/0082c13b-5866-4542-bc4f-722a4ae9530e"
  ],
  "bgC3_M9R_1K4": [
    "http://data.europa.eu/esco/skill/5c7340b9-3ab5-46bc-af5e-ed737e57df6d"
  ],
  "TEum_xLY_t4z": [
    "http://data.europa.eu/esco/skill/25f0ea33-b4a2-4f31-b7b4-7d20e827b180"
  ],
  "MuoH_pDL_nFJ": [
    "http://data.europa.eu/esco/skill/2879e8f6-037a-49ed-ba73-6f7d7766223e"
  ],
  "9F3h_HNn_mtg": [
    "http://data.europa.eu/esco/skill/0939079f-e4dc-46c3-94fa-5155fc34c888"
  ],
  "7S6x_Nic_TFv": [
    "http://data.europa.eu/esco/skill/a7723f06-53c3-4228-9fd0-1952ea1d7391"
  ],
  "YAMo_jgk_AKB": [
    "http://data.europa.eu/esco/skill/f64fe2c2-d090-4e91-ba74-1355d96b9bca"
  ],
  "tZ5p_xTP_DTx": [
    "http://data.europa.eu/esco/skill/00cd1d60-782f-48e7-9a7b-b518f2b146b8"
  ],
  "Hnsg_Mpz_6KT": [
    "http://data.europa.eu/esco/skill/8be4540d-db79-4213-8820-bda0d3fb74a7"
  ],
  "BZxx_rQH_abZ": [
    "http://data.europa.eu/esco/skill/16af9bcb-5fca-4a65-bd59-8a407f009999"
  ],
  "rFRr_KTf_FjW": [
    "http://data.europa.eu/esco/skill/609d6bb4-db16-4578-87fc-57b11a701cc2"
  ],
  "Njjp_yXP_1QV": [
    "http://data.europa.eu/esco/skill/221a3714-9a9e-43a4-869e-184bbea5e32d"
  ],
  "ZFcE_Ti2_A5c": [
    "http://data.europa.eu/esco/skill/a57a54b6-2f2e-43e4-9621-b52f4a63cb08"
  ],
  "7zph_bPW_A8z": [
    "http://data.europa.eu/esco/skill/532bcdca-a889-4dea-8f7f-4e03d8cfd0d2"
  ],
  "cnkK_3ev_Ccf": [
    "http://data.europa.eu/esco/skill/6709e92c-7546-46a4-aa57-5e951bd4cb0f"
  ],
  "x2P4_2XP_SSX": [
    "http://data.europa.eu/esco/skill/c8d53d69-d900-4092-af80-c5d0422bcdb3"
  ],
  "4QAE_wtY_gJh": [
    "http://data.europa.eu/esco/skill/8b3aefd2-5021-418f-b069-828fb7abc598"
  ],
  "6R9q_JPV_9Nw": [
    "http://data.europa.eu/esco/skill/c416bcc9-df5a-42fd-abc9-9949ec072ef3"
  ],
  "txco_m6M_RjU": [
    "http://data.europa.eu/esco/skill/fab8e95a-448d-4784-aa50-9ef10e924829"
  ],
  "i4ba_rD6_XAG": [
    "http://data.europa.eu/esco/skill/d6c84f20-db10-47d3-971f-384114f0b6c2"
  ],
  "McR1_y6q_1U5": [
    "http://data.europa.eu/esco/skill/eac55ce8-82f5-4ff0-bdff-64872d8c51ea"
  ],
  "r6uV_Vr4_Qnv": [
    "http://data.europa.eu/esco/skill/bc05eaf7-8d1f-46e3-8834-9d45c4e92831"
  ],
  "KJAs_4Qc_ab3": [
    "http://data.europa.eu/esco/skill/ec95d0a4-886e-4eb1-aa4c-2d5f2549df7d"
  ],
  "g4w2_EyF_UHm": [
    "http://data.europa.eu/esco/skill/4123b65c-8a81-4055-8361-3f49bd33a1d9"
  ],
  "aBcd_BQi_Qyd": [
    "http://data.europa.eu/esco/skill/7b0fb3d0-20a2-41a5-805a-b67a7dd98691"
  ],
  "ezVu_GhE_b3b": [
    "http://data.europa.eu/esco/skill/979cf728-896f-4f2c-8fa8-2698ca0d4930"
  ],
  "MLXT_qQX_4rM": [
    "http://data.europa.eu/esco/skill/65baf502-04a6-41c9-962f-9629de5c5a0a"
  ],
  "Jenn_CDz_spm": [
    "http://data.europa.eu/esco/skill/b0096dc5-2e2d-4bc1-8172-05bf486c3968"
  ],
  "RqGR_GDY_2me": [
    "http://data.europa.eu/esco/skill/f2aeb587-32fc-4a2c-af4c-07fbb82f7287"
  ],
  "bPHw_mw8_Mm5": [
    "http://data.europa.eu/esco/skill/0302f93a-0d38-4c00-bc37-eda17b6316ea"
  ],
  "zzSp_k6L_WgN": [
    "http://data.europa.eu/esco/skill/86f0bb12-6491-4be7-8306-c88900e91a63"
  ],
  "QRj4_BE5_bEA": [
    "http://data.europa.eu/esco/skill/0e78d9c9-7c3c-4c5c-82cb-205c16edbcb8"
  ],
  "WdBL_5qJ_F7N": [
    "http://data.europa.eu/esco/skill/814f3782-62cb-4af8-8b13-98a71c5f60a2"
  ],
  "FrPC_Dr4_w97": [
    "http://data.europa.eu/esco/skill/61844a55-4103-4bf2-afcf-08e4ee120928"
  ],
  "xxw6_hUh_P1W": [
    "http://data.europa.eu/esco/skill/4f6b656a-54d0-48ce-9b55-ebcac5904a14"
  ],
  "rVUL_AgV_ZTH": [
    "http://data.europa.eu/esco/skill/156f8c5b-894a-4ccc-a70e-37a2726f3f00"
  ],
  "BvGm_Zuj_VLF": [
    "http://data.europa.eu/esco/skill/6acf652c-33b2-4e28-8f79-1e553f255229"
  ],
  "7CRV_X9r_4gG": [
    "http://data.europa.eu/esco/skill/66ea3249-a079-45ad-b4f2-e6a79b59f10f"
  ],
  "PKWj_Pej_iE1": [
    "http://data.europa.eu/esco/skill/8ff67760-40b6-43fe-a6c5-6f1949fd0f0a"
  ],
  "f4z4_xDq_bgg": [
    "http://data.europa.eu/esco/skill/aaed82e5-b4cb-490c-85f9-509c75e6cbf0"
  ],
  "mBmm_gfH_wXb": [
    "http://data.europa.eu/esco/skill/1c7fbce8-741b-416a-8b34-f9900e0ddd52"
  ],
  "zXNU_zXR_hGd": [
    "http://data.europa.eu/esco/skill/f7b5d916-52f0-4865-b6a6-e1a3b711cb5e"
  ],
  "uAQ9_WwW_hEe": [
    "http://data.europa.eu/esco/skill/d31fab87-2a7d-485c-b699-2901ca294b15"
  ],
  "pDSo_DP5_AtK": [
    "http://data.europa.eu/esco/skill/c27702fd-7ecc-41fe-8289-47ea069d484a"
  ],
  "s57R_LAb_igj": [
    "http://data.europa.eu/esco/skill/3fe84b03-b2a5-450e-9210-10c124af738c"
  ],
  "XHqY_JaH_F4h": [
    "http://data.europa.eu/esco/skill/012795fe-5f85-4d12-a10e-9dabda4ea05f"
  ],
  "J2Sq_XTY_MMi": [
    "http://data.europa.eu/esco/skill/c349b18e-5038-4ad3-a2d9-b585b1100c3d"
  ],
  "4hpC_iEf_rfE": [
    "http://data.europa.eu/esco/skill/5b6abc4b-0cfe-4178-845d-479da3d2d699"
  ],
  "kPkd_Eqr_TQV": [
    "http://data.europa.eu/esco/skill/5e1ae060-3827-403b-b875-2f45a054ce03"
  ],
  "UqgU_JAJ_Vhg": [
    "http://data.europa.eu/esco/skill/1b7c716e-af95-4cda-a42f-6479c8b139f5"
  ],
  "HfMQ_zpY_7Q1": [
    "http://data.europa.eu/esco/skill/1a7a862d-1fb8-4348-8af6-9f43de020357"
  ],
  "CibV_iV1_wz4": [
    "http://data.europa.eu/esco/skill/6dc4bab9-1982-4d5a-b8b6-14c3cfd32c31"
  ],
  "ZZ3K_X56_6BC": [
    "http://data.europa.eu/esco/skill/df0690fb-070b-4d63-9043-a65f18044787"
  ],
  "ceB6_TP1_62U": [
    "http://data.europa.eu/esco/skill/52cf3037-ab53-4806-85ed-7fd21ea7f6a1"
  ],
  "F7nJ_k5s_L29": [
    "http://data.europa.eu/esco/skill/9a7cc3c2-b529-44a4-ab8e-f04fc91362e2"
  ]
}