0;Abbekås
0;Abborrträsk
0;Abisko
0;Adak
0;Adelsö
0;Agnesberg
0;Agunnaryd
0;Alafors
0;Alby
0;Alfta
0;Alingsås
0;Allerum
0;Almunge
0;Alnarp
0;Alnö
0;Alsen
0;Alsterbro
0;Alstermo
0;Altersbruk
0;Alunda
0;Alvesta
0;Alvhem
0;Ambjörby
0;Ambjörnarp
0;Ammarnäs
0;Anderslöv
0;Anderstorp
0;Aneby
0;Angered
0;Ankarsrum
0;Ankarsvik
0;Anneberg
0;Annelöv
0;Annerstad
0;Aplared
0;Arboga
0;Arbrå
0;Arholma
0;Arild
0;Arjeplog
0;Arkelstorp
0;Arlandastad
0;Arlöv
0;Arnemark
0;Arnäsvall
0;Arvidsjaur
0;Arvika
0;Asarum
0;Askersund
0;Askerön
0;Askim
0;Asmundtorp
0;Aspabruk
0;Asperö
0;Aspås
0;Avesta
0;Axmar
0;Axvall
0;Backaryd
0;Backe
0;Bagarmossen
0;Ballingslöv
0;Bandhagen
0;Bankeryd
0;Bara
0;Barsebäck
0;Barsele
0;Bastuträsk
0;Beddingestrand
0;Bengtsfors
0;Berga
0;Bergby
0;Bergeforsen
0;Berghem
0;Bergkvara
0;Bergshamra
0;Bergsjö
0;Bergvik
0;Bestorp
0;Bettna
0;Billdal
0;Billeberga
0;Billesholm
0;Billinge
0;Billingsfors
0;Bispgården
0;Bjurholm
0;Bjursås
0;Bjuråker
0;Bjuv
0;Bjärnum
0;Bjärred
0;Bjärtrå
0;Bjästa
0;Björbo
0;Björketorp
0;Björkliden
0;Björklinge
0;Björksele
0;Björkvik
0;Björkö
0;Björköby
0;Björna
0;Björneborg
0;Björnlunda
0;Blackstad
0;Blankaholm
0;Blattnicksele
0;Bleket
0;Blentarp
0;Blidsberg
0;Blidö
0;Blomstermåla
0;Blåsmark
0;Blåviksjön
0;Bockara
0;Boda Glasbruk
0;Boda Kyrkby
0;Bodafors
0;Boden
0;Bograngen
0;Bohus
0;Bohus-Björkö
0;Bohus-Malmön
0;Boliden
0;Bollebygd
0;Bollnäs
0;Bollstabruk
0;Bolmsö
0;Bonässund
0;Bor
0;Borensberg
0;Borgafjäll
0;Borghamn
0;Borgholm
0;Borgstena
0;Borgvik
0;Borlänge
0;Borrby
0;Borås
0;Botsmark
0;Bottnaryd
0;Bovallstrand
0;Boxholm
0;Brandbergen
0;Brandstorp
0;Brantevik
0;Brastad
0;Braås
0;Bredared
0;Bredaryd
0;Bredbyn
0;Brevens Bruk
0;Bro
0;Broakulla
0;Broaryd
0;Broby
0;Broddetorp
0;Brokind
0;Bromma
0;Bromölla
0;Brottby
0;Bruksvallarna
0;Brunflo
0;Brunskog
0;Bruzaholm
0;Brålanda
0;Bräcke
0;Bräkne-Hoby
0;Brämhult
0;Brännö
0;Brösarp
0;Bua
0;Bullaren
0;Bullmark
0;Bunkeflostrand
0;Bureå
0;Burgsvik
0;Burseryd
0;Burträsk
0;By Kyrkby
0;Bygdeå
0;Bygdsiljum
0;Byske
0;Byxelkrok
0;Bålsta
0;Båstad
0;Båtskärsnäs
0;Bäckefors
0;Bälinge
0;Charlottenberg
0;Dala-Floda
0;Dala-Husby
0;Dala-Järna
0;Dalarö
0;Dalby
0;Dalhem
0;Dals Långed
0;Dals Rostock
0;Dalsjöfors
0;Dalskog
0;Dalstorp
0;Dalum
0;Danderyd
0;Dannike
0;Degeberga
0;Degerfors
0;Degerhamn
0;Deje
0;Delsbo
0;Dikanäs
0;Dingle
0;Diö
0;Djura
0;Djurhamn
0;Djurmo
0;Djursholm
0;Djurås
0;Docksta
0;Domsjö
0;Domsten
0;Donsö
0;Dorotea
0;Drottningholm
0;Drottningskär
0;Duved
0;Dvärsätt
0;Dyltabruk
0;Dyrön
0;Dösjebro
0;Ed
0;Edane
0;Edsbro
0;Edsbruk
0;Edsbyn
0;Edsele
0;Edsvalla
0;Ekeby
0;Ekenässjön
0;Ekerö
0;Eket
0;Ekolsund
0;Ekshärad
0;Eksjö
0;Eldsberga
0;Ellös
0;Emmaboda
0;Enebyberg
0;Eneryda
0;Enhörna
0;Enköping
0;Enskede
0;Enskede Gård
0;Enskededalen
0;Enstaberga
0;Enviken
0;Enånger
0;Erikslund
0;Eriksmåla
0;Eringsboda
0;Ersmark
0;Ervalla
0;Eskilstuna
0;Eslöv
0;Everöd
0;Fagerfjäll
0;Fagerhult
0;Fagersanna
0;Fagersta
0;Fagervik
0;Fagerås
0;Falkenberg
0;Falköping
0;Falsterbo
0;Falun
0;Farhult
0;Farsta
0;Fegen
0;Fellingsbro
0;Fengersfors
0;Figeholm
0;Filipstad
0;Finja
0;Finnerödja
0;Finspång
0;Fiskebäckskil
0;Fjugesta
0;Fjälkinge
0;Fjällbacka
0;Fjärdhundra
0;Fjärås
0;Flarken
0;Flen
0;Fleninge
0;Flisby
0;Fliseryd
0;Floby
0;Floda
0;Flyinge
0;Folkärna
0;Fornåsa
0;Fors
0;Forsa
0;Forsbacka
0;Forserum
0;Forshaga
0;Forsheda
0;Forsvik
0;Fotskäl
0;Fotö
0;Fredrika
0;Fredriksberg
0;Fredriksdal
0;Fridlevstad
0;Frillesås
0;Frinnaryd
0;Fristad
0;Fritsla
0;Frufällan
0;Frändefors
0;Fränsta
0;Fröseke
0;Frösön
0;Frövi
0;Funäsdalen
0;Furuby
0;Furudal
0;Furulund
0;Furusund
0;Furuvik
0;Fågelfors
0;Fågelmara
0;Fåker
0;Fårbo
0;Fårö
0;Fårösund
0;Fällfors
0;Färentuna
0;Färgelanda
0;Färila
0;Färjestaden
0;Färlöv
0;Färnäs
0;Föllinge
0;Förslöv
0;Gagnef
0;Gamleby
0;Gammalkil
0;Gammelstad
0;Gantofta
0;Gargnäs
0;Garpenberg
0;Garphyttan
0;Garsås
0;Gemla
0;Genarp
0;Genevad
0;Getinge
0;Gideå
0;Gimo
0;Gislaved
0;Glanshammar
0;Glava
0;Glemmingebro
0;Glimåkra
0;Glommen
0;Glommersträsk
0;Glumslöv
0;Gnarp
0;Gnesta
0;Gnosjö
0;Gotlands Tofta
0;Granbergsdal
0;Grangärde
0;Graninge
0;Granö
0;Grebbestad
0;Grevie
0;Grillby
0;Grimeton
0;Grimslöv
0;Grimstorp
0;Grimsås
0;Grisslehamn
0;Grums
0;Grundsund
0;Grycksbo
0;Gryt
0;Grytgöl
0;Grythyttan
0;Gråbo
0;Gräddö
0;Grängesberg
0;Gränna
0;Gränö
0;Gräsmark
0;Gräsmyr
0;Grästorp
0;Gräsö
0;Grödinge
0;Grönahög
0;Grönskåra
0;Grötö
0;Gualöv
0;Gudhem
0;Guldsmedshyttan
0;Gullabo
0;Gullaskruv
0;Gullbrandstorp
0;Gullholmen
0;Gullringen
0;Gullspång
0;Gunnarn
0;Gunnarsbyn
0;Gunnarskog
0;Gunnebo
0;Gunnilse
0;Gusselby
0;Gustafs
0;Gustavsberg
0;Gustavsfors
0;Gusum
0;Gysinge
0;Gyttorp
0;Gålö
0;Gånghester
0;Gårdsjö
0;Gäddede
0;Gällivare
0;Gällnöby
0;Gällstad
0;Gällö
0;Gärds Köpinge
0;Gärsnäs
0;Gästrike-Hammarby
0;Gävle
0;Göta
0;Göteborg
0;Götene
0;Habo
0;Hackås
0;Hagby
0;Hagfors
0;Hajom
0;Hakenäset
0;Hakkas
0;Hallabro
0;Hallaryd
0;Hallaröd
0;Hallen
0;Hallsberg
0;Hallstahammar
0;Hallstavik
0;Halltorp
0;Halmstad
0;Hamburgsund
0;Hammar
0;Hammarstrand
0;Hammarö
0;Hammenhög
0;Hammerdal
0;Hamneda
0;Hamra
0;Hamrångefjärden
0;Hanaskog
0;Handen
0;Haninge
0;Haparanda
0;Harads
0;Harbo
0;Harestad
0;Hargshamn
0;Harlösa
0;Harmånger
0;Harplinge
0;Harö
0;Hassela
0;Hasselfors
0;Hasslarp
0;Hasslö
0;Havdhem
0;Haverdal
0;Havstenssund
0;Heberg
0;Heby
0;Hedared
0;Hede
0;Hedekas
0;Hedemora
0;Hedenäset
0;Hedesunda
0;Helgum
0;Helsingborg
0;Hemavan
0;Hemmingsmark
0;Hemse
0;Hemsön
0;Henån
0;Herrljunga
0;Herräng
0;Hestra
0;Hillared
0;Hillerstorp
0;Hindås
0;Hishult
0;Hisings Backa
0;Hisings Kärra
0;Hjo
0;Hjorted
0;Hjortkvarn
0;Hjortsberga
0;Hjälteby
0;Hjältevad
0;Hjärnarp
0;Hjärtum
0;Hjärup
0;Hofors
0;Hok
0;Holm
0;Holmsjö
0;Holmsund
0;Holmsveden
0;Holmön
0;Holsbybrunn
0;Holsljunga
0;Horda
0;Horn
0;Horndal
0;Hornmyr
0;Horred
0;Hortlax
0;Hoting
0;Hova
0;Hovenäset
0;Hovmantorp
0;Hovås
0;Huaröd
0;Huddinge
0;Huddungeby
0;Hudiksvall
0;Hult
0;Hultafors
0;Hultsfred
0;Hunnebostrand
0;Hurva
0;Husarö
0;Husby-Rekarne
0;Huskvarna
0;Husum
0;Hyllinge
0;Hyltebruk
0;Hyppeln
0;Hyssna
0;Håcksvik
0;Håknäs
0;Hålanda
0;Hållnäs
0;Hållsta
0;Hålta
0;Hårsfjärden
0;Håverud
0;Hägersten
0;Häggeby
0;Häggenås
0;Häljarp
0;Hällaström
0;Hällefors
0;Hälleforsnäs
0;Hällekis
0;Hällestad
0;Hällevadsholm
0;Hälleviksstrand
0;Hällingsjö
0;Hällnäs
0;Hälsö
0;Häradsbäck
0;Härnösand
0;Härryda
0;Härslöv
0;Hässelby
0;Hässleholm
0;Hästveda
0;Höganäs
0;Högland
0;Högsby
0;Högsjö
0;Högsäter
0;Höje
0;Hökerum
0;Höljes
0;Höllviken
0;Hölö
0;Hönö
0;Hörby
0;Hörja
0;Hörnefors
0;Hörnsjö
0;Höviksnäs
0;Höör
0;Idkerberget
0;Idre
0;Iggesund
0;Ilsbo
0;Immeln
0;Indal
0;Ingarö
0;Ingatorp
0;Ingelstad
0;Ingmarsö
0;Insjön
0;Istorp
0;Johanneshov
0;Johannishus
0;Jokkmokk
0;Jonsered
0;Jonstorp
0;Jordbro
0;Jukkasjärvi
0;Julita
0;Junosuando
0;Junsele
0;Juoksengi
0;Jäckvik
0;Jädraås
0;Jämjö
0;Jämshög
0;Järbo
0;Järfälla
0;Järlåsa
0;Järna
0;Järnforsen
0;Järpen
0;Järpås
0;Järved
0;Järvsö
0;Jät
0;Jättendal
0;Jävrebyn
0;Jönköping
0;Jönåker
0;Jörlanda
0;Jörn
0;Kainulasjärvi
0;Kalix
0;Kalix-Nyborg
0;Kallinge
0;Kalmar
0;Kalv
0;Kalvsund
0;Kalvsvik
0;Kalvträsk
0;Kangos
0;Kareby
0;Karesuando
0;Karl Gustav
0;Karlholmsbruk
0;Karlsborg
0;Karlsborgsverken
0;Karlshamn
0;Karlskoga
0;Karlskrona
0;Karlstad
0;Karungi
0;Katrineholm
0;Kattarp
0;Katthammarsvik
0;Kil
0;Kilafors
0;Killeberg
0;Kilsmo
0;Kimstad
0;Kinna
0;Kinnahult
0;Kinnared
0;Kinnarp
0;Kinnarumma
0;Kiruna
0;Kisa
0;Kista
0;Kittelfjäll
0;Kivik
0;Klagshamn
0;Klagstorp
0;Klavreström
0;Klimpfjäll
0;Klintehamn
0;Klippan
0;Klockrike
0;Klågerup
0;Klädesholmen
0;Klässbol
0;Klövedal
0;Klövsjö
0;Knislinge
0;Knivsta
0;Knutby
0;Knäred
0;Kode
0;Kolbäck
0;Koler
0;Kolmården
0;Kolsva
0;Konga
0;Kopparberg
0;Koppom
0;Korpilombolo
0;Korsberga
0;Korskrogen
0;Koskullskulle
0;Kosta
0;Kovland
0;Kramfors
0;Kristdala
0;Kristianstad
0;Kristineberg
0;Kristinehamn
0;Krokom
0;Krylbo
0;Kullavik
0;Kulltorp
0;Kumla
0;Kungens Kurva
0;Kungsbacka
0;Kungsgården
0;Kungshamn
0;Kungsängen
0;Kungsäter
0;Kungsör
0;Kungälv
0;Kurravaara
0;Kusmark
0;Kvibille
0;Kvicksund
0;Kvidinge
0;Kvikkjokk
0;Kvillsfors
0;Kvissleby
0;Kvänum
0;Kyrkesund
0;Kyrkhult
0;Kåbdalis
0;Kåge
0;Kågeröd
0;Kållekärr
0;Kållered
0;Kårböle
0;Kälarne
0;Källby
0;Källö-Knippla
0;Käringön
0;Kärna
0;Kättilstorp
0;Kävlinge
0;Köping
0;Köpingebro
0;Köpingsvik
0;Köpmanholmen
0;Köpmannebro
0;Köpstadsö
0;Lagan
0;Laholm
0;Laisvall
0;Lajksjöberg
0;Lakene
0;Lammhult
0;Landeryd
0;Landfjärden
0;Landsbro
0;Landskrona
0;Landvetter
0;Lannavaara
0;Lansjärv
0;Lappträsk
0;Larv
0;Latikberg
0;Lavsjön
0;Laxå
0;Lekeryd
0;Leksand
0;Lenhovda
0;Lerberget
0;Lerdala
0;Lerum
0;Lesjöfors
0;Lessebo
0;Liatorp
0;Liden
0;Lidhult
0;Lidingö
0;Lidköping
0;Lidsjöberg
0;Likenäs
0;Lilla Edet
0;Lillhärdal
0;Lillkyrka
0;Lillpite
0;Lima
0;Limhamn
0;Limmared
0;Linderöd
0;Lindesberg
0;Lindome
0;Lindås
0;Lingbo
0;Linghed
0;Linghem
0;Linköping
0;Linneryd
0;Listerby
0;Lit
0;Ljugarn
0;Ljung
0;Ljungaverk
0;Ljungby
0;Ljungbyhed
0;Ljungbyholm
0;Ljungdalen
0;Ljungsarp
0;Ljungsbro
0;Ljungskile
0;Ljusdal
0;Ljusfallshammar
0;Ljusne
0;Ljusnedal
0;Ljusterö
0;Ljustorp
0;Lofsdalen
0;Loftahammar
0;Lomma
0;Los
0;Lotorp
0;Lovikka
0;Ludvigsborg
0;Ludvika
0;Lugnvik
0;Luleå
0;Lund
0;Lunde
0;Lundsbrunn
0;Lur
0;Lycke
0;Lyckeby
0;Lycksele
0;Lyrestad
0;Lysekil
0;Lysvik
0;Långaryd
0;Långasjö
0;Långbäcken
0;Långsele
0;Långserud
0;Långshyttan
0;Långträsk
0;Långviksmon
0;Långås
0;Läckeby
0;Länghem
0;Länna
0;Lärbro
0;Löberöd
0;Löddeköpinge
0;Löderup
0;Lödöse
0;Lögdeå
0;Lönashult
0;Lönneberga
0;Lönsboda
0;Löttorp
0;Lövestad
0;Lövstabruk
0;Lövånger
0;Malgomaj
0;Malmberget
0;Malmbäck
0;Malmköping
0;Malmö
0;Malmö-Sturup
0;Malung
0;Malungsfors
0;Malå
0;Mangskog
0;Mantorp
0;Marbäck
0;Mariannelund
0;Mariedamm
0;Mariefred
0;Marieholm
0;Marieholmsbruk
0;Mariestad
0;Markaryd
0;Marmaverken
0;Marsfjäll
0;Marstrand
0;Matfors
0;Mattisudden
0;Mattmar
0;Mellansel
0;Mellanström
0;Mellbystrand
0;Mellerud
0;Mellösa
0;Mjällom
0;Mjöbäck
0;Mjöhult
0;Mjölby
0;Mjörn
0;Mockfjärd
0;Moheda
0;Moholm
0;Moliden
0;Molkom
0;Mollösund
0;Mora
0;Morgongåva
0;Morjärv
0;Morokulien
0;Morup
0;Moskosel
0;Motala
0;Mullhyttan
0;Mullsjö
0;Munka-Ljungby
0;Munkedal
0;Munkflohögen
0;Munkfors
0;Munsö
0;Muodoslompolo
0;Murjek
0;Muskö
0;Myggenäs
0;Myresjö
0;Målerås
0;Målilla
0;Målsryd
0;Månkarbo
0;Månsarp
0;Månstad
0;Mårdaklev
0;Mårdsel
0;Märsta
0;Möja
0;Möklinta
0;Mölle
0;Mölltorp
0;Mölnbo
0;Mölndal
0;Mölnlycke
0;Mönsterås
0;Mörarp
0;Mörbylånga
0;Mörkö
0;Mörlunda
0;Mörrum
0;Mörsil
0;Nacka
0;Nacka Strand
0;Nattavaara
0;Nattavaaraby
0;Niemisel
0;Nikkala
0;Nissafors
0;Nittorp
0;Njurunda
0;Njutånger
0;Nol
0;Nora
0;Noraström
0;Norberg
0;Nordingrå
0;Nordkoster
0;Nordmaling
0;Nordmarkshyttan
0;Norra Sorunda
0;Norrahammar
0;Norrala
0;Norrby
0;Norrfjärden
0;Norrfors
0;Norrhult
0;Norrköping
0;Norrsundet
0;Norrtälje
0;Norråker
0;Norsborg
0;Norsholm
0;Norsjö
0;Nossebro
0;Nusnäs
0;Nybro
0;Nybrostrand
0;Nye
0;Nygård
0;Nyhammar
0;Nyhamnsläge
0;Nykil
0;Nykroppa
0;Nykvarn
0;Nyköping
0;Nyland
0;Nymölla
0;Nynäshamn
0;Nyvång
0;Nyåker
0;Nås
0;Nälden
0;Nämdö
0;Närkesberg
0;Näshulta
0;Nässjö
0;Näsum
0;Näsviken
0;Näsåker
0;Nättraby
0;Nävekvarn
0;Nävlinge
0;Nödinge
0;Nösund
0;Obbola
0;Ockelbo
0;Odensbacken
0;Odensvi
0;Offerdal
0;Olofstorp
0;Olofström
0;Olsfors
0;Onsala
0;Onslunda
0;Ormaryd
0;Ornö
0;Orrefors
0;Orrviken
0;Orsa
0;Osby
0;Oskarshamn
0;Oskarström
0;Otterbäcken
0;Oviken
0;Oxelösund
0;Oxie
0;Pajala
0;Partille
0;Pauliström
0;Pello
0;Perstorp
0;Pilgrimstad
0;Piteå
0;Pixbo
0;Porjus
0;Prässebo
0;Puoltikasvaara
0;Påarp
0;Pålsboda
0;Påläng
0;Påryd
0;Påskallavik
0;Rabbalshede
0;Ramdala
0;Ramkvilla
0;Ramlösa
0;Ramnäs
0;Ramsberg
0;Ramsele
0;Ramsjö
0;Ramvik
0;Randijaur
0;Ransta
0;Ransäter
0;Reftele
0;Rejmyre
0;Rengsjö
0;Rentjärn
0;Resele
0;Resö
0;Riala
0;Riddarhyttan
0;Riksgränsen
0;Rimbo
0;Rimforsa
0;Ringarum
0;Rinkaby
0;Risbäck
0;Risögrund
0;Robertsfors
0;Rockneby
0;Roknäs
0;Rolfstorp
0;Romakloster
0;Romelanda
0;Ronneby
0;Rosenfors
0;Rosersberg
0;Rossön
0;Rosvik
0;Rottne
0;Rottneros
0;Ruda
0;Rundvik
0;Runhällen
0;Runmarö
0;Rusksele
0;Ryd
0;Rydaholm
0;Rydal
0;Rydboholm
0;Rydebäck
0;Rydsgård
0;Rydöbruk
0;Ryssby
0;Råda
0;Råneå
0;Rångedala
0;Rånäs
0;Råå
0;Rätan
0;Rättvik
0;Rävlanda
0;Rö
0;Röbäck
0;Rödeby
0;Röfors
0;Röke
0;Rökå
0;Rönneshytta
0;Rönninge
0;Rönnäng
0;Rörbäcksnäs
0;Rörvik
0;Rörö
0;Röstånga
0;Sala
0;Salbohed
0;Saltsjöbaden
0;Saltsjö-Boo
0;Saltsjö-Duvnäs
0;Sandared
0;Sandarne
0;Sandhamn
0;Sandhem
0;Sandhult
0;Sandsjöfors
0;Sandviken
0;Sandöverken
0;Sangis
0;Sankt Anna
0;Sankt Ibb
0;Sankt Olof
0;Saxdalen
0;Saxtorp
0;Segeltorp
0;Segersta
0;Segersäng
0;Seglora
0;Segmon
0;Sennan
0;Senoren
0;Seskarö
0;Sexdrega
0;Sibbhult
0;Sidensjö
0;Sifferbo
0;Sigtuna
0;Sikfors
0;Siljansnäs
0;Silverdalen
0;Simlångsdalen
0;Simrishamn
0;Sjulsmark
0;Sjuntorp
0;Själevad
0;Sjöbo
0;Sjömarken
0;Sjötofta
0;Sjötorp
0;Sjövik
0;Skagersvik
0;Skanör
0;Skara
0;Skarpnäck
0;Skattkärr
0;Skattungbyn
0;Skaulo
0;Skebobruk
0;Skee
0;Skegrie
0;Skelleftehamn
0;Skellefteå
0;Skene
0;Skephult
0;Skepplanda
0;Skeppshult
0;Skillingaryd
0;Skillinge
0;Skillingsfors
0;Skinnskatteberg
0;Skivarp
0;Skog
0;Skoghall
0;Skogstorp
0;Skogås
0;Skokloster
0;Skorped
0;Skottorp
0;Skruv
0;Skultuna
0;Skummeslövsstrand
0;Skurup
0;Skutskär
0;Skyllberg
0;Skyttorp
0;Skå
0;Skånes Fagerhult
0;Skåne-Tranås
0;Skåpafors
0;Skällinge
0;Skälvik
0;Skänninge
0;Skärblacka
0;Skäret
0;Skärhamn
0;Skärholmen
0;Skärplinge
0;Sköldinge
0;Sköllersta
0;Sköndal
0;Skövde
0;Slagnäs
0;Slite
0;Slottsbron
0;Slussfors
0;Slutarp
0;Slättåkra
0;Slöinge
0;Smedjebacken
0;Smedstorp
0;Smygehamn
0;Smålandsstenar
0;Smögen
0;Snesudden
0;Solberg
0;Solberga
0;Sollebrunn
0;Sollefteå
0;Sollenkroka Ö
0;Sollentuna
0;Sollerön
0;Solna
0;Sommen
0;Sorsele
0;Sorunda
0;Sparreholm
0;Sparsör
0;Spekeröd
0;Spånga
0;Staffanstorp
0;Stallarholmen
0;Stavsjö
0;Stavsnäs
0;Stavsudda
0;Stehag
0;Stenhamra
0;Steninge
0;Steningehöjden
0;Stenkullen
0;Stensele
0;Stensjön
0;Stenstorp
0;Stenungsund
0;Stigen
0;Stigtomta
0;Stillingsön
0;Stjärnhov
0;Stjärnsund
0;Stoby
0;Stocka
0;Stockamöllan
0;Stockaryd
0;Stockholm
0;Stockholm-Arlanda
0;Stockholm-Globen
0;Stocksund
0;Stora Blåsjön
0;Stora Höga
0;Stora Levene
0;Stora Mellösa
0;Stora Skedvi
0;Stora Sundby
0;Stora Vika
0;Storebro
0;Storfors
0;Storlien
0;Storseleby
0;Storsjö Kapell
0;Storsund
0;Storuman
0;Storvik
0;Storvreta
0;Storå
0;Strandbaden
0;Strandudden
0;Stråssa
0;Stråtjära
0;Stråvalla
0;Strängnäs
0;Strömsbergs Bruk
0;Strömsbruk
0;Strömsholm
0;Strömsnäsbruk
0;Strömstad
0;Strömsund
0;Strövelstorp
0;Stugun
0;Sturefors
0;Sturkö
0;Styrsö
0;Stånga
0;Ställdalen
0;Stöde
0;Stöllet
0;Sundborn
0;Sundbyberg
0;Sundsbruk
0;Sundsvall
0;Sunhultsbrunn
0;Sunnansjö
0;Sunne
0;Sunnemo
0;Surahammar
0;Surte
0;Svalöv
0;Svanavattnet
0;Svaneholm
0;Svanesund
0;Svanskog
0;Svappavaara
0;Svartsjö
0;Svartå
0;Svedala
0;Sveg
0;Svenljunga
0;Svensbyn
0;Svenshögen
0;Svenstavik
0;Svängsta
0;Svärdsjö
0;Svärtinge
0;Sydkoster
0;Sysslebäck
0;Sågmyra
0;Såtenäs
0;Säffle
0;Sälen
0;Särna
0;Särö
0;Säter
0;Sätila
0;Sävar
0;Säve
0;Sävedalen
0;Sävsjö
0;Sävsjöström
0;Söderala
0;Söderby
0;Söderbärke
0;Söderfors
0;Söderhamn
0;Söderköping
0;Södertälje
0;Söderåkra
0;Södra Sandby
0;Södra Sunderbyn
0;Södra Vi
0;Sölvesborg
0;Sörberge
0;Sörbygden
0;Sörsjön
0;Söråker
0;Sösdala
0;Sövde
0;Taberg
0;Tallåsen
0;Tandsbyn
0;Tanumshede
0;Tavelsjö
0;Teckomatorp
0;Tenhult
0;Tibro
0;Tidaholm
0;Tidan
0;Tierp
0;Timmele
0;Timmernabben
0;Timmersdala
0;Timrå
0;Tingsryd
0;Tingstäde
0;Tived
0;Tjockö
0;Tjureda
0;Tjurkö
0;Tjällmo
0;Tjörnarp
0;Tobo
0;Toftbyn
0;Tolg
0;Tollarp
0;Tollered
0;Tomelilla
0;Tommarp
0;Tomteboda
0;Torekov
0;Torestorp
0;Torhamn
0;Tormestorp
0;Torna-Hällestad
0;Torpsbruk
0;Torpshammar
0;Torsby
0;Torshälla
0;Torslanda
0;Torsåker
0;Torsås
0;Torsö
0;Torup
0;Tostared
0;Totebo
0;Tranemo
0;Transtrand
0;Tranås
0;Traryd
0;Trehörningsjö
0;Trekanten
0;Trelleborg
0;Trensum
0;Trollhättan
0;Trosa
0;Trångsund
0;Trångsviken
0;Tråvad
0;Trädet
0;Träslövsläge
0;Trönödal
0;Tullinge
0;Tumba
0;Tun
0;Tungelsta
0;Tving
0;Tvååker
0;Tvärred
0;Tvärålund
0;Tygelsjö
0;Tynningö
0;Tyresö
0;Tyringe
0;Tystberga
0;Tågarp
0;Täby
0;Täfteå
0;Tällberg
0;Tänndalen
0;Tännäs
0;Tärendö
0;Tärnaby
0;Tärnsjö
0;Tävelsås
0;Töcksfors
0;Töllsjö
0;Töre
0;Töreboda
0;Tösse
0;Ucklum
0;Uddebo
0;Uddeholm
0;Uddevalla
0;Ugglarp
0;Ullared
0;Ullatti
0;Ullånger
0;Ulricehamn
0;Ulrika
0;Ulvöhamn
0;Umeå
0;Undenäs
0;Undersåker
0;Undrom
0;Unnaryd
0;Upphärad
0;Upplands Väsby
0;Uppsala
0;Urshult
0;Ursviken
0;Uråsa
0;Utansjö
0;Uttran
0;Utö
0;Vadstena
0;Vaggeryd
0;Vagnhärad
0;Valbo
0;Valdemarsvik
0;Valla
0;Vallberga
0;Vallda
0;Vallentuna
0;Vallsta
0;Vallvik
0;Vallåkra
0;Valsjöbyn
0;Valskog
0;Vankiva
0;Vansbro
0;Vara
0;Varberg
0;Varekil
0;Vargön
0;Varnhem
0;Vartofta
0;Vassmolösa
0;Vattholma
0;Vaxholm
0;Veberöd
0;Veddige
0;Vederslöv
0;Vedevåg
0;Vedum
0;Vega
0;Vegby
0;Veinge
0;Vejbystrand
0;Vellinge
0;Vemdalen
0;Vemhån
0;Vena
0;Vendelsö
0;Venjan
0;Vessigebro
0;Vetlanda
0;Vettasjärvi
0;Vidsel
0;Vikarbyn
0;Vikbolandet
0;Viken
0;Vikingstad
0;Vikmanshyttan
0;Viksjö
0;Viksjöfors
0;Vilhelmina
0;Villands Vånga
0;Villshärad
0;Vilshult
0;Vimmerby
0;Vinberg
0;Vindelgransele
0;Vindeln
0;Vingåker
0;Vinninga
0;Vinslöv
0;Vintrie
0;Vintrosa
0;Virestad
0;Virsbo
0;Virserum
0;Visby
0;Visingsö
0;Viskafors
0;Vislanda
0;Vissefjärda
0;Visseltofta
0;Vistträsk
0;Vitaby
0;Vittangi
0;Vittaryd
0;Vittinge
0;Vittsjö
0;Vittskövle
0;Vitå
0;Vollsjö
0;Vormsele
0;Voxnabruk
0;Vrena
0;Vreta Kloster
0;Vretstorp
0;Vrigstad
0;Vrångö
0;Vuollerim
0;Vålberg
0;Vålådalen
0;Våmhus
0;Vårby
0;Vårgårda
0;Våxtorp
0;Väckelsång
0;Väddö
0;Väderstad
0;Väja
0;Väjern
0;Vällingby
0;Vänersborg
0;Vänersnäs
0;Vänge
0;Vännäs
0;Vännäsby
0;Värends Nöbbele
0;Väring
0;Värmdö
0;Värmlands Nysäter
0;Värmskog
0;Värnamo
0;Värsås
0;Väröbacka
0;Väse
0;Västerfärnebo
0;Västerhaninge
0;Västerlanda
0;Västerljung
0;Västervik
0;Västerås
0;Västra Frölunda
0;Västra Karup
0;Västra Näshulta
0;Västra Torup
0;Västra Tunhem
0;Västra Ämtervik
0;Vätö
0;Växjö
0;Ydre
0;Yngsjö
0;Ystad
0;Ytterby
0;Ytterhogdal
0;Yxlan
0;Zinkgruvan
0;Åby
0;Åhus
0;Åkarp
0;Åkers Styckebruk
0;Åkersberga
0;Ålberga
0;Åled
0;Ålem
0;Åmmeberg
0;Åmotfors
0;Åmotsbruk
0;Åmsele
0;Åmål
0;Ånge
0;Ånimskog
0;Ånäset
0;Åre
0;Årjäng
0;Årsta
0;Årsta Havsbad
0;Årsunda
0;Åryd
0;Ås
0;Åsa
0;Åsarna
0;Åsarp
0;Åsbro
0;Åseda
0;Åsele
0;Åsenhöga
0;Åsensbruk
0;Åshammar
0;Åskloster
0;Åsljunga
0;Åstol
0;Åstorp
0;Åtorp
0;Åtvidaberg
0;Älandsbro
0;Älekulla
0;Älgarås
0;Älghult
0;Älmeboda
0;Älmestad
0;Älmhult
0;Älta
0;Älvdalen
0;Älvkarleby
0;Älvsbyn
0;Älvsered
0;Älvsjö
0;Älvängen
0;Äng
0;Ängelholm
0;Ängelsberg
0;Äppelbo
0;Ärla
0;Äspered
0;Äsperöd
0;Ätran
0;Öckerö
0;Ödeborg
0;Ödeshög
0;Ödskölt
0;Ödsmål
0;Ödåkra
0;Öje
0;Öjebyn
0;Öjersjö
0;Ölsremma
0;Önnestad
0;Ör
0;Örby
0;Örbyhus
0;Örebro
0;Öregrund
0;Örkelljunga
0;Örnsköldsvik
0;Örsjö
0;Örsundsbro
0;Örträsk
0;Örviken
0;Ösmo
0;Össjö
0;Östansjö
0;Östavall
0;Österbybruk
0;Österfärnebo
0;Österhaninge
0;Österskär
0;Östersund
0;Östervåla
0;Östhammar
0;Östmark
0;Östra Frölunda
0;Östra Karup
0;Östra Ljungby
0;Östra Ryd
0;Östra Sönnarslöv
0;Östra Ämtervik
0;Överhörnäs
0;Överkalix
0;Överlida
0;Övertorneå
0;Överturingen
0;Överum
0;Övre Soppero
0;Öxabäck
0;Öxnevalla