5370;1:e Fartygsingenjör/1:e Maskinist;3151
5371;2:e Fartygsingenjör/2:e Maskinist;3151
5369;2:e Styrman;3152
7441;2D-grafiker;2173
7439;3D-grafiker;2173
2315;Abonnemangsförsäljare;5242
4896;Abonnemangskontorist;4222
6728;Account manager;3322
6534;Accounting controller;2412
3826;AD-assistent;3432
2787;Administrativ assistent;4119
5373;Administrativ chef;1290
4713;Administrativ utvecklare;2421
6032;Advokat;2611
4421;Advokatfiskal;2619
2799;Advokatsekreterare;3342
6670;Affischör/Affischuppsättare;9629
7319;Affärsarkitekt;2511
4004;Affärsjurist;2614
7579;Affärskonsult, IT;2511
4880;Affärsområdeschef;1120
683;Affärsresesäljare;4221
7661;Affärsutvecklare;2421
6264;Agronom;2134
5165;Akademisekreterare;2422
3581;Akrobat;3439
2526;Aktieanalytiker;2413
7554;Aktiechef;1610
2527;Aktiemäklare;3311
6655;Aktuarie;2121
7472;Akupressör;3230
1623;Akupunktör;3230
5758;Akutsjuksköterska/Sjuksköterska, akutmottagning;2226
2373;Akvariefiskuppfödare;6221
1482;Alkohol- och drogterapeut;3411
3143;Allmän åklagare;2613
4462;Ambassadråd;1230
4463;Ambassadsekreterare;2422
2005;Ambassadör;1112
1811;Ambulanssjuksköterska;2226
5708;Ambulanssjukvårdare;5326
1126;Ammoniakkokare;8132
1836;Analytisk kemist;2113
7690;Anbudsansvarig/ Bid Manager;2431
1812;Anestesisjuksköterska;2223
3920;Anfångare;7319
7638;Anhörigkonsulent;3411
4804;Animationsoperatör;3521
3829;Animatör;2173
2855;Anläggningsdykare;7115
4221;Anläggningsingenjör, elkraft;3113
4898;Annonsassistent;4114
2303;Annonschef;3339
4652;Annonsgrafiker;7321
2304;Annonskonsulent;3339
4900;Annonsmottagare;4114
3866;Annonsproducent;2432
4901;Annonssekreterare;4114
7316;Anonym konsument;5169
2864;Anrikningsarbetare, malm;8112
6654;Antagningschef, utbildning;1410
1884;Antagningssekreterare, utbildning;2422
2456;Antikvarie;2621
4036;Antropolog;2623
6528;Användbarhetsdesigner;2512
6529;Användbarhetsexpert;2512
5056;Apoteksassistent;5227
7508;Apotekschef;1730
6359;Apotekstekniker;5227
84;Applikationsingenjör;2143
7577;Applikationskonsult;2512
7576;Applikationsutvecklare/Apputvecklare;2512
6653;Arbetsförmedlare;3333
5127;Arbetsförmedlingschef;1590
4205;Arbetsledare, anläggning;3121
4227;Arbetsledare, elkraft;8191
7111;Arbetsledare, golv;3121
4296;Arbetsledare, gruvbrytning-metallproduktion;3121
4185;Arbetsledare, husbyggnad;3121
7573;Arbetsledare, lager;4321
4263;Arbetsledare, maskintillv.-verkstadsprodukter;3122
7110;Arbetsledare, mureri;3121
7109;Arbetsledare, måleri;3121
7404;Arbetsledare, rivning;3121
4640;Arbetsledare, skogsbruk;6210
444;Arbetsledare, städ/Städledare;5151
4249;Arbetsledare, tillverkning elektroniska prod.;3122
4228;Arbetsledare, tillverkning elkrafttekniska prod.;3122
4282;Arbetsledare, tillverkning kemiska produkter;3122
4309;Arbetsledare, tillverkning textil-träprod.;3122
7372;Arbetsledare, tryckeri;3122
7141;Arbetsledare, ventilation;3121
7142;Arbetsledare, VVS;3121
4563;Arbetsledare,trädgård/Trädgårdsanläggningsförman;6113
4465;Arbetsmarknadsråd;1230
610;Arbetsmiljöingenjör;2181
6652;Arbetsmiljöinspektör;2181
1467;Arbetspsykolog;2241
6254;Arbetsrättsjurist;2614
5728;Arbetsterapeut;2273
1546;Arbetsterapibiträde;5349
6769;Arborist/Trädvårdare;6113
5999;Arborrare;7223
1339;Arkare;8172
6041;Arkeolog;2623
5445;Arkitekt;2161
5898;Arkivarie;2622
5902;Arkivassistent;4410
4454;Arkivchef;1590
2435;Arkivföreståndare;2622
2466;Arkivkanslist;4410
2436;Arkivråd;2622
7364;Arkoffsettryckare;7322
4154;Armerare, betongvaruindustri;8114
7606;Aromaterapeut;3230
3351;Arrangör, musik;2652
4625;Arrendator, blandad drift;6130
6434;Arrendator, djuruppfödning;6121
7459;Arrendator, växtodling;6111
7443;Arrestantvakt/Arrestvakt;5412
6193;Art Director/AD;2172
2994;Artistagent;3339
2995;Artistbokare;3339
6015;Artistförmedlare;3339
6897;ARU, ansvarig reklamutgivare;1240
4079;Asbestsanerare;7134
4147;Asfaltarbetare;8114
4148;Asfaltkokare;8114
4149;Asfaltmaskinist;8114
6205;Asfaltverksskötare;8114
3118;Assessor;2612
1780;Assistent i församlingsarbete;3423
4888;Assistent, bostadsförmedling;4119
3144;Assistentåklagare;2613
1766;Astronom;2111
4924;Ateljéchef;1240
1414;Ateljésömmerska;7531
7236;AT-läkare;2213
1767;Atomfysiker;2111
4466;Attaché;2422
3900;Attributör;3433
1548;Audiometris;5349
5732;Audionom;2283
5947;Auktionist;3339
4117;Auktionsbiträde;9629
2736;Auktionskommissarie;3339
2737;Auktionsutropare;3339
7133;Automationselektriker;7412
7284;Automationsingenjör, elkraft;2143
7677;Automationsingenjör, gruvteknik och metallurgi;3116
7289;Automationsingenjör, maskin;2144
7286;Automationstekniker, el;3113
7287;Automationstekniker, elektronik;3113
7288;Automationstekniker, maskin;3114
7496;Automationstekniker, tillverkningsindustri;3114
2700;Automatpressare, metall;7223
5985;Automatskötare;9629
2639;Automatställare;7223
2692;Automatsvarvare;7223
6280;Avbytare, jordbruk;6111
2962;Avdelningschef, bank;3312
4925;Avdelningschef, butik;5221
7675;Avdelningschef, gruva;1360
6392;Avdelningschef, kommun;1230
7302;Avdelningschef, landsting;1230
7406;Avdelningschef, smältverk;3122
6263;Avdelningschef, statlig;1230
3000;Avgjutare;8129
1217;Avionikmekaniker;7311
516;Avisningsmaskinförare;8342
2883;Avloppstekniker;7134
3081;Avlöningskontorist;4112
3966;Avplockare, keramikbränning;9320
378;Avsmakare;7613
4155;Avsynare, betongvaror;8114
305;Avsynare, elkrafttekniska produkter;8212
306;Avsynare, elteknik;8212
304;Avsynare, el-tele;8212
2935;Avsynare, gjutgods;7224
3239;Avsynare, glas- och keramikprodukter;7319
6003;Avsynare, metallprodukter;7224
964;Avsynare, musikinstrument;7319
4392;Avsynare, pappersprodukter;8143
1318;Avsynare, tyger;8151
5208;AV-tekniker;3522
6943;Avverkningsledare, skogsbruk;2135
7607;Ayurvedamassör/Ayurvedaterapeut;3230
7632;Backend-utvecklare;2512
7557;Backofficepersonal;4113
2901;Badbevakare;5419
1549;Baderska, sjukhem;5349
386;Badföreståndare;1740
5496;Badmästare;5419
5990;Badvakt;5419
7371;Badvaktmästare;5152
5504;Bagare/Konditor;7612
7447;Bagerichef;7612
4742;Bakteriolog;2131
5406;Balettmästare;2653
5564;Ballongflygare;3153
5286;Balpressare;8181
7170;Banarbetare, utan behörighetsbevis;7114
7214;Bandlastarförare;8342
7213;Bandschaktarförare;8342
4351;Bandsågare;8173
2707;Bandsågare, metall;7223
1341;Bandsågare, träfiberskivor;8173
1303;Bandvävare;8159
6650;Bangårdsoperatör;8312
4881;Bankdirektör;1120
6178;Bankjurist;2614
5033;Banområdeschef;1320
2319;Bantekniker;7114
2122;Baptistpastor;3412
7339;Barchef;5132
6762;Barista/Kaffebartender;5132
496;Barkmaskinskötare, skogsbruk;8341
744;Barkmaskinskötare, sågverk;8173
6763;Barmästare;5132
438;Barnflicka/Barnvakt;9119
5701;Barnmorska;2222
6648;Barnmorska, förlossning;2222
7272;Barnmorska, ungdomsmottagning;2222
1433;Barnmorska, vårdavdelning/BB-avdelning;2222
1434;Barnmorska, öppen vård/mödravård;2222
6473;Barnombudsman;1112
1468;Barnpsykolog;2241
5759;Barnsjuksköterska;2232
7273;Barnsjuksköterska, akutmottagning;2232
1820;Barnsjuksköterska, mottagning/vårdcentral;2232
1821;Barnsjuksköterska, vårdavdelning;2232
5716;Barnskötare;5311
7419;Barnsköterska;5325
1475;Barnterapeut;2242
1777;Barntimmeledare;5311
5488;Bartender;5132
314;Batteriarbetare/Ackumulatorarbetare;8212
7271;Baxare;9332
5313;Bebyggelseantikvarie;2621
7648;Befaren maskinpersonal, sjöfart;7233
1443;Befolkningsstatistiker;2122
2774;Befraktare;3331
5368;Befälhavare;3152
1205;Befälhavare, kustbevakningen;3351
257;Begravningsassistent;5161
258;Begravningsbyråföreståndare;5161
5497;Begravningsentreprenör;5161
6880;Begravningsrådgivare;5161
5711;Behandlingsassistent/Socialpedagog;3411
4031;Belysningsmästare;3522
3535;Belysningstekniker;3522
2325;Beläggningsarbetare;7114
7169;Beläggningsarbetare, utan yrkesbevis;7114
505;Beläggningsmaskinförare;8342
3921;Ben- och fotanfångare;7319
3922;Benmakare;7319
5852;Bensinstationsbiträde/Servicebiträde;5225
7161;Bensinstationsföreståndare/Stationschef;5221
5694;Bergarbetare;8111
1376;Bergarbetare, gruva;8111
7171;Bergarbetare, utan yrkesbevis;8111
7256;Bergförstärkare;8111
1826;Berggrundsgeolog;2114
7250;Berglastare;8111
187;Bergsingenjör;2146
1389;Bergsprängare;8115
4222;Beräkningsingenjör, elkraft;3113
77;Beräkningsingenjör, el-tele;2143
377;Besiktningsassistent;7613
164;Besiktningsingenjör;3354
625;Besiktningsingenjör, bilprovning;3354
4243;Besiktningsingenjör, elkraft;3113
96;Besiktningsingenjör, el-tele;2143
2565;Besiktningsingenjör, försäkring;3314
5920;Besiktningsman/Skadeinspektör, försäkring;3314
624;Besiktningstekniker, bilprovning;3354
470;Bespisningsbiträde/Skolmåltidsbiträde;9412
2982;Beställningsfaktor;3339
4903;Beställningskontorist;4115
5375;Besöksbokare/Kundbokare;4222
5499;Betjänt;5169
5810;Betongarbetare;7113
7172;Betongarbetare, utan yrkesbevis;7113
6204;Betongblandare;8114
7191;Betongelementmontör;7119
5862;Betonghåltagare;7113
7175;Betonghåltagare, utan yrkesbevis;7113
4143;Betongstationskötare;8114
6207;Betongvaruarbetare;8114
5899;Bibliotekarie;2622
5901;Biblioteksassistent;4410
6262;Bibliotekschef;1590
2446;Bibliotekskonsulent;2622
5673;Bilbärgare;8332
4653;Bild- och reprografiker;7321
2438;Bildarkivarie;2622
2959;Bildemontör;9610
6257;Bildingenjör;3521
6186;Bildmixer;3521
7022;Bildpedagog;2359
4806;Bildproducent;3521
3890;Bildredaktör;2642
1624;Bildterapeut;2289
5854;Bilförsäljare;5223
2361;Bilglasmontör;7124
5580;Bilinspektör;3354
7688;Biljettkontrollör;4221
5973;Bilplåtslagare/Bilskade- och karosserireparatör;7214
396;Bilrekonditionerare;9120
2566;Bilskadeinspektör, försäkring;3314
2559;Bilskadereglerare;3314
4348;Biltapetserare;7533
7363;Biltestkoordinator;4323
2306;Biluthyrare;5226
397;Bilvårdare/Garagearbetare;9120
7074;BING, film/TV;3521
2250;Bingofunktionär/Bingovärd/Bingovärdinna;4211
5044;Biodlare/Biskötare;6129
6119;Biografmaskinist;3521
4126;Biografvaktmästare;9622
6902;Bioinformatiker;2131
1837;Biokemist;2113
6305;Biolog;2131
6906;Biomedicinare;2133
5734;Biomedicinsk analytiker;3212
1444;Biostatistiker;2122
6836;Biståndsbedömare/Biståndshandläggare;2663
7450;Biträdande butikschef;5221
7563;Biträdande förskolechef;1420
5399;Biträdande jurist;2619
7297;Biträdande rektor;1410
7466;Biträdande universitetslektor;1120
925;Blandarskötare, sprängämnesindustri;8132
926;Blandningsuppvägare, sprängämnen;8132
876;Blanksticksgravör;7312
3240;Blockgjutare;7319
4548;Blomsterodlare;6112
4655;Blysättare, tryckeri;7321
3017;Blåsare, stålverk;8193
5633;Blåsinstrumentmakare;7319
5838;Blästrare;7134
3939;Blästrare, glas;7319
4393;Blöjmaskinskötare;8143
5222;Boendechef, kommun;1520
5804;Boendeföreståndare, kommunal;1520
6686;Bohags- och flyttbilsförare;8332
4700;Bokbindare;7323
5672;Bokbussförare;8332
2895;Bokförare;4111
3070;Bokföringskontorist;4111
5063;Bokförläggare;1120
6181;Bolagsjurist;2614
6881;Borgerlig officiant;5161
1377;Borrare, gruva;8111
5938;Borrare, metall;7223
4352;Borrare, trä;7523
1390;Borrförman, berg;3121
7674;Borrkärnshanterare;8111
370;Borrledare, petroleumutvinning;3116
7610;Borrtekniker;8113
6325;Bostadsförmedlare;4119
2578;Bostadsförvaltare;3335
2580;Bostadsintendent;3335
4743;Botaniker;2132
2791;Boupptecknare;3342
5964;Boutredare;3342
2792;Boutredningsman;3342
6858;Bovärd/Fastighetsvärd/Husvärd;5152
5905;Brandbefäl/Räddningsledare/Insatsledare;5411
6647;Brandchef;1590
5567;Brandingenjör;3355
562;Brandinspektör;3355
5904;Brandman;5411
2560;Brandskadereglerare;3314
4080;Brandskadesanerare;7134
7513;Brandskyddsmålare;7132
564;Brandtekniker;3355
7623;Bredbandsinstallatör;8212
5830;Brevbärare;4420
3224;Brodös;7532
1395;Brottarbetare;8111
3156;Brottmålsadvokat;2611
2506;Brovakt;4323
5982;Brunnsborrare;8113
5661;Bryggeriarbetare;8169
1176;Brygghusarbetare;8169
5423;Bryggmästare;3122
1378;Brytare, gruva;8111
1396;Brytare, stenbrott;8111
3976;Brännare, glas, keramik;8189
1178;Brännmästare;3122
1179;Brännvinsbrännare;8169
4332;Budbilsförare;8329
6841;Buddhistpräst;2671
7467;Budget- och skuldrådgivare;2419
3071;Budgetassistent;4111
5069;Budgetchef;1210
4844;Budgetplanerare;2412
4845;Budgetsekreterare;2419
6533;Business controller;2412
5561;Bussförare/Busschaufför;8331
698;Bussguide;5113
598;Bussmekaniker;7231
4927;Butiksansvarig;5221
6646;Butikschef;1730
2289;Butiksdemonstratör;5241
4171;Butiksinspektör;5419
7211;Butikskommunikatör/Visual merchandiser;3432
5950;Butikskonsulent;3339
2475;Butikskontrollant;5413
5357;Butikssäljare, fackhandel;5223
2284;Butikssäljare/Medarbetare, dagligvaror;5222
6687;Bygg- och anläggningsförare;8332
7483;Byggledare;3112
7628;Bygglovshandläggare;3355
6369;Byggmästare;1360
4179;Byggnadsingenjör;3112
5586;Byggnadsinspektör;3355
2983;Byggnadskalkylator/Anbudsingenjör;3112
6645;Byggnadskonstruktör;3112
4180;Byggnadskonsult;3112
642;Byggnadskontrollant;3355
5972;Byggnadsplåtslagare;7213
4467;Byggnadsråd;2422
2615;Byggnadssmed;7221
449;Byggstädare;9111
4468;Byråchef;1340
2567;Båtbesiktningsman;3314
5815;Båtbyggare;7522
2282;Båtförsäljare;5223
2092;Båtinredare;7522
4047;Båtman, Sjöfartsverket;3152
2568;Båtskadeinspektör;3314
4086;Båtsman/Bås;8350
786;Båtvärdinna;5111
2629;Bänkarbetare;7222
2856;Bärgningsdykare;7115
4536;Bärodlare;6111
6810;Bärplockare;9210
4328;Bössmakare;7311
463;Cabin stewardess/Hyttvärdinna;9111
4929;Campingplatsföreståndare;4224
5936;Cateringarbetare;9412
4152;Cementbrännare;8114
3953;Centrifugoperatör, glas;8189
7449;Centrumledare;1730
7489;Centrumutvecklare/Handelsutvecklare;1250
2285;Charkuteriarbetare, butik;5222
7592;Charkuteriarbetare, slakteri;7611
5502;Charkuterist;7611
688;Charterresesäljare;4221
7555;Chef för valuta och fixed income;1610
7517;Chef inom kyrkogårdsförvaltningen;1230
7553;Chef, Corporate Finance;1610
6363;Chefredaktör;1120
1593;Chefsarbetsterapeut;2273
7560;Chefsbarnmorska;1510
217;Chefskock;3451
5960;Chefssekreterare;3343
1451;Chefssjuksköterska;1510
3145;Chefsåklagare;2613
5425;CIO, Chief Information Officer/IT-chef;1310
6106;Cirkelledare/Studiecirkelledare;3449
6095;Cirkusartist;3439
5622;Ciselör;7312
5975;Cisternreparatör;7214
2835;Cisternvårdare;7214
7448;Cityledare;1250
6644;Civilförsvarschef;1112
6497;Civilingenjör, anläggning;2142
6472;Civilingenjör, anläggning, elkraft;2143
7106;Civilingenjör, bioteknik;2131
6508;Civilingenjör, bygg;2142
6494;Civilingenjör, byggnadskonstruktion;2142
6470;Civilingenjör, drift och underhåll, elkraft;2143
6506;Civilingenjör, elkraft;2143
6505;Civilingenjör, el-tele;2143
6900;Civilingenjör, energi;2144
7427;Civilingenjör, farkostteknik;2144
7263;Civilingenjör, forskning inom bygg/anläggning;2142
6804;Civilingenjör, forskning/utveckling, kemi;2145
6491;Civilingenjör, hamn;2142
7268;Civilingenjör, järnväg;2142
6894;Civilingenjör, kemi;2145
6500;Civilingenjör, kemiteknik;2145
6460;Civilingenjör, konstruktion, elektronik;2143
6468;Civilingenjör, konstruktion, elkraft;2143
6456;Civilingenjör, konstruktion, maskin;2144
6467;Civilingenjör, kontroll, elkraft;2143
6458;Civilingenjör, kvalitet, elektronik;2143
6466;Civilingenjör, kvalitet, elkraft;2143
6449;Civilingenjör, kvalitet, kemiteknik;2145
6446;Civilingenjör, kvalitet, metallurgi;2146
6502;Civilingenjör, lantmäteri;2164
6504;Civilingenjör, maskin;2144
7378;Civilingenjör, medicinsk teknik;2143
4720;Civilingenjör, organisationsutveckling;2421
6447;Civilingenjör, process, kemiteknik;2145
6459;Civilingenjör, produktion, elektronik;2143
6463;Civilingenjör, produktion, elkraft;2143
6445;Civilingenjör, produktion, gruv, metallurgi;2146
6453;Civilingenjör, produktion, maskin;2144
6509;Civilingenjör, systemutveckling;2512
7318;Civilingenjör, teknisk fysik;2149
7491;Civilingenjör, tillverkningsindustri;2144
6485;Civilingenjör, trafik;2142
6450;Civilingenjör, VVS;2144
6483;Civilingenjör, väg;2142
6484;Civilingenjör, väg- och vattenbyggnad;2142
2569;Civilskadeinspektör;3314
2561;Civilskadereglerare;3314
3582;Clown;3439
7614;CNC-operatör, trä;7523
6004;CNC-operatör/FMS-operatör;7223
6850;Coldsettryckare;7322
7684;Colorist;3521
7689;Configuration Manager/CM;2511
6318;Controller;2412
6156;Copywriter;2432
7204;Creative director/CD;2179
5846;Croupier;4211
6882;Curator;2621
5577;Cykel- och mopedreparatör;7231
3470;Cykelbud;8329
4689;Cylindergravör;7321
6731;Cytodiagnostiker;3212
5717;Dagbarnvårdare;5311
240;Damfrisör;5141
2374;Dammskötare, fiskodling;6221
1415;Damskräddare;7531
6050;Dansare;2653
6383;Dansare, show;2653
6099;Danspedagog;2359
1625;Dansterapeut;2289
7135;Data Warehouse specialist;2512
5896;Databasadministratör;3513
2421;Databasdesigner;2512
2422;Databastekniker;3513
2423;Databasutvecklare;2512
7338;Dataingenjör;3113
3635;Datainstruktör;3449
6027;Dataoperatör;3511
3637;Datapedagog/IT-pedagog/Datautbildare;3449
5965;Dataregistrerare;4119
5944;Datasäkerhetsansvarig;2516
6677;Datorlingvist/Datalingvist;2519
2249;Dealer;4211
1342;Defibratorskötare;8173
6641;Degelmakare;7319
7246;Dekorationsmålare, bygg;3432
4062;Dekorationsmålare, glas;7319
4063;Dekorationsmålare, porslin;7319
3849;Dekorationsmålare, skyltning;3432
6152;Dekoratör;3432
4064;Dekoratör, keramik, glas;7319
3853;Dekormålare;3432
3940;Dekorslipare, glas;7319
5890;Delgivningsman;4212
1445;Demograf;2122
5857;Demonstratör;5241
2351;Demonteringsarbetare/Rivningsarbetare;7119
6006;Demontör/Återvinningsarbetare;9610
3722;Dentaltekniker;3214
6640;Departementschef;1111
6639;Departementsråd;1112
1890;Departementssekreterare;2422
6723;Deponiarbetare;9610
733;Depåförare, spårburen trafik;8312
5284;Depåman/Depåtekniker;4322
7673;Depåtekniker, prospektering;3119
7630;Designassistent;2179
3305;Designer;2179
4656;Desktopoperatör;7321
1129;Destruktionsmaskinist;8132
5808;Diakon;2672
1955;Dietetiker;2131
5769;Dietist;2282
218;Dietkock/Dietkokerska;5120
6835;Digitaltryckare;7322
2788;Direktionssekreterare;3343
4386;Direktris/Garment technician/Mönsterkonstruktör;7531
6059;Dirigent;2652
6792;Discjockey;3439
5556;Diskare;9412
4949;Diskrimineringsombudsman;1112
3638;Dispatcher;3512
2189;Distributionsassistent;4323
5116;Distributionschef;1320
384;Distributionschef, energi;1370
5616;Distributionselektriker;7413
534;Distributionsförare;8332
1435;Distriktsbarnmorska;2222
7308;Distriktschef, bilprovning;1790
6945;Distriktschef, skogsbruk;1380
3485;Distriktsinstruktör/Distriktstränare;3422
3486;Distriktskonsulent;3422
5760;Distriktssköterska;2224
3647;Distriktsstudieledare;3449
1847;Distriktsveterinär;2250
3146;Distriktsåklagare;2613
7624;DIT (Digital Imaging Technician);3521
5987;Diversearbetare;9629
4821;Djuptryckare;7322
4686;Djuptrycksetsare;7321
4687;Djuptrycksgalvanisör;7321
1848;Djurhälsoveterinär;2250
5768;Djursjukskötare;3240
1914;Djurskyddsinspektör;2182
6285;Djurskötare, djurpark;6129
6279;Djurskötare, djuruppfödning;6121
6282;Djurskötare, fjäderfä;6121
6433;Djurskötare, får;6121
6427;Djurskötare, gris;6121
6281;Djurskötare, häst;6121
7460;Djurskötare, mjölk;6121
6694;Djurtransportförare;8332
7580;Djurvårdare;6129
4401;Dockmakare;7319
6053;Dockspelare;3439
7082;Dockteaterpedagog;2359
7589;Doktorand;2314
5903;Dokumentalist;2622
6030;Domare;2612
2112;Domprost;2671
3120;Domstolsjurist;2612
7401;Domstolssekreterare;3342
2159;Dopplackerare;7132
5634;Dragspelsbyggare;7319
956;Dragspelsreparatör;7319
3654;Dramalärare/Dramapedagog;2359
3873;Dramatiker;2641
3874;Dramaturg;2641
3242;Drejare;7319
7262;Drift- och underhållsingenjör, anläggning;3112
7114;Drift- och vägunderhållsarbetare;7114
5434;Driftchef, data;1310
5539;Driftchef, energi;1370
6811;Driftchef, fastighet;5152
5097;Driftchef, lantbruk;6111
7242;Driftchef, skogsbruk;1380
6378;Driftchef, trädgård;6112
385;Driftchef, VA;1370
796;Driftelektriker;7412
4229;Driftingenjör, elkraft;3113
7279;Driftingenjör, el-tele;3113
115;Driftingenjör, maskin;2144
4264;Driftingenjör, reningsverk;3114
4265;Driftingenjör, vattenverk;3114
4266;Driftingenjör, värmeverk;3114
3712;Driftkopplingstekniker;3522
3097;Driftledare, IT;3511
5098;Driftledare, lantbruk;6111
6778;Driftledare, skogsbruk;1380
278;Driftmaskinist, reningsverk;8191
5506;Driftmaskinist, värmeverk;8191
797;Driftmontör, elkraft;7413
5431;Drifttekniker, data;3511
280;Drifttekniker, förbränningsstation;8191
6637;Drifttekniker, värmeverk;8191
5979;Dykare;7115
7640;Dykinstruktör;3422
294;Däckmontör/Däck- och hjulmekaniker;8213
5649;Däcksbyggare;8141
4129;Dörrvakt;5413
1984;Dövblindkonsulent;2422
1985;Dövkonsulent;2422
7043;Efterbearbetningsredaktör;2642
4744;Ekolog;2183
3210;Ekonometriker;2415
6024;Ekonomiassistent;4111
237;Ekonomibiträde, fartyg;9412
472;Ekonomibiträde, storhushåll;9412
6367;Ekonomichef;1210
5071;Ekonomidirektör/Finanschef;1210
5478;Ekonomiföreståndare;3452
4721;Ekonomikonsult;2421
3072;Ekonomikontorist;4111
5072;Ekonomiledare;1210
2356;Ekotoxikolog;2133
291;Eldare;8191
4032;Elektriker, film/TV;3522
7072;Elektrikerassistent, film/TV;3522
3019;Elektrodskötare;8193
1130;Elektrofilterskötare;8132
798;Elektromekaniker;7412
7327;Elektronikkonstruktör;3113
307;Elektronikmontör;8212
842;Elektronikreparatör;7420
6724;Elektroniksanerare;7134
363;Elektrotekniker;3113
5718;Elevassistent;5312
6415;Elingenjör;3113
5365;Elingenjör, fartyg/Fartygseltekniker;3151
4223;Elkonstruktör;3113
4230;Elkrafttekniker;3113
6412;Elmontör;8212
799;Elreparatör;7412
4231;Eltekniker;3113
7564;Eltekniker, järnväg/Kontaktledningsmontör;7413
5113;Elverkschef;1370
857;Elverksmontör;7413
4065;Emaljerare, keramik;7319
2160;Emaljerare, lackering;7132
877;Emaljör;7312
5265;Emballerare;8181
7097;Embryolog;2131
4048;Endestyrman;3152
7456;Energideklarerare/Energiexpert;3355
4736;Energirådgivare;3355
6521;Enhetschef inom social omsorg;1520
6522;Enhetschef inom socialtjänst;1520
2035;Enhetschef, hemtjänst/Områdeschef, hemtjänst;1530
7305;Enhetschef, hälso- och sjukvård;1510
7530;Enhetschef, offentlig förvaltning;1230
7600;Enterprise Architect;2511
3686;Entertainer;3439
4745;Entomolog;2132
7261;Entreprenadingenjör;3112
1850;Epizootolog;2250
3243;Epoxigjutare;8142
5579;Ergonom/Företagsgymnast;2181
7086;Estradör;3439
4037;Etnolog;2623
6825;Etolog;2132
6298;Etsare, tryckmedium;7321
7504;EU-handläggare;2422
5177;Eurytmist;2359
2123;Evangelist, resepastor;3412
7153;Eventproducent;3332
7535;Eventsäljare/Eventförsäljare;5241
2702;Excenterpressare/Pressoperatör, metallarbete;7223
7591;Excerpist;4410
4470;Expeditionschef, departement;1230
2804;Expeditionsföreståndare, sjukvård;4117
4131;Expeditionsvakt;5413
2173;Expeditör, spedition;4323
88;Experimentingenjör, el-tele;2143
181;Exploateringsingenjör;2164
2753;Exportspeditör;3331
4104;Extruderskötare, metall;8129
801;Fabrikselektriker;7412
7147;FAD (First assistant director);3433
3073;Fakturakontrollant;4111
5267;Falsare;8181
7375;Falsare, bokbinderi;7323
1795;Familjebehandlare;2662
1797;Familjehemssekreterare;2661
1970;Familjepedagog;2662
5788;Familjerådgivare/Familjeterapeut;2662
6251;Familjerättsjurist;2614
1798;Familjerättssekreterare;2661
1799;Familjevårdsinspektör;2661
1343;Fanerarbetare, fanertillverkning;8173
4353;Fanerare;7523
1344;Fanerpressare, fanertillverkning;8173
4354;Fanerskärare;7523
1597;Farmaceut/Apotekare;2281
6437;Farmaceut/Receptarie;3213
6194;Fartygsbefäl;3152
5618;Fartygselektriker;7412
5591;Fartygsinspektör;3354
207;Fartygsintendent;3452
2758;Fartygsklarerare;3331
132;Fartygskonstruktör;2144
2837;Fartygsplåtslagare;7215
4095;Fartygsreparatör;7233
451;Fartygsstädare;9111
2828;Fasadmontör;7119
7184;Fasadputsare;7119
7230;Fasadrengörare;7134
6636;Fastbränsleeldare;8172
2582;Fastighetsassistent;3335
6366;Fastighetschef;1350
5066;Fastighetsdirektör;1350
419;Fastighetsekonom;2419
2577;Fastighetsförmedlare;3335
5923;Fastighetsförvaltare;3335
6812;Fastighetsingenjör;3112
2584;Fastighetsinspektör;3335
2585;Fastighetsintendent;3335
4005;Fastighetsjurist;2614
2586;Fastighetskamrer;3335
7000;Fastighetsmäklarassistent;4114
5922;Fastighetsmäklare;3334
2587;Fastighetssekreterare;3335
5885;Fastighetsskötare/Fastighetsarbetare;5152
452;Fastighetsstädare;9111
2386;Fastighetstekniker/Drifttekniker, fastighet;5152
7362;FDO (Flight Data Operator);3154
7507;Fibertekniker/Optotekniker;7420
2439;Filmarkivarie;2622
4813;Filmklippare;3521
4662;Filmmontör, tryckeri;7321
3908;Filmpassare;3522
6313;Filmredigerare;3521
5209;Filmtekniker;3521
3817;Filosof, forskare;2623
6532;Financial controller;2412
1233;Finansanalytiker;2413
5669;Finansekonom;2413
1234;Finanskonsult;2413
1218;Finmekaniker;7311
953;Fiolbyggare;7319
3121;Fiskal;2612
5883;Fiskare;6222
699;Fiskeguide;5113
4746;Fiskeribiolog;2132
4533;Fiskeriinspektör;3359
4534;Fiskeriintendent;2134
6270;Fiskerikonsulent;2134
2379;Fiskerikontrollant;3359
2380;Fiskeskeppare;6222
2375;Fiskmästare;6221
5882;Fiskodlare;6221
2376;Fiskodlingsarbetare;6221
6704;Fjärrbilsförare;8332
7013;Fjärrtågklarerare;4323
4823;Flexotryckare;7322
6962;Flismaskinförare, skogsbruk;8341
6696;Floormanager;4211
5863;Florist;5223
133;Flygingenjör;2144
4733;Flyginstruktör/Flyglärare;3153
1220;Flyginstrumentmekaniker;7311
6348;Flygklarerare;4323
7361;Flygledarassistent;3154
559;Flygledare;3154
5584;Flygmekaniker;7232
2766;Flygmäklare;3331
5585;Flygplanselektriker;7412
5277;Flygplanslastare;9332
286;Flygplansmontör;8211
7559;Flygplansplåtslagare;7214
4883;Flygplatschef;1120
2477;Flygplatskontrollant;5413
6587;Flygplatsman/Ramppersonal;9332
2754;Flygspeditör;3331
5574;Flygtekniker;3155
782;Flygvärd/Flygvärdinna/Flygsteward;5111
7120;Flyktingassistent;3411
2059;Flyktingsamordnare/Flyktingkonsulent;2661
5278;Flyttkarl/Stadsbud;9332
7540;Flödesoperatör;8111
7192;Fogarbetare, hus och anläggning;7119
4355;Fogare, faner;8173
4066;Folierare;7319
2183;Folkbokföringshandläggare;3352
6681;Folkhälsoplanerare;2422
6796;Folkhälsosekreterare;3411
6682;Folkhälsoutvecklare;2422
6184;Folkhögskolelärare;2330
2010;Fondchef, statlig;1610
5317;Fondförvaltare/Portföljförvaltare;2414
5609;Fordonselektriker;7412
6632;Fordonsingenjör;3114
622;Fordonsingenjör, Trafikverket;3354
5316;Fordonslackerare;7132
5508;Fordonsmontör;8211
600;Fordonstekniker/Bilmekaniker/Personbilsmekaniker;7231
7645;Forensiker, biologi;2131
6712;Forensiker, biomedicinsk analytiker;3212
6711;Forensiker, fysiker;2111
6710;Forensiker, kemist;2113
4161;Formare, gipsplattor;8114
6046;Formare, keramik;7319
1347;Formatsågare, fiberskivor;8173
6250;Formgivare;2171
3244;Formgjutare, keramik;7319
968;Formmaskinskötare, plast;8142
1348;Formpressare, skiktträ;8173
4156;Formsättare;8114
7465;Forskarassistent;2313
2357;Forskare, farmakologi;2133
7294;Forskare, IT;2519
7665;Forskare, samhällsvetenskap;2623
5803;Forskningschef;1330
7546;Forskningschef, museum;1330
347;Forskningsingenjör, elkraft;2143
350;Forskningsingenjör, el-tele;2143
7407;Forskningsingenjör, kemi;2145
353;Forskningsingenjör, maskin;2144
185;Forskningsingenjör, metallurgi;2146
324;Forskningslaborant, fysik;3215
319;Forskningslaborant, kemi;3215
3594;Fortbildningskonsulent;2351
2778;Fortbildningssekreterare;3359
3942;Fotoetsare;7319
4790;Fotograf;3431
7207;Fotografagent;3339
4791;Fotografassistent;3431
5877;Fotomodell;5241
253;Fotterapeut/Fotvårdsspecialist;5144
6375;Fraktchef;1320
6321;Fraktexpeditör, flyg;4323
3818;Framtidsforskare;2623
3819;Fredsforskare;2623
5726;Friskvårdskonsult;3424
1584;Friskvårdsledare;3424
5491;Frisör;5141
7574;Frisöraspirant;5141
1575;Fritidsassistent;3423
5226;Fritidschef;1740
1577;Fritidsinstruktör;3423
1578;Fritidskonsulent;3423
5725;Fritidsledare;3423
1779;Fritidsledare/Ungdomsledare, församling;3423
2550;Fritidsombud, försäkringar;3321
1971;Frivårdschef;2669
1972;Frivårdshandläggare;2669
5789;Frivårdsinspektör;2669
7633;Frontend-utvecklare;2512
7568;Frontofficepersonal;4113
474;Frukostvärd/Frukostvärdinna;9412
4537;Fruktodlare;6111
4507;Fruktodlingsrådgivare/Fruktodlingskonsulent;2134
5937;Fräsare;7223
4356;Fräsare, trä;7523
7629;Fukttekniker;3355
5752;Fysiker;2111
4747;Fysiolog, allmän;2132
331;Fysiologassistent, laborant;3215
5727;Fysioterapeut/Sjukgymnast;2272
1801;Fältassistent;2661
2562;Fältskadereglerare;3314
7672;Fälttekniker, geologi;3119
2551;Fälttjänsteman, försäkringar;3321
1008;Färdigmatlagare;8161
695;Färdledare/Turledare;5113
530;Färdtjänstbussförare;8331
531;Färdtjänstförare;8321
1052;Färgare;8151
4824;Färgblandare, tryckeri;7322
247;Färgkonsulent;5149
4067;Färgtryckspåläggare, porslin;7319
6631;Fögderidirektör;1590
5684;Fönsterputsare;9120
2022;Förbundschef;1113
6630;Förbundsdirektör;1113
4431;Förbundsjurist;2615
4848;Förbundskassör;2411
2024;Förbundsordförande;1113
5774;Förbundssekreterare;2422
3490;Förbundstränare;3422
7424;Föredragande/Beredningsjurist;2619
1786;Föreningsinstruktör;3422
5754;Föreningskonsulent;2422
4931;Föreståndare, stugby;4224
2050;Föreståndare, äldreboende;1530
700;Företagsguide;5113
4006;Företagsjurist;2614
4722;Företagskonsulent;2421
4723;Företagskonsult;2421
6324;Företagsledare;1120
1469;Företagspsykolog;2241
2969;Företagsrådgivare;2413
7277;Företagssjuksköterska/Företagssköterska;2234
6158;Författare;2641
2025;Förhandlingschef, organisation;1113
4473;Förhandlingschef, statlig;1350
4474;Förhandlingssekreterare, statlig;1350
6154;Förlagsredaktör;2641
4863;Förman, snickeri;7522
5419;Förrådsarbetare, bygg;9310
5021;Förrådschef;4321
6747;Församlingsdiakon;2672
2125;Församlingsföreståndare, frikyrka;3412
2128;Församlingsföreståndare, Frälsningsarmén;3412
5753;Församlingspedagog;3423
6798;Församlingspräst med specialuppgifter;2671
7420;Förskolechef;1420
3596;Förskolekonsulent;2351
1439;Försvarsmeteorolog;2112
1833;Försäkringsaktuarie;2121
7158;Försäkringsförmedlarassistent;4114
6876;Försäkringsförmedlare/Försäkringsmäklare;3321
2557;Försäkringshandläggare;3321
5570;Försäkringshandläggare, försäkringskassa;3353
3990;Försäkringsjurist;2614
2552;Försäkringskonsulent;3321
1834;Försäkringsmatematiker;2121
2554;Försäkringsombud;3321
2555;Försäkringsrådgivare/Försäkringssäljare;3321
2556;Försäkringsspecialist;3321
2558;Försäkringstjänsteman;3321
2563;Försäkringsutredare;3314
578;Försäkringsutredare, försäkringskassa;3353
4906;Försäljningsassistent;4114
6368;Försäljningschef;1250
4907;Försäljningssekreterare;4114
6343;Försöksdjurskötare/Försöksdjurstekniker;6129
2174;Förtullare;4323
3103;Förvalsare;8122
6806;Förvaltare, skogsbruk;1380
3074;Förvaltningsassistent;4119
5228;Förvaltningschef, kommun;1350
7303;Förvaltningschef, landsting;1350
5800;Förvaltningsdirektör, statlig;1112
422;Förvaltningsekonom;2419
6179;Förvaltningsjurist;2615
2494;Garagevakt;5413
4890;Garantihandläggare;4222
6012;Garderobiär/Garderobvaktmästare;9622
3410;Garvare/Skinnberedare;7534
3411;Garvarmästare;7534
5354;Gaspåfyllare;8181
5946;Gasskärare;7212
2727;Gassvetsare;7212
5229;Gatuchef;1340
3726;Gatuförsäljare;9520
2970;Gelbgjutare;7211
5623;Gemmolog;7312
3820;Genealog;2623
2011;Generaldirektör;1112
2012;Generalkonsul;1112
2026;Generalsekreterare;1113
4748;Genetiker;2131
5477;Geodet;2164
5762;Geofysiker;2114
6190;Geograf;2623
1827;Geokemist;2114
5761;Geolog;2114
332;Geologassistent;3215
5475;Geotekniker;2146
3245;Gipsgjutare;7319
1364;Gipstekniker;5349
5397;GIS-ingenjör;3117
7534;GIS-samordnare;2422
7533;GIS-utvecklare;2512
954;Gitarrbyggare;7319
955;Gitarrtekniker;7319
6011;Gjutare;7211
4158;Gjutare, betongvaruindustri;8114
3246;Gjutare, keramik;7319
7470;Gjutberedare;8129
6016;Gjuterioperatör;8129
5142;Gjutgodsrensare;9320
2973;Gjutmästare;7211
2364;Glas- och metallmontör;7124
6195;Glas- och porslinsmålare;7319
3954;Glasarbetare;8189
3924;Glasblåsare;7319
6172;Glasbruksarbetare;7319
4068;Glaserare, keramik;7319
3943;Glasetsare;7319
6173;Glasgravör;7319
3955;Glashärdare;8189
3956;Glasmaskinskötare;8189
4069;Glasmålare;7319
7311;Glaspolerare;7319
3957;Glaspressare;8189
1191;Glassberedare;8162
3926;Glasslipare;7319
3958;Glassmältare;8189
5878;Glastekniker/Glasmästare;7124
3959;Glastryckare;8189
3927;Glasverksarbetare;7319
3960;Glasögonslipare;8189
6201;Gnistare;7223
2223;Godsmottagare;4322
4570;Golfbanearbetare;6113
387;Golfbaneföreståndare;1740
7643;Golfinstruktör/Golftränare;3422
7193;Golvbeläggningsarbetare, industri;7119
5861;Golvläggare;7122
7174;Golvläggare, utan yrkesbevis;7122
7186;Golvslipare/trä;7122
2656;Gradare;7224
4382;Gradör;7531
7440;Grafiker, game concept artist;2173
7442;Grafiker, texturerare;2173
4039;Grafisk formgivare;2172
7376;Grafisk operatör, digital produktion;7321
2891;Granskare, revision;3313
2892;Granskningsman;3313
1399;Gravstenhuggare;8116
6185;Gravör;7319
4017;Gravör, metall;7319
6299;Gravör, tryckmedier;7321
878;Gravör, ädelmetall;7312
4571;Greenkeeper;6113
4572;Griftegårdsarbetare/Kyrkogårdsarbetare;6113
7017;Grillbiträde/Gatuköksbiträde;9411
225;Grillkock, snabbmat;9411
5874;Grovarbetare, bygg och anläggning;9310
2839;Grovplåtnitare;7215
5976;Grovplåtslagare;7215
7444;Gruppchef, teknik;1370
2963;Gruppföreståndare, bank;3312
7588;Gruppledare för kontorspersonal;3341
7687;Gruppledare inom socialtjänst;2661
1477;Gruppterapeut;2241
7543;Gruvbyggare;7111
1828;Gruvgeolog;2114
4214;Gruvmätare;3116
2483;Gränskontrollant/Passkontrollant;5413
7216;Grävlastarförare, anläggning;8342
507;Grävmaskinförare;8342
6963;Grävmaskinförare, skogsbruk;8341
4538;Grönsaksodlare;6111
6775;Grönsaksodling, förman;6111
5594;Guide;5113
5621;Guldsmed;7312
6272;Gårdsmästare, växtodling/Rättare, växtodling;6111
6288;Gårdsmästare,blandad drift/Rättare,blandad drift;6130
1493;Habiliteringsassistent;5342
7511;Habiliteringspedagog;3411
5540;Hallföreståndare;1740
5144;Halmvaruarbetare;7319
2616;Hammarsmed;7221
5280;Hamnarbetare/Stuveriarbetare;9331
4884;Hamnchef;1120
5037;Hamnkapten;1320
2752;Handelsagent, partihandel;3331
3247;Handformare;7319
7340;Handformare, gjuteri;7211
4690;Handgravör, tryckmedier;7321
5796;Handikappkonsulent;2422
4858;Handlingskoordinator;4323
5571;Handläggare, utredare, arbetslöshetskassa;3353
5776;Handläggare/Utredare, offentlig förvaltning;2422
6400;Handpaketerare;9320
1424;Handsksömmare;8159
3226;Handstickare;7319
3227;Handvirkare;7319
3228;Handvävare;7319
7270;Hantverkspedagog;3411
1413;Hattmakare;7531
6839;Heatsettryckare;7322
7558;Helikopter, färdmekaniker;7232
554;Helikopterförare/Helikopterpilot;3153
640;Helikoptermekaniker;7232
608;Helikoptertekniker;3155
7020;Helpdesktekniker/Supporttekniker;3512
3727;Hemförsäljare;5241
443;Hemhjälp;9119
1457;Hemsjukvårdare;5321
6107;Hemslöjdskonsulent;3449
1494;Hemterapeut;3411
991;Hemtextilsömmerska;8159
5713;Hemtjänstassistent;5330
5799;Hemvårdare;5330
1509;Hemvårdsassistent;3411
241;Herrfrisör;5141
1417;Herrskräddare;7531
5608;Hissmontör;7412
3821;Historiker, forskare;2623
7646;Hjullastarförare, godshantering;8342
1595;Hjälpmedelskonsulent;2273
5668;Hjälpmedelstekniker;7311
1626;Homeopat;3230
6265;Hortonom;2134
394;Hotellchef;1710
213;Hotellhusfru;5151
5596;Hotellreceptionist;4224
455;Hotellstädare;9111
4133;Hotellvaktmästare/Piccolo;9622
710;Hotellvärd/Hotellvärdinna;4224
5486;Hovmästare;5131
3124;Hovrättsassessor;2612
3126;Hovrättslagman;2612
4945;Hovrättspresident;2612
6519;Hovrättsråd;2612
5928;Hovslagare;6121
7095;HR-assistent;4112
6872;HR-konsult/PA-konsult;2423
6873;HR-specialist/HR-adviser;2423
3412;Hudsorterare;7534
5494;Hudterapeut;5142
3822;Humanist, forskare;2623
4619;Hunddressör;6122
6765;Hundförare;5413
4620;Hundgårdsförman;6122
1860;Hundpsykolog;6122
6286;Hundskötare/Hundvårdare;6122
4621;Hundtrimmare;6122
4622;Hunduppfödare;6122
4495;Husdjursrådgivare/Husdjurskonsulent;2134
6283;Husdjurstekniker;6121
810;Hushållsmaskinreparatör/Vitvarureparatör;7420
7187;Husmontör;7119
211;Husmor;3452
2283;Husvagnsförsäljare;5223
7480;Huvudtillsyningsman, järnväg;4323
859;Hydraulmontör;7233
860;Hydraulreparatör;7233
4749;Hydrobiolog;2132
1829;Hydrogeolog;2114
5766;Hydrolog;2114
7344;Hygiensjuksköterska;2221
2589;Hyresintendent;3335
2590;Hyreskonsulent;3335
3929;Hyttmästare/Produktionsledare, glasbruk;7319
3011;Hyttskötare, järnbruk;8193
6628;Hyvelmästare;8173
750;Hyveloperatör, sågverk;8173
5932;Hyvlare, metall;7224
4359;Hyvlare, trä;7523
2810;Hårdlödare;7212
7609;Hårdvarukonstruktör;2143
423;Hälsoekonom;2415
6699;Hälsoinformatör;3424
6700;Hälsopedagog;3424
6683;Hälsoplanerare;2422
1916;Hälsovårdsinspektör;2182
970;Härdare, plast;8142
3587;Hörselvårdsingenjör/Hörselingenjör;3214
3599;Hörselvårdskonsulent;2351
3588;Hörselvårdstekniker;3214
6550;Idéhistoriker;2623
2996;Idrottsagent/Sportagent;3339
6667;Idrottsdomare;3422
3494;Idrottsinstruktör/Idrottstränare;3422
6083;Idrottskonsulent;3422
3496;Idrottspedagog;3422
388;Idrottsplatschef;1740
6294;Idrottsplatsvaktmästare/Idrottsplatsarbetare;5152
3687;Illusionist;3439
6150;Illustratör;2651
2134;Imam;2671
3688;Imitatör;3439
6180;Immaterialrättsjurist;2614
4750;Immunolog;2131
5111;Importchef;1320
2755;Importspeditör;3331
768;Incheckare;4221
1478;Individualterapeut;2242
3307;Industridesigner;2171
5607;Industrielektriker;7412
5835;Industrilackerare;7132
5971;Industriplåtslagare;7214
5993;Industrirobotoperatör;8199
5818;Industrirörmontör;7125
6725;Industrisanerare;7134
458;Industristädare;9111
997;Industrisömmerska;8159
2467;Informatiker;2622
2464;Informatikerassistent;4410
6732;Informationsarkitekt;2622
7096;Informationsassistent;2432
5120;Informationschef/Kommunikationschef;1240
3883;Informationskonsult;2432
5321;Informationsmäklare;2622
3885;Informationssekreterare;2432
6846;Informationsspecialist;2622
6159;Informatör/Kommunikatör;2432
7602;Infrastrukturarkitekt;2511
196;Ingenjörsgeolog;2146
2402;Inkasserare;4212
5891;Inkassohandläggare;4212
2794;Inkodare;4119
5915;Inköpare;3323
4909;Inköpsassistent;4115
6373;Inköpschef;1320
2545;Inköpsingenjör;3111
4910;Inköpskontorist;4115
2546;Inköpsledare;3323
2547;Inköpsplanerare;3111
4911;Inköpssekreterare;4115
2548;Inköpstekniker;3323
3105;Inläggare, valsverk;8122
6112;Inläsare;3439
2603;Innesäljare;3322
5449;Inredningsarkitekt;2161
25;Inredningsdesigner;3432
5812;Inredningssnickare/Specialsnickare;7522
6697;Inspector dealer;4211
2857;Inspektionsdykare;7115
3465;Inspektör, Polisen;3360
1909;Inspektör, Socialstyrelsen;2422
7154;Inspelningsassistent;3433
7155;Inspelningskoordinator;3522
4446;Inspelningsledare;3522
4027;Inspelningstekniker;3521
6260;Inspicient;3433
6309;Installationselektriker;7411
4233;Installationsingenjör;3113
273;Installationstekniker;7233
2532;Institutionsmäklare;3311
5961;Institutionssekreterare;3359
431;Instruktionsförare;8311
446;Instruktionsstädare;5151
7596;Instruktör/Tränare inom specialidrott;3422
812;Instrumentelektriker/Instrumenttekniker;7420
326;Instrumentingenjör, fysik;3215
1224;Instrumentmekaniker;7311
1225;Instrumentmontör;7311
1891;Integrationshandläggare;2669
6526;Intendenturpersonal, försvaret;5131
6527;Intendenturpersonal, sjöfart;5131
1813;Intensivvårdssjuksköterska;2228
7575;Interaktionsdesigner;2512
5480;Internatföreståndare;3452
2598;Internationell säljare;3322
1239;Internrevisor;2411
6970;Intervjuare, opinionsundersökning;4226
959;Intonatör;7319
2061;Invandrarkonsulent;2661
2062;Invandrarsekreterare;2661
520;Ismaskinförare;8342
2367;Isoleringsmontör;7123
7264;Isoleringsplåtslagare;7123
6626;IT-arkitekt/Lösningsarkitekt;2511
7590;IT-forensiker;2516
4423;IT-jurist;2619
2910;IT-metodansvarig;2516
3898;IT-producent;2641
5398;IT-revisor;2411
2915;IT-samordnare;2515
5432;IT-strateg;2519
2717;IT-säkerhetschef;2516
6625;IT-tekniker/Datatekniker;3511
2917;IT-utredare;2511
4769;Jaktkonsulent/Viltkonsulent;2135
6307;Jaktvårdare/Viltvårdare;2135
4770;Jaktvårdskonsulent/Jaktvårdsrådgivare;2135
7429;Jobbcoach/Utbildningscoach;3333
3916;Jockey;3421
3689;Jonglör;3439
4497;Jordbruksforskare;2134
4499;Jordbruksrådgivare/Jordbrukskonsulent;2134
6056;Journalist/Reporter;2642
4088;Jungman;8350
4424;Juridisk ombudsman;2619
6520;Jurist, allmän domstol;2612
3129;Jurist, förvaltningsdomstol;2612
3130;Jurist, specialdomstol;2612
7463;Juristassistent/Paralegal;3342
4946;Justitiekansler;1112
4947;Justitieombudsman;1112
7322;Justitieråd;2612
873;Juvelerare;7312
874;Juvelfattare;7312
6344;Jägare;2135
6266;Jägmästare;2135
7488;Järnvägsingenjör;3112
318;Kabelmaskinoperatör;8212
850;Kabelmontör, elkraft;8212
783;Kabinchef/Purser;5111
2013;Kabinettsekreterare;1112
7635;Kabininstruktör;3449
5850;Kaféföreståndare;5221
3250;Kakelformare;7319
2098;Kakelugnsmakare;7112
971;Kalanderskötare, plast;8142
657;Kalandrerare;8172
7497;Kalibreringsingenjör, tillverkningsindustri;3114
1401;Kalkbrottsarbetare;8111
3414;Kalkhusarbetare, garveri;8159
5485;Kallskänka;5120
230;Kallskänka, fartyg;5120
2618;Kallslagare;7221
2708;Kallsågare, metall;7223
7062;Kameraassistent;3521
4808;Kameraman, TV;3521
3132;Kammarrättsassessor;2612
3133;Kammarrättsfiskal;2612
3134;Kammarrättslagman;2612
4950;Kammarrättspresident;2612
3135;Kammarrättsråd;2612
3148;Kammaråklagare;2613
2897;Kamrer;2411
6624;Kanslichef, kommun;1230
2027;Kanslichef, organisation;1113
6623;Kanslichef, statlig;1230
7518;Kanslichef/verksamhetschef, församling;1230
5168;Kanslijurist;2615
2184;Kanslist;4119
3362;Kantor;2652
7385;Kantpressare;7223
3931;Kantslipare, glas;7319
752;Kantsågare;8173
3670;Kapellmästare;2652
259;Kapellvaktmästare;5152
2130;Kaplan;2671
4865;Karosserisnickare;7522
5518;Kartingenjör;3117
338;Kartograf;3117
4395;Kartongmaskinskötare;8143
339;Kartritare;3117
340;Karttekniker;3117
2923;Karusellsvarvare;7223
6684;Kasinopersonal;4211
587;Kassaföreståndare, arbetslöshetskassa;3353
6658;Kassaledare, butik;5221
2155;Kassapersonal;5230
7421;Kategorichef/Kategoriansvarig;1320
4294;Kemiingenjör;3115
631;Kemikalieinspektör;2182
5764;Kemist;2113
6414;Kemitekniker;3115
1099;Kemtvättare;8151
4624;Kennelföreståndare;6122
4406;Keramiker;7319
3252;Keramikpressare;7319
6729;Key account manager;3322
1403;Kilare, stenbrott;8116
6995;Kinesiolog;3230
2275;Kioskbiträde;5230
5748;Kiropraktor;2271
2619;Klensmed;7221
4659;Klichémontör;7321
6874;Klinikapotekare;2281
2033;Klinikchef, tandvård/Verksamhetschef, tandvård;1510
1853;Klinikveterinär;2250
6968;Klinisk farmakolog;2211
1473;Klinisk psykolog;2241
5963;Klockare;4119
4081;Klottersanerare;7134
264;Klubbvärdinna;5169
1419;Klänningssömmerska;7531
7663;Kock, à la carte;5120
5359;Kock, fartyg;5120
7664;Kock, storhushåll;5120
5484;Kocksteward;5120
3003;Kokillgjutare;8129
3025;Kokillskötare;8193
1133;Kolare;8132
5660;Kolonnarbetare;8169
6871;Kolportör;9621
2113;Komminister;2671
3466;Kommissarie, Polisen;3360
6362;Kommunchef;1112
6818;Kommundirektör;1112
1892;Kommunhandläggare;2422
827;Kommunikationselektriker;7420
7626;Kommunikationsstrateg;2432
2514;Kommunikationstekniker;3514
3994;Kommunjurist;2615
6621;Kommunrevisor;2411
1893;Kommunsekreterare;2422
6058;Kompositör;2652
4851;Koncerncontroller;2412
2276;Konditoribiträde;9413
6668;Konduktör;5112
993;Konfektionssömmerska;8159
3700;Konferencier;3439
708;Konferenschef;1710
4134;Konferenstekniker;3522
3194;Konferenstolk;2643
712;Konferensvärd/Konferensvärdinna;4224
7203;Konsertarrangör;3339
3377;Konsertmästare;2652
7030;Konservator;2651
2974;Konstgjutare;7211
6044;Konsthantverkare;7319
4878;Konstinramare/Rammakare;7124
2440;Konstintendent;2621
7023;Konstkonsult;2621
3272;Konstnär;2651
4856;Konstnärsmodell;5241
7156;Konstpedagog;2359
6620;Konstruktör, elkraft;3113
5455;Konstruktör, el-tele;2143
6619;Konstruktör, textil, trä, glas, förpackningar;3119
7495;Konstruktör, tillverkningsindustri;3114
4412;Konstsmed;2651
4162;Konststensgjutare;8114
1782;Konsulent på stifts-/nationell nivå;3423
4951;Konsumentombudsman;1112
6304;Konsumentvägledare;2422
6548;Kontakttolk/Dialogtolk;2643
5841;Kontorist;4119
2198;Kontorsbiträde;4119
6365;Kontorschef, bank;1610
6379;Kontorschef, offentlig förvaltning;1590
6395;Kontorschef, utbildningsföretag;1490
6026;Kontorskassör;4111
721;Kontorsreceptionist;4225
459;Kontorsstädare;9111
4136;Kontorsvaktmästare;9622
7515;Kontraktsadjunkt;2671
167;Kontrollingenjör;2149
6222;Kontrollingenjör, elektronik;3113
6219;Kontrollingenjör, elkraft;3113
6235;Kontrollingenjör, gruv, metallurgi;3116
6232;Kontrollingenjör, kemiteknik;3115
6227;Kontrollingenjör, maskin;3114
6238;Kontrollingenjör, textil, trä, glas, förpackn.;3119
4642;Kontrollmätare, virke;6210
2938;Kontrolloperatör, metallprodukter;3119
4256;Kontrolltekniker, elektronik;3113
4291;Kontrolltekniker, kemiteknik;3115
4317;Kontrolltekniker, textil, trä, glas, förpackn.;3119
4360;Kontursågare, snickeri;7523
5147;Konverteringsarbetare, papper;9320
5677;Kopieringsmaskinskötare;8132
5631;Kopparslagare;7214
4692;Kopparsticksgravör, tryckmedier;7321
6117;Kopplingstekniker;3522
6183;Koreograf;2653
4009;Koreolog;2653
2403;Korgmakare;7319
5892;Korgmakeriarbetare;7319
2404;Korgmöbelmakare;7319
3870;Korrekturläsare;2641
208;Kostchef;3452
6813;Kostekonom;3452
1865;Kostkonsulent;3452
3911;Kostymassistent;3433
6169;Kostymmästare;3433
6151;Kostymtecknare;2179
3912;Kostymör;3433
274;Kraftstationsmaskinist;8191
275;Kraftverksoperatör;8191
7594;Kran- och hisstekniker;7233
6688;Kranbilsförare;8332
7621;Kravanalytiker;2511
2738;Kreditberedare;3312
2739;Kreditbevakare;3312
2740;Kreditchef;1210
5948;Kredithandläggare;3312
2741;Kreditman;3312
2742;Kreditrådgivare;3312
5498;Krematoriemästare/Föreståndare;5161
263;Krematorievaktmästare;5161
312;Kretskortsmontör;8212
2441;Krigsarkivarie;2622
2503;Kriminalvårdare;5412
4475;Kriminalvårdsdirektör;1590
1894;Kriminalvårdsinspektör;1590
3302;Kriminolog;2623
2399;Kronoassistent;4212
6832;Kronodirektör;1590
6072;Kronofogde;2619
5889;Kronoinspektör;4212
2869;Krosskötare, malmkross;8112
2859;Krossverksmaskinist;8112
3253;Krukmakare;7319
3933;Kulare, glas;7319
2870;Kulkvarnskötare, malmanrikning;8112
5231;Kulturchef;1590
4033;Kulturgeograf;2623
1896;Kultursekreterare;2422
5572;Kundmottagare/Verkmästare, bilverkstad;3339
7552;Kundmäklare;3311
7522;Kundserviceingenjör, tillverkningsindustri;3114
7627;Kundtjänstchef;1290
5918;Kundtjänsteman, försäkring;3321
2291;Kundtjänstmedarbetare;4222
5994;Kundvagnsuppsamlare;9629
5787;Kurator;2662
2779;Kursadministratör;3359
212;Kursgårdsföreståndare;3452
3625;Kursutvecklare;3449
5664;Kustbevakningstjänsteman;3351
4396;Kuvertmaskinskötare;8143
1371;Kvalificerad skattehandläggare;3352
5537;Kvalitetsbedömare, livsmedel;7613
4726;Kvalitetschef;1290
5457;Kvalitetsingenjör, el-tele;2143
4318;Kvalitetsingenjör, textil, trä, glas, förpackn.;3119
4257;Kvalitetsingenjör/-tekniker, elektronik;3113
4246;Kvalitetsingenjör/-tekniker, elkraft;3113
4292;Kvalitetsingenjör/-tekniker, kemiteknik;3115
4276;Kvalitetsingenjör/-tekniker, maskin;3114
4305;Kvalitetsingenjör/-tekniker, metallurgi;3116
4728;Kvalitetskoordinator;2422
2939;Kvalitetsmätare, metallprodukter;3119
4729;Kvalitetsrevisor;2421
4730;Kvalitetssamordnare;2421
5652;Kvarnarbetare;8163
1117;Kvarnmaskinskötare;8163
1118;Kvarnoperatör;8163
2860;Kvarnskötare, stenkross;8112
1830;Kvartärgeolog;2114
1495;Kvinnojoursarbetare;3411
7611;Kyl- och värmepumpsmontör;7126
7612;Kyl- och värmepumpstekniker;7126
281;Kylmaskinist, kyl- och frysanläggning;8191
5819;Kylmontör/Kyltekniker;7126
4565;Kyrkogårdsförman;6113
2115;Kyrkoherde;1540
7519;Kyrkokamrer;1230
2393;Kyrkvaktmästare;5152
395;Källarmästare;1720
2906;Kärnborrare;8113
1769;Kärnfysiker;2111
6726;Kärnkraftsanerare;7134
7341;Kärnmakare;7211
483;Köksbiträde;9412
221;Kökschef;1720
209;Köksföreståndare;3452
222;Köksmästare;3451
3614;Körledare;2652
6243;Körsnär/Pälsmodellör;7531
5536;Köttklassificerare;7613
266;Köttmästare;7611
7644;Laborant, biologi;2131
327;Laborant, fysik;3215
322;Laborant, kemi;3215
1642;Laboratorieassistent;3212
5786;Laboratoriebiträde;5349
1960;Laboratoriebiträde, fys.lab.;5349
1961;Laboratoriebiträde, kem.lab.;5349
1962;Laboratoriebiträde, sjukhus;5349
2046;Laboratoriechef;1330
493;Laboratoriediskare;9412
5516;Laboratorieingenjör, fysik;3215
5515;Laboratorieingenjör, kemi;3215
7408;Laboratorieingenjör, metallurgi;3116
3723;Laboratorietandtekniker;3214
328;Laboratorietekniker, fysik;3215
323;Laboratorietekniker, kemi;3215
1855;Laboratorieveterinär;2250
2161;Lackerare;7132
4070;Lackerare, porslin;7319
1134;Lackkokare;8132
1381;Laddare, gruva;8115
6430;Ladugårdsföreståndare/Ladugårdsförman, djuruppf.;6121
6423;Ladugårdsförman, blandad drift;6130
6422;Ladugårdsskötare, blandad drift;6130
5842;Lagerarbetare;4322
6353;Lagerchef;1320
2200;Lagerkontorist;4322
2243;Lagerplanerare;4322
3136;Lagman;2612
972;Laminatpressare;8142
973;Laminerare, plast;8142
4827;Laminerare, tryckeri;7322
6616;Landsantikvarie;1590
6615;Landsarkivarie;1590
4501;Landsbygdsutvecklare;2134
2016;Landshövding;1112
5447;Landskapsarkitekt;2162
6269;Landskapsingenjör;2134
7304;Landstingsdirektör;1112
3995;Landstingsjurist;2615
6614;Landstingsrevisor;2411
1897;Landstingssekreterare;2422
2138;Lantbrevbärare;4420
6287;Lantbrukare, blandad drift;6130
6277;Lantbrukare, djuruppfödning;6121
6271;Lantbrukare, växtodling;6111
4476;Lantbruksdirektör;1230
7354;Lantbruksekonom;2134
6421;Lantbruksförman, blandad drift;6130
5102;Lantbruksförvaltare;1380
6340;Lantbruksinspektor;2134
3090;Lantbrukskassör;4111
4503;Lantbruksrådgivare/Lantbrukskonsulent;2134
6267;Lantmästare;2134
5472;Lantmätare/Förrättningslantmätare;2164
4477;Lantmäteridirektör;1340
341;Lantmäteriingenjör;3117
5614;Larminstallatör/Larmtekniker;7420
6116;Larmoperatör;5414
7637;Laseroperatör/Laserskärare;7223
6402;Lastare;9332
5578;Lastbilsmekaniker;7231
6751;Lastbilssäljare;5223
509;Lastmaskinförare;8342
4993;Lastningsförman/Load master;4323
4041;Layoutare;2172
4040;Layoutchef;2172
4042;Layouttecknare;2172
3026;LD-operatör;8193
5408;Ledande montör, el;7411
828;Ledningsmontör, tele;7420
2001;Ledsagare;5343
1518;Lekterapeut;2343
3860;Lektör;2641
7438;Leveldesigner;2173
2201;Leveransbevakare;4322
5027;Leveranschef;1320
398;Leveransman;9120
3195;Lexikograf;2643
6211;Licenskontrollant;9629
2853;Liftbyggare/Liftmontör/Montageledare, liftar;7215
6690;Liftdumper- och lastväxlarförare;8332
1332;Liftmaskinist;8343
1333;Liftskötare;8343
1349;Limberedare, träfiberindustri;8173
1350;Limmare, fiberskivtillverkning;8173
4361;Limmare, snickeri;7523
4752;Limnolog;2183
4339;Limousineförare;8321
1334;Linbaneskötare;8343
3583;Lindansare;3439
6038;Lingvist;2643
2775;Linjeagent;3331
853;Linjemontör, elkraft;7413
855;Linjereparatör, elkraft;7413
1427;Linnesömmerska;7532
3962;Linsslipare;8189
4362;Listarbetare;7522
4363;Listmakare;7522
2997;Litterär agent;3339
5442;Livsmedelsarbetare, mejeri;8162
4323;Livsmedelsingenjör;3115
6819;Livsmedelsinspektör;2182
6239;Livsmedelstekniker;3115
3528;Ljudassistent;3522
3529;Ljudbandstekniker;3522
7042;Ljuddatatekniker;3522
7658;Ljuddesigner;3522
3531;Ljudingenjör;3522
7597;Ljudmixeroperatör;3522
6085;Ljudtekniker;3522
7598;Ljusbordsoperatör;3522
3537;Ljusdesigner;3522
1135;Ljusformare;8132
1136;Ljusstöpare;8132
6086;Ljussättare;3522
6189;Ljustekniker;3522
5118;Logistikchef;1320
5471;Logistiker;2141
176;Logistikingenjör;2141
5721;Logoped;2283
1627;Logopedassistent;5349
702;Lokalguide;5113
5550;Lokförare/Förare av tåg;8311
5620;Lokreparatör;7233
5569;Lots, fartyg;3152
6838;LSS-handläggare;2663
2965;Lånechef;1610
5625;Låssmed/Låstekniker;7311
3415;Läderfärgare;8159
7383;Lädervaruarbetare;8159
7239;Läkare;2219
5967;Läkarsekreterare/Vårdadmin/Medicinsk sekreterare;4117
7387;Läkeeurytmist;3230
7475;Läkemedelsansvarig, apotekare;2281
7476;Läkemedelsansvarig, receptarie;3213
2358;Läkemedelsinspektör;2133
2606;Läkemedelskonsulent;3322
3706;Läkepedagog;2351
6610;Länsantikvarie/1:e antikvarie;2621
4480;Länsarkitekt;1340
5169;Länsassessor;2615
6609;Länsbibliotekarie;1590
4481;Länsbostadsdirektör;1230
3652;Länshemslöjdskonsulent;3449
6942;Länsjaktvårdare;2135
4773;Länsjaktvårdskonsulent;2135
7595;Länsjurist;2615
4482;Länsjägmästare;1230
4952;Länspolismästare;1112
6608;Länsråd;1112
5171;Länsrättsassessor;2612
3137;Länsrättsfiskal;2612
3138;Länsrättsnotarie;2612
4483;Länsskattechef;1112
1856;Länsveterinär;2250
4953;Länsåklagare;2613
5809;Lärarassistent;5312
5715;Lärare i fritidshem/Fritidspedagog;2342
5714;Lärare i förskola/Förskollärare;2343
7295;Lärare i förskoleklass;2343
7652;Lärare i grundskolan, årskurs 1-3;2341
7653;Lärare i grundskolan, årskurs 4-6;2341
7654;Lärare i grundskolan, årskurs 7-9;2341
7127;Lärare i gymnasiet;2330
7128;Lärare i gymnasiet - yrkesämnen;2320
7165;Lärare i musik- och kulturskolan;2330
7164;Lärare i prakt./estet och annat ämne;2330
7126;Lärare i praktiska och estetiska ämnen;2330
6918;Lärling, anläggningsdykare;7115
7219;Lärling, bandlastarförare;8342
7220;Lärling, bandschaktarförare;8342
6916;Lärling, beläggningsarbete;7114
7221;Lärling, beläggningsmaskinförare;8342
6919;Lärling, bergarbetare;8111
6920;Lärling, betongarbetare;7113
6921;Lärling, betonghåltagare;7113
6923;Lärling, byggnadsplåtslagare;7213
6927;Lärling, glastekniker;7124
6928;Lärling, golvläggare;7122
7222;Lärling, grävlastare;8342
7223;Lärling, grävmaskinförare;8342
6929;Lärling, hissmontör;7412
7267;Lärling, industrielektriker;7412
6930;Lärling, installationselektriker;7411
7266;Lärling, isoleringsplåtslagare;7123
7225;Lärling, lastmaskinförare;8342
7196;Lärling, mobilkranförare;8343
7226;Lärling, motorschaktvagnförare;8342
6934;Lärling, murare;7112
6922;Lärling, målare;7131
6935;Lärling, plattsättare;7112
7227;Lärling, pålmaskinförare;8342
7189;Lärling, stenmontör;7112
6926;Lärling, ställningsbyggare;7116
6937;Lärling, tak- och tätskiktsmontör;7121
7248;Lärling, teleskoptruckförare;8342
7197;Lärling, tornkranförare;8343
6925;Lärling, träarbetare;7111
6938;Lärling, undertaksmontör;7121
6924;Lärling, ventilationsplåtslagare;7213
7265;Lärling, VVS-isolerare;7123
6932;Lärling, VVS-montör;7125
6917;Lärling, väg- och anläggningsarbetare;7114
7228;Lärling, väghyvelförare;8342
7131;Läromedelsassistent;4410
3602;Läromedelsintendent;2351
1182;Läskedrycksberedare;8169
4874;Lästmodellör;2179
4159;Lättbetongarbetare;8114
4089;Lättmatros;8350
3083;Löneadministratör;4112
3084;Löneassistent/Lönekontorist;4112
7622;Lösullsinstallatör;7123
7312;Make-up artist;5149
6758;Makroanalytiker;2415
2871;Malmanrikare;8112
1382;Malmarbetare;8111
2872;Malmförädlingsarbetare;8112
2873;Malmkrosskötare;8112
1383;Malmlastare, gruva;8111
372;Malmletare;3116
3407;Malmvägare;8181
2998;Manager;3339
249;Manikyrist/Manikurist;5149
2360;Mannekäng;5241
3877;Manusförfattare;2641
3214;Marinarkeolog;2623
4753;Marinbiolog;2132
6824;Marinmekaniker;7231
7325;Marinmeteorolog;2112
6961;Markberedningsförare, skogsbruk;8341
183;Markförhandlare;2164
4216;Markingenjör;3112
5548;Marknadsanalytiker;2431
6314;Marknadsassistent;4114
5090;Marknadschef;1250
5547;Marknadsförare;2431
406;Marknadskommunikatör;2431
407;Marknadskonsult;2431
408;Marknadskoordinator;2431
416;Marknadsplanerare;2431
417;Marknadsundersökare;2431
7274;MAS, medicinskt ansvarig sjuksköterska;2239
5590;Maskinbefäl, fartyg;3151
6300;Maskinbokbindare/Bokbinderiarbetare;7323
2899;Maskinbokförare;3313
861;Maskinbyggare;7233
802;Maskinelektriker;7412
3005;Maskinformare, gjuteri;8129
5557;Maskinförare, lantbruk/Traktorförare, lantbruk;8341
5689;Maskinförare, träfiberskivor;8173
4018;Maskingravör, metall;7319
4693;Maskingravör, tryckmedier;7321
7337;Maskinist, energi;8191
7326;Maskinkonstruktör;3114
3006;Maskinkärnmakare;8129
862;Maskinmekaniker, industri/varvsindustri;7233
6863;Maskinmekaniker/Skogsmaskinmekaniker;7231
863;Maskinmontör;7233
276;Maskinmästare;8191
1063;Maskinoperatör, bageri;8163
1005;Maskinoperatör, fisk;8161
1119;Maskinoperatör, foder;8161
5663;Maskinoperatör, fotografiska produkter;8132
1268;Maskinoperatör, garnberedning;8159
4163;Maskinoperatör, gipsplattor;8114
1069;Maskinoperatör, gummiindustri;8141
6389;Maskinoperatör, hygienteknik;8131
7373;Maskinoperatör, hårdband;7323
6761;Maskinoperatör, juice, frukt, grönt o veg. olja;8169
1094;Maskinoperatör, konfektyrindustri;8163
998;Maskinoperatör, konservering;8161
1000;Maskinoperatör, kött;8161
6409;Maskinoperatör, läkemedel;8131
5305;Maskinoperatör, mekanisk verkstad;7223
7374;Maskinoperatör, mjukband;7323
1014;Maskinoperatör, rökning;8161
1154;Maskinoperatör, sockerindustri;8169
929;Maskinoperatör, sprängämnen och pyroteknik;8132
1164;Maskinoperatör, te-, kaffe- och kakaoberedning;8169
1170;Maskinoperatör, tobaksindustri;8169
4829;Maskinoperatör, tryckeri;7322
5629;Maskinoperatör, ytbehandling;8121
4366;Maskinoperatör, ytbehandling, trä;8174
5619;Maskinreparatör;7233
864;Maskinreparatör, stationära;7233
4504;Maskinrådgivare/Maskinkonsulent;2134
4384;Maskinskärare;8159
3963;Maskinskötare, glas;8189
1193;Maskinskötare, glasstillverkning;8162
2164;Maskinskötare, lackering;8121
1194;Maskinskötare, mejeri;8162
3967;Maskinskötare, tegelbruk;8189
4364;Maskinsnickare/Operatör, snickeri, inredning;7523
6606;Maskinsnickare/Operatör, trävaruindustri;7523
2640;Maskinställare;7223
1297;Maskinställare, textil;8159
6752;Maskinsäljare, entreprenad;5223
279;Maskintekniker, vattenverk;8191
3107;Maskinvalsare;8122
5493;Maskör/Sminkör;5149
3979;Massaberedare, keramik, tegel;8189
7490;Massaberedare, papper;8171
645;Massablekare, processoperatör;8171
646;Massakokare, processoperatör;8171
647;Massamaskinförare;8171
6308;Massör/Massageterapeut;5143
3013;Masugnsarbetare;8193
1835;Matematiker;2121
1446;Matematisk statistiker;2122
6801;Materialkemist;2113
177;Materialplanerare;2141
7631;Materialprovare;7233
329;Materialprovare, fysik;3215
178;Materialstyrare;2141
6198;Matros;8350
7422;Matros, inre fart;8350
1102;Mattvättare;8151
6376;Mediachef;1240
409;Mediakonsulent;2432
410;Mediaplanerare;2432
2607;Mediasäljare;3322
4484;Medicinalråd;1230
6096;Medicinteknisk ingenjör;3211
7093;Mediehanterare;2641
6122;Mediepedagog;3449
7328;Medlemsvärvare, intresseorg./Telefonkommunikatör;5242
5662;Mejeriarbetare;8162
1137;Mesabrännare;8132
3068;Metallduksvävare;7223
2849;Metallkonstruktionsmontör;7215
5942;Metallsågare;7223
6022;Metalltryckare;7223
5473;Metallurg;2146
5702;Meteorolog;2112
335;Meteorologassistent/Observatör, flygvapnet;3512
7461;Meteorologisk observatör;3512
2410;Metodanalytiker, IT;2511
2126;Metodistpastor;3412
1447;Metodstatistiker;2122
4754;Mikrobiolog;2131
1230;Mikromekaniker;7311
336;Mikroskopist;3215
5777;Miljö- och hälsoskyddsinspektör;2182
7514;Miljö- och klimatstrateg;2422
5986;Miljöarbetare/Renhållningsarbetare;9610
6474;Miljöchef;1290
1927;Miljöcontroller;2183
427;Miljöekonom;2415
1919;Miljöhandläggare;2183
1920;Miljöingenjör;2183
1921;Miljöinspektör;2183
6182;Miljöjurist;2619
6514;Miljökemist;2113
5778;Miljörevisor;2183
1922;Miljösamordnare/Miljökoordinator;2183
1923;Miljöskyddschef;2182
1448;Miljöstatistiker;2122
6603;Miljövårdsdirektör;1230
1925;Miljövårdsingenjör;2183
6052;Mimartist;2655
5182;Mimpedagog;2359
2018;Minister;1111
6408;Missionär;3412
3532;Mixare, ljudtekniker;3522
2813;Mjuklödare;7212
80;Mjukvaruutvecklare;2512
379;Mjölkbedömare;7613
1120;Mjölnare;8163
1325;Mobilkranförare;8343
6320;Modell;5241
4875;Modellbyggare;7522
3255;Modellgjutare, keramik;7319
4876;Modellmakare;7522
2631;Modellmakare, metall;7222
6323;Modellsnickare;7522
3256;Modellör, keramik;7319
7314;Modersmålslärare i grundskolan;2341
7313;Modersmålslärare i gymnasiet;2330
7163;Modersmålslärare/Modersmålspedagog;5312
5697;Modist;7531
4755;Molekylärbiolog;2131
5512;Montör, el- och teleutrustning;8212
5510;Montör, gummi- och plastprodukter;8213
297;Montör, metallprodukter;8213
5513;Montör, papp- och textilprodukter;8219
5511;Montör, träprodukter;8214
1404;Monumentstenhuggare;8116
7018;Mopedbud;8329
3500;Motionskonsulent;3422
287;Motorbyggare;8211
3473;Motorcykelbud;8329
6823;Motorcykelmekaniker;7231
4098;Motorelev, fartyg;7233
6199;Motorman, fartyg;7233
288;Motormontör;8211
7218;Motorschaktvagnförare;8342
521;Mudderverkskötare;8342
5816;Murare;7112
7176;Murare, utan yrkesbevis;7112
6200;Museiassistent;4410
4459;Museichef/Museidirektör;1120
2459;Museiintendent;2621
3623;Museilektor;2359
6101;Museipedagog/Museilärare;2359
7567;Museitekniker;3522
2999;Musikagent;3339
3297;Musikalartist;2655
7083;Musiker, folkmusik;2652
7202;Musiker, klassisk musik;2652
6110;Musiker, populärmusik;2652
5064;Musikförläggare;1120
3649;Musikhandledare;3449
965;Musikinstrumentmakare;7319
3617;Musikpedagog/Musiklärare;2359
7200;Musikproducent;2652
4028;Musiktekniker;3522
1628;Musikterapeut;2289
2377;Musselodlare;6221
4756;Mykolog;2132
2079;Målare;7131
7113;Måleri, servicearbetare;9310
1183;Mältare;8169
3980;Mängberedare;8189
5489;Mässman, fartyg;5131
7309;Mästare, glasbruk;7319
2881;Mätaravläsare;9629
1231;Mätarjusterare;7311
6944;Mätningschef, virkesmätning;6210
6216;Mätningsingenjör/MBK-ingenjör;3117
4218;Mätningstekniker, bygg;3117
330;Mättekniker, fysik;3215
7671;Mättekniker, geologi;3119
7411;Mättekniker, kemi;3215
2940;Mättekniker, metallprodukter;3119
2165;Möbellackerare;7132
303;Möbelmontör/Inredningsmontör;8214
4866;Möbelrenoverare/Möbelrestauratör;2651
6322;Möbelsnickare;7522
7499;Mönsterkonstruktionsassistent;7531
4387;Mönsterritare, tyger;7531
3947;Mönsterslipare, glas;7319
5439;Nagelterapeut/Nagelteknolog;5149
5747;Naprapat;2271
6040;Nationalekonom;2415
716;Nattreceptionist/Nattportier;4224
4034;Naturgeograf;2623
6104;Naturskoleföreståndare;3449
1629;Naturterapeut;3230
1926;Naturvårdsingenjör;2183
6851;Neuropsykolog;2241
2967;Notariatchef, bank;3312
2968;Notariattjänsteman, bank;3312
3673;Notskrivare;2652
5785;Nutritionist/Näringsfysiolog;2131
7235;Nyhetsgrafiker;7321
7067;Nyhetstextare;2643
7428;Nämndsekreterare;3359
1956;Näringsforskare;2131
4954;Näringsfrihetsombudsman;1112
1866;Näringskonsulent;2131
5075;Näringslivschef;1230
1902;Näringslivssekreterare/Näringslivsutvecklare;2422
7608;Näringsterapeut;3230
4236;Nätplanerare;3113
5645;Nättillverkare;8159
2515;Nätverksadministratör;3513
2516;Nätverksansvarig;3513
6602;Nätverkskonstruktör;3514
2519;Nätverksoperatör;3514
5912;Nätverkstekniker;3514
6118;OB-assistent;3521
5059;Obduktionsbiträde;5349
6361;Obduktionstekniker/Obduktionsassistent;5349
3718;OB-tekniker;3521
5805;Oceanograf;2114
3257;Ocularist;7319
7531;Oddssättare;4211
2988;Offertberedare;3324
2989;Offertchef;3324
2990;Offertingenjör;3324
2204;Offertkontorist;4115
5541;Officer;0110
5825;Officer, Frälsningsarmén;3412
1846;Officiell veterinär;2250
4830;Offsettryckare;7322
4082;Oljesanerare;7134
5605;Ombordansvarig, tåg;5112
5775;Ombudsman;2422
589;Omprövningshandläggare, arbetslöshetskassa;3353
2034;Områdeschef, barnomsorg;1420
6807;Områdeschef, skogsbruk;1380
2036;Områdeschef, äldre- och handikappomsorg;1530
2591;Områdesförvaltare;3335
5232;Omsorgschef;1230
1966;Omsorgskurator;2662
7351;Onkologisjuksköterska;2239
6800;Oorganisk kemist;2113
7146;Operachef;1120
5781;Operationssjuksköterska;2231
7541;Operatör, gruvventilation;8111
7599;Operatör, scenmaskineri;3522
5704;Optiker;2284
7501;Optikerassistent;5224
5949;Orderadministratör;3324
2744;Orderfördelare;3324
6329;Ordermottagare;4115
2747;Orderplanerare;3324
2482;Ordningsvakt;5413
5801;Organisationschef;1113
6597;Organisationschef, kommun;1230
5172;Organisationsjurist;2615
4731;Organisationskonsult;2421
1880;Organisationssekreterare, intresseorganisation;2422
6302;Organisationsutvecklare;2421
1840;Organisk kemist;2113
7516;Organist;2652
5636;Orgelbyggare;7319
960;Orgelpipmakare;7319
961;Orgelstämmare;7319
6149;Originalare;2172
4665;Originalmontör;7321
3827;Originaltecknare;2172
3358;Orkesterledare;2652
1375;Ornamentstenhuggare;8116
1384;Ortdrivare/Tillredare;8111
7299;Ortodontiassistent;5350
6120;Ortopedingenjör;3214
3949;Ortopedskomakare;7534
3951;Ortopedskotekniker;7534
3721;Ortopedtekniker;3214
7386;Ortoptist;2239
1630;Osteopat;2271
4326;Ostmästare;3115
5258;Packare;9320
5270;Packmästare;3122
5418;Paketbilsförare;8329
5193;Paketläggare;8173
1831;Paleontolog;2114
2843;Pannplåtslagare;7215
5888;Pantlånare;4212
659;Pappersarbetare;8172
660;Pappersmaskinförare;8172
4704;Pappersskärare, bokbinderi;7323
6248;Pappersvaruarbetare;8143
6717;Parkarbetare/Utemiljöarbetare/Miljövärd;6113
5047;Parkchef;1230
5907;Parkeringsvakt;5419
1351;Parkettarbetare;8173
2297;Parkettläggare;7122
4566;Parkförman;6113
5253;Parkförvaltare;2134
1771;Partikelfysiker;2111
7426;Passagerarkoordinator;4221
5824;Pastor, frikyrkoförsamling;3412
2117;Pastorsadjunkt;2671
5469;Patentingenjör/Patentkonsult;2149
4002;Patentjurist;2614
3825;Patinerare;7319
5428;PC-koordinator;3511
5997;PC-samordnare;3511
2071;Pedagogassistent;5312
254;Pedikyrist/Pedikurist;5149
5417;Pendeltågsförare/Motorvagnsförare;8311
2536;Penningmarknadsmäklare;3311
5290;Penselmakare;8219
7396;Perfusionist;3211
298;Persiennmontör;8213
5546;Personaladministratör/Personalassistent;4112
401;Personalansvarig;2423
6327;Personalchef/HR-chef;1220
4892;Personaldirektör;1220
4894;Personalintendent;1220
2207;Personalkontorist;4112
2208;Personalredogörare;4112
6820;Personalsekreterare;4112
6102;Personalutbildare;3449
7680;Personalutvecklare;2423
6241;Personbilsförare, persontransporter;8321
5798;Personlig assistent;5343
582;Personlig handläggare, försäkringskassa;3353
7283;Personlig tränare/PT;3422
6862;Personligt ombud;2669
2564;Personskadereglerare;3314
6669;Peruk- och tupéfrisör;5141
245;Perukmakare;5141
957;Pianobyggare;7319
958;Pianostämmare;7319
5635;Pianotekniker;7319
550;Pilot/Trafikflygare/Flygkapten;3153
553;Pilot/Trafikflygare/Flygstyrman;3153
522;Pistmaskinförare;8342
5505;Pizzabagare;9411
4329;Pjäsmekaniker;7311
6666;Placeringsassistent;3411
2537;Placeringsrådgivare;2413
3934;Planare, glas;7319
7315;Planarkitekt;2163
4982;Planerare, flygbolag;4323
5;Planeringsarkitekt/Fysisk planerare;2163
5077;Planeringschef;1230
4251;Planeringsingenjör, elektronik;3113
4237;Planeringsingenjör, elkraft;3113
91;Planeringsingenjör, el-tele;2143
4285;Planeringsingenjör, kemiteknik;3115
4269;Planeringsingenjör, maskin;3114
4311;Planeringsingenjör, textil, trä, glas, förpackn.;3119
2209;Planeringskontorist;4119
4286;Planeringstekniker, kemiteknik;3115
4298;Planeringstekniker, metallurgi;3116
4312;Planeringstekniker, textil, glas, trä, förpackn.;3119
4369;Planhyvlare, trä;7523
3935;Planslipare, glas;7319
7243;Plantskolearbetare, skog;9210
5124;Plantskolechef;6112
2339;Plantör;9210
1772;Plasmafysiker;2111
5640;Plastarbetare;8142
974;Plastbåtbyggare;8142
975;Plastgjutare;8142
976;Plasthärdare;8142
977;Plastimpregnerare;8142
978;Plastmaskinoperatör;8142
299;Plastmontör;8213
980;Plastreparatör;8142
983;Plastsvetsare;8142
984;Plastvaruarbetare;8142
7254;Platschef, anläggning;1360
7307;Platschef, bilprovning;1790
5055;Platschef, bygg;1360
7234;Platschef, film/TV;3433
696;Platschef, reseföretag;5113
5129;Platschef/Områdeschef, försäkringskassa;1590
7233;Platskoordinator;3433
7625;Platsletare, film/Location scout;3433
6407;Plattsättare;7112
7177;Plattsättare, utan yrkesbevis;7112
1054;Plysare;8151
1352;Plywoodarbetare;8173
7366;Plåtbearbetare;7214
4107;Plåtriktare;8129
7430;Podiater/Podiatriker;2289
4877;Polerare, trä;7522
7639;Polisaspirant;3360
3464;Polisassistent;3360
4486;Polisintendent;1590
4487;Polismästare;1590
4488;Polissekreterare;1590
1326;Pontonkranförare;8343
4071;Porslinsdekoratör;7319
3258;Porslinsgjutare;7319
4072;Porslinsmålare;7319
3260;Porslinsputsare;7319
3261;Porslinsslipare;7319
1327;Portalkranförare;8343
2141;Postterminalarbetare;4420
5121;PR-chef;1240
3234;Preparator;2651
6857;Prepressoperatör;7321
1105;Pressare, kläder;9120
1353;Pressare, spånskivor;8173
1354;Pressare, träfiber, spånskivor;8173
4831;Pressbiträde;7322
5122;Presschef;1240
3886;Pressekreterare;2432
3007;Pressgjutare;8129
2621;Pressmed;7221
6888;Pressoperatör, tryckmedier;7321
1967;Primärvårdskurator;2662
2749;Prissättare;3339
6296;Privatbokbindare;7323
5911;Privatdetektiv;5419
428;Privatekonom;3312
6008;Privatekonomisk rådgivare;3312
411;PR-konsult;2432
412;PR-man;2432
7477;Processansvarig, ITIL;2519
69;Processingenjör, elkraft;2143
92;Processingenjör, el-tele;2143
192;Processingenjör, gruv;2146
6594;Processingenjör, kemiteknik;3115
120;Processingenjör, maskin;2144
203;Processingenjör, metallurgi;2146
1841;Processkemist;2113
4150;Processoperatör, asfalt;8114
4146;Processoperatör, betong;8114
1184;Processoperatör, bryggeri;8169
6206;Processoperatör, cementtillverkning;8114
6175;Processoperatör, glas;8189
5626;Processoperatör, kemisk industri;8192
1121;Processoperatör, kvarn;8163
5981;Processoperatör, malmanrikning;8112
1195;Processoperatör, mejeri;8162
7520;Processoperatör, metallindustri;8129
5589;Processoperatör, papper;8172
5588;Processoperatör, pappersmassa;8171
7335;Processoperatör, smältverk;8193
6018;Processoperatör, stålindustri;8193
6021;Processoperatör, värmebehandling;8129
7529;Processtekniker, gjuteri;3116
7521;Processtekniker, tillverkningsindustri;3114
7321;Processtekniker, vattenrening;8191
7410;Processutvecklare, kemi;2145
7047;Producent: kultur, media, film;2654
413;Produktchef, marknadsföring;2431
6168;Produktionsassistent;3433
7255;Produktionschef, anläggning;1360
6358;Produktionschef, bygg;1360
7550;Produktionschef, Posten;1320
5538;Produktionschef, tillverkning;1370
7064;Produktionsekonom;2419
6593;Produktionsingenjör, bygg;3121
6221;Produktionsingenjör, elektronik;3113
6592;Produktionsingenjör, elkraft;3113
5474;Produktionsingenjör, gjuteri;2146
193;Produktionsingenjör, gruv;2146
6234;Produktionsingenjör, gruv, metallurgi;3116
7409;Produktionsingenjör, kemi;3115
6591;Produktionsingenjör, maskin;3114
6590;Produktionsingenjör, textil, trä, glas, förpackn;3119
7232;Produktionskoordinator;3433
7551;Produktionsledare, Posten;1320
7492;Produktionsledare, tillverkningsindustri;3114
5016;Produktionsledare: kultur, media, film;2654
7493;Produktionsplanerare, tillverkningsindustri;3114
3888;Produktionsplanerare: kultur, media, film;2654
3909;Produktionssekreterare;3433
7002;Produktionstekniker, maskin/verkstad;3114
373;Produktionstekniker, petroleumutvinning;3116
5038;Produktområdeschef, järnväg;1320
7498;Produkttekniker, konfektion;7531
161;Produktutvecklare;2149
7500;Produktutvecklare, konfektion;7531
6170;Professionell idrottsutövare;3421
7269;Professor;2311
1440;Prognosmeteorolog;2112
3703;Programledare;3439
7432;Programmerare, konsolspel;2513
7433;Programmerare, mobilspel;2513
7570;Programmerare, onlinespel;2513
7431;Programmerare, PC-spel;2513
7435;Programmerare, webbspel;2513
3704;Programpresentatör;3439
3910;Programsekreterare;3433
6113;Programvärd/Programvärdinna;3439
7484;Projekteringsingenjör, bygg och anläggning;2142
57;Projekteringsingenjör, elkraft;2143
7485;Projekteringsingenjör, el-tele och elektronik;2143
7487;Projekteringsingenjör, gruv och metallurgi;2146
7486;Projekteringsingenjör, maskin;2144
7649;Projektledare, bygg och anläggning;2142
5388;Projektledare, IT;2512
5324;Projektledare, reklam;2431
7148;Projektledare: kultur, media, film;2654
7116;Prorektor;1410
7679;Prototyptillverkare, metall;7222
4225;Provningsingenjör, elkraft;3113
101;Provningsingenjör, el-tele;2143
127;Provningsingenjör, maskin;2144
6411;Provsmakare;7613
6777;Prydnadsväxtodlare;6112
2706;Präglare, metall;7223
5829;Präst, annat trossamfund;2671
5827;Präst, grekisk-ortodox kyrka;2671
5826;Präst, romersk-katolsk kyrka;2671
1479;Psykoanalytiker;2241
5709;Psykolog;2241
5710;Psykoterapeut;2242
7292;PTP-psykolog;2241
7662;Publikvärd;9629
2880;Pumpman, oljeborrning;8113
866;Pumpmontör;8213
867;Pumpreparatör;7233
2210;Punktskriftskontorist;4119
2695;Punktsvetsare;7223
265;Påklädare;3433
511;Pålmaskinförare;8342
4398;Påsmaskinskötare;8143
6342;Pälsdjursskötare;6129
4971;Pälsdjursuppfödare;6129
3413;Pälsskinnberedare;7534
4344;Pälssömmerska;7531
5828;Rabbin;2671
3517;Radio Officer;3521
3519;Radioexpeditör;4223
1773;Radiofysiker;2111
7603;Radiolokförare;8311
7571;Radioloksoperatör;8312
4994;Rampagent;4323
4983;Rampförman, flygplats;4323
7539;Raslastare;8111
7071;Recensent;2642
5597;Receptionist, telefonist;4225
5595;Receptionschef;4224
7068;Redaktionsassistent;4119
5065;Redaktionschef;1590
3327;Redaktionssekreterare;2642
3328;Redaktör;2642
2776;Rederiagent;3331
6153;Redigerare;2641
3076;Redovisningsassistent;4111
5078;Redovisningschef;1210
5989;Redovisningsekonom;3313
6854;Redovisningskonsult;3313
2900;Redovisningsman;3313
3404;Regiassistent;3433
5095;Regionchef, butik;1730
5094;Regionchef, försäkring;1610
5048;Regionchef, skogsbruk;1380
6067;Regissör;2654
5968;Registrator;4119
6017;Reglerare, masugn;8193
3030;Reglerare, stålverk;8193
3110;Reglerare, valsverk;8122
7682;Regulatorisk handläggare;2422
1085;Regummerare;8141
6840;Rehabhandläggare;2661
1496;Rehabiliteringsassistent;3411
4816;Reklamassistent;4114
4891;Reklamationshandläggare;4222
5123;Reklamchef;1240
4043;Reklamdesigner;2172
2675;Reklamdistributör/Reklamutdelare;9621
414;Reklamkonsulent;2431
415;Reklamman;2431
2802;Reklamsekreterare;4114
3855;Reklamtextare;2172
5404;Rekryterare/Rekryteringskonsult;2423
3422;Rektor;1410
6164;Rekvisitör;3433
7089;Rekvisitörsassistent;3433
7134;Relationsmarknadsförare;2431
6691;Renhållningsförare;8332
524;Renhållningsmaskinförare;8342
7329;Renserioperatör;8171
4868;Reparationssnickare;7522
3359;Repetitör;2652
4669;Reprofotograf;7321
1047;Repslagare;8159
6440;Researcher, rekrytering;2423
691;Resebyråassistent;4221
5109;Resebyråchef;1790
693;Resehandläggare;4221
5593;Reseledare;5113
5416;Resemontör, maskin;7233
5924;Reseproducent;3332
7582;Reservdelschef;4321
2280;Reservdelsspecialist/Bildelsspecialist;7231
5314;Resesäljare/Reseförsäljare/Resekonsulent;4221
5555;Restaurangbiträde;9412
5544;Restaurangchef;1720
4175;Restauranginspektör;3359
4673;Retuschör;7321
2893;Revisionsbiträde;3313
1243;Revisionschef;1210
5670;Revisor;2411
5988;Revisorsassistent;3313
7642;Ridinstruktör/Ridlärare;3422
2641;Riggare, verktygsmaskiner;7223
4450;Riksantikvarie;1112
4451;Riksarkivarie;1112
6518;Riksbibliotekarie;1112
6586;Riksdagsledamot;1111
5962;Riksdagsstenograf;3359
6585;Riksgäldsdirektör;1112
4956;Rikspolischef;1112
4957;Riksåklagare;2613
4109;Ringverksarbetare;8129
5921;Riskbedömare;3321
2574;Riskingenjör, försäkring;3321
7565;Riskingenjör, risk management;3354
4248;Ritare, elektronik;3113
4226;Ritare, elkraft;3113
4262;Ritare, maskin;3114
4308;Ritare, textil, trä, glas, förpackning;3119
868;Robotmontör;8213
7008;Robotoperatör;8199
2697;Robotsvetsare;7223
6672;Roddare/Roadie;9332
7605;Rosenterapeut;3230
399;Rostskyddsbehandlare;7132
7231;Rostskyddsmålare;7132
667;Rullare, papper;8172
4833;Rulloffsettryckare;7322
806;Rulltrappmontör;7412
703;Rundtursguide;5113
6525;Rymdingenjör;2143
3139;Rådman;2612
3416;Råhudsarbetare;8159
5233;Räddningschef;1590
6773;Räddningsledare, statlig räddningstjänst;5414
6759;Ränteanalytiker;2415
3303;Rättssociolog;2623
3197;Rättstolk;2643
5784;Röntgensjuksköterska;2235
3590;Röntgentekniker;3211
4110;Rörbockare;8129
3051;Rördragare;8129
7650;Rörinfodrare;7125
4111;Rörriktare;8129
3709;Röstpedagog;2359
7660;SAD (Second assistant director);3433
6192;Sadelmakare;7534
3212;Samhällsekonom;2415
1905;Samhällsplanerare;2422
7532;Samhällsvägledare;2422
7536;Samplingspersonal;5241
6852;Samtalsterapeut;2662
3008;Sandberedare, gjuteri;8129
4436;Sandwichman;9629
6197;Saneringsarbetare;7134
6523;Satellitoperatör;2143
6187;Scannertekniker/Scanneroperatör;3521
3902;Scenförman;3522
6166;Scenmästare;3522
6258;Scenograf;3432
3903;Scentekniker;3522
4682;Schablontillverkare, screentryck;7322
1385;Schaktsänkare;8111
6297;Screentryckare;7322
6167;Scripta;3433
5699;Segelmakare;7532
1832;Seismolog;2114
5966;Sekreterare;4119
7676;Sektionschef, gruva;1360
7668;Sektionschef, offentlig förvaltning;1590
1453;Sektionschef, sjukhus;1510
3838;Serietecknare;2651
592;Servicechef, bilverkstad;3339
4781;Serviceelektriker, installation;7411
7667;Servicehandläggare;3359
2053;Servicehusföreståndare;1530
6223;Serviceingenjör, elektronik;3113
4241;Serviceingenjör, elkraft;3113
6233;Serviceingenjör, kemiteknik;3115
6228;Serviceingenjör, maskin;3114
4301;Serviceingenjör, metallurgi;3116
7400;Servicetekniker, data;7420
4259;Servicetekniker, elektronik;7420
4242;Servicetekniker, elkraft;7413
5306;Servicetekniker, kontorsmaskiner;7420
4278;Servicetekniker, maskin;7231
7544;Servicetekniker, tåg;7233
5487;Servitör/Servitris;5131
235;Servitör/Servitris, fartyg;5131
5490;Servitör/Servitris, kafé och konditori;5131
7382;SFI-lärare;2359
7473;Shiatsuterapeut;3230
2894;Siffergranskare;4119
105;Signalingenjör;3113
6889;Signalman;5419
817;Signaltekniker;7420
1122;Siloarbetare;8163
875;Silversmed;7312
389;Simhallsföreståndare;1740
2902;Simhallsvakt;5419
3014;Sintare;8193
3032;Sinterblandare;8193
6748;Sjukhusdiakon;2672
6398;Sjukhusdirektör;1120
1774;Sjukhusfysiker;2111
3591;Sjukhusingenjör;3211
1842;Sjukhuskemist;2113
1968;Sjukhuskurator;2662
2118;Sjukhuspräst;2671
462;Sjukhusstädare;9111
3724;Sjukhustandtekniker;3214
3592;Sjukhustekniker;3211
6766;Sjukhusvaktmästare;9622
1823;Sjuksköterska, barnavårdscentral;2232
1954;Sjuksköterska, diagnostisk radiologi;2235
7352;Sjuksköterska, geriatrisk vård;2227
7296;Sjuksköterska, grundutbildad;2221
5780;Sjuksköterska, medicin och kirurgi;2221
5783;Sjuksköterska, psykiatrisk vård;2225
7244;Sjuksköterska, äldreomsorg och -vård/geriatrik;2227
1462;Sjuktransportör;5326
5707;Sjukvårdsbiträde;5330
3198;Sjukvårdstolk;2643
3711;Sjöbevakningsassistent;5414
7583;Sjöfartskontrollant/Hamnskyddskontrollant;5419
7562;Skadedjurstekniker;7134
2571;Skadeingenjör, försäkring;3314
5919;Skadereglerare;3314
2573;Skadetekniker;3314
4489;Skattedirektör;1590
5691;Skattehandläggare;3352
6029;Skattejurist;2614
2211;Skeppningsassistent;4323
2777;Skeppningschef;3331
2212;Skeppningskontorist;4323
2769;Skeppningsplanerare;3331
5953;Skeppsklarerare/Waterclerk;3331
5958;Skeppsmäklare;3331
362;Skeppsmätare;3354
7641;Skidinstruktör/Skidlärare;3422
5686;Skidliftskötare;8343
7655;Skidliftvärd;9629
7136;Skidpatrullör/Pistör;5419
1405;Skifferbrottarbetare;8111
3417;Skinnfärgare;8159
1429;Skinnsömmerska;7532
3052;Skivställare;8129
5643;Skofabriksarbetare;8159
6959;Skogsarbetare, motormanuell avverkning;6210
6957;Skogsarbetare, plantering;6210
6958;Skogsarbetare, röjning;6210
7162;Skogsbrukare;6210
4517;Skogsbruksforskare;2135
6951;Skogsbruksinstruktör;2320
4708;Skogsbruksrådgivare;2135
6949;Skogsekonom;3335
6953;Skogsförvaltare;1380
4707;Skogsingenjör;2135
6946;Skogsinspektor;2135
4521;Skogskonsulent/Skogsvårdskonsulent;2135
5558;Skogsmaskinförare;8341
7458;Skogsmästare;2135
6948;Skogsplanläggare;2135
6693;Skogstransportförare;8332
6954;Skogsvårdschef;1380
6952;Skogsvärderare;3335
5840;Skolassistent;4116
2453;Skolbibliotekarie;2622
3423;Skolchef;1410
3424;Skoldirektör;1410
3426;Skolinspektör;2351
3605;Skolkonsulent;2351
1969;Skolkurator;2662
6073;Skolledare;1410
5479;Skolmåltidsföreståndare;3452
1474;Skolpsykolog;2241
1908;Skolsekreterare;2422
1824;Skolsköterska;2233
5886;Skolvaktmästare;5152
1544;Skolvärd/Skolvärdinna;5312
6174;Skomakare/Skoreparatör;7534
4437;Skoputsare;9120
6196;Skorstensfejare/Sotare;7133
5309;Skorstensfejarmästare;7133
4076;Skorstensfejartekniker;7133
7194;Skorstenstätare;7119
500;Skotarförare, skogsbruk;8341
3202;Skrivtolk/Vuxendövtolk;2643
1386;Skrotare;8111
5443;Skrovbyggare, trä;7522
5698;Skräddare;7531
6047;Skulptör;2651
986;Skumplastarbetare;8142
566;Skyddsingenjör;2181
7259;Skyddsrumsinspektör;3355
2486;Skyddsvakt;5413
4019;Skyltgravör;7319
4020;Skylttillverkare;7319
6051;Skådespelare;2655
3037;Skänkskötare;8193
501;Skördarförare, skogsbruk;8341
5873;Skördearbetare;9210
7298;Skötare;5341
5500;Slaktare;7611
7593;Slaktmästare;7611
7678;Slipare, finbearbetning;7224
5933;Slipare, metall;7224
4371;Slipare, snickeri;7523
3981;Slipmaterialarbetare;8189
3982;Slipskiveformare;8189
3983;Slipverktygsarbetare;8189
3984;Slipverktygsoperatör;8189
3985;Slipverktygstillverkare;8189
5909;Slussvakt;4323
3221;Slöjdare;7319
5927;Smed;7221
2624;Smidesmekaniker;7221
2625;Smidesoperatör;7223
5046;Smådjursskötare;6122
7549;Småmaskinsmekaniker;7231
3964;Smältare, glas;8189
7471;Smältare/Smältverksoperatör;8193
3986;Smärgelduksarbetare;8189
1874;Smärtsjuksköterska;2221
4372;Snickerimaskinskötare;7523
7656;Snöläggare;9629
1048;Snörmakare;8159
2890;Snöskottare;9610
6191;Socialantropolog;2623
5234;Socialchef;1230
5235;Socialdirektör;1230
5807;Socialkonsulent, Arbetsförmedlingen;2661
5757;Socialsekreterare;2661
6054;Sociolog;2623
7502;Socionom;2661
1790;Socioterapeut;3411
6579;Sodahusoperatör;8171
243;Solarievärd/Solarievärdinna;5226
7525;Soldat/Sjöman;0310
6326;Soliditetsupplysare;4119
300;Solskyddsmontör;8213
1306;Solvare;8159
236;Sommelier;5131
2861;Sorteringsverksskötare, stenkross;8112
5393;SOS-operatör;5414
224;Souschef;3451
6535;Spa- och kurterapeut;5149
3418;Spaltmästare, garveri;7534
1123;Spannmålsarbetare;8163
1124;Spannmålstorkare;8163
7505;Spannramsförare;8151
7238;Specialistläkare;2211
7526;Specialistofficer;0210
1573;Specialisttandläkare;2260
5483;Specialkock;5120
7403;Speciallärare;2351
6656;Specialpedagog;2351
6689;Specialtransportförare;8332
5839;Speditionsassistent;4323
5119;Speditionschef;1320
2756;Speditionsförman;3331
2757;Speditionstjänsteman;3331
5952;Speditör;3331
7437;Speldesigner;2173
7436;Speltestare;2514
4113;Spikmaskinskötare;8129
3507;Sportchef;3422
4650;Sporthallsvaktmästare;5152
3509;Sportledare;3422
1138;Sprayare;8132
7195;Sprinklermontör;7125
1185;Spritberedare;8169
3204;Språkforskare;2643
6676;Språkteknolog;2643
931;Sprängämnesarbetare;8132
2730;Spårsvetsare;7212
5671;Spårvagnsförare;8331
6786;Spärrexpeditör/Spärrvakt;5112
7464;SQE Supplier Quality Engineer;3111
1252;SSA-sekreterare;2352
3996;Stadsadvokat;2615
6576;Stadsarkivarie;1590
5236;Stadsbyggnadschef;1340
5237;Stadsbyggnadsdirektör;1340
6575;Stadsdirektör;1112
3997;Stadsjurist;2615
3999;Stadsombudsman;2615
4000;Stadssekreterare;2615
5049;Stadsträdgårdsmästare;1380
1859;Stadsveterinär;2250
4598;Stallchef/Stallförman;6121
162;Standardiseringsingenjör;2149
76;Standardiseringsingenjör, elkraft;2143
3690;Stand-up-komiker;3439
1030;Stansare, skor;8159
2827;Stansare, tunnplåt;7214
4021;Stansgravör;7319
2888;Stationsarbetare;9610
5040;Stationschef, flyg;1320
277;Stationsmontör;8191
858;Stationsmontör, elkraft;7413
6787;Stationsvärd;5112
6574;Stationär väktare/Receptionsväktare;5413
7659;Statist;3439
5703;Statistiker;2122
2215;Statistikkontorist;4119
4453;Statsheraldiker;1112
7355;Statssekreterare;1111
3153;Statsåklagare;2613
1406;Stenarbetare;8116
1407;Stenbildhuggare;8116
1392;Stenborrare;8111
1408;Stenborrare, stenbrott;8111
7380;Stenbrottsarbetare;8111
1409;Stenbrytare;8111
5692;Stengravör;8116
1410;Stenhuggare;8116
5980;Stenkrosskötare;8112
2862;Stenkrossmaskinist;8112
2863;Stenkrossmatare;8112
6209;Stenmaskinskötare;8114
7188;Stenmontör;7112
7178;Stenmontör, utan yrkesbevis;7112
2803;Stenograf;4119
4167;Stenslipare;8114
4168;Stensvarvare;8114
4169;Stensågare;8114
5868;Stensättare;7114
7353;Steriltekniker/Undersköterska, sterilcentral;5323
1311;Stickare, textilindustri;8159
2120;Stiftsadjunkt;2671
2070;Stiftsdiakon;2672
1387;Stigortsdrivare;8111
7237;ST-läkare;2212
7346;Stomiterapeut;2221
210;Storhushållsföreståndare;3452
2903;Strandvakt;5419
6802;Strukturkemist;2113
1775;Strålningsfysiker;2111
3041;Stränggjutare, stålverk;8193
5632;Stränginstrumentmakare;7319
4115;Strängpressare, metall;8129
987;Strängsprutare;8142
7300;ST-tandläkare;2260
6319;Stuckatör;7112
1253;Studie- och yrkesvägledare;2352
2780;Studieadministratör;3359
2781;Studieassistent;3359
3607;Studieinstruktör;2351
2782;Studiekonsulent;3359
3651;Studieledare;3449
2783;Studieorganisatör;3359
3427;Studierektor;1410
2784;Studiesekreterare;3359
5675;Studievägledare;2352
3901;Studioman;3433
4029;Studiotekniker;3521
6165;Studiovärdinna;4225
2312;Stuguthyrare;5226
726;Stugvärd;4224
3584;Stuntman;3439
4601;Stuteriarbetare;6121
4997;Stuveriförman;4323
5501;Styckare;7611
267;Styckmästare;7611
252;Stylist;5149
6573;Styr- och reglertekniker;7420
7377;Stålbyggare;7215
4022;Stålgravör;7319
4697;Stålsticksgravör;7321
464;Städare/Lokalvårdare;9111
5587;Städchef;1120
5814;Ställningsbyggare;7116
7180;Ställningsbyggare, utan yrkesbevis;7116
5617;Ställverksmontör;7413
6551;Stämningsman;4212
7446;Stängselmontör;9310
7669;Stödassistent;5342
7670;Stödpedagog;3411
6259;Sufflör;3433
6692;Sug- och spolbilsförare;8332
2926;Supportsvarvare;7223
3065;Supporttryckare;7223
6000;Svarvare;7223
7070;Svensktextare;2643
5945;Svetsare, manuell;7212
139;Svetsingenjör;2144
2698;Svetsoperatör/Automatsvetsare;7223
845;Symaskinsreparatör;7420
1989;Synkonsulent;2422
7510;Synpedagog;2351
7445;Syntolk;2643
2918;Systemadministratör;3513
2411;Systemanalytiker/Systemutredare;2511
5996;Systemansvarig;2515
7601;Systemarkitekt;2511
2413;Systemdesigner;2512
2919;Systemförvaltare;2515
4834;Systemoperatör, tryckeri;7322
2601;Systemsäljare;3322
5422;Systemtestare;2514
2419;Systemutvecklare/Programmerare;2512
760;Sågare;8173
762;Sågoperatör;8173
763;Sågverksarbetare;8173
5600;Sågverksoperatör;8173
7201;Sångare, folkmusik;2652
3346;Sångare, klassisk musik;2652
6109;Sångare, populärmusik;2652
6572;Sångpedagog;2359
4399;Säckmaskinskötare;8143
2718;Säkerhetsadministratör, IT;2516
2719;Säkerhetsanalytiker, IT;2516
2720;Säkerhetsansvarig, IT;2516
6377;Säkerhetschef;1290
568;Säkerhetsingenjör;3354
6997;Säkerhetsmontör;9332
6771;Säkerhetsrådgivare;3354
2489;Säkerhetsvakt;5413
4918;Säljassistent;4114
2609;Säljkonsulent;3322
2610;Säljledare;3322
694;Säljledare, resebyrå;4221
4919;Säljsekreterare;4114
7051;Sändningstekniker;3521
7620;Sömmerska, möbeltillverkning;7533
5859;Tak- och tätskiktsmontör;7121
7181;Tak- och tätskiktsmontör, utan yrkesbevis;7121
7545;Takmålare, plåt;7132
7474;Taktilterapeut;3230
4757;Talassolog;2132
7049;Talboksproducent;2641
2177;Tallyman;4323
7509;Talpedagog;2351
3333;Taltidningsredaktör;2642
6875;Taltjänsttolk;2643
5723;Tandhygienist;3250
5724;Tandläkare;2260
5722;Tandsköterska;5350
6121;Tandtekniker;3214
1369;Tandteknikerbiträde;7311
6360;Tandvårdsassistent;5349
5058;Tandvårdsbiträde;5349
541;Tank- och bulkbilsförare;8332
7617;Tapetserare, hantverk;7533
7616;Tapetserare, industriell tillverkning;7533
4835;Tapettryckare;7322
4698;Tapetvalsgravör;7321
1174;Tappare, bryggeri;8169
1388;Tappare, gruva;8111
1175;Tappmaskinskötare;8169
2575;Tarifferare;3321
270;Tarmförädlingsarbetare;7611
3839;Tatuerare;3439
6242;Taxiförare/Taxichaufför;8321
704;Taxiguide;5113
886;Taxitelefonist;4223
6516;Teamledare;1250
7149;Teateragent;3339
6475;Teaterchef;1120
4448;Teaterinspicient;3433
2152;Teaterkassör;5230
7381;Teatermålare;3432
6100;Teaterpedagog;2359
5211;Teatertekniker;3522
5184;Teckenspråkslärare;2359
3199;Teckenspråkstolk/Dövblindtolk;2643
6176;Tegelbruksarbetare;8189
6160;Teknikinformatör;2641
5238;Teknisk chef, kommun;1340
5372;Teknisk chef/Maskinchef, fartyg;3151
5239;Teknisk direktör, kommun;1340
7468;Telefonförsäljare;5242
5377;Telefonintervjuare;4226
6570;Teleingenjör;3113
6397;Teleområdeschef;1320
7249;Teleskoptruckförare;8344
7247;Teleskoptruckförare, anläggning;8342
839;Teletekniker;7420
1328;Telferförare;8343
2976;Tenngjutare;7211
3823;Teologisk forskare;2623
2233;Terminalarbetare;4322
6794;Testförare;8329
6826;Testledare;2514
163;Textilingenjör;3119
3277;Textilkonstnär;2651
1057;Textiltryckare;8151
3236;Textilvårdare;7319
2673;Tidningsbud/Tidningsdistributör;9621
6789;Tillgänglighetskonsult;3355
6247;Tillskärare, konfektion;7531
7618;Tillskärare, möbeltillverkning;7533
4389;Tillskärare, skinnkläder;7531
746;Timmersorterare;8173
3140;Tingsfiskal;2612
3141;Tingsnotarie/Notarie;2612
6013;Tivoliarbetare;9629
1139;Tjärkokare;8132
6568;TMP/CTMP-operatör;8171
6037;Tolk;2643
6188;TOM, Technical Operation Manager;3521
3355;Tonsättare;2652
7160;Torgförsäljare/Marknadsförsäljare;9520
668;Torkare, papper;8172
651;Torkmaskinförare, massaindustri;8171
1358;Torkskötare;8173
1329;Tornkranförare;8343
5875;Torvarbetare;9310
2359;Toxikolog;2131
7556;Trader;2414
5969;Traffic;4119
2808;Trafficman;4119
5601;Trafikassistent;4221
6354;Trafikchef;1320
5000;Trafikförman;8312
5602;Trafikinformatör;4221
4210;Trafikingenjör;3112
6566;Trafikinspektör;3354
7425;Trafikkoordinator;4323
7636;Trafikledare, spårburen trafik;4323
5003;Trafikledare, vägtrafik;4323
6797;Trafiklots;5419
6105;Trafiklärare;3441
7584;Trafiknykterhetskontrollant;5419
3645;Trafikpedagog;3441
7282;Trafikplanerare, offentlig förvaltning;2422
4980;Trafikplanerare, transportföretag;4323
6719;Trafiksamordnare;4323
5244;Trafikskolechef;1490
2495;Trafikvakt;5419
2496;Trafikvärd/Taxivärd;5112
2497;Trafikövervakare;5419
7343;Trailerreparatör;7231
1335;Traktorförare, industri;8344
619;Traktormekaniker;7231
2770;Transportadministratör;3331
5042;Transportchef;1320
2771;Transportingenjör;3331
6349;Transportledare;4323
5957;Transportplanerare;4323
2773;Transportsamordnare;4323
7084;Trapetskonstnär;3439
466;Trappstädare;9111
390;Travbaneföreståndare;1740
1330;Traversförare;8343
3917;Travkusk;3421
7506;Trikåstickare;8159
3692;Trollkarl;3439
5687;Truckförare;8344
621;Truckreparatör;7231
963;Trumtekniker;7319
5637;Trumtillverkare;7319
2993;Trycksaksfaktor;3122
3066;Trycksvarvare;7223
6020;Tråddragare;8129
3054;Trådspolare, metall;8129
5821;Träarbetare, gruva;7111
6581;Träarbetare/Snickare;7111
7182;Träarbetare/Snickare, utan yrkesbevis;7111
4869;Träbildhuggare;7522
6275;Trädgårdsanläggare/Trädgårdsanläggningsarbetare;6113
6274;Trädgårdsarbetare/Plantskolearbetare, trädgård;6112
4509;Trädgårdsforskare;2134
4554;Trädgårdsförman;6112
6268;Trädgårdsingenjör/Trädgårdstekniker;2134
4568;Trädgårdsmästare, anläggning;6113
6273;Trädgårdsmästare, odling;6112
4511;Trädgårdsrådgivare/Trädgårdskonsulent;2134
1359;Träfiberskivarbetare;8173
6345;Träförgyllare;7521
7615;Trähusarbetare/Spikare;7523
3222;Träslöjdare;7319
3223;Träsnidare;7319
4378;Träsvarvare;7523
5153;Träullsarbetare;9320
2178;Tulldeklarant;4323
6563;Tulldirektör;1590
6330;Tullkontorist;4119
2180;Tullombud;4323
1338;Tulltaxerare;3331
5665;Tulltjänsteman;3351
5154;Tunnbindare;7522
1393;Tunnelsprängare;8115
5551;Tunneltågförare;8311
6754;Tunnplåtslagare;7214
869;Turbinmontör;7233
870;Turbinreparatör;7233
727;Turistassistent;4221
5131;Turistbyråchef;1790
5598;Turistbyråtjänsteman;4221
5240;Turistchef;1740
728;Turistinformatör;4221
5241;Turistintendent;2422
729;Turistsekreterare;2422
730;Turistvärd/Turistvärdinna;5113
7090;Turnéledare;3339
7150;Turnéläggare;3339
6883;Turnéproducent för utställningar;3339
5212;Turnétekniker;3522
7145;TV-chef;1120
4449;TV-inspicient;3433
3158;Tvistemålsadvokat;2611
4814;TV-redigerare;3521
847;TV-tekniker/Hemelektroniktekniker;7420
643;Tvättchef;1120
1111;Tvätteriarbetare/Tvättbiträde;8151
7012;Tågklarerare;4323
7358;Tågledare;4323
6671;Tågvarnare;9629
795;Tågvärd/Tågvärdinna;5112
272;Tårtmakare;7612
3918;Tävlingsryttare;3421
2101;Ugnsmurare;7112
6417;Ugnsoperatör;8193
3988;Ugnsskötare, glas, keramik;8189
3045;Ugnsskötare, stålverk;8193
3974;Ugnsuppsättare, keramik;8189
2352;Underhållsarbetare;9310
7416;Underhållschef;3116
871;Underhållsmekaniker;7233
7412;Underhållsplanerare;3116
5507;Underhållstekniker, vattenrening;8191
7586;Undersköterska, hemtjänst och äldreboende;5321
7587;Undersköterska, vård- o specialavd. o mottagning;5323
5858;Undertaksmontör;7121
7183;Undertaksmontör, utan yrkesbevis;7121
7066;Undertextare;2643
3610;Undervisningsråd;2351
5916;Underwriter;3321
1497;Ungdomsassistent;3411
1580;Ungdomsgårdsföreståndare;3423
3512;Ungdomsinstruktör/Ungdomstränare;3422
1581;Ungdomskonsulent, fritid;3423
1582;Ungdomsledare;3423
1809;Ungdomssekreterare, socialtjänst;2661
7139;Universitets- och högskoleadjunkt;2319
7138;Universitets- och högskolelektor;2312
6364;Universitetsrektor;1120
2234;Uppackare/Furnerare;9332
3938;Uppblåsare;7319
7503;Upphandlare;3323
4003;Upphovsrättsjurist;2614
2549;Uppköpare;3323
989;Uppläggare;8142
7585;Uppräkningspersonal, bevakningsföretag;5230
5155;Uppslagare, gjuteri;9320
5666;Urmakare;7311
7345;Uroterapeut;2221
5959;Utbildningsadministratör/Utbildningssekreterare;3359
2785;Utbildningsassistent;4116
5245;Utbildningschef;1410
7666;Utbildningshandläggare;3359
3428;Utbildningsintendent;1410
3629;Utbildningskonsulent, företag;3449
6097;Utbildningskonsulent, skola;2351
7094;Utbildningskoordinator;3449
3630;Utbildningsledare;3449
3646;Utbildningsledare, trafikskola;3441
3633;Utbildningsplanerare, företag;3449
7117;Utesäljare;3322
5866;Uthyrare;5226
2313;Uthyrningschef;1730
6705;Utlandsförare;8332
891;Utlandstelefonist;4223
7512;Utredningsassistent;3353
5079;Utredningschef;1230
1911;Utredningssekreterare;2422
6893;Utryckningsväktare;5413
7025;Utställningskoordinator;3339
7048;Utställningsproducent;3332
2350;Utsättarbiträde;9310
7324;Utvecklingschef;1330
59;Utvecklingsingenjör, elkraft;2143
83;Utvecklingsingenjör, el-tele;2143
194;Utvecklingsingenjör, gruv;2146
7414;Utvecklingsingenjör, kemi;2145
112;Utvecklingsingenjör, maskin;2144
7413;Utvecklingsingenjör, metallurgi;2146
7494;Utvecklingsingenjör, tillverkningsindustri;2144
4870;Vagnmakare;7522
872;Vagnreparatör, järnväg;7233
468;Vagnsstädare;9111
7647;Vaktgående maskinpersonal, sjöfart;7233
6904;Valideringsingenjör;3115
3114;Valsare;8122
204;Valsverksingenjör;2146
6028;Valsverksoperatör;8122
5302;Valutaförsäljare;5230
2538;Valutahandlare;3311
2539;Valutamäklare;3311
719;Vandrarhemsföreståndare;4224
6240;Vapenmekaniker;7311
4330;Vapentekniker;7311
6111;Varietéartist;3439
1307;Varpare;8159
4886;Varuhuschef;1120
5263;Varumärkare;9320
6559;Varumärkesjurist;2614
2095;Varvssnickare;7522
2378;Vattenbrukare;6221
5114;Vattenverkschef;1370
2977;Vaxgjutare;7211
2790;VD-sekreterare;3343
2523;Webbansvarig/Webbstrateg;3515
3919;Webbdesigner;2173
6739;Webbredaktör;2642
7046;Webbtekniker;3515
2525;Webmaster;3515
4400;Wellpappmaskinförare;8143
7252;Ventilationsingenjör;3114
2369;Ventilationsisolerare;7123
7190;Ventilationsmontör;7125
5991;Ventilationsplåtslagare;7213
4084;Ventilationssanerare;7134
7253;Ventilationstekniker;7125
962;Verkmakare;7319
7538;Verksamhetsanalytiker;2421
7537;Verksamhetsarkitekt;2421
2032;Verksamhetschef, hälso- och sjukvård;1510
4732;Verksamhetskonsult;2421
7578;Verksamhetskonsult, IT;2511
6558;Verksjurist;2615
5115;Verkstadschef;1370
805;Verkstadselektriker;7412
4273;Verkstadsingenjör;3114
2216;Verkstadskontorist;4119
2930;Verkstadsmekaniker/Verkstadstekniker;7223
4380;Verkstadssnickare;7523
4887;Verkställande direktör;1120
7281;Verktygskonstruktör;3114
5929;Verktygsmakare;7222
2627;Verktygssmed;7221
2645;Verktygsställare;7223
5931;Verktygsuppsättare;7223
5767;Veterinär;2250
1862;Veterinärassistent;3240
7569;Veterinärinspektör;2250
7685;VFX Artist (Visual Effects Artist);3521
6890;Videografiker;3522
7651;Videojournalist/Videoreporter;2642
4815;Videoredigerare;3521
5214;Videotekniker/VB-tekniker;3521
705;Vildmarksguide;5113
4775;Viltmästare;2135
1187;Vinberedare;8169
7681;Vindkraftsprojektör;2183
7548;Vindkraftstekniker;7233
7019;Vinodlare;6111
380;Vinprovare;7613
6955;Virkeschef;1380
5200;Virkesimpregnerare;8173
7399;Virkesköpare/Virkesinköpare;2135
6293;Virkesmätare;6210
6956;Virkesområdeschef;1380
6388;Virkessorterare;8173
1317;Virkmaskinskötare;8159
4758;Virolog;2131
7317;Vitvarumontör;9332
7634;VTS- och lotsoperatör;5414
6557;VVS-ingenjör;3114
5879;VVS-isolerare;7123
5817;VVS-montör;7125
7199;VVS-tekniker;3114
6068;Vågskötare;8181
6317;Vårdare/Arbetshandledare/Boendestödjare;5342
5797;Vårdbiträde;5330
1810;Vårdnadsutredare;2661
1933;Vårdutvecklare;2422
5984;Väderobservatör;9629
7168;Väg- och anläggningsarbetare, utan yrkesbevis;7114
6555;Väg- och vattenbyggnadsingenjör;3112
4491;Vägdirektör;1340
513;Väghyvelförare;8342
7260;Vägingenjör;3112
5871;Väg-och anläggningsarbetare;7114
4177;Vägvakt;5419
5906;Väktare;5413
2613;Värderingsassistent;3314
5926;Värderingsman;3314
5332;Värdetransportör;5413
3965;Värmare, glas;8189
3116;Värmare, valsverk;8122
7198;Värmepumpsmontör;7126
7306;Värmeverkschef;1370
1043;Väskmakare;8159
1308;Vävare;8159
1301;Vävlagare;8159
5624;Växeltelefonist;4223
6776;Växthusodling, förman;6111
4513;Växtodlingsrådgivare/Växtodlingskonsulent;2134
4514;Växtskyddsspecialist;2134
2345;Växtskötare;9210
7604;Yogamassör;3230
5470;Yrkeshygieniker;2181
7293;Yrkesjägare;2135
4879;Ytbehandlare/Sprutlackerare, manuell, trä;7521
1843;Ytkemist;2113
1631;Zonterapeut;3230
4759;Zoolog;2132
3154;Åklagarassistent;2613
6031;Åklagare;2613
292;Ångmaskinist;8191
293;Ångpanneeldare;8191
880;Ädelstensslipare;7312
7119;Äggplockare;9210
2043;Äldreomsorgschef;1530
7657;Äldrepedagog;3411
1422;Ändringsskräddare;7531
4760;Ärftlighetsforskare;2132
1188;Ättiksberedare;8169
7349;Ögonsjuksköterska/Oftamologassistent;2239
4461;Överbibliotekarie;1590
6553;Överdirektör;1112
3534;Överspelningstekniker;3521
4061;Överstyrman;3152
3203;Översättare;2643
3155;Överåklagare;2613