8;Antarktis
23;Australien och Nya Zeeland
11;Centralafrika
16;Centralamerika
18;Centralasien
9;Europa/ej EU/EES/EURES
2;Europa/EU/EES/EURES
0;Hela världen
17;Karibien
24;Melanesien
25;Mikronesien
12;Nordafrika
6;Nordamerika
26;Polynesien
3;Sydamerika
21;Sydostasien
13;Södra Afrika
20;Södra Asien
14;Västafrika
22;Västasien
10;Östafrika
19;Östasien