891;A Coruña;ES
1623;Aberdeen City and Aberdeenshire;UK
995;Achaia;EL
1271;Achterhoek;NL
1278;Agglomeratie Haarlem;NL
1284;Agglomeratie Leiden en Bollenstreek;NL
1282;Agglomeratie 's-Gravenhage;NL
1183;Agrigento;IT
772;Ahrweiler;DE
596;Aichach-Friedberg;DE
1081;Ain;FR
1022;Aisne;FR
994;Aitoloakarnania;EL
158;Akershus;
897;Álava;ES
1434;Alba;RO
915;Albacete;ES
509;Alb-Donau-Kreis;DE
1423;Alentejo Central;PT
1421;Alentejo Litoral;PT
1138;Alessandria;IT
1406;Algarve;PT
926;Alicante / Alacant;ES
1276;Alkmaar en omgeving;NL
1089;Allier;FR
932;Almería;ES
1098;Alpes-de-Haute-Provence;FR
1100;Alpes-Maritimes;FR
875;Altenburger Land;DE
773;Altenkirchen (Westerwald);DE
829;Altmarkkreis Salzwedel;DE
1422;Alto Alentejo;PT
1405;Alto Trás-os-Montes;PT
517;Altötting;DE
1247;Alytaus apskritis;LT
797;Alzey-Worms;DE
545;Amberg, Kreisfreie Stadt;DE
548;Amberg-Sulzbach;DE
706;Ammerland;DE
1232;Ancona;IT
1607;Angus and Dundee City;UK
830;Anhalt-Bitterfeld;DE
568;Ansbach, Kreisfreie Stadt;DE
573;Ansbach, Landkreis;DE
220;Appenzell Inner-Rhodes;
219;Appenzell Outer-Rhodes;
1466;Arad;RO
1082;Ardèche;FR
958;Ardennes;FR
1226;Arezzo;IT
1452;Argeş;RO
1003;Argolida;EL
218;Argovia / Aargau;
1070;Ariège;FR
1004;Arkadia;EL
1272;Arnhem/Nijmegen;NL
82;Arr. ( 1 ) de Bruxelles-Capitale/ Arr. van Brussel-Hoofdstad;BE
373;Arr. Aalst;BE
80;Arr. Antwerpen;BE
402;Arr. Arlon;BE
390;Arr. Ath;BE
403;Arr. Bastogne;BE
381;Arr. Brugge;BE
391;Arr. Charleroi;BE
374;Arr. Dendermonde;BE
382;Arr. Diksmuide;BE
407;Arr. Dinant;BE
375;Arr. Eeklo;BE
376;Arr. Gent;BE
379;Arr. Halle-Vilvoorde;BE
370;Arr. Hasselt;BE
397;Arr. Huy;BE
383;Arr. Ieper;BE
384;Arr. Kortrijk;BE
380;Arr. Leuven;BE
398;Arr. Liège;BE
371;Arr. Maaseik;BE
404;Arr. Marche-en-Famenne;BE
368;Arr. Mechelen;BE
392;Arr. Mons;BE
393;Arr. Mouscron;BE
408;Arr. Namur;BE
405;Arr. Neufchâteau;BE
389;Arr. Nivelles;BE
385;Arr. Oostende;BE
377;Arr. Oudenaarde;BE
409;Arr. Philippeville;BE
386;Arr. Roeselare;BE
378;Arr. Sint-Niklaas;BE
394;Arr. Soignies;BE
395;Arr. Thuin;BE
387;Arr. Tielt;BE
372;Arr. Tongeren;BE
396;Arr. Tournai;BE
369;Arr. Turnhout;BE
399;Arr. Waremme;BE
400;Arr. Verviers — communes francophones;BE
388;Arr. Veurne;BE
406;Arr. Virton;BE
986;Arta;EL
580;Aschaffenburg, Kreisfreie Stadt;DE
583;Aschaffenburg, Landkreis;DE
1234;Ascoli Piceno;IT
1137;Asti;IT
895;Asturias;ES
1008;Attiki;EL
959;Aube;FR
1093;Aude;FR
592;Augsburg, Kreisfreie Stadt;DE
597;Augsburg, Landkreis;DE
707;Aurich;DE
1325;Außerfern;AT
159;Aust-Agder;
1400;Ave;PT
1165;Avellino;IT
1071;Aveyron;FR
906;Ávila;ES
1440;Bacău;RO
281;Bács-Kiskun;HU
660;Bad Doberan;DE
798;Bad Dürkheim;DE
584;Bad Kissingen;DE
774;Bad Kreuznach;DE
519;Bad Tölz-Wolfratshausen;DE
920;Badajoz;ES
482;Baden-Baden, Stadtkreis;DE
1424;Baixo Alentejo;PT
1408;Baixo Mondego;PT
1407;Baixo Vouga;PT
555;Bamberg, Kreisfreie Stadt;DE
559;Bamberg, Landkreis;DE
1487;Banskobystrický kraj;SK
272;Baranya;HU
922;Barcelona;ES
1168;Bari;IT
1169;Barletta-Andria-Trani;IT
611;Barnim;DE
1522;Barnsley, Doncaster and Rotherham;UK
222;Basle-City / -Town;
221;Basle-Country / -Land;
1046;Bas-Rhin;FR
1584;Bath and North East Somerset, North Somerset and South Gloucestershire;UK
814;Bautzen;DE
556;Bayreuth, Kreisfreie Stadt;DE
560;Bayreuth, Landkreis;DE
1559;Bedford;UK
1414;Beira Interior Norte;PT
1415;Beira Interior Sul;PT
282;Békés;HU
1630;Belfast;UK
1201;Belluno;IT
1163;Benevento;IT
518;Berchtesgadener Land;DE
1150;Bergamo;IT
632;Bergstraße;DE
1569;Berkshire;UK
606;Berlin;DE
223;Berne;
783;Bernkastel-Wittlich;DE
401;Bezirk Verviers — Deutschsprachige Gemeinschaft;BE
1366;Białostocki;PL
1356;Bialski;PL
510;Biberach;DE
752;Bielefeld, Kreisfreie Stadt;DE
1133;Biella;IT
1349;Bielski;PL
1428;Bihor;RO
775;Birkenfeld;DE
1546;Birmingham;UK
1429;Bistriţa-Năsăud;RO
1123;Bjelovarsko-bilogorska županija;HR
1507;Blackburn with Darwen;UK
1508;Blackpool;UK
431;Blagoevgrad;BG
184;Blekinge län;10
1330;Bludenz-Bregenzer Wald;AT
759;Bochum, Kreisfreie Stadt;DE
511;Bodenseekreis;DE
1214;Bologna;IT
1197;Bolzano-Bozen;IT
733;Bonn, Kreisfreie Stadt;DE
883;Border;IE
747;Borken;DE
458;Bornholm;DK
275;Borsod-Abaúj-Zemplén;HU
1441;Botoşani;RO
744;Bottrop, Kreisfreie Stadt;DE
1101;Bouches-du-Rhône;FR
1588;Bournemouth and Poole;UK
1524;Bradford;UK
1446;Brăila;RO
607;Brandenburg an der Havel, Kreisfreie Stadt;DE
1435;Braşov;RO
1482;Bratislavský kraj;SK
672;Braunschweig, Kreisfreie Stadt;DE
496;Breisgau-Hochschwarzwald;DE
625;Bremen, Kreisfreie Stadt;DE
626;Bremerhaven, Kreisfreie Stadt;DE
1151;Brescia;IT
1601;Bridgend and Neath Port Talbot;UK
1573;Brighton and Hove;UK
1171;Brindisi;IT
1583;Bristol, City of;UK
1126;Brodsko-posavska županija;HR
1571;Buckinghamshire CC;UK
1459;Bucureşti;RO
264;Budapest;HU
425;Burgas;BG
833;Burgenland (DE);DE
907;Burgos;ES
160;Buskerud;
1447;Buzău;RO
1388;Bydgosko-Toruński;PL
455;Byen København;DK
1351;Bytomski;PL
468;Böblingen;DE
832;Börde;DE
921;Cáceres;ES
933;Cádiz;ES
1191;Cagliari;IT
1624;Caithness & Sutherland and Ross & Cromarty;UK
1453;Călăraşi;RO
1526;Calderdale and Kirklees;UK
1184;Caltanissetta;IT
491;Calw;DE
1033;Calvados;FR
1554;Cambridgeshire CC;UK
1161;Campobasso;IT
896;Cantabria;ES
1090;Cantal;FR
1467;Caraş-Severin;RO
1196;Carbonia-Iglesias;IT
1604;Cardiff and Vale of Glamorgan;UK
1162;Caserta;IT
927;Castellón / Castelló;ES
1186;Catania;IT
1177;Catanzaro;IT
1399;Cávado;PT
690;Celle;DE
1560;Central Bedfordshire;UK
1599;Central Valleys;UK
941;Ceuta;ES
977;Chalkidiki;EL
549;Cham;DE
1017;Chania;EL
1061;Charente;FR
1062;Charente-Maritime;FR
1357;Chełmsko-zamojski;PL
818;Chemnitz, Kreisfreie Stadt;DE
1027;Cher;FR
1511;Cheshire East;UK
1512;Cheshire West and Chester;UK
1159;Chieti;IT
1011;Chios;EL
1337;Ciechanowsko-płocki;PL
916;Ciudad Real;ES
1608;Clackmannanshire and Fife;UK
708;Cloppenburg;DE
1430;Cluj;RO
557;Coburg, Kreisfreie Stadt;DE
561;Coburg, Landkreis;DE
777;Cochem-Zell;DE
748;Coesfeld;DE
1145;Como;IT
1448;Constanţa;RO
1597;Conwy and Denbighshire;UK
934;Córdoba;ES
1591;Cornwall and Isles of Scilly;UK
1078;Corrèze;FR
1104;Corse-du-Sud;FR
1175;Cosenza;IT
1036;Côte-d'Or;FR
1057;Côtes-d'Armor;FR
608;Cottbus, Kreisfreie Stadt;DE
1416;Cova da Beira;PT
1436;Covasna;RO
1548;Coventry;UK
1154;Cremona;IT
1079;Creuse;FR
1176;Crotone;IT
283;Csongrád;HU
917;Cuenca;ES
1136;Cuneo;IT
691;Cuxhaven;DE
1348;Częstochowski;PL
520;Dachau;DE
612;Dahme-Spreewald;DE
185;Dalarnas län;20
1454;Dâmboviţa;RO
1411;Dão-Lafões;PT
1498;Darlington;UK
628;Darmstadt, Kreisfreie Stadt;DE
633;Darmstadt-Dieburg;DE
536;Deggendorf;DE
1283;Delft en Westland;NL
1258;Delfzijl en omgeving;NL
701;Delmenhorst, Kreisfreie Stadt;DE
661;Demmin;DE
1528;Derby;UK
826;Dessau-Roßlau, Kreisfreie Stadt;DE
1063;Deux-Sèvres;FR
1594;Devon CC;UK
683;Diepholz;DE
598;Dillingen a.d. Donau;DE
544;Dingolfing-Landau;DE
844;Dithmarschen;DE
422;Dobrich;BG
1012;Dodekanisos;EL
1461;Dolj;RO
604;Donau-Ries;DE
799;Donnersbergkreis;DE
1065;Dordogne;FR
1589;Dorset CC;UK
760;Dortmund, Kreisfreie Stadt;DE
1048;Doubs;FR
1404;Douro;PT
969;Drama;EL
813;Dresden, Kreisfreie Stadt;DE
1083;Drôme;FR
886;Dublin;IE
1116;Dubrovačko-neretvanska županija;HR
1549;Dudley;UK
719;Duisburg, Kreisfreie Stadt;DE
1616;Dumfries & Galloway;UK
1499;Durham CC;UK
736;Düren;DE
718;Düsseldorf, Kreisfreie Stadt;DE
1617;East Ayrshire and North Ayrshire mainland;UK
1504;East Cumbria;UK
1529;East Derbyshire;UK
1615;East Dunbartonshire, West Dunbartonshire and Helensburgh & Lomond;UK
1609;East Lothian and Midlothian;UK
1513;East Merseyside;UK
1632;East of Northern Ireland;UK
1518;East Riding of Yorkshire;UK
1574;East Sussex CC;UK
521;Ebersberg;DE
1611;Edinburgh, City of;UK
860;Eichsfeld;DE
522;Eichstätt;DE
784;Eifelkreis Bitburg-Prüm;DE
1627;Eilean Siar (Western Isles);UK
876;Eisenach, Kreisfreie Stadt;DE
929;Eivissa y Formentera;ES
943;El Hierro;ES
613;Elbe-Elster;DE
1391;Elbląski;PL
1393;Ełcki;PL
702;Emden, Kreisfreie Stadt;DE
497;Emmendingen;DE
709;Emsland;DE
1185;Enna;IT
764;Ennepe-Ruhr-Kreis;DE
1403;Entre Douro e Vouga;PT
492;Enzkreis;DE
523;Erding;DE
855;Erfurt, Kreisfreie Stadt;DE
569;Erlangen, Kreisfreie Stadt;DE
574;Erlangen-Höchstadt;DE
819;Erzgebirgskreis;DE
720;Essen, Kreisfreie Stadt;DE
1563;Essex CC;UK
469;Esslingen;DE
953;Essonne;FR
7;Etela-Pohjanmaa;FI
3;Etela-Savo;FI
1494;Etelä-Karjala;FI
1025;Eure;FR
1028;Eure-et-Loir;FR
738;Euskirchen;DE
966;Evros;EL
999;Evrytania;EL
998;Evvoia;EL
1612;Falkirk;UK
266;Fejér;HU
1235;Fermo;IT
1215;Ferrara;IT
1058;Finistère;FR
161;Finnmark;
1222;Firenze;IT
840;Flensburg, Kreisfreie Stadt;DE
1273;Flevoland;NL
1605;Flintshire and Wrexham;UK
1020;Florina;EL
1167;Foggia;IT
1002;Fokida;EL
562;Forchheim;DE
1217;Forlì-Cesena;IT
787;Frankenthal (Pfalz), Kreisfreie Stadt;DE
609;Frankfurt (Oder), Kreisfreie Stadt;DE
629;Frankfurt am Main, Kreisfreie Stadt;DE
495;Freiburg im Breisgau, Stadtkreis;DE
524;Freising;DE
494;Freudenstadt;DE
537;Freyung-Grafenau;DE
224;Fribourg;
710;Friesland (DE);DE
1240;Frosinone;IT
1000;Fthiotida;EL
944;Fuerteventura;ES
648;Fulda;DE
461;Fyn;DK
525;Fürstenfeldbruck;DE
570;Fürth, Kreisfreie Stadt;DE
575;Fürth, Landkreis;DE
417;Gabrovo;BG
1449;Galaţi;RO
1094;Gard;FR
526;Garmisch-Partenkirchen;DE
1396;Gdański;PL
745;Gelsenkirchen, Kreisfreie Stadt;DE
225;Geneva;
1142;Genova;IT
856;Gera, Kreisfreie Stadt;DE
800;Germersheim;DE
1073;Gers;FR
642;Gießen, Landkreis;DE
675;Gifhorn;DE
923;Girona;ES
1066;Gironde;FR
1455;Giurgiu;RO
226;Glarus;
1618;Glasgow City;UK
1352;Gliwicki;PL
1585;Gloucestershire;UK
1479;Gorenjska;SI
1480;Goriška;SI
1208;Gorizia;IT
1462;Gorj;RO
1379;Gorzowski;PL
677;Goslar;DE
865;Gotha;DE
199;Gotlands län;09
366;Gozo and Comino / Għawdex u Kemmuna;MT
1117;Grad Zagreb;HR
711;Grafschaft Bentheim;DE
945;Gran Canaria;ES
935;Granada;ES
1419;Grande Lisboa;PT
1401;Grande Porto;PT
1311;Graz;AT
1506;Greater Manchester North;UK
1505;Greater Manchester South;UK
654;Greifswald, Kreisfreie Stadt;DE
874;Greiz;DE
978;Grevena;EL
227;Grisons;
1280;Groot-Amsterdam;NL
1286;Groot-Rijnmond;NL
1228;Grosseto;IT
634;Groß-Gerau;DE
1389;Grudziądzki;PL
918;Guadalajara;ES
1106;Guadeloupe;FR
898;Guipúzcoa;ES
1108;Guyane;FR
1600;Gwent Valleys;UK
1596;Gwynedd;UK
599;Günzburg;DE
662;Güstrow;DE
753;Gütersloh;DE
269;Győr-Moson-Sopron;HU
186;Gävleborgs län;21
470;Göppingen;DE
815;Görlitz;DE
676;Göttingen;DE
761;Hagen, Kreisfreie Stadt;DE
278;Hajdú-Bihar;HU
187;Hallands län;13
827;Halle (Saale), Kreisfreie Stadt;DE
627;Hamburg;DE
684;Hameln-Pyrmont;DE
762;Hamm, Kreisfreie Stadt;DE
1579;Hampshire CC;UK
692;Harburg;DE
1437;Harghita;RO
1496;Hartlepool and Stockton-on-Tees;UK
834;Harz;DE
435;Haskovo;BG
586;Haßberge;DE
1105;Haute-Corse;FR
1072;Haute-Garonne;FR
1091;Haute-Loire;FR
1021;Haute-Marne;FR
1099;Hautes-Alpes;FR
1050;Haute-Saône;FR
1088;Haute-Savoie;FR
1075;Hautes-Pyrénées;FR
1080;Haute-Vienne;FR
1047;Haut-Rhin;FR
954;Hauts-de-Seine;FR
614;Havelland;DE
162;Hedmark;
486;Heidelberg, Stadtkreis;DE
478;Heidenheim;DE
474;Heilbronn, Landkreis;DE
473;Heilbronn, Stadtkreis;DE
739;Heinsberg;DE
678;Helmstedt;DE
1490;Helsinki-Uusimaa;FI
1095;Hérault;FR
1539;Herefordshire, County of;UK
754;Herford;DE
763;Herne, Kreisfreie Stadt;DE
649;Hersfeld-Rotenburg;DE
1558;Hertfordshire;UK
845;Herzogtum Lauenburg;DE
1281;Het Gooi en Vechtstreek;NL
276;Heves;HU
867;Hildburghausen;DE
685;Hildesheim;DE
440;Hlavní město Praha;CZ
765;Hochsauerlandkreis;DE
635;Hochtaunuskreis;DE
558;Hof, Kreisfreie Stadt;DE
563;Hof, Landkreis;DE
475;Hohenlohekreis;DE
686;Holzminden;DE
163;Hordaland;
936;Huelva;ES
902;Huesca;ES
1468;Hunedoara;RO
755;Höxter;DE
1456;Ialomiţa;RO
1442;Iaşi;RO
1277;IJmond;NL
996;Ileia;EL
1460;Ilfov;RO
1059;Ille-et-Vilaine;FR
868;Ilm-Kreis;DE
971;Imathia;EL
1140;Imperia;IT
1029;Indre;FR
1030;Indre-et-Loire;FR
514;Ingolstadt, Kreisfreie Stadt;DE
1565;Inner London - East;UK
1564;Inner London - West;UK
1326;Innsbruck;AT
1317;Innviertel;AT
1619;Inverclyde, East Renfrewshire and Renfrewshire;UK
1625;Inverness & Nairn and Moray, Badenoch & Strathspey;UK
988;Ioannina;EL
1014;Irakleio;EL
1084;Isère;FR
1160;Isernia;IT
216;Island;
1595;Isle of Anglesey;UK
1580;Isle of Wight;UK
1115;Istarska županija;HR
937;Jaén;ES
279;Jász-Nagykun-Szolnok;HU
1382;Jeleniogórski;PL
857;Jena, Kreisfreie Stadt;DE
831;Jerichower Land;DE
442;Jihočeský kraj;CZ
450;Jihomoravský kraj;CZ
1476;Jugovzhodna Slovenija;SI
1049;Jura;FR
228;Jura;
188;Jämtlands län;23
189;Jönköpings län;06
10;Kainuu;FI
788;Kaiserslautern, Kreisfreie Stadt;DE
801;Kaiserslautern, Landkreis;DE
1372;Kaliski;PL
190;Kalmar län;08
1491;Kanta-Häme;FI
982;Karditsa;EL
438;Kardzhali;BG
1129;Karlovačka županija;HR
444;Karlovarský kraj;CZ
484;Karlsruhe, Landkreis;DE
483;Karlsruhe, Stadtkreis;DE
647;Kassel, Kreisfreie Stadt;DE
650;Kassel, Landkreis;DE
979;Kastoria;EL
1353;Katowicki;PL
593;Kaufbeuren, Kreisfreie Stadt;DE
1248;Kauno apskritis;LT
970;Kavala;EL
992;Kefallinia;EL
538;Kelheim;DE
594;Kempten (Allgäu), Kreisfreie Stadt;DE
1582;Kent CC;UK
991;Kerkyra;EL
880;Kesk-Eesti;EE
1495;Keski-Pohjanmaa;FI
6;Keski-Suomi;FI
841;Kiel, Kreisfreie Stadt;DE
1364;Kielecki;PL
973;Kilkis;EL
1517;Kingston upon Hull, City of;UK
881;Kirde-Eesti;EE
587;Kitzingen;DE
1308;Klagenfurt-Villach;AT
1249;Klaipėdos apskritis;LT
728;Kleve;DE
771;Koblenz, Kreisfreie Stadt;DE
267;Komárom-Esztergom;HU
1370;Koniński;PL
502;Konstanz;DE
1275;Kop van Noord-Holland;NL
1121;Koprivničko-križevačka županija;HR
1005;Korinthia;EL
1472;Koroška;SI
1489;Košický kraj;SK
1375;Koszaliński;PL
980;Kozani;EL
961;Kraj Vysočina;CZ
1344;Krakowski;PL
447;Královéhradecký kraj;CZ
1119;Krapinsko-zagorska županija;HR
721;Krefeld, Kreisfreie Stadt;DE
564;Kronach;DE
191;Kronobergs län;07
1360;Krośnieński;PL
565;Kulmbach;DE
1241;Kurzeme;LV
802;Kusel;DE
863;Kyffhäuserkreis;DE
1013;Kyklades;EL
1493;Kymenlaakso;FI
364;Kýpros;CY
433;Kyustendil;BG
456;Københavns omegn;DK
734;Köln, Kreisfreie Stadt;DE
946;La Gomera;ES
947;La Palma;ES
901;La Rioja;ES
1143;La Spezia;IT
643;Lahn-Dill-Kreis;DE
1006;Lakonia;EL
1509;Lancashire CC;UK
789;Landau in der Pfalz, Kreisfreie Stadt;DE
1067;Landes;FR
527;Landsberg am Lech;DE
533;Landshut, Kreisfreie Stadt;DE
539;Landshut, Landkreis;DE
948;Lanzarote;ES
11;Lappi;FI
1156;L'Aquila;IT
983;Larisa;EL
1015;Lasithi;EL
1242;Latgale;LV
1239;Latina;IT
1172;Lecce;IT
1146;Lecco;IT
1525;Leeds;UK
712;Leer;DE
1019;Lefkada;EL
1383;Legnicko-Głogowski;PL
1534;Leicester;UK
1535;Leicestershire CC and Rutland;UK
824;Leipzig;DE
823;Leipzig, Kreisfreie Stadt;DE
908;León;ES
1009;Lesvos;EL
1373;Leszczyński;PL
735;Leverkusen, Kreisfreie Stadt;DE
1425;Lezíria do Tejo;PT
446;Liberecký kraj;CZ
566;Lichtenfels;DE
1111;Ličko-senjska županija;HR
245;Liechtenstein;
1316;Liezen;AT
644;Limburg-Weilburg;DE
1538;Lincolnshire;UK
601;Lindau (Bodensee);DE
1318;Linz-Wels;AT
756;Lippe;DE
1514;Liverpool;UK
1224;Livorno;IT
924;Lleida;ES
1626;Lochaber, Skye & Lochalsh, Arran & Cumbrae and Argyll & Bute;UK
1153;Lodi;IT
1333;Łódzki;PL
1085;Loire;FR
1052;Loire-Atlantique;FR
1032;Loiret;FR
1031;Loir-et-Cher;FR
1367;Łomżyński;PL
1074;Lot;FR
1068;Lot-et-Garonne;FR
882;Lõuna-Eesti;EE
415;Lovech;BG
1096;Lozère;FR
1359;Lubelski;PL
1220;Lucca;IT
229;Lucerne;
471;Ludwigsburg;DE
790;Ludwigshafen am Rhein, Kreisfreie Stadt;DE
663;Ludwigslust;DE
892;Lugo;ES
1322;Lungau;AT
1557;Luton;UK
217;Luxembourg;LU
842;Lübeck, Kreisfreie Stadt;DE
693;Lüchow-Dannenberg;DE
694;Lüneburg, Landkreis;DE
879;Lääne-Eesti;EE
503;Lörrach;DE
1233;Macerata;IT
905;Madrid;ES
828;Magdeburg, Kreisfreie Stadt;DE
984;Magnisia;EL
1053;Maine-et-Loire;FR
636;Main-Kinzig-Kreis;DE
589;Main-Spessart;DE
477;Main-Tauber-Kreis;DE
637;Main-Taunus-Kreis;DE
791;Mainz, Kreisfreie Stadt;DE
805;Mainz-Bingen;DE
938;Málaga;ES
930;Mallorca;ES
365;Malta;MT
1034;Manche;FR
487;Mannheim, Stadtkreis;DE
835;Mansfeld-Südharz;DE
1155;Mantova;IT
1431;Maramureş;RO
645;Marburg-Biedenkopf;DE
1250;Marijampolės apskritis;LT
960;Marne;FR
1107;Martinique;FR
1219;Massa-Carrara;IT
1174;Matera;IT
776;Mayen-Koblenz;DE
1054;Mayenne;FR
664;Mecklenburg-Strelitz;DE
1122;Međimurska županija;HR
1195;Medio Campidano;IT
1418;Médio Tejo;PT
1581;Medway;UK
1463;Mehedinţi;RO
816;Meißen;DE
942;Melilla;ES
595;Memmingen, Kreisfreie Stadt;DE
931;Menorca;ES
808;Merzig-Wadern;DE
1182;Messina;IT
1007;Messinia;EL
729;Mettmann;DE
1042;Meurthe-et-Moselle;FR
1043;Meuse;FR
1343;Miasto Kraków;PL
1332;Miasto Łódź;PL
1371;Miasto Poznań;PL
1377;Miasto Szczecin;PL
1339;Miasto Warszawa;PL
1381;Miasto Wrocław;PL
1295;Midden-Limburg;NL
1291;Midden-Noord-Brabant;NL
887;Mid-East;IE
884;Midland;IE
888;Mid-West;IE
528;Miesbach;DE
1148;Milano;IT
588;Miltenberg;DE
1570;Milton Keynes;UK
757;Minden-Lübbecke;DE
1398;Minho-Lima;PT
1297;Mittelburgenland;AT
820;Mittelsachsen;DE
1213;Modena;IT
1603;Monmouthshire and Newport;UK
412;Montana;BG
1149;Monza e della Brianza;IT
453;Moravskoslezský kraj;CZ
1060;Morbihan;FR
1044;Moselle;FR
1300;Mostviertel-Eisenwurzen;AT
940;Murcia;ES
1438;Mureş;RO
529;Mühldorf a. Inn;DE
1319;Mühlviertel;AT
723;Mülheim an der Ruhr, Kreisfreie Stadt;DE
515;München, Kreisfreie Stadt;DE
530;München, Landkreis;DE
746;Münster, Kreisfreie Stadt;DE
665;Müritz;DE
766;Märkischer Kreis;DE
615;Märkisch-Oderland;DE
722;Mönchengladbach, Kreisfreie Stadt;DE
164;Møre og Romsdal;
1164;Napoli;IT
900;Navarra;ES
1443;Neamţ;RO
488;Neckar-Odenwald-Kreis;DE
655;Neubrandenburg, Kreisfreie Stadt;DE
531;Neuburg-Schrobenhausen;DE
230;Neuchâtel;
550;Neumarkt i. d. OPf.;DE
843;Neumünster, Kreisfreie Stadt;DE
809;Neunkirchen;DE
577;Neustadt a. d. Aisch-Bad Windsheim;DE
551;Neustadt a. d. Waldnaab;DE
792;Neustadt an der Weinstraße, Kreisfreie Stadt;DE
600;Neu-Ulm;DE
778;Neuwied;DE
231;Nidwald / Nidwalden;
1301;Niederösterreich-Süd;AT
687;Nienburg (Weser);DE
1037;Nièvre;FR
1485;Nitriansky kraj;SK
277;Nógrád;HU
1263;Noord-Drenthe;NL
1260;Noord-Friesland;NL
1294;Noord-Limburg;NL
1292;Noordoost-Noord-Brabant;NL
1266;Noord-Overijssel;NL
1040;Nord;FR
1298;Nordburgenland;AT
846;Nordfriesland;DE
861;Nordhausen;DE
465;Nordjylland;DK
165;Nordland;
825;Nordsachsen;DE
457;Nordsjælland;DK
166;Nord-Trøndelag;
667;Nordwestmecklenburg;DE
666;Nordvorpommern;DE
1555;Norfolk;UK
192;Norrbottens län;25
1519;North and North East Lincolnshire;UK
1620;North Lanarkshire;UK
1537;North Northamptonshire;UK
1532;North Nottinghamshire;UK
1633;North of Northern Ireland;UK
1521;North Yorkshire CC;UK
679;Northeim;DE
1500;Northumberland;UK
1477;Notranjsko-kraška;SI
1531;Nottingham;UK
1135;Novara;IT
1345;Nowosądecki;PL
1190;Nuoro;IT
571;Nürnberg, Kreisfreie Stadt;DE
576;Nürnberger Land;DE
1386;Nyski;PL
1481;Obalno-kraška;SI
605;Oberallgäu;DE
740;Oberbergischer Kreis;DE
724;Oberhausen, Kreisfreie Stadt;DE
616;Oberhavel;DE
1309;Oberkärnten;AT
617;Oberspreewald-Lausitz;DE
232;Obwald / Obwalden;
638;Odenwaldkreis;DE
618;Oder-Spree;DE
1417;Oeste;PT
630;Offenbach am Main, Kreisfreie Stadt;DE
639;Offenbach, Landkreis;DE
1194;Ogliastra;IT
1023;Oise;FR
1193;Olbia-Tempio;IT
703;Oldenburg (Oldenburg), Kreisfreie Stadt;DE
713;Oldenburg, Landkreis;DE
451;Olomoucký kraj;CZ
767;Olpe;DE
1392;Olsztyński;PL
1464;Olt;RO
1257;Oost-Groningen;NL
1285;Oost-Zuid-Holland;NL
1387;Opolski;PL
167;Oppland;
1192;Oristano;IT
1628;Orkney Islands;UK
1035;Orne;FR
498;Ortenaukreis;DE
1127;Osječko-baranjska županija;HR
168;Oslo;
704;Osnabrück, Kreisfreie Stadt;DE
714;Osnabrück, Landkreis;DE
1478;Osrednjeslovenska;SI
481;Ostalbkreis;DE
602;Ostallgäu;DE
695;Osterholz;DE
680;Osterode am Harz;DE
847;Ostholstein;DE
619;Ostprignitz-Ruppin;DE
1338;Ostrołęcko-siedlecki;PL
1313;Oststeiermark;AT
1327;Osttirol;AT
668;Ostvorpommern;DE
1346;Oświęcimski;PL
893;Ourense;ES
1631;Outer Belfast;UK
1566;Outer London - East and North East;UK
1567;Outer London - South;UK
1568;Outer London - West and North West;UK
1259;Overig Groningen;NL
1289;Overig Zeeland;NL
1572;Oxfordshire;UK
758;Paderborn;DE
1204;Padova;IT
909;Palencia;ES
1181;Palermo;IT
1251;Panevėžio apskritis;LT
669;Parchim;DE
448;Pardubický kraj;CZ
950;Paris;FR
1211;Parma;IT
1041;Pas-de-Calais;FR
534;Passau, Kreisfreie Stadt;DE
540;Passau, Landkreis;DE
1152;Pavia;IT
436;Pazardzhik;BG
681;Peine;DE
974;Pella;EL
1420;Península de Setúbal;PT
432;Pernik;BG
1613;Perth & Kinross and Stirling;UK
1229;Perugia;IT
1231;Pesaro e Urbino;IT
1158;Pescara;IT
265;Pest;HU
1553;Peterborough;UK
532;Pfaffenhofen a. d. Ilm;DE
490;Pforzheim, Stadtkreis;DE
1210;Piacenza;IT
975;Pieria;EL
1244;Pierīga;LV
1369;Pilski;PL
1410;Pinhal Interior Norte;PT
1412;Pinhal Interior Sul;PT
1409;Pinhal Litoral;PT
848;Pinneberg;DE
1323;Pinzgau-Pongau;AT
1334;Piotrkowski;PL
1;Pirkanmaa;FI
793;Pirmasens, Kreisfreie Stadt;DE
1225;Pisa;IT
1221;Pistoia;IT
414;Pleven;BG
434;Plovdiv;BG
1592;Plymouth;UK
443;Plzeňský kraj;CZ
849;Plön;DE
1471;Podravska;SI
878;Põhja-Eesti;EE
8;Pohjanmaa;FI
5;Pohjois-Karjala;FI
9;Pohjois-Pohjanmaa;FI
4;Pohjois-Savo;FI
1470;Pomurska;SI
894;Pontevedra;ES
1206;Pordenone;IT
1577;Portsmouth;UK
1173;Potenza;IT
610;Potsdam, Kreisfreie Stadt;DE
620;Potsdam-Mittelmark;DE
1606;Powys;UK
1125;Požeško-slavonska županija;HR
1374;Poznański;PL
1457;Prahova;RO
1223;Prato;IT
1488;Prešovský kraj;SK
989;Preveza;EL
621;Prignitz;DE
1110;Primorsko-goranska županija;HR
1361;Przemyski;PL
1358;Puławski;PL
1092;Puy-de-Dôme;FR
1069;Pyrénées-Atlantiques;FR
1097;Pyrénées-Orientales;FR
1492;Päijät-Häme;FI
1340;Radomski;PL
1187;Ragusa;IT
485;Rastatt;DE
1216;Ravenna;IT
512;Ravensburg;DE
419;Razgrad;BG
749;Recklinghausen;DE
541;Regen;DE
546;Regensburg, Kreisfreie Stadt;DE
552;Regensburg, Landkreis;DE
1179;Reggio di Calabria;IT
1212;Reggio nell'Emilia;IT
1427;Região Autónoma da Madeira;PT
1426;Região Autónoma dos Açores;PT
689;Region Hannover;DE
807;Regionalverband Saarbrücken;DE
725;Remscheid, Kreisfreie Stadt;DE
472;Rems-Murr-Kreis;DE
850;Rendsburg-Eckernförde;DE
1016;Rethymni;EL
1109;Réunion;FR
505;Reutlingen;DE
737;Rhein-Erft-Kreis;DE
640;Rheingau-Taunus-Kreis;DE
779;Rhein-Hunsrück-Kreis;DE
741;Rheinisch-Bergischer Kreis;DE
730;Rhein-Kreis Neuss;DE
780;Rhein-Lahn-Kreis;DE
489;Rhein-Neckar-Kreis;DE
804;Rhein-Pfalz-Kreis;DE
742;Rhein-Sieg-Kreis;DE
1331;Rheintal-Bodenseegebiet;AT
1086;Rhône;FR
585;Rhön-Grabfeld;DE
1237;Rieti;IT
1243;Rīga;LV
1218;Rimini;IT
968;Rodopi;EL
170;Rogaland;
1238;Roma;IT
516;Rosenheim, Kreisfreie Stadt;DE
962;Rosenheim, Landkreis;DE
656;Rostock, Kreisfreie Stadt;DE
696;Rotenburg (Wümme);DE
578;Roth;DE
542;Rottal-Inn;DE
499;Rottweil;DE
1205;Rovigo;IT
418;Ruse;BG
1350;Rybnicki;PL
670;Rügen;DE
1362;Rzeszowski;PL
872;Saale-Holzland-Kreis;DE
836;Saalekreis;DE
873;Saale-Orla-Kreis;DE
871;Saalfeld-Rudolstadt;DE
810;Saarlouis;DE
811;Saarpfalz-Kreis;DE
1433;Sălaj;RO
910;Salamanca;ES
1166;Salerno;IT
1324;Salzburg und Umgebung;AT
673;Salzgitter, Kreisfreie Stadt;DE
837;Salzlandkreis;DE
1010;Samos;EL
1365;Sandomiersko-jędrzejowski;PL
1550;Sandwell;UK
1302;Sankt Pölten;AT
1038;Saône-et-Loire;FR
1055;Sarthe;FR
1189;Sassari;IT
140;Satakunta;FI
1432;Satu Mare;RO
1473;Savinjska;SI
1087;Savoie;FR
1141;Savona;IT
233;Schaffhausen;
688;Schaumburg;DE
851;Schleswig-Flensburg;DE
864;Schmalkalden-Meiningen;DE
572;Schwabach, Kreisfreie Stadt;DE
651;Schwalm-Eder-Kreis;DE
553;Schwandorf;DE
500;Schwarzwald-Baar-Kreis;DE
581;Schweinfurt, Kreisfreie Stadt;DE
590;Schweinfurt, Landkreis;DE
657;Schwerin, Kreisfreie Stadt;DE
234;Schwyz;
476;Schwäbisch Hall;DE
1610;Scottish Borders;UK
1515;Sefton;UK
852;Segeberg;DE
911;Segovia;ES
951;Seine-et-Marne;FR
1026;Seine-Maritime;FR
955;Seine-Saint-Denis;FR
1413;Serra da Estrela;PT
976;Serres;EL
939;Sevilla;ES
1523;Sheffield;UK
1629;Shetland Islands;UK
1543;Shropshire CC;UK
423;Shumen;BG
1252;Šiaulių apskritis;LT
1113;Šibensko-kninska županija;HR
1439;Sibiu;RO
768;Siegen-Wittgenstein;DE
1227;Siena;IT
1335;Sieradzki;PL
513;Sigmaringen;DE
420;Silistra;BG
1188;Siracusa;IT
1130;Sisačko-moslavačka županija;HR
1336;Skierniewicki;PL
195;Skåne län;12
426;Sliven;BG
1394;Słupski;PL
437;Smolyan;BG
769;Soest;DE
430;Sofia;BG
429;Sofia (stolitsa);BG
171;Sogn og Fjordane;
1547;Solihull;UK
726;Solingen, Kreisfreie Stadt;DE
235;Solothurn;
697;Soltau-Fallingbostel;DE
1590;Somerset;UK
1024;Somme;FR
273;Somogy;HU
1147;Sondrio;IT
870;Sonneberg;DE
912;Soria;ES
1354;Sosnowiecki;PL
1530;South and West Derbyshire;UK
1621;South Ayrshire;UK
1622;South Lanarkshire;UK
1533;South Nottinghamshire;UK
1497;South Teesside;UK
1598;South West Wales;UK
1578;Southampton;UK
889;South-East (IE);IE
1561;Southend-on-Sea;UK
890;South-West (IE);IE
794;Speyer, Kreisfreie Stadt;DE
1114;Splitsko-dalmatinska županija;HR
1475;Spodnjeposavska;SI
622;Spree-Neiße;DE
236;St. Gall;
812;St. Wendel;DE
698;Stade;DE
1545;Staffordshire CC;UK
428;Stara Zagora;BG
1376;Stargardzki;PL
963;Starnberg;DE
1397;Starogardzki;PL
853;Steinburg;DE
750;Steinfurt;DE
838;Stendal;DE
1320;Steyr-Kirchdorf;AT
197;Stockholms län;01
1544;Stoke-on-Trent;UK
854;Stormarn;DE
658;Stralsund, Kreisfreie Stadt;DE
535;Straubing, Kreisfreie Stadt;DE
543;Straubing-Bogen;DE
441;Středočeský kraj;CZ
467;Stuttgart, Stadtkreis;DE
743;Städteregion Aachen;DE
1444;Suceava;RO
1556;Suffolk;UK
858;Suhl, Kreisfreie Stadt;DE
1502;Sunderland;UK
1575;Surrey;UK
1368;Suwalski;PL
1602;Swansea;UK
1586;Swindon;UK
1299;Südburgenland;AT
462;Sydjylland;DK
803;Südliche Weinstraße;DE
806;Südwestpfalz;DE
280;Szabolcs-Szatmár-Bereg;HU
1378;Szczeciński;PL
817;Sächsische Schweiz-Osterzgebirge;DE
196;Södermanlands län;04
866;Sömmerda;DE
172;Sør- Trøndelag;
1402;Tâmega;PT
1170;Taranto;IT
424;Targovishte;BG
1076;Tarn;FR
1077;Tarn-et-Garonne;FR
1363;Tarnobrzeski;PL
1347;Tarnowski;PL
925;Tarragona;ES
1253;Tauragės apskritis;LT
173;Telemark;
1458;Teleorman;RO
1542;Telford and Wrekin;UK
1254;Telšių apskritis;LT
623;Teltow-Fläming;DE
949;Tenerife;ES
1157;Teramo;IT
1230;Terni;IT
1051;Territoire de Belfort;FR
903;Teruel;ES
987;Thesprotia;EL
972;Thessaloniki;EL
238;Thurgovia / Thurgau;
1562;Thurrock;UK
237;Ticino;
1469;Timiş;RO
1328;Tiroler Oberland;AT
1329;Tiroler Unterland;AT
554;Tirschenreuth;DE
919;Toledo;ES
274;Tolna;HU
1593;Torbay;UK
1131;Torino;IT
1180;Trapani;IT
964;Traunstein;DE
1321;Traunviertel;AT
1484;Trenčiansky kraj;SK
1198;Trento;IT
1202;Treviso;IT
782;Trier, Kreisfreie Stadt;DE
786;Trier-Saarburg;DE
1209;Trieste;IT
985;Trikala;EL
1483;Trnavský kraj;SK
1395;Trójmiejski;PL
174;Troms;
1450;Tulcea;RO
501;Tuttlingen;DE
1268;Twente;NL
506;Tübingen, Landkreis;DE
1501;Tyneside;UK
1355;Tyski;PL
624;Uckermark;DE
1207;Udine;IT
671;Uecker-Randow;DE
699;Uelzen;DE
508;Ulm, Stadtkreis;DE
770;Unna;DE
862;Unstrut-Hainich-Kreis;DE
603;Unterallgäu;DE
1310;Unterkärnten;AT
198;Uppsala län;03
239;Uri;
445;Ústecký kraj;CZ
1255;Utenos apskritis;LT
1274;Utrecht;NL
1527;Wakefield;UK
241;Valais;
1384;Wałbrzyski;PL
1465;Vâlcea;RO
652;Waldeck-Frankenberg;DE
956;Val-de-Marne;FR
957;Val-d'Oise;FR
504;Waldshut;DE
1303;Waldviertel;AT
928;Valencia / València;ES
913;Valladolid;ES
1139;Valle d'Aosta/Vallée d'Aoste;IT
1551;Walsall;UK
1102;Var;FR
1120;Varaždinska županija;HR
751;Warendorf;DE
1144;Varese;IT
421;Varna;BG
1510;Warrington;UK
139;Varsinais-Suomi;FI
1341;Warszawski-wschodni;PL
1342;Warszawski-zachodni;PL
877;Wartburgkreis;DE
1541;Warwickshire;UK
270;Vas;HU
1445;Vaslui;RO
1103;Vaucluse;FR
240;Vaud;
715;Vechta;DE
547;Weiden i. d. Opf, Kreisfreie Stadt;DE
965;Weilheim-Schongau;DE
859;Weimar, Kreisfreie Stadt;DE
869;Weimarer Land;DE
1304;Weinviertel;AT
579;Weißenburg-Gunzenhausen;DE
416;Veliko Tarnovo;BG
1269;Veluwe;NL
1056;Vendée;FR
1203;Venezia;IT
1134;Verbano-Cusio-Ossola;IT
1132;Vercelli;IT
700;Verden;DE
1199;Verona;IT
653;Werra-Meißner-Kreis;DE
732;Wesel;DE
716;Wesermarsch;DE
885;West;IE
1634;West and South of Northern Ireland;UK
1503;West Cumbria;UK
1614;West Lothian;UK
1536;West Northamptonshire;UK
460;Vest- og Sydsjælland;DK
1576;West Sussex;UK
1314;West- und Südsteiermark;AT
176;Vest-Agder;
781;Westerwaldkreis;DE
175;Vestfold;
463;Vestjylland;DK
1315;Westliche Obersteiermark;AT
1290;West-Noord-Brabant;NL
268;Veszprém;HU
641;Wetteraukreis;DE
1178;Vibo Valentia;IT
1200;Vicenza;IT
411;Vidin;BG
1245;Vidzeme;LV
1307;Wien;AT
1305;Wiener Umland/Nordteil;AT
1306;Wiener Umland/Südteil;AT
1064;Vienne;FR
731;Viersen;DE
631;Wiesbaden, Kreisfreie Stadt;DE
705;Wilhelmshaven, Kreisfreie Stadt;DE
1256;Vilniaus apskritis;LT
1587;Wiltshire CC;UK
1124;Virovitičko-podravska županija;HR
1516;Wirral;UK
659;Wismar, Kreisfreie Stadt;DE
1236;Viterbo;IT
839;Wittenberg;DE
717;Wittmund;DE
899;Vizcaya;ES
1390;Włocławski;PL
646;Vogelsbergkreis;DE
821;Vogtlandkreis;DE
997;Voiotia;EL
682;Wolfenbüttel;DE
674;Wolfsburg, Kreisfreie Stadt;DE
1552;Wolverhampton;UK
1540;Worcestershire;UK
795;Worms, Kreisfreie Stadt;DE
1045;Vosges;FR
1451;Vrancea;RO
413;Vratsa;BG
1385;Wrocławski;PL
1128;Vukovarsko-srijemska županija;HR
785;Vulkaneifel;DE
567;Wunsiedel i. Fichtelgebirge;DE
727;Wuppertal, Kreisfreie Stadt;DE
582;Würzburg, Kreisfreie Stadt;DE
591;Würzburg, Landkreis;DE
200;Värmlands län;17
201;Västerbottens län;24
203;Västernorrlands län;22
202;Västmanlands län;19
204;Västra Götalands län;14
967;Xanthi;EL
427;Yambol;BG
1039;Yonne;FR
1520;York;UK
952;Yvelines;FR
1279;Zaanstreek;NL
1112;Zadarska županija;HR
1118;Zagrebačka županija;HR
990;Zakynthos;EL
271;Zala;HU
914;Zamora;ES
904;Zaragoza;ES
1474;Zasavska;SI
1288;Zeeuwsch-Vlaanderen;NL
1246;Zemgale;LV
1380;Zielonogórski;PL
1486;Žilinský kraj;SK
452;Zlínský kraj;CZ
507;Zollernalbkreis;DE
242;Zug;
1296;Zuid-Limburg;NL
1264;Zuidoost-Drenthe;NL
1262;Zuidoost-Friesland;NL
1293;Zuidoost-Noord-Brabant;NL
1287;Zuidoost-Zuid-Holland;NL
1265;Zuidwest-Drenthe;NL
1261;Zuidwest-Friesland;NL
1270;Zuidwest-Gelderland;NL
1267;Zuidwest-Overijssel;NL
244;Zurich;
796;Zweibrücken, Kreisfreie Stadt;DE
822;Zwickau;DE
367;Åland;FI
193;Örebro län;18
194;Östergötlands län;05
169;Østfold;
464;Østjylland;DK
1312;Östliche Obersteiermark;AT
459;Østsjælland;DK