{
  "meta" : {
    "description" : "",
    "modulid" : "24355",
    "ssyk-level-4-kod" : "[\"7212\"]",
    "name" : "195 Plåtbearbetning. 20 dagar",
    "utbildningsidn" : "[\"124519\",\"124521\",\"124520\"]",
    "type" : "",
    "ssyk-level-4-namn" : "[\"Svetsare och gasskärare\"]",
    "utbildningsnamn" : "[\"Industritekniskutbildning - Svets MMA\",\"Industritekniskutbildning - Svets TIG\",\"Industritekniskutbildning - Svets MIG/MAG\"]"
  },
  "sha1" : "8ff977c1caae68face5a0d0109ae212c86b51230",
  "annotations" : [ {
    "preferred-label" : "Svets",
    "sentiment" : "OFFERED",
    "type" : "keyword",
    "start-position" : 299,
    "end-position" : 304,
    "concept-id" : "Emhe_ce6_MYC",
    "matched-string" : "svets",
    "annotation-id" : 2
  }, {
    "preferred-label" : "Plåtbearbetning",
    "sentiment" : "OFFERED",
    "type" : "skill",
    "start-position" : 264,
    "end-position" : 279,
    "concept-id" : "SrzF_GXp_pFE",
    "matched-string" : "plåtbearbetning",
    "annotation-id" : 1
  }, {
    "preferred-label" : "Efterbearbetning",
    "sentiment" : "OFFERED",
    "type" : "skill",
    "start-position" : 215,
    "end-position" : 231,
    "concept-id" : "LWGH_AGJ_2Vj",
    "matched-string" : "efterbearbetning",
    "annotation-id" : 0
  } ],
  "text" : "Modulbeskrivning:\nPlåtbearbetningsutbildningen ska ges på inom industrin vanligt förekommande plåtbearbetningsmaskiner. Plåtbearbetningsutbildningen ska ges inom bockning, kantbockning, valsning, montering före och efterbearbetning, inklusive grovplåt.\n\nModulmål:\nPlåtbearbetning ska kombinerat med svets ge deltagaren grundläggande yrkeskompetens inom yrkesområdet. Deltagaren ska efter utbildningen ha de kunskaper och färdigheter som generellt krävs för att arbeta inom yrket."
}