{
  "meta" : {
    "description" : "",
    "modulid" : "23796",
    "ssyk-level-4-kod" : "[\"7212\"]",
    "name" : "161 Teori rörsvetsning",
    "utbildningsidn" : "[\"124519\",\"124521\",\"124520\"]",
    "type" : "",
    "ssyk-level-4-namn" : "[\"Svetsare och gasskärare\"]",
    "utbildningsnamn" : "[\"Industritekniskutbildning - Svets MMA\",\"Industritekniskutbildning - Svets TIG\",\"Industritekniskutbildning - Svets MIG/MAG\"]"
  },
  "sha1" : "a9cfb7fe78005e615925c98708ab0ff08650daa8",
  "annotations" : [ {
    "preferred-label" : "C, programmeringsspråk",
    "sentiment" : "OFFERED",
    "type" : "skill",
    "start-position" : 24,
    "end-position" : 25,
    "concept-id" : "o8wR_57f_jv9",
    "matched-string" : "c",
    "annotation-id" : 0
  } ],
  "text" : "Modulbeskrivning:\nModul C enligt Svetskommssionens kursplan\n\nModulmål:\nDetta är en teoretisk modul, deltagaren ska efter avslutad modul Kunna: \n- de olika förbanden vid svetsning av rör\n- känna till de viktigaste andra materialen och deras beteende\n- varför svetsar kan brista, vad konsekvenserna blir och vilken betydelse svetsaren kan ha\n- ha grundkunskaperna om det harmoniserade systemet med internationella standarder.\n"
}