{
  "meta" : {
    "description" : "",
    "ssyk-nivå-4-kod(er)" : "[]",
    "utbildningsbeskrivning" : "Om yrket\r\nSom mätningstekniker arbetar du bland annat med att planera och utföra olika typer av mätningar, ofta utsättning vid nybyggnationer av hus- och vägbyggen.\r\nArbetet innebär att du från ritningar ska med hjälp av instrument sätta ut platsen för var exempelvis ett nytt hus ska byggas.\r\n \r\nJobbmöjligheter\r\nDet finns stor efterfrågan på Mätningstekniker och därför är det goda möjligheter till arbete.\r\n\r\nOm utbildningen.\r\nVad är målet med utbildningen?\r\nUtbildningen är en grundutbildning inom området och målet är att få arbete som Mätningstekniker\r\n\r\nHur går utbildningen till?\r\nUtbildningen består av både praktiska och teoretiska moment. \r\n\r\nHur lång är utbildningen?\r\nHela utbildningen är ca 36 veckor lång. Men utifrån dina och företagens behov kan den bli såväl längre som kortare. \r\n\r\nNär startar utbildningen?\r\nOm det inte finns några aktuella starter så kan du fråga någon på din arbetsförmedling.",
    "name" : "105 Geodesi",
    "modulens id" : "21787",
    "type" : "",
    "utbildningsid" : "121508",
    "ssyk-nivå-4-namn" : "[]",
    "utbildningsnamn" : "Mätningstekniker"
  },
  "sha1" : "67a54d8b252bcd994ad04926bffbb8f8517c4d13",
  "annotations" : [ {
    "preferred-label" : "Data/IT",
    "sentiment" : "OFFERED",
    "type" : "occupation-field",
    "start-position" : 1250,
    "end-position" : 1254,
    "concept-id" : "apaJ_2ja_LuF",
    "matched-string" : "data",
    "annotation-id" : 9
  }, {
    "preferred-label" : "Geografiskt positionssystem/GPS",
    "sentiment" : "OFFERED",
    "type" : "skill",
    "start-position" : 1052,
    "end-position" : 1055,
    "concept-id" : "pTEz_GD2_J9b",
    "matched-string" : "gps",
    "annotation-id" : 8
  }, {
    "preferred-label" : "Ekonomi",
    "sentiment" : "OFFERED",
    "type" : "keyword",
    "start-position" : 980,
    "end-position" : 987,
    "concept-id" : "PW4f_bmT_new",
    "matched-string" : "ekonomi",
    "annotation-id" : 7
  }, {
    "preferred-label" : "noggrannhet",
    "sentiment" : "OFFERED",
    "type" : "esco-skill",
    "start-position" : 961,
    "end-position" : 972,
    "concept-id" : "mrsW_EkL_KRD",
    "matched-string" : "noggrannhet",
    "annotation-id" : 6
  }, {
    "preferred-label" : "Utsättning",
    "sentiment" : "OFFERED",
    "type" : "skill",
    "start-position" : 848,
    "end-position" : 858,
    "concept-id" : "gdTC_3Eh_PMv",
    "matched-string" : "utsättning",
    "annotation-id" : 5
  }, {
    "preferred-label" : "Beräkningsprogram",
    "sentiment" : "OFFERED",
    "type" : "skill",
    "start-position" : 754,
    "end-position" : 771,
    "concept-id" : "nwS5_PLZ_bYa",
    "matched-string" : "beräkningsprogram",
    "annotation-id" : 4
  }, {
    "preferred-label" : "Instrument",
    "sentiment" : "OFFERED",
    "type" : "skill-headline",
    "start-position" : 647,
    "end-position" : 657,
    "concept-id" : "wLYs_CKS_wK8",
    "matched-string" : "instrument",
    "annotation-id" : 3
  }, {
    "preferred-label" : "Geografiskt positionssystem/GPS",
    "sentiment" : "OFFERED",
    "type" : "skill",
    "start-position" : 436,
    "end-position" : 439,
    "concept-id" : "pTEz_GD2_J9b",
    "matched-string" : "gps",
    "annotation-id" : 2
  }, {
    "preferred-label" : "trigonometri",
    "sentiment" : "OFFERED",
    "type" : "esco-skill",
    "start-position" : 186,
    "end-position" : 198,
    "concept-id" : "jufH_aQ6_ZqW",
    "matched-string" : "trigonometri",
    "annotation-id" : 1
  }, {
    "preferred-label" : "Modeller",
    "sentiment" : "OFFERED",
    "type" : "isco-level-4",
    "start-position" : 121,
    "end-position" : 129,
    "concept-id" : "HXt9_4S5_TcH",
    "matched-string" : "modeller",
    "annotation-id" : 0
  } ],
  "text" : "Deltagaren ska lära sig använda branschanpassade programsystem, samt analysera resultat från matematiska och statistiska modeller för mätningstekniska problem.\r\nIntroduktion i geodetisk trigonometri, instrumenthantering, transformationer, punktbestämning i plan och höjd, felteori enligt minsta Kvadratmetoden, mätningsstatistik, korrektioner, koordinatsystem, trigonometrisk höjdmätning, inmätning av referenspunkter, koordinatsystem, GPS, instrumentlära och mätningsekonomi.\r\nDeltagaren skall självständigt kunna planlägga och genomföra geodetiska mätningar.\r\nDeltagaren ska efter genomgången modul kunna:\r\n•Praktiskt hantera moderna geodetiska instrument.\r\n•Utföra gängse fältarbetsteknik.\r\n•Utföra geodetiska beräkningar och använda branschanpassade beräkningsprogram.\r\n•Utföra på marknaden förekommande mätmetoder vad gäller detaljmätning och utsättning.\r\n•Självständigt planlägga, redovisa och dokumentera utfört mätuppdrag.\r\n•Göra bedömningar vad gäller noggrannhet kontra ekonomi och tidsåtgång.\r\n•Planera och utföra enklare satellitmätningar (GPS), samt analysera resultatet.\r\n•Genomföra enklare utjämningsmetodik enligt minsta kvadratmetoden, samt kunna tolka resultatutskrifter från densamma.\r\n•Utföra mätning med fältdatorer och överföra data till stationära datorer för vidare bearbetning.\r\n•Förstå hur referenspunkter kommit till och betydelsen av olika koordinatsystem.\r\n"
}