{
  "meta" : {
    "jobad" : {
      "description" : {
        "requirements" : null,
        "needs" : null,
        "company_information" : null,
        "text_formatted" : "Du bör ha viss erfarenhet av sushi och japansk mat. Du skall vara ambitiös, gärna älska sushi och vara passionerad för service.\n\n Du har känsla för kvalitet och vet att god mat och noggrann rengöring hänger tätt samman\n\n Du drivs av att vara delaktig i att alltid leverera en smak- och restaurangupplevelse\n\n Du brinner för att sätta gästen i centrum\n\n Du har god samarbetsförmåga och en positiv utstrålning\n\n Du tycker om att verka i ett företag som ständigt utvecklas\n\n Du kan ta eget ansvar\n\n Du kan hantera stress\n\nVi lägger stor vikt vid personkemi, yrkesstolthet och att du har ett öga för detaljer.\n\nVidare är du utåtriktad och engagerad samt vill göra ditt bästa i alla lägen.\n\nDu är en del av ett serviceteam. Dina uppgifter är att servera gäster, arbeta i kassan, hålla rent och snyggt i restaurangen m.m.",
        "conditions" : "Heltid\r\nAnställningstid enligt överenskommelse",
        "text" : "Du bör ha viss erfarenhet av sushi och japansk mat. Du skall vara ambitiös, gärna älska sushi och vara passionerad för service.\n\n Du har känsla för kvalitet och vet att god mat och noggrann rengöring hänger tätt samman\n\n Du drivs av att vara delaktig i att alltid leverera en smak- och restaurangupplevelse\n\n Du brinner för att sätta gästen i centrum\n\n Du har god samarbetsförmåga och en positiv utstrålning\n\n Du tycker om att verka i ett företag som ständigt utvecklas\n\n Du kan ta eget ansvar\n\n Du kan hantera stress\n\nVi lägger stor vikt vid personkemi, yrkesstolthet och att du har ett öga för detaljer.\n\nVidare är du utåtriktad och engagerad samt vill göra ditt bästa i alla lägen.\n\nDu är en del av ett serviceteam. Dina uppgifter är att servera gäster, arbeta i kassan, hålla rent och snyggt i restaurangen m.m."
      },
      "headline" : "Kassa- och serveringspersonal",
      "driving_license" : null,
      "employer" : {
        "email" : null,
        "phone_number" : null,
        "organization_number" : "5567531602",
        "name" : "Sushi Centralen AB",
        "url" : "https://www.sushiyama.se",
        "workplace" : "Sushi Yama"
      },
      "removed_date" : null,
      "logo_url" : "https://www.arbetsformedlingen.se/rest/arbetsgivare/rest/af/v3/organisation/5567531602/logotyper/logo.png",
      "last_publication_date" : "2023-01-10T23:59:59",
      "number_of_vacancies" : 1,
      "occupation" : {
        "concept_id" : "rGGf_KLs_To7",
        "label" : "Servitör/Servitris",
        "legacy_ams_taxonomy_id" : "5487"
      },
      "occupation_group" : {
        "concept_id" : "UjoW_meY_Zwt",
        "label" : "Hovmästare och servitörer",
        "legacy_ams_taxonomy_id" : "5131"
      },
      "employment_type" : {
        "concept_id" : "PFZr_Syz_cUq",
        "label" : "Vanlig anställning",
        "legacy_ams_taxonomy_id" : "1"
      },
      "webpage_url" : "https://arbetsformedlingen.se/platsbanken/annonser/26349442",
      "driving_license_required" : false,
      "application_contacts" : [ {
        "description" : "Sushi Yama",
        "email" : null,
        "telephone" : null,
        "name" : null,
        "contact_type" : null
      } ],
      "duration" : {
        "concept_id" : "qQUd_4qe_NDT",
        "label" : "6 månader eller längre",
        "legacy_ams_taxonomy_id" : "2"
      },
      "nice_to_have" : {
        "education_level" : [ ],
        "work_experiences" : [ ],
        "skills" : [ ],
        "education" : [ ],
        "languages" : [ ]
      },
      "application_details" : {
        "via_af" : false,
        "email" : null,
        "other" : null,
        "reference" : null,
        "url" : "https://career.sushiyama.se/jobs/1935830-kassa-och-serveringspersonal?promotion=453015-arbetsformedlingen",
        "information" : null
      },
      "source_type" : "VIA_PLATSBANKEN_DXA",
      "application_deadline" : "2023-01-10T23:59:59",
      "external_id" : "46-556753-1602-1935830-1",
      "workplace_address" : {
        "coordinates" : [ 18.06858, 59.329323 ],
        "city" : null,
        "postcode" : null,
        "municipality" : "Stockholm",
        "region_concept_id" : "CifL_Rzy_Mku",
        "region" : "Stockholms län",
        "country_code" : "199",
        "region_code" : "01",
        "municipality_concept_id" : "AvNB_uwa_6n6",
        "country_concept_id" : "i46j_HmG_v64",
        "municipality_code" : "0180",
        "street_address" : null,
        "country" : "Sverige"
      },
      "id" : "26349442",
      "experience_required" : false,
      "working_hours_type" : {
        "concept_id" : "6YE1_gAC_R2G",
        "label" : "Heltid",
        "legacy_ams_taxonomy_id" : "1"
      },
      "access" : null,
      "timestamp" : 1658690563765,
      "must_have" : {
        "education_level" : [ ],
        "work_experiences" : [ ],
        "skills" : [ ],
        "education" : [ ],
        "languages" : [ ]
      },
      "occupation_field" : {
        "concept_id" : "ScKy_FHB_7wT",
        "label" : "Hotell, restaurang, storhushåll",
        "legacy_ams_taxonomy_id" : "7"
      },
      "scope_of_work" : {
        "min" : 100,
        "max" : 100
      },
      "salary_type" : {
        "concept_id" : "oG8G_9cW_nRf",
        "label" : "Fast månads- vecko- eller timlön",
        "legacy_ams_taxonomy_id" : "1"
      },
      "removed" : false,
      "salary_description" : "Lön enligt överenskommelse",
      "access_to_own_car" : false,
      "publication_date" : "2022-07-24T21:22:43"
    },
    "name" : "Kassa- och serveringspersonal",
    "user" : "hannes"
  },
  "sha1" : "11a2814752ca04c012acd866f174c885877a68ba",
  "annotations" : [ {
    "preferred-label" : "Kassapersonal m.fl.",
    "type" : "ssyk-level-4",
    "start-position" : 0,
    "end-position" : 5,
    "concept-id" : "WNVp_RYe_zLX",
    "matched-string" : "Kassa",
    "annotation-id" : 3
  }, {
    "preferred-label" : "Serveringspersonal",
    "sentiment" : "MUST_HAVE",
    "type" : "keyword",
    "start-position" : 11,
    "end-position" : 29,
    "concept-id" : "VqRa_738_v98",
    "matched-string" : "serveringspersonal",
    "annotation-id" : 0
  }, {
    "preferred-label" : "Sushi",
    "sentiment" : "MUST_HAVE",
    "type" : "keyword",
    "start-position" : 59,
    "end-position" : 64,
    "concept-id" : "of6o_sJT_K7k",
    "matched-string" : "sushi",
    "annotation-id" : 1
  }, {
    "preferred-label" : "Japanskt kök",
    "type" : "skill",
    "start-position" : 69,
    "end-position" : 80,
    "concept-id" : "EvAm_oco_RcM",
    "matched-string" : "japansk mat",
    "annotation-id" : 4
  }, {
    "preferred-label" : "Sushi",
    "sentiment" : "MUST_HAVE",
    "type" : "keyword",
    "start-position" : 118,
    "end-position" : 123,
    "concept-id" : "of6o_sJT_K7k",
    "matched-string" : "sushi",
    "annotation-id" : 2
  }, {
    "preferred-label" : "noggrannhet",
    "type" : "esco-skill",
    "start-position" : 211,
    "end-position" : 219,
    "concept-id" : "mrsW_EkL_KRD",
    "matched-string" : "noggrann",
    "annotation-id" : 5
  }, {
    "preferred-label" : "hantera stress",
    "type" : "esco-skill",
    "start-position" : 533,
    "end-position" : 547,
    "concept-id" : "z5Zo_DVb_VEK",
    "matched-string" : "hantera stress",
    "annotation-id" : 6
  } ],
  "text" : "Kassa- och serveringspersonal\nDu bör ha viss erfarenhet av sushi och japansk mat. Du skall vara ambitiös, gärna älska sushi och vara passionerad för service.\n\n Du har känsla för kvalitet och vet att god mat och noggrann rengöring hänger tätt samman\n\n Du drivs av att vara delaktig i att alltid leverera en smak- och restaurangupplevelse\n\n Du brinner för att sätta gästen i centrum\n\n Du har god samarbetsförmåga och en positiv utstrålning\n\n Du tycker om att verka i ett företag som ständigt utvecklas\n\n Du kan ta eget ansvar\n\n Du kan hantera stress\n\nVi lägger stor vikt vid personkemi, yrkesstolthet och att du har ett öga för detaljer.\n\nVidare är du utåtriktad och engagerad samt vill göra ditt bästa i alla lägen.\n\nDu är en del av ett serviceteam. Dina uppgifter är att servera gäster, arbeta i kassan, hålla rent och snyggt i restaurangen m.m."
}