{
  "meta" : {
    "jobad" : {
      "description" : {
        "requirements" : null,
        "needs" : null,
        "company_information" : null,
        "text_formatted" : "Vår kund är ett teknikkonsultbolag med specialister inom teknik och IT. De har kontor i Liljeholmen och Kista där deras största kunder verkar inom fordon och telekomindustrin. Inför det nya året har dom en massa spännande projekt igång och söker därmed nya drivna, engagerade och teknik-nördiga medarbetare som vill vara med på deras framtida tillväxt. Välkommen in med din ansökan!  \n\nOM TJÄNSTEN \nI rollen som mjukvaruutvecklare kommer du bli en del av ett dedikerat team till en kommunikationsenhet som sitter i lastbilar och bussar. Teamet består av cirka åtta personer i olika roller som systemutvecklare, test/QA och teamleadare. Detta uppdrag har en variation av arbetsuppgifter så som felsökning, utveckling samt underhåll av hårdvara, vilket leder till att man utmanar sig själv samt indirekt utvecklar en mångsidig teknisk bakgrund.\n\nVår kund är ett familjärt konsultbolag med specialister inom produkt- och systemutveckling och de arbetar i hela kedjan från ledning och planering till genomförande och kvalitetssäkring. Vår kund ligger i framkant när det kommer till teknik, så här kommer du verkligen trivas om du själv är nyfiken på nya tekniker.\n\nDu erbjuds\n\n\n* Utmanande och tekniska uppgifter och en möjlighet att utvecklas och lära dig av seniora kollegor\n* Som konsult för Academic Work erbjuder vi stora möjligheter för dig att växa professionellt, bygga ditt nätverk och skapa värdefulla kontakter för framtiden. Läs mer om vårt konsulterbjudande.\n\n\nARBETSUPPGIFTER \nTeamet är ett dedikerat team till en kommunikationsenhet som sitter i lastbilar och bussar. Arbetsuppgifterna är främst felsökning, underhåll, integration, testning och utveckling av kommunikationsenheten. Enheten har Linux som operativsystem och du kommer att använda dig av programmeringspråket C++. Arbetet sker i agil form enlig kundens implementation av ramverket SAFe.\n\nVI SÖKER DIG SOM \n- Är nyexaminerad civilingenjör inom inbyggda system eller liknande\n- Har erfarenhet/kännedom av C++, Linux och inbyggda system\n- Flytande i svenska då all kommunikation sker på svenska \n\nDet är meriterande om du har\n\n\n* Erfarenhet av meddelandehantering, kommunikationsprotokoll\n* Kunskap om mobiltelefoni, mobila modem\n* Erfarenhet av databaser\n* Kvalitetssäkring av mjukvara\n* Erfarenhet/kännedom av CAN-bus\n\n\nVi ser att du är självständig och har en förmåga att sätta dig in i kluriga tekniska problembilder där alla inputs inte är givna och har ett stort intresse för inbyggda system.\n\nSom person är du\n\n\n* Problemlösande\n* Initiativtagande\n* Samarbetsvillig\n\n\nÖvrig information\n\n\n* Start: Enligt överrenskomelse\n* Omfattning: Heltid tillsvidare\n* Placering: Liljeholmen samt förekommer resande till Södertälje\n\n\nRekryteringsprocessen hanteras av Academic Work och kundens önskemål är att alla frågor rörande tjänsten hanteras av Academic Work.\n\nVi går igenom urvalet löpande och annonsen kan stängas ner innan tjänsten är tillsatt om vi gått över till urvals- och intervjufasen.",
        "conditions" : "Heltid \r\n08:00-17:00",
        "text" : "Vår kund är ett teknikkonsultbolag med specialister inom teknik och IT. De har kontor i Liljeholmen och Kista där deras största kunder verkar inom fordon och telekomindustrin. Inför det nya året har dom en massa spännande projekt igång och söker därmed nya drivna, engagerade och teknik-nördiga medarbetare som vill vara med på deras framtida tillväxt. Välkommen in med din ansökan!  \n\nOM TJÄNSTEN \nI rollen som mjukvaruutvecklare kommer du bli en del av ett dedikerat team till en kommunikationsenhet som sitter i lastbilar och bussar. Teamet består av cirka åtta personer i olika roller som systemutvecklare, test/QA och teamleadare. Detta uppdrag har en variation av arbetsuppgifter så som felsökning, utveckling samt underhåll av hårdvara, vilket leder till att man utmanar sig själv samt indirekt utvecklar en mångsidig teknisk bakgrund.\n\nVår kund är ett familjärt konsultbolag med specialister inom produkt- och systemutveckling och de arbetar i hela kedjan från ledning och planering till genomförande och kvalitetssäkring. Vår kund ligger i framkant när det kommer till teknik, så här kommer du verkligen trivas om du själv är nyfiken på nya tekniker.\n\nDu erbjuds\n\n\n* Utmanande och tekniska uppgifter och en möjlighet att utvecklas och lära dig av seniora kollegor\n* Som konsult för Academic Work erbjuder vi stora möjligheter för dig att växa professionellt, bygga ditt nätverk och skapa värdefulla kontakter för framtiden. Läs mer om vårt konsulterbjudande.\n\n\nARBETSUPPGIFTER \nTeamet är ett dedikerat team till en kommunikationsenhet som sitter i lastbilar och bussar. Arbetsuppgifterna är främst felsökning, underhåll, integration, testning och utveckling av kommunikationsenheten. Enheten har Linux som operativsystem och du kommer att använda dig av programmeringspråket C++. Arbetet sker i agil form enlig kundens implementation av ramverket SAFe.\n\nVI SÖKER DIG SOM \n- Är nyexaminerad civilingenjör inom inbyggda system eller liknande\n- Har erfarenhet/kännedom av C++, Linux och inbyggda system\n- Flytande i svenska då all kommunikation sker på svenska \n\nDet är meriterande om du har\n\n\n* Erfarenhet av meddelandehantering, kommunikationsprotokoll\n* Kunskap om mobiltelefoni, mobila modem\n* Erfarenhet av databaser\n* Kvalitetssäkring av mjukvara\n* Erfarenhet/kännedom av CAN-bus\n\n\nVi ser att du är självständig och har en förmåga att sätta dig in i kluriga tekniska problembilder där alla inputs inte är givna och har ett stort intresse för inbyggda system.\n\nSom person är du\n\n\n* Problemlösande\n* Initiativtagande\n* Samarbetsvillig\n\n\nÖvrig information\n\n\n* Start: Enligt överrenskomelse\n* Omfattning: Heltid tillsvidare\n* Placering: Liljeholmen samt förekommer resande till Södertälje\n\n\nRekryteringsprocessen hanteras av Academic Work och kundens önskemål är att alla frågor rörande tjänsten hanteras av Academic Work.\n\nVi går igenom urvalet löpande och annonsen kan stängas ner innan tjänsten är tillsatt om vi gått över till urvals- och intervjufasen."
      },
      "headline" : "Junior mjukvaruingenjör till vår kund inom konsultbranschen",
      "driving_license" : null,
      "employer" : {
        "email" : null,
        "phone_number" : null,
        "organization_number" : "5565595450",
        "name" : "Academic Work Sweden AB",
        "url" : "http://www.academicwork.se",
        "workplace" : "Academic Work"
      },
      "removed_date" : null,
      "logo_url" : "https://www.arbetsformedlingen.se/rest/arbetsgivare/rest/af/v3/organisation/5565595450/logotyper/logo.png",
      "last_publication_date" : "2022-07-29T23:59:59",
      "number_of_vacancies" : 1,
      "occupation" : {
        "concept_id" : "fg7B_yov_smw",
        "label" : "Systemutvecklare/Programmerare",
        "legacy_ams_taxonomy_id" : "2419"
      },
      "occupation_group" : {
        "concept_id" : "DJh5_yyF_hEM",
        "label" : "Mjukvaru- och systemutvecklare m.fl.",
        "legacy_ams_taxonomy_id" : "2512"
      },
      "employment_type" : {
        "concept_id" : "PFZr_Syz_cUq",
        "label" : "Vanlig anställning",
        "legacy_ams_taxonomy_id" : "1"
      },
      "webpage_url" : "https://arbetsformedlingen.se/platsbanken/annonser/26269655",
      "driving_license_required" : false,
      "application_contacts" : [ {
        "description" : "Emmy Söderberg",
        "email" : null,
        "telephone" : null,
        "name" : null,
        "contact_type" : null
      } ],
      "duration" : {
        "concept_id" : "qQUd_4qe_NDT",
        "label" : "6 månader eller längre",
        "legacy_ams_taxonomy_id" : "2"
      },
      "nice_to_have" : {
        "education_level" : [ ],
        "work_experiences" : [ ],
        "skills" : [ ],
        "education" : [ ],
        "languages" : [ ]
      },
      "application_details" : {
        "via_af" : false,
        "email" : null,
        "other" : null,
        "reference" : "15077873",
        "url" : "http://www.academicwork.se/jobad/junior-mjukvaruingenjor-till-var-kund-inom-konsultbranschen/15077873?apply=1",
        "information" : null
      },
      "source_type" : "VIA_PLATSBANKEN_DXA",
      "application_deadline" : "2022-07-29T23:59:59",
      "external_id" : "46-556559-5450-15077873",
      "workplace_address" : {
        "coordinates" : [ 18.06858, 59.329323 ],
        "city" : null,
        "postcode" : null,
        "municipality" : "Stockholm",
        "region_concept_id" : "CifL_Rzy_Mku",
        "region" : "Stockholms län",
        "country_code" : "199",
        "region_code" : "01",
        "municipality_concept_id" : "AvNB_uwa_6n6",
        "country_concept_id" : "i46j_HmG_v64",
        "municipality_code" : "0180",
        "street_address" : null,
        "country" : "Sverige"
      },
      "id" : "26269655",
      "experience_required" : true,
      "working_hours_type" : {
        "concept_id" : "6YE1_gAC_R2G",
        "label" : "Heltid",
        "legacy_ams_taxonomy_id" : "1"
      },
      "access" : null,
      "timestamp" : 1656453729063,
      "must_have" : {
        "education_level" : [ ],
        "work_experiences" : [ {
          "concept_id" : "fg7B_yov_smw",
          "weight" : 10,
          "label" : "Systemutvecklare/Programmerare",
          "legacy_ams_taxonomy_id" : "2419"
        } ],
        "skills" : [ ],
        "education" : [ ],
        "languages" : [ ]
      },
      "occupation_field" : {
        "concept_id" : "apaJ_2ja_LuF",
        "label" : "Data/IT",
        "legacy_ams_taxonomy_id" : "3"
      },
      "scope_of_work" : {
        "min" : 100,
        "max" : 100
      },
      "salary_type" : {
        "concept_id" : "oG8G_9cW_nRf",
        "label" : "Fast månads- vecko- eller timlön",
        "legacy_ams_taxonomy_id" : "1"
      },
      "removed" : false,
      "salary_description" : "Enligt avtal",
      "access_to_own_car" : false,
      "publication_date" : "2022-06-29T00:02:09"
    },
    "name" : "Junior mjukvaruingenjör till vår kund inom konsultbranschen",
    "user" : "hannes"
  },
  "sha1" : "2a3b7b25bc157d57579ca6d3290c1a2babcf8703",
  "annotations" : [ {
    "preferred-label" : "Mjukvaruutveckling",
    "type" : "skill",
    "start-position" : 7,
    "end-position" : 23,
    "concept-id" : "A5HJ_aMw_BQt",
    "matched-string" : "mjukvaruingenjör",
    "annotation-id" : 23
  }, {
    "preferred-label" : "Data/IT",
    "sentiment" : "MUST_HAVE",
    "type" : "occupation-field",
    "start-position" : 128,
    "end-position" : 130,
    "concept-id" : "apaJ_2ja_LuF",
    "matched-string" : "it",
    "annotation-id" : 0
  }, {
    "preferred-label" : "Kontor",
    "sentiment" : "MUST_HAVE",
    "type" : "keyword",
    "start-position" : 139,
    "end-position" : 145,
    "concept-id" : "Hyz1_7HF_AkP",
    "matched-string" : "kontor",
    "annotation-id" : 1
  }, {
    "preferred-label" : "telekommunikationsbranschen",
    "type" : "esco-skill",
    "start-position" : 218,
    "end-position" : 234,
    "concept-id" : "8cgo_tr6_j2v",
    "matched-string" : "telekomindustrin",
    "annotation-id" : 24
  }, {
    "preferred-label" : "Mjukvaruutvecklare",
    "sentiment" : "MUST_HAVE",
    "type" : "occupation-name",
    "start-position" : 472,
    "end-position" : 490,
    "concept-id" : "rQds_YGd_quU",
    "matched-string" : "mjukvaruutvecklare",
    "annotation-id" : 2
  }, {
    "preferred-label" : "Lastbil",
    "type" : "keyword",
    "start-position" : 575,
    "end-position" : 584,
    "concept-id" : "SAb5_TAd_ctX",
    "matched-string" : "lastbilar",
    "annotation-id" : 25
  }, {
    "preferred-label" : "Systemutvecklare/Programmerare",
    "sentiment" : "MUST_HAVE",
    "type" : "occupation-name",
    "start-position" : 653,
    "end-position" : 669,
    "concept-id" : "fg7B_yov_smw",
    "matched-string" : "systemutvecklare",
    "annotation-id" : 3
  }, {
    "preferred-label" : "Speltestare/QA",
    "sentiment" : "MUST_HAVE",
    "type" : "occupation-name",
    "start-position" : 676,
    "end-position" : 678,
    "concept-id" : "TQKD_b9Y_57Z",
    "matched-string" : "qa",
    "annotation-id" : 4
  }, {
    "preferred-label" : "Teamledare",
    "type" : "occupation-name",
    "start-position" : 683,
    "end-position" : 694,
    "concept-id" : "FC86_VDF_rqB",
    "matched-string" : "teamleadare",
    "annotation-id" : 26
  }, {
    "preferred-label" : "göra felsökning",
    "type" : "esco-skill",
    "start-position" : 753,
    "end-position" : 763,
    "concept-id" : "HqC8_fVY_ACM",
    "matched-string" : "felsökning",
    "annotation-id" : 27
  }, {
    "preferred-label" : "Hårdvaruutveckling",
    "type" : "skill",
    "start-position" : 765,
    "end-position" : 775,
    "concept-id" : "Mk8G_Jks_vtf",
    "matched-string" : "utveckling",
    "annotation-id" : 28
  }, {
    "preferred-label" : "Hårdvara",
    "sentiment" : "MUST_HAVE",
    "type" : "skill-headline",
    "start-position" : 794,
    "end-position" : 802,
    "concept-id" : "22jK_Hje_3Ec",
    "matched-string" : "hårdvara",
    "annotation-id" : 5
  }, {
    "preferred-label" : "Produktutveckling",
    "type" : "skill",
    "start-position" : 965,
    "end-position" : 972,
    "concept-id" : "uwev_L2n_fpz",
    "matched-string" : "produkt",
    "annotation-id" : 29
  }, {
    "preferred-label" : "systemutveckling",
    "sentiment" : "MUST_HAVE",
    "type" : "esco-skill",
    "start-position" : 978,
    "end-position" : 994,
    "concept-id" : "cm71_uwW_5zU",
    "matched-string" : "systemutveckling",
    "annotation-id" : 6
  }, {
    "preferred-label" : "Kvalitetssäkring",
    "sentiment" : "MUST_HAVE",
    "type" : "skill",
    "start-position" : 1073,
    "end-position" : 1089,
    "concept-id" : "a1Sf_mey_gVk",
    "matched-string" : "kvalitetssäkring",
    "annotation-id" : 7
  }, {
    "preferred-label" : "göra felsökning",
    "type" : "esco-skill",
    "start-position" : 1667,
    "end-position" : 1677,
    "concept-id" : "HqC8_fVY_ACM",
    "matched-string" : "felsökning",
    "annotation-id" : 30
  }, {
    "preferred-label" : "Testning, hårdvara/Verifiering, hårdvara",
    "type" : "skill",
    "start-position" : 1703,
    "end-position" : 1711,
    "concept-id" : "kfYc_q1X_SZ5",
    "matched-string" : "testning",
    "annotation-id" : 31
  }, {
    "preferred-label" : "Hårdvaruutveckling",
    "type" : "skill",
    "start-position" : 1716,
    "end-position" : 1726,
    "concept-id" : "Mk8G_Jks_vtf",
    "matched-string" : "utveckling",
    "annotation-id" : 32
  }, {
    "preferred-label" : "Linux, operativsystem",
    "sentiment" : "MUST_HAVE",
    "type" : "skill",
    "start-position" : 1765,
    "end-position" : 1770,
    "concept-id" : "z52H_f4y_4ZA",
    "matched-string" : "linux",
    "annotation-id" : 8
  }, {
    "preferred-label" : "Operativsystem",
    "sentiment" : "MUST_HAVE",
    "type" : "skill-headline",
    "start-position" : 1775,
    "end-position" : 1789,
    "concept-id" : "xAWr_WYq_JPP",
    "matched-string" : "operativsystem",
    "annotation-id" : 9
  }, {
    "preferred-label" : "Agila arbetsmetoder",
    "type" : "skill",
    "start-position" : 1864,
    "end-position" : 1868,
    "concept-id" : "TMVb_DnH_etF",
    "matched-string" : "agil",
    "annotation-id" : 33
  }, {
    "preferred-label" : "Scaled Agile Framework, SAFe",
    "type" : "skill",
    "start-position" : 1916,
    "end-position" : 1920,
    "concept-id" : "eTW8_AY5_tpe",
    "matched-string" : "SAFe",
    "annotation-id" : 34
  }, {
    "preferred-label" : "Civilingenjör, systemutveckling",
    "type" : "occupation-name",
    "start-position" : 1959,
    "end-position" : 1972,
    "concept-id" : "CQse_CRd_snw",
    "matched-string" : "civilingenjör",
    "annotation-id" : 35
  }, {
    "preferred-label" : "Inbyggda system/Embedded system",
    "sentiment" : "MUST_HAVE",
    "type" : "skill",
    "start-position" : 1978,
    "end-position" : 1993,
    "concept-id" : "XThy_HCH_FFc",
    "matched-string" : "inbyggda system",
    "annotation-id" : 11
  }, {
    "preferred-label" : "Linux, operativsystem",
    "sentiment" : "MUST_HAVE",
    "type" : "skill",
    "start-position" : 2043,
    "end-position" : 2048,
    "concept-id" : "z52H_f4y_4ZA",
    "matched-string" : "linux",
    "annotation-id" : 13
  }, {
    "preferred-label" : "Inbyggda system/Embedded system",
    "sentiment" : "MUST_HAVE",
    "type" : "skill",
    "start-position" : 2053,
    "end-position" : 2068,
    "concept-id" : "XThy_HCH_FFc",
    "matched-string" : "inbyggda system",
    "annotation-id" : 14
  }, {
    "preferred-label" : "Svenska",
    "sentiment" : "MUST_HAVE",
    "type" : "language",
    "start-position" : 2082,
    "end-position" : 2089,
    "concept-id" : "zSLA_vw2_FXN",
    "matched-string" : "svenska",
    "annotation-id" : 15
  }, {
    "preferred-label" : "Svenska",
    "sentiment" : "MUST_HAVE",
    "type" : "language",
    "start-position" : 2119,
    "end-position" : 2126,
    "concept-id" : "zSLA_vw2_FXN",
    "matched-string" : "svenska",
    "annotation-id" : 16
  }, {
    "preferred-label" : "Kommunikationsprotokoll",
    "sentiment" : "MUST_HAVE",
    "type" : "skill-headline",
    "start-position" : 2197,
    "end-position" : 2220,
    "concept-id" : "QkYc_pTH_tDk",
    "matched-string" : "kommunikationsprotokoll",
    "annotation-id" : 17
  }, {
    "preferred-label" : "Mobiltelefoni",
    "sentiment" : "MUST_HAVE",
    "type" : "skill",
    "start-position" : 2234,
    "end-position" : 2247,
    "concept-id" : "u6sZ_FJX_MZd",
    "matched-string" : "mobiltelefoni",
    "annotation-id" : 18
  }, {
    "preferred-label" : "Databaser",
    "sentiment" : "MUST_HAVE",
    "type" : "skill-headline",
    "start-position" : 2278,
    "end-position" : 2287,
    "concept-id" : "Uj5W_dft_Ssg",
    "matched-string" : "databaser",
    "annotation-id" : 19
  }, {
    "preferred-label" : "Kvalitetssäkring",
    "sentiment" : "MUST_HAVE",
    "type" : "skill",
    "start-position" : 2290,
    "end-position" : 2306,
    "concept-id" : "a1Sf_mey_gVk",
    "matched-string" : "kvalitetssäkring",
    "annotation-id" : 20
  }, {
    "preferred-label" : "CAN, kommunikationsprotokoll",
    "sentiment" : "MUST_HAVE",
    "type" : "skill",
    "start-position" : 2344,
    "end-position" : 2347,
    "concept-id" : "nTdr_FJz_ioy",
    "matched-string" : "can",
    "annotation-id" : 21
  }, {
    "preferred-label" : "arbeta självständigt",
    "type" : "esco-skill",
    "start-position" : 2371,
    "end-position" : 2383,
    "concept-id" : "NyFu_HHd_zhz",
    "matched-string" : "självständig",
    "annotation-id" : 36
  }, {
    "preferred-label" : "Inbyggda system/Embedded system",
    "sentiment" : "MUST_HAVE",
    "type" : "skill",
    "start-position" : 2514,
    "end-position" : 2529,
    "concept-id" : "XThy_HCH_FFc",
    "matched-string" : "inbyggda system",
    "annotation-id" : 22
  }, {
    "preferred-label" : "samarbeta med kolleger",
    "type" : "esco-skill",
    "start-position" : 2589,
    "end-position" : 2604,
    "concept-id" : "X15R_797_q62",
    "matched-string" : "Samarbetsvillig",
    "annotation-id" : 37
  }, {
    "preferred-label" : "Heltid",
    "type" : "worktime-extent",
    "start-position" : 2673,
    "end-position" : 2679,
    "concept-id" : "6YE1_gAC_R2G",
    "matched-string" : "Heltid",
    "annotation-id" : 38
  }, {
    "preferred-label" : "Tillsvidareanställning (inkl. eventuell provanställning)",
    "type" : "employment-type",
    "start-position" : 2680,
    "end-position" : 2691,
    "concept-id" : "kpPX_CNN_gDU",
    "matched-string" : "tillsvidare",
    "annotation-id" : 39
  } ],
  "text" : "Junior mjukvaruingenjör till vår kund inom konsultbranschen\nVår kund är ett teknikkonsultbolag med specialister inom teknik och IT. De har kontor i Liljeholmen och Kista där deras största kunder verkar inom fordon och telekomindustrin. Inför det nya året har dom en massa spännande projekt igång och söker därmed nya drivna, engagerade och teknik-nördiga medarbetare som vill vara med på deras framtida tillväxt. Välkommen in med din ansökan!  \n\nOM TJÄNSTEN \nI rollen som mjukvaruutvecklare kommer du bli en del av ett dedikerat team till en kommunikationsenhet som sitter i lastbilar och bussar. Teamet består av cirka åtta personer i olika roller som systemutvecklare, test/QA och teamleadare. Detta uppdrag har en variation av arbetsuppgifter så som felsökning, utveckling samt underhåll av hårdvara, vilket leder till att man utmanar sig själv samt indirekt utvecklar en mångsidig teknisk bakgrund.\n\nVår kund är ett familjärt konsultbolag med specialister inom produkt- och systemutveckling och de arbetar i hela kedjan från ledning och planering till genomförande och kvalitetssäkring. Vår kund ligger i framkant när det kommer till teknik, så här kommer du verkligen trivas om du själv är nyfiken på nya tekniker.\n\nDu erbjuds\n\n\n* Utmanande och tekniska uppgifter och en möjlighet att utvecklas och lära dig av seniora kollegor\n* Som konsult för Academic Work erbjuder vi stora möjligheter för dig att växa professionellt, bygga ditt nätverk och skapa värdefulla kontakter för framtiden. Läs mer om vårt konsulterbjudande.\n\n\nARBETSUPPGIFTER \nTeamet är ett dedikerat team till en kommunikationsenhet som sitter i lastbilar och bussar. Arbetsuppgifterna är främst felsökning, underhåll, integration, testning och utveckling av kommunikationsenheten. Enheten har Linux som operativsystem och du kommer att använda dig av programmeringspråket C++. Arbetet sker i agil form enlig kundens implementation av ramverket SAFe.\n\nVI SÖKER DIG SOM \n- Är nyexaminerad civilingenjör inom inbyggda system eller liknande\n- Har erfarenhet/kännedom av C++, Linux och inbyggda system\n- Flytande i svenska då all kommunikation sker på svenska \n\nDet är meriterande om du har\n\n\n* Erfarenhet av meddelandehantering, kommunikationsprotokoll\n* Kunskap om mobiltelefoni, mobila modem\n* Erfarenhet av databaser\n* Kvalitetssäkring av mjukvara\n* Erfarenhet/kännedom av CAN-bus\n\n\nVi ser att du är självständig och har en förmåga att sätta dig in i kluriga tekniska problembilder där alla inputs inte är givna och har ett stort intresse för inbyggda system.\n\nSom person är du\n\n\n* Problemlösande\n* Initiativtagande\n* Samarbetsvillig\n\n\nÖvrig information\n\n\n* Start: Enligt överrenskomelse\n* Omfattning: Heltid tillsvidare\n* Placering: Liljeholmen samt förekommer resande till Södertälje\n\n\nRekryteringsprocessen hanteras av Academic Work och kundens önskemål är att alla frågor rörande tjänsten hanteras av Academic Work.\n\nVi går igenom urvalet löpande och annonsen kan stängas ner innan tjänsten är tillsatt om vi gått över till urvals- och intervjufasen."
}