{
  "meta" : {
    "jobad" : {
      "description" : {
        "requirements" : null,
        "needs" : null,
        "company_information" : null,
        "text_formatted" : "We are looking for a curious and engaged 3D/Visual Artist to join our Visual and Training Solution team located in Gothenburg, Stockholm and Karlstad. We are working with graphic productions, interactive solutions for training and other visual content. \n\n \n\nYou will join a team with broad experience in visual art, 3D animation, learning design, interactive training, and technical documentation. Together we build and support solutions for our customers and users around the world.\n\n \n\n \n\nYOUR ROLE\n\nAs a 3D/Visual Artist you will work in close collaboration with 3D and visual artists, learning experience designers, developers, UX designers and other creative minds.\n\n \n\nYou will be part of developing digital training solutions, illustrations, XR, animations and other graphic content. You will model and render 3D objects, create animations, film, and interactive media. You will continuously improve your skills in a stimulating environment and there will be time for personal and professional development.\n\n YOUR PROFILE\n\nYou are a driven and curious team player with a high interest in visual production and training solutions. For us it is important that you have a creative mindset and that you want to be a part of developing our team!\n\n \n\nYou hold a degree in the Computer Science field or equivalent education and have at least 2-3 years of experience. You know how to realize user demands into usability and graphical design of applications. You have a place in your heart for visualization, animation and 3D design. Your interest lies in usability and user experience.\n\n \n\nYou have previously worked in 3ds Max or similar 3D graphics programs and have experience in vector graphics. You also have knowledge in Unity or similar game engines as well as experience from video editing. You have good communication skills in Swedish or English, verbal and written.\n\n \n\n \n\nSelection takes place after the last application date. You can send us your application in either Swedish or English.\n\n \n\n \n\nMAKE A DIFFERENCE TOGETHER WITH US\n\nWe believe that you can do a better job when you are able to focus on the right things, which is why we ensure that you have the right conditions for balancing work and everyday life. We invest in our employees - they are the heart, mind and core of our operations. In addition, since we are owned by the defense and security group Saab, we stand on a solid foundation of high technology, research and job security.\n\n \n\nFor us it's all about sustainability - we want to become the industry's most sustainable company. But to be a sustainable company, we need to invest in our employees. For us, your recovery, your development opportunities and your job security are as important as the company's success - without our employees we stand still.\n\n \n\nWant to know more about what it is like to work with us? Check out our career pages!",
        "conditions" : "Heltid\r\nPermanent",
        "text" : "We are looking for a curious and engaged 3D/Visual Artist to join our Visual and Training Solution team located in Gothenburg, Stockholm and Karlstad. We are working with graphic productions, interactive solutions for training and other visual content. \n\n \n\nYou will join a team with broad experience in visual art, 3D animation, learning design, interactive training, and technical documentation. Together we build and support solutions for our customers and users around the world.\n\n \n\n \n\nYOUR ROLE\n\nAs a 3D/Visual Artist you will work in close collaboration with 3D and visual artists, learning experience designers, developers, UX designers and other creative minds.\n\n \n\nYou will be part of developing digital training solutions, illustrations, XR, animations and other graphic content. You will model and render 3D objects, create animations, film, and interactive media. You will continuously improve your skills in a stimulating environment and there will be time for personal and professional development.\n\n YOUR PROFILE\n\nYou are a driven and curious team player with a high interest in visual production and training solutions. For us it is important that you have a creative mindset and that you want to be a part of developing our team!\n\n \n\nYou hold a degree in the Computer Science field or equivalent education and have at least 2-3 years of experience. You know how to realize user demands into usability and graphical design of applications. You have a place in your heart for visualization, animation and 3D design. Your interest lies in usability and user experience.\n\n \n\nYou have previously worked in 3ds Max or similar 3D graphics programs and have experience in vector graphics. You also have knowledge in Unity or similar game engines as well as experience from video editing. You have good communication skills in Swedish or English, verbal and written.\n\n \n\n \n\nSelection takes place after the last application date. You can send us your application in either Swedish or English.\n\n \n\n \n\nMAKE A DIFFERENCE TOGETHER WITH US\n\nWe believe that you can do a better job when you are able to focus on the right things, which is why we ensure that you have the right conditions for balancing work and everyday life. We invest in our employees - they are the heart, mind and core of our operations. In addition, since we are owned by the defense and security group Saab, we stand on a solid foundation of high technology, research and job security.\n\n \n\nFor us it's all about sustainability - we want to become the industry's most sustainable company. But to be a sustainable company, we need to invest in our employees. For us, your recovery, your development opportunities and your job security are as important as the company's success - without our employees we stand still.\n\n \n\nWant to know more about what it is like to work with us? Check out our career pages!"
      },
      "headline" : "3D/VISUAL ARTIST TO COMBITECH IN GOTHENBURG/KARLSTAD/STOCKHOLM",
      "driving_license" : null,
      "employer" : {
        "email" : null,
        "phone_number" : null,
        "organization_number" : "5562186790",
        "name" : "Combitech AB",
        "url" : null,
        "workplace" : "Combitech AB"
      },
      "removed_date" : null,
      "logo_url" : "https://www.arbetsformedlingen.se/rest/arbetsgivare/rest/af/v3/organisation/5562186790/logotyper/logo.png",
      "last_publication_date" : "2022-08-24T23:59:59",
      "number_of_vacancies" : 1,
      "occupation" : {
        "concept_id" : "fg7B_yov_smw",
        "label" : "Systemutvecklare/Programmerare",
        "legacy_ams_taxonomy_id" : "2419"
      },
      "occupation_group" : {
        "concept_id" : "DJh5_yyF_hEM",
        "label" : "Mjukvaru- och systemutvecklare m.fl.",
        "legacy_ams_taxonomy_id" : "2512"
      },
      "employment_type" : {
        "concept_id" : "PFZr_Syz_cUq",
        "label" : "Vanlig anställning",
        "legacy_ams_taxonomy_id" : "1"
      },
      "webpage_url" : "https://arbetsformedlingen.se/platsbanken/annonser/26269771",
      "driving_license_required" : false,
      "application_contacts" : [ {
        "description" : "Saab AB",
        "email" : null,
        "telephone" : null,
        "name" : null,
        "contact_type" : null
      } ],
      "duration" : {
        "concept_id" : "a7uU_j21_mkL",
        "label" : "Tills vidare",
        "legacy_ams_taxonomy_id" : "1"
      },
      "nice_to_have" : {
        "education_level" : [ ],
        "work_experiences" : [ ],
        "skills" : [ ],
        "education" : [ ],
        "languages" : [ ]
      },
      "application_details" : {
        "via_af" : false,
        "email" : null,
        "other" : null,
        "reference" : "REQ_13867",
        "url" : "https://www.aplitrak.com/?adid=cy5oYW5zc29ubGluZGVuLjg4NzkxLjMxMDFAc2FhYi5hcGxpdHJhay5jb20",
        "information" : null
      },
      "source_type" : "VIA_PLATSBANKEN_DXA",
      "application_deadline" : "2022-08-24T23:59:59",
      "external_id" : "46-556218-6790-REQ_13867",
      "workplace_address" : {
        "coordinates" : [ 11.97456, 57.70887 ],
        "city" : null,
        "postcode" : null,
        "municipality" : "Göteborg",
        "region_concept_id" : "zdoY_6u5_Krt",
        "region" : "Västra Götalands län",
        "country_code" : "199",
        "region_code" : "14",
        "municipality_concept_id" : "PVZL_BQT_XtL",
        "country_concept_id" : "i46j_HmG_v64",
        "municipality_code" : "1480",
        "street_address" : null,
        "country" : "Sverige"
      },
      "id" : "26269771",
      "experience_required" : true,
      "working_hours_type" : {
        "concept_id" : "6YE1_gAC_R2G",
        "label" : "Heltid",
        "legacy_ams_taxonomy_id" : "1"
      },
      "access" : null,
      "timestamp" : 1656482028228,
      "must_have" : {
        "education_level" : [ ],
        "work_experiences" : [ {
          "concept_id" : "fg7B_yov_smw",
          "weight" : 10,
          "label" : "Systemutvecklare/Programmerare",
          "legacy_ams_taxonomy_id" : "2419"
        } ],
        "skills" : [ ],
        "education" : [ ],
        "languages" : [ ]
      },
      "occupation_field" : {
        "concept_id" : "apaJ_2ja_LuF",
        "label" : "Data/IT",
        "legacy_ams_taxonomy_id" : "3"
      },
      "scope_of_work" : {
        "min" : 100,
        "max" : 100
      },
      "salary_type" : {
        "concept_id" : "oG8G_9cW_nRf",
        "label" : "Fast månads- vecko- eller timlön",
        "legacy_ams_taxonomy_id" : "1"
      },
      "removed" : false,
      "salary_description" : "Not Specified",
      "access_to_own_car" : false,
      "publication_date" : "2022-06-29T07:53:48"
    },
    "name" : "3D/VISUAL ARTIST TO COMBITECH IN GOTHENBURG/KARLSTAD/STOCKHOLM",
    "user" : "hannes"
  },
  "sha1" : "468148fb957fda0e078476a5b659d78022a7a963",
  "annotations" : [ {
    "preferred-label" : "3d-visualiserare",
    "type" : "keyword",
    "start-position" : 0,
    "end-position" : 16,
    "concept-id" : "dwck_5Tf_yYy",
    "matched-string" : "3D/VISUAL ARTIST",
    "annotation-id" : 15
  }, {
    "preferred-label" : "Göteborg",
    "type" : "municipality",
    "start-position" : 33,
    "end-position" : 43,
    "concept-id" : "PVZL_BQT_XtL",
    "matched-string" : "GOTHENBURG",
    "annotation-id" : 16
  }, {
    "preferred-label" : "Karlstad",
    "type" : "municipality",
    "start-position" : 44,
    "end-position" : 52,
    "concept-id" : "hRDj_PoV_sFU",
    "matched-string" : "KARLSTAD",
    "annotation-id" : 17
  }, {
    "preferred-label" : "Stockholm",
    "type" : "municipality",
    "start-position" : 53,
    "end-position" : 62,
    "concept-id" : "AvNB_uwa_6n6",
    "matched-string" : "STOCKHOLM",
    "annotation-id" : 18
  }, {
    "preferred-label" : "3d-visualiserare",
    "type" : "keyword",
    "start-position" : 104,
    "end-position" : 120,
    "concept-id" : "dwck_5Tf_yYy",
    "matched-string" : "3D/Visual Artist",
    "annotation-id" : 22
  }, {
    "preferred-label" : "Göteborg",
    "type" : "municipality",
    "start-position" : 178,
    "end-position" : 188,
    "concept-id" : "PVZL_BQT_XtL",
    "matched-string" : "Gothenburg",
    "annotation-id" : 19
  }, {
    "preferred-label" : "Stockholm",
    "type" : "municipality",
    "start-position" : 190,
    "end-position" : 199,
    "concept-id" : "AvNB_uwa_6n6",
    "matched-string" : "Stockholm",
    "annotation-id" : 20
  }, {
    "preferred-label" : "Karlstad",
    "type" : "municipality",
    "start-position" : 204,
    "end-position" : 212,
    "concept-id" : "hRDj_PoV_sFU",
    "matched-string" : "Karlstad",
    "annotation-id" : 21
  }, {
    "preferred-label" : "Grafisk produktion",
    "type" : "sni-level-3",
    "start-position" : 234,
    "end-position" : 253,
    "concept-id" : "cKdH_fFr_njC",
    "matched-string" : "graphic productions",
    "annotation-id" : 23
  }, {
    "preferred-label" : "3D-animatör",
    "type" : "esco-occupation",
    "start-position" : 379,
    "end-position" : 391,
    "concept-id" : "ESzR_Lr8_sv2",
    "matched-string" : "3D animation",
    "annotation-id" : 24
  }, {
    "preferred-label" : "Learning designer",
    "type" : "keyword",
    "start-position" : 393,
    "end-position" : 408,
    "concept-id" : "1Pqv_JJw_FQ8",
    "matched-string" : "learning design",
    "annotation-id" : 25
  }, {
    "preferred-label" : "Teknisk dokumentation",
    "type" : "skill",
    "start-position" : 436,
    "end-position" : 459,
    "concept-id" : "AEgv_4gP_ndv",
    "matched-string" : "technical documentation",
    "annotation-id" : 26
  }, {
    "preferred-label" : "3d-visualiserare",
    "type" : "keyword",
    "start-position" : 570,
    "end-position" : 586,
    "concept-id" : "dwck_5Tf_yYy",
    "matched-string" : "3D/Visual Artist",
    "annotation-id" : 27
  }, {
    "preferred-label" : "3D",
    "type" : "keyword",
    "start-position" : 629,
    "end-position" : 631,
    "concept-id" : "hL9a_dxf_fBN",
    "matched-string" : "3D",
    "annotation-id" : 28
  }, {
    "preferred-label" : "UX-designer",
    "type" : "occupation-name",
    "start-position" : 695,
    "end-position" : 707,
    "concept-id" : "iwJU_gW4_SxT",
    "matched-string" : "UX designers",
    "annotation-id" : 29
  }, {
    "preferred-label" : "utveckla animationer",
    "type" : "esco-skill",
    "start-position" : 816,
    "end-position" : 826,
    "concept-id" : "WPio_ThW_UHx",
    "matched-string" : "animations",
    "annotation-id" : 30
  }, {
    "preferred-label" : "3D-modellering",
    "type" : "skill",
    "start-position" : 863,
    "end-position" : 890,
    "concept-id" : "yQcc_fTn_JL5",
    "matched-string" : "model and render 3D objects",
    "annotation-id" : 31
  }, {
    "preferred-label" : "Animering",
    "type" : "skill",
    "start-position" : 892,
    "end-position" : 909,
    "concept-id" : "dwm2_1V3_MpP",
    "matched-string" : "create animations",
    "annotation-id" : 32
  }, {
    "preferred-label" : "Film",
    "type" : "skill",
    "start-position" : 911,
    "end-position" : 915,
    "concept-id" : "Lu8w_Lrd_n1y",
    "matched-string" : "film",
    "annotation-id" : 33
  }, {
    "preferred-label" : "Programmering",
    "type" : "skill",
    "start-position" : 1340,
    "end-position" : 1356,
    "concept-id" : "iUew_moc_BRk",
    "matched-string" : "Computer Science",
    "annotation-id" : 34
  }, {
    "preferred-label" : "2-4 års erfarenhet",
    "type" : "occupation-experience-year",
    "start-position" : 1405,
    "end-position" : 1428,
    "concept-id" : "RWA2_uu6_udD",
    "matched-string" : "2-3 years of experience",
    "annotation-id" : 35
  }, {
    "preferred-label" : "Animering",
    "type" : "skill",
    "start-position" : 1570,
    "end-position" : 1579,
    "concept-id" : "dwm2_1V3_MpP",
    "matched-string" : "animation",
    "annotation-id" : 36
  }, {
    "preferred-label" : "3d-designer",
    "type" : "keyword",
    "start-position" : 1584,
    "end-position" : 1593,
    "concept-id" : "2a1a_3iu_5nF",
    "matched-string" : "3D design",
    "annotation-id" : 37
  }, {
    "preferred-label" : "User experience",
    "sentiment" : "MUST_HAVE",
    "type" : "skill",
    "start-position" : 1631,
    "end-position" : 1646,
    "concept-id" : "AdgQ_txR_S3M",
    "matched-string" : "user experience",
    "annotation-id" : 7
  }, {
    "preferred-label" : "Unity, spelmotor",
    "sentiment" : "MUST_HAVE",
    "type" : "skill",
    "start-position" : 1789,
    "end-position" : 1794,
    "concept-id" : "bN1e_YZo_pHh",
    "matched-string" : "unity",
    "annotation-id" : 8
  }, {
    "preferred-label" : "CAN, kommunikationsprotokoll",
    "sentiment" : "MUST_HAVE",
    "type" : "skill",
    "start-position" : 2005,
    "end-position" : 2008,
    "concept-id" : "nTdr_FJz_ioy",
    "matched-string" : "can",
    "annotation-id" : 9
  }, {
    "preferred-label" : "CAN, kommunikationsprotokoll",
    "sentiment" : "MUST_HAVE",
    "type" : "skill",
    "start-position" : 2127,
    "end-position" : 2130,
    "concept-id" : "nTdr_FJz_ioy",
    "matched-string" : "can",
    "annotation-id" : 10
  }, {
    "preferred-label" : "Research",
    "sentiment" : "MUST_HAVE",
    "type" : "skill",
    "start-position" : 2496,
    "end-position" : 2504,
    "concept-id" : "FGhF_q98_YE8",
    "matched-string" : "research",
    "annotation-id" : 11
  }, {
    "preferred-label" : "Data/IT",
    "sentiment" : "MUST_HAVE",
    "type" : "occupation-field",
    "start-position" : 2534,
    "end-position" : 2536,
    "concept-id" : "apaJ_2ja_LuF",
    "matched-string" : "it",
    "annotation-id" : 12
  }, {
    "preferred-label" : "MOST, kommunikationsprotokoll",
    "sentiment" : "MUST_HAVE",
    "type" : "skill",
    "start-position" : 2599,
    "end-position" : 2603,
    "concept-id" : "ob2k_Bcp_XHY",
    "matched-string" : "most",
    "annotation-id" : 13
  }, {
    "preferred-label" : "Data/IT",
    "sentiment" : "MUST_HAVE",
    "type" : "occupation-field",
    "start-position" : 2885,
    "end-position" : 2887,
    "concept-id" : "apaJ_2ja_LuF",
    "matched-string" : "it",
    "annotation-id" : 14
  } ],
  "text" : "3D/VISUAL ARTIST TO COMBITECH IN GOTHENBURG/KARLSTAD/STOCKHOLM\nWe are looking for a curious and engaged 3D/Visual Artist to join our Visual and Training Solution team located in Gothenburg, Stockholm and Karlstad. We are working with graphic productions, interactive solutions for training and other visual content. \n\n \n\nYou will join a team with broad experience in visual art, 3D animation, learning design, interactive training, and technical documentation. Together we build and support solutions for our customers and users around the world.\n\n \n\n \n\nYOUR ROLE\n\nAs a 3D/Visual Artist you will work in close collaboration with 3D and visual artists, learning experience designers, developers, UX designers and other creative minds.\n\n \n\nYou will be part of developing digital training solutions, illustrations, XR, animations and other graphic content. You will model and render 3D objects, create animations, film, and interactive media. You will continuously improve your skills in a stimulating environment and there will be time for personal and professional development.\n\n YOUR PROFILE\n\nYou are a driven and curious team player with a high interest in visual production and training solutions. For us it is important that you have a creative mindset and that you want to be a part of developing our team!\n\n \n\nYou hold a degree in the Computer Science field or equivalent education and have at least 2-3 years of experience. You know how to realize user demands into usability and graphical design of applications. You have a place in your heart for visualization, animation and 3D design. Your interest lies in usability and user experience.\n\n \n\nYou have previously worked in 3ds Max or similar 3D graphics programs and have experience in vector graphics. You also have knowledge in Unity or similar game engines as well as experience from video editing. You have good communication skills in Swedish or English, verbal and written.\n\n \n\n \n\nSelection takes place after the last application date. You can send us your application in either Swedish or English.\n\n \n\n \n\nMAKE A DIFFERENCE TOGETHER WITH US\n\nWe believe that you can do a better job when you are able to focus on the right things, which is why we ensure that you have the right conditions for balancing work and everyday life. We invest in our employees - they are the heart, mind and core of our operations. In addition, since we are owned by the defense and security group Saab, we stand on a solid foundation of high technology, research and job security.\n\n \n\nFor us it's all about sustainability - we want to become the industry's most sustainable company. But to be a sustainable company, we need to invest in our employees. For us, your recovery, your development opportunities and your job security are as important as the company's success - without our employees we stand still.\n\n \n\nWant to know more about what it is like to work with us? Check out our career pages!"
}