{
  "meta" : {
    "jobad" : {
      "description" : {
        "requirements" : null,
        "needs" : null,
        "company_information" : null,
        "text_formatted" : "Strokeenheten och Neurorehab tillhör Neurocentrum på Sunderby sjukhus. Vårdavdelningen har vårdplatser för inneliggande neurologisk vård och rehabilitering och ligger i tillgängliga lokaler på plan 4. I anslutning till avdelningen finns strokerehabteamet (SHR), strokemottagningen, baklofenmottagningen och rehabiliteringsmedicinska mottagningen. \n\nVi söker\nStrokeenheten/Neurorehab söker dig, en engagerad sjuksköterska som är intresserad av att jobba med personcentrerad vård och rehabilitering. Du tycker om att arbeta i team med patienter och kollegor och värdesätter att få vara en del i vårt pågående utvecklingsarbete. \n\nDet här får du arbeta med\nStrokeenhetens målsättning är att arbeta med hela vårdkedjan, från det akuta insjuknandet i stroke tills det att patienten skrivs ut, ibland med stöd av vårt SHR-team. Hos strokeenheten arbetar du tillsammans med teamet utifrån tydliga rutiner som grundas i Socialstyrelsens Nationella riktlinjer för stroke.\nPå Neurorehab har vi Norrbottens högsta rehabnivå och här vårdas och rehabiliteras patienter med bland annat ryggmärgsskada och förvärvad hjärnskada. Rehabiliteringen som bedrivs är på specialistnivå (ackrediterad enligt Carf) och hit kommer patienter från hela länet på remiss.\nPå avdelningen arbetar vi i multiprofessionella team där sjuksköterska, arbetsterapeut, fysioterapeut, kurator, logoped, läkare, undersköterska, psykolog och rehabinstruktör ingår. Utöver detta har vi på avdelningen ett köksbiträde och utvecklingssjuksköterskor som bidrar till att du som sjuksköterska kan lägga ditt fokus på patienten.\nHos oss är sjuksköterskans huvudsakliga ansvarsområde patientomvårdnaden. Där igår att dagligen leda, fördela, prioritera och utvärdera det behovsstyrda och rehabiliteringsfokuserade omvårdnadsarbetet.\n\nDet här erbjuder vi dig\n- Utvecklings- och karriärmöjligheter där du får vara med och skapa framtidens hälsa och vård\n- Hälsofrämjande arbetsplatser med tillgång till friskvårdsaktiviteter och friskvårdsbidrag\n- Länk till våra förmåner: https://www.norrbotten.se/sv/Jobb-och-utbildning/Jobba-hos-oss/\n-  4 veckors introduktion på avdelningen\n-  Att delta i ett basårsprogram tillsammans med andra nyanställda.\n- En personlig mentor\n- Deltagande i strokekompentensutbildning som genererar 3 högskolepoäng\n- Ett rehabkörkort som innebär en fördjupad kunskap i rehabiliteringsmetodik. \nInformation om tjänsten\nTillsvidaretjänst på heltid. Arbetstid är dag, kväll och helg. Urval och intervjuer sker löpande och tjänsten kan tillsättas innan sista ansökningsdagen.\nRegion Norrbotten tillämpar individuell lönesättning enligt kollektivavtal.\n\nVälkommen med din ansökan!",
        "conditions" : "Heltid",
        "text" : "Strokeenheten och Neurorehab tillhör Neurocentrum på Sunderby sjukhus. Vårdavdelningen har vårdplatser för inneliggande neurologisk vård och rehabilitering och ligger i tillgängliga lokaler på plan 4. I anslutning till avdelningen finns strokerehabteamet (SHR), strokemottagningen, baklofenmottagningen och rehabiliteringsmedicinska mottagningen. \n\nVi söker\nStrokeenheten/Neurorehab söker dig, en engagerad sjuksköterska som är intresserad av att jobba med personcentrerad vård och rehabilitering. Du tycker om att arbeta i team med patienter och kollegor och värdesätter att få vara en del i vårt pågående utvecklingsarbete. \n\nDet här får du arbeta med\nStrokeenhetens målsättning är att arbeta med hela vårdkedjan, från det akuta insjuknandet i stroke tills det att patienten skrivs ut, ibland med stöd av vårt SHR-team. Hos strokeenheten arbetar du tillsammans med teamet utifrån tydliga rutiner som grundas i Socialstyrelsens Nationella riktlinjer för stroke.\nPå Neurorehab har vi Norrbottens högsta rehabnivå och här vårdas och rehabiliteras patienter med bland annat ryggmärgsskada och förvärvad hjärnskada. Rehabiliteringen som bedrivs är på specialistnivå (ackrediterad enligt Carf) och hit kommer patienter från hela länet på remiss.\nPå avdelningen arbetar vi i multiprofessionella team där sjuksköterska, arbetsterapeut, fysioterapeut, kurator, logoped, läkare, undersköterska, psykolog och rehabinstruktör ingår. Utöver detta har vi på avdelningen ett köksbiträde och utvecklingssjuksköterskor som bidrar till att du som sjuksköterska kan lägga ditt fokus på patienten.\nHos oss är sjuksköterskans huvudsakliga ansvarsområde patientomvårdnaden. Där igår att dagligen leda, fördela, prioritera och utvärdera det behovsstyrda och rehabiliteringsfokuserade omvårdnadsarbetet.\n\nDet här erbjuder vi dig\n- Utvecklings- och karriärmöjligheter där du får vara med och skapa framtidens hälsa och vård\n- Hälsofrämjande arbetsplatser med tillgång till friskvårdsaktiviteter och friskvårdsbidrag\n- Länk till våra förmåner: https://www.norrbotten.se/sv/Jobb-och-utbildning/Jobba-hos-oss/\n-  4 veckors introduktion på avdelningen\n-  Att delta i ett basårsprogram tillsammans med andra nyanställda.\n- En personlig mentor\n- Deltagande i strokekompentensutbildning som genererar 3 högskolepoäng\n- Ett rehabkörkort som innebär en fördjupad kunskap i rehabiliteringsmetodik. \nInformation om tjänsten\nTillsvidaretjänst på heltid. Arbetstid är dag, kväll och helg. Urval och intervjuer sker löpande och tjänsten kan tillsättas innan sista ansökningsdagen.\nRegion Norrbotten tillämpar individuell lönesättning enligt kollektivavtal.\n\nVälkommen med din ansökan!"
      },
      "headline" : "Legitimerad sjuksköterska till Sunderby sjukhus neurorehab/strokenheten",
      "driving_license" : null,
      "employer" : {
        "email" : null,
        "phone_number" : null,
        "organization_number" : "2321000230",
        "name" : "REGION NORRBOTTEN",
        "url" : "www.nll.se",
        "workplace" : "Region Norrbotten"
      },
      "removed_date" : null,
      "logo_url" : "https://www.arbetsformedlingen.se/rest/arbetsgivare/rest/af/v3/organisation/2321000230/logotyper/logo.png",
      "last_publication_date" : "2022-09-21T23:59:59",
      "number_of_vacancies" : 1,
      "occupation" : {
        "concept_id" : "bXNH_MNX_dUR",
        "label" : "Sjuksköterska, grundutbildad",
        "legacy_ams_taxonomy_id" : "7296"
      },
      "occupation_group" : {
        "concept_id" : "Z8ci_bBE_tmx",
        "label" : "Grundutbildade sjuksköterskor",
        "legacy_ams_taxonomy_id" : "2221"
      },
      "employment_type" : {
        "concept_id" : "PFZr_Syz_cUq",
        "label" : "Vanlig anställning",
        "legacy_ams_taxonomy_id" : "1"
      },
      "webpage_url" : "https://arbetsformedlingen.se/platsbanken/annonser/26393698",
      "driving_license_required" : false,
      "application_contacts" : [ {
        "description" : null,
        "email" : "erika.boman@norrbotten.se",
        "telephone" : "070-284 06 92",
        "name" : "Erica Boman",
        "contact_type" : null
      } ],
      "duration" : {
        "concept_id" : "a7uU_j21_mkL",
        "label" : "Tills vidare",
        "legacy_ams_taxonomy_id" : "1"
      },
      "nice_to_have" : {
        "education_level" : [ ],
        "work_experiences" : [ ],
        "skills" : [ ],
        "education" : [ ],
        "languages" : [ ]
      },
      "application_details" : {
        "via_af" : false,
        "email" : null,
        "other" : null,
        "reference" : "200237",
        "url" : "https://candidate.hr-manager.net/ApplicationInit.aspx?cid=290&ProjectId=200237&DepartmentId=21815&MediaId=5",
        "information" : null
      },
      "source_type" : "VIA_PLATSBANKEN_DXA",
      "application_deadline" : "2022-09-21T23:59:59",
      "external_id" : "46-232100-0230-00157761",
      "workplace_address" : {
        "coordinates" : [ 22.156702, 65.584816 ],
        "city" : null,
        "postcode" : null,
        "municipality" : "Luleå",
        "region_concept_id" : "9hXe_F4g_eTG",
        "region" : "Norrbottens län",
        "country_code" : "199",
        "region_code" : "25",
        "municipality_concept_id" : "CXbY_gui_14v",
        "country_concept_id" : "i46j_HmG_v64",
        "municipality_code" : "2580",
        "street_address" : null,
        "country" : "Sverige"
      },
      "id" : "26393698",
      "experience_required" : true,
      "working_hours_type" : {
        "concept_id" : "6YE1_gAC_R2G",
        "label" : "Heltid",
        "legacy_ams_taxonomy_id" : "1"
      },
      "access" : null,
      "timestamp" : 1660110523944,
      "must_have" : {
        "education_level" : [ ],
        "work_experiences" : [ {
          "concept_id" : "bXNH_MNX_dUR",
          "weight" : 10,
          "label" : "Sjuksköterska, grundutbildad",
          "legacy_ams_taxonomy_id" : "7296"
        } ],
        "skills" : [ ],
        "education" : [ ],
        "languages" : [ ]
      },
      "occupation_field" : {
        "concept_id" : "NYW6_mP6_vwf",
        "label" : "Hälso- och sjukvård",
        "legacy_ams_taxonomy_id" : "8"
      },
      "scope_of_work" : {
        "min" : 100,
        "max" : 100
      },
      "salary_type" : {
        "concept_id" : "oG8G_9cW_nRf",
        "label" : "Fast månads- vecko- eller timlön",
        "legacy_ams_taxonomy_id" : "1"
      },
      "removed" : false,
      "salary_description" : "Individuell lönesättning enligt kollektivavtal. ",
      "access_to_own_car" : false,
      "publication_date" : "2022-08-10T07:48:43"
    },
    "name" : "Legitimerad sjuksköterska till Sunderby sjukhus neurorehab/strokenheten",
    "user" : "hannes"
  },
  "sha1" : "b307407f8cf0efc70d1e7fdb87f7246e153ab247",
  "annotations" : [ {
    "preferred-label" : "Sjuksköterska, grundutbildad",
    "sentiment" : "MUST_HAVE",
    "type" : "occupation-name",
    "start-position" : 12,
    "end-position" : 25,
    "concept-id" : "bXNH_MNX_dUR",
    "matched-string" : "sjuksköterska",
    "annotation-id" : 0
  }, {
    "preferred-label" : "Neurologi",
    "sentiment" : "NOT_RELEVANT",
    "type" : "skill",
    "start-position" : 192,
    "end-position" : 203,
    "concept-id" : "Mtmj_FLt_uDk",
    "matched-string" : "neurologisk",
    "annotation-id" : 16
  }, {
    "preferred-label" : "rehabilitering",
    "sentiment" : "NOT_RELEVANT",
    "type" : "esco-skill",
    "start-position" : 213,
    "end-position" : 227,
    "concept-id" : "ok5p_sUV_QKj",
    "matched-string" : "rehabilitering",
    "annotation-id" : 1
  }, {
    "preferred-label" : "Rehabiliteringsmedicin",
    "sentiment" : "NOT_RELEVANT",
    "type" : "skill",
    "start-position" : 379,
    "end-position" : 404,
    "concept-id" : "URMC_Sxh_Lta",
    "matched-string" : "rehabiliteringsmedicinska",
    "annotation-id" : 18
  }, {
    "preferred-label" : "Sjuksköterska, grundutbildad",
    "sentiment" : "MUST_HAVE",
    "type" : "occupation-name",
    "start-position" : 479,
    "end-position" : 492,
    "concept-id" : "bXNH_MNX_dUR",
    "matched-string" : "sjuksköterska",
    "annotation-id" : 2
  }, {
    "preferred-label" : "ge personcentrerad vård",
    "sentiment" : "MUST_HAVE",
    "type" : "esco-skill",
    "start-position" : 529,
    "end-position" : 549,
    "concept-id" : "C53z_A9Z_djP",
    "matched-string" : "personcentrerad vård",
    "annotation-id" : 19
  }, {
    "preferred-label" : "rehabilitering",
    "sentiment" : "NOT_RELEVANT",
    "type" : "esco-skill",
    "start-position" : 554,
    "end-position" : 568,
    "concept-id" : "ok5p_sUV_QKj",
    "matched-string" : "rehabilitering",
    "annotation-id" : 3
  }, {
    "preferred-label" : "Utvecklingsarbete",
    "sentiment" : "MUST_HAVE",
    "type" : "skill",
    "start-position" : 679,
    "end-position" : 696,
    "concept-id" : "LsGo_Kh2_3kH",
    "matched-string" : "utvecklingsarbete",
    "annotation-id" : 4
  }, {
    "preferred-label" : "Norrbottens län",
    "type" : "region",
    "start-position" : 1056,
    "end-position" : 1067,
    "concept-id" : "9hXe_F4g_eTG",
    "matched-string" : "Norrbottens",
    "annotation-id" : 17
  }, {
    "preferred-label" : "Sjuksköterska",
    "sentiment" : "NOT_RELEVANT",
    "type" : "keyword",
    "start-position" : 1371,
    "end-position" : 1384,
    "concept-id" : "jrjV_wcz_fxg",
    "matched-string" : "sjuksköterska",
    "annotation-id" : 5
  }, {
    "preferred-label" : "Arbetsterapeut",
    "sentiment" : "NOT_RELEVANT",
    "type" : "occupation-name",
    "start-position" : 1386,
    "end-position" : 1400,
    "concept-id" : "heGV_uHh_o8W",
    "matched-string" : "arbetsterapeut",
    "annotation-id" : 6
  }, {
    "preferred-label" : "Fysioterapeut/Sjukgymnast",
    "sentiment" : "NOT_RELEVANT",
    "type" : "occupation-name",
    "start-position" : 1402,
    "end-position" : 1415,
    "concept-id" : "raVz_oTw_N3e",
    "matched-string" : "fysioterapeut",
    "annotation-id" : 7
  }, {
    "preferred-label" : "Kurator",
    "sentiment" : "NOT_RELEVANT",
    "type" : "occupation-name",
    "start-position" : 1417,
    "end-position" : 1424,
    "concept-id" : "YpRs_ybt_47a",
    "matched-string" : "kurator",
    "annotation-id" : 8
  }, {
    "preferred-label" : "logoped",
    "sentiment" : "NOT_RELEVANT",
    "type" : "esco-occupation",
    "start-position" : 1426,
    "end-position" : 1433,
    "concept-id" : "mZpY_Kwy_mTi",
    "matched-string" : "logoped",
    "annotation-id" : 9
  }, {
    "preferred-label" : "läkare",
    "sentiment" : "NOT_RELEVANT",
    "type" : "esco-occupation",
    "start-position" : 1435,
    "end-position" : 1441,
    "concept-id" : "snUT_QSf_LG9",
    "matched-string" : "läkare",
    "annotation-id" : 10
  }, {
    "preferred-label" : "Undersköterskor",
    "sentiment" : "NOT_RELEVANT",
    "type" : "ssyk-level-3",
    "start-position" : 1443,
    "end-position" : 1457,
    "concept-id" : "3EJj_WLs_kgD",
    "matched-string" : "undersköterska",
    "annotation-id" : 20
  }, {
    "preferred-label" : "psykolog",
    "sentiment" : "NOT_RELEVANT",
    "type" : "esco-occupation",
    "start-position" : 1459,
    "end-position" : 1467,
    "concept-id" : "yLc4_ZtB_oiN",
    "matched-string" : "psykolog",
    "annotation-id" : 11
  }, {
    "preferred-label" : "Köksbiträde",
    "sentiment" : "NOT_RELEVANT",
    "type" : "occupation-name",
    "start-position" : 1534,
    "end-position" : 1545,
    "concept-id" : "oRB5_b7i_Qzv",
    "matched-string" : "köksbiträde",
    "annotation-id" : 12
  }, {
    "preferred-label" : "Sjuksköterska, grundutbildad",
    "sentiment" : "MUST_HAVE",
    "type" : "occupation-name",
    "start-position" : 1603,
    "end-position" : 1616,
    "concept-id" : "bXNH_MNX_dUR",
    "matched-string" : "sjuksköterska",
    "annotation-id" : 13
  }, {
    "preferred-label" : "Sjuksköterska, grundutbildad",
    "sentiment" : "MUST_HAVE",
    "type" : "occupation-name",
    "start-position" : 1663,
    "end-position" : 1678,
    "concept-id" : "bXNH_MNX_dUR",
    "matched-string" : "sjuksköterskans",
    "annotation-id" : 21
  }, {
    "preferred-label" : "Hälsa",
    "sentiment" : "NOT_RELEVANT",
    "type" : "keyword",
    "start-position" : 1958,
    "end-position" : 1963,
    "concept-id" : "Abys_5p1_Cnq",
    "matched-string" : "hälsa",
    "annotation-id" : 14
  }, {
    "preferred-label" : "Friskvård",
    "sentiment" : "OFFERED",
    "type" : "keyword",
    "start-position" : 2022,
    "end-position" : 2043,
    "concept-id" : "yoHe_xjK_qjH",
    "matched-string" : "friskvårdsaktiviteter",
    "annotation-id" : 22
  }, {
    "preferred-label" : "Friskvård",
    "sentiment" : "OFFERED",
    "type" : "keyword",
    "start-position" : 2048,
    "end-position" : 2064,
    "concept-id" : "yoHe_xjK_qjH",
    "matched-string" : "friskvårdsbidrag",
    "annotation-id" : 23
  }, {
    "preferred-label" : "Tillsvidareanställning (inkl. eventuell provanställning)",
    "type" : "employment-type",
    "start-position" : 2462,
    "end-position" : 2479,
    "concept-id" : "kpPX_CNN_gDU",
    "matched-string" : "Tillsvidaretjänst",
    "annotation-id" : 24
  }, {
    "preferred-label" : "Heltid",
    "type" : "worktime-extent",
    "start-position" : 2483,
    "end-position" : 2489,
    "concept-id" : "6YE1_gAC_R2G",
    "matched-string" : "heltid",
    "annotation-id" : 25
  }, {
    "preferred-label" : "Norrbottens län",
    "type" : "region",
    "start-position" : 2616,
    "end-position" : 2633,
    "concept-id" : "9hXe_F4g_eTG",
    "matched-string" : "Region Norrbotten",
    "annotation-id" : 26
  }, {
    "preferred-label" : "Kollektivavtal",
    "sentiment" : "OFFERED",
    "type" : "skill",
    "start-position" : 2676,
    "end-position" : 2690,
    "concept-id" : "z7wE_9xb_3jX",
    "matched-string" : "kollektivavtal",
    "annotation-id" : 15
  } ],
  "text" : "Legitimerad sjuksköterska till Sunderby sjukhus neurorehab/strokenheten\nStrokeenheten och Neurorehab tillhör Neurocentrum på Sunderby sjukhus. Vårdavdelningen har vårdplatser för inneliggande neurologisk vård och rehabilitering och ligger i tillgängliga lokaler på plan 4. I anslutning till avdelningen finns strokerehabteamet (SHR), strokemottagningen, baklofenmottagningen och rehabiliteringsmedicinska mottagningen. \n\nVi söker\nStrokeenheten/Neurorehab söker dig, en engagerad sjuksköterska som är intresserad av att jobba med personcentrerad vård och rehabilitering. Du tycker om att arbeta i team med patienter och kollegor och värdesätter att få vara en del i vårt pågående utvecklingsarbete. \n\nDet här får du arbeta med\nStrokeenhetens målsättning är att arbeta med hela vårdkedjan, från det akuta insjuknandet i stroke tills det att patienten skrivs ut, ibland med stöd av vårt SHR-team. Hos strokeenheten arbetar du tillsammans med teamet utifrån tydliga rutiner som grundas i Socialstyrelsens Nationella riktlinjer för stroke.\nPå Neurorehab har vi Norrbottens högsta rehabnivå och här vårdas och rehabiliteras patienter med bland annat ryggmärgsskada och förvärvad hjärnskada. Rehabiliteringen som bedrivs är på specialistnivå (ackrediterad enligt Carf) och hit kommer patienter från hela länet på remiss.\nPå avdelningen arbetar vi i multiprofessionella team där sjuksköterska, arbetsterapeut, fysioterapeut, kurator, logoped, läkare, undersköterska, psykolog och rehabinstruktör ingår. Utöver detta har vi på avdelningen ett köksbiträde och utvecklingssjuksköterskor som bidrar till att du som sjuksköterska kan lägga ditt fokus på patienten.\nHos oss är sjuksköterskans huvudsakliga ansvarsområde patientomvårdnaden. Där igår att dagligen leda, fördela, prioritera och utvärdera det behovsstyrda och rehabiliteringsfokuserade omvårdnadsarbetet.\n\nDet här erbjuder vi dig\n- Utvecklings- och karriärmöjligheter där du får vara med och skapa framtidens hälsa och vård\n- Hälsofrämjande arbetsplatser med tillgång till friskvårdsaktiviteter och friskvårdsbidrag\n- Länk till våra förmåner: https://www.norrbotten.se/sv/Jobb-och-utbildning/Jobba-hos-oss/\n-  4 veckors introduktion på avdelningen\n-  Att delta i ett basårsprogram tillsammans med andra nyanställda.\n- En personlig mentor\n- Deltagande i strokekompentensutbildning som genererar 3 högskolepoäng\n- Ett rehabkörkort som innebär en fördjupad kunskap i rehabiliteringsmetodik. \nInformation om tjänsten\nTillsvidaretjänst på heltid. Arbetstid är dag, kväll och helg. Urval och intervjuer sker löpande och tjänsten kan tillsättas innan sista ansökningsdagen.\nRegion Norrbotten tillämpar individuell lönesättning enligt kollektivavtal.\n\nVälkommen med din ansökan!"
}