{
  "meta" : {
    "jobad" : {
      "description" : {
        "requirements" : null,
        "needs" : null,
        "company_information" : null,
        "text_formatted" : "VoB (Vård och Behandling) är ett kommunägt bolag som drivs på samhällsnyttig grund utan vinstsyfte. VoB erbjuder goda utvecklings- och karriärmöjligheter för dig som vill satsa i ett kreativt sammanhang med korta beslutsvägar. Arbetsklimatet i VoB präglas av engagemang, öppenhet och prestigelöshet. Som medarbetare ges du stort utrymme att ta eget ansvar och du har stor frihet att lösa ditt uppdrag på det sätt som du tycker är bäst. Du erbjuds kontinuerlig kompetensutveckling och subventionerad friskvård. \n\nFamiljehuset är ett akut, utrednings- och behandlingshem för barn och familjer, i verksamheten finns två familjeavdelningar. \nDen ena avdelningen tar emot familjer med barn i åldern 0-3 år och äldre syskon kan finnas med i placeringen. Den andra avdelningen tar emot familjer med spädbarn och fokus ligger på barnets tidiga anknytning. Avdelningen tar även emot gravida kvinnor några veckor före beräknad förlossning.\n\nVi söker nu en serviceinriktad medarbetare med ansvar för olika delar inom kök och matlagning och som trivs att arbeta nära barn och vara en av barnens förebilder.\nVerksamheten som i nuläget ligger i Hörby kommer under den senare delen av hösten att flytta till nya lokaler i Lund. Stora möjligheter att påverka utformningen av tjänsten finns i samband med flytten till nya lokaler.\r\n\r\nARBETSUPPGIFTER\nI tjänsten ingår att ta emot mat som levereras färdig för lunch och vara behjälplig med dukning och vid servering. Du kommer också att förbereda kvällsmat för dagen samt vid veckoslut även kvällsmål för helgen. \n\nViss tvätt och städning av kök och matsal ingår liksom att planera matsedel.  Varje vecka görs matbeställningar och du tar då även hand om dessa inköp med tex uppackning av varor mm.\n\nI arbetsuppgifterna ingår även att handleda familjerna i köket samt att vara rollmodell vid de möjligheter till socialt samspel som arbete i köket kan ge. Till exempel genom enklare bakning och planering av firande vid lov och högtidsdagar. \r\n\r\nKVALIFIKATIONER\nDu som söker tjänsten är serviceinriktad, engagerad, stresstålig och prestigelös och tycker att arbetsuppgifterna och verksamhetens uppdrag motsvarar dina förväntningar.\nFör dig är det självklart att förena struktur och flexibilitet i det dagliga arbete.  \nVidare är du  självständig och självgående, tar ansvar för dina uppgifter vilket bl a innebär att du planerar, organiserar och prioriterar arbetet på ett effektivt sätt.\n\nDu har någon form av köksutbildning som te x kallskänka, köksbiträde eller annan utbildning samt praktisk erfarenhet av matlagning och övrigt köksarbete. \nDet är en merit om du arbetat på arbetsplatser inom det sociala området och med människor i behov av extra stöd\nDu är kvalitetsmedveten och det är positivt om du därmed har erfarenhet av egenkontroll och livsmedelshygien.\nBefattningen motsvarar en halvtidstjänst. Utöver detta finns möjlighet till utökning av tjänstgöringsgrad och ytterligare arbetsuppgifter beroende på din erfarenhet, personliga förmågor, intresse och utbildning. \nTjänsten kan med fördel kompletteras med till exempel ansvar för lokalvård av gemensamma utrymmen eller pedagogiskt arbete med barnen på boendet.\n\nFör utökning av tjänstgöringsgrad med pedagogiskt arbete med barnen krävs även barnskötarutbildning eller motsvarande liksom erfarenhet av arbete med barn.\r\n\nÖVRIGT\nEn förutsättning för anställning är att du avstår från att röka under arbetstid.\nVoB tillämpar vård omsorg - HÖK/AB \nUrval sker löpande.",
        "conditions" : "Deltid. 50 % med möjlighet till utökning  Dagtid.\r\nTillsvidareanställning, tillträde: 2022-10-01  Efter överenskommelse, upphör: \n.",
        "text" : "VoB (Vård och Behandling) är ett kommunägt bolag som drivs på samhällsnyttig grund utan vinstsyfte. VoB erbjuder goda utvecklings- och karriärmöjligheter för dig som vill satsa i ett kreativt sammanhang med korta beslutsvägar. Arbetsklimatet i VoB präglas av engagemang, öppenhet och prestigelöshet. Som medarbetare ges du stort utrymme att ta eget ansvar och du har stor frihet att lösa ditt uppdrag på det sätt som du tycker är bäst. Du erbjuds kontinuerlig kompetensutveckling och subventionerad friskvård. \n\nFamiljehuset är ett akut, utrednings- och behandlingshem för barn och familjer, i verksamheten finns två familjeavdelningar. \nDen ena avdelningen tar emot familjer med barn i åldern 0-3 år och äldre syskon kan finnas med i placeringen. Den andra avdelningen tar emot familjer med spädbarn och fokus ligger på barnets tidiga anknytning. Avdelningen tar även emot gravida kvinnor några veckor före beräknad förlossning.\n\nVi söker nu en serviceinriktad medarbetare med ansvar för olika delar inom kök och matlagning och som trivs att arbeta nära barn och vara en av barnens förebilder.\nVerksamheten som i nuläget ligger i Hörby kommer under den senare delen av hösten att flytta till nya lokaler i Lund. Stora möjligheter att påverka utformningen av tjänsten finns i samband med flytten till nya lokaler.\r\n\r\nARBETSUPPGIFTER\nI tjänsten ingår att ta emot mat som levereras färdig för lunch och vara behjälplig med dukning och vid servering. Du kommer också att förbereda kvällsmat för dagen samt vid veckoslut även kvällsmål för helgen. \n\nViss tvätt och städning av kök och matsal ingår liksom att planera matsedel.  Varje vecka görs matbeställningar och du tar då även hand om dessa inköp med tex uppackning av varor mm.\n\nI arbetsuppgifterna ingår även att handleda familjerna i köket samt att vara rollmodell vid de möjligheter till socialt samspel som arbete i köket kan ge. Till exempel genom enklare bakning och planering av firande vid lov och högtidsdagar. \r\n\r\nKVALIFIKATIONER\nDu som söker tjänsten är serviceinriktad, engagerad, stresstålig och prestigelös och tycker att arbetsuppgifterna och verksamhetens uppdrag motsvarar dina förväntningar.\nFör dig är det självklart att förena struktur och flexibilitet i det dagliga arbete.  \nVidare är du  självständig och självgående, tar ansvar för dina uppgifter vilket bl a innebär att du planerar, organiserar och prioriterar arbetet på ett effektivt sätt.\n\nDu har någon form av köksutbildning som te x kallskänka, köksbiträde eller annan utbildning samt praktisk erfarenhet av matlagning och övrigt köksarbete. \nDet är en merit om du arbetat på arbetsplatser inom det sociala området och med människor i behov av extra stöd\nDu är kvalitetsmedveten och det är positivt om du därmed har erfarenhet av egenkontroll och livsmedelshygien.\nBefattningen motsvarar en halvtidstjänst. Utöver detta finns möjlighet till utökning av tjänstgöringsgrad och ytterligare arbetsuppgifter beroende på din erfarenhet, personliga förmågor, intresse och utbildning. \nTjänsten kan med fördel kompletteras med till exempel ansvar för lokalvård av gemensamma utrymmen eller pedagogiskt arbete med barnen på boendet.\n\nFör utökning av tjänstgöringsgrad med pedagogiskt arbete med barnen krävs även barnskötarutbildning eller motsvarande liksom erfarenhet av arbete med barn.\r\n\nÖVRIGT\nEn förutsättning för anställning är att du avstår från att röka under arbetstid.\nVoB tillämpar vård omsorg - HÖK/AB \nUrval sker löpande."
      },
      "headline" : "Köksbiträde till Familjehuset i Lund",
      "driving_license" : null,
      "employer" : {
        "email" : null,
        "phone_number" : null,
        "organization_number" : "5566504204",
        "name" : "V o B Syd AB",
        "url" : "https://vob.se/",
        "workplace" : "VoB Syd AB, Familjehuset i Hörby"
      },
      "removed_date" : null,
      "logo_url" : null,
      "last_publication_date" : "2022-08-26T23:59:59",
      "number_of_vacancies" : 1,
      "occupation" : {
        "concept_id" : "oRB5_b7i_Qzv",
        "label" : "Köksbiträde",
        "legacy_ams_taxonomy_id" : "483"
      },
      "occupation_group" : {
        "concept_id" : "tPox_ie4_X9X",
        "label" : "Restaurang- och köksbiträden m.fl.",
        "legacy_ams_taxonomy_id" : "9412"
      },
      "employment_type" : {
        "concept_id" : "PFZr_Syz_cUq",
        "label" : "Vanlig anställning",
        "legacy_ams_taxonomy_id" : "1"
      },
      "webpage_url" : "https://arbetsformedlingen.se/platsbanken/annonser/26349799",
      "driving_license_required" : false,
      "application_contacts" : [ {
        "description" : "Elin Fridström",
        "email" : "elin.fridstrom@vob.se",
        "telephone" : "0415 - 38 63 01",
        "name" : null,
        "contact_type" : "Verksamhetschef Familjehuset i Hörby"
      } ],
      "duration" : {
        "concept_id" : "a7uU_j21_mkL",
        "label" : "Tills vidare",
        "legacy_ams_taxonomy_id" : "1"
      },
      "nice_to_have" : {
        "education_level" : [ ],
        "work_experiences" : [ ],
        "skills" : [ ],
        "education" : [ ],
        "languages" : [ ]
      },
      "application_details" : {
        "via_af" : false,
        "email" : null,
        "other" : null,
        "reference" : "A1144671",
        "url" : "https://recruit.visma.com/Public/Apply.aspx?guidAssignment=075b06fb-f16f-4770-b345-3e5615a5b53f&publishCode=AMS&TK=b20a04c3-0482-4d69-8f42-49dc12a738d5",
        "information" : null
      },
      "source_type" : "VIA_PLATSBANKEN_DXA",
      "application_deadline" : "2022-08-26T23:59:59",
      "external_id" : "46-556650-4204-075B06FBF16F4770B3453E5615A5B53F",
      "workplace_address" : {
        "coordinates" : [ 13.661925, 55.851715 ],
        "city" : null,
        "postcode" : null,
        "municipality" : "Hörby",
        "region_concept_id" : "CaRE_1nn_cSU",
        "region" : "Skåne län",
        "country_code" : "199",
        "region_code" : "12",
        "municipality_concept_id" : "autr_KMa_cfp",
        "country_concept_id" : "i46j_HmG_v64",
        "municipality_code" : "1266",
        "street_address" : null,
        "country" : "Sverige"
      },
      "id" : "26349799",
      "experience_required" : true,
      "working_hours_type" : {
        "concept_id" : "947z_JGS_Uk2",
        "label" : "Deltid",
        "legacy_ams_taxonomy_id" : "2"
      },
      "access" : null,
      "timestamp" : 1658733624928,
      "must_have" : {
        "education_level" : [ ],
        "work_experiences" : [ {
          "concept_id" : "oRB5_b7i_Qzv",
          "weight" : 10,
          "label" : "Köksbiträde",
          "legacy_ams_taxonomy_id" : "483"
        } ],
        "skills" : [ ],
        "education" : [ ],
        "languages" : [ ]
      },
      "occupation_field" : {
        "concept_id" : "ScKy_FHB_7wT",
        "label" : "Hotell, restaurang, storhushåll",
        "legacy_ams_taxonomy_id" : "7"
      },
      "scope_of_work" : {
        "min" : 50,
        "max" : 100
      },
      "salary_type" : {
        "concept_id" : "oG8G_9cW_nRf",
        "label" : "Fast månads- vecko- eller timlön",
        "legacy_ams_taxonomy_id" : "1"
      },
      "removed" : false,
      "salary_description" : "Månadslön Individuell lönesättning",
      "access_to_own_car" : false,
      "publication_date" : "2022-07-25T09:20:24"
    },
    "name" : "Köksbiträde till Familjehuset i Lund",
    "user" : "hannes"
  },
  "sha1" : "dac97137f9547ca609c8167c1eea916cd3726f5a",
  "annotations" : [ {
    "preferred-label" : "Köksbiträde",
    "sentiment" : "MUST_HAVE",
    "type" : "occupation-name",
    "start-position" : 0,
    "end-position" : 11,
    "concept-id" : "oRB5_b7i_Qzv",
    "matched-string" : "köksbiträde",
    "annotation-id" : 0
  }, {
    "preferred-label" : "Lund",
    "type" : "municipality",
    "start-position" : 32,
    "end-position" : 36,
    "concept-id" : "muSY_tsR_vDZ",
    "matched-string" : "Lund",
    "annotation-id" : 10
  }, {
    "preferred-label" : "Friskvård",
    "sentiment" : "MUST_HAVE",
    "type" : "keyword",
    "start-position" : 536,
    "end-position" : 545,
    "concept-id" : "yoHe_xjK_qjH",
    "matched-string" : "friskvård",
    "annotation-id" : 1
  }, {
    "preferred-label" : "Behandlingshem",
    "sentiment" : "MUST_HAVE",
    "type" : "skill",
    "start-position" : 591,
    "end-position" : 605,
    "concept-id" : "oQm8_Ucv_eSp",
    "matched-string" : "behandlingshem",
    "annotation-id" : 2
  }, {
    "preferred-label" : "Serveringsbiträde",
    "type" : "keyword",
    "start-position" : 1474,
    "end-position" : 1483,
    "concept-id" : "gZVV_nVJ_LkV",
    "matched-string" : "servering",
    "annotation-id" : 11
  }, {
    "preferred-label" : "Tvätteri",
    "type" : "skill",
    "start-position" : 1588,
    "end-position" : 1593,
    "concept-id" : "JLX2_ZVk_veF",
    "matched-string" : "tvätt",
    "annotation-id" : 12
  }, {
    "preferred-label" : "Städa",
    "type" : "keyword",
    "start-position" : 1598,
    "end-position" : 1606,
    "concept-id" : "r35T_iyj_ueU",
    "matched-string" : "städning",
    "annotation-id" : 13
  }, {
    "preferred-label" : "arbeta självständigt",
    "type" : "esco-skill",
    "start-position" : 2299,
    "end-position" : 2311,
    "concept-id" : "NyFu_HHd_zhz",
    "matched-string" : "självständig",
    "annotation-id" : 14
  }, {
    "preferred-label" : "Kallskänka",
    "sentiment" : "MUST_HAVE",
    "type" : "occupation-name",
    "start-position" : 2501,
    "end-position" : 2511,
    "concept-id" : "JECy_3w6_gah",
    "matched-string" : "kallskänka",
    "annotation-id" : 3
  }, {
    "preferred-label" : "Köksbiträde",
    "sentiment" : "MUST_HAVE",
    "type" : "occupation-name",
    "start-position" : 2513,
    "end-position" : 2524,
    "concept-id" : "oRB5_b7i_Qzv",
    "matched-string" : "köksbiträde",
    "annotation-id" : 4
  }, {
    "preferred-label" : "Livsmedelshygien",
    "sentiment" : "MUST_HAVE",
    "type" : "skill",
    "start-position" : 2815,
    "end-position" : 2831,
    "concept-id" : "kj4Q_nLh_u8Q",
    "matched-string" : "livsmedelshygien",
    "annotation-id" : 5
  }, {
    "preferred-label" : "Deltid",
    "type" : "worktime-extent",
    "start-position" : 2859,
    "end-position" : 2873,
    "concept-id" : "947z_JGS_Uk2",
    "matched-string" : "halvtidstjänst",
    "annotation-id" : 15
  }, {
    "preferred-label" : "Lokalvård",
    "sentiment" : "MUST_HAVE",
    "type" : "keyword",
    "start-position" : 3111,
    "end-position" : 3120,
    "concept-id" : "dpoa_kdf_VRa",
    "matched-string" : "lokalvård",
    "annotation-id" : 6
  }, {
    "preferred-label" : "Pedagogiskt arbete",
    "sentiment" : "MUST_HAVE",
    "type" : "keyword",
    "start-position" : 3150,
    "end-position" : 3168,
    "concept-id" : "NXqi_A8a_X1b",
    "matched-string" : "pedagogiskt arbete",
    "annotation-id" : 7
  }, {
    "preferred-label" : "Pedagogiskt arbete",
    "sentiment" : "MUST_HAVE",
    "type" : "keyword",
    "start-position" : 3231,
    "end-position" : 3249,
    "concept-id" : "NXqi_A8a_X1b",
    "matched-string" : "pedagogiskt arbete",
    "annotation-id" : 8
  }, {
    "preferred-label" : "Barnskötarutbildning",
    "sentiment" : "MUST_HAVE",
    "type" : "keyword",
    "start-position" : 3272,
    "end-position" : 3292,
    "concept-id" : "zQSz_T95_Pmu",
    "matched-string" : "barnskötarutbildning",
    "annotation-id" : 9
  } ],
  "text" : "Köksbiträde till Familjehuset i Lund\nVoB (Vård och Behandling) är ett kommunägt bolag som drivs på samhällsnyttig grund utan vinstsyfte. VoB erbjuder goda utvecklings- och karriärmöjligheter för dig som vill satsa i ett kreativt sammanhang med korta beslutsvägar. Arbetsklimatet i VoB präglas av engagemang, öppenhet och prestigelöshet. Som medarbetare ges du stort utrymme att ta eget ansvar och du har stor frihet att lösa ditt uppdrag på det sätt som du tycker är bäst. Du erbjuds kontinuerlig kompetensutveckling och subventionerad friskvård. \n\nFamiljehuset är ett akut, utrednings- och behandlingshem för barn och familjer, i verksamheten finns två familjeavdelningar. \nDen ena avdelningen tar emot familjer med barn i åldern 0-3 år och äldre syskon kan finnas med i placeringen. Den andra avdelningen tar emot familjer med spädbarn och fokus ligger på barnets tidiga anknytning. Avdelningen tar även emot gravida kvinnor några veckor före beräknad förlossning.\n\nVi söker nu en serviceinriktad medarbetare med ansvar för olika delar inom kök och matlagning och som trivs att arbeta nära barn och vara en av barnens förebilder.\nVerksamheten som i nuläget ligger i Hörby kommer under den senare delen av hösten att flytta till nya lokaler i Lund. Stora möjligheter att påverka utformningen av tjänsten finns i samband med flytten till nya lokaler.\r\n\r\nARBETSUPPGIFTER\nI tjänsten ingår att ta emot mat som levereras färdig för lunch och vara behjälplig med dukning och vid servering. Du kommer också att förbereda kvällsmat för dagen samt vid veckoslut även kvällsmål för helgen. \n\nViss tvätt och städning av kök och matsal ingår liksom att planera matsedel.  Varje vecka görs matbeställningar och du tar då även hand om dessa inköp med tex uppackning av varor mm.\n\nI arbetsuppgifterna ingår även att handleda familjerna i köket samt att vara rollmodell vid de möjligheter till socialt samspel som arbete i köket kan ge. Till exempel genom enklare bakning och planering av firande vid lov och högtidsdagar. \r\n\r\nKVALIFIKATIONER\nDu som söker tjänsten är serviceinriktad, engagerad, stresstålig och prestigelös och tycker att arbetsuppgifterna och verksamhetens uppdrag motsvarar dina förväntningar.\nFör dig är det självklart att förena struktur och flexibilitet i det dagliga arbete.  \nVidare är du  självständig och självgående, tar ansvar för dina uppgifter vilket bl a innebär att du planerar, organiserar och prioriterar arbetet på ett effektivt sätt.\n\nDu har någon form av köksutbildning som te x kallskänka, köksbiträde eller annan utbildning samt praktisk erfarenhet av matlagning och övrigt köksarbete. \nDet är en merit om du arbetat på arbetsplatser inom det sociala området och med människor i behov av extra stöd\nDu är kvalitetsmedveten och det är positivt om du därmed har erfarenhet av egenkontroll och livsmedelshygien.\nBefattningen motsvarar en halvtidstjänst. Utöver detta finns möjlighet till utökning av tjänstgöringsgrad och ytterligare arbetsuppgifter beroende på din erfarenhet, personliga förmågor, intresse och utbildning. \nTjänsten kan med fördel kompletteras med till exempel ansvar för lokalvård av gemensamma utrymmen eller pedagogiskt arbete med barnen på boendet.\n\nFör utökning av tjänstgöringsgrad med pedagogiskt arbete med barnen krävs även barnskötarutbildning eller motsvarande liksom erfarenhet av arbete med barn.\r\n\nÖVRIGT\nEn förutsättning för anställning är att du avstår från att röka under arbetstid.\nVoB tillämpar vård omsorg - HÖK/AB \nUrval sker löpande."
}