{
  "meta" : {
    "dataset-id" : "myh-spreadsheet-2021",
    "type" : "education-description",
    "dataset-document-id" : "YH01522",
    "user" : "kristof.fischer"
  },
  "sha1" : "f005dfcfc7b5f7fb01cfd080615ab81eb8879a5c",
  "annotations" : [ {
    "preferred-label" : "produktionstekniker",
    "sentiment" : "OFFERED",
    "type" : "esco-occupation",
    "start-position" : 159,
    "end-position" : 178,
    "concept-id" : "A9i8_BAH_H1M",
    "matched-string" : "produktionstekniker",
    "annotation-id" : 12
  }, {
    "preferred-label" : "Ständiga förbättringar/Lean",
    "sentiment" : "OFFERED",
    "type" : "skill",
    "start-position" : 198,
    "end-position" : 202,
    "concept-id" : "74Mw_JUN_VKx",
    "matched-string" : "lean",
    "annotation-id" : 0
  }, {
    "preferred-label" : "Ständiga förbättringar/Lean",
    "sentiment" : "OFFERED",
    "type" : "skill",
    "start-position" : 203,
    "end-position" : 225,
    "concept-id" : "74Mw_JUN_VKx",
    "matched-string" : "ständiga förbättringar",
    "annotation-id" : 1
  }, {
    "preferred-label" : "3D-printning",
    "sentiment" : "OFFERED",
    "type" : "skill",
    "start-position" : 417,
    "end-position" : 428,
    "concept-id" : "XCdg_UJK_w2q",
    "matched-string" : "3D-printing",
    "annotation-id" : 13
  }, {
    "preferred-label" : "Robotteknik",
    "sentiment" : "OFFERED",
    "type" : "skill",
    "start-position" : 431,
    "end-position" : 443,
    "concept-id" : "XUVf_RZ8_97a",
    "matched-string" : "robotisering",
    "annotation-id" : 14
  }, {
    "preferred-label" : null,
    "sentiment" : "OFFERED",
    "type" : "skill",
    "start-position" : 445,
    "end-position" : 459,
    "concept-id" : null,
    "matched-string" : "digitalisering",
    "annotation-id" : 15
  }, {
    "preferred-label" : "Artificial Intelligence/Artificiell intelligens/AI",
    "sentiment" : "OFFERED",
    "type" : "skill",
    "start-position" : 464,
    "end-position" : 487,
    "concept-id" : "SaTd_K5z_ex1",
    "matched-string" : "artificiell intelligens",
    "annotation-id" : 16
  }, {
    "preferred-label" : "cirkulär ekonomi",
    "sentiment" : "OFFERED",
    "type" : "esco-skill",
    "start-position" : 489,
    "end-position" : 505,
    "concept-id" : "USnm_nT7_jqG",
    "matched-string" : "cirkulär ekonomi",
    "annotation-id" : 17
  }, {
    "preferred-label" : "Hållbarhetsutveckling",
    "sentiment" : "OFFERED",
    "type" : "skill",
    "start-position" : 510,
    "end-position" : 528,
    "concept-id" : "uGaX_6vC_5Tq",
    "matched-string" : "hållbar produktion",
    "annotation-id" : 18
  }, {
    "preferred-label" : "Ständiga förbättringar/Lean",
    "sentiment" : "OFFERED",
    "type" : "skill",
    "start-position" : 949,
    "end-position" : 953,
    "concept-id" : "74Mw_JUN_VKx",
    "matched-string" : "lean",
    "annotation-id" : 5
  }, {
    "preferred-label" : "Ständiga förbättringar/Lean",
    "sentiment" : "OFFERED",
    "type" : "skill",
    "start-position" : 954,
    "end-position" : 976,
    "concept-id" : "74Mw_JUN_VKx",
    "matched-string" : "ständiga förbättringar",
    "annotation-id" : 6
  }, {
    "preferred-label" : "produktionstekniker",
    "sentiment" : "OFFERED",
    "type" : "esco-occupation",
    "start-position" : 1108,
    "end-position" : 1127,
    "concept-id" : "A9i8_BAH_H1M",
    "matched-string" : "produktionstekniker",
    "annotation-id" : 19
  }, {
    "preferred-label" : "kvalitetstekniker",
    "sentiment" : "OFFERED",
    "type" : "esco-occupation",
    "start-position" : 1143,
    "end-position" : 1160,
    "concept-id" : "ew7i_cMD_8eg",
    "matched-string" : "kvalitetstekniker",
    "annotation-id" : 20
  }, {
    "preferred-label" : null,
    "sentiment" : "OFFERED",
    "type" : "occupation-name",
    "start-position" : 1176,
    "comment" : "finns bara som keyword",
    "end-position" : 1192,
    "concept-id" : null,
    "matched-string" : "Lean-koordinator",
    "annotation-id" : 21
  }, {
    "preferred-label" : "Produktionsplanerare, tillverkningsindustri",
    "sentiment" : "OFFERED",
    "type" : "occupation-name",
    "start-position" : 1199,
    "end-position" : 1219,
    "concept-id" : "zmTy_qPb_e9e",
    "matched-string" : "produktionsplanerare",
    "annotation-id" : 22
  }, {
    "preferred-label" : "produktionstekniker",
    "sentiment" : "OFFERED",
    "type" : "esco-occupation",
    "start-position" : 1274,
    "end-position" : 1293,
    "concept-id" : "A9i8_BAH_H1M",
    "matched-string" : "produktionstekniker",
    "annotation-id" : 23
  }, {
    "preferred-label" : "Ständiga förbättringar/Lean",
    "sentiment" : "OFFERED",
    "type" : "skill",
    "start-position" : 1313,
    "end-position" : 1317,
    "concept-id" : "74Mw_JUN_VKx",
    "matched-string" : "lean",
    "annotation-id" : 9
  }, {
    "preferred-label" : "Ständiga förbättringar/Lean",
    "sentiment" : "OFFERED",
    "type" : "skill",
    "start-position" : 1318,
    "end-position" : 1340,
    "concept-id" : "74Mw_JUN_VKx",
    "matched-string" : "ständiga förbättringar",
    "annotation-id" : 10
  }, {
    "preferred-label" : "Eslöv",
    "sentiment" : "NOT_RELEVANT",
    "type" : "municipality",
    "start-position" : 1729,
    "end-position" : 1734,
    "concept-id" : "gfCw_egj_1M4",
    "matched-string" : "Eslöv",
    "annotation-id" : 24
  }, {
    "preferred-label" : "Deltid",
    "sentiment" : "NOT_RELEVANT",
    "type" : "worktime-extent",
    "start-position" : 1911,
    "end-position" : 1925,
    "concept-id" : "947z_JGS_Uk2",
    "matched-string" : "75% studietakt",
    "annotation-id" : 25
  }, {
    "preferred-label" : "Distansarbete",
    "sentiment" : "OFFERED",
    "type" : "work-place-environment",
    "start-position" : 1953,
    "end-position" : 1967,
    "concept-id" : "uwzb_xcR_vxS",
    "matched-string" : "distansstudier",
    "annotation-id" : 26
  }, {
    "preferred-label" : "Eslöv",
    "sentiment" : "NOT_RELEVANT",
    "type" : "municipality",
    "start-position" : 2001,
    "end-position" : 2006,
    "concept-id" : "gfCw_egj_1M4",
    "matched-string" : "Eslöv",
    "annotation-id" : 27
  } ],
  "text" : "Utbildningens mål  Utbildningen syftar till att ge dig som studerande de teoretiska och praktiska kunskaper och färdigheter som krävs för att kunna arbeta som produktionstekniker med inriktning mot Lean/Ständiga förbättringar.     I utbildningen kombineras ett traditionellt produktionstekniskt tänkande kring ständiga   förbättringar med kunskaper inom nya produktionstekniska områden såsom additiv till-  verkning (3D-printing), robotisering, digitalisering och artificiell intelligens, cirkulär ekonomi och hållbar produktion – för att nämna några teman.     Den studerande får en bred utbildning som ger dig som studerande möjlighet att verka i en rad olika branscher. Studerande som har gått en föregångare till den nu aktuellutbildningen kom bland annat från Orkla, Securit, Tetra, Hilding Anders, Alfdex, Haldex och Atlas Copco.     Efter avslutad utbildning förändrades i de flesta fall de studerandes arbetsuppgifter på ett sådant sätt att Lean/Ständiga förbättringar kom att bli en viktig del i deras arbetsinnehåll.    Efter utbildningen  Efter genomgången utbildning kan de studerande arbeta som produktionstekniker (maskin 3114), kvalitetstekniker (maskin 3114), Lean-koordinator eller produktionsplanerare/-beredare (maskin 3114).    Arbetsmarknad  Behovet av produktionstekniker med kompetens inom Lean/ständiga förbättringar påverkas bland annat av de teknikskiften inom industrin, som drivs av teknisk utveckling i kombination med accelererande medvetenhet om betydelsen av hållbar och effektiv produktion.  Därmed ökar efterfrågan på medarbetare med bred kunskap såväl om traditionell produktion som nya produktionssätt och produktionsmetoder.     Arbetsmarknaden såg god ut före pandemin, och Yrkeshögskolan i Eslöv undersöker kontinuerligt, i samverkan med ett aktivt arbetsliv, hur arbetslivets behov ser ut.     Utbildningens studieform och omfattning  Utbildningen bedrivs på distans med 75% studietakt. Undervisningen baseras på distansstudier kombinerat med ca fyra träffar i Eslöv per termin.  "
}