{
  "meta" : {
    "jobad" : {
      "description" : {
        "requirements" : null,
        "needs" : null,
        "company_information" : null,
        "text_formatted" : "<p>Är du intresserad av nytt jobbuppdrag? I skrivande stund söker vi dig som är specialistsjuksköterska för uppdrag i Sunderby.</p><p><strong>Om uppdraget:</strong><br>Tjänsten är på visstid och omfattar arbete på en infektionsavdelning med 12 vårdplatser. På avdelningar vårdas patienter med olika infektionssjukdomar. Möjlighet finns till arbete på heltid!</p><p><strong>Kvalifikationer</strong><br>Vi söker dig som är specialistsjuksköterska. Tidigare erfarenhet av infektionssjukvård samt vana av journalsystem VAS och/ eller Life Care är meriterande.</p><p><strong>Arbetsuppgifter:</strong><br>Sedvanliga sjuksköterskeuppgifter på infektionsavdelning.</p><p><strong>Personliga egenskaper:</strong><br>Du är en engagerad och positiv kollega som bidrar till en bra arbetsmiljö. Du är flexibel, ansvarsfull och ha god förmåga att arbeta såväl självständigt som tillsammans med andra. För att lyckas i rollen ser vi också att du som person är ödmjuk, prestigelös, lyhörd och trygg i dig själv. Du är också en social person som har goda kunskaper i det svenska språket, tilltalas av utmaningar och nya utvecklingsmöjligheter. </p><p><strong>Vi erbjuder dig:</strong><br>Din egen personliga konsultchef<br>Karriär- och utvecklingsmöjligheter<br>Friskvårdsbidrag<br>Mingelträffar med andra sjuksköterskor<br>Bra betalt och fördelaktiga förmånspaket<br>Stort utrymme och frihet att styra över din tillvaro, bland annat flexibel schemaläggning</p><p><strong>Om Almia - </strong><strong>Familjära, engagerade, professionella:</strong><br>Almia är ett litet, personligt och familjärt bolag som förmedlar vårdjobb över hela Sverige, allt från enstaka arbetspass till uppdrag som sträcker sig över flera år framåt. Vi har ett starkt engagemang för våra anställda och vet att trivsel på arbetsplatsen är en nyckelfaktor för bra resultat. Därför bryr vi oss lite extra om hur du mår och trivs. Hos oss på Almia får du ta del av en kultur med högt i tak där kvalitet och långsiktighet är ledorden i alla våra åtaganden och där varje anställd är unik och får högsta prioritet från oss i form av engagemang, tillhörighet och tillgänglighet. Vi ger dig helt enkelt alla förutsättningar du behöver för att ta hand om andra. </p><p><strong>Sista svarsdag:</strong><br>2022-08-24- Urval görs löpande så tjänsten kan tillsättas innan sista svarsdag. </p><p><a href=\"https://almiabemanning.se/\">https://almiabemanning.se/</a></p>",
        "conditions" : null,
        "text" : "Är du intresserad av nytt jobbuppdrag? I skrivande stund söker vi dig som är specialistsjuksköterska för uppdrag i Sunderby.\nOm uppdraget:\nTjänsten är på visstid och omfattar arbete på en infektionsavdelning med 12 vårdplatser. På avdelningar vårdas patienter med olika infektionssjukdomar. Möjlighet finns till arbete på heltid!\nKvalifikationer\nVi söker dig som är specialistsjuksköterska. Tidigare erfarenhet av infektionssjukvård samt vana av journalsystem VAS och/ eller Life Care är meriterande.\nArbetsuppgifter:\nSedvanliga sjuksköterskeuppgifter på infektionsavdelning.\nPersonliga egenskaper:\nDu är en engagerad och positiv kollega som bidrar till en bra arbetsmiljö. Du är flexibel, ansvarsfull och ha god förmåga att arbeta såväl självständigt som tillsammans med andra. För att lyckas i rollen ser vi också att du som person är ödmjuk, prestigelös, lyhörd och trygg i dig själv. Du är också en social person som har goda kunskaper i det svenska språket, tilltalas av utmaningar och nya utvecklingsmöjligheter. \nVi erbjuder dig:\nDin egen personliga konsultchef\nKarriär- och utvecklingsmöjligheter\nFriskvårdsbidrag\nMingelträffar med andra sjuksköterskor\nBra betalt och fördelaktiga förmånspaket\nStort utrymme och frihet att styra över din tillvaro, bland annat flexibel schemaläggning\nOm Almia - Familjära, engagerade, professionella:\nAlmia är ett litet, personligt och familjärt bolag som förmedlar vårdjobb över hela Sverige, allt från enstaka arbetspass till uppdrag som sträcker sig över flera år framåt. Vi har ett starkt engagemang för våra anställda och vet att trivsel på arbetsplatsen är en nyckelfaktor för bra resultat. Därför bryr vi oss lite extra om hur du mår och trivs. Hos oss på Almia får du ta del av en kultur med högt i tak där kvalitet och långsiktighet är ledorden i alla våra åtaganden och där varje anställd är unik och får högsta prioritet från oss i form av engagemang, tillhörighet och tillgänglighet. Vi ger dig helt enkelt alla förutsättningar du behöver för att ta hand om andra. \nSista svarsdag:\n2022-08-24- Urval görs löpande så tjänsten kan tillsättas innan sista svarsdag. \nhttps://almiabemanning.se/"
      },
      "headline" : "Almia söker specialistsjuksköterska till infektionsavdelningen i Sunderby",
      "driving_license" : null,
      "employer" : {
        "email" : null,
        "phone_number" : null,
        "organization_number" : "5590584610",
        "name" : "Almia AB",
        "url" : null,
        "workplace" : "Almia Vårdbemanning"
      },
      "removed_date" : null,
      "logo_url" : "https://www.arbetsformedlingen.se/rest/arbetsgivare/rest/af/v3/organisation/5590584610/logotyper/logo.png",
      "last_publication_date" : "2022-08-24T23:59:59",
      "number_of_vacancies" : 1,
      "occupation" : {
        "concept_id" : "bXNH_MNX_dUR",
        "label" : "Sjuksköterska, grundutbildad",
        "legacy_ams_taxonomy_id" : "7296"
      },
      "occupation_group" : {
        "concept_id" : "Z8ci_bBE_tmx",
        "label" : "Grundutbildade sjuksköterskor",
        "legacy_ams_taxonomy_id" : "2221"
      },
      "employment_type" : {
        "concept_id" : "PFZr_Syz_cUq",
        "label" : "Vanlig anställning",
        "legacy_ams_taxonomy_id" : "1"
      },
      "webpage_url" : "https://arbetsformedlingen.se/platsbanken/annonser/26395750",
      "driving_license_required" : false,
      "application_contacts" : [ {
        "description" : "Amanda Ekendahl",
        "email" : "Amanda.e@almiabemanning.se",
        "telephone" : null,
        "name" : null,
        "contact_type" : null
      } ],
      "duration" : {
        "concept_id" : "a7uU_j21_mkL",
        "label" : "Tills vidare",
        "legacy_ams_taxonomy_id" : "1"
      },
      "nice_to_have" : {
        "education_level" : [ ],
        "work_experiences" : [ ],
        "skills" : [ ],
        "education" : [ ],
        "languages" : [ ]
      },
      "application_details" : {
        "via_af" : false,
        "email" : null,
        "other" : null,
        "reference" : null,
        "url" : "https://apply.recman.no/job_post.php?id=287782&path=ams&sub_id=615",
        "information" : null
      },
      "source_type" : "VIA_PLATSBANKEN_DXA",
      "application_deadline" : "2022-08-24T23:59:59",
      "external_id" : "46-559058-4610-28778262f38385a1dbc",
      "workplace_address" : {
        "coordinates" : [ 22.156702, 65.584816 ],
        "city" : null,
        "postcode" : null,
        "municipality" : "Luleå",
        "region_concept_id" : "9hXe_F4g_eTG",
        "region" : "Norrbottens län",
        "country_code" : "199",
        "region_code" : "25",
        "municipality_concept_id" : "CXbY_gui_14v",
        "country_concept_id" : "i46j_HmG_v64",
        "municipality_code" : "2580",
        "street_address" : null,
        "country" : "Sverige"
      },
      "id" : "26395750",
      "experience_required" : true,
      "working_hours_type" : {
        "concept_id" : "6YE1_gAC_R2G",
        "label" : "Heltid",
        "legacy_ams_taxonomy_id" : "1"
      },
      "access" : null,
      "timestamp" : 1660126093687,
      "must_have" : {
        "education_level" : [ ],
        "work_experiences" : [ {
          "concept_id" : "bXNH_MNX_dUR",
          "weight" : 10,
          "label" : "Sjuksköterska, grundutbildad",
          "legacy_ams_taxonomy_id" : "7296"
        } ],
        "skills" : [ ],
        "education" : [ ],
        "languages" : [ ]
      },
      "occupation_field" : {
        "concept_id" : "NYW6_mP6_vwf",
        "label" : "Hälso- och sjukvård",
        "legacy_ams_taxonomy_id" : "8"
      },
      "scope_of_work" : {
        "min" : 100,
        "max" : 100
      },
      "salary_type" : {
        "concept_id" : "oG8G_9cW_nRf",
        "label" : "Fast månads- vecko- eller timlön",
        "legacy_ams_taxonomy_id" : "1"
      },
      "removed" : false,
      "salary_description" : null,
      "access_to_own_car" : false,
      "publication_date" : "2022-08-10T12:08:13"
    },
    "name" : "Almia söker specialistsjuksköterska till infektionsavdelningen i Sunderby",
    "user" : "hannes"
  },
  "sha1" : "ec59ec07a60a333cd2643687dbd95304498287ac",
  "annotations" : [ {
    "preferred-label" : "Specialistsjuksköterskeutbildning, infektionssjukvård",
    "sentiment" : "MUST_HAVE",
    "type" : "keyword",
    "start-position" : 12,
    "end-position" : 35,
    "concept-id" : "1dUg_Jaj_yvZ",
    "matched-string" : "specialistsjuksköterska",
    "annotation-id" : 5
  }, {
    "preferred-label" : "Specialistsjuksköterskeutbildning, infektionssjukvård",
    "sentiment" : "MUST_HAVE",
    "type" : "keyword",
    "start-position" : 151,
    "end-position" : 175,
    "concept-id" : "1dUg_Jaj_yvZ",
    "matched-string" : "specialistsjuksköterska ",
    "annotation-id" : 6
  }, {
    "preferred-label" : "Allmän visstidsanställning",
    "sentiment" : "MUST_HAVE",
    "type" : "keyword",
    "start-position" : 228,
    "end-position" : 235,
    "concept-id" : "hxfz_ayC_9Vd",
    "matched-string" : "visstid",
    "annotation-id" : 7
  }, {
    "preferred-label" : "Infektionssjukdomar",
    "sentiment" : "MUST_HAVE",
    "type" : "skill",
    "start-position" : 344,
    "end-position" : 363,
    "concept-id" : "1FrM_h3A_mLq",
    "matched-string" : "infektionssjukdomar",
    "annotation-id" : 0
  }, {
    "preferred-label" : "Heltid",
    "type" : "worktime-extent",
    "start-position" : 396,
    "end-position" : 402,
    "concept-id" : "6YE1_gAC_R2G",
    "matched-string" : "heltid",
    "annotation-id" : 8
  }, {
    "preferred-label" : "Specialistsjuksköterskeutbildning, infektionssjukvård",
    "sentiment" : "MUST_HAVE",
    "type" : "keyword",
    "start-position" : 440,
    "end-position" : 463,
    "concept-id" : "1dUg_Jaj_yvZ",
    "matched-string" : "specialistsjuksköterska",
    "annotation-id" : 9
  }, {
    "preferred-label" : "Infektionssjukvård",
    "sentiment" : "MUST_HAVE",
    "type" : "skill",
    "start-position" : 488,
    "end-position" : 506,
    "concept-id" : "bsQx_dCg_52v",
    "matched-string" : "infektionssjukvård",
    "annotation-id" : 1
  }, {
    "preferred-label" : "Specialistsjuksköterskeutbildning, infektionssjukvård",
    "type" : "keyword",
    "start-position" : 603,
    "end-position" : 648,
    "concept-id" : "1dUg_Jaj_yvZ",
    "matched-string" : "sjuksköterskeuppgifter på infektionsavdelning",
    "annotation-id" : 10
  }, {
    "preferred-label" : "arbetsmiljö",
    "sentiment" : "MUST_HAVE",
    "type" : "esco-skill",
    "start-position" : 735,
    "end-position" : 746,
    "concept-id" : "zdQY_QJh_nUH",
    "matched-string" : "arbetsmiljö",
    "annotation-id" : 2
  }, {
    "preferred-label" : "visa ansvarstagande",
    "type" : "esco-skill",
    "start-position" : 764,
    "end-position" : 775,
    "concept-id" : "bcRp_hxV_f5G",
    "matched-string" : "ansvarsfull",
    "annotation-id" : 11
  }, {
    "preferred-label" : "arbeta självständigt",
    "type" : "esco-skill",
    "start-position" : 799,
    "end-position" : 805,
    "concept-id" : "NyFu_HHd_zhz",
    "matched-string" : "arbeta",
    "annotation-id" : 13
  }, {
    "preferred-label" : "arbeta självständigt",
    "type" : "esco-skill",
    "start-position" : 812,
    "end-position" : 825,
    "concept-id" : "NyFu_HHd_zhz",
    "matched-string" : "självständigt",
    "annotation-id" : 12
  }, {
    "preferred-label" : "Svenska",
    "sentiment" : "MUST_HAVE",
    "type" : "language",
    "start-position" : 1020,
    "end-position" : 1035,
    "concept-id" : "zSLA_vw2_FXN",
    "matched-string" : "svenska språket",
    "annotation-id" : 3
  }, {
    "preferred-label" : "Friskvård",
    "sentiment" : "MUST_HAVE",
    "type" : "keyword",
    "start-position" : 1179,
    "end-position" : 1195,
    "concept-id" : "yoHe_xjK_qjH",
    "matched-string" : "Friskvårdsbidrag",
    "annotation-id" : 14
  }, {
    "preferred-label" : "Sjuksköterskor",
    "sentiment" : "MUST_HAVE",
    "type" : "ssyk-level-3",
    "start-position" : 1220,
    "end-position" : 1234,
    "concept-id" : "jzaN_Vqk_TP1",
    "matched-string" : "sjuksköterskor",
    "annotation-id" : 4
  }, {
    "preferred-label" : "Sverige",
    "type" : "country",
    "start-position" : 1500,
    "end-position" : 1507,
    "concept-id" : "i46j_HmG_v64",
    "matched-string" : "Sverige",
    "annotation-id" : 15
  } ],
  "text" : "Almia söker specialistsjuksköterska till infektionsavdelningen i Sunderby\nÄr du intresserad av nytt jobbuppdrag? I skrivande stund söker vi dig som är specialistsjuksköterska för uppdrag i Sunderby.\nOm uppdraget:\nTjänsten är på visstid och omfattar arbete på en infektionsavdelning med 12 vårdplatser. På avdelningar vårdas patienter med olika infektionssjukdomar. Möjlighet finns till arbete på heltid!\nKvalifikationer\nVi söker dig som är specialistsjuksköterska. Tidigare erfarenhet av infektionssjukvård samt vana av journalsystem VAS och/ eller Life Care är meriterande.\nArbetsuppgifter:\nSedvanliga sjuksköterskeuppgifter på infektionsavdelning.\nPersonliga egenskaper:\nDu är en engagerad och positiv kollega som bidrar till en bra arbetsmiljö. Du är flexibel, ansvarsfull och ha god förmåga att arbeta såväl självständigt som tillsammans med andra. För att lyckas i rollen ser vi också att du som person är ödmjuk, prestigelös, lyhörd och trygg i dig själv. Du är också en social person som har goda kunskaper i det svenska språket, tilltalas av utmaningar och nya utvecklingsmöjligheter. \nVi erbjuder dig:\nDin egen personliga konsultchef\nKarriär- och utvecklingsmöjligheter\nFriskvårdsbidrag\nMingelträffar med andra sjuksköterskor\nBra betalt och fördelaktiga förmånspaket\nStort utrymme och frihet att styra över din tillvaro, bland annat flexibel schemaläggning\nOm Almia - Familjära, engagerade, professionella:\nAlmia är ett litet, personligt och familjärt bolag som förmedlar vårdjobb över hela Sverige, allt från enstaka arbetspass till uppdrag som sträcker sig över flera år framåt. Vi har ett starkt engagemang för våra anställda och vet att trivsel på arbetsplatsen är en nyckelfaktor för bra resultat. Därför bryr vi oss lite extra om hur du mår och trivs. Hos oss på Almia får du ta del av en kultur med högt i tak där kvalitet och långsiktighet är ledorden i alla våra åtaganden och där varje anställd är unik och får högsta prioritet från oss i form av engagemang, tillhörighet och tillgänglighet. Vi ger dig helt enkelt alla förutsättningar du behöver för att ta hand om andra. \nSista svarsdag:\n2022-08-24- Urval görs löpande så tjänsten kan tillsättas innan sista svarsdag. \nhttps://almiabemanning.se/"
}