{
  "meta" : {
    "dataset-id" : "myh-spreadsheet-2021",
    "type" : "education-desription",
    "dataset-document-id" : "YH00289",
    "user" : "kristof.fischer"
  },
  "sha1" : "43e05af03ddd57dc9d47c86784e5e8676bb8608d",
  "annotations" : [ {
    "preferred-label" : "Tandsköterska",
    "sentiment" : "OFFERED",
    "type" : "occupation-name",
    "start-position" : 38,
    "end-position" : 51,
    "concept-id" : "ckkD_JhH_Sc6",
    "matched-string" : "tandsköterska",
    "annotation-id" : 0
  }, {
    "preferred-label" : "Tandsköterska",
    "sentiment" : "OFFERED",
    "type" : "occupation-name",
    "start-position" : 133,
    "end-position" : 147,
    "concept-id" : "ckkD_JhH_Sc6",
    "matched-string" : "tandsköterskor",
    "annotation-id" : 1
  }, {
    "preferred-label" : "Tandsköterska",
    "sentiment" : "OFFERED",
    "type" : "occupation-name",
    "start-position" : 196,
    "end-position" : 209,
    "concept-id" : "ckkD_JhH_Sc6",
    "matched-string" : "tandsköterska",
    "annotation-id" : 2
  }, {
    "preferred-label" : "Tandsköterska",
    "sentiment" : "OFFERED",
    "type" : "occupation-name",
    "start-position" : 258,
    "end-position" : 271,
    "concept-id" : "ckkD_JhH_Sc6",
    "matched-string" : "tandsköterska",
    "annotation-id" : 3
  }, {
    "preferred-label" : "Tandläkare",
    "type" : "occupation-name",
    "start-position" : 315,
    "end-position" : 325,
    "concept-id" : "TdvW_S8R_CFH",
    "matched-string" : "tandläkare",
    "annotation-id" : 19
  }, {
    "preferred-label" : "Tandhygienist",
    "type" : "occupation-name",
    "start-position" : 327,
    "end-position" : 340,
    "concept-id" : "TPRY_Wze_q6x",
    "matched-string" : "tandhygienist",
    "annotation-id" : 20
  }, {
    "preferred-label" : "Tandtekniker",
    "type" : "occupation-name",
    "start-position" : 345,
    "end-position" : 357,
    "concept-id" : "9fEz_9ji_74Y",
    "matched-string" : "tandtekniker",
    "annotation-id" : 21
  }, {
    "preferred-label" : "Tandsköterska",
    "sentiment" : "OFFERED",
    "type" : "occupation-name",
    "start-position" : 464,
    "end-position" : 478,
    "concept-id" : "ckkD_JhH_Sc6",
    "matched-string" : "Tandsköterskor",
    "annotation-id" : 22
  }, {
    "preferred-label" : "Tandsköterska",
    "sentiment" : "OFFERED",
    "type" : "occupation-name",
    "start-position" : 554,
    "end-position" : 567,
    "concept-id" : "ckkD_JhH_Sc6",
    "matched-string" : "tandsköterska",
    "annotation-id" : 8
  }, {
    "preferred-label" : "Tandsköterska",
    "sentiment" : "OFFERED",
    "type" : "occupation-name",
    "start-position" : 789,
    "end-position" : 802,
    "concept-id" : "ckkD_JhH_Sc6",
    "matched-string" : "tandsköterska",
    "annotation-id" : 10
  }, {
    "preferred-label" : "interagera med patienter",
    "sentiment" : "OFFERED",
    "type" : "esco-skill",
    "start-position" : 832,
    "end-position" : 855,
    "concept-id" : "EXXv_J8z_8hM",
    "matched-string" : "kontakter med patienter",
    "annotation-id" : 23
  }, {
    "preferred-label" : "Tandsköterska",
    "sentiment" : "OFFERED",
    "type" : "occupation-name",
    "start-position" : 949,
    "end-position" : 962,
    "concept-id" : "ckkD_JhH_Sc6",
    "matched-string" : "tandsköterska",
    "annotation-id" : 11
  }, {
    "preferred-label" : "Tandläkare",
    "type" : "occupation-name",
    "start-position" : 1093,
    "end-position" : 1103,
    "concept-id" : "TdvW_S8R_CFH",
    "matched-string" : "Tandläkare",
    "annotation-id" : 24
  }, {
    "preferred-label" : "Tandsköterska",
    "sentiment" : "OFFERED",
    "type" : "occupation-name",
    "start-position" : 1137,
    "end-position" : 1151,
    "concept-id" : "ckkD_JhH_Sc6",
    "matched-string" : "tandsköterskan",
    "annotation-id" : 25
  }, {
    "preferred-label" : "lägga lokalbedövning vid tandvårdsbehandling",
    "sentiment" : "OFFERED",
    "type" : "esco-skill",
    "start-position" : 1166,
    "end-position" : 1183,
    "concept-id" : "HNod_siU_Jgc",
    "matched-string" : "ge lokalbedövning",
    "annotation-id" : 26
  }, {
    "preferred-label" : "ta röntgenbilder",
    "sentiment" : "OFFERED",
    "type" : "esco-skill",
    "start-position" : 1185,
    "end-position" : 1201,
    "concept-id" : "LW41_RM7_t4a",
    "matched-string" : "ta röntgenbilder",
    "annotation-id" : 27
  }, {
    "preferred-label" : null,
    "sentiment" : "OFFERED",
    "type" : "skill",
    "start-position" : 1206,
    "comment" : "inget passande koncept",
    "end-position" : 1229,
    "concept-id" : null,
    "matched-string" : "göra enklare fyllningar",
    "annotation-id" : 28
  }, {
    "preferred-label" : "personlig skyddsutrustning",
    "sentiment" : "MUST_HAVE",
    "type" : "esco-skill",
    "start-position" : 1488,
    "end-position" : 1510,
    "concept-id" : "hz7n_sNY_rV8",
    "matched-string" : "använda skyddshandskar",
    "annotation-id" : 29
  }, {
    "preferred-label" : "Tandsköterska",
    "sentiment" : "OFFERED",
    "type" : "occupation-name",
    "start-position" : 1880,
    "end-position" : 1894,
    "concept-id" : "ckkD_JhH_Sc6",
    "matched-string" : "tandsköterskor",
    "annotation-id" : 30
  }, {
    "preferred-label" : "Tandsköterska",
    "sentiment" : "OFFERED",
    "type" : "occupation-name",
    "start-position" : 2107,
    "end-position" : 2120,
    "concept-id" : "ckkD_JhH_Sc6",
    "matched-string" : "tandsköterska",
    "annotation-id" : 16
  }, {
    "preferred-label" : "Tandsköterska",
    "sentiment" : "OFFERED",
    "type" : "occupation-name",
    "start-position" : 2372,
    "end-position" : 2385,
    "concept-id" : "ckkD_JhH_Sc6",
    "matched-string" : "tandsköterska",
    "annotation-id" : 17
  } ],
  "text" : "  Sök vår populära YH-utbildning till tandsköterska, som har funnits i Solna sedan 2018 (tidigare SVOK).     Det råder stor brist på tandsköterskor i hela landet och för dig som utbildar dig till tandsköterska ser läget på arbetsmarknaden mycket bra ut. Som tandsköterska ingår du i tandvårdsteamet tillsammans med tandläkare, tandhygienist och tandtekniker. Arbetet är omväxlande och med kontinuerliga nya möten med människor i olika situationer och olika behov. Tandsköterskor kan arbeta både på offentliga och privata tandvårdskliniker.    Vad gör en tandsköterska?  I yrkesrollen ingår många olika arbetsuppgifter; från att ha egna patienter och ta röntgenbilder till mer traditionella uppgifter som att förbereda behandling, blanda material och sterilisera instrument. Att arbeta som tandsköterska är ett serviceyrke med många kontakter med patienter. Kontakten med människor är en stor del och det är viktigt att kunna inge förtroende.    Som tandsköterska arbetar du självständigt med munhygien och tandhälsoinformation, puts, tandhälsokontroller, avtryckstagning samt fluorbehandling. Tandläkare kan även delegera uppgifter till tandsköterskan, som t ex att ge lokalbedövning, ta röntgenbilder och göra enklare fyllningar. Allt detta lär du dig under utbildningen. Under utbildningen varvas föreläsningar med praktiskt arbete i dentalrum och Lärande i arbete, LIA.  När du arbetar inom vården måste du arbeta enligt socialstyrelsens föreskrifter. Det innebär bla att du ska kunna använda skyddshandskar och kortärmade arbetskläder.     LIA - LÄRANDE I ARBETE  Under totalt 16 veckor är studierna förlagda till en arbetsplats för Lärande i arbete, LIA. På din LIA-arbetsplats får du under handledning vidareutveckla dina kunskaper i verklig miljö och du utbildas i skarpt läge tillsammans med övrig personal och riktiga patienter.    EFTER EXAMEN  Efterfrågan på utbildade tandsköterskor är stor och väntas öka ytterligare de närmaste åren. Pensionsavgångarna bland de befintliga tandsköterskorna är stora och Sveriges befolkning växer, vilket gör att rekryteringsbehovet är stort. Detta ger dig som tandsköterska extra goda möjligheter att komma in på arbetsmarknaden.    SAMARBETE MED ARBETSLIVET  Vår utbildning är framtagen tillsammans med arbetslivet. Utbildningens innehåll är designat efter arbetslivets kompetenskrav, vilket gör dig eftertraktad som färdig tandsköterska. Bland arbetsgivarna som står bakom utbildningen finns Distriktstandvården, Praktikertjänst, Aqua Dental och Folktandvården.  "
}