{
  "meta" : {
    "jobad" : {
      "description" : {
        "requirements" : null,
        "needs" : null,
        "company_information" : null,
        "text_formatted" : "<p>Vi tror att du som söker tjänsten är kreativt lagd med fokus på gästupplevelse och service. Du ska vara van vid att arrangera happenings med olika partners för att locka både nya och gamla gäster.</p><p>Vi är övertygade om att du är uppdaterad på trender och smaker inom branschen och att du har ett brett kontaktnät för rekrytering och utveckling. Du ska vara en erfaren ledare som är van vid att leda andra och utveckla våra medarbetare.</p><p>I jobbet ingår även att administrera schema och kostnadsberäkningar. Låter det mindre upphetsande? Ingen fara! Du kommer att ha ett nära samarbete med kollegor som har svart bälte i detta. I ditt uppdrag ingår även att boka DJ:s vid behov. Du bör därför ha ett väl kontaktnät för detta.</p><p>Som person ser vi gärna att du är påläst, har lätt för att kommunicera samt jobba tillsammans i grupp. Du måste vara verbal och älska att umgås med människor!</p><p>Du ska vara stresstålig och initiativtagande. Dessutom måste du obehindrat kunna kommunicera både på svenska och på engelska. Naturligtvis är du en fena på smaker och att utveckla nya cocktails löpande med barteamet. Viktigast av allt är att du är öppen för alla slags gäster vi har på hotellet. Alla våra gäster oavsett varför de besöker oss - lokala gäster, showgäster, hotellgäster - är lika viktiga för oss!</p><p>Arbetstiderna är förlagda till både dagtid, kvällstid, veckodagar och helger, ungefär 70% i drift och 30% administration. Denna fördelning kan varieras efter säsong. Tjänsten är en heltidsanställning med start i augusti/september. Vi tillämpar sex månaders provanställning och självklart är vi anslutna till kollektivavtal!</p><p>Vi kan erbjuda en arbetsplats med många spännande gäster från hela världen! På helgerna är Rival extra välbesökt av Stockholmare och detta är en mycket viktig marknad för oss.</p><p> </p><p><strong>Är du den vi söker? Skicka din intresseanmälan med bifogad meritförteckning via Cheffle redan idag!</strong></p>",
        "conditions" : null,
        "text" : "Vi tror att du som söker tjänsten är kreativt lagd med fokus på gästupplevelse och service. Du ska vara van vid att arrangera happenings med olika partners för att locka både nya och gamla gäster.\nVi är övertygade om att du är uppdaterad på trender och smaker inom branschen och att du har ett brett kontaktnät för rekrytering och utveckling. Du ska vara en erfaren ledare som är van vid att leda andra och utveckla våra medarbetare.\nI jobbet ingår även att administrera schema och kostnadsberäkningar. Låter det mindre upphetsande? Ingen fara! Du kommer att ha ett nära samarbete med kollegor som har svart bälte i detta. I ditt uppdrag ingår även att boka DJ:s vid behov. Du bör därför ha ett väl kontaktnät för detta.\nSom person ser vi gärna att du är påläst, har lätt för att kommunicera samt jobba tillsammans i grupp. Du måste vara verbal och älska att umgås med människor!\nDu ska vara stresstålig och initiativtagande. Dessutom måste du obehindrat kunna kommunicera både på svenska och på engelska. Naturligtvis är du en fena på smaker och att utveckla nya cocktails löpande med barteamet. Viktigast av allt är att du är öppen för alla slags gäster vi har på hotellet. Alla våra gäster oavsett varför de besöker oss - lokala gäster, showgäster, hotellgäster - är lika viktiga för oss!\nArbetstiderna är förlagda till både dagtid, kvällstid, veckodagar och helger, ungefär 70% i drift och 30% administration. Denna fördelning kan varieras efter säsong. Tjänsten är en heltidsanställning med start i augusti/september. Vi tillämpar sex månaders provanställning och självklart är vi anslutna till kollektivavtal!\nVi kan erbjuda en arbetsplats med många spännande gäster från hela världen! På helgerna är Rival extra välbesökt av Stockholmare och detta är en mycket viktig marknad för oss.\n \nÄr du den vi söker? Skicka din intresseanmälan med bifogad meritförteckning via Cheffle redan idag!"
      },
      "headline" : "Hotel Rival söker målmedveten och erfaren barchef",
      "driving_license" : null,
      "employer" : {
        "email" : null,
        "phone_number" : null,
        "organization_number" : "5591395024",
        "name" : "Cheffle AB",
        "url" : "https://cheffle.se/l/Rrqgf1uHPDUg_go",
        "workplace" : "Hotell Rival"
      },
      "removed_date" : null,
      "logo_url" : "https://www.arbetsformedlingen.se/rest/arbetsgivare/rest/af/v3/arbetsplatser/86597009/logotyper/logo.png",
      "last_publication_date" : "2022-08-26T00:00:00",
      "number_of_vacancies" : 1,
      "occupation" : {
        "concept_id" : "Pppw_ySf_9m7",
        "label" : "Barchef",
        "legacy_ams_taxonomy_id" : "7339"
      },
      "occupation_group" : {
        "concept_id" : "XFXX_Jq9_Y2a",
        "label" : "Bartendrar",
        "legacy_ams_taxonomy_id" : "5132"
      },
      "employment_type" : {
        "concept_id" : "PFZr_Syz_cUq",
        "label" : "Vanlig anställning",
        "legacy_ams_taxonomy_id" : "1"
      },
      "webpage_url" : "https://arbetsformedlingen.se/platsbanken/annonser/26356183",
      "driving_license_required" : false,
      "application_contacts" : [ {
        "description" : null,
        "email" : "max@cheffle.se",
        "telephone" : null,
        "name" : "Max D",
        "contact_type" : null
      } ],
      "duration" : {
        "concept_id" : "a7uU_j21_mkL",
        "label" : "Tills vidare",
        "legacy_ams_taxonomy_id" : "1"
      },
      "nice_to_have" : {
        "education_level" : [ ],
        "work_experiences" : [ {
          "concept_id" : "Pppw_ySf_9m7",
          "weight" : 5,
          "label" : "Barchef",
          "legacy_ams_taxonomy_id" : "7339"
        } ],
        "skills" : [ {
          "concept_id" : "ZvbR_g69_jGv",
          "weight" : 5,
          "label" : "Cocktails/Drinkar",
          "legacy_ams_taxonomy_id" : "603385"
        } ],
        "education" : [ ],
        "languages" : [ ]
      },
      "application_details" : {
        "via_af" : false,
        "email" : null,
        "other" : null,
        "reference" : null,
        "url" : "https://cheffle.se/l/Rrqgf1uHPDUg_go",
        "information" : null
      },
      "source_type" : "VIA_ANNONSERA",
      "application_deadline" : "2022-08-26T00:00:00",
      "external_id" : null,
      "workplace_address" : {
        "coordinates" : [ 18.063649548356317, 59.31816734303028 ],
        "city" : "STOCKHOLM",
        "postcode" : "11848",
        "municipality" : "Stockholm",
        "region_concept_id" : "CifL_Rzy_Mku",
        "region" : "Stockholms län",
        "country_code" : "199",
        "region_code" : "01",
        "municipality_concept_id" : "AvNB_uwa_6n6",
        "country_concept_id" : "i46j_HmG_v64",
        "municipality_code" : "0180",
        "street_address" : "Mariatorget 3",
        "country" : "Sverige"
      },
      "id" : "26356183",
      "experience_required" : true,
      "working_hours_type" : {
        "concept_id" : "6YE1_gAC_R2G",
        "label" : "Heltid",
        "legacy_ams_taxonomy_id" : "1"
      },
      "access" : null,
      "timestamp" : 1658902675270,
      "must_have" : {
        "education_level" : [ ],
        "work_experiences" : [ ],
        "skills" : [ ],
        "education" : [ ],
        "languages" : [ {
          "concept_id" : "zSLA_vw2_FXN",
          "weight" : 10,
          "label" : "Svenska",
          "legacy_ams_taxonomy_id" : "502"
        }, {
          "concept_id" : "NVxJ_hLg_TYS",
          "weight" : 10,
          "label" : "Engelska",
          "legacy_ams_taxonomy_id" : "283"
        } ]
      },
      "occupation_field" : {
        "concept_id" : "ScKy_FHB_7wT",
        "label" : "Hotell, restaurang, storhushåll",
        "legacy_ams_taxonomy_id" : "7"
      },
      "scope_of_work" : {
        "min" : 0,
        "max" : 100
      },
      "salary_type" : {
        "concept_id" : "oG8G_9cW_nRf",
        "label" : "Fast månads- vecko- eller timlön",
        "legacy_ams_taxonomy_id" : "1"
      },
      "removed" : false,
      "salary_description" : null,
      "access_to_own_car" : false,
      "publication_date" : "2022-07-27T08:17:55"
    },
    "name" : "Hotel Rival söker målmedveten och erfaren barchef",
    "user" : "hannes"
  },
  "sha1" : "5a7a66e90d9136bd6a920b262153a1482612d54c",
  "annotations" : [ {
    "preferred-label" : "Barchef",
    "sentiment" : "MUST_HAVE",
    "type" : "occupation-name",
    "start-position" : 42,
    "end-position" : 49,
    "concept-id" : "Pppw_ySf_9m7",
    "matched-string" : "barchef",
    "annotation-id" : 0
  }, {
    "preferred-label" : "planera scheman",
    "type" : "esco-skill",
    "start-position" : 508,
    "end-position" : 527,
    "concept-id" : "Liq5_zFT_atX",
    "matched-string" : "administrera schema",
    "annotation-id" : 5
  }, {
    "preferred-label" : "samarbeta med kolleger",
    "type" : "esco-skill",
    "start-position" : 621,
    "end-position" : 643,
    "concept-id" : "X15R_797_q62",
    "matched-string" : "samarbete med kollegor",
    "annotation-id" : 6
  }, {
    "preferred-label" : "Svenska",
    "sentiment" : "MUST_HAVE",
    "type" : "language",
    "start-position" : 1031,
    "end-position" : 1038,
    "concept-id" : "zSLA_vw2_FXN",
    "matched-string" : "svenska",
    "annotation-id" : 1
  }, {
    "preferred-label" : "Engelska",
    "sentiment" : "MUST_HAVE",
    "type" : "language",
    "start-position" : 1046,
    "end-position" : 1054,
    "concept-id" : "NVxJ_hLg_TYS",
    "matched-string" : "engelska",
    "annotation-id" : 2
  }, {
    "preferred-label" : "Cocktails/Drinkar",
    "sentiment" : "MUST_HAVE",
    "type" : "skill",
    "start-position" : 1114,
    "end-position" : 1123,
    "concept-id" : "ZvbR_g69_jGv",
    "matched-string" : "cocktails",
    "annotation-id" : 3
  }, {
    "preferred-label" : "Heltid",
    "type" : "worktime-extent",
    "start-position" : 1523,
    "end-position" : 1541,
    "concept-id" : "6YE1_gAC_R2G",
    "matched-string" : "heltidsanställning",
    "annotation-id" : 7
  }, {
    "preferred-label" : "Kollektivavtal",
    "sentiment" : "MUST_HAVE",
    "type" : "skill",
    "start-position" : 1650,
    "end-position" : 1664,
    "concept-id" : "z7wE_9xb_3jX",
    "matched-string" : "kollektivavtal",
    "annotation-id" : 4
  } ],
  "text" : "Hotel Rival söker målmedveten och erfaren barchef\nVi tror att du som söker tjänsten är kreativt lagd med fokus på gästupplevelse och service. Du ska vara van vid att arrangera happenings med olika partners för att locka både nya och gamla gäster.\nVi är övertygade om att du är uppdaterad på trender och smaker inom branschen och att du har ett brett kontaktnät för rekrytering och utveckling. Du ska vara en erfaren ledare som är van vid att leda andra och utveckla våra medarbetare.\nI jobbet ingår även att administrera schema och kostnadsberäkningar. Låter det mindre upphetsande? Ingen fara! Du kommer att ha ett nära samarbete med kollegor som har svart bälte i detta. I ditt uppdrag ingår även att boka DJ:s vid behov. Du bör därför ha ett väl kontaktnät för detta.\nSom person ser vi gärna att du är påläst, har lätt för att kommunicera samt jobba tillsammans i grupp. Du måste vara verbal och älska att umgås med människor!\nDu ska vara stresstålig och initiativtagande. Dessutom måste du obehindrat kunna kommunicera både på svenska och på engelska. Naturligtvis är du en fena på smaker och att utveckla nya cocktails löpande med barteamet. Viktigast av allt är att du är öppen för alla slags gäster vi har på hotellet. Alla våra gäster oavsett varför de besöker oss - lokala gäster, showgäster, hotellgäster - är lika viktiga för oss!\nArbetstiderna är förlagda till både dagtid, kvällstid, veckodagar och helger, ungefär 70% i drift och 30% administration. Denna fördelning kan varieras efter säsong. Tjänsten är en heltidsanställning med start i augusti/september. Vi tillämpar sex månaders provanställning och självklart är vi anslutna till kollektivavtal!\nVi kan erbjuda en arbetsplats med många spännande gäster från hela världen! På helgerna är Rival extra välbesökt av Stockholmare och detta är en mycket viktig marknad för oss.\n \nÄr du den vi söker? Skicka din intresseanmälan med bifogad meritförteckning via Cheffle redan idag!"
}