{
  "meta" : {
    "jobad" : {
      "description" : {
        "requirements" : null,
        "needs" : null,
        "company_information" : null,
        "text_formatted" : "<p>Är du Entreprenör?</p><p>Vi erbjuder stora möjligheter för dig som vill driva eget och tjäna riktigt bra med pengar från start. Vi har ett färdigt affärskoncept och du är igång på 1-2 dagar.</p><p>Vi söker flera självständiga personer som låter seriösa och professionella på telefon och är hungrig på att tjäna stora pengar. Att du inte tar ett nej för ett nej och går den extra milen, det är essentiellt för att lyckas hos oss. Högt tempo och entusiasm är andra viktiga stickord för att uppnå succé!</p><p>Vi hjälper dig komma i gång med din egen verksamhet. Vi lär upp dig i vår beprövade metodik och coachar dig regelbundet så du får ut din potential. Det finns även möjligheter att klättra i bolaget och bli t. ex teamledare.</p><p>Konkret så bokar du möten till beslutsfattare i svenska bolag per telefon. Det kan vara allt från VDar, marknadschefer till produktspecialister, så viktigt att du låter professionell och seriös på telefon.</p><p>Du jobbar hos oss i centrala Stockholm, vi sitter i Hammarby Sjöstad. Är du självständig med självdisciplin så går det även kombinera med att jobba hemifrån.</p><p>Vi erbjuder mycket höga provisioner per genomförda möten. Du väljer själva om du vill fakturera ditt konsultarvode via egen firma/bolag eller via faktureringsbolag.</p><p>Startdatum är från augusti 2022 och arbetstiden är måndag till fredag 0800-1700.</p><p>Vi är ett bolag i Stockholm specialiserad på mötesbokning med mycket goda kundreferenser. Se vår hemsida: www.aceconsultinggroup.se</p><p>Kontakta oss för mer info på: ove@aceconsultinggroup.se</p><p><br></p>",
        "conditions" : null,
        "text" : "Är du Entreprenör?\nVi erbjuder stora möjligheter för dig som vill driva eget och tjäna riktigt bra med pengar från start. Vi har ett färdigt affärskoncept och du är igång på 1-2 dagar.\nVi söker flera självständiga personer som låter seriösa och professionella på telefon och är hungrig på att tjäna stora pengar. Att du inte tar ett nej för ett nej och går den extra milen, det är essentiellt för att lyckas hos oss. Högt tempo och entusiasm är andra viktiga stickord för att uppnå succé!\nVi hjälper dig komma i gång med din egen verksamhet. Vi lär upp dig i vår beprövade metodik och coachar dig regelbundet så du får ut din potential. Det finns även möjligheter att klättra i bolaget och bli t. ex teamledare.\nKonkret så bokar du möten till beslutsfattare i svenska bolag per telefon. Det kan vara allt från VDar, marknadschefer till produktspecialister, så viktigt att du låter professionell och seriös på telefon.\nDu jobbar hos oss i centrala Stockholm, vi sitter i Hammarby Sjöstad. Är du självständig med självdisciplin så går det även kombinera med att jobba hemifrån.\nVi erbjuder mycket höga provisioner per genomförda möten. Du väljer själva om du vill fakturera ditt konsultarvode via egen firma/bolag eller via faktureringsbolag.\nStartdatum är från augusti 2022 och arbetstiden är måndag till fredag 0800-1700.\nVi är ett bolag i Stockholm specialiserad på mötesbokning med mycket goda kundreferenser. Se vår hemsida: www.aceconsultinggroup.se\nKontakta oss för mer info på: ove@aceconsultinggroup.se"
      },
      "headline" : "Mötesbokare på telefon",
      "driving_license" : null,
      "employer" : {
        "email" : null,
        "phone_number" : null,
        "organization_number" : "5592122880",
        "name" : "ACE Consulting Group AB",
        "url" : "www.aceconsultinggroup.se",
        "workplace" : "ACE Consulting Group AB"
      },
      "removed_date" : null,
      "logo_url" : null,
      "last_publication_date" : "2022-09-02T00:00:00",
      "number_of_vacancies" : 2,
      "occupation" : {
        "concept_id" : "WZ2C_vH9_8ek",
        "label" : "Telefonförsäljare",
        "legacy_ams_taxonomy_id" : "7468"
      },
      "occupation_group" : {
        "concept_id" : "PxXc_16t_oZo",
        "label" : "Telefonförsäljare m.fl.",
        "legacy_ams_taxonomy_id" : "5242"
      },
      "employment_type" : {
        "concept_id" : "PFZr_Syz_cUq",
        "label" : "Vanlig anställning",
        "legacy_ams_taxonomy_id" : "1"
      },
      "webpage_url" : "https://arbetsformedlingen.se/platsbanken/annonser/26375322",
      "driving_license_required" : false,
      "application_contacts" : [ ],
      "duration" : {
        "concept_id" : "a7uU_j21_mkL",
        "label" : "Tills vidare",
        "legacy_ams_taxonomy_id" : "1"
      },
      "nice_to_have" : {
        "education_level" : [ ],
        "work_experiences" : [ ],
        "skills" : [ ],
        "education" : [ ],
        "languages" : [ ]
      },
      "application_details" : {
        "via_af" : false,
        "email" : "ove@aceconsultinggroup.se",
        "other" : null,
        "reference" : null,
        "url" : null,
        "information" : null
      },
      "source_type" : "VIA_ANNONSERA",
      "application_deadline" : "2022-09-02T00:00:00",
      "external_id" : null,
      "workplace_address" : {
        "coordinates" : [ 18.091820950206678, 59.30087378820218 ],
        "city" : "Stockholm",
        "postcode" : "12030",
        "municipality" : "Stockholm",
        "region_concept_id" : "CifL_Rzy_Mku",
        "region" : "Stockholms län",
        "country_code" : "199",
        "region_code" : "01",
        "municipality_concept_id" : "AvNB_uwa_6n6",
        "country_concept_id" : "i46j_HmG_v64",
        "municipality_code" : "0180",
        "street_address" : "Hammarby Fabriksväg 23",
        "country" : "Sverige"
      },
      "id" : "26375322",
      "experience_required" : true,
      "working_hours_type" : {
        "concept_id" : "6YE1_gAC_R2G",
        "label" : "Heltid",
        "legacy_ams_taxonomy_id" : "1"
      },
      "access" : null,
      "timestamp" : 1659529125265,
      "must_have" : {
        "education_level" : [ ],
        "work_experiences" : [ ],
        "skills" : [ ],
        "education" : [ ],
        "languages" : [ ]
      },
      "occupation_field" : {
        "concept_id" : "RPTn_bxG_ExZ",
        "label" : "Försäljning, inköp, marknadsföring",
        "legacy_ams_taxonomy_id" : "5"
      },
      "scope_of_work" : {
        "min" : 0,
        "max" : 100
      },
      "salary_type" : {
        "concept_id" : "vVtj_qm6_GQu",
        "label" : "Rörlig ackords- eller provisionslön",
        "legacy_ams_taxonomy_id" : "8"
      },
      "removed" : false,
      "salary_description" : null,
      "access_to_own_car" : false,
      "publication_date" : "2022-08-03T14:18:45"
    },
    "name" : "Mötesbokare på telefon",
    "user" : "hannes"
  },
  "sha1" : "2332793eb21259dd3b0f13eced6a326bddde5ba5",
  "annotations" : [ {
    "preferred-label" : "Telefonister",
    "type" : "ssyk-level-4",
    "start-position" : 15,
    "end-position" : 22,
    "concept-id" : "4aPu_2nd_8X6",
    "matched-string" : "telefon",
    "annotation-id" : 2
  }, {
    "preferred-label" : "arbeta självständigt",
    "type" : "esco-skill",
    "start-position" : 223,
    "end-position" : 236,
    "concept-id" : "NyFu_HHd_zhz",
    "matched-string" : "självständiga",
    "annotation-id" : 4
  }, {
    "preferred-label" : "Teamledare",
    "sentiment" : "MUST_HAVE",
    "type" : "occupation-name",
    "start-position" : 723,
    "end-position" : 733,
    "concept-id" : "FC86_VDF_rqB",
    "matched-string" : "teamledare",
    "annotation-id" : 0
  }, {
    "preferred-label" : "Stockholm",
    "type" : "municipality",
    "start-position" : 970,
    "end-position" : 979,
    "concept-id" : "AvNB_uwa_6n6",
    "matched-string" : "Stockholm",
    "annotation-id" : 3
  }, {
    "preferred-label" : "arbeta självständigt",
    "type" : "esco-skill",
    "start-position" : 1017,
    "end-position" : 1029,
    "concept-id" : "NyFu_HHd_zhz",
    "matched-string" : "självständig",
    "annotation-id" : 5
  }, {
    "preferred-label" : "Distansarbete",
    "type" : "work-place-environment",
    "start-position" : 1083,
    "end-position" : 1097,
    "concept-id" : "uwzb_xcR_vxS",
    "matched-string" : "jobba hemifrån",
    "annotation-id" : 6
  }, {
    "preferred-label" : "Stockholm",
    "type" : "municipality",
    "start-position" : 1363,
    "end-position" : 1372,
    "concept-id" : "AvNB_uwa_6n6",
    "matched-string" : "Stockholm",
    "annotation-id" : 7
  } ],
  "text" : "Mötesbokare på telefon\nÄr du Entreprenör?\nVi erbjuder stora möjligheter för dig som vill driva eget och tjäna riktigt bra med pengar från start. Vi har ett färdigt affärskoncept och du är igång på 1-2 dagar.\nVi söker flera självständiga personer som låter seriösa och professionella på telefon och är hungrig på att tjäna stora pengar. Att du inte tar ett nej för ett nej och går den extra milen, det är essentiellt för att lyckas hos oss. Högt tempo och entusiasm är andra viktiga stickord för att uppnå succé!\nVi hjälper dig komma i gång med din egen verksamhet. Vi lär upp dig i vår beprövade metodik och coachar dig regelbundet så du får ut din potential. Det finns även möjligheter att klättra i bolaget och bli t. ex teamledare.\nKonkret så bokar du möten till beslutsfattare i svenska bolag per telefon. Det kan vara allt från VDar, marknadschefer till produktspecialister, så viktigt att du låter professionell och seriös på telefon.\nDu jobbar hos oss i centrala Stockholm, vi sitter i Hammarby Sjöstad. Är du självständig med självdisciplin så går det även kombinera med att jobba hemifrån.\nVi erbjuder mycket höga provisioner per genomförda möten. Du väljer själva om du vill fakturera ditt konsultarvode via egen firma/bolag eller via faktureringsbolag.\nStartdatum är från augusti 2022 och arbetstiden är måndag till fredag 0800-1700.\nVi är ett bolag i Stockholm specialiserad på mötesbokning med mycket goda kundreferenser. Se vår hemsida: www.aceconsultinggroup.se\nKontakta oss för mer info på: ove@aceconsultinggroup.se"
}