{
  "meta" : {
    "jobad" : {
      "description" : {
        "requirements" : null,
        "needs" : null,
        "company_information" : null,
        "text_formatted" : "Välkommen till kommunen som är tillräckligt stor för att driva utveckling och tillräckligt liten för att du ska kunna påverka mer än den egna arbetsplatsen. Tillsammans skapar vi Alingsås!\n\nKultur- och utbildningsförvaltningens verksamheter omfattas av gymnasieskola, vuxenutbildning, konst- och kulturverksamhet, bibliotek, anläggningar och fritid, Nolhaga Parkbad, museum, konsthall, föreningsstöd, fritidsgårdar, integration och arbetsmarknad, kulturskola, turistinformation samt evenemangsverksamhet. Inom gemensamma förvaltningen arbetar cirka 470 medarbetare.\n\nInom avdelningen för kultur, turism och evenemang är tjänsten placerad vid enheten för turism och evenemang. Verksamhetens tjänster och utbud finns idag både fysiskt och via webbens olika plattformar och e-tjänster.\r\n\r\nARBETSUPPGIFTER\nI ditt arbete som turismsamordnare ansvarar du för såväl det strategiska som det operativa arbetet för att utveckla besöksnäringen i Alingsås kommun med särskilt fokus på omvärldsbevakning och skapa engagemang/koncept kring besöksnäring. I samarbete med verksamhetens kommunikatör ansvarar du för kommunikation och marknadsföring utifrån ett hållbarhetsperspektiv. Uppdraget innefattar även att samverka med lokala näringslivet och övriga reseanledningar, med syfte att ge besökaren en bra helhetsupplevelse och ett positivt intryck av destinationen.\n\nUppdraget som turismsamordnare innefattar även att informera och inspirera besökare i turismverksamheten både över disk, per telefon och via chatt. Vidare kommer du att uppdatera hemsida och sociala medier. \n\nTurismsamordnaren ingår i ett team och din närmsta chef finns inom enheten turism och evenemang. Du förväntas kunna arbeta under kvällar och helger samt sommarmånaderna.\r\n\r\nKVALIFIKATIONER\nKrav är högskoleutbildning med inriktning mot turism, alternativt att du har arbetslivserfarenhet vilken arbetsgivaren bedömer som likvärdig. Krav är vidare att du behärskar svenska och engelska i tal och skrift, samt innehar B-körkort.\n\nVi förutsätter att du är van att använda digitala kanaler och kommunicera inom digitalkommunikation, via chattprogram, sociala medier, hemsidor, Windows program samt redigeringsprogram i Adobe.\n\nMeriterande är slutförd examen från yrkeshögskola  inom kommunikation och marknadsföring med inriktning på digitala arenor eller motsvarande som arbetsgivaren bedömer lämplig. Det är även meriterande för tjänsten med kunskaper i tyska samt god kunskap om Alingsås och besöksnäringen i Sverige. \n\nFör att trivas i rollen tror vi att du är serviceinriktad och strukturerad. Du är flexibel och kan byta mellan strategiska och operativa arbetsuppgifter och har förmågan att arbeta med flera frågor och uppdrag parallellt. Du tycker om att arbeta såväl självständigt som i grupp samt uppskattar mötet med kommunens invånare och besökare och förstår komplexiteten att arbeta inom politiskt styrd organisation.\n\nVi lägger stor vikt vid personlig lämplighet.\r\n\nÖVRIGT\nVi har endast möjlighet att ta emot ansökningar via Offentliga jobb.\n\nVi gjort våra val av annonskanaler och vill ej ha kontakt med försäljare eller rekryterings- och bemanningsföretag.",
        "conditions" : "Heltid. \r\nTillsvidareanställning, tillträde: Enligt överenskommelse.",
        "text" : "Välkommen till kommunen som är tillräckligt stor för att driva utveckling och tillräckligt liten för att du ska kunna påverka mer än den egna arbetsplatsen. Tillsammans skapar vi Alingsås!\n\nKultur- och utbildningsförvaltningens verksamheter omfattas av gymnasieskola, vuxenutbildning, konst- och kulturverksamhet, bibliotek, anläggningar och fritid, Nolhaga Parkbad, museum, konsthall, föreningsstöd, fritidsgårdar, integration och arbetsmarknad, kulturskola, turistinformation samt evenemangsverksamhet. Inom gemensamma förvaltningen arbetar cirka 470 medarbetare.\n\nInom avdelningen för kultur, turism och evenemang är tjänsten placerad vid enheten för turism och evenemang. Verksamhetens tjänster och utbud finns idag både fysiskt och via webbens olika plattformar och e-tjänster.\r\n\r\nARBETSUPPGIFTER\nI ditt arbete som turismsamordnare ansvarar du för såväl det strategiska som det operativa arbetet för att utveckla besöksnäringen i Alingsås kommun med särskilt fokus på omvärldsbevakning och skapa engagemang/koncept kring besöksnäring. I samarbete med verksamhetens kommunikatör ansvarar du för kommunikation och marknadsföring utifrån ett hållbarhetsperspektiv. Uppdraget innefattar även att samverka med lokala näringslivet och övriga reseanledningar, med syfte att ge besökaren en bra helhetsupplevelse och ett positivt intryck av destinationen.\n\nUppdraget som turismsamordnare innefattar även att informera och inspirera besökare i turismverksamheten både över disk, per telefon och via chatt. Vidare kommer du att uppdatera hemsida och sociala medier. \n\nTurismsamordnaren ingår i ett team och din närmsta chef finns inom enheten turism och evenemang. Du förväntas kunna arbeta under kvällar och helger samt sommarmånaderna.\r\n\r\nKVALIFIKATIONER\nKrav är högskoleutbildning med inriktning mot turism, alternativt att du har arbetslivserfarenhet vilken arbetsgivaren bedömer som likvärdig. Krav är vidare att du behärskar svenska och engelska i tal och skrift, samt innehar B-körkort.\n\nVi förutsätter att du är van att använda digitala kanaler och kommunicera inom digitalkommunikation, via chattprogram, sociala medier, hemsidor, Windows program samt redigeringsprogram i Adobe.\n\nMeriterande är slutförd examen från yrkeshögskola  inom kommunikation och marknadsföring med inriktning på digitala arenor eller motsvarande som arbetsgivaren bedömer lämplig. Det är även meriterande för tjänsten med kunskaper i tyska samt god kunskap om Alingsås och besöksnäringen i Sverige. \n\nFör att trivas i rollen tror vi att du är serviceinriktad och strukturerad. Du är flexibel och kan byta mellan strategiska och operativa arbetsuppgifter och har förmågan att arbeta med flera frågor och uppdrag parallellt. Du tycker om att arbeta såväl självständigt som i grupp samt uppskattar mötet med kommunens invånare och besökare och förstår komplexiteten att arbeta inom politiskt styrd organisation.\n\nVi lägger stor vikt vid personlig lämplighet.\r\n\nÖVRIGT\nVi har endast möjlighet att ta emot ansökningar via Offentliga jobb.\n\nVi gjort våra val av annonskanaler och vill ej ha kontakt med försäljare eller rekryterings- och bemanningsföretag."
      },
      "headline" : "Turismsamordnare ",
      "driving_license" : [ {
        "concept_id" : "VTK8_WRx_GcM",
        "label" : "B",
        "legacy_ams_taxonomy_id" : "3"
      } ],
      "employer" : {
        "email" : null,
        "phone_number" : null,
        "organization_number" : "2120001553",
        "name" : "Alingsås kommun",
        "url" : null,
        "workplace" : "Alingsås kommun, Turism och evenemang"
      },
      "removed_date" : null,
      "logo_url" : "https://www.arbetsformedlingen.se/rest/arbetsgivare/rest/af/v3/organisation/2120001553/logotyper/logo.png",
      "last_publication_date" : "2022-08-22T23:59:59",
      "number_of_vacancies" : 1,
      "occupation" : {
        "concept_id" : "jzeN_ugc_uyf",
        "label" : "Turistinformatör",
        "legacy_ams_taxonomy_id" : "728"
      },
      "occupation_group" : {
        "concept_id" : "fdLf_oPp_wVw",
        "label" : "Resesäljare och trafikassistenter m.fl.",
        "legacy_ams_taxonomy_id" : "4221"
      },
      "employment_type" : {
        "concept_id" : "PFZr_Syz_cUq",
        "label" : "Vanlig anställning",
        "legacy_ams_taxonomy_id" : "1"
      },
      "webpage_url" : "https://arbetsformedlingen.se/platsbanken/annonser/26227587",
      "driving_license_required" : true,
      "application_contacts" : [ {
        "description" : "Pierre Åkerström",
        "email" : "pierre.akerstrom@alingsas.se",
        "telephone" : "0322-61 60 12",
        "name" : null,
        "contact_type" : "Enhetschef Turism och evenemang"
      } ],
      "duration" : {
        "concept_id" : "a7uU_j21_mkL",
        "label" : "Tills vidare",
        "legacy_ams_taxonomy_id" : "1"
      },
      "nice_to_have" : {
        "education_level" : [ ],
        "work_experiences" : [ ],
        "skills" : [ ],
        "education" : [ ],
        "languages" : [ ]
      },
      "application_details" : {
        "via_af" : false,
        "email" : null,
        "other" : null,
        "reference" : "A1131937",
        "url" : "https://recruit.visma.com/Public/Apply.aspx?guidAssignment=0ab6c7ca-5526-4384-93e7-6e3b8fa883b5&publishCode=AMS&TK=4f0ed07b-fb0c-4f78-80ab-f6c895636d15",
        "information" : null
      },
      "source_type" : "VIA_PLATSBANKEN_DXA",
      "application_deadline" : "2022-08-22T23:59:59",
      "external_id" : "46-212000-1553-0AB6C7CA5526438493E76E3B8FA883B5",
      "workplace_address" : {
        "coordinates" : [ 12.536211, 57.93002 ],
        "city" : null,
        "postcode" : null,
        "municipality" : "Alingsås",
        "region_concept_id" : "zdoY_6u5_Krt",
        "region" : "Västra Götalands län",
        "country_code" : "199",
        "region_code" : "14",
        "municipality_concept_id" : "UQ75_1eU_jaC",
        "country_concept_id" : "i46j_HmG_v64",
        "municipality_code" : "1489",
        "street_address" : null,
        "country" : "Sverige"
      },
      "id" : "26227587",
      "experience_required" : true,
      "working_hours_type" : {
        "concept_id" : "6YE1_gAC_R2G",
        "label" : "Heltid",
        "legacy_ams_taxonomy_id" : "1"
      },
      "access" : null,
      "timestamp" : 1655451623205,
      "must_have" : {
        "education_level" : [ ],
        "work_experiences" : [ {
          "concept_id" : "jzeN_ugc_uyf",
          "weight" : 10,
          "label" : "Turistinformatör",
          "legacy_ams_taxonomy_id" : "728"
        } ],
        "skills" : [ ],
        "education" : [ ],
        "languages" : [ ]
      },
      "occupation_field" : {
        "concept_id" : "RPTn_bxG_ExZ",
        "label" : "Försäljning, inköp, marknadsföring",
        "legacy_ams_taxonomy_id" : "5"
      },
      "scope_of_work" : {
        "min" : 100,
        "max" : 100
      },
      "salary_type" : {
        "concept_id" : "oG8G_9cW_nRf",
        "label" : "Fast månads- vecko- eller timlön",
        "legacy_ams_taxonomy_id" : "1"
      },
      "removed" : false,
      "salary_description" : "Enligt avtal.",
      "access_to_own_car" : false,
      "publication_date" : "2022-08-01T00:00:00"
    },
    "name" : "Turismsamordnare ",
    "user" : "kristof.fischer"
  },
  "sha1" : "34ec6ced1f5d687f6eb09fa76794271165a4000e",
  "annotations" : [ {
    "preferred-label" : "Turistinformatör",
    "sentiment" : "MUST_HAVE",
    "type" : "occupation-name",
    "start-position" : 0,
    "end-position" : 16,
    "concept-id" : "jzeN_ugc_uyf",
    "matched-string" : "turismsamordnare",
    "annotation-id" : 0
  }, {
    "preferred-label" : "Alingsås",
    "type" : "municipality",
    "start-position" : 197,
    "end-position" : 205,
    "concept-id" : "UQ75_1eU_jaC",
    "matched-string" : "Alingsås",
    "annotation-id" : 18
  }, {
    "preferred-label" : "Turistinformatör",
    "sentiment" : "MUST_HAVE",
    "type" : "occupation-name",
    "start-position" : 838,
    "end-position" : 854,
    "concept-id" : "jzeN_ugc_uyf",
    "matched-string" : "turismsamordnare",
    "annotation-id" : 5
  }, {
    "preferred-label" : "Alingsås",
    "type" : "municipality",
    "start-position" : 953,
    "end-position" : 961,
    "concept-id" : "UQ75_1eU_jaC",
    "matched-string" : "Alingsås",
    "annotation-id" : 19
  }, {
    "preferred-label" : "Informatör/Kommunikatör",
    "sentiment" : "MUST_HAVE",
    "type" : "occupation-name",
    "start-position" : 1088,
    "end-position" : 1100,
    "concept-id" : "aRp4_qjZ_tPV",
    "matched-string" : "kommunikatör",
    "annotation-id" : 7
  }, {
    "preferred-label" : "Turistinformatör",
    "sentiment" : "MUST_HAVE",
    "type" : "occupation-name",
    "start-position" : 1386,
    "end-position" : 1402,
    "concept-id" : "jzeN_ugc_uyf",
    "matched-string" : "turismsamordnare",
    "annotation-id" : 9
  }, {
    "preferred-label" : "Turistinformatör",
    "type" : "occupation-name",
    "start-position" : 1581,
    "end-position" : 1598,
    "concept-id" : "jzeN_ugc_uyf",
    "matched-string" : "Turismsamordnaren",
    "annotation-id" : 20
  }, {
    "preferred-label" : "Universitets- eller högskoleutbildning",
    "sentiment" : "MUST_HAVE",
    "type" : "sni-level-4",
    "start-position" : 1778,
    "end-position" : 1796,
    "concept-id" : "m1vC_Ssq_5Y7",
    "matched-string" : "högskoleutbildning",
    "annotation-id" : 21
  }, {
    "preferred-label" : "Turism, resor och fritid",
    "sentiment" : "MUST_HAVE",
    "type" : "sun-education-field-3",
    "start-position" : 1816,
    "end-position" : 1822,
    "concept-id" : "jZ9y_Vyg_Kvp",
    "matched-string" : "turism",
    "annotation-id" : 11
  }, {
    "preferred-label" : "Svenska",
    "sentiment" : "MUST_HAVE",
    "type" : "language",
    "start-position" : 1944,
    "end-position" : 1951,
    "concept-id" : "zSLA_vw2_FXN",
    "matched-string" : "svenska",
    "annotation-id" : 12
  }, {
    "preferred-label" : "Engelska",
    "sentiment" : "MUST_HAVE",
    "type" : "language",
    "start-position" : 1956,
    "end-position" : 1964,
    "concept-id" : "NVxJ_hLg_TYS",
    "matched-string" : "engelska",
    "annotation-id" : 13
  }, {
    "preferred-label" : "B",
    "sentiment" : "MUST_HAVE",
    "type" : "driving-licence",
    "start-position" : 1996,
    "end-position" : 2005,
    "concept-id" : "VTK8_WRx_GcM",
    "matched-string" : "B-körkort",
    "annotation-id" : 22
  }, {
    "preferred-label" : null,
    "sentiment" : "MUST_HAVE",
    "type" : "skill",
    "start-position" : 2041,
    "end-position" : 2065,
    "concept-id" : null,
    "matched-string" : "använda digitala kanaler",
    "annotation-id" : 23
  }, {
    "preferred-label" : "kommunikation",
    "sentiment" : "MUST_HAVE",
    "type" : "esco-skill",
    "start-position" : 2070,
    "end-position" : 2081,
    "concept-id" : "ahPU_HgE_Jeb",
    "matched-string" : "kommunicera",
    "annotation-id" : 24
  }, {
    "preferred-label" : "Informations- och kommunikationsteknik (IKT), allmän utbildning",
    "sentiment" : "NICE_TO_HAVE",
    "type" : "sun-education-field-4",
    "start-position" : 2259,
    "end-position" : 2272,
    "concept-id" : "Wswh_P8P_qEL",
    "matched-string" : "kommunikation",
    "annotation-id" : 25
  }, {
    "preferred-label" : "Marknadsföring",
    "sentiment" : "NICE_TO_HAVE",
    "type" : "sun-education-field-4",
    "start-position" : 2277,
    "end-position" : 2291,
    "concept-id" : "zTc5_e4U_Qsf",
    "matched-string" : "marknadsföring",
    "annotation-id" : 16
  }, {
    "preferred-label" : "Tyska",
    "sentiment" : "NICE_TO_HAVE",
    "type" : "language",
    "start-position" : 2432,
    "end-position" : 2437,
    "concept-id" : "S368_jFS_2hP",
    "matched-string" : "tyska",
    "annotation-id" : 17
  }, {
    "preferred-label" : "Alingsås",
    "type" : "municipality",
    "start-position" : 2458,
    "end-position" : 2466,
    "concept-id" : "UQ75_1eU_jaC",
    "matched-string" : "Alingsås",
    "annotation-id" : 26
  }, {
    "preferred-label" : "Sverige",
    "type" : "country",
    "start-position" : 2488,
    "end-position" : 2495,
    "concept-id" : "i46j_HmG_v64",
    "matched-string" : "Sverige",
    "annotation-id" : 27
  }, {
    "preferred-label" : "arbeta självständigt",
    "sentiment" : "MUST_HAVE",
    "type" : "esco-skill",
    "start-position" : 2751,
    "end-position" : 2764,
    "concept-id" : "NyFu_HHd_zhz",
    "matched-string" : "självständigt",
    "annotation-id" : 28
  } ],
  "text" : "Turismsamordnare \nVälkommen till kommunen som är tillräckligt stor för att driva utveckling och tillräckligt liten för att du ska kunna påverka mer än den egna arbetsplatsen. Tillsammans skapar vi Alingsås!\n\nKultur- och utbildningsförvaltningens verksamheter omfattas av gymnasieskola, vuxenutbildning, konst- och kulturverksamhet, bibliotek, anläggningar och fritid, Nolhaga Parkbad, museum, konsthall, föreningsstöd, fritidsgårdar, integration och arbetsmarknad, kulturskola, turistinformation samt evenemangsverksamhet. Inom gemensamma förvaltningen arbetar cirka 470 medarbetare.\n\nInom avdelningen för kultur, turism och evenemang är tjänsten placerad vid enheten för turism och evenemang. Verksamhetens tjänster och utbud finns idag både fysiskt och via webbens olika plattformar och e-tjänster.\r\n\r\nARBETSUPPGIFTER\nI ditt arbete som turismsamordnare ansvarar du för såväl det strategiska som det operativa arbetet för att utveckla besöksnäringen i Alingsås kommun med särskilt fokus på omvärldsbevakning och skapa engagemang/koncept kring besöksnäring. I samarbete med verksamhetens kommunikatör ansvarar du för kommunikation och marknadsföring utifrån ett hållbarhetsperspektiv. Uppdraget innefattar även att samverka med lokala näringslivet och övriga reseanledningar, med syfte att ge besökaren en bra helhetsupplevelse och ett positivt intryck av destinationen.\n\nUppdraget som turismsamordnare innefattar även att informera och inspirera besökare i turismverksamheten både över disk, per telefon och via chatt. Vidare kommer du att uppdatera hemsida och sociala medier. \n\nTurismsamordnaren ingår i ett team och din närmsta chef finns inom enheten turism och evenemang. Du förväntas kunna arbeta under kvällar och helger samt sommarmånaderna.\r\n\r\nKVALIFIKATIONER\nKrav är högskoleutbildning med inriktning mot turism, alternativt att du har arbetslivserfarenhet vilken arbetsgivaren bedömer som likvärdig. Krav är vidare att du behärskar svenska och engelska i tal och skrift, samt innehar B-körkort.\n\nVi förutsätter att du är van att använda digitala kanaler och kommunicera inom digitalkommunikation, via chattprogram, sociala medier, hemsidor, Windows program samt redigeringsprogram i Adobe.\n\nMeriterande är slutförd examen från yrkeshögskola  inom kommunikation och marknadsföring med inriktning på digitala arenor eller motsvarande som arbetsgivaren bedömer lämplig. Det är även meriterande för tjänsten med kunskaper i tyska samt god kunskap om Alingsås och besöksnäringen i Sverige. \n\nFör att trivas i rollen tror vi att du är serviceinriktad och strukturerad. Du är flexibel och kan byta mellan strategiska och operativa arbetsuppgifter och har förmågan att arbeta med flera frågor och uppdrag parallellt. Du tycker om att arbeta såväl självständigt som i grupp samt uppskattar mötet med kommunens invånare och besökare och förstår komplexiteten att arbeta inom politiskt styrd organisation.\n\nVi lägger stor vikt vid personlig lämplighet.\r\n\nÖVRIGT\nVi har endast möjlighet att ta emot ansökningar via Offentliga jobb.\n\nVi gjort våra val av annonskanaler och vill ej ha kontakt med försäljare eller rekryterings- och bemanningsföretag."
}