{
  "meta" : {
    "jobad" : {
      "description" : {
        "requirements" : null,
        "needs" : null,
        "company_information" : null,
        "text_formatted" : "Nu söker vi en Tech lead till vår utvecklingsavdelning på Workbuster. Vill du vara med och fortsätta vår spännande resa i Grade koncernen och utveckla vår produkt vidare? Drivs du av att leda andra och coacha andra? Då kan rollen som Tech lead vara något för dig!\n\nOm rollen\n\nSom Tech lead på Workbuster kommer du att leda och driva utvecklingsteamet som idag består utav sex personer. Du kommer arbeta nära vår fantastiska produktägare Marcus och vara länken mellan utveckling och vår produkt, Workbuster ATS. I rollen kommer du ha personal-och avdelningsansvar för hela teamet. Vidare kommer du att:\n\n• Vara ansvarig för arkitekturen \n• Ansvarig för design \n• Scrum Master \n• Vara delaktig i planering av utvecklingen av Workbuster ATS tillsammans med vår produktägare \n• Övergripande ansvar för att all utveckling sker på ett informationssäkert sätt \n• Befogenhet att ta beslut kring personalfrågor \n• Befogenhet att ta beslut i frågor gällande arbetsledning och utvecklingsteamet \n\nSom Tech lead kommer du: \n\n• Planera, driva och leda utvecklingsarbetet \n• Programmering och utveckling av rekryteringssystemet, anmälningssystem och övriga moduler \n• Planera, driva och leda personalen i utvecklingsteamet \n• Rekrytera tillsammans med HR \n• Fördelning av arbetsuppgifter \n• Medarbetarsamtal \n• Lönesättning \n\nVi ser gärna att du har en relevant universitets-/högskoleutbildning eller minst 5 års erfarenhet inom utveckling.\n\nOm dig \n\nFör att trivas i rollen som Tech lead ser vi att du drivs av att leda och coacha utvecklingsteamet för att nå Grades gemensamma mål och utveckla Workbuster ATS tekniska plattform genom ett proaktivt, noggrant och ansvarsfullt arbetssätt. \n\nVidare tror vi att du: \n\n• har erfarenhet av att leda andra \n• arbetat i ett SAAS bolag tidigare, gärna i ett produktbolag med en webbaserad lösning \n• kunskap i Node.js/Javascript, PostgreSQL, Vue.js \n• erfarenhet av testning\n• \n• flera års erfarenhet av programmering \n• erfarenhet av arbete med det agila arbetssättet Scrum\n• \n• beskriver dig som lösningsorienterad & problemlösare \n• \n• du behärskar svenska och engelska flytande i tal och i skrift. \n\nVilka är vi på Workbuster och Grade?\n\nGrade består av bolagen Refensa, Grade, Workbuster och Varbi, tillsammans har vi samlats under namnet Grade. Vi erbjuder en helhetslösning inom kompetensförsörjning som sträcker sig över hela medarbetarresan. Koncernen omsätter 120 Msek varav 87% är återkommande intäkter. Största ägare är Viking Venture. Vi växer så det knakar och i dagsläget inom koncernen är vi cirka 100 anställda.\n\nHos Grade blir du en del av ett prestigelöst gäng i en skön arbetsmiljö med kontor i Stockholm, Lund och Trollhättan. Vi gillar att hitta på mycket roligt tillsammans och umgås gärna både utanför och på kontoret. För oss är teamkänslan viktig och vi hoppas du vill bli en del av den. Vi har höga ambitioner för både individers och företagets utveckling samtidigt som vi värderar en vänskaplig arbetsmiljö, där alla har en plats. På Grade är det av största vikt att du ska trivas, utvecklas och må bra på jobbet. \n\nFör att läsa mer om oss på Workbuster, besök vår karriärsida www.workbuster.com/karriar \n\nMer om tjänsten\n\n• Omfattning: Heltid \n• Antal tjänster: 1 st \n• Placering: Stockholm med möjlighet att arbeta hemma 3 dagar i veckan\n• \n• Anställningsform: Tillsvidare med 6 månaders provanställning \n\nVi hanterar ansökningar löpande och tjänsten kan komma att tillsättas innan sista ansökningsdatum så skicka in din ansökan redan idag.\n\nOm du önskar mer information kring rollen, tveka inte att höra av dig till vår Talent Acquisition Manager och HR-ansvariga, Mimmie Swärdén, mimmie@workbuster.se.\n\nVarmt välkommen med din ansökan!",
        "conditions" : "-\r\n-",
        "text" : "Nu söker vi en Tech lead till vår utvecklingsavdelning på Workbuster. Vill du vara med och fortsätta vår spännande resa i Grade koncernen och utveckla vår produkt vidare? Drivs du av att leda andra och coacha andra? Då kan rollen som Tech lead vara något för dig!\n\nOm rollen\n\nSom Tech lead på Workbuster kommer du att leda och driva utvecklingsteamet som idag består utav sex personer. Du kommer arbeta nära vår fantastiska produktägare Marcus och vara länken mellan utveckling och vår produkt, Workbuster ATS. I rollen kommer du ha personal-och avdelningsansvar för hela teamet. Vidare kommer du att:\n\n• Vara ansvarig för arkitekturen \n• Ansvarig för design \n• Scrum Master \n• Vara delaktig i planering av utvecklingen av Workbuster ATS tillsammans med vår produktägare \n• Övergripande ansvar för att all utveckling sker på ett informationssäkert sätt \n• Befogenhet att ta beslut kring personalfrågor \n• Befogenhet att ta beslut i frågor gällande arbetsledning och utvecklingsteamet \n\nSom Tech lead kommer du: \n\n• Planera, driva och leda utvecklingsarbetet \n• Programmering och utveckling av rekryteringssystemet, anmälningssystem och övriga moduler \n• Planera, driva och leda personalen i utvecklingsteamet \n• Rekrytera tillsammans med HR \n• Fördelning av arbetsuppgifter \n• Medarbetarsamtal \n• Lönesättning \n\nVi ser gärna att du har en relevant universitets-/högskoleutbildning eller minst 5 års erfarenhet inom utveckling.\n\nOm dig \n\nFör att trivas i rollen som Tech lead ser vi att du drivs av att leda och coacha utvecklingsteamet för att nå Grades gemensamma mål och utveckla Workbuster ATS tekniska plattform genom ett proaktivt, noggrant och ansvarsfullt arbetssätt. \n\nVidare tror vi att du: \n\n• har erfarenhet av att leda andra \n• arbetat i ett SAAS bolag tidigare, gärna i ett produktbolag med en webbaserad lösning \n• kunskap i Node.js/Javascript, PostgreSQL, Vue.js \n• erfarenhet av testning\n• \n• flera års erfarenhet av programmering \n• erfarenhet av arbete med det agila arbetssättet Scrum\n• \n• beskriver dig som lösningsorienterad & problemlösare \n• \n• du behärskar svenska och engelska flytande i tal och i skrift. \n\nVilka är vi på Workbuster och Grade?\n\nGrade består av bolagen Refensa, Grade, Workbuster och Varbi, tillsammans har vi samlats under namnet Grade. Vi erbjuder en helhetslösning inom kompetensförsörjning som sträcker sig över hela medarbetarresan. Koncernen omsätter 120 Msek varav 87% är återkommande intäkter. Största ägare är Viking Venture. Vi växer så det knakar och i dagsläget inom koncernen är vi cirka 100 anställda.\n\nHos Grade blir du en del av ett prestigelöst gäng i en skön arbetsmiljö med kontor i Stockholm, Lund och Trollhättan. Vi gillar att hitta på mycket roligt tillsammans och umgås gärna både utanför och på kontoret. För oss är teamkänslan viktig och vi hoppas du vill bli en del av den. Vi har höga ambitioner för både individers och företagets utveckling samtidigt som vi värderar en vänskaplig arbetsmiljö, där alla har en plats. På Grade är det av största vikt att du ska trivas, utvecklas och må bra på jobbet. \n\nFör att läsa mer om oss på Workbuster, besök vår karriärsida www.workbuster.com/karriar \n\nMer om tjänsten\n\n• Omfattning: Heltid \n• Antal tjänster: 1 st \n• Placering: Stockholm med möjlighet att arbeta hemma 3 dagar i veckan\n• \n• Anställningsform: Tillsvidare med 6 månaders provanställning \n\nVi hanterar ansökningar löpande och tjänsten kan komma att tillsättas innan sista ansökningsdatum så skicka in din ansökan redan idag.\n\nOm du önskar mer information kring rollen, tveka inte att höra av dig till vår Talent Acquisition Manager och HR-ansvariga, Mimmie Swärdén, mimmie@workbuster.se.\n\nVarmt välkommen med din ansökan!"
      },
      "headline" : "Tech lead till växande koncern",
      "driving_license" : null,
      "employer" : {
        "email" : null,
        "phone_number" : null,
        "organization_number" : "5564169828",
        "name" : "Workbuster AB",
        "url" : null,
        "workplace" : "Workbuster AB"
      },
      "removed_date" : null,
      "logo_url" : "https://www.arbetsformedlingen.se/rest/arbetsgivare/rest/af/v3/organisation/5564169828/logotyper/logo.png",
      "last_publication_date" : "2022-08-30T23:59:59",
      "number_of_vacancies" : 1,
      "occupation" : {
        "concept_id" : "fg7B_yov_smw",
        "label" : "Systemutvecklare/Programmerare",
        "legacy_ams_taxonomy_id" : "2419"
      },
      "occupation_group" : {
        "concept_id" : "DJh5_yyF_hEM",
        "label" : "Mjukvaru- och systemutvecklare m.fl.",
        "legacy_ams_taxonomy_id" : "2512"
      },
      "employment_type" : {
        "concept_id" : "PFZr_Syz_cUq",
        "label" : "Vanlig anställning",
        "legacy_ams_taxonomy_id" : "1"
      },
      "webpage_url" : "https://arbetsformedlingen.se/platsbanken/annonser/26269680",
      "driving_license_required" : false,
      "application_contacts" : [ ],
      "duration" : {
        "concept_id" : "a7uU_j21_mkL",
        "label" : "Tills vidare",
        "legacy_ams_taxonomy_id" : "1"
      },
      "nice_to_have" : {
        "education_level" : [ ],
        "work_experiences" : [ ],
        "skills" : [ ],
        "education" : [ ],
        "languages" : [ ]
      },
      "application_details" : {
        "via_af" : false,
        "email" : null,
        "other" : null,
        "reference" : null,
        "url" : "https://workbuster.com/karriar/?jobid=206571&ref=platsbanken",
        "information" : null
      },
      "source_type" : "VIA_PLATSBANKEN_DXA",
      "application_deadline" : "2022-08-30T23:59:59",
      "external_id" : "46-556416-9828-wb-206571",
      "workplace_address" : {
        "coordinates" : [ 18.06858, 59.329323 ],
        "city" : null,
        "postcode" : null,
        "municipality" : "Stockholm",
        "region_concept_id" : "CifL_Rzy_Mku",
        "region" : "Stockholms län",
        "country_code" : "199",
        "region_code" : "01",
        "municipality_concept_id" : "AvNB_uwa_6n6",
        "country_concept_id" : "i46j_HmG_v64",
        "municipality_code" : "0180",
        "street_address" : null,
        "country" : "Sverige"
      },
      "id" : "26269680",
      "experience_required" : true,
      "working_hours_type" : {
        "concept_id" : "6YE1_gAC_R2G",
        "label" : "Heltid",
        "legacy_ams_taxonomy_id" : "1"
      },
      "access" : null,
      "timestamp" : 1656473461148,
      "must_have" : {
        "education_level" : [ ],
        "work_experiences" : [ {
          "concept_id" : "fg7B_yov_smw",
          "weight" : 10,
          "label" : "Systemutvecklare/Programmerare",
          "legacy_ams_taxonomy_id" : "2419"
        } ],
        "skills" : [ ],
        "education" : [ ],
        "languages" : [ ]
      },
      "occupation_field" : {
        "concept_id" : "apaJ_2ja_LuF",
        "label" : "Data/IT",
        "legacy_ams_taxonomy_id" : "3"
      },
      "scope_of_work" : {
        "min" : 100,
        "max" : 100
      },
      "salary_type" : {
        "concept_id" : "oG8G_9cW_nRf",
        "label" : "Fast månads- vecko- eller timlön",
        "legacy_ams_taxonomy_id" : "1"
      },
      "removed" : false,
      "salary_description" : "Enligt överenskommelse",
      "access_to_own_car" : false,
      "publication_date" : "2022-06-29T05:31:01"
    },
    "name" : "Tech lead till växande koncern",
    "user" : "hannes"
  },
  "sha1" : "a3c2a72a2ee3e65ccc5219cc7d795879167c170f",
  "annotations" : [ {
    "preferred-label" : "Personalansvar",
    "sentiment" : "MUST_HAVE",
    "type" : "skill",
    "start-position" : 564,
    "end-position" : 572,
    "concept-id" : "ZzN5_m7B_5CY",
    "matched-string" : "personal",
    "annotation-id" : 0
  }, {
    "preferred-label" : "Scrum master",
    "sentiment" : "MUST_HAVE",
    "type" : "occupation-name",
    "start-position" : 693,
    "end-position" : 705,
    "concept-id" : "1UTZ_bS9_kUD",
    "matched-string" : "scrum master",
    "annotation-id" : 1
  }, {
    "preferred-label" : "Programmering",
    "sentiment" : "MUST_HAVE",
    "type" : "skill",
    "start-position" : 1092,
    "end-position" : 1105,
    "concept-id" : "iUew_moc_BRk",
    "matched-string" : "programmering",
    "annotation-id" : 2
  }, {
    "preferred-label" : "rekrytera personal",
    "type" : "esco-skill",
    "start-position" : 1243,
    "end-position" : 1252,
    "concept-id" : "Q9bs_TeK_AMr",
    "matched-string" : "Rekrytera",
    "annotation-id" : 15
  }, {
    "preferred-label" : "Universitets- eller högskoleutbildning",
    "type" : "sni-level-4",
    "start-position" : 1379,
    "end-position" : 1411,
    "concept-id" : "m1vC_Ssq_5Y7",
    "matched-string" : "universitets-/högskoleutbildning",
    "annotation-id" : 16
  }, {
    "preferred-label" : "5 års erfarenhet eller mer",
    "type" : "occupation-experience-year",
    "start-position" : 1418,
    "end-position" : 1440,
    "concept-id" : "8CVf_zRX_aZj",
    "matched-string" : "minst 5 års erfarenhet",
    "annotation-id" : 17
  }, {
    "preferred-label" : "Node, exekveringsmiljö",
    "sentiment" : "MUST_HAVE",
    "type" : "skill",
    "start-position" : 1870,
    "end-position" : 1874,
    "concept-id" : "McKJ_SG4_hCM",
    "matched-string" : "node",
    "annotation-id" : 3
  }, {
    "preferred-label" : "JavaScript, programmeringsspråk",
    "sentiment" : "MUST_HAVE",
    "type" : "skill",
    "start-position" : 1878,
    "end-position" : 1888,
    "concept-id" : "DHhX_uVf_y6X",
    "matched-string" : "javascript",
    "annotation-id" : 4
  }, {
    "preferred-label" : "PostgreSQL",
    "sentiment" : "MUST_HAVE",
    "type" : "esco-skill",
    "start-position" : 1890,
    "end-position" : 1900,
    "concept-id" : "EXbL_wQe_tGp",
    "matched-string" : "postgresql",
    "annotation-id" : 5
  }, {
    "preferred-label" : "Programmering",
    "sentiment" : "MUST_HAVE",
    "type" : "skill",
    "start-position" : 1964,
    "end-position" : 1977,
    "concept-id" : "iUew_moc_BRk",
    "matched-string" : "programmering",
    "annotation-id" : 6
  }, {
    "preferred-label" : "agil utveckling",
    "type" : "esco-skill",
    "start-position" : 2010,
    "end-position" : 2015,
    "concept-id" : "azwQ_pDo_Dur",
    "matched-string" : "agila",
    "annotation-id" : 18
  }, {
    "preferred-label" : "Scrum, systemutvecklingsmetod",
    "sentiment" : "MUST_HAVE",
    "type" : "skill",
    "start-position" : 2029,
    "end-position" : 2034,
    "concept-id" : "Cnqu_REg_6jo",
    "matched-string" : "scrum",
    "annotation-id" : 7
  }, {
    "preferred-label" : "Svenska",
    "sentiment" : "MUST_HAVE",
    "type" : "language",
    "start-position" : 2112,
    "end-position" : 2119,
    "concept-id" : "zSLA_vw2_FXN",
    "matched-string" : "svenska",
    "annotation-id" : 8
  }, {
    "preferred-label" : "Engelska",
    "sentiment" : "MUST_HAVE",
    "type" : "language",
    "start-position" : 2124,
    "end-position" : 2132,
    "concept-id" : "NVxJ_hLg_TYS",
    "matched-string" : "engelska",
    "annotation-id" : 9
  }, {
    "preferred-label" : "arbetsmiljö",
    "sentiment" : "MUST_HAVE",
    "type" : "esco-skill",
    "start-position" : 2650,
    "end-position" : 2661,
    "concept-id" : "zdQY_QJh_nUH",
    "matched-string" : "arbetsmiljö",
    "annotation-id" : 10
  }, {
    "preferred-label" : "Kontor",
    "sentiment" : "MUST_HAVE",
    "type" : "keyword",
    "start-position" : 2666,
    "end-position" : 2672,
    "concept-id" : "Hyz1_7HF_AkP",
    "matched-string" : "kontor",
    "annotation-id" : 11
  }, {
    "preferred-label" : "Stockholm",
    "type" : "municipality",
    "start-position" : 2675,
    "end-position" : 2684,
    "concept-id" : "AvNB_uwa_6n6",
    "matched-string" : "Stockholm",
    "annotation-id" : 19
  }, {
    "preferred-label" : "Lund",
    "type" : "municipality",
    "start-position" : 2686,
    "end-position" : 2690,
    "concept-id" : "muSY_tsR_vDZ",
    "matched-string" : "Lund",
    "annotation-id" : 20
  }, {
    "preferred-label" : "Trollhättan",
    "type" : "municipality",
    "start-position" : 2695,
    "end-position" : 2706,
    "concept-id" : "CSy8_41F_YvX",
    "matched-string" : "Trollhättan",
    "annotation-id" : 21
  }, {
    "preferred-label" : "arbetsmiljö",
    "sentiment" : "MUST_HAVE",
    "type" : "esco-skill",
    "start-position" : 2983,
    "end-position" : 2994,
    "concept-id" : "zdQY_QJh_nUH",
    "matched-string" : "arbetsmiljö",
    "annotation-id" : 12
  }, {
    "preferred-label" : "Heltid",
    "type" : "worktime-extent",
    "start-position" : 3225,
    "end-position" : 3231,
    "concept-id" : "6YE1_gAC_R2G",
    "matched-string" : "Heltid",
    "annotation-id" : 22
  }, {
    "preferred-label" : "Tillsvidareanställning (inkl. eventuell provanställning)",
    "type" : "employment-type",
    "start-position" : 3351,
    "end-position" : 3393,
    "concept-id" : "kpPX_CNN_gDU",
    "matched-string" : "Tillsvidare med 6 månaders provanställning",
    "annotation-id" : 23
  } ],
  "text" : "Tech lead till växande koncern\nNu söker vi en Tech lead till vår utvecklingsavdelning på Workbuster. Vill du vara med och fortsätta vår spännande resa i Grade koncernen och utveckla vår produkt vidare? Drivs du av att leda andra och coacha andra? Då kan rollen som Tech lead vara något för dig!\n\nOm rollen\n\nSom Tech lead på Workbuster kommer du att leda och driva utvecklingsteamet som idag består utav sex personer. Du kommer arbeta nära vår fantastiska produktägare Marcus och vara länken mellan utveckling och vår produkt, Workbuster ATS. I rollen kommer du ha personal-och avdelningsansvar för hela teamet. Vidare kommer du att:\n\n• Vara ansvarig för arkitekturen \n• Ansvarig för design \n• Scrum Master \n• Vara delaktig i planering av utvecklingen av Workbuster ATS tillsammans med vår produktägare \n• Övergripande ansvar för att all utveckling sker på ett informationssäkert sätt \n• Befogenhet att ta beslut kring personalfrågor \n• Befogenhet att ta beslut i frågor gällande arbetsledning och utvecklingsteamet \n\nSom Tech lead kommer du: \n\n• Planera, driva och leda utvecklingsarbetet \n• Programmering och utveckling av rekryteringssystemet, anmälningssystem och övriga moduler \n• Planera, driva och leda personalen i utvecklingsteamet \n• Rekrytera tillsammans med HR \n• Fördelning av arbetsuppgifter \n• Medarbetarsamtal \n• Lönesättning \n\nVi ser gärna att du har en relevant universitets-/högskoleutbildning eller minst 5 års erfarenhet inom utveckling.\n\nOm dig \n\nFör att trivas i rollen som Tech lead ser vi att du drivs av att leda och coacha utvecklingsteamet för att nå Grades gemensamma mål och utveckla Workbuster ATS tekniska plattform genom ett proaktivt, noggrant och ansvarsfullt arbetssätt. \n\nVidare tror vi att du: \n\n• har erfarenhet av att leda andra \n• arbetat i ett SAAS bolag tidigare, gärna i ett produktbolag med en webbaserad lösning \n• kunskap i Node.js/Javascript, PostgreSQL, Vue.js \n• erfarenhet av testning\n• \n• flera års erfarenhet av programmering \n• erfarenhet av arbete med det agila arbetssättet Scrum\n• \n• beskriver dig som lösningsorienterad & problemlösare \n• \n• du behärskar svenska och engelska flytande i tal och i skrift. \n\nVilka är vi på Workbuster och Grade?\n\nGrade består av bolagen Refensa, Grade, Workbuster och Varbi, tillsammans har vi samlats under namnet Grade. Vi erbjuder en helhetslösning inom kompetensförsörjning som sträcker sig över hela medarbetarresan. Koncernen omsätter 120 Msek varav 87% är återkommande intäkter. Största ägare är Viking Venture. Vi växer så det knakar och i dagsläget inom koncernen är vi cirka 100 anställda.\n\nHos Grade blir du en del av ett prestigelöst gäng i en skön arbetsmiljö med kontor i Stockholm, Lund och Trollhättan. Vi gillar att hitta på mycket roligt tillsammans och umgås gärna både utanför och på kontoret. För oss är teamkänslan viktig och vi hoppas du vill bli en del av den. Vi har höga ambitioner för både individers och företagets utveckling samtidigt som vi värderar en vänskaplig arbetsmiljö, där alla har en plats. På Grade är det av största vikt att du ska trivas, utvecklas och må bra på jobbet. \n\nFör att läsa mer om oss på Workbuster, besök vår karriärsida www.workbuster.com/karriar \n\nMer om tjänsten\n\n• Omfattning: Heltid \n• Antal tjänster: 1 st \n• Placering: Stockholm med möjlighet att arbeta hemma 3 dagar i veckan\n• \n• Anställningsform: Tillsvidare med 6 månaders provanställning \n\nVi hanterar ansökningar löpande och tjänsten kan komma att tillsättas innan sista ansökningsdatum så skicka in din ansökan redan idag.\n\nOm du önskar mer information kring rollen, tveka inte att höra av dig till vår Talent Acquisition Manager och HR-ansvariga, Mimmie Swärdén, mimmie@workbuster.se.\n\nVarmt välkommen med din ansökan!"
}