{
  "meta" : {
    "jobad" : {
      "description" : {
        "requirements" : null,
        "needs" : null,
        "company_information" : null,
        "text_formatted" : "Om oss\n\nKey Solutions är ett av Sveriges största konsultföretag med över 200 anställda. Sedan starten 2008 har vi hjälp några av världens bästa varumärken såsom Google, Telia, Netflix m.fl.\n\n-  Årets byrå 2019 (Telia)\n-  Årets bästa återförsäljare 2018 & 2019 (EON)\n-  Årets innovativa partner 2020 & 2021 (IP-Only)\n-  En av Sveriges & Europas Bästa Arbetsplatser 10 år i rad (Great Place to Work)\n\nVad erbjuder vi ?\n\n-  Garanterad månadslön på 30 000 kr inom sex månader\n-  Goda chanser att klättra inom företaget\n-  Konferensresor till t.ex. Barcelona, Miami och Sydafrika\n-  Hjälp med att ta körkort samt möjlighet till tjänstebil och andra förmåner\n-  Vi avsätter minst en timme om dagen för din personliga utveckling\n\nHur funkar arbetet?\n\nDu kommer att utgå ifrån din hemort och jobba som resande säljare måndag till fredag. Som resande säljare får du upptäcka hela Sverige tillsammans med dina kollegor, vi garanterar ett äventyr!\n\n- Vi tillhandahåller boende, står för tjänstebil samt övriga arbetsverktyg\n- Vi står för resan till och från arbetsorten\n- Du erhåller traktamente för de dagar som du är bortrest\n\nVi ser gärna att du som söker...\n\n- Är en sann glädjespridare och har god social kompetens\n- Är tävlingsinriktad och älskar att utvecklas\n- Pratar svenska obehindrat\n- Har körkort (ej ett krav men det är meriterande)\n\nVi ser gärna även att du trivs med att arbeta både i grupp och självständigt. Du är en aktiv person som tycker om att delta i fritidsaktiviteter tillsammans med ditt team.\n\nHar du ingen tidigare erfarenhet? Ingen fara!\n\nDå vi har några av Sveriges absolut bästa säljare och coacher till förfogande, samt erbjuder säljutbildning i Key Business School, så har vi inget krav på tidigare säljerfarenhet. Vi tar ansvaret för att ge dig de bästa verktygen för att lyckas inom din karriär.\n\nLåter det intressant?\n\nAnsök nedan eller gör testet på 1 minut via vår hemsida för att se ifall just du skulle platsa i vårt team: https://www.keysolutions.se/jobb/ansok ⭐",
        "conditions" : "Heltid\r\nFast lön + rörlig lön. Garantilön, provision samt generösa bonusar och många säljtävlingar. Personlig utveckling, egen coach och möjlighet att klättra i karriären. ",
        "text" : "Om oss\n\nKey Solutions är ett av Sveriges största konsultföretag med över 200 anställda. Sedan starten 2008 har vi hjälp några av världens bästa varumärken såsom Google, Telia, Netflix m.fl.\n\n-  Årets byrå 2019 (Telia)\n-  Årets bästa återförsäljare 2018 & 2019 (EON)\n-  Årets innovativa partner 2020 & 2021 (IP-Only)\n-  En av Sveriges & Europas Bästa Arbetsplatser 10 år i rad (Great Place to Work)\n\nVad erbjuder vi ?\n\n-  Garanterad månadslön på 30 000 kr inom sex månader\n-  Goda chanser att klättra inom företaget\n-  Konferensresor till t.ex. Barcelona, Miami och Sydafrika\n-  Hjälp med att ta körkort samt möjlighet till tjänstebil och andra förmåner\n-  Vi avsätter minst en timme om dagen för din personliga utveckling\n\nHur funkar arbetet?\n\nDu kommer att utgå ifrån din hemort och jobba som resande säljare måndag till fredag. Som resande säljare får du upptäcka hela Sverige tillsammans med dina kollegor, vi garanterar ett äventyr!\n\n- Vi tillhandahåller boende, står för tjänstebil samt övriga arbetsverktyg\n- Vi står för resan till och från arbetsorten\n- Du erhåller traktamente för de dagar som du är bortrest\n\nVi ser gärna att du som söker...\n\n- Är en sann glädjespridare och har god social kompetens\n- Är tävlingsinriktad och älskar att utvecklas\n- Pratar svenska obehindrat\n- Har körkort (ej ett krav men det är meriterande)\n\nVi ser gärna även att du trivs med att arbeta både i grupp och självständigt. Du är en aktiv person som tycker om att delta i fritidsaktiviteter tillsammans med ditt team.\n\nHar du ingen tidigare erfarenhet? Ingen fara!\n\nDå vi har några av Sveriges absolut bästa säljare och coacher till förfogande, samt erbjuder säljutbildning i Key Business School, så har vi inget krav på tidigare säljerfarenhet. Vi tar ansvaret för att ge dig de bästa verktygen för att lyckas inom din karriär.\n\nLåter det intressant?\n\nAnsök nedan eller gör testet på 1 minut via vår hemsida för att se ifall just du skulle platsa i vårt team: https://www.keysolutions.se/jobb/ansok ⭐"
      },
      "headline" : "Jobba direkt efter studenten!",
      "driving_license" : null,
      "employer" : {
        "email" : null,
        "phone_number" : null,
        "organization_number" : "5567941173",
        "name" : "Key Solutions AB",
        "url" : "http://www.keysolutions.se",
        "workplace" : "Key Solutions"
      },
      "removed_date" : null,
      "logo_url" : "https://www.arbetsformedlingen.se/rest/arbetsgivare/rest/af/v3/organisation/5567941173/logotyper/logo.png",
      "last_publication_date" : "2022-07-22T23:59:59",
      "number_of_vacancies" : 1,
      "occupation" : {
        "concept_id" : "Fcpk_WQT_4hS",
        "label" : "Eventsäljare/Eventförsäljare",
        "legacy_ams_taxonomy_id" : "7535"
      },
      "occupation_group" : {
        "concept_id" : "NCeZ_rSk_B4D",
        "label" : "Eventsäljare och butiksdemonstratörer m.fl.",
        "legacy_ams_taxonomy_id" : "5241"
      },
      "employment_type" : {
        "concept_id" : "PFZr_Syz_cUq",
        "label" : "Vanlig anställning",
        "legacy_ams_taxonomy_id" : "1"
      },
      "webpage_url" : "https://arbetsformedlingen.se/platsbanken/annonser/26329769",
      "driving_license_required" : false,
      "application_contacts" : [ {
        "description" : "Linnea Strand",
        "email" : null,
        "telephone" : null,
        "name" : null,
        "contact_type" : null
      } ],
      "duration" : {
        "concept_id" : "a7uU_j21_mkL",
        "label" : "Tills vidare",
        "legacy_ams_taxonomy_id" : "1"
      },
      "nice_to_have" : {
        "education_level" : [ ],
        "work_experiences" : [ ],
        "skills" : [ ],
        "education" : [ ],
        "languages" : [ ]
      },
      "application_details" : {
        "via_af" : false,
        "email" : null,
        "other" : null,
        "reference" : null,
        "url" : "https://jobb.keysolutions.se/jobs/1923019-jobba-direkt-efter-studenten?promotion=449457-arbetsformedlingen",
        "information" : null
      },
      "source_type" : "VIA_PLATSBANKEN_DXA",
      "application_deadline" : "2022-07-22T23:59:59",
      "external_id" : "46-556794-1173-1923019-1",
      "workplace_address" : {
        "coordinates" : [ 16.54481, 59.6099 ],
        "city" : null,
        "postcode" : null,
        "municipality" : "Västerås",
        "region_concept_id" : "G6DV_fKE_Viz",
        "region" : "Västmanlands län",
        "country_code" : "199",
        "region_code" : "19",
        "municipality_concept_id" : "8deT_FRF_2SP",
        "country_concept_id" : "i46j_HmG_v64",
        "municipality_code" : "1980",
        "street_address" : null,
        "country" : "Sverige"
      },
      "id" : "26329769",
      "experience_required" : false,
      "working_hours_type" : {
        "concept_id" : "6YE1_gAC_R2G",
        "label" : "Heltid",
        "legacy_ams_taxonomy_id" : "1"
      },
      "access" : null,
      "timestamp" : 1657872428059,
      "must_have" : {
        "education_level" : [ ],
        "work_experiences" : [ ],
        "skills" : [ ],
        "education" : [ ],
        "languages" : [ ]
      },
      "occupation_field" : {
        "concept_id" : "RPTn_bxG_ExZ",
        "label" : "Försäljning, inköp, marknadsföring",
        "legacy_ams_taxonomy_id" : "5"
      },
      "scope_of_work" : {
        "min" : 100,
        "max" : 100
      },
      "salary_type" : {
        "concept_id" : "oG8G_9cW_nRf",
        "label" : "Fast månads- vecko- eller timlön",
        "legacy_ams_taxonomy_id" : "1"
      },
      "removed" : false,
      "salary_description" : "Lön enligt överenskommelse",
      "access_to_own_car" : false,
      "publication_date" : "2022-07-15T10:07:08"
    },
    "name" : "Jobba direkt efter studenten!",
    "user" : "hannes"
  },
  "sha1" : "470a61d8e2ab0bfc9dee07479c9aa7855f5f53ab",
  "annotations" : [ {
    "preferred-label" : "Sverige",
    "type" : "country",
    "start-position" : 62,
    "end-position" : 70,
    "concept-id" : "i46j_HmG_v64",
    "matched-string" : "Sveriges",
    "annotation-id" : 5
  }, {
    "preferred-label" : "Sverige",
    "type" : "country",
    "start-position" : 355,
    "end-position" : 363,
    "concept-id" : "i46j_HmG_v64",
    "matched-string" : "Sveriges",
    "annotation-id" : 6
  }, {
    "preferred-label" : "körkort",
    "type" : "esco-skill",
    "start-position" : 625,
    "end-position" : 632,
    "concept-id" : "UvDr_eNo_HSQ",
    "matched-string" : "körkort",
    "annotation-id" : 7
  }, {
    "preferred-label" : "Säljare",
    "sentiment" : "MUST_HAVE",
    "type" : "keyword",
    "start-position" : 832,
    "end-position" : 839,
    "concept-id" : "rDcj_Tao_TJJ",
    "matched-string" : "säljare",
    "annotation-id" : 1
  }, {
    "preferred-label" : "Säljare",
    "sentiment" : "MUST_HAVE",
    "type" : "keyword",
    "start-position" : 872,
    "end-position" : 879,
    "concept-id" : "rDcj_Tao_TJJ",
    "matched-string" : "säljare",
    "annotation-id" : 2
  }, {
    "preferred-label" : "Sverige",
    "type" : "country",
    "start-position" : 901,
    "end-position" : 908,
    "concept-id" : "i46j_HmG_v64",
    "matched-string" : "Sverige",
    "annotation-id" : 8
  }, {
    "preferred-label" : "uppvisa social kompetens",
    "type" : "esco-skill",
    "start-position" : 1222,
    "end-position" : 1238,
    "concept-id" : "5AbQ_a6i_H1T",
    "matched-string" : "social kompetens",
    "annotation-id" : 10
  }, {
    "preferred-label" : "Svenska",
    "sentiment" : "MUST_HAVE",
    "type" : "language",
    "start-position" : 1295,
    "end-position" : 1302,
    "concept-id" : "zSLA_vw2_FXN",
    "matched-string" : "svenska",
    "annotation-id" : 3
  }, {
    "preferred-label" : "körkort",
    "type" : "esco-skill",
    "start-position" : 1320,
    "end-position" : 1327,
    "concept-id" : "UvDr_eNo_HSQ",
    "matched-string" : "körkort",
    "annotation-id" : 9
  }, {
    "preferred-label" : "arbeta självständigt",
    "type" : "esco-skill",
    "start-position" : 1405,
    "end-position" : 1411,
    "concept-id" : "NyFu_HHd_zhz",
    "matched-string" : "arbeta",
    "annotation-id" : 12
  }, {
    "preferred-label" : "arbeta självständigt",
    "type" : "esco-skill",
    "start-position" : 1429,
    "end-position" : 1442,
    "concept-id" : "NyFu_HHd_zhz",
    "matched-string" : "självständigt",
    "annotation-id" : 11
  }, {
    "preferred-label" : "Säljare",
    "sentiment" : "MUST_HAVE",
    "type" : "keyword",
    "start-position" : 1628,
    "end-position" : 1635,
    "concept-id" : "rDcj_Tao_TJJ",
    "matched-string" : "säljare",
    "annotation-id" : 4
  } ],
  "text" : "Jobba direkt efter studenten!\nOm oss\n\nKey Solutions är ett av Sveriges största konsultföretag med över 200 anställda. Sedan starten 2008 har vi hjälp några av världens bästa varumärken såsom Google, Telia, Netflix m.fl.\n\n-  Årets byrå 2019 (Telia)\n-  Årets bästa återförsäljare 2018 & 2019 (EON)\n-  Årets innovativa partner 2020 & 2021 (IP-Only)\n-  En av Sveriges & Europas Bästa Arbetsplatser 10 år i rad (Great Place to Work)\n\nVad erbjuder vi ?\n\n-  Garanterad månadslön på 30 000 kr inom sex månader\n-  Goda chanser att klättra inom företaget\n-  Konferensresor till t.ex. Barcelona, Miami och Sydafrika\n-  Hjälp med att ta körkort samt möjlighet till tjänstebil och andra förmåner\n-  Vi avsätter minst en timme om dagen för din personliga utveckling\n\nHur funkar arbetet?\n\nDu kommer att utgå ifrån din hemort och jobba som resande säljare måndag till fredag. Som resande säljare får du upptäcka hela Sverige tillsammans med dina kollegor, vi garanterar ett äventyr!\n\n- Vi tillhandahåller boende, står för tjänstebil samt övriga arbetsverktyg\n- Vi står för resan till och från arbetsorten\n- Du erhåller traktamente för de dagar som du är bortrest\n\nVi ser gärna att du som söker...\n\n- Är en sann glädjespridare och har god social kompetens\n- Är tävlingsinriktad och älskar att utvecklas\n- Pratar svenska obehindrat\n- Har körkort (ej ett krav men det är meriterande)\n\nVi ser gärna även att du trivs med att arbeta både i grupp och självständigt. Du är en aktiv person som tycker om att delta i fritidsaktiviteter tillsammans med ditt team.\n\nHar du ingen tidigare erfarenhet? Ingen fara!\n\nDå vi har några av Sveriges absolut bästa säljare och coacher till förfogande, samt erbjuder säljutbildning i Key Business School, så har vi inget krav på tidigare säljerfarenhet. Vi tar ansvaret för att ge dig de bästa verktygen för att lyckas inom din karriär.\n\nLåter det intressant?\n\nAnsök nedan eller gör testet på 1 minut via vår hemsida för att se ifall just du skulle platsa i vårt team: https://www.keysolutions.se/jobb/ansok ⭐"
}