{
  "meta" : {
    "jobad" : {
      "description" : {
        "requirements" : null,
        "needs" : null,
        "company_information" : null,
        "text_formatted" : "<p>Vi behöver erfaren duktiga kockar och servitris som har erfarenhet av turkiska köket vi driver en restaurang med inriktning av turkiska specialiteter där vi bakar turkiskapizzor turkiska husmanskost grillrätter och meze med kvalitet och en snabb ökning och därför har behöv en av duktig kock och servitris som ska hjälpa oss med utvecklingen ... </p><p>Mejla om du är intresserad och du är den person vi söker.  </p><p>    Öppen för alla </p><p>Vi fokuserar på din kompetens inte dina övriga förutsättningar. För att anpassa rollen eller arbetsplatsen efter dina behov ...  </p><p id=\"oppenforalla\">Öppen för alla\nVi fokuserar på din kompetens, inte dina övriga förutsättningar. Vi är öppna för att anpassa rollen eller arbetsplatsen efter dina behov.</p>",
        "conditions" : null,
        "text" : "Vi behöver erfaren duktiga kockar och servitris som har erfarenhet av turkiska köket vi driver en restaurang med inriktning av turkiska specialiteter där vi bakar turkiskapizzor turkiska husmanskost grillrätter och meze med kvalitet och en snabb ökning och därför har behöv en av duktig kock och servitris som ska hjälpa oss med utvecklingen ... \nMejla om du är intresserad och du är den person vi söker.  \n    Öppen för alla \nVi fokuserar på din kompetens inte dina övriga förutsättningar. För att anpassa rollen eller arbetsplatsen efter dina behov ...  \nÖppen för alla\nVi fokuserar på din kompetens, inte dina övriga förutsättningar. Vi är öppna för att anpassa rollen eller arbetsplatsen efter dina behov."
      },
      "headline" : "Restaurang",
      "driving_license" : null,
      "employer" : {
        "email" : null,
        "phone_number" : null,
        "organization_number" : "5592770415",
        "name" : "MG Solna AB",
        "url" : "http://www.mangaljonkoping.se",
        "workplace" : "MG Solna AB"
      },
      "removed_date" : null,
      "logo_url" : null,
      "last_publication_date" : "2022-07-27T00:00:00",
      "number_of_vacancies" : 5,
      "occupation" : {
        "concept_id" : "rGGf_KLs_To7",
        "label" : "Servitör/Servitris",
        "legacy_ams_taxonomy_id" : "5487"
      },
      "occupation_group" : {
        "concept_id" : "UjoW_meY_Zwt",
        "label" : "Hovmästare och servitörer",
        "legacy_ams_taxonomy_id" : "5131"
      },
      "employment_type" : {
        "concept_id" : "PFZr_Syz_cUq",
        "label" : "Vanlig anställning",
        "legacy_ams_taxonomy_id" : "1"
      },
      "webpage_url" : "https://arbetsformedlingen.se/platsbanken/annonser/26264254",
      "driving_license_required" : false,
      "application_contacts" : [ ],
      "duration" : {
        "concept_id" : "a7uU_j21_mkL",
        "label" : "Tills vidare",
        "legacy_ams_taxonomy_id" : "1"
      },
      "nice_to_have" : {
        "education_level" : [ ],
        "work_experiences" : [ ],
        "skills" : [ ],
        "education" : [ ],
        "languages" : [ ]
      },
      "application_details" : {
        "via_af" : false,
        "email" : "jonkopingmangal@gmail.com",
        "other" : null,
        "reference" : null,
        "url" : null,
        "information" : null
      },
      "source_type" : "VIA_ANNONSERA",
      "application_deadline" : "2022-07-27T00:00:00",
      "external_id" : null,
      "workplace_address" : {
        "coordinates" : [ 14.196097619422718, 57.77186937541956 ],
        "city" : "Jönköping",
        "postcode" : "55305",
        "municipality" : "Jönköping",
        "region_concept_id" : "MtbE_xWT_eMi",
        "region" : "Jönköpings län",
        "country_code" : "199",
        "region_code" : "06",
        "municipality_concept_id" : "KURg_KJF_Lwc",
        "country_concept_id" : "i46j_HmG_v64",
        "municipality_code" : "0680",
        "street_address" : "Sjukhusgatan 12",
        "country" : "Sverige"
      },
      "id" : "26264254",
      "experience_required" : false,
      "working_hours_type" : {
        "concept_id" : "6YE1_gAC_R2G",
        "label" : "Heltid",
        "legacy_ams_taxonomy_id" : "1"
      },
      "access" : null,
      "timestamp" : 1656363205776,
      "must_have" : {
        "education_level" : [ ],
        "work_experiences" : [ ],
        "skills" : [ ],
        "education" : [ ],
        "languages" : [ ]
      },
      "occupation_field" : {
        "concept_id" : "ScKy_FHB_7wT",
        "label" : "Hotell, restaurang, storhushåll",
        "legacy_ams_taxonomy_id" : "7"
      },
      "scope_of_work" : {
        "min" : 0,
        "max" : 100
      },
      "salary_type" : {
        "concept_id" : "oG8G_9cW_nRf",
        "label" : "Fast månads- vecko- eller timlön",
        "legacy_ams_taxonomy_id" : "1"
      },
      "removed" : false,
      "salary_description" : null,
      "access_to_own_car" : false,
      "publication_date" : "2022-06-27T22:53:25"
    },
    "name" : "Restaurang",
    "user" : "hannes"
  },
  "sha1" : "ee2cff8380fbc3b951e1985b50b217c178c7d9e9",
  "annotations" : [ {
    "preferred-label" : "Restaurang",
    "sentiment" : "MUST_HAVE",
    "type" : "keyword",
    "start-position" : 0,
    "end-position" : 10,
    "concept-id" : "o2Cg_3Ap_qvK",
    "matched-string" : "restaurang",
    "annotation-id" : 0
  }, {
    "preferred-label" : "kock",
    "type" : "esco-occupation",
    "start-position" : 38,
    "end-position" : 44,
    "concept-id" : "Ti2H_QoQ_EMX",
    "matched-string" : "kockar",
    "annotation-id" : 9
  }, {
    "preferred-label" : "Servitör/Servitris",
    "sentiment" : "MUST_HAVE",
    "type" : "occupation-name",
    "start-position" : 49,
    "end-position" : 58,
    "concept-id" : "rGGf_KLs_To7",
    "matched-string" : "servitris",
    "annotation-id" : 1
  }, {
    "preferred-label" : "Turkiskt kök",
    "type" : "skill",
    "start-position" : 81,
    "end-position" : 95,
    "concept-id" : "hpHC_KHL_su1",
    "matched-string" : "turkiska köket",
    "annotation-id" : 10
  }, {
    "preferred-label" : "Restaurang",
    "sentiment" : "MUST_HAVE",
    "type" : "keyword",
    "start-position" : 109,
    "end-position" : 119,
    "concept-id" : "o2Cg_3Ap_qvK",
    "matched-string" : "restaurang",
    "annotation-id" : 3
  }, {
    "preferred-label" : "Turkiskt kök",
    "sentiment" : "MUST_HAVE",
    "type" : "skill",
    "start-position" : 138,
    "end-position" : 146,
    "concept-id" : "hpHC_KHL_su1",
    "matched-string" : "turkiska",
    "annotation-id" : 4
  }, {
    "preferred-label" : "Turkiskt kök",
    "sentiment" : "MUST_HAVE",
    "type" : "skill",
    "start-position" : 189,
    "end-position" : 197,
    "concept-id" : "hpHC_KHL_su1",
    "matched-string" : "turkiska",
    "annotation-id" : 5
  }, {
    "preferred-label" : "kock",
    "sentiment" : "MUST_HAVE",
    "type" : "esco-occupation",
    "start-position" : 298,
    "end-position" : 302,
    "concept-id" : "Ti2H_QoQ_EMX",
    "matched-string" : "kock",
    "annotation-id" : 7
  }, {
    "preferred-label" : "Servitör/Servitris",
    "sentiment" : "MUST_HAVE",
    "type" : "occupation-name",
    "start-position" : 307,
    "end-position" : 316,
    "concept-id" : "rGGf_KLs_To7",
    "matched-string" : "servitris",
    "annotation-id" : 8
  } ],
  "text" : "Restaurang\nVi behöver erfaren duktiga kockar och servitris som har erfarenhet av turkiska köket vi driver en restaurang med inriktning av turkiska specialiteter där vi bakar turkiskapizzor turkiska husmanskost grillrätter och meze med kvalitet och en snabb ökning och därför har behöv en av duktig kock och servitris som ska hjälpa oss med utvecklingen ... \nMejla om du är intresserad och du är den person vi söker.  \n    Öppen för alla \nVi fokuserar på din kompetens inte dina övriga förutsättningar. För att anpassa rollen eller arbetsplatsen efter dina behov ...  \nÖppen för alla\nVi fokuserar på din kompetens, inte dina övriga förutsättningar. Vi är öppna för att anpassa rollen eller arbetsplatsen efter dina behov."
}