{
  "meta" : {
    "jobad" : {
      "description" : {
        "requirements" : null,
        "needs" : null,
        "company_information" : null,
        "text_formatted" : "<p>SunRoof är ett av de snabbast växande techbolagen i hela Europa. Vi erbjuder en intressant och spännande arbetsplats inom en framtidsbransch. På SunRoof sätter vi anställda först och har stora ambitioner gällande förnybar energi. Nu söker vi dig som vill bidra till samhällets positiva utveckling genom att blanda annat räkna på våra marknadsledande tak och fasader. Vi söker en självgående, ambitiös och kommunikativ entreprenadingenjör som vill åka med på SunRoofs enorma tillväxtresa.</p><p><br></p><p>Vi på på Sunroof söker nu efter en entreprenadingenjör som vill vara med och räkna på våra projekt, granska offerter och göra solcellsberäkningar.  Du kommer jobba med många olika kontaktytor och avdelningar. Grunden för tjänsten kommer vara att granska och planera att ekonomin stämmer i projekten.. Tjänsten kommer till en början att vara remote och sedan när vi utvecklar flera regionkontor så finns det möjlighet att vara på plats om man så önskar.</p><p><br></p><p><strong>Arbetsuppgifter:</strong></p><ul><li>Tillsammans med projektledare se till att projekten från början till slut håller budget</li><li>Se över mindre inköp, fakturor och ekonomistyrning i delgivna projekt.</li><li>Granska målsättningarna i projekt gällande ekonomi.</li><li>Sammanställa efterkalkyl tillsammans med övriga.</li><li>Granska offerter som förbereds till kund och offertförfrågningar.</li><li>Vara en samordnande länk mellan ekonomiavdelningen och det bygg-operativa.</li><li>Delaktig i projekt-, resurs- och tidsplanering.</li><li>Kalkylarbete, förändringshantering och delaktighet i anbudsarbete</li></ul><p><br></p><p><br></p><p><strong>Bakgrund</strong></p><p>Vi söker dig som kommunicerar och samarbetar lätt med andra. Du drivs av utveckling, föredrar att det kan gå snabbt mellan beslut och handling och är ekonomiskt medveten. Vi tror att du har en bakgrund som entreprenadingenjör och har du även jobbat med projektering sedan tidigare så är det ett stort plus men inte ett krav.</p><p><br></p><p><strong>Kvalifikationer</strong></p><ul><li>Arbetslivserfarenhet som entreprenadingenjör och från arbete med kalkyl</li><li>Eftergymnasial byggteknisk utbildning är en fördel men inte ett krav.</li><li>Arbetar bra i team och samarbetar väl med andra.</li><li>Tidigare erfarenhet från att jobba i kalkylsystem och god administrativ förmåga.</li><li>God ekonomisk förståelse och medvetenhet</li></ul><p><br></p><p><br></p><p>Känner du att beskrivningen passar bra in på dig? Då får gärna söka då vi kommer tillsätta tjänsten så fort vi har hittat rätt kandidat.</p>",
        "conditions" : null,
        "text" : "SunRoof är ett av de snabbast växande techbolagen i hela Europa. Vi erbjuder en intressant och spännande arbetsplats inom en framtidsbransch. På SunRoof sätter vi anställda först och har stora ambitioner gällande förnybar energi. Nu söker vi dig som vill bidra till samhällets positiva utveckling genom att blanda annat räkna på våra marknadsledande tak och fasader. Vi söker en självgående, ambitiös och kommunikativ entreprenadingenjör som vill åka med på SunRoofs enorma tillväxtresa.\n\n\nVi på på Sunroof söker nu efter en entreprenadingenjör som vill vara med och räkna på våra projekt, granska offerter och göra solcellsberäkningar.  Du kommer jobba med många olika kontaktytor och avdelningar. Grunden för tjänsten kommer vara att granska och planera att ekonomin stämmer i projekten.. Tjänsten kommer till en början att vara remote och sedan när vi utvecklar flera regionkontor så finns det möjlighet att vara på plats om man så önskar.\n\n\nArbetsuppgifter:\nTillsammans med projektledare se till att projekten från början till slut håller budget\nSe över mindre inköp, fakturor och ekonomistyrning i delgivna projekt.\nGranska målsättningarna i projekt gällande ekonomi.\nSammanställa efterkalkyl tillsammans med övriga.\nGranska offerter som förbereds till kund och offertförfrågningar.\nVara en samordnande länk mellan ekonomiavdelningen och det bygg-operativa.\nDelaktig i projekt-, resurs- och tidsplanering.\nKalkylarbete, förändringshantering och delaktighet i anbudsarbete\n\n\n\n\n\nBakgrund\nVi söker dig som kommunicerar och samarbetar lätt med andra. Du drivs av utveckling, föredrar att det kan gå snabbt mellan beslut och handling och är ekonomiskt medveten. Vi tror att du har en bakgrund som entreprenadingenjör och har du även jobbat med projektering sedan tidigare så är det ett stort plus men inte ett krav.\n\n\nKvalifikationer\nArbetslivserfarenhet som entreprenadingenjör och från arbete med kalkyl\nEftergymnasial byggteknisk utbildning är en fördel men inte ett krav.\nArbetar bra i team och samarbetar väl med andra.\nTidigare erfarenhet från att jobba i kalkylsystem och god administrativ förmåga.\nGod ekonomisk förståelse och medvetenhet\n\n\n\n\n\nKänner du att beskrivningen passar bra in på dig? Då får gärna söka då vi kommer tillsätta tjänsten så fort vi har hittat rätt kandidat."
      },
      "headline" : "Entreprenadingenjör",
      "driving_license" : null,
      "employer" : {
        "email" : null,
        "phone_number" : null,
        "organization_number" : "5568768716",
        "name" : "Sunroof Sverige AB",
        "url" : "https://sunroof.se/",
        "workplace" : "Sunroof Sverige AB"
      },
      "removed_date" : null,
      "logo_url" : "https://www.arbetsformedlingen.se/rest/arbetsgivare/rest/af/v3/arbetsplatser/87387976/logotyper/logo.png",
      "last_publication_date" : "2022-08-18T23:59:59",
      "number_of_vacancies" : 1,
      "occupation" : {
        "concept_id" : "namT_cva_UiK",
        "label" : "Entreprenadingenjör",
        "legacy_ams_taxonomy_id" : "7261"
      },
      "occupation_group" : {
        "concept_id" : "thZP_oR7_WrY",
        "label" : "Ingenjörer och tekniker inom bygg och anläggning",
        "legacy_ams_taxonomy_id" : "3112"
      },
      "employment_type" : {
        "concept_id" : "PFZr_Syz_cUq",
        "label" : "Vanlig anställning",
        "legacy_ams_taxonomy_id" : "1"
      },
      "webpage_url" : "https://arbetsformedlingen.se/platsbanken/annonser/26340209",
      "driving_license_required" : false,
      "application_contacts" : [ ],
      "duration" : {
        "concept_id" : "a7uU_j21_mkL",
        "label" : "Tills vidare",
        "legacy_ams_taxonomy_id" : "1"
      },
      "nice_to_have" : {
        "education_level" : [ ],
        "work_experiences" : [ {
          "concept_id" : "namT_cva_UiK",
          "weight" : 5,
          "label" : "Entreprenadingenjör",
          "legacy_ams_taxonomy_id" : "7261"
        } ],
        "skills" : [ ],
        "education" : [ ],
        "languages" : [ ]
      },
      "application_details" : {
        "via_af" : false,
        "email" : null,
        "other" : null,
        "reference" : null,
        "url" : "https://system.erecruiter.pl/FormTemplates/RecruitmentForm.aspx?WebID=2953121d9bc94292bfb9a3bcea63e151",
        "information" : null
      },
      "source_type" : "VIA_ANNONSERA",
      "application_deadline" : "2022-08-18T23:59:59",
      "external_id" : null,
      "workplace_address" : {
        "coordinates" : [ 12.979076210938192, 55.60828824961656 ],
        "city" : "MALMÖ",
        "postcode" : "21111",
        "municipality" : "Malmö",
        "region_concept_id" : "CaRE_1nn_cSU",
        "region" : "Skåne län",
        "country_code" : "199",
        "region_code" : "12",
        "municipality_concept_id" : "oYPt_yRA_Smm",
        "country_concept_id" : "i46j_HmG_v64",
        "municipality_code" : "1280",
        "street_address" : "Malmö",
        "country" : "Sverige"
      },
      "id" : "26340209",
      "experience_required" : true,
      "working_hours_type" : {
        "concept_id" : "6YE1_gAC_R2G",
        "label" : "Heltid",
        "legacy_ams_taxonomy_id" : "1"
      },
      "access" : null,
      "timestamp" : 1658245470283,
      "must_have" : {
        "education_level" : [ ],
        "work_experiences" : [ ],
        "skills" : [ ],
        "education" : [ ],
        "languages" : [ ]
      },
      "occupation_field" : {
        "concept_id" : "j7Cq_ZJe_GkT",
        "label" : "Bygg och anläggning",
        "legacy_ams_taxonomy_id" : "2"
      },
      "scope_of_work" : {
        "min" : 0,
        "max" : 100
      },
      "salary_type" : {
        "concept_id" : "oG8G_9cW_nRf",
        "label" : "Fast månads- vecko- eller timlön",
        "legacy_ams_taxonomy_id" : "1"
      },
      "removed" : false,
      "salary_description" : null,
      "access_to_own_car" : false,
      "publication_date" : "2022-07-19T17:44:30"
    },
    "name" : "Entreprenadingenjör",
    "user" : "hannes"
  },
  "sha1" : "8e0b21e350b8be15f31210f38a3e222f3dfb5880",
  "annotations" : [ {
    "preferred-label" : "Entreprenadingenjör",
    "sentiment" : "MUST_HAVE",
    "type" : "occupation-name",
    "start-position" : 0,
    "end-position" : 19,
    "concept-id" : "namT_cva_UiK",
    "matched-string" : "entreprenadingenjör",
    "annotation-id" : 0
  }, {
    "preferred-label" : "Entreprenadingenjör",
    "sentiment" : "MUST_HAVE",
    "type" : "occupation-name",
    "start-position" : 438,
    "end-position" : 457,
    "concept-id" : "namT_cva_UiK",
    "matched-string" : "entreprenadingenjör",
    "annotation-id" : 1
  }, {
    "preferred-label" : "Entreprenadingenjör",
    "sentiment" : "MUST_HAVE",
    "type" : "occupation-name",
    "start-position" : 545,
    "end-position" : 564,
    "concept-id" : "namT_cva_UiK",
    "matched-string" : "entreprenadingenjör",
    "annotation-id" : 2
  }, {
    "preferred-label" : "projektledare",
    "type" : "esco-occupation",
    "start-position" : 998,
    "end-position" : 1011,
    "concept-id" : "nzMp_xN5_r6G",
    "matched-string" : "projektledare",
    "annotation-id" : 8
  }, {
    "preferred-label" : "Ekonomistyrning",
    "sentiment" : "MUST_HAVE",
    "type" : "skill",
    "start-position" : 1105,
    "end-position" : 1120,
    "concept-id" : "awjU_C3D_XEJ",
    "matched-string" : "ekonomistyrning",
    "annotation-id" : 3
  }, {
    "preferred-label" : "Ekonomi",
    "sentiment" : "MUST_HAVE",
    "type" : "keyword",
    "start-position" : 1184,
    "end-position" : 1191,
    "concept-id" : "PW4f_bmT_new",
    "matched-string" : "ekonomi",
    "annotation-id" : 4
  }, {
    "preferred-label" : "Entreprenadingenjör",
    "sentiment" : "MUST_HAVE",
    "type" : "occupation-name",
    "start-position" : 1717,
    "end-position" : 1736,
    "concept-id" : "namT_cva_UiK",
    "matched-string" : "entreprenadingenjör",
    "annotation-id" : 5
  }, {
    "preferred-label" : "Projektering",
    "sentiment" : "MUST_HAVE",
    "type" : "skill",
    "start-position" : 1764,
    "end-position" : 1776,
    "concept-id" : "zRtu_fYj_XC4",
    "matched-string" : "projektering",
    "annotation-id" : 6
  }, {
    "preferred-label" : "Entreprenadingenjör",
    "sentiment" : "MUST_HAVE",
    "type" : "occupation-name",
    "start-position" : 1879,
    "end-position" : 1898,
    "concept-id" : "namT_cva_UiK",
    "matched-string" : "entreprenadingenjör",
    "annotation-id" : 7
  }, {
    "preferred-label" : "Högskoleingenjörsutbildning, byggteknik",
    "type" : "keyword",
    "start-position" : 1926,
    "end-position" : 1963,
    "concept-id" : "sP52_Lyv_71S",
    "matched-string" : "Eftergymnasial byggteknisk utbildning",
    "annotation-id" : 9
  } ],
  "text" : "Entreprenadingenjör\nSunRoof är ett av de snabbast växande techbolagen i hela Europa. Vi erbjuder en intressant och spännande arbetsplats inom en framtidsbransch. På SunRoof sätter vi anställda först och har stora ambitioner gällande förnybar energi. Nu söker vi dig som vill bidra till samhällets positiva utveckling genom att blanda annat räkna på våra marknadsledande tak och fasader. Vi söker en självgående, ambitiös och kommunikativ entreprenadingenjör som vill åka med på SunRoofs enorma tillväxtresa.\n\n\nVi på på Sunroof söker nu efter en entreprenadingenjör som vill vara med och räkna på våra projekt, granska offerter och göra solcellsberäkningar.  Du kommer jobba med många olika kontaktytor och avdelningar. Grunden för tjänsten kommer vara att granska och planera att ekonomin stämmer i projekten.. Tjänsten kommer till en början att vara remote och sedan när vi utvecklar flera regionkontor så finns det möjlighet att vara på plats om man så önskar.\n\n\nArbetsuppgifter:\nTillsammans med projektledare se till att projekten från början till slut håller budget\nSe över mindre inköp, fakturor och ekonomistyrning i delgivna projekt.\nGranska målsättningarna i projekt gällande ekonomi.\nSammanställa efterkalkyl tillsammans med övriga.\nGranska offerter som förbereds till kund och offertförfrågningar.\nVara en samordnande länk mellan ekonomiavdelningen och det bygg-operativa.\nDelaktig i projekt-, resurs- och tidsplanering.\nKalkylarbete, förändringshantering och delaktighet i anbudsarbete\n\n\n\n\n\nBakgrund\nVi söker dig som kommunicerar och samarbetar lätt med andra. Du drivs av utveckling, föredrar att det kan gå snabbt mellan beslut och handling och är ekonomiskt medveten. Vi tror att du har en bakgrund som entreprenadingenjör och har du även jobbat med projektering sedan tidigare så är det ett stort plus men inte ett krav.\n\n\nKvalifikationer\nArbetslivserfarenhet som entreprenadingenjör och från arbete med kalkyl\nEftergymnasial byggteknisk utbildning är en fördel men inte ett krav.\nArbetar bra i team och samarbetar väl med andra.\nTidigare erfarenhet från att jobba i kalkylsystem och god administrativ förmåga.\nGod ekonomisk förståelse och medvetenhet\n\n\n\n\n\nKänner du att beskrivningen passar bra in på dig? Då får gärna söka då vi kommer tillsätta tjänsten så fort vi har hittat rätt kandidat."
}