{
  "meta" : {
    "jobad" : {
      "description" : {
        "requirements" : null,
        "needs" : null,
        "company_information" : null,
        "text_formatted" : "<p>Vi söker dig som vill jobba med potatisupptagning med start mitten av augusti fram till mitten/slutet av oktober. Man jobbar i potatisskörden på en upptagare ute i fält där man står och sorterar bort jord och sten.</p><p>På varje maskin jobbar 3-4 personer och vi har två maskiner som rullar så vi behöver vara 6-8 personer. Det innebär att man jobbar i team och hjälps åt.</p><p>B-körkort och bil är ett krav då man jobbar på olika platser på Mellersta Gotland dit man måste kunna ta sig själv. Ingen skjuts erbjuds och buss går inte.</p><p>Man måste också ha boende på Gotland, vi har ingen möjlighet att erbjuda bostad.  </p><p>God kommunikationsförmåga på antingen svenska eller engelska krävs.</p><p>Fälttoaletter och rastvagn finns.</p><p>Lön enligt kollektivavtal (Gröna arbetsgivare). Vi rekryterar löpande så skicka din ansökan via mail så fort som möjligt.</p><p>Om oss</p><p>Widegrens Gård bedriver ekologisk och KRAV godkänd morot, lök och potatisodling med eget packeri där vi tvättar, sorterar och förpackar både morot, potatis och lök. Övrig växtodling finns också i företaget. Vi är idag ett 30-tal medarbetare som jobbar året runt.</p>",
        "conditions" : null,
        "text" : "Vi söker dig som vill jobba med potatisupptagning med start mitten av augusti fram till mitten/slutet av oktober. Man jobbar i potatisskörden på en upptagare ute i fält där man står och sorterar bort jord och sten.\nPå varje maskin jobbar 3-4 personer och vi har två maskiner som rullar så vi behöver vara 6-8 personer. Det innebär att man jobbar i team och hjälps åt.\nB-körkort och bil är ett krav då man jobbar på olika platser på Mellersta Gotland dit man måste kunna ta sig själv. Ingen skjuts erbjuds och buss går inte.\nMan måste också ha boende på Gotland, vi har ingen möjlighet att erbjuda bostad.  \nGod kommunikationsförmåga på antingen svenska eller engelska krävs.\nFälttoaletter och rastvagn finns.\nLön enligt kollektivavtal (Gröna arbetsgivare). Vi rekryterar löpande så skicka din ansökan via mail så fort som möjligt.\nOm oss\nWidegrens Gård bedriver ekologisk och KRAV godkänd morot, lök och potatisodling med eget packeri där vi tvättar, sorterar och förpackar både morot, potatis och lök. Övrig växtodling finns också i företaget. Vi är idag ett 30-tal medarbetare som jobbar året runt."
      },
      "headline" : "Potatissorterare i fält ekologisk odling",
      "driving_license" : [ {
        "concept_id" : "VTK8_WRx_GcM",
        "label" : "B",
        "legacy_ams_taxonomy_id" : "3"
      } ],
      "employer" : {
        "email" : null,
        "phone_number" : null,
        "organization_number" : "5563050060",
        "name" : "Widegrens Gård AB",
        "url" : null,
        "workplace" : "Widegrens Gård AB"
      },
      "removed_date" : null,
      "logo_url" : "https://www.arbetsformedlingen.se/rest/arbetsgivare/rest/af/v3/arbetsplatser/83174054/logotyper/logo.png",
      "last_publication_date" : "2022-08-31T23:59:59",
      "number_of_vacancies" : 4,
      "occupation" : {
        "concept_id" : "V1QR_VzZ_vbj",
        "label" : "Växtskötare",
        "legacy_ams_taxonomy_id" : "2345"
      },
      "occupation_group" : {
        "concept_id" : "1EBv_UzM_ozQ",
        "label" : "Bärplockare och plantörer m.fl.",
        "legacy_ams_taxonomy_id" : "9210"
      },
      "employment_type" : {
        "concept_id" : "PFZr_Syz_cUq",
        "label" : "Vanlig anställning",
        "legacy_ams_taxonomy_id" : "1"
      },
      "webpage_url" : "https://arbetsformedlingen.se/platsbanken/annonser/26368955",
      "driving_license_required" : true,
      "application_contacts" : [ {
        "description" : null,
        "email" : "info@widegrens.se",
        "telephone" : "0707704080",
        "name" : "Olof  Ansén",
        "contact_type" : "Potatissorterare"
      } ],
      "duration" : {
        "concept_id" : "Sy9J_aRd_ALx",
        "label" : "11 dagar - upp till 3 månader",
        "legacy_ams_taxonomy_id" : "7"
      },
      "nice_to_have" : {
        "education_level" : [ ],
        "work_experiences" : [ ],
        "skills" : [ ],
        "education" : [ ],
        "languages" : [ ]
      },
      "application_details" : {
        "via_af" : false,
        "email" : "info@widegrens.se",
        "other" : null,
        "reference" : "Potatisupptagning",
        "url" : null,
        "information" : null
      },
      "source_type" : "VIA_ANNONSERA",
      "application_deadline" : "2022-08-31T23:59:59",
      "external_id" : null,
      "workplace_address" : {
        "coordinates" : [ 18.40461579904526, 57.48782223981236 ],
        "city" : "ROMAKLOSTER",
        "postcode" : "62240",
        "municipality" : "Gotland",
        "region_concept_id" : "K8iD_VQv_2BA",
        "region" : "Gotlands län",
        "country_code" : "199",
        "region_code" : "09",
        "municipality_concept_id" : "Ft9P_E8F_VLJ",
        "country_concept_id" : "i46j_HmG_v64",
        "municipality_code" : "0980",
        "street_address" : "ATLINGBO LILLA BJÖRKE",
        "country" : "Sverige"
      },
      "id" : "26368955",
      "experience_required" : false,
      "working_hours_type" : {
        "concept_id" : "6YE1_gAC_R2G",
        "label" : "Heltid",
        "legacy_ams_taxonomy_id" : "1"
      },
      "access" : null,
      "timestamp" : 1659362690311,
      "must_have" : {
        "education_level" : [ ],
        "work_experiences" : [ ],
        "skills" : [ ],
        "education" : [ ],
        "languages" : [ ]
      },
      "occupation_field" : {
        "concept_id" : "VuuL_7CH_adj",
        "label" : "Naturbruk",
        "legacy_ams_taxonomy_id" : "13"
      },
      "scope_of_work" : {
        "min" : 0,
        "max" : 100
      },
      "salary_type" : {
        "concept_id" : "oG8G_9cW_nRf",
        "label" : "Fast månads- vecko- eller timlön",
        "legacy_ams_taxonomy_id" : "1"
      },
      "removed" : false,
      "salary_description" : null,
      "access_to_own_car" : false,
      "publication_date" : "2022-08-01T16:04:50"
    },
    "name" : "Potatissorterare i fält ekologisk odling",
    "user" : "kristof.fischer"
  },
  "sha1" : "00c65201f25cde19bb04266393bc7144600f6f83",
  "annotations" : [ {
    "preferred-label" : null,
    "type" : "job-title",
    "start-position" : 0,
    "end-position" : 16,
    "concept-id" : null,
    "matched-string" : "Potatissorterare",
    "annotation-id" : 6
  }, {
    "preferred-label" : "Ekologisk odling",
    "sentiment" : "MUST_HAVE",
    "type" : "skill",
    "start-position" : 24,
    "end-position" : 40,
    "concept-id" : "Vig6_18E_ZVA",
    "matched-string" : "ekologisk odling",
    "annotation-id" : 0
  }, {
    "preferred-label" : "B",
    "sentiment" : "MUST_HAVE",
    "type" : "driving-licence",
    "start-position" : 409,
    "end-position" : 418,
    "concept-id" : "VTK8_WRx_GcM",
    "matched-string" : "B-körkort",
    "annotation-id" : 7
  }, {
    "preferred-label" : "Gotland",
    "type" : "municipality",
    "start-position" : 483,
    "end-position" : 490,
    "concept-id" : "Ft9P_E8F_VLJ",
    "matched-string" : "Gotland",
    "annotation-id" : 8
  }, {
    "preferred-label" : "Gotland",
    "type" : "municipality",
    "start-position" : 594,
    "end-position" : 601,
    "concept-id" : "Ft9P_E8F_VLJ",
    "matched-string" : "Gotland",
    "annotation-id" : 9
  }, {
    "preferred-label" : "kommunikation",
    "sentiment" : "MUST_HAVE",
    "type" : "esco-skill",
    "start-position" : 648,
    "end-position" : 673,
    "concept-id" : "ahPU_HgE_Jeb",
    "matched-string" : "God kommunikationsförmåga",
    "annotation-id" : 10
  }, {
    "preferred-label" : "Svenska",
    "sentiment" : "MUST_HAVE",
    "type" : "language",
    "start-position" : 686,
    "end-position" : 693,
    "concept-id" : "zSLA_vw2_FXN",
    "matched-string" : "svenska",
    "annotation-id" : 2
  }, {
    "preferred-label" : "Engelska",
    "sentiment" : "MUST_HAVE",
    "type" : "language",
    "start-position" : 700,
    "end-position" : 708,
    "concept-id" : "NVxJ_hLg_TYS",
    "matched-string" : "engelska",
    "annotation-id" : 3
  } ],
  "text" : "Potatissorterare i fält ekologisk odling\nVi söker dig som vill jobba med potatisupptagning med start mitten av augusti fram till mitten/slutet av oktober. Man jobbar i potatisskörden på en upptagare ute i fält där man står och sorterar bort jord och sten.\nPå varje maskin jobbar 3-4 personer och vi har två maskiner som rullar så vi behöver vara 6-8 personer. Det innebär att man jobbar i team och hjälps åt.\nB-körkort och bil är ett krav då man jobbar på olika platser på Mellersta Gotland dit man måste kunna ta sig själv. Ingen skjuts erbjuds och buss går inte.\nMan måste också ha boende på Gotland, vi har ingen möjlighet att erbjuda bostad.  \nGod kommunikationsförmåga på antingen svenska eller engelska krävs.\nFälttoaletter och rastvagn finns.\nLön enligt kollektivavtal (Gröna arbetsgivare). Vi rekryterar löpande så skicka din ansökan via mail så fort som möjligt.\nOm oss\nWidegrens Gård bedriver ekologisk och KRAV godkänd morot, lök och potatisodling med eget packeri där vi tvättar, sorterar och förpackar både morot, potatis och lök. Övrig växtodling finns också i företaget. Vi är idag ett 30-tal medarbetare som jobbar året runt."
}