{
  "meta" : {
    "jobad" : {
      "description" : {
        "requirements" : null,
        "needs" : null,
        "company_information" : null,
        "text_formatted" : "<p>Stiftelsen ERK som är fristående huvudman för Sverigefinska skolan med årskurserna F-6 samt förskolan Pikku-Erkki grundades 1993. Verksamheten är tvåspråkig och icke-vinstdrivande. Verksamheten drivs i den egna byggnaden på Vasbergsgatan 5 i Eskilstuna, en vacker, centralt belägen, anrik gammal skolbyggnad. I skolan finns ca. 100 elever inskrivna i verksamheten. Stiftelsens uppgift är det finska språkets bevarande i Eskilstuna och Sverige och målsättningen är att lära eleverna finska och svenska på en nivå som möjliggör en aktiv tvåspråkighet samt stöttar deras sverigefinska identitetsutveckling.</p><p>Vi söker dig som är behörig att undervisa i musik åk 1-6. Du är en engagerad och driven pedagog som entusiasmerar och inspirerar. Det är viktigt att du har ett inkluderande synsätt och en förmåga att se hur du bäst kan tillgodose den enskilde elevens behov.</p><p>Du tycker om att ta en ledande roll i skolans olika aktiviteter där musik är ett viktigt inslag, såsom avslutningar, Lucia och andra evenemang. Musiken är ett viktigt redskap för oss på skolan för att främja den sverigefinska identiteten och kulturen hos eleverna, därför ser vi gärna att om du själv inte innehar den bakgrunden, ändå kan vidareutveckla dig själv inom den finska och sverigefinska musikkulturen med stöd av kollegor.</p><p>Det är viktigt att du har goda ledaregenskaper, ett positivt förhållningssätt, höga förväntningar, är flexibel, ser möjligheter framför hinder. Vidare är du inriktad på att arbeta mål- och resultatinriktat, kan arbeta både enskilt och tillsammans med andra, du arbetar aktivt för att utveckla verksamheten. Att bygga relationer med elever, vårdnadshavare och kollegor är något du ser som självklart.</p><p>Du kommer att planera, genomföra, dokumentera och utvärdera undervisningen och verksamheten enligt gällande styrdokument.</p><p>Tjänsten är en tillsvidaretjänst på deltid (20%) med 6 månaders provanställning.</p><p>Tillträde 15 augusti 2022 eller enligt överenskommelse.</p><p>Skicka in din ansökan snarast innehållande CV och personligt brev, då vi kommer att kalla till intervjuer löpande och kan komma att tillsätta tjänsten före sista ansökningsdag.</p><p>Enligt lag behöver du visa upp ett utdrag från belastningsregistret som du kan beställa via polisens hemsida.</p><p>Varmt välkommen med din ansökan!</p><p>Vi undanber oss erbjudanden om annonserings- och rekryteringshjälp.</p>",
        "conditions" : null,
        "text" : "Stiftelsen ERK som är fristående huvudman för Sverigefinska skolan med årskurserna F-6 samt förskolan Pikku-Erkki grundades 1993. Verksamheten är tvåspråkig och icke-vinstdrivande. Verksamheten drivs i den egna byggnaden på Vasbergsgatan 5 i Eskilstuna, en vacker, centralt belägen, anrik gammal skolbyggnad. I skolan finns ca. 100 elever inskrivna i verksamheten. Stiftelsens uppgift är det finska språkets bevarande i Eskilstuna och Sverige och målsättningen är att lära eleverna finska och svenska på en nivå som möjliggör en aktiv tvåspråkighet samt stöttar deras sverigefinska identitetsutveckling.\nVi söker dig som är behörig att undervisa i musik åk 1-6. Du är en engagerad och driven pedagog som entusiasmerar och inspirerar. Det är viktigt att du har ett inkluderande synsätt och en förmåga att se hur du bäst kan tillgodose den enskilde elevens behov.\nDu tycker om att ta en ledande roll i skolans olika aktiviteter där musik är ett viktigt inslag, såsom avslutningar, Lucia och andra evenemang. Musiken är ett viktigt redskap för oss på skolan för att främja den sverigefinska identiteten och kulturen hos eleverna, därför ser vi gärna att om du själv inte innehar den bakgrunden, ändå kan vidareutveckla dig själv inom den finska och sverigefinska musikkulturen med stöd av kollegor.\nDet är viktigt att du har goda ledaregenskaper, ett positivt förhållningssätt, höga förväntningar, är flexibel, ser möjligheter framför hinder. Vidare är du inriktad på att arbeta mål- och resultatinriktat, kan arbeta både enskilt och tillsammans med andra, du arbetar aktivt för att utveckla verksamheten. Att bygga relationer med elever, vårdnadshavare och kollegor är något du ser som självklart.\nDu kommer att planera, genomföra, dokumentera och utvärdera undervisningen och verksamheten enligt gällande styrdokument.\nTjänsten är en tillsvidaretjänst på deltid (20%) med 6 månaders provanställning.\nTillträde 15 augusti 2022 eller enligt överenskommelse.\nSkicka in din ansökan snarast innehållande CV och personligt brev, då vi kommer att kalla till intervjuer löpande och kan komma att tillsätta tjänsten före sista ansökningsdag.\nEnligt lag behöver du visa upp ett utdrag från belastningsregistret som du kan beställa via polisens hemsida.\nVarmt välkommen med din ansökan!\nVi undanber oss erbjudanden om annonserings- och rekryteringshjälp."
      },
      "headline" : "Musiklärare till Sverigefinska skolan",
      "driving_license" : null,
      "employer" : {
        "email" : null,
        "phone_number" : null,
        "organization_number" : "8180013396",
        "name" : "Stift Sverigefinska Skolan i Sverige /Erk/",
        "url" : "http://www.erk.se",
        "workplace" : "SVERIGEFINSKA SKOLAN I ESKILSTUNA"
      },
      "removed_date" : null,
      "logo_url" : "https://www.arbetsformedlingen.se/rest/arbetsgivare/rest/af/v3/arbetsplatser/80973851/logotyper/logo.png",
      "last_publication_date" : "2022-08-07T23:59:59",
      "number_of_vacancies" : 1,
      "occupation" : {
        "concept_id" : "zrQ9_1z2_kT3",
        "label" : "Musikpedagog/Musiklärare",
        "legacy_ams_taxonomy_id" : "3617"
      },
      "occupation_group" : {
        "concept_id" : "mcRJ_kq2_jFr",
        "label" : "Övriga pedagoger med teoretisk specialistkompetens",
        "legacy_ams_taxonomy_id" : "2359"
      },
      "employment_type" : {
        "concept_id" : "PFZr_Syz_cUq",
        "label" : "Vanlig anställning",
        "legacy_ams_taxonomy_id" : "1"
      },
      "webpage_url" : "https://arbetsformedlingen.se/platsbanken/annonser/26350243",
      "driving_license_required" : false,
      "application_contacts" : [ {
        "description" : null,
        "email" : "hanna.vallden@erk.se",
        "telephone" : "0707379494",
        "name" : "Hanna Valldén",
        "contact_type" : "Rektor"
      } ],
      "duration" : {
        "concept_id" : "a7uU_j21_mkL",
        "label" : "Tills vidare",
        "legacy_ams_taxonomy_id" : "1"
      },
      "nice_to_have" : {
        "education_level" : [ ],
        "work_experiences" : [ ],
        "skills" : [ ],
        "education" : [ ],
        "languages" : [ ]
      },
      "application_details" : {
        "via_af" : false,
        "email" : "ansokan@erk.se",
        "other" : null,
        "reference" : "Musiklärare",
        "url" : null,
        "information" : null
      },
      "source_type" : "VIA_ANNONSERA",
      "application_deadline" : "2022-08-07T23:59:59",
      "external_id" : null,
      "workplace_address" : {
        "coordinates" : [ 16.517217669614375, 59.37639250998374 ],
        "city" : "Eskilstuna",
        "postcode" : "63343",
        "municipality" : "Eskilstuna",
        "region_concept_id" : "s93u_BEb_sx2",
        "region" : "Södermanlands län",
        "country_code" : "199",
        "region_code" : "04",
        "municipality_concept_id" : "kMxr_NiX_YrU",
        "country_concept_id" : "i46j_HmG_v64",
        "municipality_code" : "0484",
        "street_address" : "VASBERGSGATAN 5",
        "country" : "Sverige"
      },
      "id" : "26350243",
      "experience_required" : true,
      "working_hours_type" : {
        "concept_id" : "947z_JGS_Uk2",
        "label" : "Deltid",
        "legacy_ams_taxonomy_id" : "2"
      },
      "access" : null,
      "timestamp" : 1658737380291,
      "must_have" : {
        "education_level" : [ ],
        "work_experiences" : [ ],
        "skills" : [ {
          "concept_id" : "zJZd_pDs_SDf",
          "weight" : 10,
          "label" : "Lärarexamen",
          "legacy_ams_taxonomy_id" : "608391"
        } ],
        "education" : [ ],
        "languages" : [ ]
      },
      "occupation_field" : {
        "concept_id" : "MVqp_eS8_kDZ",
        "label" : "Pedagogik",
        "legacy_ams_taxonomy_id" : "15"
      },
      "scope_of_work" : {
        "min" : 15,
        "max" : 20
      },
      "salary_type" : {
        "concept_id" : "oG8G_9cW_nRf",
        "label" : "Fast månads- vecko- eller timlön",
        "legacy_ams_taxonomy_id" : "1"
      },
      "removed" : false,
      "salary_description" : null,
      "access_to_own_car" : false,
      "publication_date" : "2022-07-25T10:23:00"
    },
    "name" : "Musiklärare till Sverigefinska skolan",
    "user" : "kristof.fischer"
  },
  "sha1" : "e5a83ff0a7119122aca1a05977968727f0f5d523",
  "annotations" : [ {
    "preferred-label" : "Musikpedagog/Musiklärare",
    "sentiment" : "MUST_HAVE",
    "type" : "occupation-name",
    "start-position" : 0,
    "end-position" : 11,
    "concept-id" : "zrQ9_1z2_kT3",
    "matched-string" : "musiklärare",
    "annotation-id" : 0
  }, {
    "preferred-label" : "Eskilstuna",
    "type" : "municipality",
    "start-position" : 280,
    "end-position" : 290,
    "concept-id" : "kMxr_NiX_YrU",
    "matched-string" : "Eskilstuna",
    "annotation-id" : 7
  }, {
    "preferred-label" : "Finska",
    "type" : "language",
    "start-position" : 430,
    "end-position" : 445,
    "concept-id" : "Swhq_4Fg_qfm",
    "matched-string" : "finska språkets",
    "annotation-id" : 10
  }, {
    "preferred-label" : "Eskilstuna",
    "type" : "municipality",
    "start-position" : 458,
    "end-position" : 468,
    "concept-id" : "kMxr_NiX_YrU",
    "matched-string" : "Eskilstuna",
    "annotation-id" : 8
  }, {
    "preferred-label" : "Sverige",
    "type" : "country",
    "start-position" : 473,
    "end-position" : 480,
    "concept-id" : "i46j_HmG_v64",
    "matched-string" : "Sverige",
    "annotation-id" : 9
  }, {
    "preferred-label" : "Finska",
    "sentiment" : "MUST_HAVE",
    "type" : "language",
    "start-position" : 520,
    "end-position" : 526,
    "concept-id" : "Swhq_4Fg_qfm",
    "matched-string" : "finska",
    "annotation-id" : 2
  }, {
    "preferred-label" : "Svenska",
    "sentiment" : "MUST_HAVE",
    "type" : "language",
    "start-position" : 531,
    "end-position" : 538,
    "concept-id" : "zSLA_vw2_FXN",
    "matched-string" : "svenska",
    "annotation-id" : 3
  }, {
    "preferred-label" : "Musikpedagog/Musiklärare",
    "sentiment" : "MUST_HAVE",
    "type" : "occupation-name",
    "start-position" : 662,
    "end-position" : 698,
    "concept-id" : "zrQ9_1z2_kT3",
    "matched-string" : "behörig att undervisa i musik åk 1-6",
    "annotation-id" : 11
  }, {
    "preferred-label" : null,
    "sentiment" : "MUST_HAVE",
    "type" : "skill",
    "start-position" : 857,
    "end-position" : 898,
    "concept-id" : null,
    "matched-string" : "kan tillgodose den enskilde elevens behov",
    "annotation-id" : 12
  }, {
    "preferred-label" : "Pedagogiskt ledarskap",
    "sentiment" : "MUST_HAVE",
    "type" : "skill",
    "start-position" : 1365,
    "end-position" : 1380,
    "concept-id" : "5PjX_999_uLZ",
    "matched-string" : "ledaregenskaper",
    "annotation-id" : 13
  }, {
    "preferred-label" : "upprätthålla arbetsmässiga relationer",
    "sentiment" : "MUST_HAVE",
    "type" : "esco-skill",
    "start-position" : 1645,
    "end-position" : 1661,
    "concept-id" : "FSSe_5dD_kXc",
    "matched-string" : "bygga relationer",
    "annotation-id" : 14
  }, {
    "preferred-label" : "Tillsvidareanställning (inkl. eventuell provanställning)",
    "type" : "employment-type",
    "start-position" : 1871,
    "end-position" : 1888,
    "concept-id" : "kpPX_CNN_gDU",
    "matched-string" : "tillsvidaretjänst",
    "annotation-id" : 15
  }, {
    "preferred-label" : "Deltid",
    "type" : "worktime-extent",
    "start-position" : 1892,
    "end-position" : 1898,
    "concept-id" : "947z_JGS_Uk2",
    "matched-string" : "deltid",
    "annotation-id" : 16
  } ],
  "text" : "Musiklärare till Sverigefinska skolan\nStiftelsen ERK som är fristående huvudman för Sverigefinska skolan med årskurserna F-6 samt förskolan Pikku-Erkki grundades 1993. Verksamheten är tvåspråkig och icke-vinstdrivande. Verksamheten drivs i den egna byggnaden på Vasbergsgatan 5 i Eskilstuna, en vacker, centralt belägen, anrik gammal skolbyggnad. I skolan finns ca. 100 elever inskrivna i verksamheten. Stiftelsens uppgift är det finska språkets bevarande i Eskilstuna och Sverige och målsättningen är att lära eleverna finska och svenska på en nivå som möjliggör en aktiv tvåspråkighet samt stöttar deras sverigefinska identitetsutveckling.\nVi söker dig som är behörig att undervisa i musik åk 1-6. Du är en engagerad och driven pedagog som entusiasmerar och inspirerar. Det är viktigt att du har ett inkluderande synsätt och en förmåga att se hur du bäst kan tillgodose den enskilde elevens behov.\nDu tycker om att ta en ledande roll i skolans olika aktiviteter där musik är ett viktigt inslag, såsom avslutningar, Lucia och andra evenemang. Musiken är ett viktigt redskap för oss på skolan för att främja den sverigefinska identiteten och kulturen hos eleverna, därför ser vi gärna att om du själv inte innehar den bakgrunden, ändå kan vidareutveckla dig själv inom den finska och sverigefinska musikkulturen med stöd av kollegor.\nDet är viktigt att du har goda ledaregenskaper, ett positivt förhållningssätt, höga förväntningar, är flexibel, ser möjligheter framför hinder. Vidare är du inriktad på att arbeta mål- och resultatinriktat, kan arbeta både enskilt och tillsammans med andra, du arbetar aktivt för att utveckla verksamheten. Att bygga relationer med elever, vårdnadshavare och kollegor är något du ser som självklart.\nDu kommer att planera, genomföra, dokumentera och utvärdera undervisningen och verksamheten enligt gällande styrdokument.\nTjänsten är en tillsvidaretjänst på deltid (20%) med 6 månaders provanställning.\nTillträde 15 augusti 2022 eller enligt överenskommelse.\nSkicka in din ansökan snarast innehållande CV och personligt brev, då vi kommer att kalla till intervjuer löpande och kan komma att tillsätta tjänsten före sista ansökningsdag.\nEnligt lag behöver du visa upp ett utdrag från belastningsregistret som du kan beställa via polisens hemsida.\nVarmt välkommen med din ansökan!\nVi undanber oss erbjudanden om annonserings- och rekryteringshjälp."
}