{
  "meta" : {
    "jobad" : {
      "description" : {
        "requirements" : null,
        "needs" : null,
        "company_information" : null,
        "text_formatted" : "Länsstyrelsen i Dalarnas län är en statlig myndighet som finns nära människorna i vårt län. Vi är en viktig länk mellan länet och regeringen, riksdagen och andra myndigheter. Vår uppgift är att säkerställa att nationella mål och uppdrag genomförs regionalt och med hänsyn till förutsättningarna i just vårt län. Vårt arbete bygger på en samsyn kring mål och prioriteringar och utgår från de fyra ledorden rättssäkerhet, kunskap, samarbete och bra bemötande.\n\nLänsstyrelsen söker ny medarbetare till enheten för kulturmiljö och samhällsplanering med god erfarenhet av arbete med byggnadsvård och kulturmiljöer. \r\n\r\nARBETSUPPGIFTER\nDu kommer att i nära samarbete med våra övriga kulturmiljövårdare arbeta med Dalarnas kulturhistoriska byggnader, bebyggelsemiljöer och kulturlandskap utifrån gällande lagstiftning och nationella och regionala mål och strategier. Du kommer att arbeta tvärsektoriellt i olika samhällsfrågor med andra sakområden på myndigheten.\n\nSom byggnadsantikvarie kommer du att:\n•handlägga frågor om kyrkor, kyrkliga miljöer, kulturhistoriskt värdefull bebyggelse, kulturlandskap samt bidrag\n•företräda kulturmiljöfrågor i samråd om samhällsplanerings- och i utvecklingsfrågor\n•ta fram kunskapsunderlag kopplade till kulturhistorisk bebyggelse och kulturmiljöer.\r\n\r\nKVALIFIKATIONER\nKrav\n•Du har högskoleutbildning med bebyggelseantikvarisk inriktning. \n•Du har arbetslivserfarenhet av byggnadsantikvariskt arbete.\n•Du har goda kunskaper om kulturmiljölagen och aktuella delar av miljöbalken och plan- och bygglagen.\n•Du har B-körkort\n\nMeriterande\n•Du har arbetserfarenhet av ärendehandläggning av kulturhistorisk bebyggelse och kulturlandskap, byggnadsvård och samhällsplanering.\n•Du har erfarenhet av att utarbeta kunskapsunderlag och/eller kulturmiljöprogram för den fysiska samhällsplaneringen.\n•Du har annan relevant högskoleutbildning, som kulturgeografi, kulturmiljövetenskap, kulturminnesvård, samhällsplanering, kyrkohistoria, m.m.\n\nPersonliga egenskaper\n•Du ska ha lätt för att uttrycka dig i tal och skrift på svenska. \n•Du kommer att ingå i en arbetsgrupp och bidra till gruppens samlade arbete. \n•Du behöver ha ett gott omdöme, vara strukturerad och serviceinriktad, ha god samarbetsförmåga och bidra till ett gott och öppet arbetsklimat i enlighet med vår värdegrund. \nVi lägger stor vikt vid dina personliga egenskaper och referenser.\r\n\nÖVRIGT\nLänsstyrelsen arbetar för att erbjuda en attraktiv arbetsplats som är fri från diskriminering och för att ge alla lika möjligheter. Vi tar gärna emot samtal från dig som är intresserad av jobbet, men vi tackar nej till dig som säljer annonser och rekryteringstjänster.\n\nLänsstyrelsen har en viktig samordnande roll vid samhällsstörningar och därmed ingår samtliga anställda i kris- och krigsorganisationen. \nVissa av våra tjänster är säkerhetsklassade vilket innebär att säkerhetsprövning då kommer att genomföras innan anställning. \n\nVi kan erbjuda medflyttarservice via rekryteringslots Dalarna.",
        "conditions" : "Heltid. \r\nTillsvidareanställning, tillträde: Under hösten eller enligt överenskommelse. \nVi tillämpar provanställning med sex månader. .",
        "text" : "Länsstyrelsen i Dalarnas län är en statlig myndighet som finns nära människorna i vårt län. Vi är en viktig länk mellan länet och regeringen, riksdagen och andra myndigheter. Vår uppgift är att säkerställa att nationella mål och uppdrag genomförs regionalt och med hänsyn till förutsättningarna i just vårt län. Vårt arbete bygger på en samsyn kring mål och prioriteringar och utgår från de fyra ledorden rättssäkerhet, kunskap, samarbete och bra bemötande.\n\nLänsstyrelsen söker ny medarbetare till enheten för kulturmiljö och samhällsplanering med god erfarenhet av arbete med byggnadsvård och kulturmiljöer. \r\n\r\nARBETSUPPGIFTER\nDu kommer att i nära samarbete med våra övriga kulturmiljövårdare arbeta med Dalarnas kulturhistoriska byggnader, bebyggelsemiljöer och kulturlandskap utifrån gällande lagstiftning och nationella och regionala mål och strategier. Du kommer att arbeta tvärsektoriellt i olika samhällsfrågor med andra sakområden på myndigheten.\n\nSom byggnadsantikvarie kommer du att:\n•handlägga frågor om kyrkor, kyrkliga miljöer, kulturhistoriskt värdefull bebyggelse, kulturlandskap samt bidrag\n•företräda kulturmiljöfrågor i samråd om samhällsplanerings- och i utvecklingsfrågor\n•ta fram kunskapsunderlag kopplade till kulturhistorisk bebyggelse och kulturmiljöer.\r\n\r\nKVALIFIKATIONER\nKrav\n•Du har högskoleutbildning med bebyggelseantikvarisk inriktning. \n•Du har arbetslivserfarenhet av byggnadsantikvariskt arbete.\n•Du har goda kunskaper om kulturmiljölagen och aktuella delar av miljöbalken och plan- och bygglagen.\n•Du har B-körkort\n\nMeriterande\n•Du har arbetserfarenhet av ärendehandläggning av kulturhistorisk bebyggelse och kulturlandskap, byggnadsvård och samhällsplanering.\n•Du har erfarenhet av att utarbeta kunskapsunderlag och/eller kulturmiljöprogram för den fysiska samhällsplaneringen.\n•Du har annan relevant högskoleutbildning, som kulturgeografi, kulturmiljövetenskap, kulturminnesvård, samhällsplanering, kyrkohistoria, m.m.\n\nPersonliga egenskaper\n•Du ska ha lätt för att uttrycka dig i tal och skrift på svenska. \n•Du kommer att ingå i en arbetsgrupp och bidra till gruppens samlade arbete. \n•Du behöver ha ett gott omdöme, vara strukturerad och serviceinriktad, ha god samarbetsförmåga och bidra till ett gott och öppet arbetsklimat i enlighet med vår värdegrund. \nVi lägger stor vikt vid dina personliga egenskaper och referenser.\r\n\nÖVRIGT\nLänsstyrelsen arbetar för att erbjuda en attraktiv arbetsplats som är fri från diskriminering och för att ge alla lika möjligheter. Vi tar gärna emot samtal från dig som är intresserad av jobbet, men vi tackar nej till dig som säljer annonser och rekryteringstjänster.\n\nLänsstyrelsen har en viktig samordnande roll vid samhällsstörningar och därmed ingår samtliga anställda i kris- och krigsorganisationen. \nVissa av våra tjänster är säkerhetsklassade vilket innebär att säkerhetsprövning då kommer att genomföras innan anställning. \n\nVi kan erbjuda medflyttarservice via rekryteringslots Dalarna."
      },
      "headline" : "Byggnadsantikvarie",
      "driving_license" : [ {
        "concept_id" : "VTK8_WRx_GcM",
        "label" : "B",
        "legacy_ams_taxonomy_id" : "3"
      } ],
      "employer" : {
        "email" : null,
        "phone_number" : null,
        "organization_number" : "2021002429",
        "name" : "Länsstyrelsen i Dalarnas län",
        "url" : null,
        "workplace" : "Länsstyrelsen Dalarnas län, Länsstyrelsen i Dalarnas län"
      },
      "removed_date" : null,
      "logo_url" : "https://www.arbetsformedlingen.se/rest/arbetsgivare/rest/af/v3/organisation/2021002429/logotyper/logo.png",
      "last_publication_date" : "2022-07-17T23:59:59",
      "number_of_vacancies" : 1,
      "occupation" : {
        "concept_id" : "ijoc_xYk_hmR",
        "label" : "Bebyggelseantikvarie",
        "legacy_ams_taxonomy_id" : "5313"
      },
      "occupation_group" : {
        "concept_id" : "Qbvf_6nd_Esn",
        "label" : "Museiintendenter m.fl.",
        "legacy_ams_taxonomy_id" : "2621"
      },
      "employment_type" : {
        "concept_id" : "PFZr_Syz_cUq",
        "label" : "Vanlig anställning",
        "legacy_ams_taxonomy_id" : "1"
      },
      "webpage_url" : "https://arbetsformedlingen.se/platsbanken/annonser/26239054",
      "driving_license_required" : true,
      "application_contacts" : [ {
        "description" : "Åsa Lindqvist",
        "email" : "asa.lindqvist@lansstyrelsen.se",
        "telephone" : "010-2250496",
        "name" : null,
        "contact_type" : "Enhetschef"
      } ],
      "duration" : {
        "concept_id" : "a7uU_j21_mkL",
        "label" : "Tills vidare",
        "legacy_ams_taxonomy_id" : "1"
      },
      "nice_to_have" : {
        "education_level" : [ ],
        "work_experiences" : [ ],
        "skills" : [ ],
        "education" : [ ],
        "languages" : [ ]
      },
      "application_details" : {
        "via_af" : false,
        "email" : null,
        "other" : null,
        "reference" : "112-9270-2022",
        "url" : "https://recruit.visma.com/Public/Apply.aspx?guidAssignment=a337afd7-6b09-45de-9d88-ccd9111d8a90&publishCode=AMS&TK=e564cc5f-05ce-49b3-99e4-6cd3d5da7f67",
        "information" : null
      },
      "source_type" : "VIA_PLATSBANKEN_DXA",
      "application_deadline" : "2022-07-17T23:59:59",
      "external_id" : "46-202100-2429-A337AFD76B0945DE9D88CCD9111D8A90",
      "workplace_address" : {
        "coordinates" : [ 15.6355, 60.60646 ],
        "city" : null,
        "postcode" : null,
        "municipality" : "Falun",
        "region_concept_id" : "oDpK_oZ2_WYt",
        "region" : "Dalarnas län",
        "country_code" : "199",
        "region_code" : "20",
        "municipality_concept_id" : "N1wJ_Cuu_7Cs",
        "country_concept_id" : "i46j_HmG_v64",
        "municipality_code" : "2080",
        "street_address" : null,
        "country" : "Sverige"
      },
      "id" : "26239054",
      "experience_required" : true,
      "working_hours_type" : {
        "concept_id" : "6YE1_gAC_R2G",
        "label" : "Heltid",
        "legacy_ams_taxonomy_id" : "1"
      },
      "access" : null,
      "timestamp" : 1655737520626,
      "must_have" : {
        "education_level" : [ ],
        "work_experiences" : [ {
          "concept_id" : "ijoc_xYk_hmR",
          "weight" : 10,
          "label" : "Bebyggelseantikvarie",
          "legacy_ams_taxonomy_id" : "5313"
        } ],
        "skills" : [ ],
        "education" : [ ],
        "languages" : [ ]
      },
      "occupation_field" : {
        "concept_id" : "9puE_nYg_crq",
        "label" : "Kultur, media, design",
        "legacy_ams_taxonomy_id" : "11"
      },
      "scope_of_work" : {
        "min" : 100,
        "max" : 100
      },
      "salary_type" : {
        "concept_id" : "oG8G_9cW_nRf",
        "label" : "Fast månads- vecko- eller timlön",
        "legacy_ams_taxonomy_id" : "1"
      },
      "removed" : false,
      "salary_description" : "Månadslön",
      "access_to_own_car" : false,
      "publication_date" : "2022-06-20T17:05:20"
    },
    "name" : "Byggnadsantikvarie",
    "user" : "hannes"
  },
  "sha1" : "454c4d4d198fba391a0695627bcbb1507de3d5f4",
  "annotations" : [ {
    "preferred-label" : "Byggnadsantikvarie",
    "sentiment" : "MUST_HAVE",
    "type" : "keyword",
    "start-position" : 0,
    "end-position" : 18,
    "concept-id" : "gv3f_7Fh_X3e",
    "matched-string" : "byggnadsantikvarie",
    "annotation-id" : 0
  }, {
    "preferred-label" : "Dalarnas län",
    "type" : "region",
    "start-position" : 35,
    "end-position" : 47,
    "concept-id" : "oDpK_oZ2_WYt",
    "matched-string" : "Dalarnas län",
    "annotation-id" : 9
  }, {
    "preferred-label" : "Samhällsplanering",
    "sentiment" : "MUST_HAVE",
    "type" : "skill",
    "start-position" : 546,
    "end-position" : 563,
    "concept-id" : "5FMU_Dt4_2hF",
    "matched-string" : "samhällsplanering",
    "annotation-id" : 1
  }, {
    "preferred-label" : "byggnadsvård",
    "sentiment" : "MUST_HAVE",
    "type" : "esco-skill",
    "start-position" : 597,
    "end-position" : 609,
    "concept-id" : "Tk44_CrF_B33",
    "matched-string" : "byggnadsvård",
    "annotation-id" : 2
  }, {
    "preferred-label" : "Kulturmiljövård",
    "type" : "skill",
    "start-position" : 696,
    "end-position" : 714,
    "concept-id" : "XRfU_bRB_DwH",
    "matched-string" : "kulturmiljövårdare",
    "annotation-id" : 10
  }, {
    "preferred-label" : "kulturhistoria",
    "type" : "esco-skill",
    "start-position" : 735,
    "end-position" : 751,
    "concept-id" : "FMUN_KzQ_KrA",
    "matched-string" : "kulturhistoriska",
    "annotation-id" : 11
  }, {
    "preferred-label" : "Byggnadsantikvarie",
    "sentiment" : "MUST_HAVE",
    "type" : "keyword",
    "start-position" : 981,
    "end-position" : 999,
    "concept-id" : "gv3f_7Fh_X3e",
    "matched-string" : "byggnadsantikvarie",
    "annotation-id" : 3
  }, {
    "preferred-label" : "Handläggare, offentlig förvaltning/Utredare, offentlig förvaltning",
    "type" : "occupation-name",
    "start-position" : 1016,
    "end-position" : 1025,
    "concept-id" : "YG1s_tUg_jWJ",
    "matched-string" : "handlägga",
    "annotation-id" : 12
  }, {
    "preferred-label" : "Kyrkan",
    "type" : "keyword",
    "start-position" : 1036,
    "end-position" : 1042,
    "concept-id" : "h4LF_GE3_FGu",
    "matched-string" : "kyrkor",
    "annotation-id" : 13
  }, {
    "preferred-label" : "Kyrkan",
    "type" : "keyword",
    "start-position" : 1044,
    "end-position" : 1052,
    "concept-id" : "h4LF_GE3_FGu",
    "matched-string" : "kyrkliga",
    "annotation-id" : 14
  }, {
    "preferred-label" : "kulturhistoria",
    "type" : "esco-skill",
    "start-position" : 1062,
    "end-position" : 1078,
    "concept-id" : "FMUN_KzQ_KrA",
    "matched-string" : "kulturhistoriskt",
    "annotation-id" : 15
  }, {
    "preferred-label" : "Samhällsplanering",
    "type" : "skill",
    "start-position" : 1169,
    "end-position" : 1187,
    "concept-id" : "5FMU_Dt4_2hF",
    "matched-string" : "samhällsplanerings",
    "annotation-id" : 16
  }, {
    "preferred-label" : "kulturhistoria",
    "type" : "esco-skill",
    "start-position" : 1253,
    "end-position" : 1268,
    "concept-id" : "FMUN_KzQ_KrA",
    "matched-string" : "kulturhistorisk",
    "annotation-id" : 17
  }, {
    "preferred-label" : "Bebyggelseantikvarieutbildning",
    "type" : "keyword",
    "start-position" : 1331,
    "end-position" : 1386,
    "concept-id" : "ccEo_ska_zuZ",
    "matched-string" : "högskoleutbildning med bebyggelseantikvarisk inriktning",
    "annotation-id" : 18
  }, {
    "preferred-label" : "Byggnadsantikvarie",
    "type" : "keyword",
    "start-position" : 1421,
    "end-position" : 1441,
    "concept-id" : "gv3f_7Fh_X3e",
    "matched-string" : "byggnadsantikvariskt",
    "annotation-id" : 19
  }, {
    "preferred-label" : "B",
    "type" : "driving-licence",
    "start-position" : 1560,
    "end-position" : 1569,
    "concept-id" : "VTK8_WRx_GcM",
    "matched-string" : "B-körkort",
    "annotation-id" : 20
  }, {
    "preferred-label" : "kulturhistoria",
    "type" : "esco-skill",
    "start-position" : 1633,
    "end-position" : 1648,
    "concept-id" : "FMUN_KzQ_KrA",
    "matched-string" : "kulturhistorisk",
    "annotation-id" : 21
  }, {
    "preferred-label" : "byggnadsvård",
    "sentiment" : "MUST_HAVE",
    "type" : "esco-skill",
    "start-position" : 1680,
    "end-position" : 1692,
    "concept-id" : "Tk44_CrF_B33",
    "matched-string" : "byggnadsvård",
    "annotation-id" : 4
  }, {
    "preferred-label" : "Samhällsplanering",
    "sentiment" : "MUST_HAVE",
    "type" : "skill",
    "start-position" : 1697,
    "end-position" : 1714,
    "concept-id" : "5FMU_Dt4_2hF",
    "matched-string" : "samhällsplanering",
    "annotation-id" : 5
  }, {
    "preferred-label" : "Kulturgeografi",
    "sentiment" : "MUST_HAVE",
    "type" : "keyword",
    "start-position" : 1881,
    "end-position" : 1895,
    "concept-id" : "Eayw_i4b_qgS",
    "matched-string" : "kulturgeografi",
    "annotation-id" : 6
  }, {
    "preferred-label" : "Samhällsplanering",
    "sentiment" : "MUST_HAVE",
    "type" : "skill",
    "start-position" : 1937,
    "end-position" : 1954,
    "concept-id" : "5FMU_Dt4_2hF",
    "matched-string" : "samhällsplanering",
    "annotation-id" : 7
  }, {
    "preferred-label" : "Svenska",
    "sentiment" : "MUST_HAVE",
    "type" : "language",
    "start-position" : 2056,
    "end-position" : 2063,
    "concept-id" : "zSLA_vw2_FXN",
    "matched-string" : "svenska",
    "annotation-id" : 8
  }, {
    "preferred-label" : "samarbeta med kolleger",
    "type" : "esco-skill",
    "start-position" : 2222,
    "end-position" : 2238,
    "concept-id" : "X15R_797_q62",
    "matched-string" : "samarbetsförmåga",
    "annotation-id" : 22
  } ],
  "text" : "Byggnadsantikvarie\nLänsstyrelsen i Dalarnas län är en statlig myndighet som finns nära människorna i vårt län. Vi är en viktig länk mellan länet och regeringen, riksdagen och andra myndigheter. Vår uppgift är att säkerställa att nationella mål och uppdrag genomförs regionalt och med hänsyn till förutsättningarna i just vårt län. Vårt arbete bygger på en samsyn kring mål och prioriteringar och utgår från de fyra ledorden rättssäkerhet, kunskap, samarbete och bra bemötande.\n\nLänsstyrelsen söker ny medarbetare till enheten för kulturmiljö och samhällsplanering med god erfarenhet av arbete med byggnadsvård och kulturmiljöer. \r\n\r\nARBETSUPPGIFTER\nDu kommer att i nära samarbete med våra övriga kulturmiljövårdare arbeta med Dalarnas kulturhistoriska byggnader, bebyggelsemiljöer och kulturlandskap utifrån gällande lagstiftning och nationella och regionala mål och strategier. Du kommer att arbeta tvärsektoriellt i olika samhällsfrågor med andra sakområden på myndigheten.\n\nSom byggnadsantikvarie kommer du att:\n•handlägga frågor om kyrkor, kyrkliga miljöer, kulturhistoriskt värdefull bebyggelse, kulturlandskap samt bidrag\n•företräda kulturmiljöfrågor i samråd om samhällsplanerings- och i utvecklingsfrågor\n•ta fram kunskapsunderlag kopplade till kulturhistorisk bebyggelse och kulturmiljöer.\r\n\r\nKVALIFIKATIONER\nKrav\n•Du har högskoleutbildning med bebyggelseantikvarisk inriktning. \n•Du har arbetslivserfarenhet av byggnadsantikvariskt arbete.\n•Du har goda kunskaper om kulturmiljölagen och aktuella delar av miljöbalken och plan- och bygglagen.\n•Du har B-körkort\n\nMeriterande\n•Du har arbetserfarenhet av ärendehandläggning av kulturhistorisk bebyggelse och kulturlandskap, byggnadsvård och samhällsplanering.\n•Du har erfarenhet av att utarbeta kunskapsunderlag och/eller kulturmiljöprogram för den fysiska samhällsplaneringen.\n•Du har annan relevant högskoleutbildning, som kulturgeografi, kulturmiljövetenskap, kulturminnesvård, samhällsplanering, kyrkohistoria, m.m.\n\nPersonliga egenskaper\n•Du ska ha lätt för att uttrycka dig i tal och skrift på svenska. \n•Du kommer att ingå i en arbetsgrupp och bidra till gruppens samlade arbete. \n•Du behöver ha ett gott omdöme, vara strukturerad och serviceinriktad, ha god samarbetsförmåga och bidra till ett gott och öppet arbetsklimat i enlighet med vår värdegrund. \nVi lägger stor vikt vid dina personliga egenskaper och referenser.\r\n\nÖVRIGT\nLänsstyrelsen arbetar för att erbjuda en attraktiv arbetsplats som är fri från diskriminering och för att ge alla lika möjligheter. Vi tar gärna emot samtal från dig som är intresserad av jobbet, men vi tackar nej till dig som säljer annonser och rekryteringstjänster.\n\nLänsstyrelsen har en viktig samordnande roll vid samhällsstörningar och därmed ingår samtliga anställda i kris- och krigsorganisationen. \nVissa av våra tjänster är säkerhetsklassade vilket innebär att säkerhetsprövning då kommer att genomföras innan anställning. \n\nVi kan erbjuda medflyttarservice via rekryteringslots Dalarna."
}