{
  "meta" : {
    "jobad" : {
      "description" : {
        "requirements" : null,
        "needs" : null,
        "company_information" : null,
        "text_formatted" : "Om företaget\nSedan 1985 är Fogutek AB en legotillverkare av produkter producerade av tekniskt gummi. Vårt djupa kompetens i materialval och produktionsteknik gör att vi är etablerad leverantör till Matproducenter, Bilindustrin samt Läkemedelsindustrin. Tillsammans med våra kunder producerar vi produkter med högt ställda krav kvalitet och funktion.\n\nSom maskinoperatör kommer du att vara en del utav produktionspersonalen. Arbetet leds av produktionsansvarig. Möjligheten till individuell utveckling är stor då arbetet innefattar flera olika moment och maskiner.\n\nSom Maskinoperatör kommer du bland annat:\n\n- Förbereda maskin inför produktion.\n- Stansa gummidetaljer\n- Montering av gummidetaljer\n- Testning av gummidetaljer\n\n\nAnsvarsområden\nDet dagliga arbetet utförs efter produktionsansvarigas direktiv. Du ansvarar för en egen maskin under dagen och ser till att produktionen sker i den takt som förväntas och med den kvalitet som krävs. För att undvika enformigt arbete sker jobbrotation mellan maskinerna.\n\nKrav:\n\n- Har goda kunskaper i Svenska (tal och skrift)\n- Har relevant yrkeserfarenhet.\n- Är noggrann och strukturerad.\n\n\nVi söker dig som:\n\n- Då vår verksamhet har högt ställda krav på kvalitet och prestanda på våra produkter är det av yttersta vikt att du är mycket noggrann som person och har kvalitetsmedvetenhet.\n\n- Då vi är en litet team värdesätter vi att du uppskattar att arbeta i team och bidrar till att företagskulturen.\n\nMeriterande om du:\n\n- Har tidigare erfarenhet av industriarbete\n\nÖvrigt:\nHemsida:  www.fogutek.se (https://www.fogutek.se/fogutek/extern/)\nStart: Augusti / september\nArbetstider: 07:50 till 17:00 måndag - torsdag. 08:00 till 15:00 fredagar och varannan fredag ledigt\nPlacering: I Eriksbergs industriområde (Botkyrka)\nAnställningsform: Tillsvidareanställning. 6 månaders provanställning tillämpas.\nAnsökan: Skickas digitalt via  https://jobb.tillvaxtbotkyrka.com/jobs/1902344-maskinoperator-sokes-till-gummifabrik/56ef50a3-1f3f-4... (https://jobb.tillvaxtbotkyrka.com/jobs/1902344-maskinoperator-sokes-till-gummifabrik/56ef50a3-1f3f-4f80-a047-ae1bb48e3a20)\n\nRekryteringen görs i samarbete med Tillväxt Botkyrka. Urvalet sker löpande och dina svar på ansökningsfrågorna ligger till grund för bedömning av din ansökan.",
        "conditions" : "Heltid\r\nAnställningstid enligt överenskommelse",
        "text" : "Om företaget\nSedan 1985 är Fogutek AB en legotillverkare av produkter producerade av tekniskt gummi. Vårt djupa kompetens i materialval och produktionsteknik gör att vi är etablerad leverantör till Matproducenter, Bilindustrin samt Läkemedelsindustrin. Tillsammans med våra kunder producerar vi produkter med högt ställda krav kvalitet och funktion.\n\nSom maskinoperatör kommer du att vara en del utav produktionspersonalen. Arbetet leds av produktionsansvarig. Möjligheten till individuell utveckling är stor då arbetet innefattar flera olika moment och maskiner.\n\nSom Maskinoperatör kommer du bland annat:\n\n- Förbereda maskin inför produktion.\n- Stansa gummidetaljer\n- Montering av gummidetaljer\n- Testning av gummidetaljer\n\n\nAnsvarsområden\nDet dagliga arbetet utförs efter produktionsansvarigas direktiv. Du ansvarar för en egen maskin under dagen och ser till att produktionen sker i den takt som förväntas och med den kvalitet som krävs. För att undvika enformigt arbete sker jobbrotation mellan maskinerna.\n\nKrav:\n\n- Har goda kunskaper i Svenska (tal och skrift)\n- Har relevant yrkeserfarenhet.\n- Är noggrann och strukturerad.\n\n\nVi söker dig som:\n\n- Då vår verksamhet har högt ställda krav på kvalitet och prestanda på våra produkter är det av yttersta vikt att du är mycket noggrann som person och har kvalitetsmedvetenhet.\n\n- Då vi är en litet team värdesätter vi att du uppskattar att arbeta i team och bidrar till att företagskulturen.\n\nMeriterande om du:\n\n- Har tidigare erfarenhet av industriarbete\n\nÖvrigt:\nHemsida:  www.fogutek.se (https://www.fogutek.se/fogutek/extern/)\nStart: Augusti / september\nArbetstider: 07:50 till 17:00 måndag - torsdag. 08:00 till 15:00 fredagar och varannan fredag ledigt\nPlacering: I Eriksbergs industriområde (Botkyrka)\nAnställningsform: Tillsvidareanställning. 6 månaders provanställning tillämpas.\nAnsökan: Skickas digitalt via  https://jobb.tillvaxtbotkyrka.com/jobs/1902344-maskinoperator-sokes-till-gummifabrik/56ef50a3-1f3f-4... (https://jobb.tillvaxtbotkyrka.com/jobs/1902344-maskinoperator-sokes-till-gummifabrik/56ef50a3-1f3f-4f80-a047-ae1bb48e3a20)\n\nRekryteringen görs i samarbete med Tillväxt Botkyrka. Urvalet sker löpande och dina svar på ansökningsfrågorna ligger till grund för bedömning av din ansökan."
      },
      "headline" : "Maskinoperatör sökes till gummifabriken Fogutek.",
      "driving_license" : null,
      "employer" : {
        "email" : null,
        "phone_number" : null,
        "organization_number" : "5591580732",
        "name" : "Tillväxt Botkyrka AB",
        "url" : "http://www.tillvaxtbotkyrka.se",
        "workplace" : "Tillväxt Botkyrka"
      },
      "removed_date" : null,
      "logo_url" : null,
      "last_publication_date" : "2022-12-22T23:59:59",
      "number_of_vacancies" : 1,
      "occupation" : {
        "concept_id" : "Nrbx_6nx_5pN",
        "label" : "Maskinoperatör, gummiindustri",
        "legacy_ams_taxonomy_id" : "1069"
      },
      "occupation_group" : {
        "concept_id" : "ENV6_BNa_brP",
        "label" : "Maskinoperatörer, gummiindustri",
        "legacy_ams_taxonomy_id" : "8141"
      },
      "employment_type" : {
        "concept_id" : "PFZr_Syz_cUq",
        "label" : "Vanlig anställning",
        "legacy_ams_taxonomy_id" : "1"
      },
      "webpage_url" : "https://arbetsformedlingen.se/platsbanken/annonser/26294540",
      "driving_license_required" : false,
      "application_contacts" : [ {
        "description" : "Max Lauritzen",
        "email" : "max@tillvaxtbotkyrka.se",
        "telephone" : null,
        "name" : null,
        "contact_type" : null
      } ],
      "duration" : {
        "concept_id" : "a7uU_j21_mkL",
        "label" : "Tills vidare",
        "legacy_ams_taxonomy_id" : "1"
      },
      "nice_to_have" : {
        "education_level" : [ ],
        "work_experiences" : [ ],
        "skills" : [ ],
        "education" : [ ],
        "languages" : [ ]
      },
      "application_details" : {
        "via_af" : false,
        "email" : null,
        "other" : null,
        "reference" : null,
        "url" : "https://jobb.tillvaxtbotkyrka.com/jobs/1902344-maskinoperator-sokes-till-gummifabriken-fogutek?promotion=443292-arbetsformedlingen",
        "information" : null
      },
      "source_type" : "VIA_PLATSBANKEN_DXA",
      "application_deadline" : "2022-12-22T23:59:59",
      "external_id" : "46-559158-0732-1902344-1",
      "workplace_address" : {
        "coordinates" : [ 17.840858, 59.24594 ],
        "city" : null,
        "postcode" : null,
        "municipality" : "Botkyrka",
        "region_concept_id" : "CifL_Rzy_Mku",
        "region" : "Stockholms län",
        "country_code" : "199",
        "region_code" : "01",
        "municipality_concept_id" : "CCVZ_JA7_d3y",
        "country_concept_id" : "i46j_HmG_v64",
        "municipality_code" : "0127",
        "street_address" : null,
        "country" : "Sverige"
      },
      "id" : "26294540",
      "experience_required" : true,
      "working_hours_type" : {
        "concept_id" : "6YE1_gAC_R2G",
        "label" : "Heltid",
        "legacy_ams_taxonomy_id" : "1"
      },
      "access" : null,
      "timestamp" : 1657015199184,
      "must_have" : {
        "education_level" : [ ],
        "work_experiences" : [ {
          "concept_id" : "Nrbx_6nx_5pN",
          "weight" : 10,
          "label" : "Maskinoperatör, gummiindustri",
          "legacy_ams_taxonomy_id" : "1069"
        } ],
        "skills" : [ ],
        "education" : [ ],
        "languages" : [ ]
      },
      "occupation_field" : {
        "concept_id" : "wTEr_CBC_bqh",
        "label" : "Industriell tillverkning",
        "legacy_ams_taxonomy_id" : "9"
      },
      "scope_of_work" : {
        "min" : 100,
        "max" : 100
      },
      "salary_type" : {
        "concept_id" : "oG8G_9cW_nRf",
        "label" : "Fast månads- vecko- eller timlön",
        "legacy_ams_taxonomy_id" : "1"
      },
      "removed" : false,
      "salary_description" : "Lön enligt överenskommelse",
      "access_to_own_car" : false,
      "publication_date" : "2022-07-05T11:59:59"
    },
    "name" : "Maskinoperatör sökes till gummifabriken Fogutek.",
    "user" : "hannes"
  },
  "sha1" : "ea48bb40fb969da5ddeb6f29c26b506c3454fd6d",
  "annotations" : [ {
    "preferred-label" : "Maskinoperatörer, gummiindustri",
    "type" : "ssyk-level-4",
    "start-position" : 0,
    "end-position" : 14,
    "concept-id" : "ENV6_BNa_brP",
    "matched-string" : "Maskinoperatör",
    "annotation-id" : 5
  }, {
    "preferred-label" : "Produktionsteknik",
    "sentiment" : "MUST_HAVE",
    "type" : "skill",
    "start-position" : 189,
    "end-position" : 206,
    "concept-id" : "PuQP_aBK_nqJ",
    "matched-string" : "produktionsteknik",
    "annotation-id" : 0
  }, {
    "preferred-label" : "Maskinoperatörer, gummiindustri",
    "type" : "ssyk-level-4",
    "start-position" : 404,
    "end-position" : 418,
    "concept-id" : "ENV6_BNa_brP",
    "matched-string" : "maskinoperatör",
    "annotation-id" : 6
  }, {
    "preferred-label" : "Maskinoperatörer, gummiindustri",
    "type" : "ssyk-level-4",
    "start-position" : 618,
    "end-position" : 632,
    "concept-id" : "ENV6_BNa_brP",
    "matched-string" : "Maskinoperatör",
    "annotation-id" : 7
  }, {
    "preferred-label" : "stansar",
    "type" : "esco-skill",
    "start-position" : 696,
    "end-position" : 702,
    "concept-id" : "imPv_Kee_3A5",
    "matched-string" : "Stansa",
    "annotation-id" : 8
  }, {
    "preferred-label" : "Svenska",
    "sentiment" : "MUST_HAVE",
    "type" : "language",
    "start-position" : 1092,
    "end-position" : 1099,
    "concept-id" : "zSLA_vw2_FXN",
    "matched-string" : "svenska",
    "annotation-id" : 1
  }, {
    "preferred-label" : "noggrannhet",
    "type" : "esco-skill",
    "start-position" : 1154,
    "end-position" : 1162,
    "concept-id" : "mrsW_EkL_KRD",
    "matched-string" : "noggrann",
    "annotation-id" : 9
  }, {
    "preferred-label" : "noggrannhet",
    "type" : "esco-skill",
    "start-position" : 1329,
    "end-position" : 1337,
    "concept-id" : "mrsW_EkL_KRD",
    "matched-string" : "noggrann",
    "annotation-id" : 10
  }, {
    "preferred-label" : "Industriarbete",
    "sentiment" : "MUST_HAVE",
    "type" : "keyword",
    "start-position" : 1544,
    "end-position" : 1558,
    "concept-id" : "fpA8_XFc_122",
    "matched-string" : "industriarbete",
    "annotation-id" : 2
  }, {
    "preferred-label" : "Tillsvidareanställning (inkl. eventuell provanställning)",
    "type" : "employment-type",
    "start-position" : 1830,
    "end-position" : 1852,
    "concept-id" : "kpPX_CNN_gDU",
    "matched-string" : "Tillsvidareanställning",
    "annotation-id" : 11
  } ],
  "text" : "Maskinoperatör sökes till gummifabriken Fogutek.\nOm företaget\nSedan 1985 är Fogutek AB en legotillverkare av produkter producerade av tekniskt gummi. Vårt djupa kompetens i materialval och produktionsteknik gör att vi är etablerad leverantör till Matproducenter, Bilindustrin samt Läkemedelsindustrin. Tillsammans med våra kunder producerar vi produkter med högt ställda krav kvalitet och funktion.\n\nSom maskinoperatör kommer du att vara en del utav produktionspersonalen. Arbetet leds av produktionsansvarig. Möjligheten till individuell utveckling är stor då arbetet innefattar flera olika moment och maskiner.\n\nSom Maskinoperatör kommer du bland annat:\n\n- Förbereda maskin inför produktion.\n- Stansa gummidetaljer\n- Montering av gummidetaljer\n- Testning av gummidetaljer\n\n\nAnsvarsområden\nDet dagliga arbetet utförs efter produktionsansvarigas direktiv. Du ansvarar för en egen maskin under dagen och ser till att produktionen sker i den takt som förväntas och med den kvalitet som krävs. För att undvika enformigt arbete sker jobbrotation mellan maskinerna.\n\nKrav:\n\n- Har goda kunskaper i Svenska (tal och skrift)\n- Har relevant yrkeserfarenhet.\n- Är noggrann och strukturerad.\n\n\nVi söker dig som:\n\n- Då vår verksamhet har högt ställda krav på kvalitet och prestanda på våra produkter är det av yttersta vikt att du är mycket noggrann som person och har kvalitetsmedvetenhet.\n\n- Då vi är en litet team värdesätter vi att du uppskattar att arbeta i team och bidrar till att företagskulturen.\n\nMeriterande om du:\n\n- Har tidigare erfarenhet av industriarbete\n\nÖvrigt:\nHemsida:  www.fogutek.se (https://www.fogutek.se/fogutek/extern/)\nStart: Augusti / september\nArbetstider: 07:50 till 17:00 måndag - torsdag. 08:00 till 15:00 fredagar och varannan fredag ledigt\nPlacering: I Eriksbergs industriområde (Botkyrka)\nAnställningsform: Tillsvidareanställning. 6 månaders provanställning tillämpas.\nAnsökan: Skickas digitalt via  https://jobb.tillvaxtbotkyrka.com/jobs/1902344-maskinoperator-sokes-till-gummifabrik/56ef50a3-1f3f-4... (https://jobb.tillvaxtbotkyrka.com/jobs/1902344-maskinoperator-sokes-till-gummifabrik/56ef50a3-1f3f-4f80-a047-ae1bb48e3a20)\n\nRekryteringen görs i samarbete med Tillväxt Botkyrka. Urvalet sker löpande och dina svar på ansökningsfrågorna ligger till grund för bedömning av din ansökan."
}