{
  "meta" : {
    "jobad" : {
      "description" : {
        "requirements" : null,
        "needs" : null,
        "company_information" : null,
        "text_formatted" : "<p><u>Dina arbetsuppgifter:</u></p><p>Att arbeta som kock/lokalvårdare på Lättebo förskola kommer att innebära att du har ansvar för planering, beställning av råvaror, matlagning, brödbakning, specialkosttillagning och andra sedvanliga arbetsuppgifter i ett kök.  Vår vision är att i största mån använda oss av ekologiskt, kravmärkt och närproducerat. Du ska presentera maten på ett tilltalande sätt för att väcka barnens nyfikenhet och inspirera dem till nya smakupplevelser. Du ska också utföra rutinmässig dokumentation av kökets egenkontroll samt bevaka att lagar, regler och riktlinjer inom området följs.  Du ansvarar också för all städning i förskolans lokaler. Du kommer även att hantera visst budgetarbete och ha ekonomiskt ansvar i samarbete med rektor.</p><p><u>Om dig:</u></p><p>Vi söker dig som har några års erfarenhet från yrket som kock och känner dig trygg med att jobba i tillagningskök där vår strävan är att all mat ska lagas från grunden.  Du behöver vara flexibel eftersom vi är ett litet arbetslag och ofta behöver gå in och stötta varandra i arbetet. Du behöver ta egna initiativ och arbeta självständigt men även ingå i teamarbete. Vi vill att du är socialt kompetent och bygger goda relationer med barnen och dess vårdnadshavare samt arbetskamraterna. Arbetet kräver att du är strukturerad och tydlig. Du kommer att arbeta i en del digitala system så viss datorvana är bra. Som anställd hos oss är du alltid en representant för Svenska kyrkan och vi vill därför att du är lojal med vår tro och värdegrund. Vi ser gärna att du är medlem i Svenska kyrkan. Stor vikt läggs vid personlig lämplighet och provanställning kan komma att tillämpas.</p><p><u>Om oss:</u></p><p>Vetlanda Pastorat består av tio kyrkliga enheter som har ca 17 000 medlemmar. Vi är idag omkring 90 anställda vilka verkar inom olika församlingar och arbetsområden. Vår förskola, Lättebo som har en kristen profil, är placerad i Ekenässjöns kyrka. Här finns ett litet arbetslag med 6 anställda. Barngruppen består för närvarande av 23 barn. Nära samarbete sker också med präst, kantor och vaktmästare i kyrkan. Vi är positiva och vår arbetsplats präglas av omtanke, respekt, samarbetsvilja och ärlighet. </p><p><u>Kravprofil</u></p><p>·        Kock, storhushåll – erfarenhet efterfrågas</p><p>·        Goda kunskaper i livsmedelshygien</p><p>·        Kunskaper i specialkosttillagning</p><p>·        Goda kunskaper i svenska i tal och skrift</p><p>För information om tjänsten, kontakta gärna Annette Robertsson, rektor, 0383-76 37 08 annette.robertsson@svenskakyrkan.se</p><p>Heléna Svenson, HR-specialist 0383-76 37 14 helena.svenson@svenskakykan.se</p><p>Katarina Toll Koril, Kyrkoherde 0383-76 37 05 karina.toll.koril@svenskakyrkan.se</p><p>Tjänstens omfattning: 80 % tillsvidare med ev. möjlighet till ökad tjänstgöringsgrad.</p><p>Lön: Avtalsenlig</p><p>Senaste ansökningsdag: 7 aug ansökan skickas till katarina.toll.koril@svenskakyrkan.se</p><p>Löpande urval kommer göras. </p><p>Du måste uppvisa ett utdrag ur polisens belastningsregister. </p><p>Tillträde: Enl. ök </p><p><br></p><p><br></p><p><br></p><p><br></p><p><br></p><p><br></p><p><br></p><p><br></p><p><br></p><p><br></p><p><br></p><p><br></p><p><br></p><p><br></p><p><br></p><p><br></p><p><br></p><p><br></p><p><br></p><p><br></p><p><br></p><p><br></p>",
        "conditions" : null,
        "text" : "Dina arbetsuppgifter:\nAtt arbeta som kock/lokalvårdare på Lättebo förskola kommer att innebära att du har ansvar för planering, beställning av råvaror, matlagning, brödbakning, specialkosttillagning och andra sedvanliga arbetsuppgifter i ett kök.  Vår vision är att i största mån använda oss av ekologiskt, kravmärkt och närproducerat. Du ska presentera maten på ett tilltalande sätt för att väcka barnens nyfikenhet och inspirera dem till nya smakupplevelser. Du ska också utföra rutinmässig dokumentation av kökets egenkontroll samt bevaka att lagar, regler och riktlinjer inom området följs.  Du ansvarar också för all städning i förskolans lokaler. Du kommer även att hantera visst budgetarbete och ha ekonomiskt ansvar i samarbete med rektor.\nOm dig:\nVi söker dig som har några års erfarenhet från yrket som kock och känner dig trygg med att jobba i tillagningskök där vår strävan är att all mat ska lagas från grunden.  Du behöver vara flexibel eftersom vi är ett litet arbetslag och ofta behöver gå in och stötta varandra i arbetet. Du behöver ta egna initiativ och arbeta självständigt men även ingå i teamarbete. Vi vill att du är socialt kompetent och bygger goda relationer med barnen och dess vårdnadshavare samt arbetskamraterna. Arbetet kräver att du är strukturerad och tydlig. Du kommer att arbeta i en del digitala system så viss datorvana är bra. Som anställd hos oss är du alltid en representant för Svenska kyrkan och vi vill därför att du är lojal med vår tro och värdegrund. Vi ser gärna att du är medlem i Svenska kyrkan. Stor vikt läggs vid personlig lämplighet och provanställning kan komma att tillämpas.\nOm oss:\nVetlanda Pastorat består av tio kyrkliga enheter som har ca 17 000 medlemmar. Vi är idag omkring 90 anställda vilka verkar inom olika församlingar och arbetsområden. Vår förskola, Lättebo som har en kristen profil, är placerad i Ekenässjöns kyrka. Här finns ett litet arbetslag med 6 anställda. Barngruppen består för närvarande av 23 barn. Nära samarbete sker också med präst, kantor och vaktmästare i kyrkan. Vi är positiva och vår arbetsplats präglas av omtanke, respekt, samarbetsvilja och ärlighet. \nKravprofil\n·        Kock, storhushåll – erfarenhet efterfrågas\n·        Goda kunskaper i livsmedelshygien\n·        Kunskaper i specialkosttillagning\n·        Goda kunskaper i svenska i tal och skrift\nFör information om tjänsten, kontakta gärna Annette Robertsson, rektor, 0383-76 37 08 annette.robertsson@svenskakyrkan.se\nHeléna Svenson, HR-specialist 0383-76 37 14 helena.svenson@svenskakykan.se\nKatarina Toll Koril, Kyrkoherde 0383-76 37 05 karina.toll.koril@svenskakyrkan.se\nTjänstens omfattning: 80 % tillsvidare med ev. möjlighet till ökad tjänstgöringsgrad.\nLön: Avtalsenlig\nSenaste ansökningsdag: 7 aug ansökan skickas till katarina.toll.koril@svenskakyrkan.se\nLöpande urval kommer göras. \nDu måste uppvisa ett utdrag ur polisens belastningsregister. \nTillträde: Enl. ök"
      },
      "headline" : "Kock/lokalvårdare",
      "driving_license" : null,
      "employer" : {
        "email" : null,
        "phone_number" : null,
        "organization_number" : "2520049228",
        "name" : "Vetlanda Pastorat",
        "url" : null,
        "workplace" : "Lättebo förskola"
      },
      "removed_date" : null,
      "logo_url" : "https://www.arbetsformedlingen.se/rest/arbetsgivare/rest/af/v3/arbetsplatser/86806161/logotyper/logo.png",
      "last_publication_date" : "2022-08-07T23:59:59",
      "number_of_vacancies" : 1,
      "occupation" : {
        "concept_id" : "Vg3d_Azf_p5Y",
        "label" : "Kock, storhushåll",
        "legacy_ams_taxonomy_id" : "7664"
      },
      "occupation_group" : {
        "concept_id" : "BStc_SJh_DKG",
        "label" : "Kockar och kallskänkor",
        "legacy_ams_taxonomy_id" : "5120"
      },
      "employment_type" : {
        "concept_id" : "PFZr_Syz_cUq",
        "label" : "Vanlig anställning",
        "legacy_ams_taxonomy_id" : "1"
      },
      "webpage_url" : "https://arbetsformedlingen.se/platsbanken/annonser/26263186",
      "driving_license_required" : false,
      "application_contacts" : [ ],
      "duration" : {
        "concept_id" : "a7uU_j21_mkL",
        "label" : "Tills vidare",
        "legacy_ams_taxonomy_id" : "1"
      },
      "nice_to_have" : {
        "education_level" : [ ],
        "work_experiences" : [ {
          "concept_id" : "Vg3d_Azf_p5Y",
          "weight" : 5,
          "label" : "Kock, storhushåll",
          "legacy_ams_taxonomy_id" : "7664"
        } ],
        "skills" : [ ],
        "education" : [ ],
        "languages" : [ ]
      },
      "application_details" : {
        "via_af" : false,
        "email" : "katarina.toll.koril@svenskakyrkan.se",
        "other" : null,
        "reference" : null,
        "url" : null,
        "information" : null
      },
      "source_type" : "VIA_ANNONSERA",
      "application_deadline" : "2022-08-07T23:59:59",
      "external_id" : null,
      "workplace_address" : {
        "coordinates" : [ 15.023212260257012, 57.488261867580626 ],
        "city" : "EKENÄSSJÖN",
        "postcode" : "57450",
        "municipality" : "Vetlanda",
        "region_concept_id" : "MtbE_xWT_eMi",
        "region" : "Jönköpings län",
        "country_code" : "199",
        "region_code" : "06",
        "municipality_concept_id" : "xJqx_SLC_415",
        "country_concept_id" : "i46j_HmG_v64",
        "municipality_code" : "0685",
        "street_address" : "Ekstigen 2",
        "country" : "Sverige"
      },
      "id" : "26263186",
      "experience_required" : true,
      "working_hours_type" : {
        "concept_id" : "947z_JGS_Uk2",
        "label" : "Deltid",
        "legacy_ams_taxonomy_id" : "2"
      },
      "access" : null,
      "timestamp" : 1656337460781,
      "must_have" : {
        "education_level" : [ ],
        "work_experiences" : [ ],
        "skills" : [ ],
        "education" : [ ],
        "languages" : [ ]
      },
      "occupation_field" : {
        "concept_id" : "ScKy_FHB_7wT",
        "label" : "Hotell, restaurang, storhushåll",
        "legacy_ams_taxonomy_id" : "7"
      },
      "scope_of_work" : {
        "min" : 0,
        "max" : 100
      },
      "salary_type" : {
        "concept_id" : "oG8G_9cW_nRf",
        "label" : "Fast månads- vecko- eller timlön",
        "legacy_ams_taxonomy_id" : "1"
      },
      "removed" : false,
      "salary_description" : null,
      "access_to_own_car" : false,
      "publication_date" : "2022-06-27T15:44:20"
    },
    "name" : "Kock/lokalvårdare",
    "user" : "hannes"
  },
  "sha1" : "b20c2ec8e34796b5799b7795933ad51ac0ba5a95",
  "annotations" : [ {
    "preferred-label" : "kock",
    "sentiment" : "MUST_HAVE",
    "type" : "esco-occupation",
    "start-position" : 0,
    "end-position" : 4,
    "concept-id" : "Ti2H_QoQ_EMX",
    "matched-string" : "kock",
    "annotation-id" : 0
  }, {
    "preferred-label" : "Städare/Lokalvårdare",
    "sentiment" : "MUST_HAVE",
    "type" : "occupation-name",
    "start-position" : 5,
    "end-position" : 17,
    "concept-id" : "dYo1_D8c_87U",
    "matched-string" : "lokalvårdare",
    "annotation-id" : 1
  }, {
    "preferred-label" : "kock",
    "sentiment" : "MUST_HAVE",
    "type" : "esco-occupation",
    "start-position" : 55,
    "end-position" : 59,
    "concept-id" : "Ti2H_QoQ_EMX",
    "matched-string" : "kock",
    "annotation-id" : 2
  }, {
    "preferred-label" : "Städare/Lokalvårdare",
    "sentiment" : "MUST_HAVE",
    "type" : "occupation-name",
    "start-position" : 60,
    "end-position" : 72,
    "concept-id" : "dYo1_D8c_87U",
    "matched-string" : "lokalvårdare",
    "annotation-id" : 3
  }, {
    "preferred-label" : "Förskola",
    "sentiment" : "MUST_HAVE",
    "type" : "sun-education-level-3",
    "start-position" : 84,
    "end-position" : 92,
    "concept-id" : "p3Nu_zzc_L7T",
    "matched-string" : "förskola",
    "annotation-id" : 4
  }, {
    "preferred-label" : "Matlagning, cirkelledning",
    "type" : "skill",
    "start-position" : 170,
    "end-position" : 180,
    "concept-id" : "Uyxo_Y4T_X4k",
    "matched-string" : "matlagning",
    "annotation-id" : 21
  }, {
    "preferred-label" : "baka bröd",
    "type" : "esco-skill",
    "start-position" : 182,
    "end-position" : 193,
    "concept-id" : "vZun_i6c_cdk",
    "matched-string" : "brödbakning",
    "annotation-id" : 22
  }, {
    "preferred-label" : "laga specialkost",
    "type" : "esco-skill",
    "start-position" : 195,
    "end-position" : 216,
    "concept-id" : "DciE_aX1_xon",
    "matched-string" : "specialkosttillagning",
    "annotation-id" : 23
  }, {
    "preferred-label" : "Dokumentation",
    "sentiment" : "MUST_HAVE",
    "type" : "keyword",
    "start-position" : 511,
    "end-position" : 524,
    "concept-id" : "jodz_kWf_iKx",
    "matched-string" : "dokumentation",
    "annotation-id" : 5
  }, {
    "preferred-label" : "Städning av förskola/Städning av skola",
    "type" : "skill",
    "start-position" : 640,
    "end-position" : 669,
    "concept-id" : "y4sg_zUA_mPz",
    "matched-string" : "städning i förskolans lokaler",
    "annotation-id" : 24
  }, {
    "preferred-label" : "Budgetansvar",
    "type" : "skill",
    "start-position" : 690,
    "end-position" : 697,
    "concept-id" : "Gt5f_wdi_FSJ",
    "matched-string" : "hantera",
    "annotation-id" : 26
  }, {
    "preferred-label" : "Budgetansvar",
    "type" : "skill",
    "start-position" : 704,
    "end-position" : 716,
    "concept-id" : "Gt5f_wdi_FSJ",
    "matched-string" : "budgetarbete",
    "annotation-id" : 25
  }, {
    "preferred-label" : "kock",
    "sentiment" : "MUST_HAVE",
    "type" : "esco-occupation",
    "start-position" : 831,
    "end-position" : 835,
    "concept-id" : "Ti2H_QoQ_EMX",
    "matched-string" : "kock",
    "annotation-id" : 6
  }, {
    "preferred-label" : "arbeta självständigt",
    "type" : "esco-skill",
    "start-position" : 1091,
    "end-position" : 1111,
    "concept-id" : "NyFu_HHd_zhz",
    "matched-string" : "arbeta självständigt",
    "annotation-id" : 27
  }, {
    "preferred-label" : "Svenska",
    "sentiment" : "MUST_HAVE",
    "type" : "keyword",
    "start-position" : 1437,
    "end-position" : 1444,
    "concept-id" : "gfhX_bqH_U4K",
    "matched-string" : "svenska",
    "annotation-id" : 7
  }, {
    "preferred-label" : "Kyrkan",
    "sentiment" : "MUST_HAVE",
    "type" : "keyword",
    "start-position" : 1445,
    "end-position" : 1451,
    "concept-id" : "h4LF_GE3_FGu",
    "matched-string" : "kyrkan",
    "annotation-id" : 8
  }, {
    "preferred-label" : "Svenska",
    "type" : "keyword",
    "start-position" : 1547,
    "end-position" : 1554,
    "concept-id" : "gfhX_bqH_U4K",
    "matched-string" : "Svenska",
    "annotation-id" : 28
  }, {
    "preferred-label" : "Kyrkan",
    "sentiment" : "MUST_HAVE",
    "type" : "keyword",
    "start-position" : 1555,
    "end-position" : 1561,
    "concept-id" : "h4LF_GE3_FGu",
    "matched-string" : "kyrkan",
    "annotation-id" : 10
  }, {
    "preferred-label" : "Vetlanda",
    "type" : "municipality",
    "start-position" : 1657,
    "end-position" : 1665,
    "concept-id" : "xJqx_SLC_415",
    "matched-string" : "Vetlanda",
    "annotation-id" : 29
  }, {
    "preferred-label" : "Förskola",
    "sentiment" : "MUST_HAVE",
    "type" : "sun-education-level-3",
    "start-position" : 1827,
    "end-position" : 1835,
    "concept-id" : "p3Nu_zzc_L7T",
    "matched-string" : "förskola",
    "annotation-id" : 11
  }, {
    "preferred-label" : "Präster",
    "type" : "ssyk-level-4",
    "start-position" : 2028,
    "end-position" : 2033,
    "concept-id" : "2L2s_EU8_PzR",
    "matched-string" : "präst",
    "annotation-id" : 30
  }, {
    "preferred-label" : "Kantor",
    "sentiment" : "MUST_HAVE",
    "type" : "occupation-name",
    "start-position" : 2035,
    "end-position" : 2041,
    "concept-id" : "WoT4_oqQ_5Fa",
    "matched-string" : "kantor",
    "annotation-id" : 12
  }, {
    "preferred-label" : "vaktmästare",
    "sentiment" : "MUST_HAVE",
    "type" : "esco-occupation",
    "start-position" : 2046,
    "end-position" : 2057,
    "concept-id" : "88vj_SBF_e3N",
    "matched-string" : "vaktmästare",
    "annotation-id" : 13
  }, {
    "preferred-label" : "Kyrkan",
    "sentiment" : "MUST_HAVE",
    "type" : "keyword",
    "start-position" : 2060,
    "end-position" : 2066,
    "concept-id" : "h4LF_GE3_FGu",
    "matched-string" : "kyrkan",
    "annotation-id" : 14
  }, {
    "preferred-label" : "kock",
    "sentiment" : "MUST_HAVE",
    "type" : "esco-occupation",
    "start-position" : 2182,
    "end-position" : 2186,
    "concept-id" : "Ti2H_QoQ_EMX",
    "matched-string" : "kock",
    "annotation-id" : 15
  }, {
    "preferred-label" : "Storhushåll",
    "sentiment" : "MUST_HAVE",
    "type" : "keyword",
    "start-position" : 2188,
    "end-position" : 2199,
    "concept-id" : "VfLr_eEg_ABZ",
    "matched-string" : "storhushåll",
    "annotation-id" : 16
  }, {
    "preferred-label" : "Livsmedelshygien",
    "sentiment" : "MUST_HAVE",
    "type" : "skill",
    "start-position" : 2251,
    "end-position" : 2267,
    "concept-id" : "kj4Q_nLh_u8Q",
    "matched-string" : "livsmedelshygien",
    "annotation-id" : 17
  }, {
    "preferred-label" : "laga specialkost",
    "type" : "esco-skill",
    "start-position" : 2289,
    "end-position" : 2310,
    "concept-id" : "DciE_aX1_xon",
    "matched-string" : "specialkosttillagning",
    "annotation-id" : 31
  }, {
    "preferred-label" : "Svenska",
    "sentiment" : "MUST_HAVE",
    "type" : "keyword",
    "start-position" : 2337,
    "end-position" : 2344,
    "concept-id" : "gfhX_bqH_U4K",
    "matched-string" : "svenska",
    "annotation-id" : 18
  }, {
    "preferred-label" : "HR-specialist/HR-advisor",
    "sentiment" : "MUST_HAVE",
    "type" : "occupation-name",
    "start-position" : 2500,
    "end-position" : 2513,
    "concept-id" : "s28Q_sya_S2b",
    "matched-string" : "hr-specialist",
    "annotation-id" : 19
  }, {
    "preferred-label" : "Kyrkoherde",
    "sentiment" : "MUST_HAVE",
    "type" : "occupation-name",
    "start-position" : 2580,
    "end-position" : 2590,
    "concept-id" : "rMfT_rsj_WQv",
    "matched-string" : "kyrkoherde",
    "annotation-id" : 20
  }, {
    "preferred-label" : "Deltid",
    "type" : "worktime-extent",
    "start-position" : 2662,
    "end-position" : 2666,
    "concept-id" : "947z_JGS_Uk2",
    "matched-string" : "80 %",
    "annotation-id" : 32
  }, {
    "preferred-label" : "Tillsvidareanställning (inkl. eventuell provanställning)",
    "type" : "employment-type",
    "start-position" : 2667,
    "end-position" : 2678,
    "concept-id" : "kpPX_CNN_gDU",
    "matched-string" : "tillsvidare",
    "annotation-id" : 33
  } ],
  "text" : "Kock/lokalvårdare\nDina arbetsuppgifter:\nAtt arbeta som kock/lokalvårdare på Lättebo förskola kommer att innebära att du har ansvar för planering, beställning av råvaror, matlagning, brödbakning, specialkosttillagning och andra sedvanliga arbetsuppgifter i ett kök.  Vår vision är att i största mån använda oss av ekologiskt, kravmärkt och närproducerat. Du ska presentera maten på ett tilltalande sätt för att väcka barnens nyfikenhet och inspirera dem till nya smakupplevelser. Du ska också utföra rutinmässig dokumentation av kökets egenkontroll samt bevaka att lagar, regler och riktlinjer inom området följs.  Du ansvarar också för all städning i förskolans lokaler. Du kommer även att hantera visst budgetarbete och ha ekonomiskt ansvar i samarbete med rektor.\nOm dig:\nVi söker dig som har några års erfarenhet från yrket som kock och känner dig trygg med att jobba i tillagningskök där vår strävan är att all mat ska lagas från grunden.  Du behöver vara flexibel eftersom vi är ett litet arbetslag och ofta behöver gå in och stötta varandra i arbetet. Du behöver ta egna initiativ och arbeta självständigt men även ingå i teamarbete. Vi vill att du är socialt kompetent och bygger goda relationer med barnen och dess vårdnadshavare samt arbetskamraterna. Arbetet kräver att du är strukturerad och tydlig. Du kommer att arbeta i en del digitala system så viss datorvana är bra. Som anställd hos oss är du alltid en representant för Svenska kyrkan och vi vill därför att du är lojal med vår tro och värdegrund. Vi ser gärna att du är medlem i Svenska kyrkan. Stor vikt läggs vid personlig lämplighet och provanställning kan komma att tillämpas.\nOm oss:\nVetlanda Pastorat består av tio kyrkliga enheter som har ca 17 000 medlemmar. Vi är idag omkring 90 anställda vilka verkar inom olika församlingar och arbetsområden. Vår förskola, Lättebo som har en kristen profil, är placerad i Ekenässjöns kyrka. Här finns ett litet arbetslag med 6 anställda. Barngruppen består för närvarande av 23 barn. Nära samarbete sker också med präst, kantor och vaktmästare i kyrkan. Vi är positiva och vår arbetsplats präglas av omtanke, respekt, samarbetsvilja och ärlighet. \nKravprofil\n·        Kock, storhushåll – erfarenhet efterfrågas\n·        Goda kunskaper i livsmedelshygien\n·        Kunskaper i specialkosttillagning\n·        Goda kunskaper i svenska i tal och skrift\nFör information om tjänsten, kontakta gärna Annette Robertsson, rektor, 0383-76 37 08 annette.robertsson@svenskakyrkan.se\nHeléna Svenson, HR-specialist 0383-76 37 14 helena.svenson@svenskakykan.se\nKatarina Toll Koril, Kyrkoherde 0383-76 37 05 karina.toll.koril@svenskakyrkan.se\nTjänstens omfattning: 80 % tillsvidare med ev. möjlighet till ökad tjänstgöringsgrad.\nLön: Avtalsenlig\nSenaste ansökningsdag: 7 aug ansökan skickas till katarina.toll.koril@svenskakyrkan.se\nLöpande urval kommer göras. \nDu måste uppvisa ett utdrag ur polisens belastningsregister. \nTillträde: Enl. ök"
}