{
  "meta" : {
    "jobad" : {
      "description" : {
        "requirements" : null,
        "needs" : null,
        "company_information" : null,
        "text_formatted" : "Gavlefastigheters uppdrag är att hållbart förvalta, vårda och utveckla fastigheter för offentliga verksamheter i Gävle kommun. De flesta som bor i Gävle nyttjar våra lokaler på ett eller annat sätt. I vårt fastighetsbestånd hittar du allt från skolor och förskolor till idrottsanläggningar, kulturbyggnader och kontorslokaler. \n\nVi söker nu en teknisk specialist inom mark till vår fastighetsavdelning som tillsammans med oss vill arbeta för Gävles bästa!\n\nPå fastighetsavdelningen arbetar vi med planerat underhåll, lokalanpassningar, hyresavtal genom in- och uthyrning och även köp och försäljning av fastigheter. Idag förvaltar vi cirka 600 000 kvm lokalyta. På avdelningen har vi teknisk kompetens inom energi, mark, miljö, VVS, el, säkerhet, brand och byggnadsinformation för att säkerställa underhåll och utveckling av befintligt fastighetsbestånd. \r\n\r\nARBETSUPPGIFTER\nSom teknisk specialist är du en av bolagets sakkunniga inom markfrågor för att säkerställa långsiktiga och hållbara lösningar för vårat fastighetsbestånd. Du deltar i såväl ny- och ombyggnationer samt i underhållsarbeten. Du arbetar strategiskt med markfrågor som exempelvis dagvatten, grönytor och trafikfrågor. Dina arbetsuppgifter innefattar bland annat att delta som kravställare och beställarkompetens åt bolaget i utförandet av markfrågor. \n\nI uppdraget ingår även omvärldsbevakning och utveckling inom området samt ett aktivt arbete för att öka samverkan inom bolaget, koncernen, kommunkoncernen och med externa aktörer.\n\nHuvudsakliga arbetsuppgifter:\n• Ansvara för övergripande strategier samt processer, instruktioner, rutiner och mallar inom specialistområdet\n• Beställarkompetens i utförandet av markåtgärder i vårat fastighetsbestånd\n• Agera sakkunnig och driva utveckling inom specialistområdet\n• Stötta och utveckla medarbetare i området markfrågor\n• Ansvara för våra projekteringsanvisningar för markfrågor\n• Omvärldsbevaka utvecklingen inom specialistområdet\n• Samverka med driftorganisationen gällande markfrågor\n• Övervaka att lagar och regler inom området följs\n• Genomföra områdesspecifika utredningar vid behov\r\n\r\nKVALIFIKATIONER\nVi ser att du som söker har en treårig akademisk examen som landskapsingenjör eller inriktning mot mark, alternativt utbildning eller erfarenhet som arbetsgivaren bedömer likvärdig. Har du tidigare erfarenhet av markfrågor är det meriterande. Du gör dig förstådd och förstår svenska i tal och skrift. B-körkort är ett krav.\n\nDu som söker behöver vara systematisk och noggrann i ditt arbete. Ha en god social kompetens och samarbetsförmåga. Vi ser också att du är drivande inom ditt ansvarsområde. Du är öppen för ständiga förbättringar och har en vilja att förändra och se utvecklingspotential i arbetsprocesserna.",
        "conditions" : "Heltid. \r\nTillsvidareanställning, tillträde: Tillträde enligt överenskommelse.",
        "text" : "Gavlefastigheters uppdrag är att hållbart förvalta, vårda och utveckla fastigheter för offentliga verksamheter i Gävle kommun. De flesta som bor i Gävle nyttjar våra lokaler på ett eller annat sätt. I vårt fastighetsbestånd hittar du allt från skolor och förskolor till idrottsanläggningar, kulturbyggnader och kontorslokaler. \n\nVi söker nu en teknisk specialist inom mark till vår fastighetsavdelning som tillsammans med oss vill arbeta för Gävles bästa!\n\nPå fastighetsavdelningen arbetar vi med planerat underhåll, lokalanpassningar, hyresavtal genom in- och uthyrning och även köp och försäljning av fastigheter. Idag förvaltar vi cirka 600 000 kvm lokalyta. På avdelningen har vi teknisk kompetens inom energi, mark, miljö, VVS, el, säkerhet, brand och byggnadsinformation för att säkerställa underhåll och utveckling av befintligt fastighetsbestånd. \r\n\r\nARBETSUPPGIFTER\nSom teknisk specialist är du en av bolagets sakkunniga inom markfrågor för att säkerställa långsiktiga och hållbara lösningar för vårat fastighetsbestånd. Du deltar i såväl ny- och ombyggnationer samt i underhållsarbeten. Du arbetar strategiskt med markfrågor som exempelvis dagvatten, grönytor och trafikfrågor. Dina arbetsuppgifter innefattar bland annat att delta som kravställare och beställarkompetens åt bolaget i utförandet av markfrågor. \n\nI uppdraget ingår även omvärldsbevakning och utveckling inom området samt ett aktivt arbete för att öka samverkan inom bolaget, koncernen, kommunkoncernen och med externa aktörer.\n\nHuvudsakliga arbetsuppgifter:\n• Ansvara för övergripande strategier samt processer, instruktioner, rutiner och mallar inom specialistområdet\n• Beställarkompetens i utförandet av markåtgärder i vårat fastighetsbestånd\n• Agera sakkunnig och driva utveckling inom specialistområdet\n• Stötta och utveckla medarbetare i området markfrågor\n• Ansvara för våra projekteringsanvisningar för markfrågor\n• Omvärldsbevaka utvecklingen inom specialistområdet\n• Samverka med driftorganisationen gällande markfrågor\n• Övervaka att lagar och regler inom området följs\n• Genomföra områdesspecifika utredningar vid behov\r\n\r\nKVALIFIKATIONER\nVi ser att du som söker har en treårig akademisk examen som landskapsingenjör eller inriktning mot mark, alternativt utbildning eller erfarenhet som arbetsgivaren bedömer likvärdig. Har du tidigare erfarenhet av markfrågor är det meriterande. Du gör dig förstådd och förstår svenska i tal och skrift. B-körkort är ett krav.\n\nDu som söker behöver vara systematisk och noggrann i ditt arbete. Ha en god social kompetens och samarbetsförmåga. Vi ser också att du är drivande inom ditt ansvarsområde. Du är öppen för ständiga förbättringar och har en vilja att förändra och se utvecklingspotential i arbetsprocesserna."
      },
      "headline" : "Vi söker en teknisk specialist inom mark",
      "driving_license" : [ {
        "concept_id" : "VTK8_WRx_GcM",
        "label" : "B",
        "legacy_ams_taxonomy_id" : "3"
      } ],
      "employer" : {
        "email" : null,
        "phone_number" : null,
        "organization_number" : "5560099581",
        "name" : "Gavlefastigheter Gävle kommun AB",
        "url" : null,
        "workplace" : "Gavlefastigheter , Gavlefastigheter"
      },
      "removed_date" : null,
      "logo_url" : "https://www.arbetsformedlingen.se/rest/arbetsgivare/rest/af/v3/organisation/5560099581/logotyper/logo.png",
      "last_publication_date" : "2022-08-07T23:59:59",
      "number_of_vacancies" : 1,
      "occupation" : {
        "concept_id" : "SXAF_LMk_j4S",
        "label" : "Landskapsarkitekt",
        "legacy_ams_taxonomy_id" : "5447"
      },
      "occupation_group" : {
        "concept_id" : "ETAR_ggZ_Wuw",
        "label" : "Landskapsarkitekter",
        "legacy_ams_taxonomy_id" : "2162"
      },
      "employment_type" : {
        "concept_id" : "PFZr_Syz_cUq",
        "label" : "Vanlig anställning",
        "legacy_ams_taxonomy_id" : "1"
      },
      "webpage_url" : "https://arbetsformedlingen.se/platsbanken/annonser/26278782",
      "driving_license_required" : true,
      "application_contacts" : [ {
        "description" : "Annie Larsson",
        "email" : null,
        "telephone" : "026-17 80 36",
        "name" : null,
        "contact_type" : "Fastighetschef"
      }, {
        "description" : "Johanna Bergström",
        "email" : null,
        "telephone" : "0700826989",
        "name" : null,
        "contact_type" : "HR-specialist"
      } ],
      "duration" : {
        "concept_id" : "a7uU_j21_mkL",
        "label" : "Tills vidare",
        "legacy_ams_taxonomy_id" : "1"
      },
      "nice_to_have" : {
        "education_level" : [ ],
        "work_experiences" : [ ],
        "skills" : [ ],
        "education" : [ ],
        "languages" : [ ]
      },
      "application_details" : {
        "via_af" : false,
        "email" : null,
        "other" : null,
        "reference" : "Teknisk specialist mark",
        "url" : "https://recruit.visma.com/Public/Apply.aspx?guidAssignment=ef01aba2-85ef-4bb1-9dcb-85e548b7fd27&publishCode=AMS&TK=ca497074-4081-451e-99c6-a83f4823a319",
        "information" : null
      },
      "source_type" : "VIA_PLATSBANKEN_DXA",
      "application_deadline" : "2022-08-07T23:59:59",
      "external_id" : "46-556009-9581-EF01ABA285EF4BB19DCB85E548B7FD27",
      "workplace_address" : {
        "coordinates" : [ 17.141273, 60.67488 ],
        "city" : null,
        "postcode" : null,
        "municipality" : "Gävle",
        "region_concept_id" : "zupA_8Nt_xcD",
        "region" : "Gävleborgs län",
        "country_code" : "199",
        "region_code" : "21",
        "municipality_concept_id" : "qk8Y_2b6_82D",
        "country_concept_id" : "i46j_HmG_v64",
        "municipality_code" : "2180",
        "street_address" : null,
        "country" : "Sverige"
      },
      "id" : "26278782",
      "experience_required" : true,
      "working_hours_type" : {
        "concept_id" : "6YE1_gAC_R2G",
        "label" : "Heltid",
        "legacy_ams_taxonomy_id" : "1"
      },
      "access" : null,
      "timestamp" : 1656596732339,
      "must_have" : {
        "education_level" : [ ],
        "work_experiences" : [ {
          "concept_id" : "SXAF_LMk_j4S",
          "weight" : 10,
          "label" : "Landskapsarkitekt",
          "legacy_ams_taxonomy_id" : "5447"
        } ],
        "skills" : [ ],
        "education" : [ ],
        "languages" : [ ]
      },
      "occupation_field" : {
        "concept_id" : "6Hq3_tKo_V57",
        "label" : "Yrken med teknisk inriktning",
        "legacy_ams_taxonomy_id" : "18"
      },
      "scope_of_work" : {
        "min" : 100,
        "max" : 100
      },
      "salary_type" : {
        "concept_id" : "oG8G_9cW_nRf",
        "label" : "Fast månads- vecko- eller timlön",
        "legacy_ams_taxonomy_id" : "1"
      },
      "removed" : false,
      "salary_description" : "Enligt avtal.",
      "access_to_own_car" : false,
      "publication_date" : "2022-07-01T00:00:00"
    },
    "name" : "Vi söker en teknisk specialist inom mark",
    "user" : "hannes"
  },
  "sha1" : "4e3d1726eca21f06f1bf8a06c04717702f9a17a9",
  "annotations" : [ {
    "preferred-label" : "Gävle",
    "type" : "municipality",
    "start-position" : 154,
    "end-position" : 166,
    "concept-id" : "qk8Y_2b6_82D",
    "matched-string" : "Gävle kommun",
    "annotation-id" : 9
  }, {
    "preferred-label" : "Gävle",
    "type" : "municipality",
    "start-position" : 188,
    "end-position" : 193,
    "concept-id" : "qk8Y_2b6_82D",
    "matched-string" : "Gävle",
    "annotation-id" : 10
  }, {
    "preferred-label" : "Gävle",
    "type" : "municipality",
    "start-position" : 483,
    "end-position" : 489,
    "concept-id" : "qk8Y_2b6_82D",
    "matched-string" : "Gävles",
    "annotation-id" : 11
  }, {
    "preferred-label" : "Hyresavtal",
    "sentiment" : "MUST_HAVE",
    "type" : "skill",
    "start-position" : 577,
    "end-position" : 587,
    "concept-id" : "xrds_8Cq_rzm",
    "matched-string" : "hyresavtal",
    "annotation-id" : 2
  }, {
    "preferred-label" : "Energiteknik",
    "type" : "skill",
    "start-position" : 748,
    "end-position" : 754,
    "concept-id" : "tNHP_38u_Pjt",
    "matched-string" : "energi",
    "annotation-id" : 12
  }, {
    "preferred-label" : "Elektrotekniker",
    "type" : "occupation-name",
    "start-position" : 774,
    "end-position" : 776,
    "concept-id" : "Avnw_RQP_2qy",
    "matched-string" : "el",
    "annotation-id" : 13
  }, {
    "preferred-label" : "Landskapsingenjörsexamen",
    "sentiment" : "MUST_HAVE",
    "type" : "skill",
    "start-position" : 2216,
    "end-position" : 2222,
    "concept-id" : "gVcG_kVL_iQf",
    "matched-string" : "examen",
    "annotation-id" : 4
  }, {
    "preferred-label" : "Landskapsingenjörsexamen",
    "sentiment" : "MUST_HAVE",
    "type" : "skill",
    "start-position" : 2227,
    "end-position" : 2244,
    "concept-id" : "gVcG_kVL_iQf",
    "matched-string" : "landskapsingenjör",
    "annotation-id" : 5
  }, {
    "preferred-label" : "Svenska",
    "sentiment" : "MUST_HAVE",
    "type" : "language",
    "start-position" : 2442,
    "end-position" : 2449,
    "concept-id" : "zSLA_vw2_FXN",
    "matched-string" : "svenska",
    "annotation-id" : 7
  }, {
    "preferred-label" : "B",
    "type" : "driving-licence",
    "start-position" : 2468,
    "end-position" : 2477,
    "concept-id" : "VTK8_WRx_GcM",
    "matched-string" : "B-körkort",
    "annotation-id" : 14
  } ],
  "text" : "Vi söker en teknisk specialist inom mark\nGavlefastigheters uppdrag är att hållbart förvalta, vårda och utveckla fastigheter för offentliga verksamheter i Gävle kommun. De flesta som bor i Gävle nyttjar våra lokaler på ett eller annat sätt. I vårt fastighetsbestånd hittar du allt från skolor och förskolor till idrottsanläggningar, kulturbyggnader och kontorslokaler. \n\nVi söker nu en teknisk specialist inom mark till vår fastighetsavdelning som tillsammans med oss vill arbeta för Gävles bästa!\n\nPå fastighetsavdelningen arbetar vi med planerat underhåll, lokalanpassningar, hyresavtal genom in- och uthyrning och även köp och försäljning av fastigheter. Idag förvaltar vi cirka 600 000 kvm lokalyta. På avdelningen har vi teknisk kompetens inom energi, mark, miljö, VVS, el, säkerhet, brand och byggnadsinformation för att säkerställa underhåll och utveckling av befintligt fastighetsbestånd. \r\n\r\nARBETSUPPGIFTER\nSom teknisk specialist är du en av bolagets sakkunniga inom markfrågor för att säkerställa långsiktiga och hållbara lösningar för vårat fastighetsbestånd. Du deltar i såväl ny- och ombyggnationer samt i underhållsarbeten. Du arbetar strategiskt med markfrågor som exempelvis dagvatten, grönytor och trafikfrågor. Dina arbetsuppgifter innefattar bland annat att delta som kravställare och beställarkompetens åt bolaget i utförandet av markfrågor. \n\nI uppdraget ingår även omvärldsbevakning och utveckling inom området samt ett aktivt arbete för att öka samverkan inom bolaget, koncernen, kommunkoncernen och med externa aktörer.\n\nHuvudsakliga arbetsuppgifter:\n• Ansvara för övergripande strategier samt processer, instruktioner, rutiner och mallar inom specialistområdet\n• Beställarkompetens i utförandet av markåtgärder i vårat fastighetsbestånd\n• Agera sakkunnig och driva utveckling inom specialistområdet\n• Stötta och utveckla medarbetare i området markfrågor\n• Ansvara för våra projekteringsanvisningar för markfrågor\n• Omvärldsbevaka utvecklingen inom specialistområdet\n• Samverka med driftorganisationen gällande markfrågor\n• Övervaka att lagar och regler inom området följs\n• Genomföra områdesspecifika utredningar vid behov\r\n\r\nKVALIFIKATIONER\nVi ser att du som söker har en treårig akademisk examen som landskapsingenjör eller inriktning mot mark, alternativt utbildning eller erfarenhet som arbetsgivaren bedömer likvärdig. Har du tidigare erfarenhet av markfrågor är det meriterande. Du gör dig förstådd och förstår svenska i tal och skrift. B-körkort är ett krav.\n\nDu som söker behöver vara systematisk och noggrann i ditt arbete. Ha en god social kompetens och samarbetsförmåga. Vi ser också att du är drivande inom ditt ansvarsområde. Du är öppen för ständiga förbättringar och har en vilja att förändra och se utvecklingspotential i arbetsprocesserna."
}