{
  "meta" : {
    "jobad" : {
      "description" : {
        "requirements" : null,
        "needs" : null,
        "company_information" : null,
        "text_formatted" : "<p>Grillbiträde sökes som kan grilla hamburgare, stå i kassa. diska och städa. Anställningen är på heltid och tillsvidare anställning.</p><p>Ansökan tas endast emot via Email!</p>",
        "conditions" : null,
        "text" : "Grillbiträde sökes som kan grilla hamburgare, stå i kassa. diska och städa. Anställningen är på heltid och tillsvidare anställning.\nAnsökan tas endast emot via Email!"
      },
      "headline" : "Grillbiträde",
      "driving_license" : null,
      "employer" : {
        "email" : null,
        "phone_number" : null,
        "organization_number" : "5592763170",
        "name" : "ARKIL Invest AB",
        "url" : null,
        "workplace" : "ARKIL Invest AB"
      },
      "removed_date" : null,
      "logo_url" : null,
      "last_publication_date" : "2022-08-31T00:00:00",
      "number_of_vacancies" : 1,
      "occupation" : {
        "concept_id" : "Cqo8_tUs_JHu",
        "label" : "Grillbiträde/Gatuköksbiträde",
        "legacy_ams_taxonomy_id" : "7017"
      },
      "occupation_group" : {
        "concept_id" : "a8gg_ktU_w8V",
        "label" : "Pizzabagare m.fl.",
        "legacy_ams_taxonomy_id" : "9411"
      },
      "employment_type" : {
        "concept_id" : "PFZr_Syz_cUq",
        "label" : "Vanlig anställning",
        "legacy_ams_taxonomy_id" : "1"
      },
      "webpage_url" : "https://arbetsformedlingen.se/platsbanken/annonser/26368030",
      "driving_license_required" : false,
      "application_contacts" : [ ],
      "duration" : {
        "concept_id" : "a7uU_j21_mkL",
        "label" : "Tills vidare",
        "legacy_ams_taxonomy_id" : "1"
      },
      "nice_to_have" : {
        "education_level" : [ ],
        "work_experiences" : [ ],
        "skills" : [ ],
        "education" : [ ],
        "languages" : [ ]
      },
      "application_details" : {
        "via_af" : false,
        "email" : "arkilab1@hotmail.com",
        "other" : null,
        "reference" : null,
        "url" : null,
        "information" : null
      },
      "source_type" : "VIA_ANNONSERA",
      "application_deadline" : "2022-08-31T00:00:00",
      "external_id" : null,
      "workplace_address" : {
        "coordinates" : [ 18.022930970188604, 59.286870060952 ],
        "city" : "Älvsjö",
        "postcode" : "12535",
        "municipality" : "Stockholm",
        "region_concept_id" : "CifL_Rzy_Mku",
        "region" : "Stockholms län",
        "country_code" : "199",
        "region_code" : "01",
        "municipality_concept_id" : "AvNB_uwa_6n6",
        "country_concept_id" : "i46j_HmG_v64",
        "municipality_code" : "0180",
        "street_address" : "Lisebergsvägen 85",
        "country" : "Sverige"
      },
      "id" : "26368030",
      "experience_required" : false,
      "working_hours_type" : {
        "concept_id" : "6YE1_gAC_R2G",
        "label" : "Heltid",
        "legacy_ams_taxonomy_id" : "1"
      },
      "access" : null,
      "timestamp" : 1659354055292,
      "must_have" : {
        "education_level" : [ ],
        "work_experiences" : [ ],
        "skills" : [ ],
        "education" : [ ],
        "languages" : [ ]
      },
      "occupation_field" : {
        "concept_id" : "ScKy_FHB_7wT",
        "label" : "Hotell, restaurang, storhushåll",
        "legacy_ams_taxonomy_id" : "7"
      },
      "scope_of_work" : {
        "min" : 0,
        "max" : 100
      },
      "salary_type" : {
        "concept_id" : "oG8G_9cW_nRf",
        "label" : "Fast månads- vecko- eller timlön",
        "legacy_ams_taxonomy_id" : "1"
      },
      "removed" : false,
      "salary_description" : null,
      "access_to_own_car" : false,
      "publication_date" : "2022-08-01T13:40:55"
    },
    "name" : "Grillbiträde",
    "user" : "hannes"
  },
  "sha1" : "ab41b6aa9de726f601eaa8565d89554e70a000ae",
  "annotations" : [ {
    "preferred-label" : "Grillbiträde/Gatuköksbiträde",
    "sentiment" : "MUST_HAVE",
    "type" : "occupation-name",
    "start-position" : 0,
    "end-position" : 12,
    "concept-id" : "Cqo8_tUs_JHu",
    "matched-string" : "grillbiträde",
    "annotation-id" : 0
  }, {
    "preferred-label" : "Grillbiträde/Gatuköksbiträde",
    "sentiment" : "MUST_HAVE",
    "type" : "occupation-name",
    "start-position" : 13,
    "end-position" : 25,
    "concept-id" : "Cqo8_tUs_JHu",
    "matched-string" : "grillbiträde",
    "annotation-id" : 1
  }, {
    "preferred-label" : "Städa",
    "sentiment" : "MUST_HAVE",
    "type" : "keyword",
    "start-position" : 82,
    "end-position" : 87,
    "concept-id" : "r35T_iyj_ueU",
    "matched-string" : "städa",
    "annotation-id" : 2
  }, {
    "preferred-label" : "Heltid",
    "type" : "worktime-extent",
    "start-position" : 109,
    "end-position" : 115,
    "concept-id" : "6YE1_gAC_R2G",
    "matched-string" : "heltid",
    "annotation-id" : 3
  }, {
    "preferred-label" : "Tillsvidareanställning (inkl. eventuell provanställning)",
    "type" : "employment-type",
    "start-position" : 120,
    "end-position" : 143,
    "concept-id" : "kpPX_CNN_gDU",
    "matched-string" : "tillsvidare anställning",
    "annotation-id" : 4
  } ],
  "text" : "Grillbiträde\nGrillbiträde sökes som kan grilla hamburgare, stå i kassa. diska och städa. Anställningen är på heltid och tillsvidare anställning.\nAnsökan tas endast emot via Email!"
}