{
  "meta" : {
    "jobad" : {
      "description" : {
        "requirements" : null,
        "needs" : null,
        "company_information" : null,
        "text_formatted" : "Vill du vara med på vår effektiviseringsresa inom ekonomifunktionen? Just nu söker vi dig som har intresse för system och förståelse för finansiella processer!\n\nDin framtida utmaning\n\nVi söker dig som vill vara med och forma Saabs finansiella system. Du kommer bli en del av ett team som har en mycket bred kompetens, där alla deltar i både förvaltning och utveckling av system för finansiell rapportering inom hela Saab gruppen.\n\nI tjänsten ingår såväl förvaltningsuppgifter som utveckling samt deltagande i implementerings och uppgraderingsprojekt av Saabs finansiella system både i Sverige och utomlands. Du kommer vara delaktig i projekt för implementering och utveckling av systemstöd. Mycket fokus ligger på effektivisering och förbättring av verksamheten.\n\nDu kommer arbeta tillsammans med leverantörer och kunder för att se till att systemet stöder ett effektivt arbetssätt. Du har även ett tätt samarbete med övriga ekonomifunktioner på Saab. \n\nRollen är möjlig att anpassa efter din bakgrund och ditt intresse.\n\nDen du är idag\n\nDu som har en god analys- och samarbetsförmåga samt är självgående kommer att trivas hos oss. Du har intresse för system och förståelse finansiella processer.\n\nVi söker dig som är universitetsutbildad inom systemvetenskap eller ekonomi och vill jobba med förvaltning av finansiella system. Du har gärna erfarenhet från Agresso, Unit4 Business World eller liknande system som t.ex Oracle, SAP, IFS, Microsoft Dynamics, Pyramid, Raindance, Hyperion, Cognos eller Mercur. Kunskap i SQL är meriterande. Du måste kunna kommunicera effektivt i både svenska och engelska.\n\nVi behöver bli fler och söker dig som vill ingå i ett team som uppskattar varandras olikheter och strävar efter att skapa en öppen kultur som präglas av respekt och acceptans. Vi tror att ett öppet klimat, där olikheter uppskattas och åsikter välkomnas, är en förutsättning för vår framtida utveckling.\n \n\nVi välkomnar både sökande med lång erfarenhet så väl som personer som är i början av sin yrkeskarriär.\n\nVad du blir en del av\n\nSaab är ett ledande försvars- och säkerhetsföretag med uppdrag att hjälpa nationer att skydda sin befolkning och bidrar till trygghet för människor och samhällen.\n\nMed 18 000 talangfulla medarbetare utvecklar Saab teknik och lösningar för en säkrare, mer hållbar och mer rättvis värld. Saab utvecklar, tillverkar och underhåller avancerade system inom flygteknik, vapen, ledningssystem, sensorer och undervattenssystem. Saab har sitt huvudkontor i Sverige men en global verksamhet där Saab är en del av många nationers försvarsförmåga. Läs mer om oss här \n\nFinancial Systems är en avdelning inom Saabs centrala redovisningsfunktion som ligger i Linköping. Avdelningen har ett globalt ansvar att förvalta, underhålla och utveckla finansiella system inom hela Saab gruppen. Om du är intresserad av vilka förmåner som du kan ta del av som anställd på Saab i Sverige, kan du läsa om dem här\n\nBefattningen kräver att du genomgår och godkänns enligt vid var tid gällande bestämmelser för säkerhetsskydd. För befattningar där Saab har krav på säkerhetsklassinplacering kan, i förekommande fall, medföra krav på visst medborgarskap.\n \n\nSista ansökningsdag 2022-08-31.\n\nUrval sker löpande, välkommen med din ansökan!\n \n\nSaab är ett företag där människan står i centrum. Vi har en god arbetsmiljö där vi stöttar och hjälper varandra att göra vårt bästa. Kontinuerligt lärande, välmående, karriär- och talangutveckling är exempel på områden där vi alltid arbetar hårt för att säkerställa att du som medarbetare får de möjligheter som du behöver.",
        "conditions" : "Heltid\r\nPermanent",
        "text" : "Vill du vara med på vår effektiviseringsresa inom ekonomifunktionen? Just nu söker vi dig som har intresse för system och förståelse för finansiella processer!\n\nDin framtida utmaning\n\nVi söker dig som vill vara med och forma Saabs finansiella system. Du kommer bli en del av ett team som har en mycket bred kompetens, där alla deltar i både förvaltning och utveckling av system för finansiell rapportering inom hela Saab gruppen.\n\nI tjänsten ingår såväl förvaltningsuppgifter som utveckling samt deltagande i implementerings och uppgraderingsprojekt av Saabs finansiella system både i Sverige och utomlands. Du kommer vara delaktig i projekt för implementering och utveckling av systemstöd. Mycket fokus ligger på effektivisering och förbättring av verksamheten.\n\nDu kommer arbeta tillsammans med leverantörer och kunder för att se till att systemet stöder ett effektivt arbetssätt. Du har även ett tätt samarbete med övriga ekonomifunktioner på Saab. \n\nRollen är möjlig att anpassa efter din bakgrund och ditt intresse.\n\nDen du är idag\n\nDu som har en god analys- och samarbetsförmåga samt är självgående kommer att trivas hos oss. Du har intresse för system och förståelse finansiella processer.\n\nVi söker dig som är universitetsutbildad inom systemvetenskap eller ekonomi och vill jobba med förvaltning av finansiella system. Du har gärna erfarenhet från Agresso, Unit4 Business World eller liknande system som t.ex Oracle, SAP, IFS, Microsoft Dynamics, Pyramid, Raindance, Hyperion, Cognos eller Mercur. Kunskap i SQL är meriterande. Du måste kunna kommunicera effektivt i både svenska och engelska.\n\nVi behöver bli fler och söker dig som vill ingå i ett team som uppskattar varandras olikheter och strävar efter att skapa en öppen kultur som präglas av respekt och acceptans. Vi tror att ett öppet klimat, där olikheter uppskattas och åsikter välkomnas, är en förutsättning för vår framtida utveckling.\n \n\nVi välkomnar både sökande med lång erfarenhet så väl som personer som är i början av sin yrkeskarriär.\n\nVad du blir en del av\n\nSaab är ett ledande försvars- och säkerhetsföretag med uppdrag att hjälpa nationer att skydda sin befolkning och bidrar till trygghet för människor och samhällen.\n\nMed 18 000 talangfulla medarbetare utvecklar Saab teknik och lösningar för en säkrare, mer hållbar och mer rättvis värld. Saab utvecklar, tillverkar och underhåller avancerade system inom flygteknik, vapen, ledningssystem, sensorer och undervattenssystem. Saab har sitt huvudkontor i Sverige men en global verksamhet där Saab är en del av många nationers försvarsförmåga. Läs mer om oss här \n\nFinancial Systems är en avdelning inom Saabs centrala redovisningsfunktion som ligger i Linköping. Avdelningen har ett globalt ansvar att förvalta, underhålla och utveckla finansiella system inom hela Saab gruppen. Om du är intresserad av vilka förmåner som du kan ta del av som anställd på Saab i Sverige, kan du läsa om dem här\n\nBefattningen kräver att du genomgår och godkänns enligt vid var tid gällande bestämmelser för säkerhetsskydd. För befattningar där Saab har krav på säkerhetsklassinplacering kan, i förekommande fall, medföra krav på visst medborgarskap.\n \n\nSista ansökningsdag 2022-08-31.\n\nUrval sker löpande, välkommen med din ansökan!\n \n\nSaab är ett företag där människan står i centrum. Vi har en god arbetsmiljö där vi stöttar och hjälper varandra att göra vårt bästa. Kontinuerligt lärande, välmående, karriär- och talangutveckling är exempel på områden där vi alltid arbetar hårt för att säkerställa att du som medarbetare får de möjligheter som du behöver."
      },
      "headline" : "Systemförvaltare inom ekonomi",
      "driving_license" : null,
      "employer" : {
        "email" : null,
        "phone_number" : null,
        "organization_number" : "5560360793",
        "name" : "SAAB AB",
        "url" : null,
        "workplace" : "SAAB AB"
      },
      "removed_date" : null,
      "logo_url" : "https://www.arbetsformedlingen.se/rest/arbetsgivare/rest/af/v3/organisation/5560360793/logotyper/logo.png",
      "last_publication_date" : "2022-08-29T23:59:59",
      "number_of_vacancies" : 1,
      "occupation" : {
        "concept_id" : "nFJR_WkF_ir7",
        "label" : "Systemförvaltare",
        "legacy_ams_taxonomy_id" : "2919"
      },
      "occupation_group" : {
        "concept_id" : "cBBa_ngH_fCx",
        "label" : "Systemförvaltare m.fl.",
        "legacy_ams_taxonomy_id" : "2515"
      },
      "employment_type" : {
        "concept_id" : "PFZr_Syz_cUq",
        "label" : "Vanlig anställning",
        "legacy_ams_taxonomy_id" : "1"
      },
      "webpage_url" : "https://arbetsformedlingen.se/platsbanken/annonser/26385641",
      "driving_license_required" : false,
      "application_contacts" : [ {
        "description" : "Saab AB",
        "email" : null,
        "telephone" : "000",
        "name" : null,
        "contact_type" : null
      } ],
      "duration" : {
        "concept_id" : "a7uU_j21_mkL",
        "label" : "Tills vidare",
        "legacy_ams_taxonomy_id" : "1"
      },
      "nice_to_have" : {
        "education_level" : [ ],
        "work_experiences" : [ ],
        "skills" : [ ],
        "education" : [ ],
        "languages" : [ ]
      },
      "application_details" : {
        "via_af" : false,
        "email" : null,
        "other" : null,
        "reference" : "REQ_14398",
        "url" : "https://www.aplitrak.com/?adid=YW5uYS5hbWJqb3JuLjk0MTI3LjMxMDFAc2FhYi5hcGxpdHJhay5jb20",
        "information" : null
      },
      "source_type" : "VIA_PLATSBANKEN_DXA",
      "application_deadline" : "2022-08-29T23:59:59",
      "external_id" : "46-556036-0793-REQ_14398",
      "workplace_address" : {
        "coordinates" : [ 15.621373, 58.41081 ],
        "city" : null,
        "postcode" : null,
        "municipality" : "Linköping",
        "region_concept_id" : "oLT3_Q9p_3nn",
        "region" : "Östergötlands län",
        "country_code" : "199",
        "region_code" : "05",
        "municipality_concept_id" : "bm2x_1mr_Qhx",
        "country_concept_id" : "i46j_HmG_v64",
        "municipality_code" : "0580",
        "street_address" : null,
        "country" : "Sverige"
      },
      "id" : "26385641",
      "experience_required" : false,
      "working_hours_type" : {
        "concept_id" : "6YE1_gAC_R2G",
        "label" : "Heltid",
        "legacy_ams_taxonomy_id" : "1"
      },
      "access" : null,
      "timestamp" : 1659951713667,
      "must_have" : {
        "education_level" : [ ],
        "work_experiences" : [ ],
        "skills" : [ ],
        "education" : [ ],
        "languages" : [ ]
      },
      "occupation_field" : {
        "concept_id" : "apaJ_2ja_LuF",
        "label" : "Data/IT",
        "legacy_ams_taxonomy_id" : "3"
      },
      "scope_of_work" : {
        "min" : 100,
        "max" : 100
      },
      "salary_type" : {
        "concept_id" : "oG8G_9cW_nRf",
        "label" : "Fast månads- vecko- eller timlön",
        "legacy_ams_taxonomy_id" : "1"
      },
      "removed" : false,
      "salary_description" : "Not Specified",
      "access_to_own_car" : false,
      "publication_date" : "2022-08-08T11:41:53"
    },
    "name" : "Systemförvaltare inom ekonomi",
    "user" : "hannes"
  },
  "sha1" : "6c9f58aed2860329065903fb6b5cb203e0607a8c",
  "annotations" : [ {
    "preferred-label" : "Systemförvaltare",
    "sentiment" : "MUST_HAVE",
    "type" : "forecast-occupation",
    "start-position" : 0,
    "end-position" : 16,
    "concept-id" : "rno7_MFk_voB",
    "matched-string" : "systemförvaltare",
    "annotation-id" : 0
  }, {
    "preferred-label" : "Ekonomi",
    "sentiment" : "MUST_HAVE",
    "type" : "keyword",
    "start-position" : 22,
    "end-position" : 29,
    "concept-id" : "PW4f_bmT_new",
    "matched-string" : "ekonomi",
    "annotation-id" : 1
  }, {
    "preferred-label" : "Systemvetenskap",
    "sentiment" : "MUST_HAVE",
    "type" : "keyword",
    "start-position" : 1274,
    "end-position" : 1289,
    "concept-id" : "k2nm_7ss_NnX",
    "matched-string" : "systemvetenskap",
    "annotation-id" : 2
  }, {
    "preferred-label" : "Ekonomi",
    "sentiment" : "MUST_HAVE",
    "type" : "keyword",
    "start-position" : 1296,
    "end-position" : 1303,
    "concept-id" : "PW4f_bmT_new",
    "matched-string" : "ekonomi",
    "annotation-id" : 3
  }, {
    "preferred-label" : "Agresso, redovisningssystem",
    "sentiment" : "MUST_HAVE",
    "type" : "skill",
    "start-position" : 1387,
    "end-position" : 1394,
    "concept-id" : "iyhf_Cm4_cWw",
    "matched-string" : "agresso",
    "annotation-id" : 4
  }, {
    "preferred-label" : "Oracle, affärssystem",
    "sentiment" : "MUST_HAVE",
    "type" : "skill",
    "start-position" : 1448,
    "end-position" : 1454,
    "concept-id" : "s6Ui_k2K_kf2",
    "matched-string" : "oracle",
    "annotation-id" : 5
  }, {
    "preferred-label" : "SAP, applikationsplattform",
    "sentiment" : "MUST_HAVE",
    "type" : "skill",
    "start-position" : 1456,
    "end-position" : 1459,
    "concept-id" : "iGBs_5FQ_Kk9",
    "matched-string" : "sap",
    "annotation-id" : 6
  }, {
    "preferred-label" : "Pyramid, affärssystem",
    "sentiment" : "MUST_HAVE",
    "type" : "skill",
    "start-position" : 1486,
    "end-position" : 1493,
    "concept-id" : "9pKg_zXP_9ig",
    "matched-string" : "pyramid",
    "annotation-id" : 7
  }, {
    "preferred-label" : "SQL, programmeringsspråk",
    "sentiment" : "MUST_HAVE",
    "type" : "skill",
    "start-position" : 1547,
    "end-position" : 1550,
    "concept-id" : "Xnmr_kYS_YKY",
    "matched-string" : "sql",
    "annotation-id" : 8
  }, {
    "preferred-label" : "Svenska",
    "sentiment" : "MUST_HAVE",
    "type" : "language",
    "start-position" : 1611,
    "end-position" : 1618,
    "concept-id" : "zSLA_vw2_FXN",
    "matched-string" : "svenska",
    "annotation-id" : 9
  }, {
    "preferred-label" : "Engelska",
    "sentiment" : "MUST_HAVE",
    "type" : "keyword",
    "start-position" : 1623,
    "end-position" : 1631,
    "concept-id" : "xiD7_snJ_D8x",
    "matched-string" : "engelska",
    "annotation-id" : 10
  }, {
    "preferred-label" : "Flygteknik",
    "sentiment" : "MUST_HAVE",
    "type" : "skill",
    "start-position" : 2419,
    "end-position" : 2429,
    "concept-id" : "23tt_fXS_N7o",
    "matched-string" : "flygteknik",
    "annotation-id" : 11
  }, {
    "preferred-label" : "arbetsmiljö",
    "sentiment" : "MUST_HAVE",
    "type" : "esco-skill",
    "start-position" : 3342,
    "end-position" : 3353,
    "concept-id" : "zdQY_QJh_nUH",
    "matched-string" : "arbetsmiljö",
    "annotation-id" : 12
  } ],
  "text" : "Systemförvaltare inom ekonomi\nVill du vara med på vår effektiviseringsresa inom ekonomifunktionen? Just nu söker vi dig som har intresse för system och förståelse för finansiella processer!\n\nDin framtida utmaning\n\nVi söker dig som vill vara med och forma Saabs finansiella system. Du kommer bli en del av ett team som har en mycket bred kompetens, där alla deltar i både förvaltning och utveckling av system för finansiell rapportering inom hela Saab gruppen.\n\nI tjänsten ingår såväl förvaltningsuppgifter som utveckling samt deltagande i implementerings och uppgraderingsprojekt av Saabs finansiella system både i Sverige och utomlands. Du kommer vara delaktig i projekt för implementering och utveckling av systemstöd. Mycket fokus ligger på effektivisering och förbättring av verksamheten.\n\nDu kommer arbeta tillsammans med leverantörer och kunder för att se till att systemet stöder ett effektivt arbetssätt. Du har även ett tätt samarbete med övriga ekonomifunktioner på Saab. \n\nRollen är möjlig att anpassa efter din bakgrund och ditt intresse.\n\nDen du är idag\n\nDu som har en god analys- och samarbetsförmåga samt är självgående kommer att trivas hos oss. Du har intresse för system och förståelse finansiella processer.\n\nVi söker dig som är universitetsutbildad inom systemvetenskap eller ekonomi och vill jobba med förvaltning av finansiella system. Du har gärna erfarenhet från Agresso, Unit4 Business World eller liknande system som t.ex Oracle, SAP, IFS, Microsoft Dynamics, Pyramid, Raindance, Hyperion, Cognos eller Mercur. Kunskap i SQL är meriterande. Du måste kunna kommunicera effektivt i både svenska och engelska.\n\nVi behöver bli fler och söker dig som vill ingå i ett team som uppskattar varandras olikheter och strävar efter att skapa en öppen kultur som präglas av respekt och acceptans. Vi tror att ett öppet klimat, där olikheter uppskattas och åsikter välkomnas, är en förutsättning för vår framtida utveckling.\n \n\nVi välkomnar både sökande med lång erfarenhet så väl som personer som är i början av sin yrkeskarriär.\n\nVad du blir en del av\n\nSaab är ett ledande försvars- och säkerhetsföretag med uppdrag att hjälpa nationer att skydda sin befolkning och bidrar till trygghet för människor och samhällen.\n\nMed 18 000 talangfulla medarbetare utvecklar Saab teknik och lösningar för en säkrare, mer hållbar och mer rättvis värld. Saab utvecklar, tillverkar och underhåller avancerade system inom flygteknik, vapen, ledningssystem, sensorer och undervattenssystem. Saab har sitt huvudkontor i Sverige men en global verksamhet där Saab är en del av många nationers försvarsförmåga. Läs mer om oss här \n\nFinancial Systems är en avdelning inom Saabs centrala redovisningsfunktion som ligger i Linköping. Avdelningen har ett globalt ansvar att förvalta, underhålla och utveckla finansiella system inom hela Saab gruppen. Om du är intresserad av vilka förmåner som du kan ta del av som anställd på Saab i Sverige, kan du läsa om dem här\n\nBefattningen kräver att du genomgår och godkänns enligt vid var tid gällande bestämmelser för säkerhetsskydd. För befattningar där Saab har krav på säkerhetsklassinplacering kan, i förekommande fall, medföra krav på visst medborgarskap.\n \n\nSista ansökningsdag 2022-08-31.\n\nUrval sker löpande, välkommen med din ansökan!\n \n\nSaab är ett företag där människan står i centrum. Vi har en god arbetsmiljö där vi stöttar och hjälper varandra att göra vårt bästa. Kontinuerligt lärande, välmående, karriär- och talangutveckling är exempel på områden där vi alltid arbetar hårt för att säkerställa att du som medarbetare får de möjligheter som du behöver."
}