{
  "meta" : {
    "description" : "",
    "ssyk-nivå-4-kod(er)" : "[]",
    "utbildningsbeskrivning" : "Om yrket\r\nSom mätningstekniker arbetar du bland annat med att planera och utföra olika typer av mätningar, ofta utsättning vid nybyggnationer av hus- och vägbyggen.\r\nArbetet innebär att du från ritningar ska med hjälp av instrument sätta ut platsen för var exempelvis ett nytt hus ska byggas.\r\n \r\nJobbmöjligheter\r\nDet finns stor efterfrågan på Mätningstekniker och därför är det goda möjligheter till arbete.\r\n\r\nOm utbildningen.\r\nVad är målet med utbildningen?\r\nUtbildningen är en grundutbildning inom området och målet är att få arbete som Mätningstekniker\r\n\r\nHur går utbildningen till?\r\nUtbildningen består av både praktiska och teoretiska moment. \r\n\r\nHur lång är utbildningen?\r\nHela utbildningen är ca 36 veckor lång. Men utifrån dina och företagens behov kan den bli såväl längre som kortare. \r\n\r\nNär startar utbildningen?\r\nOm det inte finns några aktuella starter så kan du fråga någon på din arbetsförmedling.",
    "name" : "109 Grunderna inom några byggtekniska områden",
    "modulens id" : "21791",
    "type" : "",
    "utbildningsid" : "121508",
    "ssyk-nivå-4-namn" : "[]",
    "utbildningsnamn" : "Mätningstekniker"
  },
  "sha1" : "4a288d4ed9e0ccd4b0ce33fd1cfefbfc578313f2",
  "annotations" : [ {
    "preferred-label" : "Husbyggnad",
    "sentiment" : "OFFERED",
    "type" : "skill",
    "start-position" : 61,
    "end-position" : 71,
    "concept-id" : "X9ta_N3H_1is",
    "matched-string" : "husbyggnad",
    "annotation-id" : 0
  } ],
  "text" : "Introduktion till metoder för områdena, schaktning, VA samt\r\nhusbyggnad.\r\n"
}