{
  "meta" : {
    "jobad" : {
      "description" : {
        "requirements" : null,
        "needs" : null,
        "company_information" : null,
        "text_formatted" : "Vill du bli vår nya kollega?\nCA Fastigheter, med snart 100 anställda, ingår i den familjeägda CA-koncernen. Vi äger fastigheter i attraktiva tillväxtregioner - både i och utanför Sverige. Vi finns med kontor på sex orter i Sverige, från Stockholm i norr till Malmö i söder och med huvudkontor i Kalmar. Totalt omfattar fastighetsbeståndet cirka 675 000 kvm. Bolaget har funnits i över 100 år och planen är att finnas minst lika länge till. Vill du bygga och förvalta för framtiden tillsammans med oss? Välkommen till ett fastighetsbolag där hållbarhet och säkerhet alltid finns med i vardagen och en företagskultur som präglas av nära samarbeten och korta beslutsvägar.\n\nLäs mer om oss på www.cafastigheter.se (https://eur02.safelinks.protection.outlook.com/?url=http%3A%2F%2Fwww.cafastigheter.se%2F&data=04%7C01%7C%7C06bacbb1c10f43052d1408d93644bcb1%7Cba6c449791314796ae6ab078ef7f3b29%7C1%7C0%7C637600491117721535%7CUnknown%7CTWFpbGZsb3d8eyJWIjoiMC4wLjAwMDAiLCJQIjoiV2luMzIiLCJBTiI6Ik1haWwiLCJXVCI6Mn0%3D%7C1000&sdata=YWCNVGchrNN2w2yxa9N2y1JPmrW06CgJY6XQ7cQLTcw%3D&reserved=0)\n\nArbetsuppgifter\nI rollen som Fastighetsskötare ansvarar du för att ge hyresgästerna bästa tänkbara service. Genom att vara lyhörd och serviceinriktad skapar du en bekymmersfri vardag för hyresgästerna, vilket i sin tur bygger värden inom koncernen. Vårt fastighetsbestånd i Stockholm består av ca 100.000 kvm intressanta kommersiella byggnader, primärt handel och kontor. Dessutom är ett av våra fokusområden att utveckla nya områden och fastigheter vilket innebär att beståndet kommer att utökas på sikt. Som Fastighetsskötare ansvarar du för den dagliga driften och skötseln av våra fastigheter. Vidare ingår att initiera och genomföra underhållsåtgärder och upphandling i samråd med Teknisk chef. Vanligt förekommande arbetsuppgifter består av att åtgärda felanmälningar, utföra ronderingar och daglig skötsel samt uppföljning av serviceavtal.\n\nPå vårt regionkontor i Stockholm är sex personer placerade och har roller som Regionchef, Kommersiell uthyrare, Byggprojektchef, Projektledare och Teknisk chef. Du blir vår första Fastighetsskötare i Stockholm och över hela CA-koncernen har vi 35 personer med motsvarande roll.\n\nDin bakgrund\nVi söker dig som på ett prestigelöst och serviceinriktat sätt driver och planerar arbetet framåt. För att vara aktuell för tjänsten som Fastighetsskötare har du relevant arbetslivserfarenhet från likvärdigt arbete. Erfarenhet av att genomföra vecko- respektive månadsprov på brandlarm och/eller sprinkler är meriterande.\n\nEftersom du dagligen behöver transportera dig mellan våra fastigheter är B-körkort ett krav. Dessutom krävs god datorvana för att på ett effektivt sätt kunna hantera inkomna felanmälningar. För att lyckas i rollen hos CA Fastigheter agerar du professionellt i mötet med hyresgästen och är en problemlösare ut i fingerspetsarna. För att kommunicera med våra hyresgäster behöver du kunna hantera svenska flytande i såväl tal som skrift och även ha kunskaper i engelska.\n\nTillträde\nSnarast, eller enligt överenskommelse.\n\nVaraktighet:\nTillsvidare.\nProvanställning kan komma att tillämpas.\n\nÖvrigt\nSista ansökningsdag är 28 augusti. Observera att vi endast tar emot ansökningar via vårt webbverktyg.\n\nHar du frågor angående tjänsten är du välkommen att kontakta:\nBjörn Ruthström, Teknisk chef, 08-505 950 51\nSofia Lundin, HR-ansvarig, 0480-574 10\n\nInför rekryteringen har vi tagit ställning till rekryteringskanaler och marknadsföring. Vi undanber oss därför kontakt av mediesäljare och rekryteringsföretag.",
        "conditions" : "Heltid\r\nAnställningstid enligt överenskommelse",
        "text" : "Vill du bli vår nya kollega?\nCA Fastigheter, med snart 100 anställda, ingår i den familjeägda CA-koncernen. Vi äger fastigheter i attraktiva tillväxtregioner - både i och utanför Sverige. Vi finns med kontor på sex orter i Sverige, från Stockholm i norr till Malmö i söder och med huvudkontor i Kalmar. Totalt omfattar fastighetsbeståndet cirka 675 000 kvm. Bolaget har funnits i över 100 år och planen är att finnas minst lika länge till. Vill du bygga och förvalta för framtiden tillsammans med oss? Välkommen till ett fastighetsbolag där hållbarhet och säkerhet alltid finns med i vardagen och en företagskultur som präglas av nära samarbeten och korta beslutsvägar.\n\nLäs mer om oss på www.cafastigheter.se (https://eur02.safelinks.protection.outlook.com/?url=http%3A%2F%2Fwww.cafastigheter.se%2F&data=04%7C01%7C%7C06bacbb1c10f43052d1408d93644bcb1%7Cba6c449791314796ae6ab078ef7f3b29%7C1%7C0%7C637600491117721535%7CUnknown%7CTWFpbGZsb3d8eyJWIjoiMC4wLjAwMDAiLCJQIjoiV2luMzIiLCJBTiI6Ik1haWwiLCJXVCI6Mn0%3D%7C1000&sdata=YWCNVGchrNN2w2yxa9N2y1JPmrW06CgJY6XQ7cQLTcw%3D&reserved=0)\n\nArbetsuppgifter\nI rollen som Fastighetsskötare ansvarar du för att ge hyresgästerna bästa tänkbara service. Genom att vara lyhörd och serviceinriktad skapar du en bekymmersfri vardag för hyresgästerna, vilket i sin tur bygger värden inom koncernen. Vårt fastighetsbestånd i Stockholm består av ca 100.000 kvm intressanta kommersiella byggnader, primärt handel och kontor. Dessutom är ett av våra fokusområden att utveckla nya områden och fastigheter vilket innebär att beståndet kommer att utökas på sikt. Som Fastighetsskötare ansvarar du för den dagliga driften och skötseln av våra fastigheter. Vidare ingår att initiera och genomföra underhållsåtgärder och upphandling i samråd med Teknisk chef. Vanligt förekommande arbetsuppgifter består av att åtgärda felanmälningar, utföra ronderingar och daglig skötsel samt uppföljning av serviceavtal.\n\nPå vårt regionkontor i Stockholm är sex personer placerade och har roller som Regionchef, Kommersiell uthyrare, Byggprojektchef, Projektledare och Teknisk chef. Du blir vår första Fastighetsskötare i Stockholm och över hela CA-koncernen har vi 35 personer med motsvarande roll.\n\nDin bakgrund\nVi söker dig som på ett prestigelöst och serviceinriktat sätt driver och planerar arbetet framåt. För att vara aktuell för tjänsten som Fastighetsskötare har du relevant arbetslivserfarenhet från likvärdigt arbete. Erfarenhet av att genomföra vecko- respektive månadsprov på brandlarm och/eller sprinkler är meriterande.\n\nEftersom du dagligen behöver transportera dig mellan våra fastigheter är B-körkort ett krav. Dessutom krävs god datorvana för att på ett effektivt sätt kunna hantera inkomna felanmälningar. För att lyckas i rollen hos CA Fastigheter agerar du professionellt i mötet med hyresgästen och är en problemlösare ut i fingerspetsarna. För att kommunicera med våra hyresgäster behöver du kunna hantera svenska flytande i såväl tal som skrift och även ha kunskaper i engelska.\n\nTillträde\nSnarast, eller enligt överenskommelse.\n\nVaraktighet:\nTillsvidare.\nProvanställning kan komma att tillämpas.\n\nÖvrigt\nSista ansökningsdag är 28 augusti. Observera att vi endast tar emot ansökningar via vårt webbverktyg.\n\nHar du frågor angående tjänsten är du välkommen att kontakta:\nBjörn Ruthström, Teknisk chef, 08-505 950 51\nSofia Lundin, HR-ansvarig, 0480-574 10\n\nInför rekryteringen har vi tagit ställning till rekryteringskanaler och marknadsföring. Vi undanber oss därför kontakt av mediesäljare och rekryteringsföretag."
      },
      "headline" : "Fastighetsskötare",
      "driving_license" : null,
      "employer" : {
        "email" : null,
        "phone_number" : null,
        "organization_number" : "5562275700",
        "name" : "CA Fastigheter AB (publ)",
        "url" : null,
        "workplace" : "CA Fastigheter"
      },
      "removed_date" : null,
      "logo_url" : "https://www.arbetsformedlingen.se/rest/arbetsgivare/rest/af/v3/organisation/5562275700/logotyper/logo.png",
      "last_publication_date" : "2022-08-28T23:59:59",
      "number_of_vacancies" : 1,
      "occupation" : {
        "concept_id" : "C6Cv_9ZR_7Gb",
        "label" : "Fastighetsskötare/Fastighetsarbetare",
        "legacy_ams_taxonomy_id" : "5885"
      },
      "occupation_group" : {
        "concept_id" : "df9D_e6y_61z",
        "label" : "Fastighetsskötare",
        "legacy_ams_taxonomy_id" : "5152"
      },
      "employment_type" : {
        "concept_id" : "PFZr_Syz_cUq",
        "label" : "Vanlig anställning",
        "legacy_ams_taxonomy_id" : "1"
      },
      "webpage_url" : "https://arbetsformedlingen.se/platsbanken/annonser/26355919",
      "driving_license_required" : false,
      "application_contacts" : [ {
        "description" : "Sofia Lundin",
        "email" : null,
        "telephone" : null,
        "name" : null,
        "contact_type" : null
      } ],
      "duration" : {
        "concept_id" : "a7uU_j21_mkL",
        "label" : "Tills vidare",
        "legacy_ams_taxonomy_id" : "1"
      },
      "nice_to_have" : {
        "education_level" : [ ],
        "work_experiences" : [ ],
        "skills" : [ ],
        "education" : [ ],
        "languages" : [ ]
      },
      "application_details" : {
        "via_af" : false,
        "email" : null,
        "other" : null,
        "reference" : null,
        "url" : "https://jobbahososs.cafastigheter.se/jobs/1891366-fastighetsskotare?promotion=454247-arbetsformedlingen",
        "information" : null
      },
      "source_type" : "VIA_PLATSBANKEN_DXA",
      "application_deadline" : "2022-08-28T23:59:59",
      "external_id" : "46-556227-5700-1891366-1",
      "workplace_address" : {
        "coordinates" : [ 18.06858, 59.329323 ],
        "city" : null,
        "postcode" : null,
        "municipality" : "Stockholm",
        "region_concept_id" : "CifL_Rzy_Mku",
        "region" : "Stockholms län",
        "country_code" : "199",
        "region_code" : "01",
        "municipality_concept_id" : "AvNB_uwa_6n6",
        "country_concept_id" : "i46j_HmG_v64",
        "municipality_code" : "0180",
        "street_address" : null,
        "country" : "Sverige"
      },
      "id" : "26355919",
      "experience_required" : true,
      "working_hours_type" : {
        "concept_id" : "6YE1_gAC_R2G",
        "label" : "Heltid",
        "legacy_ams_taxonomy_id" : "1"
      },
      "access" : null,
      "timestamp" : 1658855263771,
      "must_have" : {
        "education_level" : [ ],
        "work_experiences" : [ {
          "concept_id" : "C6Cv_9ZR_7Gb",
          "weight" : 10,
          "label" : "Fastighetsskötare/Fastighetsarbetare",
          "legacy_ams_taxonomy_id" : "5885"
        } ],
        "skills" : [ ],
        "education" : [ ],
        "languages" : [ ]
      },
      "occupation_field" : {
        "concept_id" : "yhCP_AqT_tns",
        "label" : "Installation, drift, underhåll",
        "legacy_ams_taxonomy_id" : "10"
      },
      "scope_of_work" : {
        "min" : 100,
        "max" : 100
      },
      "salary_type" : {
        "concept_id" : "oG8G_9cW_nRf",
        "label" : "Fast månads- vecko- eller timlön",
        "legacy_ams_taxonomy_id" : "1"
      },
      "removed" : false,
      "salary_description" : "Lön enligt överenskommelse",
      "access_to_own_car" : false,
      "publication_date" : "2022-07-26T19:07:43"
    },
    "name" : "Fastighetsskötare",
    "user" : "kristof.fischer"
  },
  "sha1" : "df1e33bb8ead15e76b1125fe1c201d7bee7b0ffa",
  "annotations" : [ {
    "preferred-label" : "Fastighetsskötare/Fastighetsarbetare",
    "sentiment" : "MUST_HAVE",
    "type" : "occupation-name",
    "start-position" : 0,
    "end-position" : 17,
    "concept-id" : "C6Cv_9ZR_7Gb",
    "matched-string" : "fastighetsskötare",
    "annotation-id" : 0
  }, {
    "preferred-label" : "Sverige",
    "type" : "country",
    "start-position" : 197,
    "end-position" : 204,
    "concept-id" : "i46j_HmG_v64",
    "matched-string" : "Sverige",
    "annotation-id" : 17
  }, {
    "preferred-label" : "Sverige",
    "type" : "country",
    "start-position" : 241,
    "end-position" : 248,
    "concept-id" : "i46j_HmG_v64",
    "matched-string" : "Sverige",
    "annotation-id" : 18
  }, {
    "preferred-label" : "Stockholm",
    "type" : "municipality",
    "start-position" : 255,
    "end-position" : 264,
    "concept-id" : "AvNB_uwa_6n6",
    "matched-string" : "Stockholm",
    "annotation-id" : 19
  }, {
    "preferred-label" : "Malmö",
    "type" : "municipality",
    "start-position" : 277,
    "end-position" : 282,
    "concept-id" : "oYPt_yRA_Smm",
    "matched-string" : "Malmö",
    "annotation-id" : 20
  }, {
    "preferred-label" : "Kalmar",
    "type" : "municipality",
    "start-position" : 313,
    "end-position" : 319,
    "concept-id" : "Pnmg_SgP_uHQ",
    "matched-string" : "Kalmar",
    "annotation-id" : 21
  }, {
    "preferred-label" : "Object Component Model/COM",
    "sentiment" : "MUST_HAVE",
    "type" : "skill",
    "start-position" : 772,
    "end-position" : 775,
    "concept-id" : "Np6W_aQg_Rkn",
    "matched-string" : "com",
    "annotation-id" : 2
  }, {
    "preferred-label" : "Data/IT",
    "sentiment" : "MUST_HAVE",
    "type" : "occupation-field",
    "start-position" : 818,
    "end-position" : 822,
    "concept-id" : "apaJ_2ja_LuF",
    "matched-string" : "data",
    "annotation-id" : 3
  }, {
    "preferred-label" : "Fastighetsskötare/Fastighetsarbetare",
    "sentiment" : "MUST_HAVE",
    "type" : "occupation-name",
    "start-position" : 1126,
    "end-position" : 1143,
    "concept-id" : "C6Cv_9ZR_7Gb",
    "matched-string" : "fastighetsskötare",
    "annotation-id" : 4
  }, {
    "preferred-label" : "Stockholm",
    "type" : "municipality",
    "start-position" : 1371,
    "end-position" : 1380,
    "concept-id" : "AvNB_uwa_6n6",
    "matched-string" : "Stockholm",
    "annotation-id" : 22
  }, {
    "preferred-label" : "Fastighetsskötare/Fastighetsarbetare",
    "sentiment" : "MUST_HAVE",
    "type" : "occupation-name",
    "start-position" : 1607,
    "end-position" : 1624,
    "concept-id" : "C6Cv_9ZR_7Gb",
    "matched-string" : "fastighetsskötare",
    "annotation-id" : 6
  }, {
    "preferred-label" : "Stockholm",
    "type" : "municipality",
    "start-position" : 1968,
    "end-position" : 1977,
    "concept-id" : "AvNB_uwa_6n6",
    "matched-string" : "Stockholm",
    "annotation-id" : 23
  }, {
    "preferred-label" : "Stockholm",
    "type" : "municipality",
    "start-position" : 2145,
    "end-position" : 2154,
    "concept-id" : "AvNB_uwa_6n6",
    "matched-string" : "Stockholm",
    "annotation-id" : 24
  }, {
    "preferred-label" : "Brandteknik",
    "sentiment" : "NICE_TO_HAVE",
    "type" : "skill",
    "start-position" : 2512,
    "end-position" : 2541,
    "concept-id" : "cRTW_MkF_2wh",
    "matched-string" : "brandlarm och/eller sprinkler",
    "annotation-id" : 25
  }, {
    "preferred-label" : "B",
    "sentiment" : "MUST_HAVE",
    "type" : "driving-licence",
    "start-position" : 2632,
    "end-position" : 2641,
    "concept-id" : "VTK8_WRx_GcM",
    "matched-string" : "B-körkort",
    "annotation-id" : 26
  }, {
    "preferred-label" : "använda dator",
    "sentiment" : "MUST_HAVE",
    "type" : "esco-skill",
    "start-position" : 2667,
    "end-position" : 2680,
    "concept-id" : "HEbR_xrb_MpT",
    "matched-string" : "god datorvana",
    "annotation-id" : 27
  }, {
    "preferred-label" : "hitta lösningar på problem",
    "sentiment" : "MUST_HAVE",
    "type" : "esco-skill",
    "start-position" : 2851,
    "end-position" : 2864,
    "concept-id" : "WFSY_Bwt_QWE",
    "matched-string" : "problemlösare",
    "annotation-id" : 28
  }, {
    "preferred-label" : "Svenska",
    "sentiment" : "MUST_HAVE",
    "type" : "language",
    "start-position" : 2953,
    "end-position" : 2960,
    "concept-id" : "zSLA_vw2_FXN",
    "matched-string" : "svenska",
    "annotation-id" : 13
  }, {
    "preferred-label" : "Engelska",
    "sentiment" : "MUST_HAVE",
    "type" : "language",
    "start-position" : 3017,
    "end-position" : 3025,
    "concept-id" : "NVxJ_hLg_TYS",
    "matched-string" : "engelska",
    "annotation-id" : 14
  }, {
    "preferred-label" : "Tillsvidareanställning (inkl. eventuell provanställning)",
    "type" : "employment-type",
    "start-position" : 3091,
    "end-position" : 3102,
    "concept-id" : "kpPX_CNN_gDU",
    "matched-string" : "Tillsvidare",
    "annotation-id" : 29
  } ],
  "text" : "Fastighetsskötare\nVill du bli vår nya kollega?\nCA Fastigheter, med snart 100 anställda, ingår i den familjeägda CA-koncernen. Vi äger fastigheter i attraktiva tillväxtregioner - både i och utanför Sverige. Vi finns med kontor på sex orter i Sverige, från Stockholm i norr till Malmö i söder och med huvudkontor i Kalmar. Totalt omfattar fastighetsbeståndet cirka 675 000 kvm. Bolaget har funnits i över 100 år och planen är att finnas minst lika länge till. Vill du bygga och förvalta för framtiden tillsammans med oss? Välkommen till ett fastighetsbolag där hållbarhet och säkerhet alltid finns med i vardagen och en företagskultur som präglas av nära samarbeten och korta beslutsvägar.\n\nLäs mer om oss på www.cafastigheter.se (https://eur02.safelinks.protection.outlook.com/?url=http%3A%2F%2Fwww.cafastigheter.se%2F&data=04%7C01%7C%7C06bacbb1c10f43052d1408d93644bcb1%7Cba6c449791314796ae6ab078ef7f3b29%7C1%7C0%7C637600491117721535%7CUnknown%7CTWFpbGZsb3d8eyJWIjoiMC4wLjAwMDAiLCJQIjoiV2luMzIiLCJBTiI6Ik1haWwiLCJXVCI6Mn0%3D%7C1000&sdata=YWCNVGchrNN2w2yxa9N2y1JPmrW06CgJY6XQ7cQLTcw%3D&reserved=0)\n\nArbetsuppgifter\nI rollen som Fastighetsskötare ansvarar du för att ge hyresgästerna bästa tänkbara service. Genom att vara lyhörd och serviceinriktad skapar du en bekymmersfri vardag för hyresgästerna, vilket i sin tur bygger värden inom koncernen. Vårt fastighetsbestånd i Stockholm består av ca 100.000 kvm intressanta kommersiella byggnader, primärt handel och kontor. Dessutom är ett av våra fokusområden att utveckla nya områden och fastigheter vilket innebär att beståndet kommer att utökas på sikt. Som Fastighetsskötare ansvarar du för den dagliga driften och skötseln av våra fastigheter. Vidare ingår att initiera och genomföra underhållsåtgärder och upphandling i samråd med Teknisk chef. Vanligt förekommande arbetsuppgifter består av att åtgärda felanmälningar, utföra ronderingar och daglig skötsel samt uppföljning av serviceavtal.\n\nPå vårt regionkontor i Stockholm är sex personer placerade och har roller som Regionchef, Kommersiell uthyrare, Byggprojektchef, Projektledare och Teknisk chef. Du blir vår första Fastighetsskötare i Stockholm och över hela CA-koncernen har vi 35 personer med motsvarande roll.\n\nDin bakgrund\nVi söker dig som på ett prestigelöst och serviceinriktat sätt driver och planerar arbetet framåt. För att vara aktuell för tjänsten som Fastighetsskötare har du relevant arbetslivserfarenhet från likvärdigt arbete. Erfarenhet av att genomföra vecko- respektive månadsprov på brandlarm och/eller sprinkler är meriterande.\n\nEftersom du dagligen behöver transportera dig mellan våra fastigheter är B-körkort ett krav. Dessutom krävs god datorvana för att på ett effektivt sätt kunna hantera inkomna felanmälningar. För att lyckas i rollen hos CA Fastigheter agerar du professionellt i mötet med hyresgästen och är en problemlösare ut i fingerspetsarna. För att kommunicera med våra hyresgäster behöver du kunna hantera svenska flytande i såväl tal som skrift och även ha kunskaper i engelska.\n\nTillträde\nSnarast, eller enligt överenskommelse.\n\nVaraktighet:\nTillsvidare.\nProvanställning kan komma att tillämpas.\n\nÖvrigt\nSista ansökningsdag är 28 augusti. Observera att vi endast tar emot ansökningar via vårt webbverktyg.\n\nHar du frågor angående tjänsten är du välkommen att kontakta:\nBjörn Ruthström, Teknisk chef, 08-505 950 51\nSofia Lundin, HR-ansvarig, 0480-574 10\n\nInför rekryteringen har vi tagit ställning till rekryteringskanaler och marknadsföring. Vi undanber oss därför kontakt av mediesäljare och rekryteringsföretag."
}