{
  "meta" : {
    "jobad" : {
      "description" : {
        "requirements" : null,
        "needs" : null,
        "company_information" : null,
        "text_formatted" : "Är du intresserad av programmering och matematiska modeller och har du praktisk kunskap om finansiella instrument och utvärdering av vilka risker som finns i dessa? Då kan det här vara jobbet för dig. \n\nOm jobbet\n\nSom junior analytiker på avdelningen Risktillsyn försäkring arbetar du med tillsyn av försäkringsbolagens hantering av marknadsrisker samt löpande granskning av deras riskexponering och riskhantering i placeringstillgångarna. Du kommer medverka i undersökningar och analysprojekt och hantera, sammanställa och analysera inrapporterad riskinformation och data, samt utveckla datastödd analys i SAS och Excel. I tjänsten ingår dessutom deltagande i nationella och internationella projekt rörande metod- och regelutveckling för att förbättra tillsynen av marknadsrisker.\n\nTjänsten ger dig även mycket goda möjligheter att löpande utvecklas inom programmering och matematiska modeller då det finns kollegor med mycket goda och djupa kunskaper inom detta.\n\nDin utbildning och erfarenhet\n\nVi söker dig som:\n\n\n• har akademisk examen motsvarande civilekonom eller civilingenjör inom finansiell ekonomi\n• har något års erfarenhet av analys av marknadsrisker och finansiella instrument inom finansiella företag eller myndigheter\n• har praktisk kunskap om finansiella instrument och utvärdering av vilka risker som finns i dessa\n• är intresserad av programmering och matematiska modeller\n• uttrycker dig väl på svenska och engelska i både tal och skrift.\n\nDet är meriterande om du:                                                                 \n\n\n• har fördjupande utbildning i finansiell matematik och/eller matematisk statistik\n• tidigare arbetat med Solvens 2- eller annan form av myndighetsrapportering\n• har erfarenhet av värdepappershantering, exempelvis Back Office\n• har kunskaper i SAS, VBA-programmering, SQL och försäkring\n• har kunskaper om kapitalkrav inom Solvens 2, riskkänsligt kapitalkrav för tjänstepensionsföretag.\n\nOm dig \n\nI det här jobbet behöver du:\n\n\n• vara självgående, analytisk och initiativtagande\n• bidra till ett gott samarbete\n• arbeta självständigt utifrån de värderingar och riktlinjer som styr verksamheten\n• vara hjälpsam, flexibel och bemöta andra på ett vänligt och respektfullt sätt.\n\n\n\n\nFinansinspektionen (FI) bidrar till ett stabilt finansiellt system, en hållbar utveckling och ett högt skydd för konsumenter. Vi erbjuder dig att arbeta med samhällsviktiga uppgifter, där du är med och påverkar den finansiella marknaden. \n \n På FI arbetar cirka 600 personer och våra värderingar präglas av att vi är engagerade, beslutsamma, målinriktade och hjälpsamma. Vår arbetsplats ligger centralt i Stockholm. Det finns även möjlighet att delvis arbeta på distans. \n\n\n\nBra att veta\n\nVi baserar vår rekrytering på kompetens. Det innebär att vi noggrant definierar vilka kvalifikationer som efterfrågas och sedan utgår från dem genom hela rekryteringsprocessen.\n\nVi arbetar aktivt för mångfald och likabehandling och välkomnar därför medarbetare med olika erfarenheter, bakgrunder och kompetenser.\n\nArbetspsykologiska tester ingår i rekryteringsprocessen.\n\nPå FI arbetar vi aktivt för att vara en attraktiv arbetsgivare där du som medarbetare trivs och utvecklas. Läs mer om hur det är att jobba på FI och vad vi erbjuder: https://www.fi.se/sv/om-fi/lediga-jobb/vi-erbjuder/\n\nEn anställning på FI kan innebära att säkerhetsprövning och registerkontroll görs enligt säkerhetsskyddslagen.\n\nSök jobbet\n\nVälkommen med din ansökan som ska innehålla cv, personligt brev och relevanta intyg eller examensbevis.\n\nVi avböjer all hjälp med rekrytering och annonsering.\n\n\n\n\n\nAnställningsform:\n\n\n\nAnställningen är tillsvidare och inleds med sex månaders provanställning. Tillträde enligt överenskommelse.\n\n\n\n\n\nOmfattning:\n\n\n\nHeltid\n\n\n\n\n\nKontaktperson:\n\n\n\nPer Jakobsson, biträdande avdelningschef, 08-408 982 11\n\n\n\n\n\nSista ansökningsdag:\n\n\n\n2022-07-01\n\n\n\n\n\n \n\n ",
        "conditions" : "Heltid/\r\nEj specificerat",
        "text" : "Är du intresserad av programmering och matematiska modeller och har du praktisk kunskap om finansiella instrument och utvärdering av vilka risker som finns i dessa? Då kan det här vara jobbet för dig. \n\nOm jobbet\n\nSom junior analytiker på avdelningen Risktillsyn försäkring arbetar du med tillsyn av försäkringsbolagens hantering av marknadsrisker samt löpande granskning av deras riskexponering och riskhantering i placeringstillgångarna. Du kommer medverka i undersökningar och analysprojekt och hantera, sammanställa och analysera inrapporterad riskinformation och data, samt utveckla datastödd analys i SAS och Excel. I tjänsten ingår dessutom deltagande i nationella och internationella projekt rörande metod- och regelutveckling för att förbättra tillsynen av marknadsrisker.\n\nTjänsten ger dig även mycket goda möjligheter att löpande utvecklas inom programmering och matematiska modeller då det finns kollegor med mycket goda och djupa kunskaper inom detta.\n\nDin utbildning och erfarenhet\n\nVi söker dig som:\n\n\n• har akademisk examen motsvarande civilekonom eller civilingenjör inom finansiell ekonomi\n• har något års erfarenhet av analys av marknadsrisker och finansiella instrument inom finansiella företag eller myndigheter\n• har praktisk kunskap om finansiella instrument och utvärdering av vilka risker som finns i dessa\n• är intresserad av programmering och matematiska modeller\n• uttrycker dig väl på svenska och engelska i både tal och skrift.\n\nDet är meriterande om du:                                                                 \n\n\n• har fördjupande utbildning i finansiell matematik och/eller matematisk statistik\n• tidigare arbetat med Solvens 2- eller annan form av myndighetsrapportering\n• har erfarenhet av värdepappershantering, exempelvis Back Office\n• har kunskaper i SAS, VBA-programmering, SQL och försäkring\n• har kunskaper om kapitalkrav inom Solvens 2, riskkänsligt kapitalkrav för tjänstepensionsföretag.\n\nOm dig \n\nI det här jobbet behöver du:\n\n\n• vara självgående, analytisk och initiativtagande\n• bidra till ett gott samarbete\n• arbeta självständigt utifrån de värderingar och riktlinjer som styr verksamheten\n• vara hjälpsam, flexibel och bemöta andra på ett vänligt och respektfullt sätt.\n\n\n\n\nFinansinspektionen (FI) bidrar till ett stabilt finansiellt system, en hållbar utveckling och ett högt skydd för konsumenter. Vi erbjuder dig att arbeta med samhällsviktiga uppgifter, där du är med och påverkar den finansiella marknaden. \n \n På FI arbetar cirka 600 personer och våra värderingar präglas av att vi är engagerade, beslutsamma, målinriktade och hjälpsamma. Vår arbetsplats ligger centralt i Stockholm. Det finns även möjlighet att delvis arbeta på distans. \n\n\n\nBra att veta\n\nVi baserar vår rekrytering på kompetens. Det innebär att vi noggrant definierar vilka kvalifikationer som efterfrågas och sedan utgår från dem genom hela rekryteringsprocessen.\n\nVi arbetar aktivt för mångfald och likabehandling och välkomnar därför medarbetare med olika erfarenheter, bakgrunder och kompetenser.\n\nArbetspsykologiska tester ingår i rekryteringsprocessen.\n\nPå FI arbetar vi aktivt för att vara en attraktiv arbetsgivare där du som medarbetare trivs och utvecklas. Läs mer om hur det är att jobba på FI och vad vi erbjuder: https://www.fi.se/sv/om-fi/lediga-jobb/vi-erbjuder/\n\nEn anställning på FI kan innebära att säkerhetsprövning och registerkontroll görs enligt säkerhetsskyddslagen.\n\nSök jobbet\n\nVälkommen med din ansökan som ska innehålla cv, personligt brev och relevanta intyg eller examensbevis.\n\nVi avböjer all hjälp med rekrytering och annonsering.\n\n\n\n\n\nAnställningsform:\n\n\n\nAnställningen är tillsvidare och inleds med sex månaders provanställning. Tillträde enligt överenskommelse.\n\n\n\n\n\nOmfattning:\n\n\n\nHeltid\n\n\n\n\n\nKontaktperson:\n\n\n\nPer Jakobsson, biträdande avdelningschef, 08-408 982 11\n\n\n\n\n\nSista ansökningsdag:\n\n\n\n2022-07-01"
      },
      "headline" : "Junior analytiker som vill arbeta med tillsyn av försäkringsbolag",
      "driving_license" : null,
      "employer" : {
        "email" : null,
        "phone_number" : null,
        "organization_number" : "2021004235",
        "name" : "Finansinspektionen",
        "url" : "http://www.fi.se/",
        "workplace" : "Finansinspektionen"
      },
      "removed_date" : null,
      "logo_url" : "https://www.arbetsformedlingen.se/rest/arbetsgivare/rest/af/v3/organisation/2021004235/logotyper/logo.png",
      "last_publication_date" : "2022-07-01T23:59:59",
      "number_of_vacancies" : 1,
      "occupation" : {
        "concept_id" : "2Di8_skD_voL",
        "label" : "Finansanalytiker",
        "legacy_ams_taxonomy_id" : "1233"
      },
      "occupation_group" : {
        "concept_id" : "pTr9_RBT_9ur",
        "label" : "Finansanalytiker och investeringsrådgivare m.fl.",
        "legacy_ams_taxonomy_id" : "2413"
      },
      "employment_type" : {
        "concept_id" : "PFZr_Syz_cUq",
        "label" : "Vanlig anställning",
        "legacy_ams_taxonomy_id" : "1"
      },
      "webpage_url" : "https://arbetsformedlingen.se/platsbanken/annonser/26228377",
      "driving_license_required" : false,
      "application_contacts" : [ ],
      "duration" : {
        "concept_id" : "a7uU_j21_mkL",
        "label" : "Tills vidare",
        "legacy_ams_taxonomy_id" : "1"
      },
      "nice_to_have" : {
        "education_level" : [ ],
        "work_experiences" : [ ],
        "skills" : [ ],
        "education" : [ ],
        "languages" : [ ]
      },
      "application_details" : {
        "via_af" : false,
        "email" : null,
        "other" : null,
        "reference" : null,
        "url" : "https://www.fi.se/sv/om-fi/lediga-jobb/lediga-jobb/?rmpage=job&rmjob=1701",
        "information" : null
      },
      "source_type" : "VIA_PLATSBANKEN_DXA",
      "application_deadline" : "2022-07-01T23:59:59",
      "external_id" : "46-202100-4235-1701",
      "workplace_address" : {
        "coordinates" : [ 18.06858, 59.329323 ],
        "city" : null,
        "postcode" : null,
        "municipality" : "Stockholm",
        "region_concept_id" : "CifL_Rzy_Mku",
        "region" : "Stockholms län",
        "country_code" : "199",
        "region_code" : "01",
        "municipality_concept_id" : "AvNB_uwa_6n6",
        "country_concept_id" : "i46j_HmG_v64",
        "municipality_code" : "0180",
        "street_address" : null,
        "country" : "Sverige"
      },
      "id" : "26228377",
      "experience_required" : true,
      "working_hours_type" : {
        "concept_id" : "6YE1_gAC_R2G",
        "label" : "Heltid",
        "legacy_ams_taxonomy_id" : "1"
      },
      "access" : null,
      "timestamp" : 1655456472206,
      "must_have" : {
        "education_level" : [ ],
        "work_experiences" : [ {
          "concept_id" : "2Di8_skD_voL",
          "weight" : 10,
          "label" : "Finansanalytiker",
          "legacy_ams_taxonomy_id" : "1233"
        } ],
        "skills" : [ ],
        "education" : [ ],
        "languages" : [ ]
      },
      "occupation_field" : {
        "concept_id" : "X82t_awd_Qyc",
        "label" : "Administration, ekonomi, juridik",
        "legacy_ams_taxonomy_id" : "1"
      },
      "scope_of_work" : {
        "min" : 100,
        "max" : 100
      },
      "salary_type" : {
        "concept_id" : "oG8G_9cW_nRf",
        "label" : "Fast månads- vecko- eller timlön",
        "legacy_ams_taxonomy_id" : "1"
      },
      "removed" : false,
      "salary_description" : "Individuell lönesättning",
      "access_to_own_car" : false,
      "publication_date" : "2022-06-17T11:01:12"
    },
    "name" : "Junior analytiker som vill arbeta med tillsyn av försäkringsbolag",
    "user" : "fisko"
  },
  "sha1" : "443aaf632a7ba1bab30fa66f9af5d0ca73ff2649",
  "annotations" : [ {
    "preferred-label" : "Data/IT",
    "sentiment" : "MUST_HAVE",
    "type" : "occupation-field",
    "start-position" : 634,
    "end-position" : 638,
    "concept-id" : "apaJ_2ja_LuF",
    "matched-string" : "data",
    "annotation-id" : 3
  }, {
    "preferred-label" : "Universitets- eller högskoleutbildning",
    "sentiment" : "MUST_HAVE",
    "type" : "sni-level-5",
    "start-position" : 1089,
    "end-position" : 1105,
    "concept-id" : "4Hs1_pdH_C7k",
    "matched-string" : "akademisk examen",
    "annotation-id" : 26
  }, {
    "preferred-label" : "Civilekonomexamen",
    "sentiment" : "MUST_HAVE",
    "type" : "skill",
    "start-position" : 1118,
    "end-position" : 1129,
    "concept-id" : "h6B2_Egm_LWp",
    "matched-string" : "civilekonom",
    "annotation-id" : 27
  }, {
    "preferred-label" : "Civilingenjörsexamen",
    "sentiment" : "MUST_HAVE",
    "type" : "skill",
    "start-position" : 1136,
    "end-position" : 1149,
    "concept-id" : "ND2K_ivB_6RA",
    "matched-string" : "civilingenjör",
    "annotation-id" : 28
  }, {
    "preferred-label" : "Ekonomi, undervisning högskolenivå",
    "sentiment" : "MUST_HAVE",
    "type" : "skill",
    "start-position" : 1155,
    "end-position" : 1173,
    "concept-id" : "9Ra9_2yh_jH4",
    "matched-string" : "finansiell ekonomi",
    "annotation-id" : 29
  }, {
    "preferred-label" : "Ekonomisk analys",
    "sentiment" : "MUST_HAVE",
    "type" : "skill",
    "start-position" : 1204,
    "end-position" : 1255,
    "concept-id" : "W7Qf_aRY_FEo",
    "matched-string" : "analys av marknadsrisker och finansiella instrument",
    "annotation-id" : 30
  }, {
    "preferred-label" : "arbeta med finansiella instrument",
    "sentiment" : "MUST_HAVE",
    "type" : "esco-skill",
    "start-position" : 1325,
    "end-position" : 1347,
    "concept-id" : "BHtG_yQq_e2L",
    "matched-string" : "finansiella instrument",
    "annotation-id" : 31
  }, {
    "preferred-label" : "Risk management",
    "sentiment" : "MUST_HAVE",
    "type" : "skill",
    "start-position" : 1373,
    "end-position" : 1379,
    "concept-id" : "bHQT_Bhn_w3S",
    "matched-string" : "risker",
    "annotation-id" : 32
  }, {
    "preferred-label" : "Programmering",
    "sentiment" : "MUST_HAVE",
    "type" : "skill",
    "start-position" : 1418,
    "end-position" : 1431,
    "concept-id" : "iUew_moc_BRk",
    "matched-string" : "programmering",
    "annotation-id" : 9
  }, {
    "preferred-label" : "matematik",
    "sentiment" : "MUST_HAVE",
    "type" : "esco-skill",
    "start-position" : 1436,
    "end-position" : 1456,
    "concept-id" : "qn4M_gYf_2K1",
    "matched-string" : "matematiska modeller",
    "annotation-id" : 33
  }, {
    "preferred-label" : "Svenska",
    "sentiment" : "MUST_HAVE",
    "type" : "language",
    "start-position" : 1480,
    "end-position" : 1487,
    "concept-id" : "zSLA_vw2_FXN",
    "matched-string" : "svenska",
    "annotation-id" : 10
  }, {
    "preferred-label" : "Engelska",
    "sentiment" : "MUST_HAVE",
    "type" : "language",
    "start-position" : 1492,
    "end-position" : 1500,
    "concept-id" : "NVxJ_hLg_TYS",
    "matched-string" : "engelska",
    "annotation-id" : 11
  }, {
    "preferred-label" : "Matematik",
    "sentiment" : "NICE_TO_HAVE",
    "type" : "sun-education-field-3",
    "start-position" : 1660,
    "end-position" : 1669,
    "concept-id" : "UXoe_GVp_gui",
    "matched-string" : "matematik",
    "annotation-id" : 34
  }, {
    "preferred-label" : "Statistik",
    "sentiment" : "NICE_TO_HAVE",
    "type" : "sun-education-field-3",
    "start-position" : 1691,
    "end-position" : 1700,
    "concept-id" : "VDZC_YeP_k1P",
    "matched-string" : "statistik",
    "annotation-id" : 35
  }, {
    "preferred-label" : "Ekonomisk rapportering",
    "sentiment" : "NICE_TO_HAVE",
    "type" : "skill",
    "start-position" : 1724,
    "end-position" : 1733,
    "concept-id" : "WNnT_qrt_M77",
    "matched-string" : "Solvens 2",
    "annotation-id" : 36
  }, {
    "preferred-label" : "hantera värdepappershandel",
    "sentiment" : "NICE_TO_HAVE",
    "type" : "esco-skill",
    "start-position" : 1798,
    "end-position" : 1819,
    "concept-id" : "5i7T_Fj1_yMZ",
    "matched-string" : "värdepappershantering",
    "annotation-id" : 37
  }, {
    "preferred-label" : "medarbetare, back office, finansiella marknader",
    "sentiment" : "NICE_TO_HAVE",
    "type" : "esco-occupation",
    "start-position" : 1832,
    "end-position" : 1843,
    "concept-id" : "WToe_v6k_aK1",
    "matched-string" : "Back Office",
    "annotation-id" : 38
  }, {
    "preferred-label" : "SAS, statistikprogram",
    "sentiment" : "NICE_TO_HAVE",
    "type" : "skill",
    "start-position" : 1862,
    "comment" : "Statistical Analysis System",
    "end-position" : 1865,
    "concept-id" : "SQ5j_FkT_zJY",
    "matched-string" : "SAS",
    "annotation-id" : 39
  }, {
    "preferred-label" : "VBA, programmeringsspråk",
    "sentiment" : "NICE_TO_HAVE",
    "type" : "skill",
    "start-position" : 1867,
    "comment" : "Visual Basic for Applications",
    "end-position" : 1884,
    "concept-id" : "kUcK_d6Y_SEr",
    "matched-string" : "VBA-programmering",
    "annotation-id" : 40
  }, {
    "preferred-label" : "SQL, programmeringsspråk",
    "sentiment" : "NICE_TO_HAVE",
    "type" : "skill",
    "start-position" : 1886,
    "comment" : "Structured Query Language",
    "end-position" : 1889,
    "concept-id" : "Xnmr_kYS_YKY",
    "matched-string" : "sql",
    "annotation-id" : 16
  }, {
    "preferred-label" : "Försäkring",
    "sentiment" : "NICE_TO_HAVE",
    "type" : "sni-level-3",
    "start-position" : 1894,
    "end-position" : 1904,
    "concept-id" : "wjA9_2f4_Wy8",
    "matched-string" : "försäkring",
    "annotation-id" : 17
  }, {
    "preferred-label" : null,
    "sentiment" : "NICE_TO_HAVE",
    "type" : "skill",
    "start-position" : 1924,
    "end-position" : 1950,
    "concept-id" : null,
    "matched-string" : "kapitalkrav inom Solvens 2",
    "annotation-id" : 41
  }, {
    "preferred-label" : null,
    "sentiment" : "NICE_TO_HAVE",
    "type" : "skill",
    "start-position" : 1952,
    "end-position" : 2003,
    "concept-id" : null,
    "matched-string" : "riskkänsligt kapitalkrav för tjänstepensionsföretag",
    "annotation-id" : 42
  }, {
    "preferred-label" : "arbeta analytiskt",
    "sentiment" : "MUST_HAVE",
    "type" : "esco-skill",
    "start-position" : 2066,
    "end-position" : 2075,
    "concept-id" : "wLyJ_Zpf_tgC",
    "matched-string" : "analytisk",
    "annotation-id" : 43
  } ],
  "text" : "Junior analytiker som vill arbeta med tillsyn av försäkringsbolag\nÄr du intresserad av programmering och matematiska modeller och har du praktisk kunskap om finansiella instrument och utvärdering av vilka risker som finns i dessa? Då kan det här vara jobbet för dig. \n\nOm jobbet\n\nSom junior analytiker på avdelningen Risktillsyn försäkring arbetar du med tillsyn av försäkringsbolagens hantering av marknadsrisker samt löpande granskning av deras riskexponering och riskhantering i placeringstillgångarna. Du kommer medverka i undersökningar och analysprojekt och hantera, sammanställa och analysera inrapporterad riskinformation och data, samt utveckla datastödd analys i SAS och Excel. I tjänsten ingår dessutom deltagande i nationella och internationella projekt rörande metod- och regelutveckling för att förbättra tillsynen av marknadsrisker.\n\nTjänsten ger dig även mycket goda möjligheter att löpande utvecklas inom programmering och matematiska modeller då det finns kollegor med mycket goda och djupa kunskaper inom detta.\n\nDin utbildning och erfarenhet\n\nVi söker dig som:\n\n\n• har akademisk examen motsvarande civilekonom eller civilingenjör inom finansiell ekonomi\n• har något års erfarenhet av analys av marknadsrisker och finansiella instrument inom finansiella företag eller myndigheter\n• har praktisk kunskap om finansiella instrument och utvärdering av vilka risker som finns i dessa\n• är intresserad av programmering och matematiska modeller\n• uttrycker dig väl på svenska och engelska i både tal och skrift.\n\nDet är meriterande om du:                                                                 \n\n\n• har fördjupande utbildning i finansiell matematik och/eller matematisk statistik\n• tidigare arbetat med Solvens 2- eller annan form av myndighetsrapportering\n• har erfarenhet av värdepappershantering, exempelvis Back Office\n• har kunskaper i SAS, VBA-programmering, SQL och försäkring\n• har kunskaper om kapitalkrav inom Solvens 2, riskkänsligt kapitalkrav för tjänstepensionsföretag.\n\nOm dig \n\nI det här jobbet behöver du:\n\n\n• vara självgående, analytisk och initiativtagande\n• bidra till ett gott samarbete\n• arbeta självständigt utifrån de värderingar och riktlinjer som styr verksamheten\n• vara hjälpsam, flexibel och bemöta andra på ett vänligt och respektfullt sätt.\n\n\n\n\nFinansinspektionen (FI) bidrar till ett stabilt finansiellt system, en hållbar utveckling och ett högt skydd för konsumenter. Vi erbjuder dig att arbeta med samhällsviktiga uppgifter, där du är med och påverkar den finansiella marknaden. \n \n På FI arbetar cirka 600 personer och våra värderingar präglas av att vi är engagerade, beslutsamma, målinriktade och hjälpsamma. Vår arbetsplats ligger centralt i Stockholm. Det finns även möjlighet att delvis arbeta på distans. \n\n\n\nBra att veta\n\nVi baserar vår rekrytering på kompetens. Det innebär att vi noggrant definierar vilka kvalifikationer som efterfrågas och sedan utgår från dem genom hela rekryteringsprocessen.\n\nVi arbetar aktivt för mångfald och likabehandling och välkomnar därför medarbetare med olika erfarenheter, bakgrunder och kompetenser.\n\nArbetspsykologiska tester ingår i rekryteringsprocessen.\n\nPå FI arbetar vi aktivt för att vara en attraktiv arbetsgivare där du som medarbetare trivs och utvecklas. Läs mer om hur det är att jobba på FI och vad vi erbjuder: https://www.fi.se/sv/om-fi/lediga-jobb/vi-erbjuder/\n\nEn anställning på FI kan innebära att säkerhetsprövning och registerkontroll görs enligt säkerhetsskyddslagen.\n\nSök jobbet\n\nVälkommen med din ansökan som ska innehålla cv, personligt brev och relevanta intyg eller examensbevis.\n\nVi avböjer all hjälp med rekrytering och annonsering.\n\n\n\n\n\nAnställningsform:\n\n\n\nAnställningen är tillsvidare och inleds med sex månaders provanställning. Tillträde enligt överenskommelse.\n\n\n\n\n\nOmfattning:\n\n\n\nHeltid\n\n\n\n\n\nKontaktperson:\n\n\n\nPer Jakobsson, biträdande avdelningschef, 08-408 982 11\n\n\n\n\n\nSista ansökningsdag:\n\n\n\n2022-07-01"
}