{
  "meta" : {
    "jobad" : {
      "description" : {
        "requirements" : null,
        "needs" : null,
        "company_information" : null,
        "text_formatted" : "Trivsamma Hotel Riddargatan hittar du precis runt hörnet från Stureplan, mitt i centrala Stockholm. Här hittar du moderna, färgstarkt inredda rum med en personlig touch som ger dig allt du behöver för en lyckad hotellvistelse. Letar du efter ett boende som skämmer bort dig lite extra så stoltserar hotellet med fyra sviter med stort designfokus.\n\n\r\n\r\nOm jobbet\n\nHotel Riddargatan ingår i hotellkedjan ProfilHotels och finns på nio orter i Sverige samt i Köpenhamn.\r\n\r\nMed våra tretton hotell är vi ingen stor kedja, men det lyfter vi gärna fram som en fördel. Den familjära stämningen, sammanhållningen, den uppmärksamma servicen – det är saker som blir lättare för oss som inte är så stora.\n\n \n\nRollbeskrivning\n\nSom receptionsansvarig ansvarar du för teamet i frontdesk. Du lägger schema, ansvarar för kundreskontra och fakturahantering. Du är vår platschefs högra hand och kan få möjlighet att agera ställföreträdande. Du ser till att våra gäster får det de vill ha, att de trivs och kommer tillbaka. Arbetsuppgifterna innefattar även sedvanliga receptionsuppgifter så som in- och utcheckning, service, bokning av logi och konferenser samt viss barservering\n\nTjänsten avser ett rullande schema dag och kvällspass samt  helger. \n\n \n\nVi söker dig som \n\n… med glädje och energi gör det där lilla extra för att få alla våra gäster att känna sig speciella och varmt välkomna. Som person är du proffsig, älskar människor och är självständig, drivande och social. Du ser vad som behöver göras, har öga för detaljer och har lätt för att ta egna initiativ.\nDu ser vad ditt team behöver för att nå till nästa nivå. \n\n \n\nVi ser att du har\n\n - Utbildning inom hotell och restaurang eller minst 2 års erfarenhet av hotellbranschen\n - Tidigare arbetat i bokningssystem, (vi jobbar med Mews.)\n - Du talar och skriver svenska och engelska flytande, något som är ett krav i mötet men våra gäster. Ytterligare språk är självklart meriterande.\n - Erfarenhet från administration, Revenue management och Yield Management är meriterande.\n\n \n\nVi erbjuder\n\nEn fantastisk arbetsplats där ingen dag är den andra lik och där du får stora möjligheter att vara med och påverka och utveckla verksamheten. Anställningen är tills vidare med inledande 6 månaders provanställning. Lön enligt avtal. Arbetstiderna varierar och innebär arbete dagtid såväl som kvällstid och helger.\n\n\n\n\n\nLigula Hospitality Group är moderbolag i en privatägd koncern i stark tillväxt. Vi äger, förvaltar och utvecklar varumärken och koncept inom hotell- och restaurangnäringen. Sedan 2015 har vi mer än fördubblat antalet hotell och expansionen fortsätter. Koncernen består i dag av 45  hotell i Sverige, Danmark och Tyskland som drivs under varumärkena ProfilHotels, Apartments by Ligula, Motel L, Good Morning Hotels och Collection by Ligula. Genom franchiseavtal driver vi även fyra Park Inn by Radisson och ett Radisson Blu. Vi sysselsätter normalt  ca 800   årsanställda och omsätter  över 1 400 MSEK.",
        "conditions" : "100. Tillträde: 2022-08-15\r\nTillsvidareanställning",
        "text" : "Trivsamma Hotel Riddargatan hittar du precis runt hörnet från Stureplan, mitt i centrala Stockholm. Här hittar du moderna, färgstarkt inredda rum med en personlig touch som ger dig allt du behöver för en lyckad hotellvistelse. Letar du efter ett boende som skämmer bort dig lite extra så stoltserar hotellet med fyra sviter med stort designfokus.\n\n\r\n\r\nOm jobbet\n\nHotel Riddargatan ingår i hotellkedjan ProfilHotels och finns på nio orter i Sverige samt i Köpenhamn.\r\n\r\nMed våra tretton hotell är vi ingen stor kedja, men det lyfter vi gärna fram som en fördel. Den familjära stämningen, sammanhållningen, den uppmärksamma servicen – det är saker som blir lättare för oss som inte är så stora.\n\n \n\nRollbeskrivning\n\nSom receptionsansvarig ansvarar du för teamet i frontdesk. Du lägger schema, ansvarar för kundreskontra och fakturahantering. Du är vår platschefs högra hand och kan få möjlighet att agera ställföreträdande. Du ser till att våra gäster får det de vill ha, att de trivs och kommer tillbaka. Arbetsuppgifterna innefattar även sedvanliga receptionsuppgifter så som in- och utcheckning, service, bokning av logi och konferenser samt viss barservering\n\nTjänsten avser ett rullande schema dag och kvällspass samt  helger. \n\n \n\nVi söker dig som \n\n… med glädje och energi gör det där lilla extra för att få alla våra gäster att känna sig speciella och varmt välkomna. Som person är du proffsig, älskar människor och är självständig, drivande och social. Du ser vad som behöver göras, har öga för detaljer och har lätt för att ta egna initiativ.\nDu ser vad ditt team behöver för att nå till nästa nivå. \n\n \n\nVi ser att du har\n\n - Utbildning inom hotell och restaurang eller minst 2 års erfarenhet av hotellbranschen\n - Tidigare arbetat i bokningssystem, (vi jobbar med Mews.)\n - Du talar och skriver svenska och engelska flytande, något som är ett krav i mötet men våra gäster. Ytterligare språk är självklart meriterande.\n - Erfarenhet från administration, Revenue management och Yield Management är meriterande.\n\n \n\nVi erbjuder\n\nEn fantastisk arbetsplats där ingen dag är den andra lik och där du får stora möjligheter att vara med och påverka och utveckla verksamheten. Anställningen är tills vidare med inledande 6 månaders provanställning. Lön enligt avtal. Arbetstiderna varierar och innebär arbete dagtid såväl som kvällstid och helger.\n\n\n\n\n\nLigula Hospitality Group är moderbolag i en privatägd koncern i stark tillväxt. Vi äger, förvaltar och utvecklar varumärken och koncept inom hotell- och restaurangnäringen. Sedan 2015 har vi mer än fördubblat antalet hotell och expansionen fortsätter. Koncernen består i dag av 45  hotell i Sverige, Danmark och Tyskland som drivs under varumärkena ProfilHotels, Apartments by Ligula, Motel L, Good Morning Hotels och Collection by Ligula. Genom franchiseavtal driver vi även fyra Park Inn by Radisson och ett Radisson Blu. Vi sysselsätter normalt  ca 800   årsanställda och omsätter  över 1 400 MSEK."
      },
      "headline" : "Receptionsansvarig, Hotel Riddargatan",
      "driving_license" : null,
      "employer" : {
        "email" : null,
        "phone_number" : null,
        "organization_number" : "5567926497",
        "name" : "Ligula Hospitality Group AB",
        "url" : null,
        "workplace" : "Profilevents AB, Profilhotels Riddargatan"
      },
      "removed_date" : null,
      "logo_url" : null,
      "last_publication_date" : "2022-08-05T23:59:59",
      "number_of_vacancies" : 1,
      "occupation" : {
        "concept_id" : "3kFW_XLk_v9H",
        "label" : "Hotellreceptionist",
        "legacy_ams_taxonomy_id" : "5596"
      },
      "occupation_group" : {
        "concept_id" : "bYde_Frc_xcB",
        "label" : "Hotellreceptionister m.fl.",
        "legacy_ams_taxonomy_id" : "4224"
      },
      "employment_type" : {
        "concept_id" : "PFZr_Syz_cUq",
        "label" : "Vanlig anställning",
        "legacy_ams_taxonomy_id" : "1"
      },
      "webpage_url" : "https://arbetsformedlingen.se/platsbanken/annonser/26257626",
      "driving_license_required" : false,
      "application_contacts" : [ {
        "description" : "Mattias Larsson",
        "email" : null,
        "telephone" : null,
        "name" : null,
        "contact_type" : null
      } ],
      "duration" : {
        "concept_id" : "a7uU_j21_mkL",
        "label" : "Tills vidare",
        "legacy_ams_taxonomy_id" : "1"
      },
      "nice_to_have" : {
        "education_level" : [ ],
        "work_experiences" : [ ],
        "skills" : [ ],
        "education" : [ ],
        "languages" : [ ]
      },
      "application_details" : {
        "via_af" : false,
        "email" : null,
        "other" : null,
        "reference" : "2022/158",
        "url" : "https://ligula.varbi.com/what:job/jobID:517531/type:job/where:1/apply:1",
        "information" : null
      },
      "source_type" : "VIA_PLATSBANKEN_DXA",
      "application_deadline" : "2022-08-05T23:59:59",
      "external_id" : "46-556792-6497-517531",
      "workplace_address" : {
        "coordinates" : [ 18.06858, 59.329323 ],
        "city" : null,
        "postcode" : null,
        "municipality" : "Stockholm",
        "region_concept_id" : "CifL_Rzy_Mku",
        "region" : "Stockholms län",
        "country_code" : "199",
        "region_code" : "01",
        "municipality_concept_id" : "AvNB_uwa_6n6",
        "country_concept_id" : "i46j_HmG_v64",
        "municipality_code" : "0180",
        "street_address" : null,
        "country" : "Sverige"
      },
      "id" : "26257626",
      "experience_required" : true,
      "working_hours_type" : {
        "concept_id" : "6YE1_gAC_R2G",
        "label" : "Heltid",
        "legacy_ams_taxonomy_id" : "1"
      },
      "access" : null,
      "timestamp" : 1656214649261,
      "must_have" : {
        "education_level" : [ ],
        "work_experiences" : [ {
          "concept_id" : "3kFW_XLk_v9H",
          "weight" : 10,
          "label" : "Hotellreceptionist",
          "legacy_ams_taxonomy_id" : "5596"
        } ],
        "skills" : [ ],
        "education" : [ ],
        "languages" : [ ]
      },
      "occupation_field" : {
        "concept_id" : "ScKy_FHB_7wT",
        "label" : "Hotell, restaurang, storhushåll",
        "legacy_ams_taxonomy_id" : "7"
      },
      "scope_of_work" : {
        "min" : 100,
        "max" : 100
      },
      "salary_type" : {
        "concept_id" : "oG8G_9cW_nRf",
        "label" : "Fast månads- vecko- eller timlön",
        "legacy_ams_taxonomy_id" : "1"
      },
      "removed" : false,
      "salary_description" : "Timlön enligt avtal",
      "access_to_own_car" : false,
      "publication_date" : "2022-06-27T00:00:00"
    },
    "name" : "Receptionsansvarig, Hotel Riddargatan",
    "user" : "kristof.fischer"
  },
  "sha1" : "4d75c98813a1b7716fbbf1ff59f7177c0df3d626",
  "annotations" : [ {
    "preferred-label" : "receptionist inom hotell- och restaurangbranschen",
    "type" : "esco-occupation",
    "start-position" : 0,
    "end-position" : 18,
    "concept-id" : "DmNS_sQg_fZB",
    "matched-string" : "Receptionsansvarig",
    "annotation-id" : 11
  }, {
    "preferred-label" : "Frontdesk",
    "type" : "keyword",
    "start-position" : 800,
    "end-position" : 809,
    "concept-id" : "2g2j_Kki_Agk",
    "matched-string" : "frontdesk",
    "annotation-id" : 12
  }, {
    "preferred-label" : "arbeta självständigt",
    "sentiment" : "MUST_HAVE",
    "type" : "esco-skill",
    "start-position" : 1463,
    "end-position" : 1475,
    "concept-id" : "NyFu_HHd_zhz",
    "matched-string" : "självständig",
    "annotation-id" : 13
  }, {
    "preferred-label" : "Hotell, restaurang och storhushåll, allmän utbildning",
    "sentiment" : "MUST_HAVE",
    "type" : "sun-education-field-4",
    "start-position" : 1689,
    "end-position" : 1710,
    "concept-id" : "tgBB_Gxi_5ZG",
    "matched-string" : "hotell och restaurang",
    "annotation-id" : 14
  }, {
    "preferred-label" : "hotellverksamhet",
    "sentiment" : "MUST_HAVE",
    "type" : "esco-skill",
    "start-position" : 1729,
    "end-position" : 1758,
    "concept-id" : "yBAe_zdv_QFk",
    "matched-string" : "erfarenhet av hotellbranschen",
    "annotation-id" : 15
  }, {
    "preferred-label" : "göra bokningar",
    "sentiment" : "MUST_HAVE",
    "type" : "esco-skill",
    "start-position" : 1781,
    "end-position" : 1795,
    "concept-id" : "hcSG_xG4_WUt",
    "matched-string" : "bokningssystem",
    "annotation-id" : 3
  }, {
    "preferred-label" : "produktkunskap",
    "sentiment" : "MUST_HAVE",
    "type" : "esco-skill",
    "start-position" : 1812,
    "end-position" : 1816,
    "concept-id" : "FC5o_4w6_cLJ",
    "matched-string" : "Mews",
    "annotation-id" : 16
  }, {
    "preferred-label" : "Svenska",
    "sentiment" : "MUST_HAVE",
    "type" : "language",
    "start-position" : 1843,
    "end-position" : 1850,
    "concept-id" : "zSLA_vw2_FXN",
    "matched-string" : "svenska",
    "annotation-id" : 4
  }, {
    "preferred-label" : "Engelska",
    "sentiment" : "MUST_HAVE",
    "type" : "language",
    "start-position" : 1855,
    "end-position" : 1863,
    "concept-id" : "NVxJ_hLg_TYS",
    "matched-string" : "engelska",
    "annotation-id" : 5
  }, {
    "preferred-label" : "Diverse språk",
    "sentiment" : "NICE_TO_HAVE",
    "type" : "language",
    "start-position" : 1921,
    "end-position" : 1938,
    "concept-id" : "8GQ1_Avf_vdR",
    "matched-string" : "Ytterligare språk",
    "annotation-id" : 17
  }, {
    "preferred-label" : "sköta administration",
    "sentiment" : "NICE_TO_HAVE",
    "type" : "esco-skill",
    "start-position" : 1985,
    "end-position" : 1999,
    "concept-id" : "NEWh_NMX_RCZ",
    "matched-string" : "administration",
    "annotation-id" : 18
  }, {
    "preferred-label" : "Revenue Management/Yield management",
    "sentiment" : "NICE_TO_HAVE",
    "type" : "skill",
    "start-position" : 2001,
    "end-position" : 2019,
    "concept-id" : "ZxKX_dN4_8DJ",
    "matched-string" : "revenue management",
    "annotation-id" : 6
  }, {
    "preferred-label" : "Revenue Management/Yield management",
    "sentiment" : "NICE_TO_HAVE",
    "type" : "skill",
    "start-position" : 2024,
    "end-position" : 2040,
    "concept-id" : "ZxKX_dN4_8DJ",
    "matched-string" : "yield management",
    "annotation-id" : 7
  }, {
    "preferred-label" : "Tillsvidareanställning (inkl. eventuell provanställning)",
    "type" : "employment-type",
    "start-position" : 2233,
    "end-position" : 2245,
    "concept-id" : "kpPX_CNN_gDU",
    "matched-string" : "tills vidare",
    "annotation-id" : 19
  } ],
  "text" : "Receptionsansvarig, Hotel Riddargatan\nTrivsamma Hotel Riddargatan hittar du precis runt hörnet från Stureplan, mitt i centrala Stockholm. Här hittar du moderna, färgstarkt inredda rum med en personlig touch som ger dig allt du behöver för en lyckad hotellvistelse. Letar du efter ett boende som skämmer bort dig lite extra så stoltserar hotellet med fyra sviter med stort designfokus.\n\n\r\n\r\nOm jobbet\n\nHotel Riddargatan ingår i hotellkedjan ProfilHotels och finns på nio orter i Sverige samt i Köpenhamn.\r\n\r\nMed våra tretton hotell är vi ingen stor kedja, men det lyfter vi gärna fram som en fördel. Den familjära stämningen, sammanhållningen, den uppmärksamma servicen – det är saker som blir lättare för oss som inte är så stora.\n\n \n\nRollbeskrivning\n\nSom receptionsansvarig ansvarar du för teamet i frontdesk. Du lägger schema, ansvarar för kundreskontra och fakturahantering. Du är vår platschefs högra hand och kan få möjlighet att agera ställföreträdande. Du ser till att våra gäster får det de vill ha, att de trivs och kommer tillbaka. Arbetsuppgifterna innefattar även sedvanliga receptionsuppgifter så som in- och utcheckning, service, bokning av logi och konferenser samt viss barservering\n\nTjänsten avser ett rullande schema dag och kvällspass samt  helger. \n\n \n\nVi söker dig som \n\n… med glädje och energi gör det där lilla extra för att få alla våra gäster att känna sig speciella och varmt välkomna. Som person är du proffsig, älskar människor och är självständig, drivande och social. Du ser vad som behöver göras, har öga för detaljer och har lätt för att ta egna initiativ.\nDu ser vad ditt team behöver för att nå till nästa nivå. \n\n \n\nVi ser att du har\n\n - Utbildning inom hotell och restaurang eller minst 2 års erfarenhet av hotellbranschen\n - Tidigare arbetat i bokningssystem, (vi jobbar med Mews.)\n - Du talar och skriver svenska och engelska flytande, något som är ett krav i mötet men våra gäster. Ytterligare språk är självklart meriterande.\n - Erfarenhet från administration, Revenue management och Yield Management är meriterande.\n\n \n\nVi erbjuder\n\nEn fantastisk arbetsplats där ingen dag är den andra lik och där du får stora möjligheter att vara med och påverka och utveckla verksamheten. Anställningen är tills vidare med inledande 6 månaders provanställning. Lön enligt avtal. Arbetstiderna varierar och innebär arbete dagtid såväl som kvällstid och helger.\n\n\n\n\n\nLigula Hospitality Group är moderbolag i en privatägd koncern i stark tillväxt. Vi äger, förvaltar och utvecklar varumärken och koncept inom hotell- och restaurangnäringen. Sedan 2015 har vi mer än fördubblat antalet hotell och expansionen fortsätter. Koncernen består i dag av 45  hotell i Sverige, Danmark och Tyskland som drivs under varumärkena ProfilHotels, Apartments by Ligula, Motel L, Good Morning Hotels och Collection by Ligula. Genom franchiseavtal driver vi även fyra Park Inn by Radisson och ett Radisson Blu. Vi sysselsätter normalt  ca 800   årsanställda och omsätter  över 1 400 MSEK."
}