{
  "meta" : {
    "jobad" : {
      "description" : {
        "requirements" : null,
        "needs" : null,
        "company_information" : null,
        "text_formatted" : "<p>Saya Sushi grundades 2012 och vi har idag två restauranger. En ligger på Linnégatan 31 och den andra på Olofsgatan 6. Förutom bordsservering har vi väldigt mycket take-away och erbjuder även catering.</p><p>Nu söker vi kassapersonal/serveringspersonal på deltid/heltid (20-40 tim/vecka) enligt schema. </p><p>Anställningsform: 6 mån provanställning med möjlighet till tillsvidareanställning </p><p>Du ansvarar för kassan, tar emot kunder, serverar, tar emot take-away beställningar.</p><p>Du behöver vara serviceinriktad och stresstålig då det under vissa tider är väldigt många kunder som kommer samtidigt. </p><p>Krav: svenska och engelska, tidigare erfarenhet från kassa och servering är ett plus.</p><p>Skicka in din ansökan (CV och personligt brev) redan idag till jobb@sayasushi.se, intervjuer och anställning sker löpande så vänta inte med att skicka in din ansökan. </p>",
        "conditions" : null,
        "text" : "Saya Sushi grundades 2012 och vi har idag två restauranger. En ligger på Linnégatan 31 och den andra på Olofsgatan 6. Förutom bordsservering har vi väldigt mycket take-away och erbjuder även catering.\nNu söker vi kassapersonal/serveringspersonal på deltid/heltid (20-40 tim/vecka) enligt schema. \nAnställningsform: 6 mån provanställning med möjlighet till tillsvidareanställning \nDu ansvarar för kassan, tar emot kunder, serverar, tar emot take-away beställningar.\nDu behöver vara serviceinriktad och stresstålig då det under vissa tider är väldigt många kunder som kommer samtidigt. \nKrav: svenska och engelska, tidigare erfarenhet från kassa och servering är ett plus.\nSkicka in din ansökan (CV och personligt brev) redan idag till jobb@sayasushi.se, intervjuer och anställning sker löpande så vänta inte med att skicka in din ansökan."
      },
      "headline" : "Kassör/servitör på restaurang Saya Sushi",
      "driving_license" : null,
      "employer" : {
        "email" : null,
        "phone_number" : null,
        "organization_number" : "5592202104",
        "name" : "Blue fin AB",
        "url" : "www.sayasushi.se",
        "workplace" : "Blue fin AB"
      },
      "removed_date" : null,
      "logo_url" : null,
      "last_publication_date" : "2022-09-01T23:59:59",
      "number_of_vacancies" : 2,
      "occupation" : {
        "concept_id" : "rGGf_KLs_To7",
        "label" : "Servitör/Servitris",
        "legacy_ams_taxonomy_id" : "5487"
      },
      "occupation_group" : {
        "concept_id" : "UjoW_meY_Zwt",
        "label" : "Hovmästare och servitörer",
        "legacy_ams_taxonomy_id" : "5131"
      },
      "employment_type" : {
        "concept_id" : "PFZr_Syz_cUq",
        "label" : "Vanlig anställning",
        "legacy_ams_taxonomy_id" : "1"
      },
      "webpage_url" : "https://arbetsformedlingen.se/platsbanken/annonser/26427751",
      "driving_license_required" : false,
      "application_contacts" : [ {
        "description" : null,
        "email" : "jobb@sayasushi.se",
        "telephone" : null,
        "name" : "Tumenzaya Rydlund",
        "contact_type" : "Restaurangchef"
      } ],
      "duration" : {
        "concept_id" : "a7uU_j21_mkL",
        "label" : "Tills vidare",
        "legacy_ams_taxonomy_id" : "1"
      },
      "nice_to_have" : {
        "education_level" : [ ],
        "work_experiences" : [ ],
        "skills" : [ ],
        "education" : [ ],
        "languages" : [ {
          "concept_id" : "zSLA_vw2_FXN",
          "weight" : 5,
          "label" : "Svenska",
          "legacy_ams_taxonomy_id" : "502"
        }, {
          "concept_id" : "NVxJ_hLg_TYS",
          "weight" : 5,
          "label" : "Engelska",
          "legacy_ams_taxonomy_id" : "283"
        } ]
      },
      "application_details" : {
        "via_af" : false,
        "email" : "jobb@sayasushi.se",
        "other" : null,
        "reference" : null,
        "url" : null,
        "information" : null
      },
      "source_type" : "VIA_ANNONSERA",
      "application_deadline" : "2022-09-01T23:59:59",
      "external_id" : null,
      "workplace_address" : {
        "coordinates" : [ 18.06203100677164, 59.33608506246618 ],
        "city" : "Stockholm",
        "postcode" : "11136",
        "municipality" : "Stockholm",
        "region_concept_id" : "CifL_Rzy_Mku",
        "region" : "Stockholms län",
        "country_code" : "199",
        "region_code" : "01",
        "municipality_concept_id" : "AvNB_uwa_6n6",
        "country_concept_id" : "i46j_HmG_v64",
        "municipality_code" : "0180",
        "street_address" : "Olofsgatan 6",
        "country" : "Sverige"
      },
      "id" : "26427751",
      "experience_required" : true,
      "working_hours_type" : {
        "concept_id" : "947z_JGS_Uk2",
        "label" : "Deltid",
        "legacy_ams_taxonomy_id" : "2"
      },
      "access" : null,
      "timestamp" : 1660835385285,
      "must_have" : {
        "education_level" : [ ],
        "work_experiences" : [ ],
        "skills" : [ ],
        "education" : [ ],
        "languages" : [ ]
      },
      "occupation_field" : {
        "concept_id" : "ScKy_FHB_7wT",
        "label" : "Hotell, restaurang, storhushåll",
        "legacy_ams_taxonomy_id" : "7"
      },
      "scope_of_work" : {
        "min" : 0,
        "max" : 100
      },
      "salary_type" : {
        "concept_id" : "oG8G_9cW_nRf",
        "label" : "Fast månads- vecko- eller timlön",
        "legacy_ams_taxonomy_id" : "1"
      },
      "removed" : false,
      "salary_description" : null,
      "access_to_own_car" : false,
      "publication_date" : "2022-08-18T16:54:50"
    },
    "name" : "Kassör/servitör på restaurang Saya Sushi",
    "user" : "hannes"
  },
  "sha1" : "d59aa767d39071f66b9e934339d5b2b26aa0ba00",
  "annotations" : [ {
    "preferred-label" : "Kassapersonal",
    "sentiment" : "MUST_HAVE",
    "type" : "occupation-name",
    "start-position" : 0,
    "end-position" : 6,
    "concept-id" : "j8X2_KhG_6ty",
    "matched-string" : "Kassör",
    "annotation-id" : 9
  }, {
    "preferred-label" : "Servitör/Servitris",
    "sentiment" : "MUST_HAVE",
    "type" : "occupation-name",
    "start-position" : 7,
    "end-position" : 15,
    "concept-id" : "rGGf_KLs_To7",
    "matched-string" : "servitör",
    "annotation-id" : 0
  }, {
    "preferred-label" : "Restaurang",
    "sentiment" : "NOT_RELEVANT",
    "type" : "keyword",
    "start-position" : 19,
    "end-position" : 29,
    "concept-id" : "o2Cg_3Ap_qvK",
    "matched-string" : "restaurang",
    "annotation-id" : 1
  }, {
    "preferred-label" : "Sushi",
    "sentiment" : "NOT_RELEVANT",
    "type" : "keyword",
    "start-position" : 35,
    "end-position" : 40,
    "concept-id" : "of6o_sJT_K7k",
    "matched-string" : "sushi",
    "annotation-id" : 2
  }, {
    "preferred-label" : "Sushi",
    "sentiment" : "NOT_RELEVANT",
    "type" : "keyword",
    "start-position" : 46,
    "end-position" : 51,
    "concept-id" : "of6o_sJT_K7k",
    "matched-string" : "sushi",
    "annotation-id" : 3
  }, {
    "preferred-label" : "Bordsservering",
    "sentiment" : "NOT_RELEVANT",
    "type" : "skill",
    "start-position" : 167,
    "end-position" : 181,
    "concept-id" : "5fAq_Squ_o7p",
    "matched-string" : "bordsservering",
    "annotation-id" : 4
  }, {
    "preferred-label" : "Kassapersonal",
    "sentiment" : "MUST_HAVE",
    "type" : "occupation-name",
    "start-position" : 254,
    "end-position" : 267,
    "concept-id" : "j8X2_KhG_6ty",
    "matched-string" : "kassapersonal",
    "annotation-id" : 5
  }, {
    "preferred-label" : "Serveringspersonal",
    "sentiment" : "MUST_HAVE",
    "type" : "keyword",
    "start-position" : 268,
    "end-position" : 286,
    "concept-id" : "VqRa_738_v98",
    "matched-string" : "serveringspersonal",
    "annotation-id" : 6
  }, {
    "preferred-label" : "Tillsvidareanställning (inkl. eventuell provanställning)",
    "sentiment" : "OFFERED",
    "type" : "employment-type",
    "start-position" : 397,
    "end-position" : 419,
    "concept-id" : "kpPX_CNN_gDU",
    "matched-string" : "tillsvidareanställning",
    "annotation-id" : 10
  }, {
    "preferred-label" : "Svenska",
    "sentiment" : "MUST_HAVE",
    "type" : "language",
    "start-position" : 632,
    "end-position" : 639,
    "concept-id" : "zSLA_vw2_FXN",
    "matched-string" : "svenska",
    "annotation-id" : 7
  }, {
    "preferred-label" : "Engelska",
    "sentiment" : "MUST_HAVE",
    "type" : "language",
    "start-position" : 644,
    "end-position" : 652,
    "concept-id" : "NVxJ_hLg_TYS",
    "matched-string" : "engelska",
    "annotation-id" : 8
  } ],
  "text" : "Kassör/servitör på restaurang Saya Sushi\nSaya Sushi grundades 2012 och vi har idag två restauranger. En ligger på Linnégatan 31 och den andra på Olofsgatan 6. Förutom bordsservering har vi väldigt mycket take-away och erbjuder även catering.\nNu söker vi kassapersonal/serveringspersonal på deltid/heltid (20-40 tim/vecka) enligt schema. \nAnställningsform: 6 mån provanställning med möjlighet till tillsvidareanställning \nDu ansvarar för kassan, tar emot kunder, serverar, tar emot take-away beställningar.\nDu behöver vara serviceinriktad och stresstålig då det under vissa tider är väldigt många kunder som kommer samtidigt. \nKrav: svenska och engelska, tidigare erfarenhet från kassa och servering är ett plus.\nSkicka in din ansökan (CV och personligt brev) redan idag till jobb@sayasushi.se, intervjuer och anställning sker löpande så vänta inte med att skicka in din ansökan."
}