{
  "meta" : {
    "dataset-id" : "myh-spreadsheet-2021",
    "type" : "education-description",
    "dataset-document-id" : "YH00305",
    "user" : "kristof.fischer"
  },
  "sha1" : "9cd7a9e85f231db25c6b2e5886d3cab13ebf9f94",
  "annotations" : [ {
    "preferred-label" : "Undersköterska, vård- och specialavdelning och mottagning",
    "sentiment" : "OFFERED",
    "type" : "occupation-name",
    "start-position" : 0,
    "end-position" : 33,
    "concept-id" : "PQkQ_Dmk_ZF8",
    "matched-string" : "Specialistutbildad undersköterska",
    "annotation-id" : 7
  }, {
    "preferred-label" : "Specialistundersköterskeutbildning inom kvalificerad sjukvård",
    "sentiment" : "OFFERED",
    "type" : "keyword",
    "start-position" : 206,
    "end-position" : 257,
    "concept-id" : "PABK_Mgi_cnj",
    "matched-string" : "Specialistundersköterska inom kvalificerad sjukvård",
    "annotation-id" : 8
  }, {
    "preferred-label" : "Undersköterska, vård- och specialavdelning och mottagning",
    "sentiment" : "OFFERED",
    "type" : "occupation-name",
    "start-position" : 314,
    "end-position" : 338,
    "concept-id" : "PQkQ_Dmk_ZF8",
    "matched-string" : "specialistundersköterska",
    "annotation-id" : 9
  }, {
    "preferred-label" : "hantera akuta vårdsituationer",
    "sentiment" : "OFFERED",
    "type" : "esco-skill",
    "start-position" : 717,
    "end-position" : 762,
    "concept-id" : "JAZa_gxH_Yk2",
    "matched-string" : "göra adekvata bedömningar i akuta situationer",
    "annotation-id" : 10
  }, {
    "preferred-label" : "Undersköterska, vård- och specialavdelning och mottagning",
    "sentiment" : "OFFERED",
    "type" : "occupation-name",
    "start-position" : 810,
    "end-position" : 835,
    "concept-id" : "PQkQ_Dmk_ZF8",
    "matched-string" : "specialistundersköterskor",
    "annotation-id" : 11
  }, {
    "preferred-label" : "Undersköterska, vård- och specialavdelning och mottagning",
    "sentiment" : "OFFERED",
    "type" : "occupation-name",
    "start-position" : 846,
    "end-position" : 870,
    "concept-id" : "PQkQ_Dmk_ZF8",
    "matched-string" : "specialistundersköterska",
    "annotation-id" : 12
  }, {
    "preferred-label" : "ledarskap inom vård och omsorg",
    "sentiment" : "OFFERED",
    "type" : "esco-skill",
    "start-position" : 901,
    "end-position" : 910,
    "concept-id" : "9iKH_7qc_V5h",
    "matched-string" : "ledarskap",
    "annotation-id" : 13
  }, {
    "preferred-label" : "arbeta som ett team",
    "sentiment" : "OFFERED",
    "type" : "esco-skill",
    "start-position" : 912,
    "end-position" : 922,
    "concept-id" : "VFVZ_4YG_Ydi",
    "matched-string" : "teamarbete",
    "annotation-id" : 14
  }, {
    "preferred-label" : "Undersköterska, vård- och specialavdelning och mottagning",
    "sentiment" : "OFFERED",
    "type" : "occupation-name",
    "start-position" : 961,
    "end-position" : 986,
    "concept-id" : "PQkQ_Dmk_ZF8",
    "matched-string" : "specialistundersköterskor",
    "annotation-id" : 15
  }, {
    "preferred-label" : "Hälso- och sjukvård, allmän utbildning",
    "sentiment" : "OFFERED",
    "type" : "sun-education-field-3",
    "start-position" : 1578,
    "end-position" : 1614,
    "concept-id" : "ePB9_rjD_WYM",
    "matched-string" : "Kvalificerad sjukvård och behandling",
    "annotation-id" : 16
  }, {
    "preferred-label" : "Annan omvårdnadsutbildning, allmän vård och omsorg",
    "sentiment" : "OFFERED",
    "type" : "sun-education-field-4",
    "start-position" : 1621,
    "end-position" : 1665,
    "concept-id" : "hLkE_Bx6_riR",
    "matched-string" : "Kommunikation, samtal och bemötande i vården",
    "annotation-id" : 17
  }, {
    "preferred-label" : "Ledarskap, organisation och styrning",
    "sentiment" : "OFFERED",
    "type" : "sun-education-field-4",
    "start-position" : 1672,
    "end-position" : 1697,
    "concept-id" : "AUNw_Uki_1ig",
    "matched-string" : "Handledning och ledarskap",
    "annotation-id" : 18
  }, {
    "preferred-label" : "Specialistsjuksköterskeutbildning, barn och ungdom",
    "sentiment" : "OFFERED",
    "type" : "sun-education-field-4",
    "start-position" : 1704,
    "end-position" : 1744,
    "concept-id" : "E8Yd_tr3_5A5",
    "matched-string" : "Hälso- och sjukvård för barn- och ungdom",
    "annotation-id" : 19
  }, {
    "preferred-label" : "Annan omvårdnadsutbildning, allmän vård och omsorg",
    "sentiment" : "OFFERED",
    "type" : "sun-education-field-4",
    "start-position" : 1751,
    "end-position" : 1765,
    "concept-id" : "hLkE_Bx6_riR",
    "matched-string" : "palliativ vård",
    "annotation-id" : 5
  }, {
    "preferred-label" : "Annan omvårdnadsutbildning, psykiatrisk vård",
    "sentiment" : "OFFERED",
    "type" : "sun-education-field-4",
    "start-position" : 1772,
    "end-position" : 1786,
    "concept-id" : "DUV9_brd_omr",
    "matched-string" : "Psykisk ohälsa",
    "annotation-id" : 20
  }, {
    "preferred-label" : "Hälso- och sjukvård, allmän utbildning",
    "sentiment" : "OFFERED",
    "type" : "sun-education-field-3",
    "start-position" : 1793,
    "end-position" : 1809,
    "concept-id" : "7hoV_kEY_bNs",
    "matched-string" : "Näring och hälsa",
    "annotation-id" : 21
  }, {
    "preferred-label" : null,
    "sentiment" : "OFFERED",
    "type" : "sun-education-field-4",
    "start-position" : 1816,
    "comment" : "praktik",
    "end-position" : 1819,
    "concept-id" : null,
    "matched-string" : "LIA",
    "annotation-id" : 22
  }, {
    "preferred-label" : null,
    "sentiment" : "OFFERED",
    "type" : "sun-education-field-4",
    "start-position" : 1826,
    "end-position" : 1839,
    "concept-id" : null,
    "matched-string" : "Examensarbete",
    "annotation-id" : 23
  } ],
  "text" : "Specialistutbildad undersköterska inom kvalificerad sjukvård  Är du undersköterska och nyfiken på mer och ny kunskap? På Akademi Båstad Yrkeshögskola kan du som redan är undersköterska läsa Yh-utbildningen Specialistundersköterska inom kvalificerad sjukvård. Utbildningen är delvis på distans under ett år.    Som specialistundersköterska går du en spännande framtid till mötes inom kvalificerad sjukvård i privat, regional eller kommunal regi.    Efter utbildningen kan du bidra till bättre kvalitet i den kvalificerade sjukvården och bli en viktig länk mellan undersköterskan och sjuksköterskan i akuta situationer både inom öppen- och sluten vård.  Du får en kompetenshöjning som ger dig beredskap att hantera och göra adekvata bedömningar i akuta situationer vid vård av både barn och vuxna.    Behovet av specialistundersköterskor ökar  Som specialistundersköterska kan du bland annat arbeta med ledarskap, teamarbete och kvalificerad sjukvård. Behovet av specialistundersköterskor ökar i takt med att hälso- och sjukvården blir allt mer kunskapsintensiv och specialiserad. Vårdens organisation har förändrats med korta, intensiva vårdtider i akutsjukvården, och ett ökat ansvar för primärvården och kommunal hälso- och sjukvård.    Studierna bedrivs delvis på distans med en obligatorisk teorivecka per månad i Båstad varvat med tre veckors handledda självstudier på hemorten. De 40 utbildningsveckorna har specialdesignats i samarbete med vårdbranschen för att möta hälso- och sjukvårdens behov av alltmer kunskapsinriktade och specialistundersköterska.    Kursinnehåll  Kvalificerad sjukvård och behandling 55 p  Kommunikation, samtal och bemötande i vården 15 p  Handledning och ledarskap 15 p  Hälso- och sjukvård för barn- och ungdom 20 p  Palliativ vård 20 p  Psykisk ohälsa 20 p  Näring och hälsa 15 p  LIA 20 p  Examensarbete 20 p  "
}