{
  "meta" : {
    "jobad" : {
      "description" : {
        "requirements" : null,
        "needs" : null,
        "company_information" : null,
        "text_formatted" : "<p>Du ska vara anställd av Gevab Bygg AB men arbete ute hos kunder på kortare och/eller längre perioder i deras verkstadsmekaniska verksamhet där montering och verkstadsarbete vid maskiner utförs. Besiktning och kontroller av slutprodukt kan ingå.</p><p>Vi arbetar med de största företagen inom bil- och produkttillverkning samt övrig verkstadsindustri och är ett stöd till dem vid arbetstoppar och större orderingångar.</p><p>Vi söker också duktiga lagerarbetare med sinne för logistik och inventering.</p><p>Beskrivning av kvalifikationer: Du ska vara noggrann, arbetsam och kunna arbeta individuellt samt även samarbeta bra samt trivas i verkstadsmiljö där arbetet ska utföras. Tidigare erfarenhet är meriterande.</p><p>Vi vill enbart ha skriftliga ansökningar då påringningar stör i det dagliga arbetet. Vi svarar på frågor via mail samt kallar till intervju.</p>",
        "conditions" : null,
        "text" : "Du ska vara anställd av Gevab Bygg AB men arbete ute hos kunder på kortare och/eller längre perioder i deras verkstadsmekaniska verksamhet där montering och verkstadsarbete vid maskiner utförs. Besiktning och kontroller av slutprodukt kan ingå.\nVi arbetar med de största företagen inom bil- och produkttillverkning samt övrig verkstadsindustri och är ett stöd till dem vid arbetstoppar och större orderingångar.\nVi söker också duktiga lagerarbetare med sinne för logistik och inventering.\nBeskrivning av kvalifikationer: Du ska vara noggrann, arbetsam och kunna arbeta individuellt samt även samarbeta bra samt trivas i verkstadsmiljö där arbetet ska utföras. Tidigare erfarenhet är meriterande.\nVi vill enbart ha skriftliga ansökningar då påringningar stör i det dagliga arbetet. Vi svarar på frågor via mail samt kallar till intervju."
      },
      "headline" : "Metallkonstruktionsmontör",
      "driving_license" : null,
      "employer" : {
        "email" : null,
        "phone_number" : null,
        "organization_number" : "5569760266",
        "name" : "Gevab Bygg AB",
        "url" : null,
        "workplace" : "Gevab Bygg AB"
      },
      "removed_date" : null,
      "logo_url" : "https://www.arbetsformedlingen.se/rest/arbetsgivare/rest/af/v3/arbetsplatser/86850593/logotyper/logo.png",
      "last_publication_date" : "2022-08-04T00:00:00",
      "number_of_vacancies" : 1,
      "occupation" : {
        "concept_id" : "SXdz_rhy_whp",
        "label" : "Metallkonstruktionsmontör",
        "legacy_ams_taxonomy_id" : "2849"
      },
      "occupation_group" : {
        "concept_id" : "TrwQ_RXT_W8a",
        "label" : "Stålkonstruktionsmontörer och grovplåtsslagare",
        "legacy_ams_taxonomy_id" : "7215"
      },
      "employment_type" : {
        "concept_id" : "PFZr_Syz_cUq",
        "label" : "Vanlig anställning",
        "legacy_ams_taxonomy_id" : "1"
      },
      "webpage_url" : "https://arbetsformedlingen.se/platsbanken/annonser/26294444",
      "driving_license_required" : false,
      "application_contacts" : [ ],
      "duration" : {
        "concept_id" : "a7uU_j21_mkL",
        "label" : "Tills vidare",
        "legacy_ams_taxonomy_id" : "1"
      },
      "nice_to_have" : {
        "education_level" : [ ],
        "work_experiences" : [ {
          "concept_id" : "SXdz_rhy_whp",
          "weight" : 5,
          "label" : "Metallkonstruktionsmontör",
          "legacy_ams_taxonomy_id" : "2849"
        } ],
        "skills" : [ ],
        "education" : [ ],
        "languages" : [ ]
      },
      "application_details" : {
        "via_af" : false,
        "email" : "gevabbyggab@outlook.com",
        "other" : null,
        "reference" : null,
        "url" : null,
        "information" : null
      },
      "source_type" : "VIA_ANNONSERA",
      "application_deadline" : "2022-08-04T00:00:00",
      "external_id" : null,
      "workplace_address" : {
        "coordinates" : [ 11.993919678732928, 57.64968209606495 ],
        "city" : "Mölndal",
        "postcode" : "43145",
        "municipality" : "Mölndal",
        "region_concept_id" : "zdoY_6u5_Krt",
        "region" : "Västra Götalands län",
        "country_code" : "199",
        "region_code" : "14",
        "municipality_concept_id" : "mc45_ki9_Bv3",
        "country_concept_id" : "i46j_HmG_v64",
        "municipality_code" : "1481",
        "street_address" : "Ragnar Thorngrens Gata 8",
        "country" : "Sverige"
      },
      "id" : "26294444",
      "experience_required" : true,
      "working_hours_type" : {
        "concept_id" : "6YE1_gAC_R2G",
        "label" : "Heltid",
        "legacy_ams_taxonomy_id" : "1"
      },
      "access" : null,
      "timestamp" : 1657014305773,
      "must_have" : {
        "education_level" : [ ],
        "work_experiences" : [ ],
        "skills" : [ ],
        "education" : [ ],
        "languages" : [ ]
      },
      "occupation_field" : {
        "concept_id" : "wTEr_CBC_bqh",
        "label" : "Industriell tillverkning",
        "legacy_ams_taxonomy_id" : "9"
      },
      "scope_of_work" : {
        "min" : 0,
        "max" : 100
      },
      "salary_type" : {
        "concept_id" : "oG8G_9cW_nRf",
        "label" : "Fast månads- vecko- eller timlön",
        "legacy_ams_taxonomy_id" : "1"
      },
      "removed" : false,
      "salary_description" : null,
      "access_to_own_car" : false,
      "publication_date" : "2022-07-05T11:45:05"
    },
    "name" : "Metallkonstruktionsmontör",
    "user" : "hannes"
  },
  "sha1" : "9acda772707be9bd0cf5492030c91cb6aa5ca556",
  "annotations" : [ {
    "preferred-label" : "Metallkonstruktionsmontör",
    "sentiment" : "MUST_HAVE",
    "type" : "occupation-name",
    "start-position" : 0,
    "end-position" : 25,
    "concept-id" : "SXdz_rhy_whp",
    "matched-string" : "metallkonstruktionsmontör",
    "annotation-id" : 0
  }, {
    "preferred-label" : "Verkstadsmekaniker",
    "type" : "keyword",
    "start-position" : 135,
    "end-position" : 153,
    "concept-id" : "qpjb_iL4_K68",
    "matched-string" : "verkstadsmekaniska",
    "annotation-id" : 3
  }, {
    "preferred-label" : "Biltillverkare",
    "type" : "keyword",
    "start-position" : 312,
    "end-position" : 315,
    "concept-id" : "CvC1_fS5_jWx",
    "matched-string" : "bil",
    "annotation-id" : 4
  }, {
    "preferred-label" : "lagerarbetare",
    "sentiment" : "MUST_HAVE",
    "type" : "esco-occupation",
    "start-position" : 461,
    "end-position" : 474,
    "concept-id" : "xCqP_G8q_72B",
    "matched-string" : "lagerarbetare",
    "annotation-id" : 1
  }, {
    "preferred-label" : "Logistik",
    "sentiment" : "MUST_HAVE",
    "type" : "skill",
    "start-position" : 489,
    "end-position" : 497,
    "concept-id" : "yXmf_iKi_7ci",
    "matched-string" : "logistik",
    "annotation-id" : 2
  }, {
    "preferred-label" : "noggrannhet",
    "type" : "esco-skill",
    "start-position" : 559,
    "end-position" : 567,
    "concept-id" : "mrsW_EkL_KRD",
    "matched-string" : "noggrann",
    "annotation-id" : 5
  } ],
  "text" : "Metallkonstruktionsmontör\nDu ska vara anställd av Gevab Bygg AB men arbete ute hos kunder på kortare och/eller längre perioder i deras verkstadsmekaniska verksamhet där montering och verkstadsarbete vid maskiner utförs. Besiktning och kontroller av slutprodukt kan ingå.\nVi arbetar med de största företagen inom bil- och produkttillverkning samt övrig verkstadsindustri och är ett stöd till dem vid arbetstoppar och större orderingångar.\nVi söker också duktiga lagerarbetare med sinne för logistik och inventering.\nBeskrivning av kvalifikationer: Du ska vara noggrann, arbetsam och kunna arbeta individuellt samt även samarbeta bra samt trivas i verkstadsmiljö där arbetet ska utföras. Tidigare erfarenhet är meriterande.\nVi vill enbart ha skriftliga ansökningar då påringningar stör i det dagliga arbetet. Vi svarar på frågor via mail samt kallar till intervju."
}