{
  "meta" : {
    "jobad" : {
      "description" : {
        "requirements" : null,
        "needs" : null,
        "company_information" : null,
        "text_formatted" : "<p><strong>Att integrera system är en viktig pusselbit i digitaliseringen av den offentliga sektorn. På Region Uppsalas IT-centrum utvecklar och förvaltar vi integrationer för hela regionens verksamhet.</strong></p><p>Vi söker en systemutvecklare som är serviceinriktad och vetgirig att utvecklas tillsammans med vår grupp som utvecklar integrationer till hela Region Uppsalas verksamhet. </p><p><strong>Om tjänsten</strong></p><p>Som integrationsutvecklare kommer du att arbeta med utvecklingsprojekt i samråd med systemarkitekt, andra integrationsutvecklare och kund; verksamheten. Du har flera parallella projekt, allt från mindre anpassningar till större utvecklingar.</p><p>Du kommer att jobba med uppdrag inom hela Region Uppsala och du kommer att ha många kontaktytor inom vård, kollektivtrafik, fastighetsförvaltning och administrativ förvaltning.</p><p>Vi arbetar agilt enligt ITIL. Här arbetar vi i en föränderlig verksamhet med behov av nytänkande och utveckling.</p><p>IT stödet är idag en viktig del av Region Uppsalas verksamhet. Inom IT-centrum blir du kollega med drygt 170 engagerade medarbetare vars kompetens spänner över ett systems hela livscykel. Du kommer att ingå i gruppen Identitet &amp; Integration som ligger inom avdelningen IT Teknisk plattform.</p><p><strong>Din roll</strong></p><p>Rollen som utvecklare av integrationslösningar är en omväxlande roll där du har goda möjligheter att utvecklas och ta dig an nya områden allt efter som du lär dig nytt.</p><p>Region Uppsala bedriver komplex och kunskapsintensiv verksamhet - här finns i stora möjligheter att lära sig nytt och inte bara inom ditt eget kunskapsområde. Dessutom är vi en arbetsplats där du kan ha balans i livet - här finns plats för både arbete och fritid!</p><p><strong>Din bakgrund</strong></p><p>Vi söker dig som har:</p><ul><li>Högskoleutbildning inom programmering eller har inhämtat motsvarande kunskap på annat sätt</li><li>Mycket god svenska i tal och skrift samt god engelska i tal och skrift är ett krav. </li></ul><p>Det ses som meriterande om du har:</p><ul><li>Erfarenhet av arbete i stor IT-miljö</li><li>Två-tre års arbetslivserfarenhet av programmering och då gärna inom specifikt integrationsutveckling</li><li>Praktisk kunskap om programmeringsspråket Java</li><li>Erfarenhet av API/Microservices</li></ul><p><strong>Personliga egenskaper</strong></p><p>Vi lägger stor vikt vid dina personliga egenskaper vid tillsättningen av denna tjänst.</p><p>Vi söker dig som har rätt grundkunskaper och vill utvecklas, lära dig nytt och växa in i den här rollen över tid. Därför ser vi det som väldigt viktigt att du är trygg i dig själv, driven och tar ansvar för dina arbetsuppgifter.</p><p>Eftersom du kommer ha mycket kontakt med både kolleger i gruppen och IT-organisationen, men också med våra kunder ute i verksamheten så behöver du vara uppmärksam och tillmötesgående i ditt sätt att vara och trivas med att samarbeta med andra. Det är självklart för dig att hjälpa dina kollegor i teamet om de behöver det.</p><p>Vi ser det också som väldigt fördelaktigt om du har ett strukturerat sätt att analysera och angripa problemlösning då det är en stor del av att bygga integrationer.</p><p><strong>Annat viktigt att veta</strong></p><p>Vi erbjuder dig en möjlighet att vara med och påverka utvecklingen i en av Sveriges snabbast växande regioner.</p><p>Tjänsten är en tillsvidareanställning på heltid. </p><p>Hos oss får du förmåner som gör skillnad, läs om dem här, https://regionuppsala.se/jobba-hos-oss/bli-var-nya-kollega/formaner/. Det finns möjlighet till distansarbete. </p><p>Din ansökan vill vi ha senast den <strong>14 augusti 2022</strong>. </p><p>Vid frågor om tjänsten kontakta rekryteringskonsult Eva Gryding, eva.gryding@jobbet.se. Fackliga representanter når du via Region Uppsalas växel 018-611 00 00.</p><p><strong>Välkommen med din ansökan!</strong></p><p><em>Region Uppsala värdesätter de kvaliteter som jämn könsfördelning och mångfald tillför verksamheten. Vi ser därför gärna sökande av alla kön och med olika födelsebakgrund, funktionalitet och livserfarenhet.</em></p><p><strong>Krav</strong></p><ul><li>Högskoleutbildning inom programmering eller motsvarande kunskap inhämtad på annat sätt.</li><li>Mycket god svenska i tal och skrift samt god engelska i tal och skrift.</li></ul><p><strong>Meriterande</strong></p><ul><li>Erfarenhet av arbete i stor IT-miljö</li><li>Två-tre års arbetslivserfarenhet av programmering och då gärna inom specifikt integrationsutveckling</li><li>Praktisk kunskap om programmeringsspråket Java</li><li>Erfarenhet av API/Microservices</li></ul><p>__</p><p><strong>Om arbetsgivaren - Resurscentrum</strong></p><p><em>Resurscentrum är en del av Region Uppsala. Vi är ca 250 medarbetare och verksamma inom områdena IT, systemförvaltning, patientadministration och regionarkiv. Resurscentrum ska tillhandahålla och utveckla effektiva stödprocesser med god kvalitet och hög kundnytta. Vi ska vara en naturlig samarbetspartner för kärnverksamheten och underlätta för dem i deras dagliga arbete.</em></p><p><br></p>",
        "conditions" : null,
        "text" : "Att integrera system är en viktig pusselbit i digitaliseringen av den offentliga sektorn. På Region Uppsalas IT-centrum utvecklar och förvaltar vi integrationer för hela regionens verksamhet.\nVi söker en systemutvecklare som är serviceinriktad och vetgirig att utvecklas tillsammans med vår grupp som utvecklar integrationer till hela Region Uppsalas verksamhet. \nOm tjänsten\nSom integrationsutvecklare kommer du att arbeta med utvecklingsprojekt i samråd med systemarkitekt, andra integrationsutvecklare och kund; verksamheten. Du har flera parallella projekt, allt från mindre anpassningar till större utvecklingar.\nDu kommer att jobba med uppdrag inom hela Region Uppsala och du kommer att ha många kontaktytor inom vård, kollektivtrafik, fastighetsförvaltning och administrativ förvaltning.\nVi arbetar agilt enligt ITIL. Här arbetar vi i en föränderlig verksamhet med behov av nytänkande och utveckling.\nIT stödet är idag en viktig del av Region Uppsalas verksamhet. Inom IT-centrum blir du kollega med drygt 170 engagerade medarbetare vars kompetens spänner över ett systems hela livscykel. Du kommer att ingå i gruppen Identitet & Integration som ligger inom avdelningen IT Teknisk plattform.\nDin roll\nRollen som utvecklare av integrationslösningar är en omväxlande roll där du har goda möjligheter att utvecklas och ta dig an nya områden allt efter som du lär dig nytt.\nRegion Uppsala bedriver komplex och kunskapsintensiv verksamhet - här finns i stora möjligheter att lära sig nytt och inte bara inom ditt eget kunskapsområde. Dessutom är vi en arbetsplats där du kan ha balans i livet - här finns plats för både arbete och fritid!\nDin bakgrund\nVi söker dig som har:\nHögskoleutbildning inom programmering eller har inhämtat motsvarande kunskap på annat sätt\nMycket god svenska i tal och skrift samt god engelska i tal och skrift är ett krav. \n\nDet ses som meriterande om du har:\nErfarenhet av arbete i stor IT-miljö\nTvå-tre års arbetslivserfarenhet av programmering och då gärna inom specifikt integrationsutveckling\nPraktisk kunskap om programmeringsspråket Java\nErfarenhet av API/Microservices\n\nPersonliga egenskaper\nVi lägger stor vikt vid dina personliga egenskaper vid tillsättningen av denna tjänst.\nVi söker dig som har rätt grundkunskaper och vill utvecklas, lära dig nytt och växa in i den här rollen över tid. Därför ser vi det som väldigt viktigt att du är trygg i dig själv, driven och tar ansvar för dina arbetsuppgifter.\nEftersom du kommer ha mycket kontakt med både kolleger i gruppen och IT-organisationen, men också med våra kunder ute i verksamheten så behöver du vara uppmärksam och tillmötesgående i ditt sätt att vara och trivas med att samarbeta med andra. Det är självklart för dig att hjälpa dina kollegor i teamet om de behöver det.\nVi ser det också som väldigt fördelaktigt om du har ett strukturerat sätt att analysera och angripa problemlösning då det är en stor del av att bygga integrationer.\nAnnat viktigt att veta\nVi erbjuder dig en möjlighet att vara med och påverka utvecklingen i en av Sveriges snabbast växande regioner.\nTjänsten är en tillsvidareanställning på heltid. \nHos oss får du förmåner som gör skillnad, läs om dem här, https://regionuppsala.se/jobba-hos-oss/bli-var-nya-kollega/formaner/. Det finns möjlighet till distansarbete. \nDin ansökan vill vi ha senast den 14 augusti 2022. \nVid frågor om tjänsten kontakta rekryteringskonsult Eva Gryding, eva.gryding@jobbet.se. Fackliga representanter når du via Region Uppsalas växel 018-611 00 00.\nVälkommen med din ansökan!\nRegion Uppsala värdesätter de kvaliteter som jämn könsfördelning och mångfald tillför verksamheten. Vi ser därför gärna sökande av alla kön och med olika födelsebakgrund, funktionalitet och livserfarenhet.\nKrav\nHögskoleutbildning inom programmering eller motsvarande kunskap inhämtad på annat sätt.\nMycket god svenska i tal och skrift samt god engelska i tal och skrift.\n\nMeriterande\nErfarenhet av arbete i stor IT-miljö\nTvå-tre års arbetslivserfarenhet av programmering och då gärna inom specifikt integrationsutveckling\nPraktisk kunskap om programmeringsspråket Java\nErfarenhet av API/Microservices\n\n__\nOm arbetsgivaren - Resurscentrum\nResurscentrum är en del av Region Uppsala. Vi är ca 250 medarbetare och verksamma inom områdena IT, systemförvaltning, patientadministration och regionarkiv. Resurscentrum ska tillhandahålla och utveckla effektiva stödprocesser med god kvalitet och hög kundnytta. Vi ska vara en naturlig samarbetspartner för kärnverksamheten och underlätta för dem i deras dagliga arbete."
      },
      "headline" : "Integrationsutvecklare - Resurscentrum, Region Uppsala ",
      "driving_license" : null,
      "employer" : {
        "email" : null,
        "phone_number" : null,
        "organization_number" : "5563752822",
        "name" : "Ls Jobbet AB",
        "url" : null,
        "workplace" : "Resurscentrum"
      },
      "removed_date" : null,
      "logo_url" : null,
      "last_publication_date" : "2022-08-14T23:59:59",
      "number_of_vacancies" : 1,
      "occupation" : {
        "concept_id" : "fg7B_yov_smw",
        "label" : "Systemutvecklare/Programmerare",
        "legacy_ams_taxonomy_id" : "2419"
      },
      "occupation_group" : {
        "concept_id" : "DJh5_yyF_hEM",
        "label" : "Mjukvaru- och systemutvecklare m.fl.",
        "legacy_ams_taxonomy_id" : "2512"
      },
      "employment_type" : {
        "concept_id" : "PFZr_Syz_cUq",
        "label" : "Vanlig anställning",
        "legacy_ams_taxonomy_id" : "1"
      },
      "webpage_url" : "https://arbetsformedlingen.se/platsbanken/annonser/26270062",
      "driving_license_required" : false,
      "application_contacts" : [ ],
      "duration" : {
        "concept_id" : "a7uU_j21_mkL",
        "label" : "Tills vidare",
        "legacy_ams_taxonomy_id" : "1"
      },
      "nice_to_have" : {
        "education_level" : [ ],
        "work_experiences" : [ ],
        "skills" : [ ],
        "education" : [ ],
        "languages" : [ ]
      },
      "application_details" : {
        "via_af" : false,
        "email" : null,
        "other" : null,
        "reference" : null,
        "url" : "https://www.jobbet.se/pagaende-rekryteringar/resurscentrum/integrationsutvecklare/cl4yal80a90252294nm5xvda463",
        "information" : null
      },
      "source_type" : "VIA_ANNONSERA",
      "application_deadline" : "2022-08-14T23:59:59",
      "external_id" : null,
      "workplace_address" : {
        "coordinates" : [ null, null ],
        "city" : null,
        "postcode" : null,
        "municipality" : "Uppsala",
        "region_concept_id" : "zBon_eET_fFU",
        "region" : "Uppsala län",
        "country_code" : "199",
        "region_code" : "03",
        "municipality_concept_id" : "otaF_bQY_4ZD",
        "country_concept_id" : "i46j_HmG_v64",
        "municipality_code" : "0380",
        "street_address" : null,
        "country" : "Sverige"
      },
      "id" : "26270062",
      "experience_required" : true,
      "working_hours_type" : {
        "concept_id" : "6YE1_gAC_R2G",
        "label" : "Heltid",
        "legacy_ams_taxonomy_id" : "1"
      },
      "access" : null,
      "timestamp" : 1656485105806,
      "must_have" : {
        "education_level" : [ ],
        "work_experiences" : [ ],
        "skills" : [ ],
        "education" : [ ],
        "languages" : [ ]
      },
      "occupation_field" : {
        "concept_id" : "apaJ_2ja_LuF",
        "label" : "Data/IT",
        "legacy_ams_taxonomy_id" : "3"
      },
      "scope_of_work" : {
        "min" : 0,
        "max" : 100
      },
      "salary_type" : {
        "concept_id" : "oG8G_9cW_nRf",
        "label" : "Fast månads- vecko- eller timlön",
        "legacy_ams_taxonomy_id" : "1"
      },
      "removed" : false,
      "salary_description" : null,
      "access_to_own_car" : false,
      "publication_date" : "2022-06-29T08:45:05"
    },
    "name" : "Integrationsutvecklare - Resurscentrum, Region Uppsala ",
    "user" : "hannes"
  },
  "sha1" : "229ebde1b3b31cb1bd44bb309710520cb8dde64c",
  "annotations" : [ {
    "preferred-label" : "Uppsala län",
    "type" : "region",
    "start-position" : 40,
    "end-position" : 54,
    "concept-id" : "zBon_eET_fFU",
    "matched-string" : "Region Uppsala",
    "annotation-id" : 26
  }, {
    "preferred-label" : "integrera systemkomponenter",
    "type" : "esco-skill",
    "start-position" : 60,
    "end-position" : 76,
    "concept-id" : "bpSj_Dj4_peh",
    "matched-string" : "integrera system",
    "annotation-id" : 27
  }, {
    "preferred-label" : "Uppsala län",
    "type" : "region",
    "start-position" : 149,
    "end-position" : 164,
    "concept-id" : "zBon_eET_fFU",
    "matched-string" : "Region Uppsalas",
    "annotation-id" : 28
  }, {
    "preferred-label" : "Data/IT",
    "sentiment" : "MUST_HAVE",
    "type" : "occupation-field",
    "start-position" : 165,
    "end-position" : 167,
    "concept-id" : "apaJ_2ja_LuF",
    "matched-string" : "it",
    "annotation-id" : 0
  }, {
    "preferred-label" : "Uppsala län",
    "type" : "region",
    "start-position" : 226,
    "end-position" : 235,
    "concept-id" : "zBon_eET_fFU",
    "matched-string" : "regionens",
    "annotation-id" : 29
  }, {
    "preferred-label" : "Systemutvecklare/Programmerare",
    "sentiment" : "MUST_HAVE",
    "type" : "occupation-name",
    "start-position" : 260,
    "end-position" : 276,
    "concept-id" : "fg7B_yov_smw",
    "matched-string" : "systemutvecklare",
    "annotation-id" : 1
  }, {
    "preferred-label" : "Uppsala län",
    "type" : "region",
    "start-position" : 391,
    "end-position" : 406,
    "concept-id" : "zBon_eET_fFU",
    "matched-string" : "Region Uppsalas",
    "annotation-id" : 30
  }, {
    "preferred-label" : "Systemarkitekt",
    "sentiment" : "MUST_HAVE",
    "type" : "occupation-name",
    "start-position" : 516,
    "end-position" : 530,
    "concept-id" : "i1F4_cZZ_PJu",
    "matched-string" : "systemarkitekt",
    "annotation-id" : 2
  }, {
    "preferred-label" : "Uppsala län",
    "type" : "region",
    "start-position" : 716,
    "end-position" : 730,
    "concept-id" : "zBon_eET_fFU",
    "matched-string" : "Region Uppsala",
    "annotation-id" : 31
  }, {
    "preferred-label" : "Kollektivtrafik",
    "sentiment" : "MUST_HAVE",
    "type" : "sni-level-4",
    "start-position" : 781,
    "end-position" : 796,
    "concept-id" : "XVG5_tVe_RFd",
    "matched-string" : "kollektivtrafik",
    "annotation-id" : 3
  }, {
    "preferred-label" : "Fastighetsförvaltning",
    "sentiment" : "MUST_HAVE",
    "type" : "skill",
    "start-position" : 798,
    "end-position" : 819,
    "concept-id" : "4XyZ_6t8_TWq",
    "matched-string" : "fastighetsförvaltning",
    "annotation-id" : 4
  }, {
    "preferred-label" : "agil utveckling",
    "type" : "esco-skill",
    "start-position" : 862,
    "end-position" : 867,
    "concept-id" : "azwQ_pDo_Dur",
    "matched-string" : "agilt",
    "annotation-id" : 32
  }, {
    "preferred-label" : "arbeta i en ITIL-baserad miljö",
    "type" : "esco-skill",
    "start-position" : 875,
    "end-position" : 879,
    "concept-id" : "ZJS4_Han_D8x",
    "matched-string" : "ITIL",
    "annotation-id" : 33
  }, {
    "preferred-label" : "Data/IT",
    "sentiment" : "MUST_HAVE",
    "type" : "occupation-field",
    "start-position" : 964,
    "end-position" : 966,
    "concept-id" : "apaJ_2ja_LuF",
    "matched-string" : "it",
    "annotation-id" : 5
  }, {
    "preferred-label" : "Uppsala län",
    "type" : "region",
    "start-position" : 999,
    "end-position" : 1014,
    "concept-id" : "zBon_eET_fFU",
    "matched-string" : "Region Uppsalas",
    "annotation-id" : 34
  }, {
    "preferred-label" : "Data/IT",
    "sentiment" : "MUST_HAVE",
    "type" : "occupation-field",
    "start-position" : 1032,
    "end-position" : 1034,
    "concept-id" : "apaJ_2ja_LuF",
    "matched-string" : "it",
    "annotation-id" : 6
  }, {
    "preferred-label" : "Data/IT",
    "sentiment" : "MUST_HAVE",
    "type" : "occupation-field",
    "start-position" : 1233,
    "end-position" : 1235,
    "concept-id" : "apaJ_2ja_LuF",
    "matched-string" : "it",
    "annotation-id" : 7
  }, {
    "preferred-label" : "Uppsala län",
    "type" : "region",
    "start-position" : 1433,
    "end-position" : 1447,
    "concept-id" : "zBon_eET_fFU",
    "matched-string" : "Region Uppsala",
    "annotation-id" : 35
  }, {
    "preferred-label" : "Programmering",
    "sentiment" : "MUST_HAVE",
    "type" : "skill",
    "start-position" : 1756,
    "end-position" : 1769,
    "concept-id" : "iUew_moc_BRk",
    "matched-string" : "programmering",
    "annotation-id" : 9
  }, {
    "preferred-label" : "Svenska",
    "sentiment" : "MUST_HAVE",
    "type" : "language",
    "start-position" : 1834,
    "end-position" : 1841,
    "concept-id" : "zSLA_vw2_FXN",
    "matched-string" : "svenska",
    "annotation-id" : 10
  }, {
    "preferred-label" : "Engelska",
    "sentiment" : "MUST_HAVE",
    "type" : "language",
    "start-position" : 1868,
    "end-position" : 1876,
    "concept-id" : "NVxJ_hLg_TYS",
    "matched-string" : "engelska",
    "annotation-id" : 11
  }, {
    "preferred-label" : "Data/IT",
    "sentiment" : "MUST_HAVE",
    "type" : "occupation-field",
    "start-position" : 1972,
    "end-position" : 1974,
    "concept-id" : "apaJ_2ja_LuF",
    "matched-string" : "it",
    "annotation-id" : 12
  }, {
    "preferred-label" : "2-4 års erfarenhet",
    "type" : "occupation-experience-year",
    "start-position" : 1981,
    "end-position" : 2013,
    "concept-id" : "RWA2_uu6_udD",
    "matched-string" : "Två-tre års arbetslivserfarenhet",
    "annotation-id" : 36
  }, {
    "preferred-label" : "Programmering",
    "sentiment" : "MUST_HAVE",
    "type" : "skill",
    "start-position" : 2017,
    "end-position" : 2030,
    "concept-id" : "iUew_moc_BRk",
    "matched-string" : "programmering",
    "annotation-id" : 13
  }, {
    "preferred-label" : "Java, programmeringsspråk",
    "sentiment" : "MUST_HAVE",
    "type" : "skill",
    "start-position" : 2124,
    "end-position" : 2128,
    "concept-id" : "jCsR_WQX_CKD",
    "matched-string" : "java",
    "annotation-id" : 14
  }, {
    "preferred-label" : "Data/IT",
    "sentiment" : "MUST_HAVE",
    "type" : "occupation-field",
    "start-position" : 2569,
    "end-position" : 2571,
    "concept-id" : "apaJ_2ja_LuF",
    "matched-string" : "it",
    "annotation-id" : 15
  }, {
    "preferred-label" : "Tillsvidareanställning (inkl. eventuell provanställning)",
    "type" : "employment-type",
    "start-position" : 3137,
    "end-position" : 3159,
    "concept-id" : "kpPX_CNN_gDU",
    "matched-string" : "tillsvidareanställning",
    "annotation-id" : 37
  }, {
    "preferred-label" : "Heltid",
    "type" : "worktime-extent",
    "start-position" : 3163,
    "end-position" : 3169,
    "concept-id" : "6YE1_gAC_R2G",
    "matched-string" : "heltid",
    "annotation-id" : 38
  }, {
    "preferred-label" : "Distansarbete",
    "type" : "work-place-environment",
    "start-position" : 3325,
    "end-position" : 3338,
    "concept-id" : "uwzb_xcR_vxS",
    "matched-string" : "distansarbete",
    "annotation-id" : 39
  }, {
    "preferred-label" : "rekryteringskonsult",
    "sentiment" : "MUST_HAVE",
    "type" : "esco-occupation",
    "start-position" : 3425,
    "end-position" : 3444,
    "concept-id" : "tGyt_via_HNb",
    "matched-string" : "rekryteringskonsult",
    "annotation-id" : 16
  }, {
    "preferred-label" : "Uppsala län",
    "type" : "region",
    "start-position" : 3516,
    "end-position" : 3531,
    "concept-id" : "zBon_eET_fFU",
    "matched-string" : "Region Uppsalas",
    "annotation-id" : 40
  }, {
    "preferred-label" : "Uppsala län",
    "type" : "region",
    "start-position" : 3580,
    "end-position" : 3594,
    "concept-id" : "zBon_eET_fFU",
    "matched-string" : "Region Uppsala",
    "annotation-id" : 41
  }, {
    "preferred-label" : "Programmering",
    "sentiment" : "MUST_HAVE",
    "type" : "skill",
    "start-position" : 3815,
    "end-position" : 3828,
    "concept-id" : "iUew_moc_BRk",
    "matched-string" : "programmering",
    "annotation-id" : 17
  }, {
    "preferred-label" : "Svenska",
    "sentiment" : "MUST_HAVE",
    "type" : "language",
    "start-position" : 3890,
    "end-position" : 3897,
    "concept-id" : "zSLA_vw2_FXN",
    "matched-string" : "svenska",
    "annotation-id" : 18
  }, {
    "preferred-label" : "Engelska",
    "sentiment" : "MUST_HAVE",
    "type" : "language",
    "start-position" : 3924,
    "end-position" : 3932,
    "concept-id" : "NVxJ_hLg_TYS",
    "matched-string" : "engelska",
    "annotation-id" : 19
  }, {
    "preferred-label" : "Data/IT",
    "sentiment" : "MUST_HAVE",
    "type" : "occupation-field",
    "start-position" : 3992,
    "end-position" : 3994,
    "concept-id" : "apaJ_2ja_LuF",
    "matched-string" : "it",
    "annotation-id" : 20
  }, {
    "preferred-label" : "Programmering",
    "sentiment" : "MUST_HAVE",
    "type" : "skill",
    "start-position" : 4037,
    "end-position" : 4050,
    "concept-id" : "iUew_moc_BRk",
    "matched-string" : "programmering",
    "annotation-id" : 21
  }, {
    "preferred-label" : "Java, programmeringsspråk",
    "sentiment" : "MUST_HAVE",
    "type" : "skill",
    "start-position" : 4144,
    "end-position" : 4148,
    "concept-id" : "jCsR_WQX_CKD",
    "matched-string" : "java",
    "annotation-id" : 22
  }, {
    "preferred-label" : "Uppsala län",
    "type" : "region",
    "start-position" : 4245,
    "end-position" : 4259,
    "concept-id" : "zBon_eET_fFU",
    "matched-string" : "Region Uppsala",
    "annotation-id" : 42
  }, {
    "preferred-label" : "Data/IT",
    "sentiment" : "MUST_HAVE",
    "type" : "occupation-field",
    "start-position" : 4314,
    "end-position" : 4316,
    "concept-id" : "apaJ_2ja_LuF",
    "matched-string" : "it",
    "annotation-id" : 23
  }, {
    "preferred-label" : "Systemförvaltning",
    "sentiment" : "MUST_HAVE",
    "type" : "skill",
    "start-position" : 4318,
    "end-position" : 4335,
    "concept-id" : "4f1v_w91_qVM",
    "matched-string" : "systemförvaltning",
    "annotation-id" : 24
  }, {
    "preferred-label" : "Patientadministration",
    "sentiment" : "MUST_HAVE",
    "type" : "skill",
    "start-position" : 4337,
    "end-position" : 4358,
    "concept-id" : "Xw3d_9qU_TAj",
    "matched-string" : "patientadministration",
    "annotation-id" : 25
  } ],
  "text" : "Integrationsutvecklare - Resurscentrum, Region Uppsala \nAtt integrera system är en viktig pusselbit i digitaliseringen av den offentliga sektorn. På Region Uppsalas IT-centrum utvecklar och förvaltar vi integrationer för hela regionens verksamhet.\nVi söker en systemutvecklare som är serviceinriktad och vetgirig att utvecklas tillsammans med vår grupp som utvecklar integrationer till hela Region Uppsalas verksamhet. \nOm tjänsten\nSom integrationsutvecklare kommer du att arbeta med utvecklingsprojekt i samråd med systemarkitekt, andra integrationsutvecklare och kund; verksamheten. Du har flera parallella projekt, allt från mindre anpassningar till större utvecklingar.\nDu kommer att jobba med uppdrag inom hela Region Uppsala och du kommer att ha många kontaktytor inom vård, kollektivtrafik, fastighetsförvaltning och administrativ förvaltning.\nVi arbetar agilt enligt ITIL. Här arbetar vi i en föränderlig verksamhet med behov av nytänkande och utveckling.\nIT stödet är idag en viktig del av Region Uppsalas verksamhet. Inom IT-centrum blir du kollega med drygt 170 engagerade medarbetare vars kompetens spänner över ett systems hela livscykel. Du kommer att ingå i gruppen Identitet & Integration som ligger inom avdelningen IT Teknisk plattform.\nDin roll\nRollen som utvecklare av integrationslösningar är en omväxlande roll där du har goda möjligheter att utvecklas och ta dig an nya områden allt efter som du lär dig nytt.\nRegion Uppsala bedriver komplex och kunskapsintensiv verksamhet - här finns i stora möjligheter att lära sig nytt och inte bara inom ditt eget kunskapsområde. Dessutom är vi en arbetsplats där du kan ha balans i livet - här finns plats för både arbete och fritid!\nDin bakgrund\nVi söker dig som har:\nHögskoleutbildning inom programmering eller har inhämtat motsvarande kunskap på annat sätt\nMycket god svenska i tal och skrift samt god engelska i tal och skrift är ett krav. \n\nDet ses som meriterande om du har:\nErfarenhet av arbete i stor IT-miljö\nTvå-tre års arbetslivserfarenhet av programmering och då gärna inom specifikt integrationsutveckling\nPraktisk kunskap om programmeringsspråket Java\nErfarenhet av API/Microservices\n\nPersonliga egenskaper\nVi lägger stor vikt vid dina personliga egenskaper vid tillsättningen av denna tjänst.\nVi söker dig som har rätt grundkunskaper och vill utvecklas, lära dig nytt och växa in i den här rollen över tid. Därför ser vi det som väldigt viktigt att du är trygg i dig själv, driven och tar ansvar för dina arbetsuppgifter.\nEftersom du kommer ha mycket kontakt med både kolleger i gruppen och IT-organisationen, men också med våra kunder ute i verksamheten så behöver du vara uppmärksam och tillmötesgående i ditt sätt att vara och trivas med att samarbeta med andra. Det är självklart för dig att hjälpa dina kollegor i teamet om de behöver det.\nVi ser det också som väldigt fördelaktigt om du har ett strukturerat sätt att analysera och angripa problemlösning då det är en stor del av att bygga integrationer.\nAnnat viktigt att veta\nVi erbjuder dig en möjlighet att vara med och påverka utvecklingen i en av Sveriges snabbast växande regioner.\nTjänsten är en tillsvidareanställning på heltid. \nHos oss får du förmåner som gör skillnad, läs om dem här, https://regionuppsala.se/jobba-hos-oss/bli-var-nya-kollega/formaner/. Det finns möjlighet till distansarbete. \nDin ansökan vill vi ha senast den 14 augusti 2022. \nVid frågor om tjänsten kontakta rekryteringskonsult Eva Gryding, eva.gryding@jobbet.se. Fackliga representanter når du via Region Uppsalas växel 018-611 00 00.\nVälkommen med din ansökan!\nRegion Uppsala värdesätter de kvaliteter som jämn könsfördelning och mångfald tillför verksamheten. Vi ser därför gärna sökande av alla kön och med olika födelsebakgrund, funktionalitet och livserfarenhet.\nKrav\nHögskoleutbildning inom programmering eller motsvarande kunskap inhämtad på annat sätt.\nMycket god svenska i tal och skrift samt god engelska i tal och skrift.\n\nMeriterande\nErfarenhet av arbete i stor IT-miljö\nTvå-tre års arbetslivserfarenhet av programmering och då gärna inom specifikt integrationsutveckling\nPraktisk kunskap om programmeringsspråket Java\nErfarenhet av API/Microservices\n\n__\nOm arbetsgivaren - Resurscentrum\nResurscentrum är en del av Region Uppsala. Vi är ca 250 medarbetare och verksamma inom områdena IT, systemförvaltning, patientadministration och regionarkiv. Resurscentrum ska tillhandahålla och utveckla effektiva stödprocesser med god kvalitet och hög kundnytta. Vi ska vara en naturlig samarbetspartner för kärnverksamheten och underlätta för dem i deras dagliga arbete."
}