{
  "meta" : {
    "jobad" : {
      "description" : {
        "requirements" : null,
        "needs" : null,
        "company_information" : null,
        "text_formatted" : "Dina arbetsuppgifter\nTill vår kund i Hudiksvall med omnejd söker vi nu efter en installationstekniker. Du kommer att utföra installationer av port och dockningslösningar på ombyggnationer och nybyggnationer. Du kommer även ansvara för dokumentering kring installationerna, ta emot tilläggsbeställningar samt att hålla en löpande kontakt med kunder och underentreprenörer. Du utgår från hemifrån och arbetar inom ett angivet distrikt, resor i tjänsten och övernattningar kan förekomma ibland.\n\nDetta är en rekrytering vilket innebär att du blir anställd direkt hos kunden. Arbetet är på heltid och arbetstiden är förlagt mellan 07.00-16.00, måndag till fredag.\n\nOm företaget\nMer information om företaget ges vid intervjutillfället\n\n\nDin profil\nVi tror att du som söker har en gymnasieutbildning inom el, mekanik, teknik eller alternativt att du har en likvärdig eller relevant yrkesutbildning inom området. För att passa i rollen krävs det att du arbetat med något av följande, felsökning, reparationer, installationer och/eller underhåll. Har du el-behörighet eller kunskaper kring svagström är detta meriterande. Har du även liftutbildning samt certifikat på heta arbeten ser vi detta som en fördel. Du har goda kunskaper i svenska, både i tal och skrift samt grundläggande kunskaper i engelska. Ett krav för tjänsten är att du har B-körkort.\n\nFör att passa in i denna rollen är du serviceinriktad och relationsskapande, du trivs i en position med mycket kundkontakt. Du tar ansvar för ditt arbete och utför det på ett strukturerat och säkert sätt. Du har ett intresse för teknik, är en problemlösare och har god verktygsvana.\n\nIntresserad? Skicka in din ansökan snarast då urval sker löpande. Vid eventuella frågor om tjänsten hänvisar vi till ansvarig rekryteringskonsult Emily Higgins på telefon 0733656832 eller emily.higgins@2complete.se.\n\nOm 2Complete\n2Complete är ett auktoriserat rekryterings- och bemanningsföretag som arbetar med personligt engagemang samt en passion för personal. Vår auktorisation i Kompetensföretagen ger oss i sin tur medlemskap i Almega och Svenskt Näringsliv. \n\nDet är för oss av yttersta vikt att de personliga förutsättningarna stämmer överens mellan kund och kandidat, likväl som kompetensen. För att uppnå detta vill vi som arbetar på 2Complete skapa en så nära och personlig relation med kunder och kandidater som möjligt. Ett arbete efter dessa riktlinjer skapar förtroende och trygghet, värden som är självklara för en lyckad rekryteringsprocess. Vi rekryterar och bemannar under tjänstemannaavtalet såväl som arbetaravtalet, allt från juniora tjänster till chefer- och specialister.\n\n2Complete är auktoriserade medlemmar inom Kompetensföretagen, Almega samt Svenskt Näringsliv och har varit sedan 2011.",
        "conditions" : "Heltid\r\nTillsvidare",
        "text" : "Dina arbetsuppgifter\nTill vår kund i Hudiksvall med omnejd söker vi nu efter en installationstekniker. Du kommer att utföra installationer av port och dockningslösningar på ombyggnationer och nybyggnationer. Du kommer även ansvara för dokumentering kring installationerna, ta emot tilläggsbeställningar samt att hålla en löpande kontakt med kunder och underentreprenörer. Du utgår från hemifrån och arbetar inom ett angivet distrikt, resor i tjänsten och övernattningar kan förekomma ibland.\n\nDetta är en rekrytering vilket innebär att du blir anställd direkt hos kunden. Arbetet är på heltid och arbetstiden är förlagt mellan 07.00-16.00, måndag till fredag.\n\nOm företaget\nMer information om företaget ges vid intervjutillfället\n\n\nDin profil\nVi tror att du som söker har en gymnasieutbildning inom el, mekanik, teknik eller alternativt att du har en likvärdig eller relevant yrkesutbildning inom området. För att passa i rollen krävs det att du arbetat med något av följande, felsökning, reparationer, installationer och/eller underhåll. Har du el-behörighet eller kunskaper kring svagström är detta meriterande. Har du även liftutbildning samt certifikat på heta arbeten ser vi detta som en fördel. Du har goda kunskaper i svenska, både i tal och skrift samt grundläggande kunskaper i engelska. Ett krav för tjänsten är att du har B-körkort.\n\nFör att passa in i denna rollen är du serviceinriktad och relationsskapande, du trivs i en position med mycket kundkontakt. Du tar ansvar för ditt arbete och utför det på ett strukturerat och säkert sätt. Du har ett intresse för teknik, är en problemlösare och har god verktygsvana.\n\nIntresserad? Skicka in din ansökan snarast då urval sker löpande. Vid eventuella frågor om tjänsten hänvisar vi till ansvarig rekryteringskonsult Emily Higgins på telefon 0733656832 eller emily.higgins@2complete.se.\n\nOm 2Complete\n2Complete är ett auktoriserat rekryterings- och bemanningsföretag som arbetar med personligt engagemang samt en passion för personal. Vår auktorisation i Kompetensföretagen ger oss i sin tur medlemskap i Almega och Svenskt Näringsliv. \n\nDet är för oss av yttersta vikt att de personliga förutsättningarna stämmer överens mellan kund och kandidat, likväl som kompetensen. För att uppnå detta vill vi som arbetar på 2Complete skapa en så nära och personlig relation med kunder och kandidater som möjligt. Ett arbete efter dessa riktlinjer skapar förtroende och trygghet, värden som är självklara för en lyckad rekryteringsprocess. Vi rekryterar och bemannar under tjänstemannaavtalet såväl som arbetaravtalet, allt från juniora tjänster till chefer- och specialister.\n\n2Complete är auktoriserade medlemmar inom Kompetensföretagen, Almega samt Svenskt Näringsliv och har varit sedan 2011."
      },
      "headline" : "Installationstekniker till Hudiksvall",
      "driving_license" : [ {
        "concept_id" : "VTK8_WRx_GcM",
        "label" : "B",
        "legacy_ams_taxonomy_id" : "3"
      } ],
      "employer" : {
        "email" : null,
        "phone_number" : null,
        "organization_number" : "5568118334",
        "name" : "2Complete AB",
        "url" : "http://www.2complete.se",
        "workplace" : "2Complete AB"
      },
      "removed_date" : null,
      "logo_url" : "https://www.arbetsformedlingen.se/rest/arbetsgivare/rest/af/v3/organisation/5568118334/logotyper/logo.png",
      "last_publication_date" : "2022-08-25T23:59:59",
      "number_of_vacancies" : 1,
      "occupation" : {
        "concept_id" : "szG4_Xgg_AjP",
        "label" : "Installationstekniker",
        "legacy_ams_taxonomy_id" : "273"
      },
      "occupation_group" : {
        "concept_id" : "KttZ_Skc_bMR",
        "label" : "Underhållsmekaniker och maskinreparatörer",
        "legacy_ams_taxonomy_id" : "7233"
      },
      "employment_type" : {
        "concept_id" : "PFZr_Syz_cUq",
        "label" : "Vanlig anställning",
        "legacy_ams_taxonomy_id" : "1"
      },
      "webpage_url" : "https://arbetsformedlingen.se/platsbanken/annonser/26356170",
      "driving_license_required" : true,
      "application_contacts" : [ {
        "description" : "Emily Higgins",
        "email" : "emily.higgins@2complete.se",
        "telephone" : "073 365 68 32",
        "name" : null,
        "contact_type" : null
      } ],
      "duration" : {
        "concept_id" : "a7uU_j21_mkL",
        "label" : "Tills vidare",
        "legacy_ams_taxonomy_id" : "1"
      },
      "nice_to_have" : {
        "education_level" : [ ],
        "work_experiences" : [ ],
        "skills" : [ ],
        "education" : [ ],
        "languages" : [ ]
      },
      "application_details" : {
        "via_af" : false,
        "email" : null,
        "other" : null,
        "reference" : "3237",
        "url" : "http://2complete.se/index.php?option=com_bloom&task=ads.redirect&item_id=3237",
        "information" : null
      },
      "source_type" : "VIA_PLATSBANKEN_DXA",
      "application_deadline" : "2022-08-25T23:59:59",
      "external_id" : "46-556811-8334-3237",
      "workplace_address" : {
        "coordinates" : [ 17.1074, 61.72739 ],
        "city" : null,
        "postcode" : null,
        "municipality" : "Hudiksvall",
        "region_concept_id" : "zupA_8Nt_xcD",
        "region" : "Gävleborgs län",
        "country_code" : "199",
        "region_code" : "21",
        "municipality_concept_id" : "Utks_mwF_axY",
        "country_concept_id" : "i46j_HmG_v64",
        "municipality_code" : "2184",
        "street_address" : null,
        "country" : "Sverige"
      },
      "id" : "26356170",
      "experience_required" : false,
      "working_hours_type" : {
        "concept_id" : "6YE1_gAC_R2G",
        "label" : "Heltid",
        "legacy_ams_taxonomy_id" : "1"
      },
      "access" : null,
      "timestamp" : 1658902283968,
      "must_have" : {
        "education_level" : [ ],
        "work_experiences" : [ ],
        "skills" : [ ],
        "education" : [ ],
        "languages" : [ ]
      },
      "occupation_field" : {
        "concept_id" : "yhCP_AqT_tns",
        "label" : "Installation, drift, underhåll",
        "legacy_ams_taxonomy_id" : "10"
      },
      "scope_of_work" : {
        "min" : 100,
        "max" : 100
      },
      "salary_type" : {
        "concept_id" : "oG8G_9cW_nRf",
        "label" : "Fast månads- vecko- eller timlön",
        "legacy_ams_taxonomy_id" : "1"
      },
      "removed" : false,
      "salary_description" : "Fast lön",
      "access_to_own_car" : false,
      "publication_date" : "2022-07-27T08:11:23"
    },
    "name" : "Installationstekniker till Hudiksvall",
    "user" : "kristof.fischer"
  },
  "sha1" : "33e233b714588026d79d7a6004a70029fbf7b12d",
  "annotations" : [ {
    "preferred-label" : "Installationstekniker",
    "sentiment" : "MUST_HAVE",
    "type" : "occupation-name",
    "start-position" : 0,
    "end-position" : 21,
    "concept-id" : "szG4_Xgg_AjP",
    "matched-string" : "installationstekniker",
    "annotation-id" : 0
  }, {
    "preferred-label" : "Hudiksvall",
    "type" : "municipality",
    "start-position" : 27,
    "end-position" : 37,
    "concept-id" : "Utks_mwF_axY",
    "matched-string" : "Hudiksvall",
    "annotation-id" : 11
  }, {
    "preferred-label" : "Hudiksvall",
    "type" : "municipality",
    "start-position" : 75,
    "end-position" : 85,
    "concept-id" : "Utks_mwF_axY",
    "matched-string" : "Hudiksvall",
    "annotation-id" : 10
  }, {
    "preferred-label" : "Installationstekniker",
    "sentiment" : "MUST_HAVE",
    "type" : "occupation-name",
    "start-position" : 118,
    "end-position" : 139,
    "concept-id" : "szG4_Xgg_AjP",
    "matched-string" : "installationstekniker",
    "annotation-id" : 1
  }, {
    "preferred-label" : "Heltid",
    "type" : "worktime-extent",
    "start-position" : 624,
    "end-position" : 630,
    "concept-id" : "6YE1_gAC_R2G",
    "matched-string" : "heltid",
    "annotation-id" : 12
  }, {
    "preferred-label" : "Gymnasial utbildning",
    "sentiment" : "MUST_HAVE",
    "type" : "sni-level-3",
    "start-position" : 813,
    "end-position" : 831,
    "concept-id" : "t8bn_FTn_FiG",
    "matched-string" : "gymnasieutbildning",
    "annotation-id" : 13
  }, {
    "preferred-label" : "Annan utbildning inom teknik och teknisk industri",
    "sentiment" : "MUST_HAVE",
    "type" : "sun-education-field-4",
    "start-position" : 837,
    "end-position" : 856,
    "concept-id" : "NKNc_sE8_2ok",
    "matched-string" : "el, mekanik, teknik",
    "annotation-id" : 14
  }, {
    "preferred-label" : "göra felsökning",
    "sentiment" : "MUST_HAVE",
    "type" : "esco-skill",
    "start-position" : 1015,
    "end-position" : 1025,
    "concept-id" : "HqC8_fVY_ACM",
    "matched-string" : "felsökning",
    "annotation-id" : 15
  }, {
    "preferred-label" : "underhåll och reparation",
    "sentiment" : "MUST_HAVE",
    "type" : "esco-skill",
    "start-position" : 1027,
    "end-position" : 1039,
    "concept-id" : "i19U_G6R_t19",
    "matched-string" : "reparationer",
    "annotation-id" : 16
  }, {
    "preferred-label" : "Installationsteknik",
    "sentiment" : "MUST_HAVE",
    "type" : "skill",
    "start-position" : 1041,
    "end-position" : 1055,
    "concept-id" : "1VVe_BBY_rpQ",
    "matched-string" : "installationer",
    "annotation-id" : 17
  }, {
    "preferred-label" : "underhåll och reparation",
    "sentiment" : "MUST_HAVE",
    "type" : "esco-skill",
    "start-position" : 1066,
    "end-position" : 1075,
    "concept-id" : "i19U_G6R_t19",
    "matched-string" : "underhåll",
    "annotation-id" : 18
  }, {
    "preferred-label" : "Elbehörigheter",
    "sentiment" : "NICE_TO_HAVE",
    "type" : "skill-headline",
    "start-position" : 1084,
    "end-position" : 1097,
    "concept-id" : "ZCoT_VJN_9cA",
    "matched-string" : "el-behörighet",
    "annotation-id" : 19
  }, {
    "preferred-label" : null,
    "sentiment" : "NICE_TO_HAVE",
    "type" : "sni-level-4",
    "start-position" : 1164,
    "end-position" : 1178,
    "concept-id" : null,
    "matched-string" : "liftutbildning",
    "annotation-id" : 20
  }, {
    "preferred-label" : "Certifikat, heta arbeten",
    "sentiment" : "NICE_TO_HAVE",
    "type" : "skill",
    "start-position" : 1184,
    "end-position" : 1210,
    "concept-id" : "Q7eC_B7g_QiU",
    "matched-string" : "certifikat på heta arbeten",
    "annotation-id" : 21
  }, {
    "preferred-label" : "Svenska",
    "sentiment" : "MUST_HAVE",
    "type" : "language",
    "start-position" : 1263,
    "end-position" : 1270,
    "concept-id" : "zSLA_vw2_FXN",
    "matched-string" : "svenska",
    "annotation-id" : 5
  }, {
    "preferred-label" : "Engelska",
    "sentiment" : "MUST_HAVE",
    "type" : "language",
    "start-position" : 1325,
    "end-position" : 1333,
    "concept-id" : "NVxJ_hLg_TYS",
    "matched-string" : "engelska",
    "annotation-id" : 6
  }, {
    "preferred-label" : "B",
    "sentiment" : "MUST_HAVE",
    "type" : "driving-licence",
    "start-position" : 1371,
    "end-position" : 1380,
    "concept-id" : "VTK8_WRx_GcM",
    "matched-string" : "B-körkort",
    "annotation-id" : 22
  }, {
    "preferred-label" : "hitta lösningar på problem",
    "sentiment" : "MUST_HAVE",
    "type" : "esco-skill",
    "start-position" : 1626,
    "end-position" : 1639,
    "concept-id" : "WFSY_Bwt_QWE",
    "matched-string" : "problemlösare",
    "annotation-id" : 23
  } ],
  "text" : "Installationstekniker till Hudiksvall\nDina arbetsuppgifter\nTill vår kund i Hudiksvall med omnejd söker vi nu efter en installationstekniker. Du kommer att utföra installationer av port och dockningslösningar på ombyggnationer och nybyggnationer. Du kommer även ansvara för dokumentering kring installationerna, ta emot tilläggsbeställningar samt att hålla en löpande kontakt med kunder och underentreprenörer. Du utgår från hemifrån och arbetar inom ett angivet distrikt, resor i tjänsten och övernattningar kan förekomma ibland.\n\nDetta är en rekrytering vilket innebär att du blir anställd direkt hos kunden. Arbetet är på heltid och arbetstiden är förlagt mellan 07.00-16.00, måndag till fredag.\n\nOm företaget\nMer information om företaget ges vid intervjutillfället\n\n\nDin profil\nVi tror att du som söker har en gymnasieutbildning inom el, mekanik, teknik eller alternativt att du har en likvärdig eller relevant yrkesutbildning inom området. För att passa i rollen krävs det att du arbetat med något av följande, felsökning, reparationer, installationer och/eller underhåll. Har du el-behörighet eller kunskaper kring svagström är detta meriterande. Har du även liftutbildning samt certifikat på heta arbeten ser vi detta som en fördel. Du har goda kunskaper i svenska, både i tal och skrift samt grundläggande kunskaper i engelska. Ett krav för tjänsten är att du har B-körkort.\n\nFör att passa in i denna rollen är du serviceinriktad och relationsskapande, du trivs i en position med mycket kundkontakt. Du tar ansvar för ditt arbete och utför det på ett strukturerat och säkert sätt. Du har ett intresse för teknik, är en problemlösare och har god verktygsvana.\n\nIntresserad? Skicka in din ansökan snarast då urval sker löpande. Vid eventuella frågor om tjänsten hänvisar vi till ansvarig rekryteringskonsult Emily Higgins på telefon 0733656832 eller emily.higgins@2complete.se.\n\nOm 2Complete\n2Complete är ett auktoriserat rekryterings- och bemanningsföretag som arbetar med personligt engagemang samt en passion för personal. Vår auktorisation i Kompetensföretagen ger oss i sin tur medlemskap i Almega och Svenskt Näringsliv. \n\nDet är för oss av yttersta vikt att de personliga förutsättningarna stämmer överens mellan kund och kandidat, likväl som kompetensen. För att uppnå detta vill vi som arbetar på 2Complete skapa en så nära och personlig relation med kunder och kandidater som möjligt. Ett arbete efter dessa riktlinjer skapar förtroende och trygghet, värden som är självklara för en lyckad rekryteringsprocess. Vi rekryterar och bemannar under tjänstemannaavtalet såväl som arbetaravtalet, allt från juniora tjänster till chefer- och specialister.\n\n2Complete är auktoriserade medlemmar inom Kompetensföretagen, Almega samt Svenskt Näringsliv och har varit sedan 2011."
}