{
  "meta" : {
    "jobad" : {
      "description" : {
        "requirements" : null,
        "needs" : null,
        "company_information" : null,
        "text_formatted" : "<p>Heltid 100%</p><p>Tillsvidare-</p><p>Kock, à la carte</p><p>Köket på Lottas producerar dagligen egen färsk pasta, kokar egna fonder och marinerar och mörar sitt kött. Vi använder få eller inga halvfabrikat. Kort sagt, ett lite gammeldags köksideal!</p><p>Menyn är en mix mellan pubklassiker och \"fine dining\". Målsättningen är vettigt prissatt mat med förvånadsvärd kvalitet.</p><p>Köket är större än pubdelen - ca 250 kvadratmeter - med kapacitet att servera kring 450 matgäster per kväll, vilket inte är ovanligt under helgerna.</p><p>Vi söker dig om har ett brinnande intresse för matlagning och god service, gillar att jobba i team samt sätter gästen i fokus.</p><p>Erfarenhet är meriterande.</p><p>Vi hoppas att just du vill bli en del av vårat gäng här på Lottas Krog och ser fram emot att höra ifrån dig!</p>",
        "conditions" : null,
        "text" : "Heltid 100%\nTillsvidare-\nKock, à la carte\nKöket på Lottas producerar dagligen egen färsk pasta, kokar egna fonder och marinerar och mörar sitt kött. Vi använder få eller inga halvfabrikat. Kort sagt, ett lite gammeldags köksideal!\nMenyn är en mix mellan pubklassiker och \"fine dining\". Målsättningen är vettigt prissatt mat med förvånadsvärd kvalitet.\nKöket är större än pubdelen - ca 250 kvadratmeter - med kapacitet att servera kring 450 matgäster per kväll, vilket inte är ovanligt under helgerna.\nVi söker dig om har ett brinnande intresse för matlagning och god service, gillar att jobba i team samt sätter gästen i fokus.\nErfarenhet är meriterande.\nVi hoppas att just du vill bli en del av vårat gäng här på Lottas Krog och ser fram emot att höra ifrån dig!"
      },
      "headline" : "Kock, Lottas Krog, heltid 100%",
      "driving_license" : null,
      "employer" : {
        "email" : null,
        "phone_number" : null,
        "organization_number" : "5562983808",
        "name" : "Charlotta Företaget i Umeå AB",
        "url" : "www.lottas.nu",
        "workplace" : "Lottas Krog "
      },
      "removed_date" : null,
      "logo_url" : null,
      "last_publication_date" : "2022-09-08T23:59:59",
      "number_of_vacancies" : 1,
      "occupation" : {
        "concept_id" : "JbJw_as4_S93",
        "label" : "Kock, à la carte",
        "legacy_ams_taxonomy_id" : "7663"
      },
      "occupation_group" : {
        "concept_id" : "BStc_SJh_DKG",
        "label" : "Kockar och kallskänkor",
        "legacy_ams_taxonomy_id" : "5120"
      },
      "employment_type" : {
        "concept_id" : "PFZr_Syz_cUq",
        "label" : "Vanlig anställning",
        "legacy_ams_taxonomy_id" : "1"
      },
      "webpage_url" : "https://arbetsformedlingen.se/platsbanken/annonser/26390676",
      "driving_license_required" : false,
      "application_contacts" : [ {
        "description" : null,
        "email" : "carl.malmqvist@lottas.nu",
        "telephone" : "090129551",
        "name" : "Carl  Malmqvist",
        "contact_type" : "Chef"
      } ],
      "duration" : {
        "concept_id" : "a7uU_j21_mkL",
        "label" : "Tills vidare",
        "legacy_ams_taxonomy_id" : "1"
      },
      "nice_to_have" : {
        "education_level" : [ ],
        "work_experiences" : [ {
          "concept_id" : "JbJw_as4_S93",
          "weight" : 5,
          "label" : "Kock, à la carte",
          "legacy_ams_taxonomy_id" : "7663"
        } ],
        "skills" : [ ],
        "education" : [ ],
        "languages" : [ ]
      },
      "application_details" : {
        "via_af" : false,
        "email" : "Info@lottas.nu",
        "other" : null,
        "reference" : null,
        "url" : null,
        "information" : null
      },
      "source_type" : "VIA_ANNONSERA",
      "application_deadline" : "2022-09-08T23:59:59",
      "external_id" : null,
      "workplace_address" : {
        "coordinates" : [ 20.263466222848546, 63.827617477617096 ],
        "city" : "Umeå",
        "postcode" : "90327",
        "municipality" : "Umeå",
        "region_concept_id" : "g5Tt_CAV_zBd",
        "region" : "Västerbottens län",
        "country_code" : "199",
        "region_code" : "24",
        "municipality_concept_id" : "QiGt_BLu_amP",
        "country_concept_id" : "i46j_HmG_v64",
        "municipality_code" : "2480",
        "street_address" : "Nygatan 22",
        "country" : "Sverige"
      },
      "id" : "26390676",
      "experience_required" : true,
      "working_hours_type" : {
        "concept_id" : "6YE1_gAC_R2G",
        "label" : "Heltid",
        "legacy_ams_taxonomy_id" : "1"
      },
      "access" : null,
      "timestamp" : 1660036100292,
      "must_have" : {
        "education_level" : [ ],
        "work_experiences" : [ ],
        "skills" : [ ],
        "education" : [ ],
        "languages" : [ ]
      },
      "occupation_field" : {
        "concept_id" : "ScKy_FHB_7wT",
        "label" : "Hotell, restaurang, storhushåll",
        "legacy_ams_taxonomy_id" : "7"
      },
      "scope_of_work" : {
        "min" : 0,
        "max" : 100
      },
      "salary_type" : {
        "concept_id" : "oG8G_9cW_nRf",
        "label" : "Fast månads- vecko- eller timlön",
        "legacy_ams_taxonomy_id" : "1"
      },
      "removed" : false,
      "salary_description" : null,
      "access_to_own_car" : false,
      "publication_date" : "2022-08-09T11:08:20"
    },
    "name" : "Kock, Lottas Krog, heltid 100%",
    "user" : "hannes"
  },
  "sha1" : "17724b8be2a0d651cc5b6eb048ae621b5c3f72a3",
  "annotations" : [ {
    "preferred-label" : "kock",
    "sentiment" : "MUST_HAVE",
    "type" : "esco-occupation",
    "start-position" : 0,
    "end-position" : 4,
    "concept-id" : "Ti2H_QoQ_EMX",
    "matched-string" : "kock",
    "annotation-id" : 0
  }, {
    "preferred-label" : "Heltid",
    "type" : "worktime-extent",
    "start-position" : 19,
    "end-position" : 30,
    "concept-id" : "6YE1_gAC_R2G",
    "matched-string" : "heltid 100%",
    "annotation-id" : 2
  }, {
    "preferred-label" : "Heltid",
    "type" : "worktime-extent",
    "start-position" : 31,
    "end-position" : 42,
    "concept-id" : "6YE1_gAC_R2G",
    "matched-string" : "Heltid 100%",
    "annotation-id" : 3
  }, {
    "preferred-label" : "Tillsvidareanställning (inkl. eventuell provanställning)",
    "type" : "employment-type",
    "start-position" : 43,
    "end-position" : 54,
    "concept-id" : "kpPX_CNN_gDU",
    "matched-string" : "Tillsvidare",
    "annotation-id" : 4
  }, {
    "preferred-label" : "Kock, à la carte",
    "sentiment" : "MUST_HAVE",
    "type" : "occupation-name",
    "start-position" : 56,
    "end-position" : 72,
    "concept-id" : "JbJw_as4_S93",
    "matched-string" : "kock, à la carte",
    "annotation-id" : 1
  } ],
  "text" : "Kock, Lottas Krog, heltid 100%\nHeltid 100%\nTillsvidare-\nKock, à la carte\nKöket på Lottas producerar dagligen egen färsk pasta, kokar egna fonder och marinerar och mörar sitt kött. Vi använder få eller inga halvfabrikat. Kort sagt, ett lite gammeldags köksideal!\nMenyn är en mix mellan pubklassiker och \"fine dining\". Målsättningen är vettigt prissatt mat med förvånadsvärd kvalitet.\nKöket är större än pubdelen - ca 250 kvadratmeter - med kapacitet att servera kring 450 matgäster per kväll, vilket inte är ovanligt under helgerna.\nVi söker dig om har ett brinnande intresse för matlagning och god service, gillar att jobba i team samt sätter gästen i fokus.\nErfarenhet är meriterande.\nVi hoppas att just du vill bli en del av vårat gäng här på Lottas Krog och ser fram emot att höra ifrån dig!"
}