{
  "meta" : {
    "jobad" : {
      "description" : {
        "requirements" : null,
        "needs" : null,
        "company_information" : null,
        "text_formatted" : "Stockholm utvecklas och förändras för framtiden. Våra ambitioner är höga. Nu söker vi dig som vill vara med och forma morgondagens Stockholm.\n\n\r\n\r\nArbetsplatsbeskrivning\nKulturförvaltningen arbetar på uppdrag av kulturnämnden.\r\n\r\nVerksamheten omfattar Kulturskolan, Liljevalchs konsthall, Stadsbiblioteket samt Stadsmuseet med Medeltidsmuseet och stockholmsforskningen. Vi ansvarar också för stadens kultur- och integrationsstöd. Vi eftersträvar jämställdhet och mångfald och ser gärna sökanden med olika bakgrund och erfarenheter. \nStockholms stadsbibliotek består av ett 40-tal folkbibliotek. Därtill bedrivs biblioteksverksamhet på sjukhus, häkten, äldreboenden och träffpunkter och uppsökande biblioteksverksamhet i form av en bokbuss, pop up-bibliotek och annan mobil biblioteksverksamhet. Stockholms stadsbibliotek har ca 350 anställda. Vi förutsätter att du liksom vi sätter besökaren i centrum. Ditt uppdrag är att med fantasi och kunskap medverka till att forma ett bibliotek som är tillgängligt och angeläget för alla. Du kommer till ett stadsbibliotek i starkt utveckling och med goda utvecklingsmöjligheter för den enskilde medarbetaren.\nEnheten Enskede-Vantör-Årsta, Älvsjö är en del av Stockholms stadsbibliotek och består av biblioteken Högdalen, Enskede, Hagsätra, Årsta, Älvsjö, Örby och Östberga. Biblioteken verkar för och tillsammans med lokalsamhället. Dina huvudsakliga arbetsplatser är biblioteken i Högdalen och Örby.\n\n \n\nArbetsbeskrivning\nVi söker en bibliotekarie med fokus på våra vuxna målgrupper. Vi söker dig som är påhittig och kreativ med en utpräglad förmåga och vilja att samarbeta. Du är nyfiken och omvärldsorienterad och vill utveckla verksamhet och lära nytt. Du har erfarenhet av att arbeta med våra prioriterade målgrupper när det gäller såväl läsfrämjande aktiviteter, digital tillgänglighet och informationssökning. Du har arbetat med cirkulationsarbete, statistik och andra på bibliotek förekommande arbetsuppgifter. Du har förmåga att bidra till goda möten med bibliotekets alla besökare, såväl barn som vuxna och har ett serviceinriktat förhållningsätt när du arbetar i biblioteksrummet och informationsdisken. I denna tjänst ingår det att vara med och utveckla biblioteket i Örby för att också kunna inrymma fritidsaktiviteter för tonåringar.  \n\nKvalifikationer\nFör rollen krävs att du har minst kandidatexamen inom biblioteks- och informationsvetenskap eller annan utbildning som arbetsgivaren bedömer vara likvärdig. \nLitteraturintresse och kunskap om såväl fack- som skönlitteratur en självklarhet. Erfarenhet av att möta personer med svenska som andra språk eller med funktionsvariationer är meriterande. \n\n• Du ska ha kunskaper om metoder inom pedagogik, informations- och litteraturförmedling\n• Du ska ha god och bred litteraturkännedom.\n• Du ska ha god digital kompetens och förmåga att omsätta och förmedla den i kontakten med våra användare\n\nRollen som bibliotekarie inom Stockholms stadsbibliotek ställer krav på:\n• Ett kommunikativt och pedagogiskt förhållningssätt\n• Att du är självgående och har initiativförmåga\n• Att du är strukturerad och duktig på att samarbeta\n• Att du är serviceinriktad och har ett gott bemötande.\n\nVillkor\nTjänsten är ett vikariat på 75% under 12 månader.\n\nSchemalagd arbetstid inklusive kvälls- och helgtjänstgöring. \nKulturförvaltningen har friskvårdssubvention.\n\n\n\n\n\n\n\n\n\n\n\n\n\nStockholms stad arbetar med kompetensbaserad rekrytering som syftar till att se till varje persons kompetens och därmed motverka diskriminering.",
        "conditions" : "100%. Tillträde: Snarast\r\nVisstidsanställning till ",
        "text" : "Stockholm utvecklas och förändras för framtiden. Våra ambitioner är höga. Nu söker vi dig som vill vara med och forma morgondagens Stockholm.\n\n\r\n\r\nArbetsplatsbeskrivning\nKulturförvaltningen arbetar på uppdrag av kulturnämnden.\r\n\r\nVerksamheten omfattar Kulturskolan, Liljevalchs konsthall, Stadsbiblioteket samt Stadsmuseet med Medeltidsmuseet och stockholmsforskningen. Vi ansvarar också för stadens kultur- och integrationsstöd. Vi eftersträvar jämställdhet och mångfald och ser gärna sökanden med olika bakgrund och erfarenheter. \nStockholms stadsbibliotek består av ett 40-tal folkbibliotek. Därtill bedrivs biblioteksverksamhet på sjukhus, häkten, äldreboenden och träffpunkter och uppsökande biblioteksverksamhet i form av en bokbuss, pop up-bibliotek och annan mobil biblioteksverksamhet. Stockholms stadsbibliotek har ca 350 anställda. Vi förutsätter att du liksom vi sätter besökaren i centrum. Ditt uppdrag är att med fantasi och kunskap medverka till att forma ett bibliotek som är tillgängligt och angeläget för alla. Du kommer till ett stadsbibliotek i starkt utveckling och med goda utvecklingsmöjligheter för den enskilde medarbetaren.\nEnheten Enskede-Vantör-Årsta, Älvsjö är en del av Stockholms stadsbibliotek och består av biblioteken Högdalen, Enskede, Hagsätra, Årsta, Älvsjö, Örby och Östberga. Biblioteken verkar för och tillsammans med lokalsamhället. Dina huvudsakliga arbetsplatser är biblioteken i Högdalen och Örby.\n\n \n\nArbetsbeskrivning\nVi söker en bibliotekarie med fokus på våra vuxna målgrupper. Vi söker dig som är påhittig och kreativ med en utpräglad förmåga och vilja att samarbeta. Du är nyfiken och omvärldsorienterad och vill utveckla verksamhet och lära nytt. Du har erfarenhet av att arbeta med våra prioriterade målgrupper när det gäller såväl läsfrämjande aktiviteter, digital tillgänglighet och informationssökning. Du har arbetat med cirkulationsarbete, statistik och andra på bibliotek förekommande arbetsuppgifter. Du har förmåga att bidra till goda möten med bibliotekets alla besökare, såväl barn som vuxna och har ett serviceinriktat förhållningsätt när du arbetar i biblioteksrummet och informationsdisken. I denna tjänst ingår det att vara med och utveckla biblioteket i Örby för att också kunna inrymma fritidsaktiviteter för tonåringar.  \n\nKvalifikationer\nFör rollen krävs att du har minst kandidatexamen inom biblioteks- och informationsvetenskap eller annan utbildning som arbetsgivaren bedömer vara likvärdig. \nLitteraturintresse och kunskap om såväl fack- som skönlitteratur en självklarhet. Erfarenhet av att möta personer med svenska som andra språk eller med funktionsvariationer är meriterande. \n\n• Du ska ha kunskaper om metoder inom pedagogik, informations- och litteraturförmedling\n• Du ska ha god och bred litteraturkännedom.\n• Du ska ha god digital kompetens och förmåga att omsätta och förmedla den i kontakten med våra användare\n\nRollen som bibliotekarie inom Stockholms stadsbibliotek ställer krav på:\n• Ett kommunikativt och pedagogiskt förhållningssätt\n• Att du är självgående och har initiativförmåga\n• Att du är strukturerad och duktig på att samarbeta\n• Att du är serviceinriktad och har ett gott bemötande.\n\nVillkor\nTjänsten är ett vikariat på 75% under 12 månader.\n\nSchemalagd arbetstid inklusive kvälls- och helgtjänstgöring. \nKulturförvaltningen har friskvårdssubvention.\n\n\n\n\n\n\n\n\n\n\n\n\n\nStockholms stad arbetar med kompetensbaserad rekrytering som syftar till att se till varje persons kompetens och därmed motverka diskriminering."
      },
      "headline" : "Vikarierande bibliotekarie Högdalen och Örby 75%",
      "driving_license" : null,
      "employer" : {
        "email" : null,
        "phone_number" : null,
        "organization_number" : "2120000142",
        "name" : "Stockholms kommun",
        "url" : null,
        "workplace" : "Kulturförvaltningen, SSB, Enskede-Årsta-Vantör, Älvsjö"
      },
      "removed_date" : null,
      "logo_url" : "https://www.arbetsformedlingen.se/rest/arbetsgivare/rest/af/v3/organisation/2120000142/logotyper/logo.png",
      "last_publication_date" : "2022-08-21T23:59:59",
      "number_of_vacancies" : 1,
      "occupation" : {
        "concept_id" : "GujS_MtW_PRH",
        "label" : "Bibliotekarie",
        "legacy_ams_taxonomy_id" : "5899"
      },
      "occupation_group" : {
        "concept_id" : "wVfo_Njx_1rB",
        "label" : "Bibliotekarier och arkivarier",
        "legacy_ams_taxonomy_id" : "2622"
      },
      "employment_type" : {
        "concept_id" : "PFZr_Syz_cUq",
        "label" : "Vanlig anställning",
        "legacy_ams_taxonomy_id" : "1"
      },
      "webpage_url" : "https://arbetsformedlingen.se/platsbanken/annonser/26375468",
      "driving_license_required" : false,
      "application_contacts" : [ {
        "description" : "Anna Ulfstrand",
        "email" : null,
        "telephone" : "0850830767",
        "name" : null,
        "contact_type" : null
      } ],
      "duration" : {
        "concept_id" : "qQUd_4qe_NDT",
        "label" : "6 månader eller längre",
        "legacy_ams_taxonomy_id" : "2"
      },
      "nice_to_have" : {
        "education_level" : [ ],
        "work_experiences" : [ ],
        "skills" : [ ],
        "education" : [ ],
        "languages" : [ ]
      },
      "application_details" : {
        "via_af" : false,
        "email" : null,
        "other" : null,
        "reference" : "2022/5289",
        "url" : "https://stockholmsstad.varbi.com/what:job/jobID:531756/type:job/where:1/apply:1",
        "information" : null
      },
      "source_type" : "VIA_PLATSBANKEN_DXA",
      "application_deadline" : "2022-08-21T23:59:59",
      "external_id" : "46-212000-0142-531756",
      "workplace_address" : {
        "coordinates" : [ 18.06858, 59.329323 ],
        "city" : null,
        "postcode" : null,
        "municipality" : "Stockholm",
        "region_concept_id" : "CifL_Rzy_Mku",
        "region" : "Stockholms län",
        "country_code" : "199",
        "region_code" : "01",
        "municipality_concept_id" : "AvNB_uwa_6n6",
        "country_concept_id" : "i46j_HmG_v64",
        "municipality_code" : "0180",
        "street_address" : null,
        "country" : "Sverige"
      },
      "id" : "26375468",
      "experience_required" : true,
      "working_hours_type" : {
        "concept_id" : "947z_JGS_Uk2",
        "label" : "Deltid",
        "legacy_ams_taxonomy_id" : "2"
      },
      "access" : null,
      "timestamp" : 1659531164190,
      "must_have" : {
        "education_level" : [ ],
        "work_experiences" : [ {
          "concept_id" : "GujS_MtW_PRH",
          "weight" : 10,
          "label" : "Bibliotekarie",
          "legacy_ams_taxonomy_id" : "5899"
        } ],
        "skills" : [ ],
        "education" : [ ],
        "languages" : [ ]
      },
      "occupation_field" : {
        "concept_id" : "9puE_nYg_crq",
        "label" : "Kultur, media, design",
        "legacy_ams_taxonomy_id" : "11"
      },
      "scope_of_work" : {
        "min" : 0,
        "max" : 100
      },
      "salary_type" : {
        "concept_id" : "oG8G_9cW_nRf",
        "label" : "Fast månads- vecko- eller timlön",
        "legacy_ams_taxonomy_id" : "1"
      },
      "removed" : false,
      "salary_description" : "Snarast",
      "access_to_own_car" : false,
      "publication_date" : "2022-08-03T14:52:44"
    },
    "name" : "Vikarierande bibliotekarie Högdalen och Örby 75%",
    "user" : "hannes"
  },
  "sha1" : "7c9f0e4b6fdf6d3d4c891de3b6c69c4ee9c61fd0",
  "annotations" : [ {
    "preferred-label" : "Vikariat",
    "type" : "employment-type",
    "start-position" : 0,
    "end-position" : 12,
    "concept-id" : "gro4_cWF_6D7",
    "matched-string" : "Vikarierande",
    "annotation-id" : 13
  }, {
    "preferred-label" : "bibliotekarie",
    "sentiment" : "MUST_HAVE",
    "type" : "esco-occupation",
    "start-position" : 13,
    "end-position" : 26,
    "concept-id" : "UzDm_fz2_Bnp",
    "matched-string" : "bibliotekarie",
    "annotation-id" : 0
  }, {
    "preferred-label" : "Deltid",
    "type" : "worktime-extent",
    "start-position" : 45,
    "end-position" : 48,
    "concept-id" : "947z_JGS_Uk2",
    "matched-string" : "75%",
    "annotation-id" : 14
  }, {
    "preferred-label" : "Stockholm",
    "type" : "municipality",
    "start-position" : 49,
    "end-position" : 58,
    "concept-id" : "AvNB_uwa_6n6",
    "matched-string" : "Stockholm",
    "annotation-id" : 15
  }, {
    "preferred-label" : "Stockholm",
    "type" : "municipality",
    "start-position" : 180,
    "end-position" : 189,
    "concept-id" : "AvNB_uwa_6n6",
    "matched-string" : "Stockholm",
    "annotation-id" : 16
  }, {
    "preferred-label" : "Jämställdhet",
    "sentiment" : "MUST_HAVE",
    "type" : "keyword",
    "start-position" : 495,
    "end-position" : 507,
    "concept-id" : "WgGj_zNt_Pzz",
    "matched-string" : "jämställdhet",
    "annotation-id" : 1
  }, {
    "preferred-label" : "Biblioteksverksamhet",
    "sentiment" : "MUST_HAVE",
    "type" : "sni-level-5",
    "start-position" : 660,
    "end-position" : 680,
    "concept-id" : "g8r7_YEp_eSp",
    "matched-string" : "biblioteksverksamhet",
    "annotation-id" : 2
  }, {
    "preferred-label" : "Biblioteksverksamhet",
    "sentiment" : "MUST_HAVE",
    "type" : "sni-level-5",
    "start-position" : 746,
    "end-position" : 766,
    "concept-id" : "g8r7_YEp_eSp",
    "matched-string" : "biblioteksverksamhet",
    "annotation-id" : 3
  }, {
    "preferred-label" : "Biblioteksverksamhet",
    "sentiment" : "MUST_HAVE",
    "type" : "sni-level-5",
    "start-position" : 822,
    "end-position" : 842,
    "concept-id" : "g8r7_YEp_eSp",
    "matched-string" : "biblioteksverksamhet",
    "annotation-id" : 4
  }, {
    "preferred-label" : "bibliotekarie",
    "sentiment" : "MUST_HAVE",
    "type" : "esco-occupation",
    "start-position" : 1525,
    "end-position" : 1538,
    "concept-id" : "UzDm_fz2_Bnp",
    "matched-string" : "bibliotekarie",
    "annotation-id" : 5
  }, {
    "preferred-label" : "visa nyfikenhet",
    "type" : "esco-skill",
    "start-position" : 1672,
    "end-position" : 1679,
    "concept-id" : "mbHa_NFf_vyf",
    "matched-string" : "nyfiken",
    "annotation-id" : 17
  }, {
    "preferred-label" : "Statistik",
    "sentiment" : "MUST_HAVE",
    "type" : "sun-education-field-3",
    "start-position" : 1946,
    "end-position" : 1955,
    "concept-id" : "VDZC_YeP_k1P",
    "matched-string" : "statistik",
    "annotation-id" : 6
  }, {
    "preferred-label" : "Biblioteksverksamhet",
    "type" : "sni-level-5",
    "start-position" : 1969,
    "end-position" : 1978,
    "concept-id" : "g8r7_YEp_eSp",
    "matched-string" : "bibliotek",
    "annotation-id" : 18
  }, {
    "preferred-label" : "Biblioteksverksamhet",
    "type" : "sni-level-5",
    "start-position" : 2054,
    "end-position" : 2066,
    "concept-id" : "g8r7_YEp_eSp",
    "matched-string" : "bibliotekets",
    "annotation-id" : 19
  }, {
    "preferred-label" : "Biblioteks- och informationsvetenskap",
    "sentiment" : "MUST_HAVE",
    "type" : "keyword",
    "start-position" : 2411,
    "end-position" : 2448,
    "concept-id" : "uFcK_S16_nyU",
    "matched-string" : "biblioteks- och informationsvetenskap",
    "annotation-id" : 7
  }, {
    "preferred-label" : "Skönlitteratur",
    "sentiment" : "MUST_HAVE",
    "type" : "skill",
    "start-position" : 2565,
    "end-position" : 2579,
    "concept-id" : "zPdv_znE_aka",
    "matched-string" : "skönlitteratur",
    "annotation-id" : 8
  }, {
    "preferred-label" : "Svenska som andra språk",
    "sentiment" : "MUST_HAVE",
    "type" : "keyword",
    "start-position" : 2633,
    "end-position" : 2656,
    "concept-id" : "5pFN_svy_wiR",
    "matched-string" : "svenska som andra språk",
    "annotation-id" : 9
  }, {
    "preferred-label" : "Pedagogik",
    "sentiment" : "MUST_HAVE",
    "type" : "sun-education-field-4",
    "start-position" : 2744,
    "end-position" : 2753,
    "concept-id" : "zzEU_5xS_cJw",
    "matched-string" : "pedagogik",
    "annotation-id" : 10
  }, {
    "preferred-label" : "bibliotekarie",
    "sentiment" : "MUST_HAVE",
    "type" : "esco-occupation",
    "start-position" : 2957,
    "end-position" : 2970,
    "concept-id" : "UzDm_fz2_Bnp",
    "matched-string" : "bibliotekarie",
    "annotation-id" : 11
  }, {
    "preferred-label" : "Pedagogiskt förhållningssätt",
    "sentiment" : "MUST_HAVE",
    "type" : "skill",
    "start-position" : 3043,
    "end-position" : 3071,
    "concept-id" : "qMfa_U8e_Lto",
    "matched-string" : "pedagogiskt förhållningssätt",
    "annotation-id" : 12
  }, {
    "preferred-label" : "Vikariat",
    "type" : "employment-type",
    "start-position" : 3255,
    "end-position" : 3263,
    "concept-id" : "gro4_cWF_6D7",
    "matched-string" : "vikariat",
    "annotation-id" : 20
  }, {
    "preferred-label" : "Deltid",
    "type" : "worktime-extent",
    "start-position" : 3267,
    "end-position" : 3270,
    "concept-id" : "947z_JGS_Uk2",
    "matched-string" : "75%",
    "annotation-id" : 21
  }, {
    "preferred-label" : "Stockholm",
    "type" : "municipality",
    "start-position" : 3411,
    "end-position" : 3426,
    "concept-id" : "AvNB_uwa_6n6",
    "matched-string" : "Stockholms stad",
    "annotation-id" : 22
  } ],
  "text" : "Vikarierande bibliotekarie Högdalen och Örby 75%\nStockholm utvecklas och förändras för framtiden. Våra ambitioner är höga. Nu söker vi dig som vill vara med och forma morgondagens Stockholm.\n\n\r\n\r\nArbetsplatsbeskrivning\nKulturförvaltningen arbetar på uppdrag av kulturnämnden.\r\n\r\nVerksamheten omfattar Kulturskolan, Liljevalchs konsthall, Stadsbiblioteket samt Stadsmuseet med Medeltidsmuseet och stockholmsforskningen. Vi ansvarar också för stadens kultur- och integrationsstöd. Vi eftersträvar jämställdhet och mångfald och ser gärna sökanden med olika bakgrund och erfarenheter. \nStockholms stadsbibliotek består av ett 40-tal folkbibliotek. Därtill bedrivs biblioteksverksamhet på sjukhus, häkten, äldreboenden och träffpunkter och uppsökande biblioteksverksamhet i form av en bokbuss, pop up-bibliotek och annan mobil biblioteksverksamhet. Stockholms stadsbibliotek har ca 350 anställda. Vi förutsätter att du liksom vi sätter besökaren i centrum. Ditt uppdrag är att med fantasi och kunskap medverka till att forma ett bibliotek som är tillgängligt och angeläget för alla. Du kommer till ett stadsbibliotek i starkt utveckling och med goda utvecklingsmöjligheter för den enskilde medarbetaren.\nEnheten Enskede-Vantör-Årsta, Älvsjö är en del av Stockholms stadsbibliotek och består av biblioteken Högdalen, Enskede, Hagsätra, Årsta, Älvsjö, Örby och Östberga. Biblioteken verkar för och tillsammans med lokalsamhället. Dina huvudsakliga arbetsplatser är biblioteken i Högdalen och Örby.\n\n \n\nArbetsbeskrivning\nVi söker en bibliotekarie med fokus på våra vuxna målgrupper. Vi söker dig som är påhittig och kreativ med en utpräglad förmåga och vilja att samarbeta. Du är nyfiken och omvärldsorienterad och vill utveckla verksamhet och lära nytt. Du har erfarenhet av att arbeta med våra prioriterade målgrupper när det gäller såväl läsfrämjande aktiviteter, digital tillgänglighet och informationssökning. Du har arbetat med cirkulationsarbete, statistik och andra på bibliotek förekommande arbetsuppgifter. Du har förmåga att bidra till goda möten med bibliotekets alla besökare, såväl barn som vuxna och har ett serviceinriktat förhållningsätt när du arbetar i biblioteksrummet och informationsdisken. I denna tjänst ingår det att vara med och utveckla biblioteket i Örby för att också kunna inrymma fritidsaktiviteter för tonåringar.  \n\nKvalifikationer\nFör rollen krävs att du har minst kandidatexamen inom biblioteks- och informationsvetenskap eller annan utbildning som arbetsgivaren bedömer vara likvärdig. \nLitteraturintresse och kunskap om såväl fack- som skönlitteratur en självklarhet. Erfarenhet av att möta personer med svenska som andra språk eller med funktionsvariationer är meriterande. \n\n• Du ska ha kunskaper om metoder inom pedagogik, informations- och litteraturförmedling\n• Du ska ha god och bred litteraturkännedom.\n• Du ska ha god digital kompetens och förmåga att omsätta och förmedla den i kontakten med våra användare\n\nRollen som bibliotekarie inom Stockholms stadsbibliotek ställer krav på:\n• Ett kommunikativt och pedagogiskt förhållningssätt\n• Att du är självgående och har initiativförmåga\n• Att du är strukturerad och duktig på att samarbeta\n• Att du är serviceinriktad och har ett gott bemötande.\n\nVillkor\nTjänsten är ett vikariat på 75% under 12 månader.\n\nSchemalagd arbetstid inklusive kvälls- och helgtjänstgöring. \nKulturförvaltningen har friskvårdssubvention.\n\n\n\n\n\n\n\n\n\n\n\n\n\nStockholms stad arbetar med kompetensbaserad rekrytering som syftar till att se till varje persons kompetens och därmed motverka diskriminering."
}