{
  "meta" : {
    "jobad" : {
      "description" : {
        "requirements" : null,
        "needs" : null,
        "company_information" : null,
        "text_formatted" : "<p>Är du fotointresserad?</p><p>Exakta Photo är Sveriges största skolfotoleverantör med mer än 60 års erfarenhet och vi söker nu fler fotografer till vår fotografkår. Vi finns över hela landet och fotografera ca 900 000 elever varje år.</p><p>Vi söker personer med genuint fotointresse som tycker om att jobba med barn och ungdomar. Du kanske redan är fotograf men viktigast är att du tycker om att arbeta med ungdomar och har ett intresse för foto med ett estetiskt sinne för bild och form. Ordning och reda är viktigt, bra social kompentens, stort tålamod och en förmåga att ta ansvar. Erfarenhet från barn- och ungdomsverksamhet är en stor merit.</p><p>Du kommer att få tillgång till en digital fotoutrustning vilket kräver datorvana och vi erbjuder en professionell fotoutbildning med en online kurs samt utbildning på plats innan skolstart i augusti.</p><p>Tjänsten kräver att du har körkort samt tillgång till bil.</p><p>Arbetsperiod i första hand augusti till oktober/november med möjlighet till förlängning.</p><p>Tidigare branscherfarenhet inom foto/skolfoto är inget krav men är självklart en merit.</p><p>Vi ser gärna ett samarbete med redan etablerade fotografer.</p><p>Passa på att söka till vår fotografkår och berätta lite om dig själv samt bifoga ditt CV med några bilder(eller länk).</p><p>Vi rekryterar fortlöpande under våren. </p><p>Välkommen med din ansökan!</p>",
        "conditions" : null,
        "text" : "Är du fotointresserad?\nExakta Photo är Sveriges största skolfotoleverantör med mer än 60 års erfarenhet och vi söker nu fler fotografer till vår fotografkår. Vi finns över hela landet och fotografera ca 900 000 elever varje år.\nVi söker personer med genuint fotointresse som tycker om att jobba med barn och ungdomar. Du kanske redan är fotograf men viktigast är att du tycker om att arbeta med ungdomar och har ett intresse för foto med ett estetiskt sinne för bild och form. Ordning och reda är viktigt, bra social kompentens, stort tålamod och en förmåga att ta ansvar. Erfarenhet från barn- och ungdomsverksamhet är en stor merit.\nDu kommer att få tillgång till en digital fotoutrustning vilket kräver datorvana och vi erbjuder en professionell fotoutbildning med en online kurs samt utbildning på plats innan skolstart i augusti.\nTjänsten kräver att du har körkort samt tillgång till bil.\nArbetsperiod i första hand augusti till oktober/november med möjlighet till förlängning.\nTidigare branscherfarenhet inom foto/skolfoto är inget krav men är självklart en merit.\nVi ser gärna ett samarbete med redan etablerade fotografer.\nPassa på att söka till vår fotografkår och berätta lite om dig själv samt bifoga ditt CV med några bilder(eller länk).\nVi rekryterar fortlöpande under våren. \nVälkommen med din ansökan!"
      },
      "headline" : "Nu söker vi fler fotografer i Lerum till vår Fotografkår!",
      "driving_license" : [ {
        "concept_id" : "VTK8_WRx_GcM",
        "label" : "B",
        "legacy_ams_taxonomy_id" : "3"
      } ],
      "employer" : {
        "email" : null,
        "phone_number" : null,
        "organization_number" : "5592593866",
        "name" : "Exakta Photo AB",
        "url" : null,
        "workplace" : "Exakta Photo AB"
      },
      "removed_date" : null,
      "logo_url" : "https://www.arbetsformedlingen.se/rest/arbetsgivare/rest/af/v3/arbetsplatser/88076683/logotyper/logo.png",
      "last_publication_date" : "2022-07-23T23:59:59",
      "number_of_vacancies" : 1,
      "occupation" : {
        "concept_id" : "1N2U_6xW_Tdx",
        "label" : "Fotograf",
        "legacy_ams_taxonomy_id" : "4790"
      },
      "occupation_group" : {
        "concept_id" : "3J38_DNz_YKK",
        "label" : "Fotografer",
        "legacy_ams_taxonomy_id" : "3431"
      },
      "employment_type" : {
        "concept_id" : "PFZr_Syz_cUq",
        "label" : "Vanlig anställning",
        "legacy_ams_taxonomy_id" : "1"
      },
      "webpage_url" : "https://arbetsformedlingen.se/platsbanken/annonser/26252837",
      "driving_license_required" : true,
      "application_contacts" : [ {
        "description" : null,
        "email" : null,
        "telephone" : "0705649021",
        "name" : "Torgny Karlsson",
        "contact_type" : "Fotoansvarig"
      } ],
      "duration" : {
        "concept_id" : "Sy9J_aRd_ALx",
        "label" : "11 dagar - upp till 3 månader",
        "legacy_ams_taxonomy_id" : "7"
      },
      "nice_to_have" : {
        "education_level" : [ ],
        "work_experiences" : [ {
          "concept_id" : "1N2U_6xW_Tdx",
          "weight" : 5,
          "label" : "Fotograf",
          "legacy_ams_taxonomy_id" : "4790"
        } ],
        "skills" : [ {
          "concept_id" : "UdXV_fqG_jWu",
          "weight" : 5,
          "label" : "Fotografering, digitalkamera",
          "legacy_ams_taxonomy_id" : "606876"
        }, {
          "concept_id" : "2gv8_SfE_iXr",
          "weight" : 5,
          "label" : "Ateljéfotografering/Studiofotografering",
          "legacy_ams_taxonomy_id" : "608046"
        }, {
          "concept_id" : "AuHz_M2K_yZW",
          "weight" : 5,
          "label" : "Barnjournalistik/Ungdomsjournalistik",
          "legacy_ams_taxonomy_id" : "607805"
        }, {
          "concept_id" : "HUBG_Mz2_X1G",
          "weight" : 5,
          "label" : "Estetiska programmet, undervisning",
          "legacy_ams_taxonomy_id" : "605815"
        } ],
        "education" : [ ],
        "languages" : [ ]
      },
      "application_details" : {
        "via_af" : false,
        "email" : null,
        "other" : null,
        "reference" : "Skolfotograf 2022",
        "url" : "https://jobb.exaktafoto.se/",
        "information" : null
      },
      "source_type" : "VIA_ANNONSERA",
      "application_deadline" : "2022-07-23T23:59:59",
      "external_id" : null,
      "workplace_address" : {
        "coordinates" : [ null, null ],
        "city" : null,
        "postcode" : null,
        "municipality" : "Lerum",
        "region_concept_id" : "zdoY_6u5_Krt",
        "region" : "Västra Götalands län",
        "country_code" : "199",
        "region_code" : "14",
        "municipality_concept_id" : "yHV7_2Y6_zQx",
        "country_concept_id" : "i46j_HmG_v64",
        "municipality_code" : "1441",
        "street_address" : null,
        "country" : "Sverige"
      },
      "id" : "26252837",
      "experience_required" : true,
      "working_hours_type" : {
        "concept_id" : "6YE1_gAC_R2G",
        "label" : "Heltid",
        "legacy_ams_taxonomy_id" : "1"
      },
      "access" : null,
      "timestamp" : 1655972666061,
      "must_have" : {
        "education_level" : [ ],
        "work_experiences" : [ ],
        "skills" : [ ],
        "education" : [ ],
        "languages" : [ ]
      },
      "occupation_field" : {
        "concept_id" : "9puE_nYg_crq",
        "label" : "Kultur, media, design",
        "legacy_ams_taxonomy_id" : "11"
      },
      "scope_of_work" : {
        "min" : 0,
        "max" : 100
      },
      "salary_type" : {
        "concept_id" : "oG8G_9cW_nRf",
        "label" : "Fast månads- vecko- eller timlön",
        "legacy_ams_taxonomy_id" : "1"
      },
      "removed" : false,
      "salary_description" : null,
      "access_to_own_car" : true,
      "publication_date" : "2022-06-23T10:24:26"
    },
    "name" : "Nu söker vi fler fotografer i Lerum till vår Fotografkår!",
    "user" : "fischer.kristof"
  },
  "sha1" : "62a36f8dd5b62a89851f3f7cfc47a409520effa2",
  "annotations" : [ {
    "preferred-label" : "Fotograf",
    "type" : "occupation-name",
    "start-position" : 17,
    "end-position" : 27,
    "concept-id" : "1N2U_6xW_Tdx",
    "matched-string" : "fotografer",
    "annotation-id" : 6
  }, {
    "preferred-label" : "Fotograf",
    "type" : "occupation-name",
    "start-position" : 183,
    "end-position" : 193,
    "concept-id" : "1N2U_6xW_Tdx",
    "matched-string" : "fotografer",
    "annotation-id" : 7
  }, {
    "preferred-label" : "fotograf",
    "sentiment" : "MUST_HAVE",
    "type" : "esco-occupation",
    "start-position" : 395,
    "end-position" : 403,
    "concept-id" : "X1AG_Jya_y93",
    "matched-string" : "fotograf",
    "annotation-id" : 2
  }, {
    "preferred-label" : "Ungdomsverksamhet",
    "sentiment" : "MUST_HAVE",
    "type" : "skill",
    "start-position" : 657,
    "end-position" : 674,
    "concept-id" : "kb9z_LG1_CZE",
    "matched-string" : "ungdomsverksamhet",
    "annotation-id" : 3
  }, {
    "preferred-label" : "använda dator",
    "sentiment" : "MUST_HAVE",
    "type" : "esco-skill",
    "start-position" : 764,
    "end-position" : 773,
    "concept-id" : "HEbR_xrb_MpT",
    "matched-string" : "datorvana",
    "annotation-id" : 8
  }, {
    "preferred-label" : "Fotografering",
    "sentiment" : "OFFERED",
    "type" : "skill",
    "start-position" : 807,
    "comment" : "fotoutbildning finns bara som keyword",
    "end-position" : 821,
    "concept-id" : "zpaf_mDu_foK",
    "matched-string" : "fotoutbildning",
    "annotation-id" : 9
  }, {
    "preferred-label" : "B",
    "sentiment" : "MUST_HAVE",
    "type" : "driving-licence",
    "start-position" : 920,
    "end-position" : 927,
    "concept-id" : "VTK8_WRx_GcM",
    "matched-string" : "körkort",
    "annotation-id" : 10
  }, {
    "preferred-label" : "Fotografering",
    "sentiment" : "NICE_TO_HAVE",
    "type" : "skill",
    "start-position" : 1073,
    "end-position" : 1077,
    "concept-id" : "zpaf_mDu_foK",
    "matched-string" : "foto",
    "annotation-id" : 11
  }, {
    "preferred-label" : "Skolfotografering",
    "sentiment" : "NICE_TO_HAVE",
    "type" : "skill",
    "start-position" : 1078,
    "end-position" : 1086,
    "concept-id" : "c9dk_AKz_1Db",
    "matched-string" : "skolfoto",
    "annotation-id" : 12
  }, {
    "preferred-label" : "samarbeta med kolleger",
    "sentiment" : "MUST_HAVE",
    "type" : "esco-skill",
    "start-position" : 1146,
    "end-position" : 1155,
    "concept-id" : "X15R_797_q62",
    "matched-string" : "samarbete",
    "annotation-id" : 13
  }, {
    "preferred-label" : "Fotograf",
    "type" : "occupation-name",
    "start-position" : 1177,
    "end-position" : 1187,
    "concept-id" : "1N2U_6xW_Tdx",
    "matched-string" : "fotografer",
    "annotation-id" : 14
  } ],
  "text" : "Nu söker vi fler fotografer i Lerum till vår Fotografkår!\nÄr du fotointresserad?\nExakta Photo är Sveriges största skolfotoleverantör med mer än 60 års erfarenhet och vi söker nu fler fotografer till vår fotografkår. Vi finns över hela landet och fotografera ca 900 000 elever varje år.\nVi söker personer med genuint fotointresse som tycker om att jobba med barn och ungdomar. Du kanske redan är fotograf men viktigast är att du tycker om att arbeta med ungdomar och har ett intresse för foto med ett estetiskt sinne för bild och form. Ordning och reda är viktigt, bra social kompentens, stort tålamod och en förmåga att ta ansvar. Erfarenhet från barn- och ungdomsverksamhet är en stor merit.\nDu kommer att få tillgång till en digital fotoutrustning vilket kräver datorvana och vi erbjuder en professionell fotoutbildning med en online kurs samt utbildning på plats innan skolstart i augusti.\nTjänsten kräver att du har körkort samt tillgång till bil.\nArbetsperiod i första hand augusti till oktober/november med möjlighet till förlängning.\nTidigare branscherfarenhet inom foto/skolfoto är inget krav men är självklart en merit.\nVi ser gärna ett samarbete med redan etablerade fotografer.\nPassa på att söka till vår fotografkår och berätta lite om dig själv samt bifoga ditt CV med några bilder(eller länk).\nVi rekryterar fortlöpande under våren. \nVälkommen med din ansökan!"
}