{
  "meta" : {
    "jobad" : {
      "description" : {
        "requirements" : null,
        "needs" : null,
        "company_information" : null,
        "text_formatted" : "Verksamhetsområde kirurgi \r\n\r\nVi är Akademiska sjukhuset – ett av Sveriges ledande universitetssjukhus. Förutom rollen som länssjukhus är vi leverantör av högspecialiserad vård och betjänar två miljoner människor i Mellansverige. Hos oss pågår det något hela tiden – ett nytt liv ser dagens ljus, en mormor opereras, en kollega hyllas som livets hjälte. Vi tror att ärlighet varar längst och det är ingen hemlighet att vi behöver bli fler. Som kollega till oss får du vara med om mycket. Hårda prövningar men också fantastiska händelser, stark gemenskap och stöttning från kollegor och medmänniskor. För att se delar ur vår verklighet, besök vår fotoutställning på akademiskafotoutstallning.se.\n\nVälkommen med din ansökan och bli en del av oss.\r\n\r\nVår verksamhet\nVi har ca 400 anställda fördelade på mottagningar, vårdavdelningar och medicinska sektioner inom verksamhetsområde kirurgi. En stor del av vården består av riks- och regionpatienter som remitterats för högspecialiserad utredning och behandling.  \n\nKirurgavdelning 70D \nAvdelning 70D är en kirurgisk avdelning med inriktning på akut- och traumakirurgi, kolorektalkirurgi och endokrinkirurgi. På avdelningen vårdar vi patienter med akuta kirurgiska tillstånd samt patienter som genomgår planerad kolorektal- eller endokrinkirurgi. Inom akut-och traumakirurgi behandlar och opererar vi patienter med akuta sjukdomar i buken såsom gallbesvär, blindtarmsinflammation, bukspottkörtelinflammation, magsår och tarmvred. Vi tar även hand om patienter som har varit med om olika typer av trauman. Inom kolorektalkirurgi behandlar och opererar vi patienter med tumörer i tjock-eller ändtarm, inflammatoriska tarmsjukdomar och funktionella tarmrubbningar. Vi vårdar och opererar även HIPEC-patienter från hela landet. Inom endokrinkirurgi behandlar och opererar vi patienter med sjukdomar i endokrina organ så som sköldkörtel, binjurar och neuroendokrina tumörer.\n\nDitt uppdrag\nSom undersköterska ansvarar du bland annat för patientens basala omvårdnad, pre- och postoperativ vård, såromläggningar, stomivård, kateter- och dränagevård, blodprovstagning och kontroller av vitala parametrar. Vi arbetar i team med patienten i centrum\n\nDina kvalifikationer\nVi söker dig som är utbildad undersköterska med erfarenhet av sjukhusvård. Vi söker både dig som vill arbeta dag, kväll och helg. Tjänsten innefattar även nattrotation på sikt.\n\nDin kompetens\nVi värdesätter egenskaper som nyfikenhet, engagemang, vilja att lära sig nya saker, samarbetsförmåga, ett positivt förhållningssätt samt flexibilitet. Stor vikt läggs på personlig lämplighet. \n\nVi erbjuder\nVi erbjuder ett vikariat på heltid i 6 månader med möjlighet till förlängning. Lön och tillträde enligt överenskommelse. \n\nHos oss får du förmåner som gör skillnad, läs om förmånerna här (https://regionuppsala.se/jobba-hos-oss/bli-var-nya-kollega/formaner/).\n\nVill du veta mer?\nMalin Hållinder, avdelningschef: 018-611 29 77 \nEmmy Ekblad, biträdande avdelningschef: 018–617 53 55\nFacklig kontaktperson för kommunal nås via växeln: 018-611 00 00\n\nVill du jobba med oss?\nVälkommen med din ansökan via länken nedan. Urval och intervjuer kan komma att ske löpande så vänta inte med din ansökan.\n\nRegion Uppsala värdesätter de kvaliteter som jämn könsfördelning och mångfald tillför verksamheten. Vi ser därför gärna sökande av alla kön och med olika födelsebakgrund, funktionalitet och livserfarenhet.\n\nDenna rekrytering sker helt genom Region Uppsalas försorg. Vi undanber oss därför telefonsamtal från rekryteringsföretag och annonsförsäljare.",
        "conditions" : "Tidsbegränsad, 100%, Tillträde enligt ö.k till 6 mån\r\n\n-",
        "text" : "Verksamhetsområde kirurgi \r\n\r\nVi är Akademiska sjukhuset – ett av Sveriges ledande universitetssjukhus. Förutom rollen som länssjukhus är vi leverantör av högspecialiserad vård och betjänar två miljoner människor i Mellansverige. Hos oss pågår det något hela tiden – ett nytt liv ser dagens ljus, en mormor opereras, en kollega hyllas som livets hjälte. Vi tror att ärlighet varar längst och det är ingen hemlighet att vi behöver bli fler. Som kollega till oss får du vara med om mycket. Hårda prövningar men också fantastiska händelser, stark gemenskap och stöttning från kollegor och medmänniskor. För att se delar ur vår verklighet, besök vår fotoutställning på akademiskafotoutstallning.se.\n\nVälkommen med din ansökan och bli en del av oss.\r\n\r\nVår verksamhet\nVi har ca 400 anställda fördelade på mottagningar, vårdavdelningar och medicinska sektioner inom verksamhetsområde kirurgi. En stor del av vården består av riks- och regionpatienter som remitterats för högspecialiserad utredning och behandling.  \n\nKirurgavdelning 70D \nAvdelning 70D är en kirurgisk avdelning med inriktning på akut- och traumakirurgi, kolorektalkirurgi och endokrinkirurgi. På avdelningen vårdar vi patienter med akuta kirurgiska tillstånd samt patienter som genomgår planerad kolorektal- eller endokrinkirurgi. Inom akut-och traumakirurgi behandlar och opererar vi patienter med akuta sjukdomar i buken såsom gallbesvär, blindtarmsinflammation, bukspottkörtelinflammation, magsår och tarmvred. Vi tar även hand om patienter som har varit med om olika typer av trauman. Inom kolorektalkirurgi behandlar och opererar vi patienter med tumörer i tjock-eller ändtarm, inflammatoriska tarmsjukdomar och funktionella tarmrubbningar. Vi vårdar och opererar även HIPEC-patienter från hela landet. Inom endokrinkirurgi behandlar och opererar vi patienter med sjukdomar i endokrina organ så som sköldkörtel, binjurar och neuroendokrina tumörer.\n\nDitt uppdrag\nSom undersköterska ansvarar du bland annat för patientens basala omvårdnad, pre- och postoperativ vård, såromläggningar, stomivård, kateter- och dränagevård, blodprovstagning och kontroller av vitala parametrar. Vi arbetar i team med patienten i centrum\n\nDina kvalifikationer\nVi söker dig som är utbildad undersköterska med erfarenhet av sjukhusvård. Vi söker både dig som vill arbeta dag, kväll och helg. Tjänsten innefattar även nattrotation på sikt.\n\nDin kompetens\nVi värdesätter egenskaper som nyfikenhet, engagemang, vilja att lära sig nya saker, samarbetsförmåga, ett positivt förhållningssätt samt flexibilitet. Stor vikt läggs på personlig lämplighet. \n\nVi erbjuder\nVi erbjuder ett vikariat på heltid i 6 månader med möjlighet till förlängning. Lön och tillträde enligt överenskommelse. \n\nHos oss får du förmåner som gör skillnad, läs om förmånerna här (https://regionuppsala.se/jobba-hos-oss/bli-var-nya-kollega/formaner/).\n\nVill du veta mer?\nMalin Hållinder, avdelningschef: 018-611 29 77 \nEmmy Ekblad, biträdande avdelningschef: 018–617 53 55\nFacklig kontaktperson för kommunal nås via växeln: 018-611 00 00\n\nVill du jobba med oss?\nVälkommen med din ansökan via länken nedan. Urval och intervjuer kan komma att ske löpande så vänta inte med din ansökan.\n\nRegion Uppsala värdesätter de kvaliteter som jämn könsfördelning och mångfald tillför verksamheten. Vi ser därför gärna sökande av alla kön och med olika födelsebakgrund, funktionalitet och livserfarenhet.\n\nDenna rekrytering sker helt genom Region Uppsalas försorg. Vi undanber oss därför telefonsamtal från rekryteringsföretag och annonsförsäljare."
      },
      "headline" : "Undersköterska till kirurgavdelning 70D ",
      "driving_license" : null,
      "employer" : {
        "email" : null,
        "phone_number" : null,
        "organization_number" : "2321000024",
        "name" : "REGION UPPSALA",
        "url" : null,
        "workplace" : "Region Uppsala"
      },
      "removed_date" : null,
      "logo_url" : "https://www.arbetsformedlingen.se/rest/arbetsgivare/rest/af/v3/organisation/2321000024/logotyper/logo.png",
      "last_publication_date" : "2022-07-24T23:59:59",
      "number_of_vacancies" : 1,
      "occupation" : {
        "concept_id" : "PQkQ_Dmk_ZF8",
        "label" : "Undersköterska, vård- o specialavd. o mottagning",
        "legacy_ams_taxonomy_id" : "7587"
      },
      "occupation_group" : {
        "concept_id" : "LP4Z_ABV_gRm",
        "label" : "Undersköterskor, vård- och specialavdelning och mottagning",
        "legacy_ams_taxonomy_id" : "5323"
      },
      "employment_type" : {
        "concept_id" : "PFZr_Syz_cUq",
        "label" : "Vanlig anställning",
        "legacy_ams_taxonomy_id" : "1"
      },
      "webpage_url" : "https://arbetsformedlingen.se/platsbanken/annonser/26285680",
      "driving_license_required" : false,
      "application_contacts" : [ ],
      "duration" : {
        "concept_id" : "qQUd_4qe_NDT",
        "label" : "6 månader eller längre",
        "legacy_ams_taxonomy_id" : "2"
      },
      "nice_to_have" : {
        "education_level" : [ ],
        "work_experiences" : [ ],
        "skills" : [ ],
        "education" : [ ],
        "languages" : [ ]
      },
      "application_details" : {
        "via_af" : false,
        "email" : null,
        "other" : null,
        "reference" : "AS902/2022",
        "url" : "https://lul.powerinit.com/Modules/Recruitments/Public/?JobPositionId=42636&RefNo=AS902%2f2022",
        "information" : null
      },
      "source_type" : "VIA_PLATSBANKEN_DXA",
      "application_deadline" : "2022-07-24T23:59:59",
      "external_id" : "46-232100-0024-42636",
      "workplace_address" : {
        "coordinates" : [ 17.638927, 59.858562 ],
        "city" : null,
        "postcode" : null,
        "municipality" : "Uppsala",
        "region_concept_id" : "zBon_eET_fFU",
        "region" : "Uppsala län",
        "country_code" : "199",
        "region_code" : "03",
        "municipality_concept_id" : "otaF_bQY_4ZD",
        "country_concept_id" : "i46j_HmG_v64",
        "municipality_code" : "0380",
        "street_address" : null,
        "country" : "Sverige"
      },
      "id" : "26285680",
      "experience_required" : true,
      "working_hours_type" : {
        "concept_id" : "6YE1_gAC_R2G",
        "label" : "Heltid",
        "legacy_ams_taxonomy_id" : "1"
      },
      "access" : null,
      "timestamp" : 1656685389416,
      "must_have" : {
        "education_level" : [ ],
        "work_experiences" : [ {
          "concept_id" : "PQkQ_Dmk_ZF8",
          "weight" : 10,
          "label" : "Undersköterska, vård- och specialavdelning och mottagning",
          "legacy_ams_taxonomy_id" : "7587"
        } ],
        "skills" : [ ],
        "education" : [ ],
        "languages" : [ ]
      },
      "occupation_field" : {
        "concept_id" : "NYW6_mP6_vwf",
        "label" : "Hälso- och sjukvård",
        "legacy_ams_taxonomy_id" : "8"
      },
      "scope_of_work" : {
        "min" : 100,
        "max" : 100
      },
      "salary_type" : {
        "concept_id" : "oG8G_9cW_nRf",
        "label" : "Fast månads- vecko- eller timlön",
        "legacy_ams_taxonomy_id" : "1"
      },
      "removed" : false,
      "salary_description" : "-",
      "access_to_own_car" : false,
      "publication_date" : "2022-07-01T16:23:09"
    },
    "name" : "Undersköterska till kirurgavdelning 70D ",
    "user" : "hannes"
  },
  "sha1" : "525fc2c6eab74098f3258619c34e5e2ab74e40e5",
  "annotations" : [ {
    "preferred-label" : "Undersköterskor",
    "type" : "ssyk-level-3",
    "start-position" : 0,
    "end-position" : 14,
    "concept-id" : "3EJj_WLs_kgD",
    "matched-string" : "Undersköterska",
    "annotation-id" : 4
  }, {
    "preferred-label" : "Kirurgi",
    "sentiment" : "MUST_HAVE",
    "type" : "skill",
    "start-position" : 59,
    "end-position" : 66,
    "concept-id" : "iD5y_V1Z_Exw",
    "matched-string" : "kirurgi",
    "annotation-id" : 0
  }, {
    "preferred-label" : "Sverige",
    "type" : "country",
    "start-position" : 107,
    "end-position" : 115,
    "concept-id" : "i46j_HmG_v64",
    "matched-string" : "Sveriges",
    "annotation-id" : 5
  }, {
    "preferred-label" : "Kirurgi",
    "sentiment" : "MUST_HAVE",
    "type" : "skill",
    "start-position" : 919,
    "end-position" : 926,
    "concept-id" : "iD5y_V1Z_Exw",
    "matched-string" : "kirurgi",
    "annotation-id" : 1
  }, {
    "preferred-label" : "akut kirurgi",
    "type" : "esco-skill",
    "start-position" : 1338,
    "end-position" : 1342,
    "concept-id" : "7bNy_k4Z_DuR",
    "matched-string" : "akut",
    "annotation-id" : 6
  }, {
    "preferred-label" : "Undersköterskor",
    "type" : "ssyk-level-3",
    "start-position" : 1974,
    "end-position" : 1988,
    "concept-id" : "3EJj_WLs_kgD",
    "matched-string" : "undersköterska",
    "annotation-id" : 7
  }, {
    "preferred-label" : "Omvårdnad",
    "sentiment" : "MUST_HAVE",
    "type" : "skill",
    "start-position" : 2035,
    "end-position" : 2044,
    "concept-id" : "MR4H_FFT_mTj",
    "matched-string" : "omvårdnad",
    "annotation-id" : 2
  }, {
    "preferred-label" : "Stomivård",
    "sentiment" : "MUST_HAVE",
    "type" : "skill",
    "start-position" : 2091,
    "end-position" : 2100,
    "concept-id" : "mNUF_J2A_H8c",
    "matched-string" : "stomivård",
    "annotation-id" : 3
  }, {
    "preferred-label" : "Undersköterskor",
    "type" : "ssyk-level-3",
    "start-position" : 2275,
    "end-position" : 2289,
    "concept-id" : "3EJj_WLs_kgD",
    "matched-string" : "undersköterska",
    "annotation-id" : 8
  }, {
    "preferred-label" : "Vikariat",
    "type" : "employment-type",
    "start-position" : 2660,
    "end-position" : 2668,
    "concept-id" : "gro4_cWF_6D7",
    "matched-string" : "vikariat",
    "annotation-id" : 9
  }, {
    "preferred-label" : "Heltid",
    "type" : "worktime-extent",
    "start-position" : 2672,
    "end-position" : 2678,
    "concept-id" : "6YE1_gAC_R2G",
    "matched-string" : "heltid",
    "annotation-id" : 10
  }, {
    "preferred-label" : "Uppsala län",
    "type" : "region",
    "start-position" : 3236,
    "end-position" : 3250,
    "concept-id" : "zBon_eET_fFU",
    "matched-string" : "Region Uppsala",
    "annotation-id" : 11
  }, {
    "preferred-label" : "Uppsala län",
    "type" : "region",
    "start-position" : 3477,
    "end-position" : 3492,
    "concept-id" : "zBon_eET_fFU",
    "matched-string" : "Region Uppsalas",
    "annotation-id" : 12
  } ],
  "text" : "Undersköterska till kirurgavdelning 70D \nVerksamhetsområde kirurgi \r\n\r\nVi är Akademiska sjukhuset – ett av Sveriges ledande universitetssjukhus. Förutom rollen som länssjukhus är vi leverantör av högspecialiserad vård och betjänar två miljoner människor i Mellansverige. Hos oss pågår det något hela tiden – ett nytt liv ser dagens ljus, en mormor opereras, en kollega hyllas som livets hjälte. Vi tror att ärlighet varar längst och det är ingen hemlighet att vi behöver bli fler. Som kollega till oss får du vara med om mycket. Hårda prövningar men också fantastiska händelser, stark gemenskap och stöttning från kollegor och medmänniskor. För att se delar ur vår verklighet, besök vår fotoutställning på akademiskafotoutstallning.se.\n\nVälkommen med din ansökan och bli en del av oss.\r\n\r\nVår verksamhet\nVi har ca 400 anställda fördelade på mottagningar, vårdavdelningar och medicinska sektioner inom verksamhetsområde kirurgi. En stor del av vården består av riks- och regionpatienter som remitterats för högspecialiserad utredning och behandling.  \n\nKirurgavdelning 70D \nAvdelning 70D är en kirurgisk avdelning med inriktning på akut- och traumakirurgi, kolorektalkirurgi och endokrinkirurgi. På avdelningen vårdar vi patienter med akuta kirurgiska tillstånd samt patienter som genomgår planerad kolorektal- eller endokrinkirurgi. Inom akut-och traumakirurgi behandlar och opererar vi patienter med akuta sjukdomar i buken såsom gallbesvär, blindtarmsinflammation, bukspottkörtelinflammation, magsår och tarmvred. Vi tar även hand om patienter som har varit med om olika typer av trauman. Inom kolorektalkirurgi behandlar och opererar vi patienter med tumörer i tjock-eller ändtarm, inflammatoriska tarmsjukdomar och funktionella tarmrubbningar. Vi vårdar och opererar även HIPEC-patienter från hela landet. Inom endokrinkirurgi behandlar och opererar vi patienter med sjukdomar i endokrina organ så som sköldkörtel, binjurar och neuroendokrina tumörer.\n\nDitt uppdrag\nSom undersköterska ansvarar du bland annat för patientens basala omvårdnad, pre- och postoperativ vård, såromläggningar, stomivård, kateter- och dränagevård, blodprovstagning och kontroller av vitala parametrar. Vi arbetar i team med patienten i centrum\n\nDina kvalifikationer\nVi söker dig som är utbildad undersköterska med erfarenhet av sjukhusvård. Vi söker både dig som vill arbeta dag, kväll och helg. Tjänsten innefattar även nattrotation på sikt.\n\nDin kompetens\nVi värdesätter egenskaper som nyfikenhet, engagemang, vilja att lära sig nya saker, samarbetsförmåga, ett positivt förhållningssätt samt flexibilitet. Stor vikt läggs på personlig lämplighet. \n\nVi erbjuder\nVi erbjuder ett vikariat på heltid i 6 månader med möjlighet till förlängning. Lön och tillträde enligt överenskommelse. \n\nHos oss får du förmåner som gör skillnad, läs om förmånerna här (https://regionuppsala.se/jobba-hos-oss/bli-var-nya-kollega/formaner/).\n\nVill du veta mer?\nMalin Hållinder, avdelningschef: 018-611 29 77 \nEmmy Ekblad, biträdande avdelningschef: 018–617 53 55\nFacklig kontaktperson för kommunal nås via växeln: 018-611 00 00\n\nVill du jobba med oss?\nVälkommen med din ansökan via länken nedan. Urval och intervjuer kan komma att ske löpande så vänta inte med din ansökan.\n\nRegion Uppsala värdesätter de kvaliteter som jämn könsfördelning och mångfald tillför verksamheten. Vi ser därför gärna sökande av alla kön och med olika födelsebakgrund, funktionalitet och livserfarenhet.\n\nDenna rekrytering sker helt genom Region Uppsalas försorg. Vi undanber oss därför telefonsamtal från rekryteringsföretag och annonsförsäljare."
}