{
  "meta" : {
    "jobad" : {
      "description" : {
        "requirements" : null,
        "needs" : null,
        "company_information" : null,
        "text_formatted" : "DeltaNordic är en totalleverantör av avancerade elektriska och elektroniska system. De tillverkar apparatskåp, kablage och elektronik. Det är ett välmående företag och en attraktiv arbetsgivare. De är måna om medarbetarnas trivsel och de tillämpar flextid och kort arbetsdag på fredagar.\r\n\r\nNu söker vi två elmontörer till DeltaNordic!\n\nOm tjänsten\nArbetet innebär montering av kablage och komponenter i bl.a. apparatskåp. Till din hjälp har du noggrant framtagna instruktioner, men även montering utifrån elschema förekommer. Anställningen inleds med en god introduktion med stöd från mentor och kollegor. Du kommer få stora möjligheter att utbildas i nya komponenter och produkter inom el. \n\nFöretaget har en imponerande kundbas och högteknologiska produkter som används bl.a. inom gruvindustrin och transport.\n\nDeltaNordic sitter i fina lokaler i Kungsängen. De tillämpar flextid och kort arbetsdag på fredagar. Tjänsten är ett uthyrningsuppdrag och behovet är på lång sikt! Eventuellt kan det finnas möjlighet att bli anställd hos kund efter en period som inhyrd.\n\nKvalifikationer\nVi söker dig som har arbetat som apparatskåpsmontör i minst ett år, alternativt har du elutbildning och vill lära dig ett nytt yrke. Elutbildning är generellt ett stort plus, men inget krav om du har annan erfarenhet från branschen. Har du arbetat som provare, testare, elskåpsmontör, automationstekniker eller elektriker är det starkt meriterande.\n\nVi fäster stor vikt vid de personliga egenskaperna. Noggrannhet, bra ordningssinne och förmåga att arbeta självständigt är viktigt för att lyckas i tjänsten. Flytande svenska i tal och skrift krävs också då samarbete med kollegor är en viktig del av tjänsten. \n\nAnsökan\nLåter det här som ett arbete för dig? Skicka din ansökan direkt då urvalet sker löpande! \n\nDeltaNordic har anlitat MTX Rekrytering & Bemanning för den här rekryteringen och det är DeltaNordics önskemål att alla frågor kring tjänsten hanteras av MTX Rekrytering & Bemanning.\n\nÖvrigt\nPlacering: DeltaNordics lokaler i Kungsängen (Brunna industriområde)\nStart: Omgående, med hänsyn till ev uppsägningstid\nOmfattning: Heltid\nLön: Genomsnittligt förtjänstläge enligt kollektivavtal \n\nKontaktpersoner:\nJulia Edoff, ansvarig rekryteringskonsult\nTel: 076 880 03 68",
        "conditions" : "-\r\n-",
        "text" : "DeltaNordic är en totalleverantör av avancerade elektriska och elektroniska system. De tillverkar apparatskåp, kablage och elektronik. Det är ett välmående företag och en attraktiv arbetsgivare. De är måna om medarbetarnas trivsel och de tillämpar flextid och kort arbetsdag på fredagar.\r\n\r\nNu söker vi två elmontörer till DeltaNordic!\n\nOm tjänsten\nArbetet innebär montering av kablage och komponenter i bl.a. apparatskåp. Till din hjälp har du noggrant framtagna instruktioner, men även montering utifrån elschema förekommer. Anställningen inleds med en god introduktion med stöd från mentor och kollegor. Du kommer få stora möjligheter att utbildas i nya komponenter och produkter inom el. \n\nFöretaget har en imponerande kundbas och högteknologiska produkter som används bl.a. inom gruvindustrin och transport.\n\nDeltaNordic sitter i fina lokaler i Kungsängen. De tillämpar flextid och kort arbetsdag på fredagar. Tjänsten är ett uthyrningsuppdrag och behovet är på lång sikt! Eventuellt kan det finnas möjlighet att bli anställd hos kund efter en period som inhyrd.\n\nKvalifikationer\nVi söker dig som har arbetat som apparatskåpsmontör i minst ett år, alternativt har du elutbildning och vill lära dig ett nytt yrke. Elutbildning är generellt ett stort plus, men inget krav om du har annan erfarenhet från branschen. Har du arbetat som provare, testare, elskåpsmontör, automationstekniker eller elektriker är det starkt meriterande.\n\nVi fäster stor vikt vid de personliga egenskaperna. Noggrannhet, bra ordningssinne och förmåga att arbeta självständigt är viktigt för att lyckas i tjänsten. Flytande svenska i tal och skrift krävs också då samarbete med kollegor är en viktig del av tjänsten. \n\nAnsökan\nLåter det här som ett arbete för dig? Skicka din ansökan direkt då urvalet sker löpande! \n\nDeltaNordic har anlitat MTX Rekrytering & Bemanning för den här rekryteringen och det är DeltaNordics önskemål att alla frågor kring tjänsten hanteras av MTX Rekrytering & Bemanning.\n\nÖvrigt\nPlacering: DeltaNordics lokaler i Kungsängen (Brunna industriområde)\nStart: Omgående, med hänsyn till ev uppsägningstid\nOmfattning: Heltid\nLön: Genomsnittligt förtjänstläge enligt kollektivavtal \n\nKontaktpersoner:\nJulia Edoff, ansvarig rekryteringskonsult\nTel: 076 880 03 68"
      },
      "headline" : "Elmontörer inom apparatskåp till DeltaNordic - Norra Stockholm!",
      "driving_license" : null,
      "employer" : {
        "email" : null,
        "phone_number" : null,
        "organization_number" : "5590679378",
        "name" : "MTX Rekrytering & Bemanning AB",
        "url" : null,
        "workplace" : "MTX Rekrytering & Bemanning"
      },
      "removed_date" : null,
      "logo_url" : "https://www.arbetsformedlingen.se/rest/arbetsgivare/rest/af/v3/organisation/5590679378/logotyper/logo.png",
      "last_publication_date" : "2022-09-03T23:59:59",
      "number_of_vacancies" : 2,
      "occupation" : {
        "concept_id" : "AJDU_fpb_ADF",
        "label" : "Elmontör",
        "legacy_ams_taxonomy_id" : "6412"
      },
      "occupation_group" : {
        "concept_id" : "SgAJ_DW2_FN5",
        "label" : "Montörer, elektrisk och elektronisk utrustning",
        "legacy_ams_taxonomy_id" : "8212"
      },
      "employment_type" : {
        "concept_id" : "PFZr_Syz_cUq",
        "label" : "Vanlig anställning",
        "legacy_ams_taxonomy_id" : "1"
      },
      "webpage_url" : "https://arbetsformedlingen.se/platsbanken/annonser/26375035",
      "driving_license_required" : false,
      "application_contacts" : [ ],
      "duration" : {
        "concept_id" : "a7uU_j21_mkL",
        "label" : "Tills vidare",
        "legacy_ams_taxonomy_id" : "1"
      },
      "nice_to_have" : {
        "education_level" : [ ],
        "work_experiences" : [ ],
        "skills" : [ ],
        "education" : [ ],
        "languages" : [ ]
      },
      "application_details" : {
        "via_af" : false,
        "email" : null,
        "other" : null,
        "reference" : null,
        "url" : "https://jobb.mtxrekrytering.se/jobs/211593-elmontorer-inom-apparatskap-till-deltanordic-norra-stockholm?ref=platsbanken",
        "information" : null
      },
      "source_type" : "VIA_PLATSBANKEN_DXA",
      "application_deadline" : "2022-09-03T23:59:59",
      "external_id" : "46-559067-9378-wb-211593",
      "workplace_address" : {
        "coordinates" : [ 18.06858, 59.329323 ],
        "city" : null,
        "postcode" : null,
        "municipality" : "Stockholm",
        "region_concept_id" : "CifL_Rzy_Mku",
        "region" : "Stockholms län",
        "country_code" : "199",
        "region_code" : "01",
        "municipality_concept_id" : "AvNB_uwa_6n6",
        "country_concept_id" : "i46j_HmG_v64",
        "municipality_code" : "0180",
        "street_address" : null,
        "country" : "Sverige"
      },
      "id" : "26375035",
      "experience_required" : true,
      "working_hours_type" : {
        "concept_id" : "6YE1_gAC_R2G",
        "label" : "Heltid",
        "legacy_ams_taxonomy_id" : "1"
      },
      "access" : null,
      "timestamp" : 1659526235474,
      "must_have" : {
        "education_level" : [ ],
        "work_experiences" : [ {
          "concept_id" : "AJDU_fpb_ADF",
          "weight" : 10,
          "label" : "Elmontör",
          "legacy_ams_taxonomy_id" : "6412"
        } ],
        "skills" : [ ],
        "education" : [ ],
        "languages" : [ ]
      },
      "occupation_field" : {
        "concept_id" : "wTEr_CBC_bqh",
        "label" : "Industriell tillverkning",
        "legacy_ams_taxonomy_id" : "9"
      },
      "scope_of_work" : {
        "min" : 100,
        "max" : 100
      },
      "salary_type" : {
        "concept_id" : "oG8G_9cW_nRf",
        "label" : "Fast månads- vecko- eller timlön",
        "legacy_ams_taxonomy_id" : "1"
      },
      "removed" : false,
      "salary_description" : "Enligt överenskommelse",
      "access_to_own_car" : false,
      "publication_date" : "2022-08-03T13:30:35"
    },
    "name" : "Elmontörer inom apparatskåp till DeltaNordic - Norra Stockholm!",
    "user" : "hannes"
  },
  "sha1" : "2e62ae66246fc5e1bd3e89c95479063c276a27c2",
  "annotations" : [ {
    "preferred-label" : "Elmontör",
    "type" : "occupation-name",
    "start-position" : 0,
    "end-position" : 10,
    "concept-id" : "AJDU_fpb_ADF",
    "matched-string" : "Elmontörer",
    "annotation-id" : 6
  }, {
    "preferred-label" : "Stockholm",
    "type" : "municipality",
    "start-position" : 53,
    "end-position" : 62,
    "concept-id" : "AvNB_uwa_6n6",
    "matched-string" : "Stockholm",
    "annotation-id" : 7
  }, {
    "preferred-label" : "montör, kablage",
    "type" : "esco-occupation",
    "start-position" : 175,
    "end-position" : 182,
    "concept-id" : "FYfj_bpz_zK9",
    "matched-string" : "kablage",
    "annotation-id" : 9
  }, {
    "preferred-label" : "elektronik",
    "type" : "esco-skill",
    "start-position" : 187,
    "end-position" : 197,
    "concept-id" : "S9Th_73n_Fpu",
    "matched-string" : "elektronik",
    "annotation-id" : 8
  }, {
    "preferred-label" : "Elmontör",
    "type" : "occupation-name",
    "start-position" : 371,
    "end-position" : 381,
    "concept-id" : "AJDU_fpb_ADF",
    "matched-string" : "elmontörer",
    "annotation-id" : 10
  }, {
    "preferred-label" : "Apparatskåpsmontör",
    "sentiment" : "MUST_HAVE",
    "type" : "keyword",
    "start-position" : 1182,
    "end-position" : 1200,
    "concept-id" : "5ETM_zu9_YMf",
    "matched-string" : "apparatskåpsmontör",
    "annotation-id" : 0
  }, {
    "preferred-label" : "Godkänd elutbildning",
    "type" : "skill",
    "start-position" : 1236,
    "end-position" : 1248,
    "concept-id" : "bG9S_mns_7q9",
    "matched-string" : "elutbildning",
    "annotation-id" : 12
  }, {
    "preferred-label" : "Godkänd elutbildning",
    "type" : "skill",
    "start-position" : 1282,
    "end-position" : 1294,
    "concept-id" : "bG9S_mns_7q9",
    "matched-string" : "Elutbildning",
    "annotation-id" : 11
  }, {
    "preferred-label" : "provare",
    "type" : "esco-occupation",
    "start-position" : 1401,
    "end-position" : 1408,
    "concept-id" : "VUu2_Cxm_BbE",
    "matched-string" : "provare",
    "annotation-id" : 13
  }, {
    "preferred-label" : "Elskåpsmontör",
    "sentiment" : "MUST_HAVE",
    "type" : "keyword",
    "start-position" : 1419,
    "end-position" : 1432,
    "concept-id" : "tNS4_dBr_Ysg",
    "matched-string" : "elskåpsmontör",
    "annotation-id" : 1
  }, {
    "preferred-label" : "Automationstekniker",
    "sentiment" : "MUST_HAVE",
    "type" : "keyword",
    "start-position" : 1434,
    "end-position" : 1453,
    "concept-id" : "mTT5_xgE_sRx",
    "matched-string" : "automationstekniker",
    "annotation-id" : 2
  }, {
    "preferred-label" : "noggrannhet",
    "type" : "esco-skill",
    "start-position" : 1551,
    "end-position" : 1562,
    "concept-id" : "mrsW_EkL_KRD",
    "matched-string" : "Noggrannhet",
    "annotation-id" : 14
  }, {
    "preferred-label" : "arbeta självständigt",
    "type" : "esco-skill",
    "start-position" : 1598,
    "end-position" : 1618,
    "concept-id" : "NyFu_HHd_zhz",
    "matched-string" : "arbeta självständigt",
    "annotation-id" : 15
  }, {
    "preferred-label" : "Svenska",
    "sentiment" : "MUST_HAVE",
    "type" : "language",
    "start-position" : 1666,
    "end-position" : 1673,
    "concept-id" : "zSLA_vw2_FXN",
    "matched-string" : "svenska",
    "annotation-id" : 3
  }, {
    "preferred-label" : "samarbeta med kolleger",
    "type" : "esco-skill",
    "start-position" : 1706,
    "end-position" : 1728,
    "concept-id" : "X15R_797_q62",
    "matched-string" : "samarbete med kollegor",
    "annotation-id" : 16
  }, {
    "preferred-label" : "Heltid",
    "type" : "worktime-extent",
    "start-position" : 2183,
    "end-position" : 2189,
    "concept-id" : "6YE1_gAC_R2G",
    "matched-string" : "Heltid",
    "annotation-id" : 17
  }, {
    "preferred-label" : "Kollektivavtal",
    "sentiment" : "MUST_HAVE",
    "type" : "skill",
    "start-position" : 2231,
    "end-position" : 2245,
    "concept-id" : "z7wE_9xb_3jX",
    "matched-string" : "kollektivavtal",
    "annotation-id" : 4
  }, {
    "preferred-label" : "rekryteringskonsult",
    "sentiment" : "MUST_HAVE",
    "type" : "esco-occupation",
    "start-position" : 2287,
    "end-position" : 2306,
    "concept-id" : "tGyt_via_HNb",
    "matched-string" : "rekryteringskonsult",
    "annotation-id" : 5
  } ],
  "text" : "Elmontörer inom apparatskåp till DeltaNordic - Norra Stockholm!\nDeltaNordic är en totalleverantör av avancerade elektriska och elektroniska system. De tillverkar apparatskåp, kablage och elektronik. Det är ett välmående företag och en attraktiv arbetsgivare. De är måna om medarbetarnas trivsel och de tillämpar flextid och kort arbetsdag på fredagar.\r\n\r\nNu söker vi två elmontörer till DeltaNordic!\n\nOm tjänsten\nArbetet innebär montering av kablage och komponenter i bl.a. apparatskåp. Till din hjälp har du noggrant framtagna instruktioner, men även montering utifrån elschema förekommer. Anställningen inleds med en god introduktion med stöd från mentor och kollegor. Du kommer få stora möjligheter att utbildas i nya komponenter och produkter inom el. \n\nFöretaget har en imponerande kundbas och högteknologiska produkter som används bl.a. inom gruvindustrin och transport.\n\nDeltaNordic sitter i fina lokaler i Kungsängen. De tillämpar flextid och kort arbetsdag på fredagar. Tjänsten är ett uthyrningsuppdrag och behovet är på lång sikt! Eventuellt kan det finnas möjlighet att bli anställd hos kund efter en period som inhyrd.\n\nKvalifikationer\nVi söker dig som har arbetat som apparatskåpsmontör i minst ett år, alternativt har du elutbildning och vill lära dig ett nytt yrke. Elutbildning är generellt ett stort plus, men inget krav om du har annan erfarenhet från branschen. Har du arbetat som provare, testare, elskåpsmontör, automationstekniker eller elektriker är det starkt meriterande.\n\nVi fäster stor vikt vid de personliga egenskaperna. Noggrannhet, bra ordningssinne och förmåga att arbeta självständigt är viktigt för att lyckas i tjänsten. Flytande svenska i tal och skrift krävs också då samarbete med kollegor är en viktig del av tjänsten. \n\nAnsökan\nLåter det här som ett arbete för dig? Skicka din ansökan direkt då urvalet sker löpande! \n\nDeltaNordic har anlitat MTX Rekrytering & Bemanning för den här rekryteringen och det är DeltaNordics önskemål att alla frågor kring tjänsten hanteras av MTX Rekrytering & Bemanning.\n\nÖvrigt\nPlacering: DeltaNordics lokaler i Kungsängen (Brunna industriområde)\nStart: Omgående, med hänsyn till ev uppsägningstid\nOmfattning: Heltid\nLön: Genomsnittligt förtjänstläge enligt kollektivavtal \n\nKontaktpersoner:\nJulia Edoff, ansvarig rekryteringskonsult\nTel: 076 880 03 68"
}