{
  "meta" : {
    "jobad" : {
      "description" : {
        "requirements" : null,
        "needs" : null,
        "company_information" : null,
        "text_formatted" : "Kundtjänst på tyska till e-handelsbolag\n\n \n\niPiccolo AB står inför satsningar på flera nya områden, i vår kundtjänst har du en viktig roll att serva kunderna på bästa sätt. Som kundtjänstmedarbetare hos oss ingår du i ett trevligt team. Vi söker nu en kollega som kan ge support till den svenska och antingen den franska eller den tyska marknaden (gärna båda) och som har ett långsiktigt intresse av att arbeta i en serviceinriktad roll.\n\nUppdraget\n\nI rollen som kundtjänst/Ordermedarbetare kommer du främst att arbeta med att besvara inkommande kundärenden. Våra ärenden kommer in via telefon, e-post, webformulär, facebook och chatt. De hanteras bland annat i vårt ärendehanteringssystem ServIT e-helpdesk.\n\nDitt fokus kommer ligga på att ge förstklassig service och besvara frågor kring order, leveranser, produkter, reklamationer och betalningar. Även översättning av text ingår i rollen. Vi arbetar med kontinuerlig uppföljning på våra kunders upplevelse för att utveckla oss i kundtjänsten.\n\nI tjänsten ingår även att emellanåt vara behjälplig, på andra avdelningar. Arbetsuppgifter som kan vara aktuella är inventering, packning och returhantering. \n\nKvalifikationer\n\nRollen passar dig som gillar att arbeta med telefonen som verktyg och har lätt att hantera flera system och telefonen parallellt. Det är meriterande om du har erfarenhet av kundtjänstarbete och att du tidigare har arbetat med Visma Business.\n\nSpråknivån och trevlig tonalitet i kundbemötandet är viktigt för oss och det kommer att genomföras språktest (tyska i kombination med svenska) under rekryteringsprocessen.\n\nVi lägger stor vikt vid din personlighet och ser att du som person är serviceinriktad, kommunikativ och kan hantera olika uppgifter simultant. Rätt person för tjänsten uppskattar variationen av ärenden, tar ansvar för sina ärenden och är en lagspelare som bidrar i gruppen.\n\nTjänsten är en tillsvidareanställning på iPiccolos huvudkontor i Uppsala. Vi erbjuder en heltidstjänst efter överenskommelse. \n\nVi gör löpande urval och tjänsterna kan komma att tillsättas före sista ansökningsdag. Vi ser gärna att du kan börja så snart som möjligt.\n\nFör oss är det viktigt att all kompetens på arbetsmarknaden tillvaratas. Vi välkomnar alla sökande och eftersträvar mångfald.\n\n \n\nOm inkClub:\n inkClub grundades år 2000 och är idag ett av Europas största e-handelsbolag inom förbrukningsvaror med försäljning till tio länder och fler än fem miljoner kunder. Huvudkontoret ligger i Uppsala och 2017 bytte vi koncernnamn till iPiccolo AB.\n\nFrån Uppsala hanteras samtliga marknader och funktioner. Bolaget har c:a 100 anställda. iPiccolo omsätter drygt 600 M kr.\n\n \n\nUppdragsgivare:  iPiccolo AB\n\nOrt:  Uppsala\n\nOmfattning:  Heltid\n\nSista ansökningsdag:  2022-09-30",
        "conditions" : "Tillsvidare\r\nHeltid",
        "text" : "Kundtjänst på tyska till e-handelsbolag\n\n \n\niPiccolo AB står inför satsningar på flera nya områden, i vår kundtjänst har du en viktig roll att serva kunderna på bästa sätt. Som kundtjänstmedarbetare hos oss ingår du i ett trevligt team. Vi söker nu en kollega som kan ge support till den svenska och antingen den franska eller den tyska marknaden (gärna båda) och som har ett långsiktigt intresse av att arbeta i en serviceinriktad roll.\n\nUppdraget\n\nI rollen som kundtjänst/Ordermedarbetare kommer du främst att arbeta med att besvara inkommande kundärenden. Våra ärenden kommer in via telefon, e-post, webformulär, facebook och chatt. De hanteras bland annat i vårt ärendehanteringssystem ServIT e-helpdesk.\n\nDitt fokus kommer ligga på att ge förstklassig service och besvara frågor kring order, leveranser, produkter, reklamationer och betalningar. Även översättning av text ingår i rollen. Vi arbetar med kontinuerlig uppföljning på våra kunders upplevelse för att utveckla oss i kundtjänsten.\n\nI tjänsten ingår även att emellanåt vara behjälplig, på andra avdelningar. Arbetsuppgifter som kan vara aktuella är inventering, packning och returhantering. \n\nKvalifikationer\n\nRollen passar dig som gillar att arbeta med telefonen som verktyg och har lätt att hantera flera system och telefonen parallellt. Det är meriterande om du har erfarenhet av kundtjänstarbete och att du tidigare har arbetat med Visma Business.\n\nSpråknivån och trevlig tonalitet i kundbemötandet är viktigt för oss och det kommer att genomföras språktest (tyska i kombination med svenska) under rekryteringsprocessen.\n\nVi lägger stor vikt vid din personlighet och ser att du som person är serviceinriktad, kommunikativ och kan hantera olika uppgifter simultant. Rätt person för tjänsten uppskattar variationen av ärenden, tar ansvar för sina ärenden och är en lagspelare som bidrar i gruppen.\n\nTjänsten är en tillsvidareanställning på iPiccolos huvudkontor i Uppsala. Vi erbjuder en heltidstjänst efter överenskommelse. \n\nVi gör löpande urval och tjänsterna kan komma att tillsättas före sista ansökningsdag. Vi ser gärna att du kan börja så snart som möjligt.\n\nFör oss är det viktigt att all kompetens på arbetsmarknaden tillvaratas. Vi välkomnar alla sökande och eftersträvar mångfald.\n\n \n\nOm inkClub:\n inkClub grundades år 2000 och är idag ett av Europas största e-handelsbolag inom förbrukningsvaror med försäljning till tio länder och fler än fem miljoner kunder. Huvudkontoret ligger i Uppsala och 2017 bytte vi koncernnamn till iPiccolo AB.\n\nFrån Uppsala hanteras samtliga marknader och funktioner. Bolaget har c:a 100 anställda. iPiccolo omsätter drygt 600 M kr.\n\n \n\nUppdragsgivare:  iPiccolo AB\n\nOrt:  Uppsala\n\nOmfattning:  Heltid\n\nSista ansökningsdag:  2022-09-30"
      },
      "headline" : "Uppsala: Tysktalande kundtjänstmedarbetare till iPiccolo",
      "driving_license" : null,
      "employer" : {
        "email" : null,
        "phone_number" : null,
        "organization_number" : "5566228846",
        "name" : "Jobbakuten Väst AB",
        "url" : "http://www.hefty.se",
        "workplace" : "Jobbakuten Hefty"
      },
      "removed_date" : null,
      "logo_url" : "https://www.arbetsformedlingen.se/rest/arbetsgivare/rest/af/v3/organisation/5566228846/logotyper/logo.png",
      "last_publication_date" : "2022-09-30T23:59:59",
      "number_of_vacancies" : 1,
      "occupation" : {
        "concept_id" : "8Uhp_XYo_z5f",
        "label" : "Kundtjänstmedarbetare",
        "legacy_ams_taxonomy_id" : "2291"
      },
      "occupation_group" : {
        "concept_id" : "pwRH_MT1_8nR",
        "label" : "Kundtjänstpersonal",
        "legacy_ams_taxonomy_id" : "4222"
      },
      "employment_type" : {
        "concept_id" : "PFZr_Syz_cUq",
        "label" : "Vanlig anställning",
        "legacy_ams_taxonomy_id" : "1"
      },
      "webpage_url" : "https://arbetsformedlingen.se/platsbanken/annonser/26329723",
      "driving_license_required" : false,
      "application_contacts" : [ {
        "description" : "Team Hefty",
        "email" : null,
        "telephone" : null,
        "name" : null,
        "contact_type" : null
      } ],
      "duration" : {
        "concept_id" : "a7uU_j21_mkL",
        "label" : "Tills vidare",
        "legacy_ams_taxonomy_id" : "1"
      },
      "nice_to_have" : {
        "education_level" : [ ],
        "work_experiences" : [ ],
        "skills" : [ ],
        "education" : [ ],
        "languages" : [ ]
      },
      "application_details" : {
        "via_af" : false,
        "email" : null,
        "other" : null,
        "reference" : null,
        "url" : "https://Jobbakuten.easycruit.com/vacancy/application/2991365/194669?channel=amv&iso=se",
        "information" : null
      },
      "source_type" : "VIA_PLATSBANKEN_DXA",
      "application_deadline" : "2022-09-30T23:59:59",
      "external_id" : "46-556622-8846-2991365-194669-se",
      "workplace_address" : {
        "coordinates" : [ 17.638927, 59.858562 ],
        "city" : null,
        "postcode" : null,
        "municipality" : "Uppsala",
        "region_concept_id" : "zBon_eET_fFU",
        "region" : "Uppsala län",
        "country_code" : "199",
        "region_code" : "03",
        "municipality_concept_id" : "otaF_bQY_4ZD",
        "country_concept_id" : "i46j_HmG_v64",
        "municipality_code" : "0380",
        "street_address" : null,
        "country" : "Sverige"
      },
      "id" : "26329723",
      "experience_required" : true,
      "working_hours_type" : {
        "concept_id" : "6YE1_gAC_R2G",
        "label" : "Heltid",
        "legacy_ams_taxonomy_id" : "1"
      },
      "access" : null,
      "timestamp" : 1657872058151,
      "must_have" : {
        "education_level" : [ ],
        "work_experiences" : [ {
          "concept_id" : "8Uhp_XYo_z5f",
          "weight" : 10,
          "label" : "Kundtjänstmedarbetare",
          "legacy_ams_taxonomy_id" : "2291"
        } ],
        "skills" : [ ],
        "education" : [ ],
        "languages" : [ ]
      },
      "occupation_field" : {
        "concept_id" : "RPTn_bxG_ExZ",
        "label" : "Försäljning, inköp, marknadsföring",
        "legacy_ams_taxonomy_id" : "5"
      },
      "scope_of_work" : {
        "min" : 100,
        "max" : 100
      },
      "salary_type" : {
        "concept_id" : "oG8G_9cW_nRf",
        "label" : "Fast månads- vecko- eller timlön",
        "legacy_ams_taxonomy_id" : "1"
      },
      "removed" : false,
      "salary_description" : "Enl. avtal",
      "access_to_own_car" : false,
      "publication_date" : "2022-07-15T10:00:58"
    },
    "name" : "Uppsala: Tysktalande kundtjänstmedarbetare till iPiccolo",
    "user" : "hannes"
  },
  "sha1" : "3daa8904e2acd211a75a929017260ba1451f17a3",
  "annotations" : [ {
    "preferred-label" : "Kundtjänstmedarbetare",
    "sentiment" : "MUST_HAVE",
    "type" : "occupation-name",
    "start-position" : 21,
    "end-position" : 42,
    "concept-id" : "8Uhp_XYo_z5f",
    "matched-string" : "kundtjänstmedarbetare",
    "annotation-id" : 0
  }, {
    "preferred-label" : "Kundtjänst",
    "sentiment" : "MUST_HAVE",
    "type" : "skill",
    "start-position" : 57,
    "end-position" : 67,
    "concept-id" : "aMyW_hB7_TpU",
    "matched-string" : "kundtjänst",
    "annotation-id" : 1
  }, {
    "preferred-label" : "Tyska",
    "sentiment" : "MUST_HAVE",
    "type" : "language",
    "start-position" : 71,
    "end-position" : 76,
    "concept-id" : "S368_jFS_2hP",
    "matched-string" : "tyska",
    "annotation-id" : 2
  }, {
    "preferred-label" : "E-handel",
    "type" : "keyword",
    "start-position" : 82,
    "end-position" : 90,
    "concept-id" : "yxpW_N32_YMK",
    "matched-string" : "e-handel",
    "annotation-id" : 13
  }, {
    "preferred-label" : "Kundtjänst",
    "sentiment" : "MUST_HAVE",
    "type" : "skill",
    "start-position" : 163,
    "end-position" : 173,
    "concept-id" : "aMyW_hB7_TpU",
    "matched-string" : "kundtjänst",
    "annotation-id" : 3
  }, {
    "preferred-label" : "Kundtjänstmedarbetare",
    "sentiment" : "MUST_HAVE",
    "type" : "occupation-name",
    "start-position" : 234,
    "end-position" : 255,
    "concept-id" : "8Uhp_XYo_z5f",
    "matched-string" : "kundtjänstmedarbetare",
    "annotation-id" : 4
  }, {
    "preferred-label" : "Kundtjänst",
    "sentiment" : "MUST_HAVE",
    "type" : "skill",
    "start-position" : 520,
    "end-position" : 530,
    "concept-id" : "aMyW_hB7_TpU",
    "matched-string" : "kundtjänst",
    "annotation-id" : 8
  }, {
    "preferred-label" : "Verktyg",
    "sentiment" : "MUST_HAVE",
    "type" : "skill",
    "start-position" : 1290,
    "end-position" : 1297,
    "concept-id" : "KG9j_WxP_ym2",
    "matched-string" : "verktyg",
    "annotation-id" : 9
  }, {
    "preferred-label" : "Tyska",
    "sentiment" : "MUST_HAVE",
    "type" : "language",
    "start-position" : 1585,
    "end-position" : 1590,
    "concept-id" : "S368_jFS_2hP",
    "matched-string" : "tyska",
    "annotation-id" : 10
  }, {
    "preferred-label" : "Svenska",
    "sentiment" : "MUST_HAVE",
    "type" : "language",
    "start-position" : 1609,
    "end-position" : 1616,
    "concept-id" : "zSLA_vw2_FXN",
    "matched-string" : "svenska",
    "annotation-id" : 11
  }, {
    "preferred-label" : "Uppsala",
    "type" : "municipality",
    "start-position" : 1988,
    "end-position" : 1995,
    "concept-id" : "otaF_bQY_4ZD",
    "matched-string" : "Uppsala",
    "annotation-id" : 14
  }, {
    "preferred-label" : "Heltid",
    "type" : "worktime-extent",
    "start-position" : 2012,
    "end-position" : 2025,
    "concept-id" : "6YE1_gAC_R2G",
    "matched-string" : "heltidstjänst",
    "annotation-id" : 15
  }, {
    "preferred-label" : "Uppsala",
    "type" : "municipality",
    "start-position" : 2740,
    "end-position" : 2747,
    "concept-id" : "otaF_bQY_4ZD",
    "matched-string" : "Uppsala",
    "annotation-id" : 16
  }, {
    "preferred-label" : "Heltid",
    "type" : "worktime-extent",
    "start-position" : 2762,
    "end-position" : 2768,
    "concept-id" : "6YE1_gAC_R2G",
    "matched-string" : "Heltid",
    "annotation-id" : 17
  } ],
  "text" : "Uppsala: Tysktalande kundtjänstmedarbetare till iPiccolo\nKundtjänst på tyska till e-handelsbolag\n\n \n\niPiccolo AB står inför satsningar på flera nya områden, i vår kundtjänst har du en viktig roll att serva kunderna på bästa sätt. Som kundtjänstmedarbetare hos oss ingår du i ett trevligt team. Vi söker nu en kollega som kan ge support till den svenska och antingen den franska eller den tyska marknaden (gärna båda) och som har ett långsiktigt intresse av att arbeta i en serviceinriktad roll.\n\nUppdraget\n\nI rollen som kundtjänst/Ordermedarbetare kommer du främst att arbeta med att besvara inkommande kundärenden. Våra ärenden kommer in via telefon, e-post, webformulär, facebook och chatt. De hanteras bland annat i vårt ärendehanteringssystem ServIT e-helpdesk.\n\nDitt fokus kommer ligga på att ge förstklassig service och besvara frågor kring order, leveranser, produkter, reklamationer och betalningar. Även översättning av text ingår i rollen. Vi arbetar med kontinuerlig uppföljning på våra kunders upplevelse för att utveckla oss i kundtjänsten.\n\nI tjänsten ingår även att emellanåt vara behjälplig, på andra avdelningar. Arbetsuppgifter som kan vara aktuella är inventering, packning och returhantering. \n\nKvalifikationer\n\nRollen passar dig som gillar att arbeta med telefonen som verktyg och har lätt att hantera flera system och telefonen parallellt. Det är meriterande om du har erfarenhet av kundtjänstarbete och att du tidigare har arbetat med Visma Business.\n\nSpråknivån och trevlig tonalitet i kundbemötandet är viktigt för oss och det kommer att genomföras språktest (tyska i kombination med svenska) under rekryteringsprocessen.\n\nVi lägger stor vikt vid din personlighet och ser att du som person är serviceinriktad, kommunikativ och kan hantera olika uppgifter simultant. Rätt person för tjänsten uppskattar variationen av ärenden, tar ansvar för sina ärenden och är en lagspelare som bidrar i gruppen.\n\nTjänsten är en tillsvidareanställning på iPiccolos huvudkontor i Uppsala. Vi erbjuder en heltidstjänst efter överenskommelse. \n\nVi gör löpande urval och tjänsterna kan komma att tillsättas före sista ansökningsdag. Vi ser gärna att du kan börja så snart som möjligt.\n\nFör oss är det viktigt att all kompetens på arbetsmarknaden tillvaratas. Vi välkomnar alla sökande och eftersträvar mångfald.\n\n \n\nOm inkClub:\n inkClub grundades år 2000 och är idag ett av Europas största e-handelsbolag inom förbrukningsvaror med försäljning till tio länder och fler än fem miljoner kunder. Huvudkontoret ligger i Uppsala och 2017 bytte vi koncernnamn till iPiccolo AB.\n\nFrån Uppsala hanteras samtliga marknader och funktioner. Bolaget har c:a 100 anställda. iPiccolo omsätter drygt 600 M kr.\n\n \n\nUppdragsgivare:  iPiccolo AB\n\nOrt:  Uppsala\n\nOmfattning:  Heltid\n\nSista ansökningsdag:  2022-09-30"
}