{
  "meta" : {
    "jobad" : {
      "description" : {
        "requirements" : null,
        "needs" : null,
        "company_information" : null,
        "text_formatted" : "Är du utbildad skrivtolk, har god datavana och intresse för teknikutveckling samt vill ha ett jobb som är varierande och lärorikt? Då är det dig vi söker till Tolkcentralen. Tolkcentralen i Norrbotten utför tolkuppdrag för döva- och hörselskadade i hela länet, antingen på plats eller via distanstolkning. Hos oss finns 4 st skriv & TSS-tolkar, 4 stycken teckenspråks-/dövblindtolkar samt 1 administratör.\n\nVi söker\nVi söker dig som innehar en skrivtolkutbildning samt har god datavana. Du har även goda kunskaper i svenska, i både tal och skrift. Vi ser det som meriterande om du har TSS-tolk utbildning, tecken och dövtolksutbildning samt erfarenhet av skrivtolkyrket. \n\nVi lägger stor vikt vid dina personliga egenskaper. Som person är du flexibel, stabil och serviceinriktad. Du är strukturerad, tar ansvar för dina arbetsuppgifter, ser möjligheter i förändringar och har lätt för att anpassa dig till ändrade omständigheter. Du är en självgående, utåtriktad person som uppskattar mötet med andra människor och kan arbeta både självständigt och tillsammans med kollegor. Stor vikt kommer att läggas vid personlig lämplighet\n\nDet här får du arbeta med\nTolkcentralen är en länsövergripande verksamhet som ingår i verksamhetsområdet LSS-Syn-Hör-Tolk. Tolkcentralen erbjuder hörselskadade, döva, dövblinda samt hörande kostnadsfri tolkservice. Tjänsten är placerad i Luleå men resor i tjänst samt arbete på annan ort förekommer.\nArbetsuppgifterna innefattar skrivtolkning och TSS-tolkning, om du har den utbildningen, till hörselskadade i länet, förbereda tolkuppdrag samt ansvara för teknisk tolkutrustning.Du kommer även arbeta med att informera om tolkverksamheten samt vid behov vara delaktig i övrig verksamhet inom Tolkcentralen. \n\nDet här erbjuder vi dig\n- Utvecklings- och karriärmöjligheter där du får vara med och skapa framtidens hälsa och vård\n- Hälsofrämjande arbetsplatser med tillgång till friskvårdsaktiviteter och friskvårdsbidrag\n- Länk till våra förmåner: https://www.norrbotten.se/sv/Jobb-och-utbildning/Jobba-hos-oss/\nInformation om tjänsten\nTjänsten är en tillsvidareanställning på heltid. Arbetstiden är förlagd på dag- och kvällstid samt helgtjänstgöring förekommer. Tillträde sker enligt överenskommelse. Urval och intervjuer sker löpande och tjänsten kan tillsättas innan sista ansökningsdag.\nRegion Norrbotten tillämpar individuell lönesättning enligt kollektivavtal. \n\nVälkommen med din ansökan!",
        "conditions" : "Heltid",
        "text" : "Är du utbildad skrivtolk, har god datavana och intresse för teknikutveckling samt vill ha ett jobb som är varierande och lärorikt? Då är det dig vi söker till Tolkcentralen. Tolkcentralen i Norrbotten utför tolkuppdrag för döva- och hörselskadade i hela länet, antingen på plats eller via distanstolkning. Hos oss finns 4 st skriv & TSS-tolkar, 4 stycken teckenspråks-/dövblindtolkar samt 1 administratör.\n\nVi söker\nVi söker dig som innehar en skrivtolkutbildning samt har god datavana. Du har även goda kunskaper i svenska, i både tal och skrift. Vi ser det som meriterande om du har TSS-tolk utbildning, tecken och dövtolksutbildning samt erfarenhet av skrivtolkyrket. \n\nVi lägger stor vikt vid dina personliga egenskaper. Som person är du flexibel, stabil och serviceinriktad. Du är strukturerad, tar ansvar för dina arbetsuppgifter, ser möjligheter i förändringar och har lätt för att anpassa dig till ändrade omständigheter. Du är en självgående, utåtriktad person som uppskattar mötet med andra människor och kan arbeta både självständigt och tillsammans med kollegor. Stor vikt kommer att läggas vid personlig lämplighet\n\nDet här får du arbeta med\nTolkcentralen är en länsövergripande verksamhet som ingår i verksamhetsområdet LSS-Syn-Hör-Tolk. Tolkcentralen erbjuder hörselskadade, döva, dövblinda samt hörande kostnadsfri tolkservice. Tjänsten är placerad i Luleå men resor i tjänst samt arbete på annan ort förekommer.\nArbetsuppgifterna innefattar skrivtolkning och TSS-tolkning, om du har den utbildningen, till hörselskadade i länet, förbereda tolkuppdrag samt ansvara för teknisk tolkutrustning.Du kommer även arbeta med att informera om tolkverksamheten samt vid behov vara delaktig i övrig verksamhet inom Tolkcentralen. \n\nDet här erbjuder vi dig\n- Utvecklings- och karriärmöjligheter där du får vara med och skapa framtidens hälsa och vård\n- Hälsofrämjande arbetsplatser med tillgång till friskvårdsaktiviteter och friskvårdsbidrag\n- Länk till våra förmåner: https://www.norrbotten.se/sv/Jobb-och-utbildning/Jobba-hos-oss/\nInformation om tjänsten\nTjänsten är en tillsvidareanställning på heltid. Arbetstiden är förlagd på dag- och kvällstid samt helgtjänstgöring förekommer. Tillträde sker enligt överenskommelse. Urval och intervjuer sker löpande och tjänsten kan tillsättas innan sista ansökningsdag.\nRegion Norrbotten tillämpar individuell lönesättning enligt kollektivavtal. \n\nVälkommen med din ansökan!"
      },
      "headline" : "Skrivtolk till Tolkcentralen",
      "driving_license" : null,
      "employer" : {
        "email" : null,
        "phone_number" : null,
        "organization_number" : "2321000230",
        "name" : "REGION NORRBOTTEN",
        "url" : "www.nll.se",
        "workplace" : "Region Norrbotten"
      },
      "removed_date" : null,
      "logo_url" : "https://www.arbetsformedlingen.se/rest/arbetsgivare/rest/af/v3/organisation/2321000230/logotyper/logo.png",
      "last_publication_date" : "2022-09-11T23:59:59",
      "number_of_vacancies" : 1,
      "occupation" : {
        "concept_id" : "fRnA_rcj_eJi",
        "label" : "Skrivtolk/Vuxendövtolk",
        "legacy_ams_taxonomy_id" : "3202"
      },
      "occupation_group" : {
        "concept_id" : "PQDm_Z63_zst",
        "label" : "Översättare, tolkar och lingvister m.fl.",
        "legacy_ams_taxonomy_id" : "2643"
      },
      "employment_type" : {
        "concept_id" : "PFZr_Syz_cUq",
        "label" : "Vanlig anställning",
        "legacy_ams_taxonomy_id" : "1"
      },
      "webpage_url" : "https://arbetsformedlingen.se/platsbanken/annonser/26424248",
      "driving_license_required" : false,
      "application_contacts" : [ {
        "description" : null,
        "email" : "victoria.hedstrom@norrbotten.se",
        "telephone" : "0920-284058",
        "name" : "Victoria Hedström",
        "contact_type" : null
      } ],
      "duration" : {
        "concept_id" : "a7uU_j21_mkL",
        "label" : "Tills vidare",
        "legacy_ams_taxonomy_id" : "1"
      },
      "nice_to_have" : {
        "education_level" : [ ],
        "work_experiences" : [ ],
        "skills" : [ ],
        "education" : [ ],
        "languages" : [ ]
      },
      "application_details" : {
        "via_af" : false,
        "email" : null,
        "other" : null,
        "reference" : "201573",
        "url" : "https://candidate.hr-manager.net/ApplicationInit.aspx?cid=290&ProjectId=201573&DepartmentId=21825&MediaId=5",
        "information" : null
      },
      "source_type" : "VIA_PLATSBANKEN_DXA",
      "application_deadline" : "2022-09-11T23:59:59",
      "external_id" : "46-232100-0230-00159122",
      "workplace_address" : {
        "coordinates" : [ 22.156702, 65.584816 ],
        "city" : null,
        "postcode" : null,
        "municipality" : "Luleå",
        "region_concept_id" : "9hXe_F4g_eTG",
        "region" : "Norrbottens län",
        "country_code" : "199",
        "region_code" : "25",
        "municipality_concept_id" : "CXbY_gui_14v",
        "country_concept_id" : "i46j_HmG_v64",
        "municipality_code" : "2580",
        "street_address" : null,
        "country" : "Sverige"
      },
      "id" : "26424248",
      "experience_required" : true,
      "working_hours_type" : {
        "concept_id" : "6YE1_gAC_R2G",
        "label" : "Heltid",
        "legacy_ams_taxonomy_id" : "1"
      },
      "access" : null,
      "timestamp" : 1660809933696,
      "must_have" : {
        "education_level" : [ ],
        "work_experiences" : [ {
          "concept_id" : "fRnA_rcj_eJi",
          "weight" : 10,
          "label" : "Skrivtolk/Vuxendövtolk",
          "legacy_ams_taxonomy_id" : "3202"
        } ],
        "skills" : [ ],
        "education" : [ ],
        "languages" : [ ]
      },
      "occupation_field" : {
        "concept_id" : "9puE_nYg_crq",
        "label" : "Kultur, media, design",
        "legacy_ams_taxonomy_id" : "11"
      },
      "scope_of_work" : {
        "min" : 100,
        "max" : 100
      },
      "salary_type" : {
        "concept_id" : "oG8G_9cW_nRf",
        "label" : "Fast månads- vecko- eller timlön",
        "legacy_ams_taxonomy_id" : "1"
      },
      "removed" : false,
      "salary_description" : null,
      "access_to_own_car" : false,
      "publication_date" : "2022-08-18T10:05:33"
    },
    "name" : "Skrivtolk till Tolkcentralen",
    "user" : "hannes"
  },
  "sha1" : "8cc781ceee8017991c0fa92b64e9c6e47122c0b6",
  "annotations" : [ {
    "preferred-label" : "Skrivtolk/Vuxendövtolk",
    "sentiment" : "MUST_HAVE",
    "type" : "occupation-name",
    "start-position" : 0,
    "end-position" : 9,
    "concept-id" : "fRnA_rcj_eJi",
    "matched-string" : "skrivtolk",
    "annotation-id" : 0
  }, {
    "preferred-label" : "Skrivtolk/Vuxendövtolk",
    "sentiment" : "MUST_HAVE",
    "type" : "occupation-name",
    "start-position" : 44,
    "end-position" : 53,
    "concept-id" : "fRnA_rcj_eJi",
    "matched-string" : "skrivtolk",
    "annotation-id" : 1
  }, {
    "preferred-label" : "Skrivtolk/Vuxendövtolk",
    "sentiment" : "NOT_RELEVANT",
    "type" : "occupation-name",
    "start-position" : 354,
    "end-position" : 359,
    "concept-id" : "fRnA_rcj_eJi",
    "matched-string" : "skriv",
    "annotation-id" : 10
  }, {
    "preferred-label" : "TSS-tolkning (Tecken som Stöd)",
    "sentiment" : "NOT_RELEVANT",
    "type" : "skill",
    "start-position" : 362,
    "end-position" : 372,
    "concept-id" : "JEkW_rqS_ojk",
    "matched-string" : "TSS-tolkar",
    "annotation-id" : 11
  }, {
    "preferred-label" : "Teckenspråkstolk/Dövblindtolk",
    "sentiment" : "NOT_RELEVANT",
    "type" : "occupation-name",
    "start-position" : 384,
    "end-position" : 412,
    "concept-id" : "aPeE_Gxs_cWJ",
    "matched-string" : "teckenspråks-/dövblindtolkar",
    "annotation-id" : 12
  }, {
    "preferred-label" : "Administratör/Administrativ assistent",
    "sentiment" : "NOT_RELEVANT",
    "type" : "occupation-name",
    "start-position" : 420,
    "end-position" : 433,
    "concept-id" : "s5pR_WNm_R8W",
    "matched-string" : "administratör",
    "annotation-id" : 2
  }, {
    "preferred-label" : "Svenska",
    "sentiment" : "MUST_HAVE",
    "type" : "language",
    "start-position" : 545,
    "end-position" : 552,
    "concept-id" : "zSLA_vw2_FXN",
    "matched-string" : "svenska",
    "annotation-id" : 3
  }, {
    "preferred-label" : "TSS-tolkning (Tecken som Stöd)",
    "sentiment" : "NICE_TO_HAVE",
    "type" : "skill",
    "start-position" : 614,
    "end-position" : 622,
    "concept-id" : "JEkW_rqS_ojk",
    "matched-string" : "TSS-tolk",
    "annotation-id" : 13
  }, {
    "preferred-label" : "Teckenspråkstolk/Dövblindtolk",
    "sentiment" : "NICE_TO_HAVE",
    "type" : "occupation-name",
    "start-position" : 635,
    "end-position" : 664,
    "concept-id" : "aPeE_Gxs_cWJ",
    "matched-string" : "tecken och dövtolksutbildning",
    "annotation-id" : 14
  }, {
    "preferred-label" : "Skrivtolk/Vuxendövtolk",
    "sentiment" : "NICE_TO_HAVE",
    "type" : "occupation-name",
    "start-position" : 684,
    "end-position" : 698,
    "concept-id" : "fRnA_rcj_eJi",
    "matched-string" : "skrivtolkyrket",
    "annotation-id" : 15
  }, {
    "preferred-label" : "arbeta självständigt",
    "sentiment" : "MUST_HAVE",
    "type" : "esco-skill",
    "start-position" : 1048,
    "end-position" : 1073,
    "concept-id" : "NyFu_HHd_zhz",
    "matched-string" : "arbeta både självständigt",
    "annotation-id" : 16
  }, {
    "preferred-label" : "samarbeta med kolleger",
    "sentiment" : "MUST_HAVE",
    "type" : "esco-skill",
    "start-position" : 1078,
    "end-position" : 1102,
    "concept-id" : "X15R_797_q62",
    "matched-string" : "tillsammans med kollegor",
    "annotation-id" : 17
  }, {
    "preferred-label" : "Tolk",
    "sentiment" : "MUST_HAVE",
    "type" : "occupation-name",
    "start-position" : 1275,
    "end-position" : 1279,
    "concept-id" : "vaEY_R9R_LjB",
    "matched-string" : "tolk",
    "annotation-id" : 5
  }, {
    "preferred-label" : "Luleå",
    "sentiment" : "NOT_RELEVANT",
    "type" : "municipality",
    "start-position" : 1396,
    "end-position" : 1401,
    "concept-id" : "CXbY_gui_14v",
    "matched-string" : "Luleå",
    "annotation-id" : 19
  }, {
    "preferred-label" : "Resor i arbetet förekommer",
    "type" : "work-place-environment",
    "start-position" : 1406,
    "end-position" : 1456,
    "concept-id" : "oaM2_JTK_muh",
    "matched-string" : "resor i tjänst samt arbete på annan ort förekommer",
    "annotation-id" : 18
  }, {
    "preferred-label" : "Skrivtolkning",
    "sentiment" : "MUST_HAVE",
    "type" : "skill",
    "start-position" : 1487,
    "end-position" : 1500,
    "concept-id" : "KFyd_zgS_6aw",
    "matched-string" : "skrivtolkning",
    "annotation-id" : 7
  }, {
    "preferred-label" : "TSS-tolkning (Tecken som Stöd)",
    "sentiment" : "MUST_HAVE",
    "type" : "skill",
    "start-position" : 1505,
    "end-position" : 1517,
    "concept-id" : "JEkW_rqS_ojk",
    "matched-string" : "TSS-tolkning",
    "annotation-id" : 20
  }, {
    "preferred-label" : "Friskvård",
    "sentiment" : "OFFERED",
    "type" : "keyword",
    "start-position" : 1934,
    "end-position" : 1976,
    "concept-id" : "yoHe_xjK_qjH",
    "matched-string" : "friskvårdsaktiviteter och friskvårdsbidrag",
    "annotation-id" : 23
  }, {
    "preferred-label" : "Tillsvidareanställning (inkl. eventuell provanställning)",
    "sentiment" : "OFFERED",
    "type" : "employment-type",
    "start-position" : 2107,
    "end-position" : 2129,
    "concept-id" : "kpPX_CNN_gDU",
    "matched-string" : "tillsvidareanställning",
    "annotation-id" : 21
  }, {
    "preferred-label" : "Heltid",
    "sentiment" : "OFFERED",
    "type" : "worktime-extent",
    "start-position" : 2133,
    "end-position" : 2139,
    "concept-id" : "6YE1_gAC_R2G",
    "matched-string" : "heltid",
    "annotation-id" : 22
  }, {
    "preferred-label" : "Kollektivavtal",
    "sentiment" : "OFFERED",
    "type" : "skill",
    "start-position" : 2408,
    "end-position" : 2422,
    "concept-id" : "z7wE_9xb_3jX",
    "matched-string" : "kollektivavtal",
    "annotation-id" : 9
  } ],
  "text" : "Skrivtolk till Tolkcentralen\nÄr du utbildad skrivtolk, har god datavana och intresse för teknikutveckling samt vill ha ett jobb som är varierande och lärorikt? Då är det dig vi söker till Tolkcentralen. Tolkcentralen i Norrbotten utför tolkuppdrag för döva- och hörselskadade i hela länet, antingen på plats eller via distanstolkning. Hos oss finns 4 st skriv & TSS-tolkar, 4 stycken teckenspråks-/dövblindtolkar samt 1 administratör.\n\nVi söker\nVi söker dig som innehar en skrivtolkutbildning samt har god datavana. Du har även goda kunskaper i svenska, i både tal och skrift. Vi ser det som meriterande om du har TSS-tolk utbildning, tecken och dövtolksutbildning samt erfarenhet av skrivtolkyrket. \n\nVi lägger stor vikt vid dina personliga egenskaper. Som person är du flexibel, stabil och serviceinriktad. Du är strukturerad, tar ansvar för dina arbetsuppgifter, ser möjligheter i förändringar och har lätt för att anpassa dig till ändrade omständigheter. Du är en självgående, utåtriktad person som uppskattar mötet med andra människor och kan arbeta både självständigt och tillsammans med kollegor. Stor vikt kommer att läggas vid personlig lämplighet\n\nDet här får du arbeta med\nTolkcentralen är en länsövergripande verksamhet som ingår i verksamhetsområdet LSS-Syn-Hör-Tolk. Tolkcentralen erbjuder hörselskadade, döva, dövblinda samt hörande kostnadsfri tolkservice. Tjänsten är placerad i Luleå men resor i tjänst samt arbete på annan ort förekommer.\nArbetsuppgifterna innefattar skrivtolkning och TSS-tolkning, om du har den utbildningen, till hörselskadade i länet, förbereda tolkuppdrag samt ansvara för teknisk tolkutrustning.Du kommer även arbeta med att informera om tolkverksamheten samt vid behov vara delaktig i övrig verksamhet inom Tolkcentralen. \n\nDet här erbjuder vi dig\n- Utvecklings- och karriärmöjligheter där du får vara med och skapa framtidens hälsa och vård\n- Hälsofrämjande arbetsplatser med tillgång till friskvårdsaktiviteter och friskvårdsbidrag\n- Länk till våra förmåner: https://www.norrbotten.se/sv/Jobb-och-utbildning/Jobba-hos-oss/\nInformation om tjänsten\nTjänsten är en tillsvidareanställning på heltid. Arbetstiden är förlagd på dag- och kvällstid samt helgtjänstgöring förekommer. Tillträde sker enligt överenskommelse. Urval och intervjuer sker löpande och tjänsten kan tillsättas innan sista ansökningsdag.\nRegion Norrbotten tillämpar individuell lönesättning enligt kollektivavtal. \n\nVälkommen med din ansökan!"
}