{
  "meta" : {
    "jobad" : {
      "description" : {
        "requirements" : null,
        "needs" : null,
        "company_information" : null,
        "text_formatted" : "<p>Hej</p><p>vi behöver en pizzabagare som vill jobba heltid.måste ha erfarenhet inom branschen och måste vara van vid stress.</p><p><br></p><p id=\"oppenforalla\">Öppen för alla\nVi fokuserar på din kompetens, inte dina övriga förutsättningar. Vi är öppna för att anpassa rollen eller arbetsplatsen efter dina behov.</p>",
        "conditions" : null,
        "text" : "Hej\nvi behöver en pizzabagare som vill jobba heltid.måste ha erfarenhet inom branschen och måste vara van vid stress.\n\n\nÖppen för alla\nVi fokuserar på din kompetens, inte dina övriga förutsättningar. Vi är öppna för att anpassa rollen eller arbetsplatsen efter dina behov."
      },
      "headline" : "Pizzabagare",
      "driving_license" : null,
      "employer" : {
        "email" : null,
        "phone_number" : null,
        "organization_number" : "5593340986",
        "name" : "La Strada i Filipstad AB",
        "url" : null,
        "workplace" : "La Strada i Filipstad AB"
      },
      "removed_date" : null,
      "logo_url" : null,
      "last_publication_date" : "2022-09-14T00:00:00",
      "number_of_vacancies" : 2,
      "occupation" : {
        "concept_id" : "9YaE_Syg_5ZB",
        "label" : "Pizzabagare",
        "legacy_ams_taxonomy_id" : "5505"
      },
      "occupation_group" : {
        "concept_id" : "a8gg_ktU_w8V",
        "label" : "Pizzabagare m.fl.",
        "legacy_ams_taxonomy_id" : "9411"
      },
      "employment_type" : {
        "concept_id" : "PFZr_Syz_cUq",
        "label" : "Vanlig anställning",
        "legacy_ams_taxonomy_id" : "1"
      },
      "webpage_url" : "https://arbetsformedlingen.se/platsbanken/annonser/26404045",
      "driving_license_required" : false,
      "application_contacts" : [ ],
      "duration" : {
        "concept_id" : "a7uU_j21_mkL",
        "label" : "Tills vidare",
        "legacy_ams_taxonomy_id" : "1"
      },
      "nice_to_have" : {
        "education_level" : [ ],
        "work_experiences" : [ {
          "concept_id" : "9YaE_Syg_5ZB",
          "weight" : 5,
          "label" : "Pizzabagare",
          "legacy_ams_taxonomy_id" : "5505"
        } ],
        "skills" : [ ],
        "education" : [ ],
        "languages" : [ {
          "concept_id" : "zSLA_vw2_FXN",
          "weight" : 5,
          "label" : "Svenska",
          "legacy_ams_taxonomy_id" : "502"
        }, {
          "concept_id" : "NVxJ_hLg_TYS",
          "weight" : 5,
          "label" : "Engelska",
          "legacy_ams_taxonomy_id" : "283"
        }, {
          "concept_id" : "3iEY_RGP_qXq",
          "weight" : 5,
          "label" : "Arabiska",
          "legacy_ams_taxonomy_id" : "247"
        } ]
      },
      "application_details" : {
        "via_af" : false,
        "email" : "wissam29@msn.com",
        "other" : null,
        "reference" : null,
        "url" : null,
        "information" : null
      },
      "source_type" : "VIA_ANNONSERA",
      "application_deadline" : "2022-09-14T00:00:00",
      "external_id" : null,
      "workplace_address" : {
        "coordinates" : [ 14.164731611882795, 59.71282992046742 ],
        "city" : "Filipstad",
        "postcode" : "68230",
        "municipality" : "Filipstad",
        "region_concept_id" : "EVVp_h6U_GSZ",
        "region" : "Värmlands län",
        "country_code" : "199",
        "region_code" : "17",
        "municipality_concept_id" : "UXir_vKD_FuW",
        "country_concept_id" : "i46j_HmG_v64",
        "municipality_code" : "1782",
        "street_address" : "Tegnérgatan 1 C",
        "country" : "Sverige"
      },
      "id" : "26404045",
      "experience_required" : true,
      "working_hours_type" : {
        "concept_id" : "6YE1_gAC_R2G",
        "label" : "Heltid",
        "legacy_ams_taxonomy_id" : "1"
      },
      "access" : null,
      "timestamp" : 1660298465269,
      "must_have" : {
        "education_level" : [ ],
        "work_experiences" : [ ],
        "skills" : [ ],
        "education" : [ ],
        "languages" : [ ]
      },
      "occupation_field" : {
        "concept_id" : "ScKy_FHB_7wT",
        "label" : "Hotell, restaurang, storhushåll",
        "legacy_ams_taxonomy_id" : "7"
      },
      "scope_of_work" : {
        "min" : 0,
        "max" : 100
      },
      "salary_type" : {
        "concept_id" : "oG8G_9cW_nRf",
        "label" : "Fast månads- vecko- eller timlön",
        "legacy_ams_taxonomy_id" : "1"
      },
      "removed" : false,
      "salary_description" : null,
      "access_to_own_car" : false,
      "publication_date" : "2022-08-15T00:00:00"
    },
    "name" : "Pizzabagare",
    "user" : "hannes"
  },
  "sha1" : "2859571d6ca88f9653c08d54e5ddc01a92b3b4a4",
  "annotations" : [ {
    "preferred-label" : "Pizzabagare",
    "sentiment" : "MUST_HAVE",
    "type" : "forecast-occupation",
    "start-position" : 0,
    "end-position" : 11,
    "concept-id" : "SyvN_uBW_USt",
    "matched-string" : "pizzabagare",
    "annotation-id" : 0
  }, {
    "preferred-label" : "Pizzabagare",
    "sentiment" : "MUST_HAVE",
    "type" : "forecast-occupation",
    "start-position" : 30,
    "end-position" : 41,
    "concept-id" : "SyvN_uBW_USt",
    "matched-string" : "pizzabagare",
    "annotation-id" : 1
  }, {
    "preferred-label" : "Heltid",
    "type" : "worktime-extent",
    "start-position" : 57,
    "end-position" : 63,
    "concept-id" : "6YE1_gAC_R2G",
    "matched-string" : "heltid",
    "annotation-id" : 2
  } ],
  "text" : "Pizzabagare\nHej\nvi behöver en pizzabagare som vill jobba heltid.måste ha erfarenhet inom branschen och måste vara van vid stress.\n\n\nÖppen för alla\nVi fokuserar på din kompetens, inte dina övriga förutsättningar. Vi är öppna för att anpassa rollen eller arbetsplatsen efter dina behov."
}