{
  "meta" : {
    "jobad" : {
      "description" : {
        "requirements" : null,
        "needs" : null,
        "company_information" : null,
        "text_formatted" : "Hos oss i den moderna kurorten Ronneby kan du bli delaktig i utvecklingen av ett hållbart samhälle med människan i fokus. Ronneby kommun har ca 30 000 invånare och ligger attraktivt mellan hav och skog. Vi har bra kommunikationer med bil, tåg och flyg.  \n\nInom kommunen jobbar ca 2 500 anställda för att ge bästa möjliga service till våra invånare, besökare och företagare. Vill du bli en av oss?\n\nTycker du om att möta människor i olika livssituationer och vill stödja och motivera personer till förändring och möjlighet till egen försörjning? Vi söker just nu en socialsekreterare till Försörjningsenheten. \n\nPå Försörjningsenheten arbetar vi med att utreda ansökningar om och bedöma rätten till ekonomiskt bistånd enligt Socialtjänstlagen. Vi möter, vägleder och motiverar individer till att nå egen försörjning genom exempelvis arbete eller studier. De senaste åren har det skett en spännande utveckling på enheten genom införandet av RPA, automatiserad handläggning, och ett förändrat arbetssätt. På enheten är vi cirka 14 medarbetare samt teamledare och enhetschef.\n\t\nPå vår enhet jobbar vi med stor kunskap, professionalitet och engagemang. Hos oss är klienten i fokus! Vi arbetar aktivt med att skapa en kultur som tillåter våra medarbetare att utvecklas. Du kommer till en arbetsplats där det är viktigt med goda skratt, utmaningar, nära ledarskap och stöttande kollegor.\n\r\n\r\nARBETSUPPGIFTER\nI rollen som planeringshandläggare möter du klienten för att vägleda och coacha den enskilde till att formulera sina mål samt att nå varaktig försörjning i form av arbete, studier eller annan ersättning. Tillsammans upprättar ni arbetsplaner för att hitta den snabbaste vägen till egen försörjning. I uppdraget ingår att anvisa till kompetenshöjande arbetsmarknadsinsatser för den som har behov av detta.\n\nEn del av uppdraget består i att utreda och bedöma rätten till ekonomiskt bistånd enligt gällande lagstiftning och föreskrifter. Samverkan med andra aktörer, både internt och externt, är en mycket betydelsefull del av uppdraget. I klientarbetet använder vi oss av MI (motiverande samtal). \n \nSom nyanställd hos oss får du en individuellt anpassad introduktion. I ditt dagliga arbete får du stöd av en nära och tillgänglig arbetsledning i form av teamledare och enhetschef. Du erbjuds extern handledning, kompetensutveckling och friskvård på arbetstid.  \n\r\n\r\nKVALIFIKATIONER\nDu är socionom eller har annan högskoleutbildning som arbetsgivaren bedömer som likvärdig. Goda kunskaper i aktuell lagstiftning är meriterande. Du har ett engagemang för uppdraget och bidrar med nytänkande och metodutveckling. Egenskaper som att vara flexibel, ha god samarbetsförmåga och lätt för att bygga relationer är värdefulla i arbetet. Stor vikt kommer att läggas på din personliga lämplighet. \r\n\nÖVRIGT\nVi arbetar för en jämn köns- och åldersfördelning och för etnisk och kulturell mångfald i våra verksamheter. Vi är övertygade om att mångfald leder till utveckling.\n\nFör att kvalitetssäkra rekryteringsprocessen hos Ronneby kommun samt möjliggöra god kommunikation med dig som sökande vill vi att du ansöker via den digitala länken. \n\nTillsättning sker om erforderliga beslut fattas.\n\nVi undanber oss alla erbjudanden om annonserings- och rekryteringshjälp i samband med denna annons.",
        "conditions" : "Heltid. \r\nTillsvidareanställning, tillträde: Enligt överenskommelse .",
        "text" : "Hos oss i den moderna kurorten Ronneby kan du bli delaktig i utvecklingen av ett hållbart samhälle med människan i fokus. Ronneby kommun har ca 30 000 invånare och ligger attraktivt mellan hav och skog. Vi har bra kommunikationer med bil, tåg och flyg.  \n\nInom kommunen jobbar ca 2 500 anställda för att ge bästa möjliga service till våra invånare, besökare och företagare. Vill du bli en av oss?\n\nTycker du om att möta människor i olika livssituationer och vill stödja och motivera personer till förändring och möjlighet till egen försörjning? Vi söker just nu en socialsekreterare till Försörjningsenheten. \n\nPå Försörjningsenheten arbetar vi med att utreda ansökningar om och bedöma rätten till ekonomiskt bistånd enligt Socialtjänstlagen. Vi möter, vägleder och motiverar individer till att nå egen försörjning genom exempelvis arbete eller studier. De senaste åren har det skett en spännande utveckling på enheten genom införandet av RPA, automatiserad handläggning, och ett förändrat arbetssätt. På enheten är vi cirka 14 medarbetare samt teamledare och enhetschef.\n\t\nPå vår enhet jobbar vi med stor kunskap, professionalitet och engagemang. Hos oss är klienten i fokus! Vi arbetar aktivt med att skapa en kultur som tillåter våra medarbetare att utvecklas. Du kommer till en arbetsplats där det är viktigt med goda skratt, utmaningar, nära ledarskap och stöttande kollegor.\n\r\n\r\nARBETSUPPGIFTER\nI rollen som planeringshandläggare möter du klienten för att vägleda och coacha den enskilde till att formulera sina mål samt att nå varaktig försörjning i form av arbete, studier eller annan ersättning. Tillsammans upprättar ni arbetsplaner för att hitta den snabbaste vägen till egen försörjning. I uppdraget ingår att anvisa till kompetenshöjande arbetsmarknadsinsatser för den som har behov av detta.\n\nEn del av uppdraget består i att utreda och bedöma rätten till ekonomiskt bistånd enligt gällande lagstiftning och föreskrifter. Samverkan med andra aktörer, både internt och externt, är en mycket betydelsefull del av uppdraget. I klientarbetet använder vi oss av MI (motiverande samtal). \n \nSom nyanställd hos oss får du en individuellt anpassad introduktion. I ditt dagliga arbete får du stöd av en nära och tillgänglig arbetsledning i form av teamledare och enhetschef. Du erbjuds extern handledning, kompetensutveckling och friskvård på arbetstid.  \n\r\n\r\nKVALIFIKATIONER\nDu är socionom eller har annan högskoleutbildning som arbetsgivaren bedömer som likvärdig. Goda kunskaper i aktuell lagstiftning är meriterande. Du har ett engagemang för uppdraget och bidrar med nytänkande och metodutveckling. Egenskaper som att vara flexibel, ha god samarbetsförmåga och lätt för att bygga relationer är värdefulla i arbetet. Stor vikt kommer att läggas på din personliga lämplighet. \r\n\nÖVRIGT\nVi arbetar för en jämn köns- och åldersfördelning och för etnisk och kulturell mångfald i våra verksamheter. Vi är övertygade om att mångfald leder till utveckling.\n\nFör att kvalitetssäkra rekryteringsprocessen hos Ronneby kommun samt möjliggöra god kommunikation med dig som sökande vill vi att du ansöker via den digitala länken. \n\nTillsättning sker om erforderliga beslut fattas.\n\nVi undanber oss alla erbjudanden om annonserings- och rekryteringshjälp i samband med denna annons."
      },
      "headline" : "Socialsekreterare Försörjningsenheten",
      "driving_license" : null,
      "employer" : {
        "email" : null,
        "phone_number" : null,
        "organization_number" : "2120000837",
        "name" : "Ronneby kommun",
        "url" : null,
        "workplace" : "Ronneby kommun, Individ och familjeomsorg"
      },
      "removed_date" : null,
      "logo_url" : "https://www.arbetsformedlingen.se/rest/arbetsgivare/rest/af/v3/organisation/2120000837/logotyper/logo.png",
      "last_publication_date" : "2022-08-31T23:59:59",
      "number_of_vacancies" : 1,
      "occupation" : {
        "concept_id" : "FwM7_WYB_qgc",
        "label" : "Socialsekreterare",
        "legacy_ams_taxonomy_id" : "5757"
      },
      "occupation_group" : {
        "concept_id" : "pok1_ipJ_yzD",
        "label" : "Socialsekreterare",
        "legacy_ams_taxonomy_id" : "2661"
      },
      "employment_type" : {
        "concept_id" : "PFZr_Syz_cUq",
        "label" : "Vanlig anställning",
        "legacy_ams_taxonomy_id" : "1"
      },
      "webpage_url" : "https://arbetsformedlingen.se/platsbanken/annonser/26367872",
      "driving_license_required" : false,
      "application_contacts" : [ {
        "description" : "Malin Gustafsson",
        "email" : "malin.gustafsson1@ronneby.se",
        "telephone" : "0457-61 83 30",
        "name" : null,
        "contact_type" : "Enhetschef"
      } ],
      "duration" : {
        "concept_id" : "a7uU_j21_mkL",
        "label" : "Tills vidare",
        "legacy_ams_taxonomy_id" : "1"
      },
      "nice_to_have" : {
        "education_level" : [ ],
        "work_experiences" : [ ],
        "skills" : [ ],
        "education" : [ ],
        "languages" : [ ]
      },
      "application_details" : {
        "via_af" : false,
        "email" : null,
        "other" : null,
        "reference" : "A1145685-2022-11",
        "url" : "https://recruit.visma.com/Public/Apply.aspx?guidAssignment=37d00fea-d326-4bb9-8832-f4e59bfea991&publishCode=AMS&TK=0d7c2676-5ead-4977-a0ef-099f575e2cb4",
        "information" : null
      },
      "source_type" : "VIA_PLATSBANKEN_DXA",
      "application_deadline" : "2022-08-31T23:59:59",
      "external_id" : "46-212000-0837-37D00FEAD3264BB98832F4E59BFEA991",
      "workplace_address" : {
        "coordinates" : [ 15.276023, 56.210434 ],
        "city" : null,
        "postcode" : null,
        "municipality" : "Ronneby",
        "region_concept_id" : "DQZd_uYs_oKb",
        "region" : "Blekinge län",
        "country_code" : "199",
        "region_code" : "10",
        "municipality_concept_id" : "vH8x_gVz_z7R",
        "country_concept_id" : "i46j_HmG_v64",
        "municipality_code" : "1081",
        "street_address" : null,
        "country" : "Sverige"
      },
      "id" : "26367872",
      "experience_required" : true,
      "working_hours_type" : {
        "concept_id" : "6YE1_gAC_R2G",
        "label" : "Heltid",
        "legacy_ams_taxonomy_id" : "1"
      },
      "access" : null,
      "timestamp" : 1659352823825,
      "must_have" : {
        "education_level" : [ ],
        "work_experiences" : [ {
          "concept_id" : "FwM7_WYB_qgc",
          "weight" : 10,
          "label" : "Socialsekreterare",
          "legacy_ams_taxonomy_id" : "5757"
        } ],
        "skills" : [ ],
        "education" : [ ],
        "languages" : [ ]
      },
      "occupation_field" : {
        "concept_id" : "GazW_2TU_kJw",
        "label" : "Yrken med social inriktning",
        "legacy_ams_taxonomy_id" : "16"
      },
      "scope_of_work" : {
        "min" : 100,
        "max" : 100
      },
      "salary_type" : {
        "concept_id" : "oG8G_9cW_nRf",
        "label" : "Fast månads- vecko- eller timlön",
        "legacy_ams_taxonomy_id" : "1"
      },
      "removed" : false,
      "salary_description" : "Enligt avtal.",
      "access_to_own_car" : false,
      "publication_date" : "2022-08-03T00:00:00"
    },
    "name" : "Socialsekreterare Försörjningsenheten",
    "user" : "kristof.fischer"
  },
  "sha1" : "143745191cf50903b4a688abf32f779801c15e25",
  "annotations" : [ {
    "preferred-label" : "Socialsekreterare",
    "sentiment" : "MUST_HAVE",
    "type" : "occupation-name",
    "start-position" : 0,
    "end-position" : 17,
    "concept-id" : "FwM7_WYB_qgc",
    "matched-string" : "socialsekreterare",
    "annotation-id" : 0
  }, {
    "preferred-label" : "Ronneby",
    "type" : "municipality",
    "start-position" : 69,
    "end-position" : 76,
    "concept-id" : "vH8x_gVz_z7R",
    "matched-string" : "Ronneby",
    "annotation-id" : 8
  }, {
    "preferred-label" : "Ronneby",
    "type" : "municipality",
    "start-position" : 160,
    "end-position" : 167,
    "concept-id" : "vH8x_gVz_z7R",
    "matched-string" : "Ronneby",
    "annotation-id" : 9
  }, {
    "preferred-label" : "Socialsekreterare",
    "sentiment" : "MUST_HAVE",
    "type" : "occupation-name",
    "start-position" : 603,
    "end-position" : 620,
    "concept-id" : "FwM7_WYB_qgc",
    "matched-string" : "socialsekreterare",
    "annotation-id" : 2
  }, {
    "preferred-label" : "Teamledare",
    "sentiment" : "MUST_HAVE",
    "type" : "occupation-name",
    "start-position" : 1083,
    "end-position" : 1093,
    "concept-id" : "FC86_VDF_rqB",
    "matched-string" : "teamledare",
    "annotation-id" : 3
  }, {
    "preferred-label" : "Enhetschef inom socialtjänst",
    "type" : "occupation-name",
    "start-position" : 1098,
    "end-position" : 1108,
    "concept-id" : "CnYS_d4N_CZJ",
    "matched-string" : "enhetschef",
    "annotation-id" : 10
  }, {
    "preferred-label" : "Biståndsbedömning",
    "sentiment" : "MUST_HAVE",
    "type" : "skill",
    "start-position" : 1878,
    "end-position" : 1926,
    "concept-id" : "C7Ni_3MM_YQD",
    "matched-string" : "utreda och bedöma rätten till ekonomiskt bistånd",
    "annotation-id" : 11
  }, {
    "preferred-label" : "Motiverande samtal",
    "sentiment" : "MUST_HAVE",
    "type" : "skill",
    "start-position" : 2113,
    "end-position" : 2131,
    "concept-id" : "E7QH_Hnd_BAC",
    "matched-string" : "motiverande samtal",
    "annotation-id" : 4
  }, {
    "preferred-label" : "Teamledare",
    "sentiment" : "MUST_HAVE",
    "type" : "occupation-name",
    "start-position" : 2291,
    "end-position" : 2301,
    "concept-id" : "FC86_VDF_rqB",
    "matched-string" : "teamledare",
    "annotation-id" : 5
  }, {
    "preferred-label" : "Enhetschef inom socialtjänst",
    "type" : "occupation-name",
    "start-position" : 2306,
    "end-position" : 2316,
    "concept-id" : "CnYS_d4N_CZJ",
    "matched-string" : "enhetschef",
    "annotation-id" : 12
  }, {
    "preferred-label" : "Socionom",
    "sentiment" : "MUST_HAVE",
    "type" : "occupation-name",
    "start-position" : 2425,
    "end-position" : 2433,
    "concept-id" : "aEF1_qeh_5Qe",
    "matched-string" : "socionom",
    "annotation-id" : 7
  }, {
    "preferred-label" : "Universitets- eller högskoleutbildning",
    "sentiment" : "MUST_HAVE",
    "type" : "sni-level-4",
    "start-position" : 2444,
    "end-position" : 2468,
    "concept-id" : "m1vC_Ssq_5Y7",
    "matched-string" : "annan högskoleutbildning",
    "annotation-id" : 13
  }, {
    "preferred-label" : null,
    "sentiment" : "NICE_TO_HAVE",
    "type" : "skill",
    "start-position" : 2510,
    "end-position" : 2547,
    "concept-id" : null,
    "matched-string" : "Goda kunskaper i aktuell lagstiftning",
    "annotation-id" : 14
  }, {
    "preferred-label" : "samarbeta med kolleger",
    "sentiment" : "MUST_HAVE",
    "type" : "esco-skill",
    "start-position" : 2684,
    "end-position" : 2704,
    "concept-id" : "X15R_797_q62",
    "matched-string" : "god samarbetsförmåga",
    "annotation-id" : 15
  }, {
    "preferred-label" : "upprätthålla arbetsmässiga relationer",
    "sentiment" : "MUST_HAVE",
    "type" : "esco-skill",
    "start-position" : 2722,
    "end-position" : 2738,
    "concept-id" : "FSSe_5dD_kXc",
    "matched-string" : "bygga relationer",
    "annotation-id" : 16
  }, {
    "preferred-label" : "Ronneby",
    "type" : "municipality",
    "start-position" : 3047,
    "end-position" : 3054,
    "concept-id" : "vH8x_gVz_z7R",
    "matched-string" : "Ronneby",
    "annotation-id" : 17
  }, {
    "preferred-label" : "kommunikation",
    "sentiment" : "MUST_HAVE",
    "type" : "esco-skill",
    "start-position" : 3078,
    "end-position" : 3095,
    "concept-id" : "ahPU_HgE_Jeb",
    "matched-string" : "god kommunikation",
    "annotation-id" : 18
  } ],
  "text" : "Socialsekreterare Försörjningsenheten\nHos oss i den moderna kurorten Ronneby kan du bli delaktig i utvecklingen av ett hållbart samhälle med människan i fokus. Ronneby kommun har ca 30 000 invånare och ligger attraktivt mellan hav och skog. Vi har bra kommunikationer med bil, tåg och flyg.  \n\nInom kommunen jobbar ca 2 500 anställda för att ge bästa möjliga service till våra invånare, besökare och företagare. Vill du bli en av oss?\n\nTycker du om att möta människor i olika livssituationer och vill stödja och motivera personer till förändring och möjlighet till egen försörjning? Vi söker just nu en socialsekreterare till Försörjningsenheten. \n\nPå Försörjningsenheten arbetar vi med att utreda ansökningar om och bedöma rätten till ekonomiskt bistånd enligt Socialtjänstlagen. Vi möter, vägleder och motiverar individer till att nå egen försörjning genom exempelvis arbete eller studier. De senaste åren har det skett en spännande utveckling på enheten genom införandet av RPA, automatiserad handläggning, och ett förändrat arbetssätt. På enheten är vi cirka 14 medarbetare samt teamledare och enhetschef.\n\t\nPå vår enhet jobbar vi med stor kunskap, professionalitet och engagemang. Hos oss är klienten i fokus! Vi arbetar aktivt med att skapa en kultur som tillåter våra medarbetare att utvecklas. Du kommer till en arbetsplats där det är viktigt med goda skratt, utmaningar, nära ledarskap och stöttande kollegor.\n\r\n\r\nARBETSUPPGIFTER\nI rollen som planeringshandläggare möter du klienten för att vägleda och coacha den enskilde till att formulera sina mål samt att nå varaktig försörjning i form av arbete, studier eller annan ersättning. Tillsammans upprättar ni arbetsplaner för att hitta den snabbaste vägen till egen försörjning. I uppdraget ingår att anvisa till kompetenshöjande arbetsmarknadsinsatser för den som har behov av detta.\n\nEn del av uppdraget består i att utreda och bedöma rätten till ekonomiskt bistånd enligt gällande lagstiftning och föreskrifter. Samverkan med andra aktörer, både internt och externt, är en mycket betydelsefull del av uppdraget. I klientarbetet använder vi oss av MI (motiverande samtal). \n \nSom nyanställd hos oss får du en individuellt anpassad introduktion. I ditt dagliga arbete får du stöd av en nära och tillgänglig arbetsledning i form av teamledare och enhetschef. Du erbjuds extern handledning, kompetensutveckling och friskvård på arbetstid.  \n\r\n\r\nKVALIFIKATIONER\nDu är socionom eller har annan högskoleutbildning som arbetsgivaren bedömer som likvärdig. Goda kunskaper i aktuell lagstiftning är meriterande. Du har ett engagemang för uppdraget och bidrar med nytänkande och metodutveckling. Egenskaper som att vara flexibel, ha god samarbetsförmåga och lätt för att bygga relationer är värdefulla i arbetet. Stor vikt kommer att läggas på din personliga lämplighet. \r\n\nÖVRIGT\nVi arbetar för en jämn köns- och åldersfördelning och för etnisk och kulturell mångfald i våra verksamheter. Vi är övertygade om att mångfald leder till utveckling.\n\nFör att kvalitetssäkra rekryteringsprocessen hos Ronneby kommun samt möjliggöra god kommunikation med dig som sökande vill vi att du ansöker via den digitala länken. \n\nTillsättning sker om erforderliga beslut fattas.\n\nVi undanber oss alla erbjudanden om annonserings- och rekryteringshjälp i samband med denna annons."
}