{
  "meta" : {
    "jobad" : {
      "description" : {
        "requirements" : null,
        "needs" : null,
        "company_information" : null,
        "text_formatted" : "Nordic Retail Group söker efter de bästa butiksambassadörerna för Asics. Vi är ute efter en säljare som har ett stort intresse för sport, gärna löpning och skor.\n\nAsics är en japansk tillverkare av sportkläder och sportskor. De grundades 1940 och namnet är en akronym för Anima Sana In Corpore Sano som är en variant på mens sana in corpore sano, det vill säga \"en sund själ i en sund kropp\".\n\nDin erfarenhet:\n\n- Erfarenhet av detaljhandeln och försäljning\n- Van att möta människor och kunna hantera olika typer av personer\n- Fördel om du har erfarenhet/intresse av löpning och träning över lag\n\n\nPersonliga egenskaper:\n\nSom butiksambassadör för Asics så tror vi att du är:\n\n- En universitetsstudent\n- Flexibel och lättsam\n- Social och framåt med egen initiativförmåga\n\n\nArbetstider\n\n-  Lördag (6 timmars skift)\n-  Söndag (6 timmars skift)\n\n\nÖvrigt:\n\nDu blir anställd av Nordic Retail Group och representerar Asics i butik.\n\nUrval sker löpande så skicka in din ansökan redan idag. Planerad start är 20 augusti, men dessförinnan sker introduktion och utbildning den veckan. Om du har några frågor om tjänsten, vänligen kontakta Adiam Araya på: araya@nordicretailgroup.com\n\nOm Nordic Retail Group\n\nNordic Retail Group är en fullservice retail byrå, som grundades 1997 och finns idag lokalt representerade i alla fyra nordiska länder. Vi fokuserar på att hjälpa våra kunder att bygga sina varumärken och nå sina mål genom att erbjuda bemanning, rekrytering, creative studio, och andra innovativa uppfinningar för våra kunder. Vi har byggt ett starkt team och vi vet vad som krävs för ett varumärke att lyckas inom retail och hur man ökar försäljning både lokalt och globalt.\n\nPå Nordic Retail Group har vi ett arbetsklimat som är kreativt och energiskt och vi är alltid ivriga att göra det lilla extra för att lyckas. Vi har verkligen passion för människor och det är därför det är viktigt för oss att erbjuda den mest säkra, inkluderande och inspirerande arbetsplatsen vi kan för våra fantastiska medarbetare.\n\nVi värdesätter högt att ha ett mångsidigt team med olika typer av erfarenheter och bakgrunder som ingår i gruppen. Det är viktigt för oss att alla känner sig värderade, uppskattade och som en viktig del av vårt team. Det viktigaste är att vi vill att vår personal ska älska att komma till jobbet. Som våra grundare alltid säger: “Du ska inte bara vissla på väg hem från kontoret - utan också på väg till kontoret”.\n\nBesök vår hemsida www.nordicretailgroup.com (http://www.nordicretailgroup.com/) för mer information.",
        "conditions" : "Deltid\r\nAnställningstid enligt överenskommelse",
        "text" : "Nordic Retail Group söker efter de bästa butiksambassadörerna för Asics. Vi är ute efter en säljare som har ett stort intresse för sport, gärna löpning och skor.\n\nAsics är en japansk tillverkare av sportkläder och sportskor. De grundades 1940 och namnet är en akronym för Anima Sana In Corpore Sano som är en variant på mens sana in corpore sano, det vill säga \"en sund själ i en sund kropp\".\n\nDin erfarenhet:\n\n- Erfarenhet av detaljhandeln och försäljning\n- Van att möta människor och kunna hantera olika typer av personer\n- Fördel om du har erfarenhet/intresse av löpning och träning över lag\n\n\nPersonliga egenskaper:\n\nSom butiksambassadör för Asics så tror vi att du är:\n\n- En universitetsstudent\n- Flexibel och lättsam\n- Social och framåt med egen initiativförmåga\n\n\nArbetstider\n\n-  Lördag (6 timmars skift)\n-  Söndag (6 timmars skift)\n\n\nÖvrigt:\n\nDu blir anställd av Nordic Retail Group och representerar Asics i butik.\n\nUrval sker löpande så skicka in din ansökan redan idag. Planerad start är 20 augusti, men dessförinnan sker introduktion och utbildning den veckan. Om du har några frågor om tjänsten, vänligen kontakta Adiam Araya på: araya@nordicretailgroup.com\n\nOm Nordic Retail Group\n\nNordic Retail Group är en fullservice retail byrå, som grundades 1997 och finns idag lokalt representerade i alla fyra nordiska länder. Vi fokuserar på att hjälpa våra kunder att bygga sina varumärken och nå sina mål genom att erbjuda bemanning, rekrytering, creative studio, och andra innovativa uppfinningar för våra kunder. Vi har byggt ett starkt team och vi vet vad som krävs för ett varumärke att lyckas inom retail och hur man ökar försäljning både lokalt och globalt.\n\nPå Nordic Retail Group har vi ett arbetsklimat som är kreativt och energiskt och vi är alltid ivriga att göra det lilla extra för att lyckas. Vi har verkligen passion för människor och det är därför det är viktigt för oss att erbjuda den mest säkra, inkluderande och inspirerande arbetsplatsen vi kan för våra fantastiska medarbetare.\n\nVi värdesätter högt att ha ett mångsidigt team med olika typer av erfarenheter och bakgrunder som ingår i gruppen. Det är viktigt för oss att alla känner sig värderade, uppskattade och som en viktig del av vårt team. Det viktigaste är att vi vill att vår personal ska älska att komma till jobbet. Som våra grundare alltid säger: “Du ska inte bara vissla på väg hem från kontoret - utan också på väg till kontoret”.\n\nBesök vår hemsida www.nordicretailgroup.com (http://www.nordicretailgroup.com/) för mer information."
      },
      "headline" : "Butiksambassadör för Asics på deltid - Helsingborg",
      "driving_license" : null,
      "employer" : {
        "email" : null,
        "phone_number" : null,
        "organization_number" : "5566119474",
        "name" : "NRG Sweden AB",
        "url" : "http://nordicretailgroup.com/",
        "workplace" : "Nordic Retail Group "
      },
      "removed_date" : null,
      "logo_url" : null,
      "last_publication_date" : "2022-08-08T23:59:59",
      "number_of_vacancies" : 1,
      "occupation" : {
        "concept_id" : "NP4b_8RE_Egp",
        "label" : "Butiksdemonstratör",
        "legacy_ams_taxonomy_id" : "2289"
      },
      "occupation_group" : {
        "concept_id" : "NCeZ_rSk_B4D",
        "label" : "Eventsäljare och butiksdemonstratörer m.fl.",
        "legacy_ams_taxonomy_id" : "5241"
      },
      "employment_type" : {
        "concept_id" : "PFZr_Syz_cUq",
        "label" : "Vanlig anställning",
        "legacy_ams_taxonomy_id" : "1"
      },
      "webpage_url" : "https://arbetsformedlingen.se/platsbanken/annonser/26331788",
      "driving_license_required" : false,
      "application_contacts" : [ {
        "description" : "Lovisa Tengnér",
        "email" : "tengner@nordicretailgroup.com",
        "telephone" : null,
        "name" : null,
        "contact_type" : null
      } ],
      "duration" : {
        "concept_id" : "Sy9J_aRd_ALx",
        "label" : "11 dagar - upp till 3 månader",
        "legacy_ams_taxonomy_id" : "7"
      },
      "nice_to_have" : {
        "education_level" : [ ],
        "work_experiences" : [ ],
        "skills" : [ ],
        "education" : [ ],
        "languages" : [ ]
      },
      "application_details" : {
        "via_af" : false,
        "email" : null,
        "other" : null,
        "reference" : null,
        "url" : "https://career.nordicretailgroup.com/jobs/1861415-butiksambassador-for-asics-pa-deltid-helsingborg?promotion=433034-arbetsformedlingen",
        "information" : null
      },
      "source_type" : "VIA_PLATSBANKEN_DXA",
      "application_deadline" : "2022-08-08T23:59:59",
      "external_id" : "46-556611-9474-1861415-9",
      "workplace_address" : {
        "coordinates" : [ 12.694512, 56.046467 ],
        "city" : null,
        "postcode" : null,
        "municipality" : "Helsingborg",
        "region_concept_id" : "CaRE_1nn_cSU",
        "region" : "Skåne län",
        "country_code" : "199",
        "region_code" : "12",
        "municipality_concept_id" : "qj3q_oXH_MGR",
        "country_concept_id" : "i46j_HmG_v64",
        "municipality_code" : "1283",
        "street_address" : null,
        "country" : "Sverige"
      },
      "id" : "26331788",
      "experience_required" : true,
      "working_hours_type" : {
        "concept_id" : "947z_JGS_Uk2",
        "label" : "Deltid",
        "legacy_ams_taxonomy_id" : "2"
      },
      "access" : null,
      "timestamp" : 1657888940799,
      "must_have" : {
        "education_level" : [ ],
        "work_experiences" : [ {
          "concept_id" : "NP4b_8RE_Egp",
          "weight" : 10,
          "label" : "Butiksdemonstratör",
          "legacy_ams_taxonomy_id" : "2289"
        } ],
        "skills" : [ ],
        "education" : [ ],
        "languages" : [ ]
      },
      "occupation_field" : {
        "concept_id" : "RPTn_bxG_ExZ",
        "label" : "Försäljning, inköp, marknadsföring",
        "legacy_ams_taxonomy_id" : "5"
      },
      "scope_of_work" : {
        "min" : 0,
        "max" : 100
      },
      "salary_type" : {
        "concept_id" : "oG8G_9cW_nRf",
        "label" : "Fast månads- vecko- eller timlön",
        "legacy_ams_taxonomy_id" : "1"
      },
      "removed" : false,
      "salary_description" : "Lön enligt överenskommelse",
      "access_to_own_car" : false,
      "publication_date" : "2022-07-15T14:42:20"
    },
    "name" : "Butiksambassadör för Asics på deltid - Helsingborg",
    "user" : "hannes"
  },
  "sha1" : "be9a4117aff0d502704ea0e6efcc165904ed1fc8",
  "annotations" : [ {
    "preferred-label" : "Deltid",
    "type" : "worktime-extent",
    "start-position" : 30,
    "end-position" : 36,
    "concept-id" : "947z_JGS_Uk2",
    "matched-string" : "deltid",
    "annotation-id" : 9
  }, {
    "preferred-label" : "Helsingborg",
    "type" : "municipality",
    "start-position" : 39,
    "end-position" : 50,
    "concept-id" : "qj3q_oXH_MGR",
    "matched-string" : "Helsingborg",
    "annotation-id" : 10
  }, {
    "preferred-label" : "Säljare",
    "sentiment" : "MUST_HAVE",
    "type" : "keyword",
    "start-position" : 143,
    "end-position" : 150,
    "concept-id" : "rDcj_Tao_TJJ",
    "matched-string" : "säljare",
    "annotation-id" : 0
  }, {
    "preferred-label" : "Sport",
    "sentiment" : "MUST_HAVE",
    "type" : "keyword",
    "start-position" : 182,
    "end-position" : 187,
    "concept-id" : "oiV9_drz_NYC",
    "matched-string" : "sport",
    "annotation-id" : 1
  }, {
    "preferred-label" : "Skor",
    "sentiment" : "MUST_HAVE",
    "type" : "skill",
    "start-position" : 207,
    "end-position" : 211,
    "concept-id" : "5TwE_JEt_pWX",
    "matched-string" : "skor",
    "annotation-id" : 2
  }, {
    "preferred-label" : "Träning",
    "sentiment" : "MUST_HAVE",
    "type" : "keyword",
    "start-position" : 629,
    "end-position" : 636,
    "concept-id" : "n19Z_hzx_Apu",
    "matched-string" : "träning",
    "annotation-id" : 3
  }, {
    "preferred-label" : "Butik",
    "sentiment" : "MUST_HAVE",
    "type" : "keyword",
    "start-position" : 968,
    "end-position" : 973,
    "concept-id" : "xLsd_zjY_5wr",
    "matched-string" : "butik",
    "annotation-id" : 4
  }, {
    "preferred-label" : "Object Component Model/COM",
    "sentiment" : "MUST_HAVE",
    "type" : "skill",
    "start-position" : 1218,
    "end-position" : 1221,
    "concept-id" : "Np6W_aQg_Rkn",
    "matched-string" : "com",
    "annotation-id" : 5
  }, {
    "preferred-label" : "Personal",
    "sentiment" : "MUST_HAVE",
    "type" : "keyword",
    "start-position" : 2315,
    "end-position" : 2323,
    "concept-id" : "HVxM_6MS_y1c",
    "matched-string" : "personal",
    "annotation-id" : 6
  } ],
  "text" : "Butiksambassadör för Asics på deltid - Helsingborg\nNordic Retail Group söker efter de bästa butiksambassadörerna för Asics. Vi är ute efter en säljare som har ett stort intresse för sport, gärna löpning och skor.\n\nAsics är en japansk tillverkare av sportkläder och sportskor. De grundades 1940 och namnet är en akronym för Anima Sana In Corpore Sano som är en variant på mens sana in corpore sano, det vill säga \"en sund själ i en sund kropp\".\n\nDin erfarenhet:\n\n- Erfarenhet av detaljhandeln och försäljning\n- Van att möta människor och kunna hantera olika typer av personer\n- Fördel om du har erfarenhet/intresse av löpning och träning över lag\n\n\nPersonliga egenskaper:\n\nSom butiksambassadör för Asics så tror vi att du är:\n\n- En universitetsstudent\n- Flexibel och lättsam\n- Social och framåt med egen initiativförmåga\n\n\nArbetstider\n\n-  Lördag (6 timmars skift)\n-  Söndag (6 timmars skift)\n\n\nÖvrigt:\n\nDu blir anställd av Nordic Retail Group och representerar Asics i butik.\n\nUrval sker löpande så skicka in din ansökan redan idag. Planerad start är 20 augusti, men dessförinnan sker introduktion och utbildning den veckan. Om du har några frågor om tjänsten, vänligen kontakta Adiam Araya på: araya@nordicretailgroup.com\n\nOm Nordic Retail Group\n\nNordic Retail Group är en fullservice retail byrå, som grundades 1997 och finns idag lokalt representerade i alla fyra nordiska länder. Vi fokuserar på att hjälpa våra kunder att bygga sina varumärken och nå sina mål genom att erbjuda bemanning, rekrytering, creative studio, och andra innovativa uppfinningar för våra kunder. Vi har byggt ett starkt team och vi vet vad som krävs för ett varumärke att lyckas inom retail och hur man ökar försäljning både lokalt och globalt.\n\nPå Nordic Retail Group har vi ett arbetsklimat som är kreativt och energiskt och vi är alltid ivriga att göra det lilla extra för att lyckas. Vi har verkligen passion för människor och det är därför det är viktigt för oss att erbjuda den mest säkra, inkluderande och inspirerande arbetsplatsen vi kan för våra fantastiska medarbetare.\n\nVi värdesätter högt att ha ett mångsidigt team med olika typer av erfarenheter och bakgrunder som ingår i gruppen. Det är viktigt för oss att alla känner sig värderade, uppskattade och som en viktig del av vårt team. Det viktigaste är att vi vill att vår personal ska älska att komma till jobbet. Som våra grundare alltid säger: “Du ska inte bara vissla på väg hem från kontoret - utan också på väg till kontoret”.\n\nBesök vår hemsida www.nordicretailgroup.com (http://www.nordicretailgroup.com/) för mer information."
}