{
  "meta" : {
    "jobad" : {
      "description" : {
        "requirements" : null,
        "needs" : null,
        "company_information" : null,
        "text_formatted" : "At Park och Elite Park Avenues konferens- och festvåning är mötesplatser för såväl göteborgare som konferens- och hotellgäster. Välbesökt lunch, à la carte, stora konferensmåltider, galamiddagar, brunch, room service och pianobar är några av de produkter som du som kock ska leverera till. Med ett varierat och högkvalitativt utbud av produkter lyckas vi möta de höga förväntningar våra gäster har på oss, lika viktigt i det lilla sammanhanget som till den stora gruppen. Ambitionen i köket är hög och kräver ständig utveckling av såväl menyer som koncept. Vi söker dig som antingen vill arbeta hos oss under sommaren eller på mer permanent basis och vill aktivt delta i att utveckla våra produkter.\n\nDu gillar att ha högt ställda krav på dig och är en kollega som håller humöret och lagandan uppe när tempot är högt. Du är mån om detaljer och jämn kvalitet och förstår vikten av att tänka hållbarhet i såväl ditt sätt att arbeta som val av råvaror.\n\nVi kan erbjuda en arbetsplats att utvecklas på, där du tillsammans med oss kan arbeta både dag och kväll, lunch, a la carte eller större middagar oavsett konferensgrupper eller krävande högtidliga middagssällskap. Möjligheterna är stora att växa tillsammans med oss.\n\nVälkommen med din ansökan. Urval kommer ske löpande, vi rekommenderar därför att du inte väntar med din ansökan!\n\n\n\nVi ser framemot att höra från dig!",
        "conditions" : "Heltid\r\nAnställningstid enligt överenskommelse",
        "text" : "At Park och Elite Park Avenues konferens- och festvåning är mötesplatser för såväl göteborgare som konferens- och hotellgäster. Välbesökt lunch, à la carte, stora konferensmåltider, galamiddagar, brunch, room service och pianobar är några av de produkter som du som kock ska leverera till. Med ett varierat och högkvalitativt utbud av produkter lyckas vi möta de höga förväntningar våra gäster har på oss, lika viktigt i det lilla sammanhanget som till den stora gruppen. Ambitionen i köket är hög och kräver ständig utveckling av såväl menyer som koncept. Vi söker dig som antingen vill arbeta hos oss under sommaren eller på mer permanent basis och vill aktivt delta i att utveckla våra produkter.\n\nDu gillar att ha högt ställda krav på dig och är en kollega som håller humöret och lagandan uppe när tempot är högt. Du är mån om detaljer och jämn kvalitet och förstår vikten av att tänka hållbarhet i såväl ditt sätt att arbeta som val av råvaror.\n\nVi kan erbjuda en arbetsplats att utvecklas på, där du tillsammans med oss kan arbeta både dag och kväll, lunch, a la carte eller större middagar oavsett konferensgrupper eller krävande högtidliga middagssällskap. Möjligheterna är stora att växa tillsammans med oss.\n\nVälkommen med din ansökan. Urval kommer ske löpande, vi rekommenderar därför att du inte väntar med din ansökan!\n\n\n\nVi ser framemot att höra från dig!"
      },
      "headline" : "Kockar till At Park och festvåning på Elite Park Avenue",
      "driving_license" : null,
      "employer" : {
        "email" : null,
        "phone_number" : null,
        "organization_number" : "5562485259",
        "name" : "Elite Hotels Of Sweden AB",
        "url" : "https://www.elite.se/sv/",
        "workplace" : "Elite Hotels"
      },
      "removed_date" : null,
      "logo_url" : "https://www.arbetsformedlingen.se/rest/arbetsgivare/rest/af/v3/organisation/5562485259/logotyper/logo.png",
      "last_publication_date" : "2022-12-14T23:59:59",
      "number_of_vacancies" : 1,
      "occupation" : {
        "concept_id" : "JbJw_as4_S93",
        "label" : "Kock, à la carte",
        "legacy_ams_taxonomy_id" : "7663"
      },
      "occupation_group" : {
        "concept_id" : "BStc_SJh_DKG",
        "label" : "Kockar och kallskänkor",
        "legacy_ams_taxonomy_id" : "5120"
      },
      "employment_type" : {
        "concept_id" : "PFZr_Syz_cUq",
        "label" : "Vanlig anställning",
        "legacy_ams_taxonomy_id" : "1"
      },
      "webpage_url" : "https://arbetsformedlingen.se/platsbanken/annonser/26263225",
      "driving_license_required" : false,
      "application_contacts" : [ {
        "description" : "camilla.nyman@elite.se",
        "email" : "camilla.nyman@elite.se",
        "telephone" : null,
        "name" : null,
        "contact_type" : null
      } ],
      "duration" : {
        "concept_id" : "a7uU_j21_mkL",
        "label" : "Tills vidare",
        "legacy_ams_taxonomy_id" : "1"
      },
      "nice_to_have" : {
        "education_level" : [ ],
        "work_experiences" : [ ],
        "skills" : [ ],
        "education" : [ ],
        "languages" : [ ]
      },
      "application_details" : {
        "via_af" : false,
        "email" : null,
        "other" : null,
        "reference" : null,
        "url" : "https://elitehotels.teamtailor.com/jobs/1719348-kockar-till-at-park-och-festvaning-pa-elite-park-avenue?promotion=438090-arbetsformedlingen",
        "information" : null
      },
      "source_type" : "VIA_PLATSBANKEN_DXA",
      "application_deadline" : "2022-12-14T23:59:59",
      "external_id" : "46-556248-5259-1719348-1",
      "workplace_address" : {
        "coordinates" : [ 11.97456, 57.70887 ],
        "city" : null,
        "postcode" : null,
        "municipality" : "Göteborg",
        "region_concept_id" : "zdoY_6u5_Krt",
        "region" : "Västra Götalands län",
        "country_code" : "199",
        "region_code" : "14",
        "municipality_concept_id" : "PVZL_BQT_XtL",
        "country_concept_id" : "i46j_HmG_v64",
        "municipality_code" : "1480",
        "street_address" : null,
        "country" : "Sverige"
      },
      "id" : "26263225",
      "experience_required" : true,
      "working_hours_type" : {
        "concept_id" : "6YE1_gAC_R2G",
        "label" : "Heltid",
        "legacy_ams_taxonomy_id" : "1"
      },
      "access" : null,
      "timestamp" : 1656337255149,
      "must_have" : {
        "education_level" : [ ],
        "work_experiences" : [ {
          "concept_id" : "JbJw_as4_S93",
          "weight" : 10,
          "label" : "Kock, à la carte",
          "legacy_ams_taxonomy_id" : "7663"
        } ],
        "skills" : [ ],
        "education" : [ ],
        "languages" : [ ]
      },
      "occupation_field" : {
        "concept_id" : "ScKy_FHB_7wT",
        "label" : "Hotell, restaurang, storhushåll",
        "legacy_ams_taxonomy_id" : "7"
      },
      "scope_of_work" : {
        "min" : 100,
        "max" : 100
      },
      "salary_type" : {
        "concept_id" : "oG8G_9cW_nRf",
        "label" : "Fast månads- vecko- eller timlön",
        "legacy_ams_taxonomy_id" : "1"
      },
      "removed" : false,
      "salary_description" : "Lön enligt överenskommelse",
      "access_to_own_car" : false,
      "publication_date" : "2022-06-27T15:40:55"
    },
    "name" : "Kockar till At Park och festvåning på Elite Park Avenue",
    "user" : "hannes"
  },
  "sha1" : "ef1af4bbc7a815ac510fdfb8574350f26f8e7cfb",
  "annotations" : [ {
    "preferred-label" : "Kock",
    "type" : "keyword",
    "start-position" : 0,
    "end-position" : 6,
    "concept-id" : "RTQf_1Qm_YhD",
    "matched-string" : "Kockar",
    "annotation-id" : 2
  }, {
    "preferred-label" : "Konferensservice",
    "type" : "skill",
    "start-position" : 87,
    "end-position" : 96,
    "concept-id" : "H73b_dCy_CTT",
    "matched-string" : "konferens",
    "annotation-id" : 3
  }, {
    "preferred-label" : "Konferensservice",
    "type" : "skill",
    "start-position" : 155,
    "end-position" : 164,
    "concept-id" : "H73b_dCy_CTT",
    "matched-string" : "konferens",
    "annotation-id" : 4
  }, {
    "preferred-label" : "Hotell",
    "type" : "keyword",
    "start-position" : 170,
    "end-position" : 176,
    "concept-id" : "Jrrg_iiS_2yp",
    "matched-string" : "hotell",
    "annotation-id" : 5
  }, {
    "preferred-label" : "A la carte",
    "type" : "skill",
    "start-position" : 201,
    "end-position" : 211,
    "concept-id" : "Bb4Q_Vou_pbq",
    "matched-string" : "à la carte",
    "annotation-id" : 6
  }, {
    "preferred-label" : "Konferensservice",
    "type" : "skill",
    "start-position" : 219,
    "end-position" : 228,
    "concept-id" : "H73b_dCy_CTT",
    "matched-string" : "konferens",
    "annotation-id" : 7
  }, {
    "preferred-label" : "kock",
    "sentiment" : "MUST_HAVE",
    "type" : "esco-occupation",
    "start-position" : 322,
    "end-position" : 326,
    "concept-id" : "Ti2H_QoQ_EMX",
    "matched-string" : "kock",
    "annotation-id" : 0
  }, {
    "preferred-label" : "A la carte",
    "sentiment" : "MUST_HAVE",
    "type" : "skill",
    "start-position" : 1120,
    "end-position" : 1130,
    "concept-id" : "Bb4Q_Vou_pbq",
    "matched-string" : "a la carte",
    "annotation-id" : 1
  }, {
    "preferred-label" : "Konferensservice",
    "type" : "skill",
    "start-position" : 1161,
    "end-position" : 1170,
    "concept-id" : "H73b_dCy_CTT",
    "matched-string" : "konferens",
    "annotation-id" : 8
  } ],
  "text" : "Kockar till At Park och festvåning på Elite Park Avenue\nAt Park och Elite Park Avenues konferens- och festvåning är mötesplatser för såväl göteborgare som konferens- och hotellgäster. Välbesökt lunch, à la carte, stora konferensmåltider, galamiddagar, brunch, room service och pianobar är några av de produkter som du som kock ska leverera till. Med ett varierat och högkvalitativt utbud av produkter lyckas vi möta de höga förväntningar våra gäster har på oss, lika viktigt i det lilla sammanhanget som till den stora gruppen. Ambitionen i köket är hög och kräver ständig utveckling av såväl menyer som koncept. Vi söker dig som antingen vill arbeta hos oss under sommaren eller på mer permanent basis och vill aktivt delta i att utveckla våra produkter.\n\nDu gillar att ha högt ställda krav på dig och är en kollega som håller humöret och lagandan uppe när tempot är högt. Du är mån om detaljer och jämn kvalitet och förstår vikten av att tänka hållbarhet i såväl ditt sätt att arbeta som val av råvaror.\n\nVi kan erbjuda en arbetsplats att utvecklas på, där du tillsammans med oss kan arbeta både dag och kväll, lunch, a la carte eller större middagar oavsett konferensgrupper eller krävande högtidliga middagssällskap. Möjligheterna är stora att växa tillsammans med oss.\n\nVälkommen med din ansökan. Urval kommer ske löpande, vi rekommenderar därför att du inte väntar med din ansökan!\n\n\n\nVi ser framemot att höra från dig!"
}