{
  "meta" : {
    "jobad" : {
      "description" : {
        "requirements" : null,
        "needs" : null,
        "company_information" : null,
        "text_formatted" : "Har du erfarenhet av att organisera event både digitalt och fysiskt? Då kan denna tjänst vara för dig!\n\nOm uppdraget\n\nVår kund, som är verksam inom samhällsvetenskaplig forskning, söker en eventansvarig med digital kompetens med start omgående och till och med årsskiftet med möjlighet till förlängning. Tjänsten är på deltid, 80%. Placeringsort: Uppsala.\n\nDina arbetsuppgifter\n\nI denna roll kommer du att ingå i kommunikationsenheten, och anordna externa evenemang för att presentera verksamhetens interna arbete.\n\nExempel på arbetsuppgifter:\n\n- Hantera inbjudningar, talarlistor och deltagarlistor\n- Ansvara för tekniken vid digitala möten\n- Kontrollera presentationer i realtid och hantera zoom med utsedda talare, visa bilder och hantera frågor\n- Värdskap, dukning och andra uppgifter vid fysiska event för allmänheten\n\n\nDina kvalifikationer\n\nKrav för tjänsten:\n\n- Erfarenhet av att självständigt organisera event, både i Zoom och fysiskt\n- Mycket god förmåga att uttrycka dig i tal och skrift på engelska, då merparten av arbetet utförs på engelska\n- Erfarenhet av att marknadsföra event i sociala medier\n\n\nMeriterande för tjänsten\n\n- Bakgrund och erfarenhet inom kommunikation\n- Erfarenhet av internationella frågor\n- Erfarenhet av forskningssammanhang\n\n\nVad vi erbjuder dig\n\nSom konsult på Bemannia erbjuder vi dig en nära kontakt med din konsultchef och en möjlighet till fler uppdrag via oss. Hos oss får du utvecklas på lärorika arbetsplatser och känna att din kompetens kommer till nytta.\n\nOm ansökan\nSök tjänsten genom att klicka på ansök nedan. Urval och intervjuer sker löpande och tjänsten kan komma att tillsättas före sista ansökningsdag.\n\nVi tar inte emot ansökningar via mail men har du specifika frågor kring tjänsten besvaras dessa av ansvarig rekryterare Ydalia Mendoza, ydalia.mendoza@bemannia.se.\n\nFör generella funderingar kring din ansökan eller vår rekryteringsprocess når du oss under kontorstid på 08-84 53 00.\n\nBemannia är ett publikt och svenskägt bemannings- och rekryteringsföretag som tillhandahåller kompetent och kvalificerad personal genom uthyrning, rekrytering och personalentreprenader inom Organisation & Ledarskap, PR & Information, Marknad & Sälj, Ekonomi, Juridik, HR & Personal, Fastighet & Teknik, IT & Data samt Kontor & Administration. Bemannia har ramavtal med merparten av Sveriges Myndigheter och Sveriges kommuner, dess förvaltningar och bolag. Bemannia är medlem i Kompetensföretagen och är ett auktoriserat Bemanningsföretag och Rekryteringsföretag samt har kollektivavtal med Unionen, Akademikerna, SEKO samt LO och Hotell- och Restauranganställdas förbund. Bemannia är certifierat enligt SS-EN ISO 9001:2015, Ledningssystem för kvalitet, SS-EN ISO 14001:2015, Miljöledningssystem - krav och vägledning, SS-ISO 45001:2018, Ledningssystem för arbetsmiljö och SS-ISO/IEC 27001:2013 Ledningssystem för informationssäkerhet\n\nLedningen för bolaget har varit verksam i branschen i 40 år.",
        "conditions" : "Heltid\r\nAnställningstid enligt överenskommelse",
        "text" : "Har du erfarenhet av att organisera event både digitalt och fysiskt? Då kan denna tjänst vara för dig!\n\nOm uppdraget\n\nVår kund, som är verksam inom samhällsvetenskaplig forskning, söker en eventansvarig med digital kompetens med start omgående och till och med årsskiftet med möjlighet till förlängning. Tjänsten är på deltid, 80%. Placeringsort: Uppsala.\n\nDina arbetsuppgifter\n\nI denna roll kommer du att ingå i kommunikationsenheten, och anordna externa evenemang för att presentera verksamhetens interna arbete.\n\nExempel på arbetsuppgifter:\n\n- Hantera inbjudningar, talarlistor och deltagarlistor\n- Ansvara för tekniken vid digitala möten\n- Kontrollera presentationer i realtid och hantera zoom med utsedda talare, visa bilder och hantera frågor\n- Värdskap, dukning och andra uppgifter vid fysiska event för allmänheten\n\n\nDina kvalifikationer\n\nKrav för tjänsten:\n\n- Erfarenhet av att självständigt organisera event, både i Zoom och fysiskt\n- Mycket god förmåga att uttrycka dig i tal och skrift på engelska, då merparten av arbetet utförs på engelska\n- Erfarenhet av att marknadsföra event i sociala medier\n\n\nMeriterande för tjänsten\n\n- Bakgrund och erfarenhet inom kommunikation\n- Erfarenhet av internationella frågor\n- Erfarenhet av forskningssammanhang\n\n\nVad vi erbjuder dig\n\nSom konsult på Bemannia erbjuder vi dig en nära kontakt med din konsultchef och en möjlighet till fler uppdrag via oss. Hos oss får du utvecklas på lärorika arbetsplatser och känna att din kompetens kommer till nytta.\n\nOm ansökan\nSök tjänsten genom att klicka på ansök nedan. Urval och intervjuer sker löpande och tjänsten kan komma att tillsättas före sista ansökningsdag.\n\nVi tar inte emot ansökningar via mail men har du specifika frågor kring tjänsten besvaras dessa av ansvarig rekryterare Ydalia Mendoza, ydalia.mendoza@bemannia.se.\n\nFör generella funderingar kring din ansökan eller vår rekryteringsprocess når du oss under kontorstid på 08-84 53 00.\n\nBemannia är ett publikt och svenskägt bemannings- och rekryteringsföretag som tillhandahåller kompetent och kvalificerad personal genom uthyrning, rekrytering och personalentreprenader inom Organisation & Ledarskap, PR & Information, Marknad & Sälj, Ekonomi, Juridik, HR & Personal, Fastighet & Teknik, IT & Data samt Kontor & Administration. Bemannia har ramavtal med merparten av Sveriges Myndigheter och Sveriges kommuner, dess förvaltningar och bolag. Bemannia är medlem i Kompetensföretagen och är ett auktoriserat Bemanningsföretag och Rekryteringsföretag samt har kollektivavtal med Unionen, Akademikerna, SEKO samt LO och Hotell- och Restauranganställdas förbund. Bemannia är certifierat enligt SS-EN ISO 9001:2015, Ledningssystem för kvalitet, SS-EN ISO 14001:2015, Miljöledningssystem - krav och vägledning, SS-ISO 45001:2018, Ledningssystem för arbetsmiljö och SS-ISO/IEC 27001:2013 Ledningssystem för informationssäkerhet\n\nLedningen för bolaget har varit verksam i branschen i 40 år."
      },
      "headline" : "Eventansvarig med digital kompetens sökes till kund i Uppsala",
      "driving_license" : null,
      "employer" : {
        "email" : null,
        "phone_number" : null,
        "organization_number" : "5566335476",
        "name" : "Bemannia Kontor AB",
        "url" : "https://www.bemannia.se",
        "workplace" : "Bemannia"
      },
      "removed_date" : null,
      "logo_url" : "https://www.arbetsformedlingen.se/rest/arbetsgivare/rest/af/v3/organisation/5566335476/logotyper/logo.png",
      "last_publication_date" : "2023-01-19T23:59:59",
      "number_of_vacancies" : 1,
      "occupation" : {
        "concept_id" : "XSoL_LLU_PYV",
        "label" : "Eventproducent",
        "legacy_ams_taxonomy_id" : "7153"
      },
      "occupation_group" : {
        "concept_id" : "rYSG_3WJ_LmC",
        "label" : "Regissörer och producenter av film, teater m.m.",
        "legacy_ams_taxonomy_id" : "2654"
      },
      "employment_type" : {
        "concept_id" : "PFZr_Syz_cUq",
        "label" : "Vanlig anställning",
        "legacy_ams_taxonomy_id" : "1"
      },
      "webpage_url" : "https://arbetsformedlingen.se/platsbanken/annonser/26370103",
      "driving_license_required" : false,
      "application_contacts" : [ {
        "description" : "Ydalia Mendoza",
        "email" : "ydalia.mendoza@bemannia.se",
        "telephone" : null,
        "name" : null,
        "contact_type" : null
      } ],
      "duration" : {
        "concept_id" : "Xj7x_7yZ_jEn",
        "label" : "3 månader – upp till 6 månader",
        "legacy_ams_taxonomy_id" : "3"
      },
      "nice_to_have" : {
        "education_level" : [ ],
        "work_experiences" : [ ],
        "skills" : [ ],
        "education" : [ ],
        "languages" : [ ]
      },
      "application_details" : {
        "via_af" : false,
        "email" : null,
        "other" : null,
        "reference" : null,
        "url" : "https://career.bemannia.se/jobs/1943465-eventansvarig-med-digital-kompetens-sokes-till-kund-i-uppsala?promotion=455329-arbetsformedlingen",
        "information" : null
      },
      "source_type" : "VIA_PLATSBANKEN_DXA",
      "application_deadline" : "2023-01-19T23:59:59",
      "external_id" : "46-556633-5476-1943465-3",
      "workplace_address" : {
        "coordinates" : [ 17.638927, 59.858562 ],
        "city" : null,
        "postcode" : null,
        "municipality" : "Uppsala",
        "region_concept_id" : "zBon_eET_fFU",
        "region" : "Uppsala län",
        "country_code" : "199",
        "region_code" : "03",
        "municipality_concept_id" : "otaF_bQY_4ZD",
        "country_concept_id" : "i46j_HmG_v64",
        "municipality_code" : "0380",
        "street_address" : null,
        "country" : "Sverige"
      },
      "id" : "26370103",
      "experience_required" : true,
      "working_hours_type" : {
        "concept_id" : "6YE1_gAC_R2G",
        "label" : "Heltid",
        "legacy_ams_taxonomy_id" : "1"
      },
      "access" : null,
      "timestamp" : 1659422927060,
      "must_have" : {
        "education_level" : [ ],
        "work_experiences" : [ {
          "concept_id" : "XSoL_LLU_PYV",
          "weight" : 10,
          "label" : "Eventproducent",
          "legacy_ams_taxonomy_id" : "7153"
        } ],
        "skills" : [ ],
        "education" : [ ],
        "languages" : [ ]
      },
      "occupation_field" : {
        "concept_id" : "9puE_nYg_crq",
        "label" : "Kultur, media, design",
        "legacy_ams_taxonomy_id" : "11"
      },
      "scope_of_work" : {
        "min" : 100,
        "max" : 100
      },
      "salary_type" : {
        "concept_id" : "oG8G_9cW_nRf",
        "label" : "Fast månads- vecko- eller timlön",
        "legacy_ams_taxonomy_id" : "1"
      },
      "removed" : false,
      "salary_description" : "Lön enligt överenskommelse",
      "access_to_own_car" : false,
      "publication_date" : "2022-08-02T08:48:47"
    },
    "name" : "Eventansvarig med digital kompetens sökes till kund i Uppsala",
    "user" : "hannes"
  },
  "sha1" : "062962df7943325a15b50c6520fb1b87b0cb983c",
  "annotations" : [ {
    "preferred-label" : "Eventansvarig/Eventkoordinator",
    "sentiment" : "OFFERED",
    "type" : "occupation-name",
    "start-position" : 0,
    "end-position" : 13,
    "concept-id" : "gFRe_kD3_jPc",
    "matched-string" : "eventansvarig",
    "annotation-id" : 0
  }, {
    "preferred-label" : "Uppsala",
    "type" : "municipality",
    "start-position" : 54,
    "end-position" : 61,
    "concept-id" : "otaF_bQY_4ZD",
    "matched-string" : "Uppsala",
    "annotation-id" : 19
  }, {
    "preferred-label" : "Eventansvarig/Eventkoordinator",
    "sentiment" : "OFFERED",
    "type" : "occupation-name",
    "start-position" : 251,
    "end-position" : 264,
    "concept-id" : "gFRe_kD3_jPc",
    "matched-string" : "eventansvarig",
    "annotation-id" : 1
  }, {
    "preferred-label" : null,
    "sentiment" : "MUST_HAVE",
    "type" : "skill",
    "start-position" : 269,
    "end-position" : 286,
    "concept-id" : null,
    "matched-string" : "digital kompetens",
    "annotation-id" : 25
  }, {
    "preferred-label" : "Deltid",
    "type" : "worktime-extent",
    "start-position" : 381,
    "end-position" : 392,
    "concept-id" : "947z_JGS_Uk2",
    "matched-string" : "deltid, 80%",
    "annotation-id" : 20
  }, {
    "preferred-label" : "Uppsala",
    "type" : "municipality",
    "start-position" : 409,
    "end-position" : 416,
    "concept-id" : "otaF_bQY_4ZD",
    "matched-string" : "Uppsala",
    "annotation-id" : 21
  }, {
    "preferred-label" : "Eventarrangemang",
    "sentiment" : "OFFERED",
    "type" : "skill",
    "start-position" : 609,
    "end-position" : 661,
    "concept-id" : "CrTX_qgG_frX",
    "matched-string" : "Hantera inbjudningar, talarlistor och deltagarlistor",
    "annotation-id" : 26
  }, {
    "preferred-label" : "arbeta självständigt",
    "sentiment" : "MUST_HAVE",
    "type" : "esco-skill",
    "start-position" : 949,
    "end-position" : 962,
    "concept-id" : "NyFu_HHd_zhz",
    "matched-string" : "självständigt",
    "annotation-id" : 22
  }, {
    "preferred-label" : "Engelska",
    "sentiment" : "MUST_HAVE",
    "type" : "language",
    "start-position" : 1063,
    "end-position" : 1071,
    "concept-id" : "NVxJ_hLg_TYS",
    "matched-string" : "engelska",
    "annotation-id" : 2
  }, {
    "preferred-label" : "Engelska",
    "sentiment" : "MUST_HAVE",
    "type" : "language",
    "start-position" : 1107,
    "end-position" : 1115,
    "concept-id" : "NVxJ_hLg_TYS",
    "matched-string" : "engelska",
    "annotation-id" : 3
  }, {
    "preferred-label" : "Marknadsföring/PR",
    "sentiment" : "MUST_HAVE",
    "type" : "skill",
    "start-position" : 1136,
    "end-position" : 1148,
    "concept-id" : "5yDE_FiQ_bMn",
    "matched-string" : "marknadsföra",
    "annotation-id" : 23
  }, {
    "preferred-label" : "kommunikation",
    "sentiment" : "NICE_TO_HAVE",
    "type" : "esco-skill",
    "start-position" : 1231,
    "end-position" : 1244,
    "concept-id" : "ahPU_HgE_Jeb",
    "matched-string" : "kommunikation",
    "annotation-id" : 24
  }, {
    "preferred-label" : "Internationella frågor",
    "sentiment" : "OFFERED",
    "type" : "skill",
    "start-position" : 1261,
    "end-position" : 1283,
    "concept-id" : "cRpm_EWm_dK5",
    "matched-string" : "internationella frågor",
    "annotation-id" : 4
  }, {
    "preferred-label" : "Rekryterare/Rekryteringskonsult",
    "sentiment" : "MUST_HAVE",
    "type" : "occupation-name",
    "start-position" : 1827,
    "end-position" : 1838,
    "concept-id" : "QaQC_ozP_Bme",
    "matched-string" : "rekryterare",
    "annotation-id" : 5
  }, {
    "preferred-label" : "Personal",
    "sentiment" : "MUST_HAVE",
    "type" : "keyword",
    "start-position" : 2124,
    "end-position" : 2132,
    "concept-id" : "HVxM_6MS_y1c",
    "matched-string" : "personal",
    "annotation-id" : 6
  }, {
    "preferred-label" : "PR",
    "sentiment" : "MUST_HAVE",
    "type" : "esco-skill",
    "start-position" : 2219,
    "end-position" : 2221,
    "concept-id" : "MDrj_dr4_mnA",
    "matched-string" : "pr",
    "annotation-id" : 7
  }, {
    "preferred-label" : "Sälj",
    "sentiment" : "MUST_HAVE",
    "type" : "keyword",
    "start-position" : 2247,
    "end-position" : 2251,
    "concept-id" : "QaXB_Zd5_gmh",
    "matched-string" : "sälj",
    "annotation-id" : 8
  }, {
    "preferred-label" : "Ekonomi",
    "sentiment" : "MUST_HAVE",
    "type" : "keyword",
    "start-position" : 2253,
    "end-position" : 2260,
    "concept-id" : "PW4f_bmT_new",
    "matched-string" : "ekonomi",
    "annotation-id" : 9
  }, {
    "preferred-label" : "Juridik",
    "sentiment" : "MUST_HAVE",
    "type" : "keyword",
    "start-position" : 2262,
    "end-position" : 2269,
    "concept-id" : "Z9ZH_7XU_Kkb",
    "matched-string" : "juridik",
    "annotation-id" : 10
  }, {
    "preferred-label" : "Personal",
    "sentiment" : "MUST_HAVE",
    "type" : "keyword",
    "start-position" : 2276,
    "end-position" : 2284,
    "concept-id" : "HVxM_6MS_y1c",
    "matched-string" : "personal",
    "annotation-id" : 11
  }, {
    "preferred-label" : "Data/IT",
    "sentiment" : "MUST_HAVE",
    "type" : "occupation-field",
    "start-position" : 2306,
    "end-position" : 2308,
    "concept-id" : "apaJ_2ja_LuF",
    "matched-string" : "it",
    "annotation-id" : 12
  }, {
    "preferred-label" : "Data/IT",
    "sentiment" : "MUST_HAVE",
    "type" : "occupation-field",
    "start-position" : 2311,
    "end-position" : 2315,
    "concept-id" : "apaJ_2ja_LuF",
    "matched-string" : "data",
    "annotation-id" : 13
  }, {
    "preferred-label" : "Kontor",
    "sentiment" : "MUST_HAVE",
    "type" : "keyword",
    "start-position" : 2321,
    "end-position" : 2327,
    "concept-id" : "Hyz1_7HF_AkP",
    "matched-string" : "kontor",
    "annotation-id" : 14
  }, {
    "preferred-label" : "Kollektivavtal",
    "sentiment" : "MUST_HAVE",
    "type" : "skill",
    "start-position" : 2574,
    "end-position" : 2588,
    "concept-id" : "z7wE_9xb_3jX",
    "matched-string" : "kollektivavtal",
    "annotation-id" : 15
  }, {
    "preferred-label" : "Hotell",
    "sentiment" : "MUST_HAVE",
    "type" : "keyword",
    "start-position" : 2633,
    "end-position" : 2639,
    "concept-id" : "Jrrg_iiS_2yp",
    "matched-string" : "hotell",
    "annotation-id" : 16
  }, {
    "preferred-label" : "arbetsmiljö",
    "sentiment" : "MUST_HAVE",
    "type" : "esco-skill",
    "start-position" : 2859,
    "end-position" : 2870,
    "concept-id" : "zdQY_QJh_nUH",
    "matched-string" : "arbetsmiljö",
    "annotation-id" : 17
  }, {
    "preferred-label" : "Informationssäkerhet",
    "sentiment" : "MUST_HAVE",
    "type" : "skill",
    "start-position" : 2916,
    "end-position" : 2936,
    "concept-id" : "LqRT_TVB_RPo",
    "matched-string" : "informationssäkerhet",
    "annotation-id" : 18
  } ],
  "text" : "Eventansvarig med digital kompetens sökes till kund i Uppsala\nHar du erfarenhet av att organisera event både digitalt och fysiskt? Då kan denna tjänst vara för dig!\n\nOm uppdraget\n\nVår kund, som är verksam inom samhällsvetenskaplig forskning, söker en eventansvarig med digital kompetens med start omgående och till och med årsskiftet med möjlighet till förlängning. Tjänsten är på deltid, 80%. Placeringsort: Uppsala.\n\nDina arbetsuppgifter\n\nI denna roll kommer du att ingå i kommunikationsenheten, och anordna externa evenemang för att presentera verksamhetens interna arbete.\n\nExempel på arbetsuppgifter:\n\n- Hantera inbjudningar, talarlistor och deltagarlistor\n- Ansvara för tekniken vid digitala möten\n- Kontrollera presentationer i realtid och hantera zoom med utsedda talare, visa bilder och hantera frågor\n- Värdskap, dukning och andra uppgifter vid fysiska event för allmänheten\n\n\nDina kvalifikationer\n\nKrav för tjänsten:\n\n- Erfarenhet av att självständigt organisera event, både i Zoom och fysiskt\n- Mycket god förmåga att uttrycka dig i tal och skrift på engelska, då merparten av arbetet utförs på engelska\n- Erfarenhet av att marknadsföra event i sociala medier\n\n\nMeriterande för tjänsten\n\n- Bakgrund och erfarenhet inom kommunikation\n- Erfarenhet av internationella frågor\n- Erfarenhet av forskningssammanhang\n\n\nVad vi erbjuder dig\n\nSom konsult på Bemannia erbjuder vi dig en nära kontakt med din konsultchef och en möjlighet till fler uppdrag via oss. Hos oss får du utvecklas på lärorika arbetsplatser och känna att din kompetens kommer till nytta.\n\nOm ansökan\nSök tjänsten genom att klicka på ansök nedan. Urval och intervjuer sker löpande och tjänsten kan komma att tillsättas före sista ansökningsdag.\n\nVi tar inte emot ansökningar via mail men har du specifika frågor kring tjänsten besvaras dessa av ansvarig rekryterare Ydalia Mendoza, ydalia.mendoza@bemannia.se.\n\nFör generella funderingar kring din ansökan eller vår rekryteringsprocess når du oss under kontorstid på 08-84 53 00.\n\nBemannia är ett publikt och svenskägt bemannings- och rekryteringsföretag som tillhandahåller kompetent och kvalificerad personal genom uthyrning, rekrytering och personalentreprenader inom Organisation & Ledarskap, PR & Information, Marknad & Sälj, Ekonomi, Juridik, HR & Personal, Fastighet & Teknik, IT & Data samt Kontor & Administration. Bemannia har ramavtal med merparten av Sveriges Myndigheter och Sveriges kommuner, dess förvaltningar och bolag. Bemannia är medlem i Kompetensföretagen och är ett auktoriserat Bemanningsföretag och Rekryteringsföretag samt har kollektivavtal med Unionen, Akademikerna, SEKO samt LO och Hotell- och Restauranganställdas förbund. Bemannia är certifierat enligt SS-EN ISO 9001:2015, Ledningssystem för kvalitet, SS-EN ISO 14001:2015, Miljöledningssystem - krav och vägledning, SS-ISO 45001:2018, Ledningssystem för arbetsmiljö och SS-ISO/IEC 27001:2013 Ledningssystem för informationssäkerhet\n\nLedningen för bolaget har varit verksam i branschen i 40 år."
}