{
  "meta" : {
    "jobad" : {
      "description" : {
        "requirements" : null,
        "needs" : null,
        "company_information" : null,
        "text_formatted" : "<p>Vi söker en skräddare med minst 5 års erfarenheten i branschen. </p><p>Som krav har vi att man skall du som skräddare kunna om herr och damkläder.</p>",
        "conditions" : null,
        "text" : "Vi söker en skräddare med minst 5 års erfarenheten i branschen. \nSom krav har vi att man skall du som skräddare kunna om herr och damkläder."
      },
      "headline" : "Skräddare",
      "driving_license" : [ {
        "concept_id" : "VTK8_WRx_GcM",
        "label" : "B",
        "legacy_ams_taxonomy_id" : "3"
      } ],
      "employer" : {
        "email" : null,
        "phone_number" : null,
        "organization_number" : "5569838344",
        "name" : "Super skrädderi och kemtvätt i Östermalm AB",
        "url" : null,
        "workplace" : "Super skrädderi & kemtvätt i Östermalm AB"
      },
      "removed_date" : null,
      "logo_url" : null,
      "last_publication_date" : "2022-08-20T23:59:59",
      "number_of_vacancies" : 1,
      "occupation" : {
        "concept_id" : "ras1_rJP_9UX",
        "label" : "Skräddare",
        "legacy_ams_taxonomy_id" : "5698"
      },
      "occupation_group" : {
        "concept_id" : "mwVN_oEH_g9k",
        "label" : "Skräddare och ateljésömmerskor m.fl.",
        "legacy_ams_taxonomy_id" : "7531"
      },
      "employment_type" : {
        "concept_id" : "PFZr_Syz_cUq",
        "label" : "Vanlig anställning",
        "legacy_ams_taxonomy_id" : "1"
      },
      "webpage_url" : "https://arbetsformedlingen.se/platsbanken/annonser/26344647",
      "driving_license_required" : true,
      "application_contacts" : [ ],
      "duration" : {
        "concept_id" : "a7uU_j21_mkL",
        "label" : "Tills vidare",
        "legacy_ams_taxonomy_id" : "1"
      },
      "nice_to_have" : {
        "education_level" : [ ],
        "work_experiences" : [ ],
        "skills" : [ ],
        "education" : [ ],
        "languages" : [ {
          "concept_id" : "zSLA_vw2_FXN",
          "weight" : 5,
          "label" : "Svenska",
          "legacy_ams_taxonomy_id" : "502"
        } ]
      },
      "application_details" : {
        "via_af" : false,
        "email" : "info@super-skradderi-ostermalm.se",
        "other" : null,
        "reference" : "skräddare",
        "url" : null,
        "information" : null
      },
      "source_type" : "VIA_ANNONSERA",
      "application_deadline" : "2022-08-20T23:59:59",
      "external_id" : null,
      "workplace_address" : {
        "coordinates" : [ 18.075436283384075, 59.3356081913932 ],
        "city" : "Stockholm",
        "postcode" : "11446",
        "municipality" : "Stockholm",
        "region_concept_id" : "CifL_Rzy_Mku",
        "region" : "Stockholms län",
        "country_code" : "199",
        "region_code" : "01",
        "municipality_concept_id" : "AvNB_uwa_6n6",
        "country_concept_id" : "i46j_HmG_v64",
        "municipality_code" : "0180",
        "street_address" : "Grev Turegatan 10",
        "country" : "Sverige"
      },
      "id" : "26344647",
      "experience_required" : true,
      "working_hours_type" : {
        "concept_id" : "6YE1_gAC_R2G",
        "label" : "Heltid",
        "legacy_ams_taxonomy_id" : "1"
      },
      "access" : null,
      "timestamp" : 1658413510288,
      "must_have" : {
        "education_level" : [ {
          "concept_id" : "asZm_TEQ_Srk",
          "weight" : 10,
          "label" : "Eftergymnasial utbildning två år eller längre",
          "legacy_ams_taxonomy_id" : "6"
        } ],
        "work_experiences" : [ {
          "concept_id" : "ras1_rJP_9UX",
          "weight" : 10,
          "label" : "Skräddare",
          "legacy_ams_taxonomy_id" : "5698"
        } ],
        "skills" : [ ],
        "education" : [ {
          "concept_id" : "qryY_rKa_as3",
          "weight" : 10,
          "label" : "Material och tillverkning",
          "legacy_ams_taxonomy_id" : "16"
        } ],
        "languages" : [ {
          "concept_id" : "rod1_aPk_8V5",
          "weight" : 10,
          "label" : "Albanska",
          "legacy_ams_taxonomy_id" : "243"
        } ]
      },
      "occupation_field" : {
        "concept_id" : "PaxQ_o1G_wWH",
        "label" : "Hantverk",
        "legacy_ams_taxonomy_id" : "6"
      },
      "scope_of_work" : {
        "min" : 0,
        "max" : 100
      },
      "salary_type" : {
        "concept_id" : "oG8G_9cW_nRf",
        "label" : "Fast månads- vecko- eller timlön",
        "legacy_ams_taxonomy_id" : "1"
      },
      "removed" : false,
      "salary_description" : null,
      "access_to_own_car" : false,
      "publication_date" : "2022-07-21T13:23:40"
    },
    "name" : "Skräddare",
    "user" : "hannes"
  },
  "sha1" : "faeaf45d8683098cb7c8d3a397c6f44156a955fd",
  "annotations" : [ {
    "preferred-label" : "Skräddare",
    "sentiment" : "MUST_HAVE",
    "type" : "occupation-name",
    "start-position" : 0,
    "end-position" : 9,
    "concept-id" : "ras1_rJP_9UX",
    "matched-string" : "skräddare",
    "annotation-id" : 0
  }, {
    "preferred-label" : "Skräddare",
    "sentiment" : "MUST_HAVE",
    "type" : "occupation-name",
    "start-position" : 22,
    "end-position" : 31,
    "concept-id" : "ras1_rJP_9UX",
    "matched-string" : "skräddare",
    "annotation-id" : 1
  }, {
    "preferred-label" : "5 års erfarenhet eller mer",
    "type" : "occupation-experience-year",
    "start-position" : 42,
    "end-position" : 60,
    "concept-id" : "8CVf_zRX_aZj",
    "matched-string" : "5 års erfarenheten",
    "annotation-id" : 3
  }, {
    "preferred-label" : "Skräddare",
    "sentiment" : "MUST_HAVE",
    "type" : "occupation-name",
    "start-position" : 112,
    "end-position" : 121,
    "concept-id" : "ras1_rJP_9UX",
    "matched-string" : "skräddare",
    "annotation-id" : 2
  } ],
  "text" : "Skräddare\nVi söker en skräddare med minst 5 års erfarenheten i branschen. \nSom krav har vi att man skall du som skräddare kunna om herr och damkläder."
}