{
  "meta" : {
    "jobad" : {
      "description" : {
        "requirements" : null,
        "needs" : null,
        "company_information" : null,
        "text_formatted" : "Devi fortsätter växa och söker nu fler drivna säljare som vill påbörja sin säljkarriär. Vi är på jakt efter dig som är utåtriktad, älskar att träffa människor och som trivs med att arbeta i ett högt tempo.\n\nI din roll som säljare hos oss får du möjlighet att representera några av Sveriges största varumärken inom telekom och infrastruktur. Detta gör du genom personliga kundmöten face2face.\n\nDu kommer tillhöra ett större sälj-team där du arbetar mot en individuell budget samt en större produktionsbudget. Ditt syfte är att skapa kvalitativa helhetslösningar åt våra kunder. Du som säljare hos oss ansvarar själv över hela försäljningsprocessen, från första kontakt till offerthantering och avslut.\n\nDevi erbjuder dig:\n\n- En gedigen säljutbildning med fokus på personlig utveckling samt coaching.\n- Spännande utvecklingsmöjligheter både på ett professionellt och personligt plan.\n- En inspirerande, varierad och tävlingsinriktad arbetsmiljö.\n- Garantilön + höga provisioner\n- En familjär företagskultur med stark teamkänsla.\n\n\nDevi söker dig som:\n\n- Vill utvecklas, på ett personligt- och professionellt plan.\n- Älskar att resa och upptäcka nya platser\n- Är utåtriktad, med en stark tävlingsinstinkt.\n- Gillar att arbeta mot tydligt uppsatta mål.\n- Är bekväm med att kontakta nya människor.",
        "conditions" : "Heltid\r\nAnställningstid enligt överenskommelse",
        "text" : "Devi fortsätter växa och söker nu fler drivna säljare som vill påbörja sin säljkarriär. Vi är på jakt efter dig som är utåtriktad, älskar att träffa människor och som trivs med att arbeta i ett högt tempo.\n\nI din roll som säljare hos oss får du möjlighet att representera några av Sveriges största varumärken inom telekom och infrastruktur. Detta gör du genom personliga kundmöten face2face.\n\nDu kommer tillhöra ett större sälj-team där du arbetar mot en individuell budget samt en större produktionsbudget. Ditt syfte är att skapa kvalitativa helhetslösningar åt våra kunder. Du som säljare hos oss ansvarar själv över hela försäljningsprocessen, från första kontakt till offerthantering och avslut.\n\nDevi erbjuder dig:\n\n- En gedigen säljutbildning med fokus på personlig utveckling samt coaching.\n- Spännande utvecklingsmöjligheter både på ett professionellt och personligt plan.\n- En inspirerande, varierad och tävlingsinriktad arbetsmiljö.\n- Garantilön + höga provisioner\n- En familjär företagskultur med stark teamkänsla.\n\n\nDevi söker dig som:\n\n- Vill utvecklas, på ett personligt- och professionellt plan.\n- Älskar att resa och upptäcka nya platser\n- Är utåtriktad, med en stark tävlingsinstinkt.\n- Gillar att arbeta mot tydligt uppsatta mål.\n- Är bekväm med att kontakta nya människor."
      },
      "headline" : "Devi söker resande säljare",
      "driving_license" : null,
      "employer" : {
        "email" : null,
        "phone_number" : null,
        "organization_number" : "5569166662",
        "name" : "Devi Recruit AB",
        "url" : "http://devigroup.se",
        "workplace" : "Devi"
      },
      "removed_date" : null,
      "logo_url" : "https://www.arbetsformedlingen.se/rest/arbetsgivare/rest/af/v3/organisation/5569166662/logotyper/logo.png",
      "last_publication_date" : "2022-08-05T23:59:59",
      "number_of_vacancies" : 1,
      "occupation" : {
        "concept_id" : "p17k_znk_osi",
        "label" : "Utesäljare",
        "legacy_ams_taxonomy_id" : "7117"
      },
      "occupation_group" : {
        "concept_id" : "oXSW_fbY_XrY",
        "label" : "Företagssäljare",
        "legacy_ams_taxonomy_id" : "3322"
      },
      "employment_type" : {
        "concept_id" : "PFZr_Syz_cUq",
        "label" : "Vanlig anställning",
        "legacy_ams_taxonomy_id" : "1"
      },
      "webpage_url" : "https://arbetsformedlingen.se/platsbanken/annonser/26375349",
      "driving_license_required" : false,
      "application_contacts" : [ {
        "description" : "Nevine",
        "email" : "nevine.chorbaji@devigroup.se",
        "telephone" : null,
        "name" : null,
        "contact_type" : null
      } ],
      "duration" : {
        "concept_id" : "qQUd_4qe_NDT",
        "label" : "6 månader eller längre",
        "legacy_ams_taxonomy_id" : "2"
      },
      "nice_to_have" : {
        "education_level" : [ ],
        "work_experiences" : [ ],
        "skills" : [ ],
        "education" : [ ],
        "languages" : [ ]
      },
      "application_details" : {
        "via_af" : false,
        "email" : null,
        "other" : null,
        "reference" : null,
        "url" : "https://jobb.devigroup.se/jobs/1805766-devi-soker-resande-saljare?promotion=419959-arbetsformedlingen",
        "information" : null
      },
      "source_type" : "VIA_PLATSBANKEN_DXA",
      "application_deadline" : "2022-08-05T23:59:59",
      "external_id" : "46-556916-6662-1805766-20",
      "workplace_address" : {
        "coordinates" : [ 18.283392, 59.242596 ],
        "city" : null,
        "postcode" : null,
        "municipality" : "Tyresö",
        "region_concept_id" : "CifL_Rzy_Mku",
        "region" : "Stockholms län",
        "country_code" : "199",
        "region_code" : "01",
        "municipality_concept_id" : "sTPc_k2B_SqV",
        "country_concept_id" : "i46j_HmG_v64",
        "municipality_code" : "0138",
        "street_address" : null,
        "country" : "Sverige"
      },
      "id" : "26375349",
      "experience_required" : false,
      "working_hours_type" : {
        "concept_id" : "6YE1_gAC_R2G",
        "label" : "Heltid",
        "legacy_ams_taxonomy_id" : "1"
      },
      "access" : null,
      "timestamp" : 1659529295737,
      "must_have" : {
        "education_level" : [ ],
        "work_experiences" : [ ],
        "skills" : [ ],
        "education" : [ ],
        "languages" : [ ]
      },
      "occupation_field" : {
        "concept_id" : "RPTn_bxG_ExZ",
        "label" : "Försäljning, inköp, marknadsföring",
        "legacy_ams_taxonomy_id" : "5"
      },
      "scope_of_work" : {
        "min" : 100,
        "max" : 100
      },
      "salary_type" : {
        "concept_id" : "oG8G_9cW_nRf",
        "label" : "Fast månads- vecko- eller timlön",
        "legacy_ams_taxonomy_id" : "1"
      },
      "removed" : false,
      "salary_description" : "Lön enligt överenskommelse",
      "access_to_own_car" : false,
      "publication_date" : "2022-08-03T14:21:35"
    },
    "name" : "Devi söker resande säljare",
    "user" : "hannes"
  },
  "sha1" : "394a95c9095fd28751abdb77f6fd936a121c50c0",
  "annotations" : [ {
    "preferred-label" : "Resor i arbetet förekommer",
    "type" : "work-place-environment",
    "start-position" : 11,
    "end-position" : 18,
    "concept-id" : "oaM2_JTK_muh",
    "matched-string" : "resande",
    "annotation-id" : 8
  }, {
    "preferred-label" : "Säljare",
    "sentiment" : "MUST_HAVE",
    "type" : "keyword",
    "start-position" : 19,
    "end-position" : 26,
    "concept-id" : "rDcj_Tao_TJJ",
    "matched-string" : "säljare",
    "annotation-id" : 0
  }, {
    "preferred-label" : "Säljare",
    "sentiment" : "MUST_HAVE",
    "type" : "keyword",
    "start-position" : 73,
    "end-position" : 80,
    "concept-id" : "rDcj_Tao_TJJ",
    "matched-string" : "säljare",
    "annotation-id" : 1
  }, {
    "preferred-label" : "Säljare",
    "sentiment" : "MUST_HAVE",
    "type" : "keyword",
    "start-position" : 249,
    "end-position" : 256,
    "concept-id" : "rDcj_Tao_TJJ",
    "matched-string" : "säljare",
    "annotation-id" : 2
  }, {
    "preferred-label" : "Sverige",
    "type" : "country",
    "start-position" : 308,
    "end-position" : 316,
    "concept-id" : "i46j_HmG_v64",
    "matched-string" : "Sveriges",
    "annotation-id" : 9
  }, {
    "preferred-label" : "Telekommunikation",
    "type" : "sni-level-2",
    "start-position" : 341,
    "end-position" : 348,
    "concept-id" : "tSTd_gwV_QpZ",
    "matched-string" : "telekom",
    "annotation-id" : 10
  }, {
    "preferred-label" : "Sälj",
    "sentiment" : "MUST_HAVE",
    "type" : "keyword",
    "start-position" : 450,
    "end-position" : 454,
    "concept-id" : "QaXB_Zd5_gmh",
    "matched-string" : "sälj",
    "annotation-id" : 3
  }, {
    "preferred-label" : "Säljare",
    "sentiment" : "MUST_HAVE",
    "type" : "keyword",
    "start-position" : 611,
    "end-position" : 618,
    "concept-id" : "rDcj_Tao_TJJ",
    "matched-string" : "säljare",
    "annotation-id" : 4
  }, {
    "preferred-label" : "personlig utveckling",
    "sentiment" : "MUST_HAVE",
    "type" : "esco-skill",
    "start-position" : 790,
    "end-position" : 810,
    "concept-id" : "wkQj_Dah_2GD",
    "matched-string" : "personlig utveckling",
    "annotation-id" : 5
  }, {
    "preferred-label" : "Coaching/Coachning",
    "sentiment" : "MUST_HAVE",
    "type" : "skill",
    "start-position" : 816,
    "end-position" : 824,
    "concept-id" : "91Ef_58Y_jX4",
    "matched-string" : "coaching",
    "annotation-id" : 6
  }, {
    "preferred-label" : "arbetsmiljö",
    "sentiment" : "MUST_HAVE",
    "type" : "esco-skill",
    "start-position" : 958,
    "end-position" : 969,
    "concept-id" : "zdQY_QJh_nUH",
    "matched-string" : "arbetsmiljö",
    "annotation-id" : 7
  } ],
  "text" : "Devi söker resande säljare\nDevi fortsätter växa och söker nu fler drivna säljare som vill påbörja sin säljkarriär. Vi är på jakt efter dig som är utåtriktad, älskar att träffa människor och som trivs med att arbeta i ett högt tempo.\n\nI din roll som säljare hos oss får du möjlighet att representera några av Sveriges största varumärken inom telekom och infrastruktur. Detta gör du genom personliga kundmöten face2face.\n\nDu kommer tillhöra ett större sälj-team där du arbetar mot en individuell budget samt en större produktionsbudget. Ditt syfte är att skapa kvalitativa helhetslösningar åt våra kunder. Du som säljare hos oss ansvarar själv över hela försäljningsprocessen, från första kontakt till offerthantering och avslut.\n\nDevi erbjuder dig:\n\n- En gedigen säljutbildning med fokus på personlig utveckling samt coaching.\n- Spännande utvecklingsmöjligheter både på ett professionellt och personligt plan.\n- En inspirerande, varierad och tävlingsinriktad arbetsmiljö.\n- Garantilön + höga provisioner\n- En familjär företagskultur med stark teamkänsla.\n\n\nDevi söker dig som:\n\n- Vill utvecklas, på ett personligt- och professionellt plan.\n- Älskar att resa och upptäcka nya platser\n- Är utåtriktad, med en stark tävlingsinstinkt.\n- Gillar att arbeta mot tydligt uppsatta mål.\n- Är bekväm med att kontakta nya människor."
}