{
  "meta" : {
    "jobad" : {
      "description" : {
        "requirements" : null,
        "needs" : null,
        "company_information" : null,
        "text_formatted" : "<p><strong>Brinner du för yoga och vill dela med dig av dina kunskaper till andra? Då har du hittat rätt!</strong></p><p>Medborgarskolan i Eskilstuna söker kursledare inom området yoga. </p><p>Har du en passion för ämnet som du vill att fler ska ta del av och lära sig om är detta din chans! Skicka din intresseanmälan i ett mail till linnea.andersson@medborgarskolan.se där du förklarar vad du brinner för och varför du vill starta en kurs inom det området. Kursplaneringen är i full gång och vi ser gärna att du inkommer med din ansökan så snart som möjligt.</p><p>Rollen som kursledare är en objektsanställning och antalet timmar varierar därför beroende på hur många av dina kurser som kommer igång. Uppskattningsvis varierar antalet arbetstimmar mellan 10-50 timmar per halvår.</p>",
        "conditions" : null,
        "text" : "Brinner du för yoga och vill dela med dig av dina kunskaper till andra? Då har du hittat rätt!\nMedborgarskolan i Eskilstuna söker kursledare inom området yoga. \nHar du en passion för ämnet som du vill att fler ska ta del av och lära sig om är detta din chans! Skicka din intresseanmälan i ett mail till linnea.andersson@medborgarskolan.se där du förklarar vad du brinner för och varför du vill starta en kurs inom det området. Kursplaneringen är i full gång och vi ser gärna att du inkommer med din ansökan så snart som möjligt.\nRollen som kursledare är en objektsanställning och antalet timmar varierar därför beroende på hur många av dina kurser som kommer igång. Uppskattningsvis varierar antalet arbetstimmar mellan 10-50 timmar per halvår."
      },
      "headline" : "KURSLEDARE: YOGA I ESKILSTUNA",
      "driving_license" : null,
      "employer" : {
        "email" : null,
        "phone_number" : null,
        "organization_number" : "8176007097",
        "name" : "Medborgarskolan Mälardalen",
        "url" : "www.medborgarskolan.se",
        "workplace" : "Lokalkontor"
      },
      "removed_date" : null,
      "logo_url" : "https://www.arbetsformedlingen.se/rest/arbetsgivare/rest/af/v3/arbetsplatser/20214215/logotyper/logo.png",
      "last_publication_date" : "2022-08-31T23:59:59",
      "number_of_vacancies" : 1,
      "occupation" : {
        "concept_id" : "vE2q_wQB_NGv",
        "label" : "Cirkelledare/Studiecirkelledare",
        "legacy_ams_taxonomy_id" : "6106"
      },
      "occupation_group" : {
        "concept_id" : "1CX5_mZw_Vcq",
        "label" : "Övriga utbildare och instruktörer",
        "legacy_ams_taxonomy_id" : "3449"
      },
      "employment_type" : {
        "concept_id" : "1paU_aCR_nGn",
        "label" : "Behovsanställning",
        "legacy_ams_taxonomy_id" : "4"
      },
      "webpage_url" : "https://arbetsformedlingen.se/platsbanken/annonser/25917418",
      "driving_license_required" : false,
      "application_contacts" : [ ],
      "duration" : {
        "concept_id" : null,
        "label" : null,
        "legacy_ams_taxonomy_id" : null
      },
      "nice_to_have" : {
        "education_level" : [ ],
        "work_experiences" : [ {
          "concept_id" : "vE2q_wQB_NGv",
          "weight" : 5,
          "label" : "Cirkelledare/Studiecirkelledare",
          "legacy_ams_taxonomy_id" : "6106"
        } ],
        "skills" : [ ],
        "education" : [ ],
        "languages" : [ ]
      },
      "application_details" : {
        "via_af" : false,
        "email" : "linnea.andersson@medborgarskolan.se",
        "other" : null,
        "reference" : "Yoga i Eskilstuna",
        "url" : null,
        "information" : null
      },
      "source_type" : "VIA_ANNONSERA",
      "application_deadline" : "2022-08-31T23:59:59",
      "external_id" : null,
      "workplace_address" : {
        "coordinates" : [ 16.514810647776137, 59.37232115370168 ],
        "city" : "Eskilstuna",
        "postcode" : "63218",
        "municipality" : "Eskilstuna",
        "region_concept_id" : "s93u_BEb_sx2",
        "region" : "Södermanlands län",
        "country_code" : "199",
        "region_code" : "04",
        "municipality_concept_id" : "kMxr_NiX_YrU",
        "country_concept_id" : "i46j_HmG_v64",
        "municipality_code" : "0484",
        "street_address" : "J A Selanders Gata 1",
        "country" : "Sverige"
      },
      "id" : "25917418",
      "experience_required" : true,
      "working_hours_type" : {
        "concept_id" : null,
        "label" : null,
        "legacy_ams_taxonomy_id" : null
      },
      "access" : null,
      "timestamp" : 1654075615822,
      "must_have" : {
        "education_level" : [ ],
        "work_experiences" : [ ],
        "skills" : [ ],
        "education" : [ ],
        "languages" : [ {
          "concept_id" : "zSLA_vw2_FXN",
          "weight" : 10,
          "label" : "Svenska",
          "legacy_ams_taxonomy_id" : "502"
        } ]
      },
      "occupation_field" : {
        "concept_id" : "MVqp_eS8_kDZ",
        "label" : "Pedagogik",
        "legacy_ams_taxonomy_id" : "15"
      },
      "scope_of_work" : {
        "min" : 0,
        "max" : null
      },
      "salary_type" : {
        "concept_id" : "oG8G_9cW_nRf",
        "label" : "Fast månads- vecko- eller timlön",
        "legacy_ams_taxonomy_id" : "1"
      },
      "removed" : false,
      "salary_description" : null,
      "access_to_own_car" : false,
      "publication_date" : "2022-04-08T15:49:44"
    },
    "name" : "KURSLEDARE: YOGA I ESKILSTUNA"
  },
  "sha1" : "5732b179cc39a2c910b9f0521f8da51206523148",
  "annotations" : [ {
    "preferred-label" : "Yogainstruktör/Yogalärare",
    "type" : "occupation-name",
    "start-position" : 0,
    "end-position" : 16,
    "concept-id" : "6Smf_Gqg_cv8",
    "matched-string" : "KURSLEDARE: YOGA",
    "annotation-id" : 1
  }, {
    "preferred-label" : "Yoga, instruktör/Yoga, tränare",
    "type" : "skill",
    "start-position" : 45,
    "end-position" : 49,
    "concept-id" : "iLtv_YM8_L89",
    "matched-string" : "yoga",
    "annotation-id" : 2
  }, {
    "preferred-label" : "Yogainstruktör/Yogalärare",
    "type" : "occupation-name",
    "start-position" : 160,
    "end-position" : 188,
    "concept-id" : "6Smf_Gqg_cv8",
    "matched-string" : "kursledare inom området yoga",
    "annotation-id" : 3
  } ],
  "text" : "KURSLEDARE: YOGA I ESKILSTUNA\nBrinner du för yoga och vill dela med dig av dina kunskaper till andra? Då har du hittat rätt!\nMedborgarskolan i Eskilstuna söker kursledare inom området yoga. \nHar du en passion för ämnet som du vill att fler ska ta del av och lära sig om är detta din chans! Skicka din intresseanmälan i ett mail till linnea.andersson@medborgarskolan.se där du förklarar vad du brinner för och varför du vill starta en kurs inom det området. Kursplaneringen är i full gång och vi ser gärna att du inkommer med din ansökan så snart som möjligt.\nRollen som kursledare är en objektsanställning och antalet timmar varierar därför beroende på hur många av dina kurser som kommer igång. Uppskattningsvis varierar antalet arbetstimmar mellan 10-50 timmar per halvår."
}