{
  "meta" : {
    "jobad" : {
      "description" : {
        "requirements" : null,
        "needs" : null,
        "company_information" : null,
        "text_formatted" : "<p>Vi är ett litet konditori i Vallberga, utanför Laholm.</p><p>Det lilla konditoriet med det stora utbudet. Vi utvecklar och förnyar hela tiden vårt sortiment. Vi söker dig som är en självgående bagare. Du sköter avbakning och tillverkning av bröd och frallor.</p><p>Vissa dagar jobbar du själv och måste då även göra tårtor och bakelser men vi kan vara flexibla och anpassa oss</p><p>Ansök redan idag. Tillträde gärna omgående</p><p>Anställningen är 60-95%, omfattning och arbetstider kan diskuteras. </p><p>Ansök via mail info@signes.se</p><p>#jobbjustnu</p>",
        "conditions" : null,
        "text" : "Vi är ett litet konditori i Vallberga, utanför Laholm.\nDet lilla konditoriet med det stora utbudet. Vi utvecklar och förnyar hela tiden vårt sortiment. Vi söker dig som är en självgående bagare. Du sköter avbakning och tillverkning av bröd och frallor.\nVissa dagar jobbar du själv och måste då även göra tårtor och bakelser men vi kan vara flexibla och anpassa oss\nAnsök redan idag. Tillträde gärna omgående\nAnställningen är 60-95%, omfattning och arbetstider kan diskuteras. \nAnsök via mail info@signes.se\n#jobbjustnu"
      },
      "headline" : "Bagare / konditor",
      "driving_license" : null,
      "employer" : {
        "email" : null,
        "phone_number" : null,
        "organization_number" : "5590002027",
        "name" : "Signes Konditorier i Halland AB",
        "url" : "http://www.signes.se",
        "workplace" : "Signes Konditorier i Halland AB"
      },
      "removed_date" : null,
      "logo_url" : null,
      "last_publication_date" : "2022-09-04T23:59:59",
      "number_of_vacancies" : 1,
      "occupation" : {
        "concept_id" : "XugJ_6hw_wVV",
        "label" : "Bagare/Konditor",
        "legacy_ams_taxonomy_id" : "5504"
      },
      "occupation_group" : {
        "concept_id" : "5qT8_z9d_8rw",
        "label" : "Bagare och konditorer",
        "legacy_ams_taxonomy_id" : "7612"
      },
      "employment_type" : {
        "concept_id" : "PFZr_Syz_cUq",
        "label" : "Vanlig anställning",
        "legacy_ams_taxonomy_id" : "1"
      },
      "webpage_url" : "https://arbetsformedlingen.se/platsbanken/annonser/26381089",
      "driving_license_required" : false,
      "application_contacts" : [ {
        "description" : null,
        "email" : "carina@signes.se",
        "telephone" : null,
        "name" : "Carina Nilsson",
        "contact_type" : "Personalansvarig"
      } ],
      "duration" : {
        "concept_id" : "a7uU_j21_mkL",
        "label" : "Tills vidare",
        "legacy_ams_taxonomy_id" : "1"
      },
      "nice_to_have" : {
        "education_level" : [ ],
        "work_experiences" : [ ],
        "skills" : [ ],
        "education" : [ ],
        "languages" : [ ]
      },
      "application_details" : {
        "via_af" : false,
        "email" : "carina@signes.se",
        "other" : null,
        "reference" : "Bagare",
        "url" : null,
        "information" : null
      },
      "source_type" : "VIA_ANNONSERA",
      "application_deadline" : "2022-09-04T23:59:59",
      "external_id" : null,
      "workplace_address" : {
        "coordinates" : [ 13.024701027899914, 56.468131214696946 ],
        "city" : "Vallberga",
        "postcode" : "31250",
        "municipality" : "Laholm",
        "region_concept_id" : "wjee_qH2_yb6",
        "region" : "Hallands län",
        "country_code" : "199",
        "region_code" : "13",
        "municipality_concept_id" : "c1iL_rqh_Zja",
        "country_concept_id" : "i46j_HmG_v64",
        "municipality_code" : "1381",
        "street_address" : "Kövlingevägen 5",
        "country" : "Sverige"
      },
      "id" : "26381089",
      "experience_required" : true,
      "working_hours_type" : {
        "concept_id" : "947z_JGS_Uk2",
        "label" : "Deltid",
        "legacy_ams_taxonomy_id" : "2"
      },
      "access" : null,
      "timestamp" : 1659700425272,
      "must_have" : {
        "education_level" : [ ],
        "work_experiences" : [ {
          "concept_id" : "XugJ_6hw_wVV",
          "weight" : 10,
          "label" : "Bagare/Konditor",
          "legacy_ams_taxonomy_id" : "5504"
        } ],
        "skills" : [ ],
        "education" : [ ],
        "languages" : [ {
          "concept_id" : "zSLA_vw2_FXN",
          "weight" : 10,
          "label" : "Svenska",
          "legacy_ams_taxonomy_id" : "502"
        } ]
      },
      "occupation_field" : {
        "concept_id" : "PaxQ_o1G_wWH",
        "label" : "Hantverk",
        "legacy_ams_taxonomy_id" : "6"
      },
      "scope_of_work" : {
        "min" : 0,
        "max" : 100
      },
      "salary_type" : {
        "concept_id" : "oG8G_9cW_nRf",
        "label" : "Fast månads- vecko- eller timlön",
        "legacy_ams_taxonomy_id" : "1"
      },
      "removed" : false,
      "salary_description" : null,
      "access_to_own_car" : false,
      "publication_date" : "2022-08-05T13:53:45"
    },
    "name" : "Bagare / konditor",
    "user" : "hannes"
  },
  "sha1" : "3dfef74a40feef31876518bec3d77e34c50c1a22",
  "annotations" : [ {
    "preferred-label" : "Bagare/Konditor",
    "type" : "occupation-name",
    "start-position" : 0,
    "end-position" : 17,
    "concept-id" : "XugJ_6hw_wVV",
    "matched-string" : "Bagare / konditor",
    "annotation-id" : 6
  }, {
    "preferred-label" : "Bageri och konditori",
    "type" : "keyword",
    "start-position" : 34,
    "end-position" : 43,
    "concept-id" : "4t2m_4Dj_ksJ",
    "matched-string" : "konditori",
    "annotation-id" : 7
  }, {
    "preferred-label" : "Bageri och konditori",
    "type" : "keyword",
    "start-position" : 83,
    "end-position" : 94,
    "concept-id" : "4t2m_4Dj_ksJ",
    "matched-string" : "konditoriet",
    "annotation-id" : 8
  }, {
    "preferred-label" : "Bagare/Konditor",
    "sentiment" : "MUST_HAVE",
    "type" : "occupation-name",
    "start-position" : 205,
    "end-position" : 211,
    "concept-id" : "XugJ_6hw_wVV",
    "matched-string" : "bagare",
    "annotation-id" : 2
  }, {
    "preferred-label" : "Tillverkning",
    "sentiment" : "MUST_HAVE",
    "type" : "sni-level-1",
    "start-position" : 237,
    "end-position" : 249,
    "concept-id" : "trPt_iHy_oFP",
    "matched-string" : "tillverkning",
    "annotation-id" : 3
  }, {
    "preferred-label" : "Tårtor/Bakelser",
    "sentiment" : "MUST_HAVE",
    "type" : "skill",
    "start-position" : 322,
    "end-position" : 328,
    "concept-id" : "UVj4_qZp_iqS",
    "matched-string" : "tårtor",
    "annotation-id" : 4
  }, {
    "preferred-label" : "Tårtor/Bakelser",
    "sentiment" : "MUST_HAVE",
    "type" : "skill",
    "start-position" : 333,
    "end-position" : 341,
    "concept-id" : "UVj4_qZp_iqS",
    "matched-string" : "bakelser",
    "annotation-id" : 5
  }, {
    "preferred-label" : "Heltid/Deltid",
    "type" : "worktime-extent",
    "start-position" : 443,
    "end-position" : 449,
    "concept-id" : "hGCt_6Ni_XPz",
    "matched-string" : "60-95%",
    "annotation-id" : 9
  } ],
  "text" : "Bagare / konditor\nVi är ett litet konditori i Vallberga, utanför Laholm.\nDet lilla konditoriet med det stora utbudet. Vi utvecklar och förnyar hela tiden vårt sortiment. Vi söker dig som är en självgående bagare. Du sköter avbakning och tillverkning av bröd och frallor.\nVissa dagar jobbar du själv och måste då även göra tårtor och bakelser men vi kan vara flexibla och anpassa oss\nAnsök redan idag. Tillträde gärna omgående\nAnställningen är 60-95%, omfattning och arbetstider kan diskuteras. \nAnsök via mail info@signes.se\n#jobbjustnu"
}