{
  "meta" : {
    "jobad" : {
      "description" : {
        "requirements" : null,
        "needs" : null,
        "company_information" : null,
        "text_formatted" : "Mitt i hjärtat av sydöstra Sverige - med pendlingsavstånd till Växjö, Kalmar och Karlskrona ligger Emmaboda. Om du vill bo i vacker natur, nära skog och sjö, skapa ditt drömboende till en rimlig kostnad, vara garanterad förskoleplats och dessutom ha flera stora evenemang i din närhet så kan Emmaboda vara något för dig. Vill du dessutom vara med och påverka din omgivning har du bäst möjligheter för det i Emmaboda! Kreativa människor har påverkat och levandegjort miljön och livet här sedan länge. Emmaboda lever och vårt liv präglas av omtanke och öppenhet.\n\nHälso- och sjukvårdsenheten, en av socialförvaltningens verksamheter, består av sjuksköterskor, undersköterskor, arbetsterapeuter, fysioterapeuter/sjukgymnaster och rehabassistenter. \nSocialförvaltningen arbetar utifrån Emmaboda kommuns socialtjänstplan Ditt  ansvar, vårt stöd. Ett självständigt liv! Den enskildes behov och livssituation påverkar hur dina arbetsuppgifter ser ut och ska utföras. Vi sätter det förebyggande arbetet och det salutogena synsättet i fokus.\n\nEmmaboda kommuns hälso-och sjukvård är liksom kommunen i stort, liten och smidig med närhet och samarbete mellan olika verksamheter. Det småskaliga och smidiga är många gånger en fördel i de större utmaningarna som vi delar med alla kommuner, men kan förstås också innebära hinder att ta sig över eller runt genom att finna på kreativa lösningar. Verksamhetens syfte och mål är att hela tiden utvecklas för att kunna fortsätta att utföra en god och säker vård enligt våra invånares behov och förväntningar. Läs mer om vår kommunala hälso-och sjukvård: https://www.emmaboda.se/omsorg-stod--hjalp/sjukvard. \n\nSverige, Region Kalmar län och Emmaboda kommun håller på att ställa om till Jämlik hälsa-Nära vård. Det pågår utvecklingsprocesser mot detta lokalt, regionalt och nationellt. Omställningen innebär att vi i större utsträckning ska  samskapa med invånare och arbeta mera personcentrerat, sammanhållet, proaktivt och hälsofrämjande. Vi ska förflytta oss i vårt sätt att arbeta från fokus på organisation till fokus på person och relation. Det kommer handla om mer konkreta och praktiska steg liksom om mer abstrakta steg i vårt professionella förhållningssätt. Läs gärna mer om omställningen: https://skr.se/skr/halsasjukvard/utvecklingavverksamhet/naravard/omstallningtillnaravard.57446.html\n\nI Emmaboda kommuns utvecklingsarbete mot Jämlik hälsa-Nära vård är också Emmaboda kommuns socialtjänstplan https://www.emmaboda.se/socialtjanstplan och Socialnämndens mål för verksamheten https://www.emmaboda.se/socialnamndensmal centrala. \nVi söker nu en verksamhetsutvecklare som tillsammans med oss vill driva hälso-och sjukvårdens utvecklingsresa  framåt!  Du behöver ha en god förståelse för en utvecklingsprocess alla delar såväl det operativa som det strategiska. Där god samarbetsförmåga och lyhördhet för verksamhetens behov är viktigt.\n\nDet är en projektanställning som sträcker sig tom 231231, med möjlighet till eventuell förlängning, tillträde efter överenskommelse.\n\r\n\r\nARBETSUPPGIFTER\nDitt uppdrag innebär att arbeta nära verksamhetens sjuksköterskor/undersköterskor och rehab för att skapa förståelse och hållbarhet mellan verkligheten och rutiner/system. \n\nDu kommer att ansvara för att införa/tydliggöra vårdprocessen i verksamheten samt implementera ett nytt verksamhetssystem. \nDu kommer, i nära samarbete med MAS och verksamhetschef, ansvara för att upprätta struktur kring rutiner, riktlinjer och checklistor för att säkerställa god och säker vård.\nDu kommer att arbeta för digitala lösningar.\nDu kommer att medverka i samverkan med andra aktörer kring Jämlik hälsa-Nära vård.\nDu kan komma att medverka till att arbeta fram underlag för politiska beslut.\n\r\n\r\nKVALIFIKATIONER\nVi söker dig som är legitimerad sjuksköterska, fysioterapeut eller arbetsterapeut gärna med erfarenhet från kommunal hälso-och sjukvård. Har du utbildning och/eller erfarenhet av att ha arbetat med verksamhetsutveckling, processer samt implementeringsarbete ser vi detta som positivt. \n\nSom person är du nyfiken och kreativ med förmåga att snabbt få en överblick över olika situationer. Du är strukturerad, har analytisk förmåga och är van vid att prioritera i det dagliga arbetet. Du har lätt för att arbeta självständigt utifrån uppsatta mål, utvärderar, slutför och följer upp uppdragen. \nDu är pedagogisk och har lätt för att kommunicera med olika målgrupper, knyta kontakter och skapa nätverk både internt och externt.\nDu har god förmåga att uttrycka dig väl i tal och skrift, samt lätt för att entusiasmera och inspirera.\nErfarenhet av arbete i Procapita och Cosmic är meriterande.\nStor vikt läggs vid personlig lämplighet.\nKrav på B körkort.\n\r\n\nÖVRIGT\nEmmaboda kommuns anställda ska spegla den mångfald som finns i kommunen. Vi välkomnar sökande oberoende av ålder, kön och utländsk bakgrund. \n\nVi undanber oss bestämt kontakt med mediesäljare, rekryteringssajter och liknande.",
        "conditions" : "Heltid.  Dagtid.\r\nTidsbegränsad anställning, tillträde: Efter överenskommelse, upphör: 2023-12-31  .",
        "text" : "Mitt i hjärtat av sydöstra Sverige - med pendlingsavstånd till Växjö, Kalmar och Karlskrona ligger Emmaboda. Om du vill bo i vacker natur, nära skog och sjö, skapa ditt drömboende till en rimlig kostnad, vara garanterad förskoleplats och dessutom ha flera stora evenemang i din närhet så kan Emmaboda vara något för dig. Vill du dessutom vara med och påverka din omgivning har du bäst möjligheter för det i Emmaboda! Kreativa människor har påverkat och levandegjort miljön och livet här sedan länge. Emmaboda lever och vårt liv präglas av omtanke och öppenhet.\n\nHälso- och sjukvårdsenheten, en av socialförvaltningens verksamheter, består av sjuksköterskor, undersköterskor, arbetsterapeuter, fysioterapeuter/sjukgymnaster och rehabassistenter. \nSocialförvaltningen arbetar utifrån Emmaboda kommuns socialtjänstplan Ditt  ansvar, vårt stöd. Ett självständigt liv! Den enskildes behov och livssituation påverkar hur dina arbetsuppgifter ser ut och ska utföras. Vi sätter det förebyggande arbetet och det salutogena synsättet i fokus.\n\nEmmaboda kommuns hälso-och sjukvård är liksom kommunen i stort, liten och smidig med närhet och samarbete mellan olika verksamheter. Det småskaliga och smidiga är många gånger en fördel i de större utmaningarna som vi delar med alla kommuner, men kan förstås också innebära hinder att ta sig över eller runt genom att finna på kreativa lösningar. Verksamhetens syfte och mål är att hela tiden utvecklas för att kunna fortsätta att utföra en god och säker vård enligt våra invånares behov och förväntningar. Läs mer om vår kommunala hälso-och sjukvård: https://www.emmaboda.se/omsorg-stod--hjalp/sjukvard. \n\nSverige, Region Kalmar län och Emmaboda kommun håller på att ställa om till Jämlik hälsa-Nära vård. Det pågår utvecklingsprocesser mot detta lokalt, regionalt och nationellt. Omställningen innebär att vi i större utsträckning ska  samskapa med invånare och arbeta mera personcentrerat, sammanhållet, proaktivt och hälsofrämjande. Vi ska förflytta oss i vårt sätt att arbeta från fokus på organisation till fokus på person och relation. Det kommer handla om mer konkreta och praktiska steg liksom om mer abstrakta steg i vårt professionella förhållningssätt. Läs gärna mer om omställningen: https://skr.se/skr/halsasjukvard/utvecklingavverksamhet/naravard/omstallningtillnaravard.57446.html\n\nI Emmaboda kommuns utvecklingsarbete mot Jämlik hälsa-Nära vård är också Emmaboda kommuns socialtjänstplan https://www.emmaboda.se/socialtjanstplan och Socialnämndens mål för verksamheten https://www.emmaboda.se/socialnamndensmal centrala. \nVi söker nu en verksamhetsutvecklare som tillsammans med oss vill driva hälso-och sjukvårdens utvecklingsresa  framåt!  Du behöver ha en god förståelse för en utvecklingsprocess alla delar såväl det operativa som det strategiska. Där god samarbetsförmåga och lyhördhet för verksamhetens behov är viktigt.\n\nDet är en projektanställning som sträcker sig tom 231231, med möjlighet till eventuell förlängning, tillträde efter överenskommelse.\n\r\n\r\nARBETSUPPGIFTER\nDitt uppdrag innebär att arbeta nära verksamhetens sjuksköterskor/undersköterskor och rehab för att skapa förståelse och hållbarhet mellan verkligheten och rutiner/system. \n\nDu kommer att ansvara för att införa/tydliggöra vårdprocessen i verksamheten samt implementera ett nytt verksamhetssystem. \nDu kommer, i nära samarbete med MAS och verksamhetschef, ansvara för att upprätta struktur kring rutiner, riktlinjer och checklistor för att säkerställa god och säker vård.\nDu kommer att arbeta för digitala lösningar.\nDu kommer att medverka i samverkan med andra aktörer kring Jämlik hälsa-Nära vård.\nDu kan komma att medverka till att arbeta fram underlag för politiska beslut.\n\r\n\r\nKVALIFIKATIONER\nVi söker dig som är legitimerad sjuksköterska, fysioterapeut eller arbetsterapeut gärna med erfarenhet från kommunal hälso-och sjukvård. Har du utbildning och/eller erfarenhet av att ha arbetat med verksamhetsutveckling, processer samt implementeringsarbete ser vi detta som positivt. \n\nSom person är du nyfiken och kreativ med förmåga att snabbt få en överblick över olika situationer. Du är strukturerad, har analytisk förmåga och är van vid att prioritera i det dagliga arbetet. Du har lätt för att arbeta självständigt utifrån uppsatta mål, utvärderar, slutför och följer upp uppdragen. \nDu är pedagogisk och har lätt för att kommunicera med olika målgrupper, knyta kontakter och skapa nätverk både internt och externt.\nDu har god förmåga att uttrycka dig väl i tal och skrift, samt lätt för att entusiasmera och inspirera.\nErfarenhet av arbete i Procapita och Cosmic är meriterande.\nStor vikt läggs vid personlig lämplighet.\nKrav på B körkort.\n\r\n\nÖVRIGT\nEmmaboda kommuns anställda ska spegla den mångfald som finns i kommunen. Vi välkomnar sökande oberoende av ålder, kön och utländsk bakgrund. \n\nVi undanber oss bestämt kontakt med mediesäljare, rekryteringssajter och liknande."
      },
      "headline" : "Verksamhetsutvecklare kommunal hälso- och sjukvård",
      "driving_license" : null,
      "employer" : {
        "email" : null,
        "phone_number" : null,
        "organization_number" : "2120000738",
        "name" : "Emmaboda kommun",
        "url" : null,
        "workplace" : "Emmaboda kommun, Socialförvaltningen"
      },
      "removed_date" : null,
      "logo_url" : "https://www.arbetsformedlingen.se/rest/arbetsgivare/rest/af/v3/organisation/2120000738/logotyper/logo.png",
      "last_publication_date" : "2022-09-04T23:59:59",
      "number_of_vacancies" : 1,
      "occupation" : {
        "concept_id" : "bXNH_MNX_dUR",
        "label" : "Sjuksköterska, grundutbildad",
        "legacy_ams_taxonomy_id" : "7296"
      },
      "occupation_group" : {
        "concept_id" : "Z8ci_bBE_tmx",
        "label" : "Grundutbildade sjuksköterskor",
        "legacy_ams_taxonomy_id" : "2221"
      },
      "employment_type" : {
        "concept_id" : "PFZr_Syz_cUq",
        "label" : "Vanlig anställning",
        "legacy_ams_taxonomy_id" : "1"
      },
      "webpage_url" : "https://arbetsformedlingen.se/platsbanken/annonser/26395712",
      "driving_license_required" : false,
      "application_contacts" : [ {
        "description" : "Katarina Eriksson",
        "email" : "katarina.eriksson@emmaboda.se",
        "telephone" : "0471-24 94 62",
        "name" : null,
        "contact_type" : "Verksamhetschef Hälso- och sjukvården"
      } ],
      "duration" : {
        "concept_id" : "Xj7x_7yZ_jEn",
        "label" : "3 månader – upp till 6 månader",
        "legacy_ams_taxonomy_id" : "3"
      },
      "nice_to_have" : {
        "education_level" : [ ],
        "work_experiences" : [ ],
        "skills" : [ ],
        "education" : [ ],
        "languages" : [ ]
      },
      "application_details" : {
        "via_af" : false,
        "email" : null,
        "other" : null,
        "reference" : "106/2022",
        "url" : "https://recruit.visma.com/Public/Apply.aspx?guidAssignment=4722fb09-4946-4a68-b032-133d2900d429&publishCode=AMS&TK=ce429da5-1353-497c-85a6-f4896b5d646f",
        "information" : null
      },
      "source_type" : "VIA_PLATSBANKEN_DXA",
      "application_deadline" : "2022-09-04T23:59:59",
      "external_id" : "46-212000-0738-4722FB0949464A68B032133D2900D429",
      "workplace_address" : {
        "coordinates" : [ 15.540006, 56.630684 ],
        "city" : null,
        "postcode" : null,
        "municipality" : "Emmaboda",
        "region_concept_id" : "9QUH_2bb_6Np",
        "region" : "Kalmar län",
        "country_code" : "199",
        "region_code" : "08",
        "municipality_concept_id" : "1koj_6Bg_8K6",
        "country_concept_id" : "i46j_HmG_v64",
        "municipality_code" : "0862",
        "street_address" : null,
        "country" : "Sverige"
      },
      "id" : "26395712",
      "experience_required" : true,
      "working_hours_type" : {
        "concept_id" : "6YE1_gAC_R2G",
        "label" : "Heltid",
        "legacy_ams_taxonomy_id" : "1"
      },
      "access" : null,
      "timestamp" : 1660125618371,
      "must_have" : {
        "education_level" : [ ],
        "work_experiences" : [ {
          "concept_id" : "bXNH_MNX_dUR",
          "weight" : 10,
          "label" : "Sjuksköterska, grundutbildad",
          "legacy_ams_taxonomy_id" : "7296"
        } ],
        "skills" : [ ],
        "education" : [ ],
        "languages" : [ ]
      },
      "occupation_field" : {
        "concept_id" : "NYW6_mP6_vwf",
        "label" : "Hälso- och sjukvård",
        "legacy_ams_taxonomy_id" : "8"
      },
      "scope_of_work" : {
        "min" : 100,
        "max" : 100
      },
      "salary_type" : {
        "concept_id" : "oG8G_9cW_nRf",
        "label" : "Fast månads- vecko- eller timlön",
        "legacy_ams_taxonomy_id" : "1"
      },
      "removed" : false,
      "salary_description" : "Månadslön",
      "access_to_own_car" : false,
      "publication_date" : "2022-08-10T12:00:18"
    },
    "name" : "Verksamhetsutvecklare kommunal hälso- och sjukvård",
    "user" : "hannes"
  },
  "sha1" : "361858e5f93e8ff6e24686c4bb9a5d3e1101a2b0",
  "annotations" : [ {
    "preferred-label" : "Verksamhetsutvecklare",
    "sentiment" : "MUST_HAVE",
    "type" : "occupation-name",
    "start-position" : 0,
    "end-position" : 21,
    "concept-id" : "fUJp_V4d_ueo",
    "matched-string" : "verksamhetsutvecklare",
    "annotation-id" : 0
  }, {
    "preferred-label" : "Hälso- och sjukvård",
    "type" : "sni-level-2",
    "start-position" : 31,
    "end-position" : 50,
    "concept-id" : "KhNL_Quq_Xjk",
    "matched-string" : "hälso- och sjukvård",
    "annotation-id" : 24
  }, {
    "preferred-label" : "Sverige",
    "type" : "country",
    "start-position" : 78,
    "end-position" : 85,
    "concept-id" : "i46j_HmG_v64",
    "matched-string" : "Sverige",
    "annotation-id" : 25
  }, {
    "preferred-label" : "Växjö",
    "type" : "municipality",
    "start-position" : 114,
    "end-position" : 119,
    "concept-id" : "mmot_H3A_auW",
    "matched-string" : "Växjö",
    "annotation-id" : 26
  }, {
    "preferred-label" : "Kalmar",
    "type" : "municipality",
    "start-position" : 121,
    "end-position" : 127,
    "concept-id" : "Pnmg_SgP_uHQ",
    "matched-string" : "Kalmar",
    "annotation-id" : 27
  }, {
    "preferred-label" : "Karlskrona",
    "type" : "municipality",
    "start-position" : 132,
    "end-position" : 142,
    "concept-id" : "YSt4_bAa_ccs",
    "matched-string" : "Karlskrona",
    "annotation-id" : 28
  }, {
    "preferred-label" : "Emmaboda",
    "type" : "municipality",
    "start-position" : 150,
    "end-position" : 158,
    "concept-id" : "1koj_6Bg_8K6",
    "matched-string" : "Emmaboda",
    "annotation-id" : 29
  }, {
    "preferred-label" : "Emmaboda",
    "type" : "municipality",
    "start-position" : 343,
    "end-position" : 351,
    "concept-id" : "1koj_6Bg_8K6",
    "matched-string" : "Emmaboda",
    "annotation-id" : 30
  }, {
    "preferred-label" : "Emmaboda",
    "type" : "municipality",
    "start-position" : 458,
    "end-position" : 466,
    "concept-id" : "1koj_6Bg_8K6",
    "matched-string" : "Emmaboda",
    "annotation-id" : 31
  }, {
    "preferred-label" : "Emmaboda",
    "type" : "municipality",
    "start-position" : 551,
    "end-position" : 559,
    "concept-id" : "1koj_6Bg_8K6",
    "matched-string" : "Emmaboda",
    "annotation-id" : 32
  }, {
    "preferred-label" : "Hälso- och sjukvård",
    "type" : "sni-level-2",
    "start-position" : 613,
    "end-position" : 640,
    "concept-id" : "KhNL_Quq_Xjk",
    "matched-string" : "Hälso- och sjukvårdsenheten",
    "annotation-id" : 33
  }, {
    "preferred-label" : "Sjuksköterskor",
    "sentiment" : "NOT_RELEVANT",
    "type" : "ssyk-level-3",
    "start-position" : 693,
    "end-position" : 707,
    "concept-id" : "jzaN_Vqk_TP1",
    "matched-string" : "sjuksköterskor",
    "annotation-id" : 4
  }, {
    "preferred-label" : "Undersköterskor",
    "sentiment" : "NOT_RELEVANT",
    "type" : "ssyk-level-3",
    "start-position" : 709,
    "end-position" : 724,
    "concept-id" : "3EJj_WLs_kgD",
    "matched-string" : "undersköterskor",
    "annotation-id" : 5
  }, {
    "preferred-label" : "Arbetsterapeuter",
    "sentiment" : "NOT_RELEVANT",
    "type" : "ssyk-level-4",
    "start-position" : 726,
    "end-position" : 742,
    "concept-id" : "TPH4_2AM_isT",
    "matched-string" : "arbetsterapeuter",
    "annotation-id" : 6
  }, {
    "preferred-label" : "Fysioterapeuter och sjukgymnaster",
    "sentiment" : "NOT_RELEVANT",
    "type" : "ssyk-level-4",
    "start-position" : 744,
    "end-position" : 773,
    "concept-id" : "s7vU_FhY_L5Z",
    "matched-string" : "fysioterapeuter/sjukgymnaster",
    "annotation-id" : 34
  }, {
    "preferred-label" : "Emmaboda",
    "type" : "municipality",
    "start-position" : 833,
    "end-position" : 849,
    "concept-id" : "1koj_6Bg_8K6",
    "matched-string" : "Emmaboda kommuns",
    "annotation-id" : 35
  }, {
    "preferred-label" : "Emmaboda",
    "type" : "municipality",
    "start-position" : 1085,
    "end-position" : 1101,
    "concept-id" : "1koj_6Bg_8K6",
    "matched-string" : "Emmaboda kommuns",
    "annotation-id" : 36
  }, {
    "preferred-label" : "Hälso- och sjukvård",
    "type" : "sni-level-2",
    "start-position" : 1102,
    "end-position" : 1120,
    "concept-id" : "KhNL_Quq_Xjk",
    "matched-string" : "hälso-och sjukvård",
    "annotation-id" : 37
  }, {
    "preferred-label" : "Emmaboda",
    "type" : "municipality",
    "start-position" : 1131,
    "end-position" : 1139,
    "concept-id" : "1koj_6Bg_8K6",
    "matched-string" : "kommunen",
    "annotation-id" : 38
  }, {
    "preferred-label" : "Hälso- och sjukvård",
    "type" : "sni-level-2",
    "start-position" : 1617,
    "end-position" : 1635,
    "concept-id" : "KhNL_Quq_Xjk",
    "matched-string" : "hälso-och sjukvård",
    "annotation-id" : 39
  }, {
    "preferred-label" : "Sverige",
    "type" : "country",
    "start-position" : 1692,
    "end-position" : 1699,
    "concept-id" : "i46j_HmG_v64",
    "matched-string" : "Sverige",
    "annotation-id" : 42
  }, {
    "preferred-label" : "Kalmar län",
    "type" : "region",
    "start-position" : 1701,
    "end-position" : 1718,
    "concept-id" : "9QUH_2bb_6Np",
    "matched-string" : "Region Kalmar län",
    "annotation-id" : 41
  }, {
    "preferred-label" : "Emmaboda",
    "type" : "municipality",
    "start-position" : 1723,
    "end-position" : 1738,
    "concept-id" : "1koj_6Bg_8K6",
    "matched-string" : "Emmaboda kommun",
    "annotation-id" : 40
  }, {
    "preferred-label" : "Hälsa",
    "sentiment" : "MUST_HAVE",
    "type" : "keyword",
    "start-position" : 1775,
    "end-position" : 1780,
    "concept-id" : "Abys_5p1_Cnq",
    "matched-string" : "hälsa",
    "annotation-id" : 9
  }, {
    "preferred-label" : "Emmaboda",
    "type" : "municipality",
    "start-position" : 2385,
    "end-position" : 2401,
    "concept-id" : "1koj_6Bg_8K6",
    "matched-string" : "Emmaboda kommuns",
    "annotation-id" : 43
  }, {
    "preferred-label" : "Utvecklingsarbete",
    "sentiment" : "MUST_HAVE",
    "type" : "skill",
    "start-position" : 2402,
    "end-position" : 2419,
    "concept-id" : "LsGo_Kh2_3kH",
    "matched-string" : "utvecklingsarbete",
    "annotation-id" : 11
  }, {
    "preferred-label" : "Hälsa",
    "sentiment" : "MUST_HAVE",
    "type" : "keyword",
    "start-position" : 2431,
    "end-position" : 2436,
    "concept-id" : "Abys_5p1_Cnq",
    "matched-string" : "hälsa",
    "annotation-id" : 12
  }, {
    "preferred-label" : "Emmaboda",
    "type" : "municipality",
    "start-position" : 2456,
    "end-position" : 2472,
    "concept-id" : "1koj_6Bg_8K6",
    "matched-string" : "Emmaboda kommuns",
    "annotation-id" : 44
  }, {
    "preferred-label" : "Verksamhetsutvecklare",
    "sentiment" : "MUST_HAVE",
    "type" : "occupation-name",
    "start-position" : 2639,
    "end-position" : 2660,
    "concept-id" : "fUJp_V4d_ueo",
    "matched-string" : "verksamhetsutvecklare",
    "annotation-id" : 13
  }, {
    "preferred-label" : "Hälso- och sjukvård",
    "type" : "sni-level-2",
    "start-position" : 2696,
    "end-position" : 2717,
    "concept-id" : "KhNL_Quq_Xjk",
    "matched-string" : "hälso-och sjukvårdens",
    "annotation-id" : 45
  }, {
    "preferred-label" : "Sjuksköterskor",
    "sentiment" : "NOT_RELEVANT",
    "type" : "ssyk-level-3",
    "start-position" : 3134,
    "end-position" : 3148,
    "concept-id" : "jzaN_Vqk_TP1",
    "matched-string" : "sjuksköterskor",
    "annotation-id" : 16
  }, {
    "preferred-label" : "Undersköterskor",
    "sentiment" : "NOT_RELEVANT",
    "type" : "ssyk-level-3",
    "start-position" : 3149,
    "end-position" : 3164,
    "concept-id" : "3EJj_WLs_kgD",
    "matched-string" : "undersköterskor",
    "annotation-id" : 17
  }, {
    "preferred-label" : "Medicinskt ansvarig sjuksköterska/MAS",
    "sentiment" : "NOT_RELEVANT",
    "type" : "occupation-name",
    "start-position" : 3413,
    "end-position" : 3416,
    "concept-id" : "hbyN_1pA_VxX",
    "matched-string" : "mas",
    "annotation-id" : 18
  }, {
    "preferred-label" : "Verksamhetschef, hälso- och sjukvård",
    "sentiment" : "NOT_RELEVANT",
    "type" : "occupation-name",
    "start-position" : 3421,
    "end-position" : 3436,
    "concept-id" : "41Vq_aR6_yRb",
    "matched-string" : "verksamhetschef",
    "annotation-id" : 46
  }, {
    "preferred-label" : "Hälsa",
    "sentiment" : "MUST_HAVE",
    "type" : "keyword",
    "start-position" : 3665,
    "end-position" : 3670,
    "concept-id" : "Abys_5p1_Cnq",
    "matched-string" : "hälsa",
    "annotation-id" : 19
  }, {
    "preferred-label" : "Sjuksköterska, grundutbildad",
    "sentiment" : "MUST_HAVE",
    "type" : "occupation-name",
    "start-position" : 3812,
    "end-position" : 3825,
    "concept-id" : "bXNH_MNX_dUR",
    "matched-string" : "sjuksköterska",
    "annotation-id" : 20
  }, {
    "preferred-label" : "Fysioterapeut/Sjukgymnast",
    "sentiment" : "MUST_HAVE",
    "type" : "occupation-name",
    "start-position" : 3827,
    "end-position" : 3840,
    "concept-id" : "raVz_oTw_N3e",
    "matched-string" : "fysioterapeut",
    "annotation-id" : 21
  }, {
    "preferred-label" : "Arbetsterapeut",
    "sentiment" : "MUST_HAVE",
    "type" : "occupation-name",
    "start-position" : 3847,
    "end-position" : 3861,
    "concept-id" : "heGV_uHh_o8W",
    "matched-string" : "arbetsterapeut",
    "annotation-id" : 22
  }, {
    "preferred-label" : "Kommunal förvaltning",
    "type" : "skill",
    "start-position" : 3888,
    "end-position" : 3896,
    "concept-id" : "detQ_YNb_9nG",
    "matched-string" : "kommunal",
    "annotation-id" : 47
  }, {
    "preferred-label" : "Hälso- och sjukvård",
    "type" : "sni-level-2",
    "start-position" : 3897,
    "end-position" : 3915,
    "concept-id" : "KhNL_Quq_Xjk",
    "matched-string" : "hälso-och sjukvård",
    "annotation-id" : 48
  }, {
    "preferred-label" : "visa nyfikenhet",
    "sentiment" : "MUST_HAVE",
    "type" : "esco-skill",
    "start-position" : 4084,
    "end-position" : 4091,
    "concept-id" : "mbHa_NFf_vyf",
    "matched-string" : "nyfiken",
    "annotation-id" : 49
  }, {
    "preferred-label" : "arbeta självständigt",
    "sentiment" : "MUST_HAVE",
    "type" : "esco-skill",
    "start-position" : 4282,
    "end-position" : 4302,
    "concept-id" : "NyFu_HHd_zhz",
    "matched-string" : "arbeta självständigt",
    "annotation-id" : 51
  }, {
    "preferred-label" : "B",
    "sentiment" : "MUST_HAVE",
    "type" : "driving-licence",
    "start-position" : 4718,
    "end-position" : 4727,
    "concept-id" : "VTK8_WRx_GcM",
    "matched-string" : "B körkort",
    "annotation-id" : 50
  }, {
    "preferred-label" : "Emmaboda",
    "type" : "municipality",
    "start-position" : 4739,
    "end-position" : 4755,
    "concept-id" : "1koj_6Bg_8K6",
    "matched-string" : "Emmaboda kommuns",
    "annotation-id" : 52
  }, {
    "preferred-label" : "Emmaboda",
    "type" : "municipality",
    "start-position" : 4802,
    "end-position" : 4810,
    "concept-id" : "1koj_6Bg_8K6",
    "matched-string" : "kommunen",
    "annotation-id" : 53
  } ],
  "text" : "Verksamhetsutvecklare kommunal hälso- och sjukvård\nMitt i hjärtat av sydöstra Sverige - med pendlingsavstånd till Växjö, Kalmar och Karlskrona ligger Emmaboda. Om du vill bo i vacker natur, nära skog och sjö, skapa ditt drömboende till en rimlig kostnad, vara garanterad förskoleplats och dessutom ha flera stora evenemang i din närhet så kan Emmaboda vara något för dig. Vill du dessutom vara med och påverka din omgivning har du bäst möjligheter för det i Emmaboda! Kreativa människor har påverkat och levandegjort miljön och livet här sedan länge. Emmaboda lever och vårt liv präglas av omtanke och öppenhet.\n\nHälso- och sjukvårdsenheten, en av socialförvaltningens verksamheter, består av sjuksköterskor, undersköterskor, arbetsterapeuter, fysioterapeuter/sjukgymnaster och rehabassistenter. \nSocialförvaltningen arbetar utifrån Emmaboda kommuns socialtjänstplan Ditt  ansvar, vårt stöd. Ett självständigt liv! Den enskildes behov och livssituation påverkar hur dina arbetsuppgifter ser ut och ska utföras. Vi sätter det förebyggande arbetet och det salutogena synsättet i fokus.\n\nEmmaboda kommuns hälso-och sjukvård är liksom kommunen i stort, liten och smidig med närhet och samarbete mellan olika verksamheter. Det småskaliga och smidiga är många gånger en fördel i de större utmaningarna som vi delar med alla kommuner, men kan förstås också innebära hinder att ta sig över eller runt genom att finna på kreativa lösningar. Verksamhetens syfte och mål är att hela tiden utvecklas för att kunna fortsätta att utföra en god och säker vård enligt våra invånares behov och förväntningar. Läs mer om vår kommunala hälso-och sjukvård: https://www.emmaboda.se/omsorg-stod--hjalp/sjukvard. \n\nSverige, Region Kalmar län och Emmaboda kommun håller på att ställa om till Jämlik hälsa-Nära vård. Det pågår utvecklingsprocesser mot detta lokalt, regionalt och nationellt. Omställningen innebär att vi i större utsträckning ska  samskapa med invånare och arbeta mera personcentrerat, sammanhållet, proaktivt och hälsofrämjande. Vi ska förflytta oss i vårt sätt att arbeta från fokus på organisation till fokus på person och relation. Det kommer handla om mer konkreta och praktiska steg liksom om mer abstrakta steg i vårt professionella förhållningssätt. Läs gärna mer om omställningen: https://skr.se/skr/halsasjukvard/utvecklingavverksamhet/naravard/omstallningtillnaravard.57446.html\n\nI Emmaboda kommuns utvecklingsarbete mot Jämlik hälsa-Nära vård är också Emmaboda kommuns socialtjänstplan https://www.emmaboda.se/socialtjanstplan och Socialnämndens mål för verksamheten https://www.emmaboda.se/socialnamndensmal centrala. \nVi söker nu en verksamhetsutvecklare som tillsammans med oss vill driva hälso-och sjukvårdens utvecklingsresa  framåt!  Du behöver ha en god förståelse för en utvecklingsprocess alla delar såväl det operativa som det strategiska. Där god samarbetsförmåga och lyhördhet för verksamhetens behov är viktigt.\n\nDet är en projektanställning som sträcker sig tom 231231, med möjlighet till eventuell förlängning, tillträde efter överenskommelse.\n\r\n\r\nARBETSUPPGIFTER\nDitt uppdrag innebär att arbeta nära verksamhetens sjuksköterskor/undersköterskor och rehab för att skapa förståelse och hållbarhet mellan verkligheten och rutiner/system. \n\nDu kommer att ansvara för att införa/tydliggöra vårdprocessen i verksamheten samt implementera ett nytt verksamhetssystem. \nDu kommer, i nära samarbete med MAS och verksamhetschef, ansvara för att upprätta struktur kring rutiner, riktlinjer och checklistor för att säkerställa god och säker vård.\nDu kommer att arbeta för digitala lösningar.\nDu kommer att medverka i samverkan med andra aktörer kring Jämlik hälsa-Nära vård.\nDu kan komma att medverka till att arbeta fram underlag för politiska beslut.\n\r\n\r\nKVALIFIKATIONER\nVi söker dig som är legitimerad sjuksköterska, fysioterapeut eller arbetsterapeut gärna med erfarenhet från kommunal hälso-och sjukvård. Har du utbildning och/eller erfarenhet av att ha arbetat med verksamhetsutveckling, processer samt implementeringsarbete ser vi detta som positivt. \n\nSom person är du nyfiken och kreativ med förmåga att snabbt få en överblick över olika situationer. Du är strukturerad, har analytisk förmåga och är van vid att prioritera i det dagliga arbetet. Du har lätt för att arbeta självständigt utifrån uppsatta mål, utvärderar, slutför och följer upp uppdragen. \nDu är pedagogisk och har lätt för att kommunicera med olika målgrupper, knyta kontakter och skapa nätverk både internt och externt.\nDu har god förmåga att uttrycka dig väl i tal och skrift, samt lätt för att entusiasmera och inspirera.\nErfarenhet av arbete i Procapita och Cosmic är meriterande.\nStor vikt läggs vid personlig lämplighet.\nKrav på B körkort.\n\r\n\nÖVRIGT\nEmmaboda kommuns anställda ska spegla den mångfald som finns i kommunen. Vi välkomnar sökande oberoende av ålder, kön och utländsk bakgrund. \n\nVi undanber oss bestämt kontakt med mediesäljare, rekryteringssajter och liknande."
}