{
  "meta" : {
    "dataset-id" : "myh-spreadsheet-2021",
    "type" : "education-description",
    "dataset-document-id" : "YH00362",
    "user" : "kristof.fischer"
  },
  "sha1" : "6f4797d90932b668f653f9a08d25772ba188440c",
  "annotations" : [ {
    "preferred-label" : "Yrkesbevis/examen",
    "sentiment" : "OFFERED",
    "type" : "skill-headline",
    "start-position" : 255,
    "end-position" : 261,
    "concept-id" : "HjPN_99i_cFD",
    "matched-string" : "examen",
    "annotation-id" : 0
  }, {
    "preferred-label" : "Högskoleutbildning, yrkesinriktad, 2 år",
    "sentiment" : "OFFERED",
    "type" : "sun-education-level-3",
    "start-position" : 262,
    "end-position" : 281,
    "concept-id" : "zdKB_pTL_HMS",
    "matched-string" : "Yrkeshögskoleexamen",
    "annotation-id" : 14
  }, {
    "preferred-label" : "Mölndal",
    "type" : "municipality",
    "start-position" : 394,
    "end-position" : 401,
    "concept-id" : "mc45_ki9_Bv3",
    "matched-string" : "Mölndal",
    "annotation-id" : 15
  }, {
    "preferred-label" : "Intellektuell funktionsnedsättning, arbetsrehabilitering",
    "sentiment" : "OFFERED",
    "type" : "skill",
    "start-position" : 535,
    "end-position" : 586,
    "concept-id" : "ufbK_zKv_qmJ",
    "matched-string" : "intellektuella och kognitiva funktionsnedsättningar",
    "annotation-id" : 16
  }, {
    "preferred-label" : "Intellektuell funktionsnedsättning, arbetsrehabilitering",
    "sentiment" : "OFFERED",
    "type" : "skill",
    "start-position" : 622,
    "end-position" : 652,
    "concept-id" : "ufbK_zKv_qmJ",
    "matched-string" : "aktivering, stöd och stimulans",
    "annotation-id" : 17
  }, {
    "preferred-label" : "Intellektuell funktionsnedsättning, arbetsrehabilitering",
    "sentiment" : "OFFERED",
    "type" : "skill",
    "start-position" : 735,
    "end-position" : 804,
    "concept-id" : "ufbK_zKv_qmJ",
    "matched-string" : "sinnesstimulerande aktiviteter, kognitivt stöd och kommunikationsstöd",
    "annotation-id" : 18
  }, {
    "preferred-label" : "dokumentation inom hälso- och sjukvård",
    "sentiment" : "OFFERED",
    "type" : "esco-skill",
    "start-position" : 859,
    "end-position" : 889,
    "concept-id" : "2hA5_AC8_bsP",
    "matched-string" : "dokumentation och presentation",
    "annotation-id" : 19
  }, {
    "preferred-label" : "Kvalitetsutveckling, omsorg",
    "sentiment" : "OFFERED",
    "type" : "skill",
    "start-position" : 965,
    "end-position" : 982,
    "concept-id" : "gtVT_cXB_d7f",
    "matched-string" : "kvalitetsutveckla",
    "annotation-id" : 21
  }, {
    "preferred-label" : "Pedagogiskt förhållningssätt",
    "sentiment" : "OFFERED",
    "type" : "skill",
    "start-position" : 987,
    "end-position" : 1020,
    "concept-id" : "qMfa_U8e_Lto",
    "matched-string" : "pedagogiskt vägleda vardagsarbete",
    "annotation-id" : 20
  }, {
    "preferred-label" : "Daglig verksamhet",
    "sentiment" : "OFFERED",
    "type" : "skill",
    "start-position" : 1067,
    "end-position" : 1084,
    "concept-id" : "zMr8_cTC_PCB",
    "matched-string" : "daglig verksamhet",
    "annotation-id" : 2
  }, {
    "preferred-label" : "Särskola",
    "sentiment" : "OFFERED",
    "type" : "skill",
    "start-position" : 1086,
    "end-position" : 1094,
    "concept-id" : "tcgM_8bo_yiv",
    "matched-string" : "särskola",
    "annotation-id" : 3
  }, {
    "preferred-label" : "Sjukhem/Särskilt boende",
    "sentiment" : "OFFERED",
    "type" : "skill",
    "start-position" : 1096,
    "end-position" : 1123,
    "concept-id" : "ZpXZ_PG5_B9s",
    "matched-string" : "grupp- eller korttidsboende",
    "annotation-id" : 22
  }, {
    "preferred-label" : "Stödpedagog",
    "sentiment" : "OFFERED",
    "type" : "occupation-name",
    "start-position" : 1367,
    "end-position" : 1378,
    "concept-id" : "NSEG_DmQ_waj",
    "matched-string" : "stödpedagog",
    "annotation-id" : 4
  }, {
    "preferred-label" : "Eftergymnasial utbildning",
    "sentiment" : "OFFERED",
    "type" : "sni-level-3",
    "start-position" : 1638,
    "end-position" : 1663,
    "concept-id" : "bg6r_KVf_KNN",
    "matched-string" : "eftergymnasial utbildning",
    "annotation-id" : 6
  }, {
    "preferred-label" : "Aktiveringspedagog",
    "sentiment" : "OFFERED",
    "type" : "keyword",
    "start-position" : 1746,
    "end-position" : 1764,
    "concept-id" : "jWh3_qhF_c1x",
    "matched-string" : "aktiveringspedagog",
    "annotation-id" : 7
  }, {
    "preferred-label" : "Annan utbildning inom omvårdnad",
    "sentiment" : "OFFERED",
    "type" : "sun-education-field-4",
    "start-position" : 2069,
    "end-position" : 2100,
    "concept-id" : "2K8B_GSo_Rbw",
    "matched-string" : "Förutsättningar för yrkesrollen",
    "annotation-id" : 23
  }, {
    "preferred-label" : "Annan utbildning inom omvårdnad",
    "sentiment" : "OFFERED",
    "type" : "sun-education-field-4",
    "start-position" : 2117,
    "end-position" : 2153,
    "concept-id" : "2K8B_GSo_Rbw",
    "matched-string" : "Människan i utveckling och aktivitet",
    "annotation-id" : 24
  }, {
    "preferred-label" : "Annan omvårdnadsutbildning, funktionsnedsatta",
    "sentiment" : "OFFERED",
    "type" : "sun-education-field-4",
    "start-position" : 2170,
    "end-position" : 2223,
    "concept-id" : "Y8WH_Nam_wZN",
    "matched-string" : "Människan med funktionsnedsättning i sampel med andra",
    "annotation-id" : 25
  }, {
    "preferred-label" : null,
    "sentiment" : "OFFERED",
    "type" : "sun-education-field-4",
    "start-position" : 2240,
    "comment" : "praktik",
    "end-position" : 2243,
    "concept-id" : null,
    "matched-string" : "LIA",
    "annotation-id" : 26
  }, {
    "preferred-label" : "Annan utbildning inom omvårdnad",
    "sentiment" : "OFFERED",
    "type" : "sun-education-field-4",
    "start-position" : 2331,
    "end-position" : 2384,
    "concept-id" : "2K8B_GSo_Rbw",
    "matched-string" : "Vardagsaktivitet, kommunikation och sinnesstimulering",
    "annotation-id" : 27
  }, {
    "preferred-label" : "Annan utbildning inom omvårdnad",
    "sentiment" : "OFFERED",
    "type" : "sun-education-field-4",
    "start-position" : 2403,
    "end-position" : 2437,
    "concept-id" : "2K8B_GSo_Rbw",
    "matched-string" : "Vardagsaktivitet och dokumentation",
    "annotation-id" : 28
  }, {
    "preferred-label" : "Annan utbildning inom omvårdnad",
    "sentiment" : "OFFERED",
    "type" : "sun-education-field-4",
    "start-position" : 2454,
    "end-position" : 2479,
    "concept-id" : "2K8B_GSo_Rbw",
    "matched-string" : "Kommunikation och samspel",
    "annotation-id" : 29
  }, {
    "preferred-label" : "Annan utbildning inom omvårdnad",
    "sentiment" : "OFFERED",
    "type" : "sun-education-field-4",
    "start-position" : 2496,
    "end-position" : 2542,
    "concept-id" : "2K8B_GSo_Rbw",
    "matched-string" : "Tillgänglighet, delaktighet och välfärdsteknik",
    "annotation-id" : 30
  }, {
    "preferred-label" : "Annan utbildning inom omvårdnad",
    "sentiment" : "OFFERED",
    "type" : "sun-education-field-4",
    "start-position" : 2559,
    "end-position" : 2601,
    "concept-id" : "2K8B_GSo_Rbw",
    "matched-string" : "Sinnesstimulering och social dokumentation",
    "annotation-id" : 31
  }, {
    "preferred-label" : null,
    "sentiment" : "OFFERED",
    "type" : "sun-education-field-4",
    "start-position" : 2618,
    "comment" : "praktik",
    "end-position" : 2621,
    "concept-id" : null,
    "matched-string" : "LIA",
    "annotation-id" : 32
  }, {
    "preferred-label" : "Annan utbildning inom omvårdnad",
    "sentiment" : "OFFERED",
    "type" : "sun-education-field-4",
    "start-position" : 2729,
    "end-position" : 2768,
    "concept-id" : "2K8B_GSo_Rbw",
    "matched-string" : "Resultat, implementering och vägledning",
    "annotation-id" : 33
  }, {
    "preferred-label" : "Annan utbildning inom omvårdnad",
    "sentiment" : "OFFERED",
    "type" : "sun-education-field-4",
    "start-position" : 2785,
    "end-position" : 2843,
    "concept-id" : "2K8B_GSo_Rbw",
    "matched-string" : "Ett vägledande förhållningssätt och evidensbaserad praktik",
    "annotation-id" : 34
  }, {
    "preferred-label" : "Annan utbildning inom omvårdnad",
    "sentiment" : "OFFERED",
    "type" : "sun-education-field-4",
    "start-position" : 2860,
    "end-position" : 2897,
    "concept-id" : "2K8B_GSo_Rbw",
    "matched-string" : "Utveckling för evidensbaserad praktik",
    "annotation-id" : 35
  } ],
  "text" : "Reflektion utvecklar professionalitet – du blir efterfrågad!    Vill du arbeta med att göra skillnad för andra? Vill du göra vardagen mer aktiv och meningsfull för personer som har en utvecklingsstörning, autism eller förvärvad hjärnskada?    Snabbfakta  Examen Yrkeshögskoleexamen  Start 13 september 2021  Längd 300 YH-poäng (2 år)  Studietakt 75% bunden 3 dagar/vecka skolförlagt  Studieort Mölndal, Campus Mölndal  Antal platser 20 st  LIA 23 veckor (praktik)    UNDER STUDIETIDEN  Under YH-utbildningen fördjupar du din kunskap i intellektuella och kognitiva funktionsnedsättningar. Du utvecklar kompetens vad gäller aktivering, stöd och stimulans i vardagen för personer i behov av stöd. Du tränar dina färdigheter i att utforma sinnesstimulerande aktiviteter, kognitivt stöd och kommunikationsstöd.    Under YH-utbildningen fördjupar du din kunskap om dokumentation och presentation. Du utvecklar också ditt professionella förhållningssätt som grund för att kvalitetsutveckla och pedagogiskt vägleda vardagsarbete. Färdigheter som kan användas inom exempelvis daglig verksamhet, särskola, grupp- eller korttidsboende.    Yrkeshögskoleutbildningen genomförs i nära samarbete med arbetslivet.    EFERFRÅGAD UTBILDNING  Inom Göteborgsregionens kommunförbund (GR) beslutades 2011 om att införa gemensamma titlar inom funktionshinderområdet. För att erhålla titeln Stödpedagog krävs utbildning på eftergymnasial nivå.    Antalet pedagoger inom verksamheterna Boende och Daglig verksamhet har sedan dess ökat från cirka 200 till cirka 400 till antalet.    Målet som beräknas vara uppnått 2025 är att 20 procent av de anställda ska ha en eftergymnasial utbildning. Idag är det cirka 12 procent som har en motsvarande utbildning. Utbildningen som Aktiveringspedagog ger även kompetens som efterfrågas inom följande områden:  - Personlig assistans  - Grundskola  - Grundsärskola  - Gymnasiesärskola  - Kortidsverksamhet inom LSS    KURSER SOM DU LÄSER (YH-poäng*):  *5 YH-poäng motsvarar 1 veckas helstudier    Utbildningen är uppbyggd av tre delar/block;    Block 1   - Förutsättningar för yrkesrollen, 70 YH-poäng  - Människan i utveckling och aktivitet, 20 YH-poäng  - Människan med funktionsnedsättning i sampel med andra, 30 YH-poäng  - LIA 1 - Människan med funktionsnedsättning i samspel med andra, 20 YH-poäng    Block 2   - Vardagsaktivitet, kommunikation och sinnesstimulering, 140 YH-poäng   - Vardagsaktivitet och dokumentation, 25 YH-poäng  - Kommunikation och samspel, 25 YH-poäng  - Tillgänglighet, delaktighet och välfärdsteknik, 25 YH-poäng  - Sinnesstimulering och social dokumentation, 25 YH-poäng  - LIA 2 - Vardagsaktivitet, kommunikation, välfärdsteknik och dokumentation, 40 yrkeshögskolepoäng    Block 3  - Resultat, implementering och vägledning, 90 YH-poäng  - Ett vägledande förhållningssätt och evidensbaserad praktik, 40 YH-poäng  - Utveckling för evidensbaserad praktik, 25 YH-poäng  - Examensarbete, 25 YH-poäng"
}