{
  "meta" : {
    "dataset-id" : "myh-spreadsheet-2021",
    "type" : "education-description",
    "dataset-document-id" : "YH01587",
    "user" : "hannes"
  },
  "sha1" : "809680d5f95a926bdafb5ac26eab3743b5e9609c",
  "annotations" : [ {
    "preferred-label" : "Frontend-utvecklare",
    "sentiment" : "OFFERED",
    "type" : "occupation-name",
    "start-position" : 0,
    "end-position" : 9,
    "concept-id" : "GDHs_eoz_uKx",
    "matched-string" : "Front end",
    "annotation-id" : 12
  }, {
    "preferred-label" : "webbutvecklare",
    "sentiment" : "OFFERED",
    "type" : "esco-occupation",
    "start-position" : 10,
    "end-position" : 24,
    "concept-id" : "AkVP_op7_dSC",
    "matched-string" : "webbutvecklare",
    "annotation-id" : 0
  }, {
    "preferred-label" : "Webbapplikationsutvecklare",
    "sentiment" : "NOT_RELEVANT",
    "type" : "keyword",
    "start-position" : 68,
    "end-position" : 73,
    "concept-id" : "ovLk_gz7_FAe",
    "matched-string" : "skapa",
    "annotation-id" : 18
  }, {
    "preferred-label" : "Webbapplikationsutvecklare",
    "sentiment" : "NOT_RELEVANT",
    "type" : "keyword",
    "start-position" : 101,
    "end-position" : 118,
    "concept-id" : "ovLk_gz7_FAe",
    "matched-string" : "webbapplikationer",
    "annotation-id" : 17
  }, {
    "preferred-label" : "Frontend-utvecklare",
    "sentiment" : "NOT_RELEVANT",
    "type" : "occupation-name",
    "start-position" : 153,
    "end-position" : 162,
    "concept-id" : "GDHs_eoz_uKx",
    "matched-string" : "Front end",
    "annotation-id" : 13
  }, {
    "preferred-label" : "webbutvecklare",
    "sentiment" : "NOT_RELEVANT",
    "type" : "esco-occupation",
    "start-position" : 163,
    "end-position" : 177,
    "concept-id" : "AkVP_op7_dSC",
    "matched-string" : "webbutvecklare",
    "annotation-id" : 1
  }, {
    "preferred-label" : "Högskoleutbildning, yrkesinriktad, 2 år",
    "sentiment" : "OFFERED",
    "type" : "sun-education-level-3",
    "start-position" : 189,
    "end-position" : 208,
    "concept-id" : "zdKB_pTL_HMS",
    "matched-string" : "tvååriga utbildning",
    "annotation-id" : 19
  }, {
    "preferred-label" : "JavaScript, programmeringsspråk",
    "sentiment" : "OFFERED",
    "type" : "skill",
    "start-position" : 263,
    "end-position" : 273,
    "concept-id" : "DHhX_uVf_y6X",
    "matched-string" : "javascript",
    "annotation-id" : 2
  }, {
    "preferred-label" : "Frontend-utvecklare",
    "sentiment" : "NOT_RELEVANT",
    "type" : "occupation-name",
    "start-position" : 361,
    "end-position" : 370,
    "concept-id" : "GDHs_eoz_uKx",
    "matched-string" : "front end",
    "annotation-id" : 14
  }, {
    "preferred-label" : "webbutvecklare",
    "sentiment" : "NOT_RELEVANT",
    "type" : "esco-occupation",
    "start-position" : 371,
    "end-position" : 385,
    "concept-id" : "AkVP_op7_dSC",
    "matched-string" : "webbutvecklare",
    "annotation-id" : 3
  }, {
    "preferred-label" : "Sverige",
    "sentiment" : "NOT_RELEVANT",
    "type" : "country",
    "start-position" : 432,
    "end-position" : 439,
    "concept-id" : "i46j_HmG_v64",
    "matched-string" : "Sverige",
    "annotation-id" : 20
  }, {
    "preferred-label" : "Data/IT",
    "sentiment" : "NOT_RELEVANT",
    "type" : "occupation-field",
    "start-position" : 556,
    "end-position" : 558,
    "concept-id" : "apaJ_2ja_LuF",
    "matched-string" : "it",
    "annotation-id" : 5
  }, {
    "preferred-label" : "Frontend-utvecklare",
    "sentiment" : "NOT_RELEVANT",
    "type" : "occupation-name",
    "start-position" : 788,
    "end-position" : 797,
    "concept-id" : "GDHs_eoz_uKx",
    "matched-string" : "front end",
    "annotation-id" : 15
  }, {
    "preferred-label" : "webbutvecklare",
    "sentiment" : "NOT_RELEVANT",
    "type" : "esco-occupation",
    "start-position" : 798,
    "end-position" : 812,
    "concept-id" : "AkVP_op7_dSC",
    "matched-string" : "webbutvecklare",
    "annotation-id" : 6
  }, {
    "preferred-label" : "Webb",
    "sentiment" : "NOT_RELEVANT",
    "type" : "skill",
    "start-position" : 874,
    "end-position" : 878,
    "concept-id" : "KKQV_aGF_bWq",
    "matched-string" : "webb",
    "annotation-id" : 7
  }, {
    "preferred-label" : "Högskoleutbildning, yrkesinriktad, 2 år",
    "sentiment" : "OFFERED",
    "type" : "sun-education-level-3",
    "start-position" : 1038,
    "end-position" : 1048,
    "concept-id" : "zdKB_pTL_HMS",
    "matched-string" : "utbildning",
    "annotation-id" : 21
  }, {
    "preferred-label" : "webbutvecklare",
    "sentiment" : "NOT_RELEVANT",
    "type" : "esco-occupation",
    "start-position" : 1051,
    "end-position" : 1065,
    "concept-id" : "AkVP_op7_dSC",
    "matched-string" : "webbutvecklare",
    "annotation-id" : 8
  }, {
    "preferred-label" : "Frontend-utvecklare",
    "sentiment" : "NOT_RELEVANT",
    "type" : "occupation-name",
    "start-position" : 1066,
    "end-position" : 1075,
    "concept-id" : "GDHs_eoz_uKx",
    "matched-string" : "front end",
    "annotation-id" : 16
  }, {
    "preferred-label" : "Frontend-utvecklare",
    "sentiment" : "OFFERED",
    "type" : "occupation-name",
    "start-position" : 1106,
    "end-position" : 1126,
    "concept-id" : "GDHs_eoz_uKx",
    "matched-string" : "Front end utvecklare",
    "annotation-id" : 22
  }, {
    "preferred-label" : "JavaScript, programmeringsspråk",
    "sentiment" : "OFFERED",
    "type" : "skill",
    "start-position" : 1127,
    "end-position" : 1137,
    "concept-id" : "DHhX_uVf_y6X",
    "matched-string" : "javascript",
    "annotation-id" : 9
  }, {
    "preferred-label" : "Systemutvecklare/Programmerare",
    "sentiment" : "OFFERED",
    "type" : "occupation-name",
    "start-position" : 1139,
    "end-position" : 1155,
    "concept-id" : "fg7B_yov_smw",
    "matched-string" : "systemutvecklare",
    "annotation-id" : 10
  }, {
    "preferred-label" : "UX-designer",
    "sentiment" : "OFFERED",
    "type" : "occupation-name",
    "start-position" : 1157,
    "end-position" : 1168,
    "concept-id" : "iwJU_gW4_SxT",
    "matched-string" : "ux-designer",
    "annotation-id" : 11
  }, {
    "preferred-label" : "Javascript-utvecklare",
    "sentiment" : "OFFERED",
    "type" : "keyword",
    "start-position" : 1174,
    "end-position" : 1194,
    "concept-id" : "PDG1_fV1_WnX",
    "matched-string" : "JavaScriptutvecklare",
    "annotation-id" : 23
  } ],
  "text" : "Front end webbutvecklare   Vill du använda din kreativitet till att skapa interaktiva och avancerade webbapplikationer och webbsidor? Då låter du som en Front end webbutvecklare! Efter vår tvååriga utbildning kan du bland annat det populära programmeringsspråket JavaScript, och har de teoretiska och praktiska färdigheter för att kunna arbeta som kvalificerad front end webbutvecklare.    BRANSCHEN  Utan digital kompetens stannar Sverige, och utan en modern webbsida stannar trafiken dit. Vi lever i ett digitalt samhälle där efterfrågan på personer med IT-kompetens är stor nu, och i framtiden. Förmågan att ta vara på digitaliseringens möjligheter har blivit en framgångsfaktor, samtidigt som konkurrensen ökat i takt med konsumenternas krav på den digitala upplevelsen. Som utbildad front end webbutvecklare har du specialiserade kompetenser i att arbeta med responsiv webb och mobila plattformar, och är därför mycket eftertraktad på arbetsmarknaden, där du har många arbetsmöjligheter och utmaningar som väntar.    KARRIÄR  Med en utbildning i webbutvecklare front end kan du bland annat arbeta som Front end utvecklare JavaScript, systemutvecklare, UX-designer samt JavaScriptutvecklare.    \n"
}