{
  "meta" : {
    "dataset-id" : "myh-spreadsheet-2021",
    "type" : "education-description",
    "dataset-document-id" : "YH00302",
    "user" : "kristof.fischer"
  },
  "sha1" : "9f94aa602e24d899d784e015b6a6357bea0de32a",
  "annotations" : [ {
    "preferred-label" : "Stödpedagog",
    "sentiment" : "OFFERED",
    "type" : "occupation-name",
    "start-position" : 73,
    "end-position" : 86,
    "concept-id" : "NSEG_DmQ_waj",
    "matched-string" : "stödpedagoger",
    "annotation-id" : 12
  }, {
    "preferred-label" : "handleda anställda",
    "sentiment" : "OFFERED",
    "type" : "esco-skill",
    "start-position" : 458,
    "end-position" : 476,
    "concept-id" : "o8pN_QiG_fwx",
    "matched-string" : "handleder kollegor",
    "annotation-id" : 13
  }, {
    "preferred-label" : "Vårdare/Arbetshandledare/Boendestödjare",
    "sentiment" : "OFFERED",
    "type" : "occupation-name",
    "start-position" : 648,
    "end-position" : 662,
    "concept-id" : "c32f_KpH_CfN",
    "matched-string" : "boendestödjare",
    "annotation-id" : 1
  }, {
    "preferred-label" : "LSS-handläggare",
    "sentiment" : "OFFERED",
    "type" : "occupation-name",
    "start-position" : 666,
    "end-position" : 681,
    "concept-id" : "6gF2_LeK_d34",
    "matched-string" : "lss-handläggare",
    "annotation-id" : 2
  }, {
    "preferred-label" : "Stödpedagog",
    "sentiment" : "OFFERED",
    "type" : "occupation-name",
    "start-position" : 684,
    "end-position" : 698,
    "concept-id" : "NSEG_DmQ_waj",
    "matched-string" : "omsorgspedagog",
    "annotation-id" : 3
  }, {
    "preferred-label" : "Stödpedagog",
    "sentiment" : "OFFERED",
    "type" : "occupation-name",
    "start-position" : 701,
    "end-position" : 747,
    "concept-id" : "NSEG_DmQ_waj",
    "matched-string" : "Pedagogisk vägledare inom funktionsnedsättning",
    "annotation-id" : 14
  }, {
    "preferred-label" : "samverkan inom det psykosociala området",
    "sentiment" : "OFFERED",
    "type" : "esco-skill",
    "start-position" : 769,
    "end-position" : 778,
    "concept-id" : "q8jx_pq3_XRm",
    "matched-string" : "Samverkan",
    "annotation-id" : 15
  }, {
    "preferred-label" : "Utvecklingsarbete",
    "sentiment" : "OFFERED",
    "type" : "skill",
    "start-position" : 854,
    "end-position" : 871,
    "concept-id" : "LsGo_Kh2_3kH",
    "matched-string" : "utvecklingsarbete",
    "annotation-id" : 4
  }, {
    "preferred-label" : "Daglig verksamhet",
    "sentiment" : "OFFERED",
    "type" : "skill",
    "start-position" : 881,
    "end-position" : 898,
    "concept-id" : "zMr8_cTC_PCB",
    "matched-string" : "daglig verksamhet",
    "annotation-id" : 5
  }, {
    "preferred-label" : "fungera som mentor för andra verksamma inom hälso- och sjukvården",
    "sentiment" : "OFFERED",
    "type" : "esco-skill",
    "start-position" : 911,
    "end-position" : 957,
    "concept-id" : "uZPL_y98_HSg",
    "matched-string" : "handledare eller utöva mentorskap för kollegor",
    "annotation-id" : 16
  }, {
    "preferred-label" : "Pedagogiskt förhållningssätt",
    "sentiment" : "OFFERED",
    "type" : "skill",
    "start-position" : 979,
    "end-position" : 1009,
    "concept-id" : "qMfa_U8e_Lto",
    "matched-string" : "pedagogisk och etisk kompetens",
    "annotation-id" : 17
  }, {
    "preferred-label" : "Stödpedagog",
    "sentiment" : "OFFERED",
    "type" : "occupation-name",
    "start-position" : 1095,
    "end-position" : 1106,
    "concept-id" : "NSEG_DmQ_waj",
    "matched-string" : "stödpedagog",
    "annotation-id" : 6
  }, {
    "preferred-label" : "Funktionsnedsättning, omsorgserfarenhet",
    "sentiment" : "MUST_HAVE",
    "type" : "skill",
    "start-position" : 1157,
    "end-position" : 1198,
    "concept-id" : "X3ec_jqv_xRp",
    "matched-string" : "arbetar inom funktionsnedsättningsområdet",
    "annotation-id" : 18
  }, {
    "preferred-label" : "Högskoleutbildning, yrkesinriktad, 2 år",
    "sentiment" : "OFFERED",
    "type" : "sun-education-level-3",
    "start-position" : 1247,
    "end-position" : 1259,
    "concept-id" : "zdKB_pTL_HMS",
    "matched-string" : "Utbildningen",
    "annotation-id" : 19
  }, {
    "preferred-label" : "Dokumentations- och informationsvetenskap",
    "sentiment" : "OFFERED",
    "type" : "sun-education-field-4",
    "start-position" : 1424,
    "end-position" : 1458,
    "concept-id" : "eaWv_6EA_ZG2",
    "matched-string" : "Dokumentation och kvalitetssäkring",
    "annotation-id" : 20
  }, {
    "preferred-label" : null,
    "sentiment" : "OFFERED",
    "type" : "sun-education-field-4",
    "start-position" : 1461,
    "end-position" : 1501,
    "concept-id" : null,
    "matched-string" : "Etik och professionellt förhållningssätt",
    "annotation-id" : 21
  }, {
    "preferred-label" : null,
    "sentiment" : "OFFERED",
    "type" : "sun-education-field-4",
    "start-position" : 1504,
    "end-position" : 1517,
    "concept-id" : null,
    "matched-string" : "Examensarbete",
    "annotation-id" : 22
  }, {
    "preferred-label" : "Annan omvårdnadsutbildning, funktionsnedsatta",
    "sentiment" : "OFFERED",
    "type" : "sun-education-field-4",
    "start-position" : 1520,
    "end-position" : 1542,
    "concept-id" : "Y8WH_Nam_wZN",
    "matched-string" : "Funktionsnedsättningar",
    "annotation-id" : 23
  }, {
    "preferred-label" : null,
    "sentiment" : "OFFERED",
    "type" : "sun-education-field-4",
    "start-position" : 1545,
    "end-position" : 1596,
    "concept-id" : null,
    "matched-string" : "Kommunikation, välfärdsteknologi och kognitivt stöd",
    "annotation-id" : 24
  }, {
    "preferred-label" : null,
    "sentiment" : "OFFERED",
    "type" : "sun-education-field-4",
    "start-position" : 1599,
    "end-position" : 1621,
    "concept-id" : null,
    "matched-string" : "LIA (lärande i arbete)",
    "annotation-id" : 25
  }, {
    "preferred-label" : null,
    "sentiment" : "OFFERED",
    "type" : "sun-education-field-4",
    "start-position" : 1624,
    "end-position" : 1646,
    "concept-id" : null,
    "matched-string" : "Människan i utveckling",
    "annotation-id" : 26
  }, {
    "preferred-label" : "Annan utbildning inom pedagogik och lärarutbildning",
    "sentiment" : "OFFERED",
    "type" : "sun-education-field-4",
    "start-position" : 1650,
    "end-position" : 1693,
    "concept-id" : "xW52_8We_zmQ",
    "matched-string" : "Pedagogiska teorier, metoder och arbetssätt",
    "annotation-id" : 27
  }, {
    "preferred-label" : "Annan utbildning i juridik och rättsvetenskap",
    "sentiment" : "OFFERED",
    "type" : "sun-education-field-4",
    "start-position" : 1696,
    "end-position" : 1731,
    "concept-id" : "jLhR_w1C_nTT",
    "matched-string" : "Praktisk juridik inom social omsorg",
    "annotation-id" : 28
  } ],
  "text" : "Inom den privata och offentliga omsorgen och skolan finns stora behov av stödpedagoger för den som lever med funktionsnedsättning. Under utbildningen får du professionell kunskap om hur du med hjälp av pedagogisk vägledning och individanpassat vardagsstöd kan öka möjligheterna till en bättre tillvaro och hälsa för dem i behov av stöd. Du kommer också att få större pedagogisk och etisk kompetens i mötet med både brukare och anhöriga, samt lära dig hur du handleder kollegor och bedriver verksamhet. Utbildningen är framtagen tillsammans med representanter från arbetslivet. Välkommen till en utbildning där du verkligen behövs.    YRKESROLLER  -Boendestödjare   -LSS-handläggare  -Omsorgspedagog  -Pedagogisk vägledare inom funktionsnedsättning    ARBETSUPPGIFTER  -Samverkan och koordination inom såväl offentligt som privat finansierad vård  -Driva utvecklingsarbete i boende/daglig verksamhet  -Verka som handledare eller utöva mentorskap för kollegor  -Bidra med medveten pedagogisk och etisk kompetens i möte med såväl brukare som anhöriga.      UTBILDNINGENS UPPLÄGG  Utbildningen till Stödpedagog är en distansbaserad vidareutbildning för dig som arbetar inom funktionsnedsättningsområdet i såväl offentligt som privat finansierad vård. Utbildningen omfattar 200 YH-poäng, vilket motsvarar två års studier på halvtid. Upplägget med deltid och distans innebär att du kan arbeta och studera samtidigt.      KURSER  -Dokumentation och kvalitetssäkring  -Etik och professionellt förhållningssätt  -Examensarbete  -Funktionsnedsättningar  -Kommunikation, välfärdsteknologi och kognitivt stöd  -LIA (lärande i arbete)  -Människan i utveckling   -Pedagogiska teorier, metoder och arbetssätt  -Praktisk juridik inom social omsorg"
}