{
  "meta" : {
    "jobad" : {
      "description" : {
        "requirements" : null,
        "needs" : null,
        "company_information" : null,
        "text_formatted" : "Om tjänsten\n\nFör kunds räkning söker vi nu en administratör för ett uppdrag med start omgående. Företaget är i en samhällsviktig bransch som jobbar med drift och underhåll. De söker nu en medarbetare som vill komma in och avlasta med administration kopplat till felavhjälpning.\n\nUppdraget är ett konsultuppdrag där man blir anställd som konsult hos oss på Wrknest och arbetar på plats hos kund. Uppdraget är på 6-12 månader med goda chanser till förlängning eller överrekrytering.\n\nDina framtida arbetsuppgifter\n\nI rollen som administratör med kommer du ha en viktig roll på företaget med fokus på felavhjälpning. Din roll kommer vara varierande och både innefatta skapande och hantering av felanmälningar, mötesprotokoll, fakturering, månadsrapporter och powerpoint presentationer.\n\nRollen innebär att ha övergripande koll i trafikförvaltningen system för att ta emot information kring järnvägsfelen. När ett fel har uppkommit på deras järnvägar så kommer man ta emot felet och kommunicera det till rätt tekniker via telefon och mejl som sedan åker ut och löser problemet. I vissa ärenden kommer man även fakturera i Navision för felärendet.\n\nVi söker dig som har\n\n- Erfarenhet av liknande administrativa arbetsuppgifter\n- Flytande språkkunskaper i svenska och engelska\n- Goda kunskaper inom officepaketet\n- Erfarenhet av någon form av affärssystem\n\n\nVi ser det som meriterande\n\n- Om man har erfarenhet av Navision sedan tidigare\n\nVid denna rekrytering lägger vi stor vikt vid dina personliga egenskaper, då de är avgörande för hur du kommer att lyckas i rollen och företaget. Vi förstår att man inte kan allting från början - men du ska ha en vilja att lära dig! Därför söker vi dig som är noggrann, strukturerad och självgående. Som person är du även ansvarstagande i ditt arbete och kommunikativ i din kontakt med kollegor.\n\nÖvrig information\n\nStart: 1 augusti\n\nPlats: Mörby Centrum, Stockholm\n\nOmfattning: Heltid, 100% (40 h/v)\n\nAnställningsform: Konsult 6-12 mån med chans till överrekrytering.\n\nArbetstider: 7:00-15:30\n\nSök gärna så snart som möjligt då vi jobbar med löpande urval.",
        "conditions" : "Heltid\r\nAnställningstid enligt överenskommelse",
        "text" : "Om tjänsten\n\nFör kunds räkning söker vi nu en administratör för ett uppdrag med start omgående. Företaget är i en samhällsviktig bransch som jobbar med drift och underhåll. De söker nu en medarbetare som vill komma in och avlasta med administration kopplat till felavhjälpning.\n\nUppdraget är ett konsultuppdrag där man blir anställd som konsult hos oss på Wrknest och arbetar på plats hos kund. Uppdraget är på 6-12 månader med goda chanser till förlängning eller överrekrytering.\n\nDina framtida arbetsuppgifter\n\nI rollen som administratör med kommer du ha en viktig roll på företaget med fokus på felavhjälpning. Din roll kommer vara varierande och både innefatta skapande och hantering av felanmälningar, mötesprotokoll, fakturering, månadsrapporter och powerpoint presentationer.\n\nRollen innebär att ha övergripande koll i trafikförvaltningen system för att ta emot information kring järnvägsfelen. När ett fel har uppkommit på deras järnvägar så kommer man ta emot felet och kommunicera det till rätt tekniker via telefon och mejl som sedan åker ut och löser problemet. I vissa ärenden kommer man även fakturera i Navision för felärendet.\n\nVi söker dig som har\n\n- Erfarenhet av liknande administrativa arbetsuppgifter\n- Flytande språkkunskaper i svenska och engelska\n- Goda kunskaper inom officepaketet\n- Erfarenhet av någon form av affärssystem\n\n\nVi ser det som meriterande\n\n- Om man har erfarenhet av Navision sedan tidigare\n\nVid denna rekrytering lägger vi stor vikt vid dina personliga egenskaper, då de är avgörande för hur du kommer att lyckas i rollen och företaget. Vi förstår att man inte kan allting från början - men du ska ha en vilja att lära dig! Därför söker vi dig som är noggrann, strukturerad och självgående. Som person är du även ansvarstagande i ditt arbete och kommunikativ i din kontakt med kollegor.\n\nÖvrig information\n\nStart: 1 augusti\n\nPlats: Mörby Centrum, Stockholm\n\nOmfattning: Heltid, 100% (40 h/v)\n\nAnställningsform: Konsult 6-12 mån med chans till överrekrytering.\n\nArbetstider: 7:00-15:30\n\nSök gärna så snart som möjligt då vi jobbar med löpande urval."
      },
      "headline" : "Administratör för omgående start!",
      "driving_license" : null,
      "employer" : {
        "email" : null,
        "phone_number" : null,
        "organization_number" : "5592932213",
        "name" : "Wrknest AB",
        "url" : "http://www.wrknest.se",
        "workplace" : "Wrknest"
      },
      "removed_date" : null,
      "logo_url" : null,
      "last_publication_date" : "2022-12-31T23:59:59",
      "number_of_vacancies" : 1,
      "occupation" : {
        "concept_id" : "s5pR_WNm_R8W",
        "label" : "Administrativ assistent",
        "legacy_ams_taxonomy_id" : "2787"
      },
      "occupation_group" : {
        "concept_id" : "eQ4M_CNm_ozj",
        "label" : "Övriga kontorsassistenter och sekreterare",
        "legacy_ams_taxonomy_id" : "4119"
      },
      "employment_type" : {
        "concept_id" : "PFZr_Syz_cUq",
        "label" : "Vanlig anställning",
        "legacy_ams_taxonomy_id" : "1"
      },
      "webpage_url" : "https://arbetsformedlingen.se/platsbanken/annonser/26325559",
      "driving_license_required" : false,
      "application_contacts" : [ {
        "description" : "Andrea Rahlen",
        "email" : "andrea@wrknest.se",
        "telephone" : null,
        "name" : null,
        "contact_type" : null
      } ],
      "duration" : {
        "concept_id" : "qQUd_4qe_NDT",
        "label" : "6 månader eller längre",
        "legacy_ams_taxonomy_id" : "2"
      },
      "nice_to_have" : {
        "education_level" : [ ],
        "work_experiences" : [ ],
        "skills" : [ ],
        "education" : [ ],
        "languages" : [ ]
      },
      "application_details" : {
        "via_af" : false,
        "email" : null,
        "other" : null,
        "reference" : null,
        "url" : "https://careers.wrknest.se/jobs/1874939-administrator-for-omgaende-start?promotion=436814-arbetsformedlingen",
        "information" : null
      },
      "source_type" : "VIA_PLATSBANKEN_DXA",
      "application_deadline" : "2022-12-31T23:59:59",
      "external_id" : "46-559293-2213-1874939-25",
      "workplace_address" : {
        "coordinates" : [ 18.06858, 59.329323 ],
        "city" : null,
        "postcode" : null,
        "municipality" : "Stockholm",
        "region_concept_id" : "CifL_Rzy_Mku",
        "region" : "Stockholms län",
        "country_code" : "199",
        "region_code" : "01",
        "municipality_concept_id" : "AvNB_uwa_6n6",
        "country_concept_id" : "i46j_HmG_v64",
        "municipality_code" : "0180",
        "street_address" : null,
        "country" : "Sverige"
      },
      "id" : "26325559",
      "experience_required" : true,
      "working_hours_type" : {
        "concept_id" : "6YE1_gAC_R2G",
        "label" : "Heltid",
        "legacy_ams_taxonomy_id" : "1"
      },
      "access" : null,
      "timestamp" : 1657779779314,
      "must_have" : {
        "education_level" : [ ],
        "work_experiences" : [ {
          "concept_id" : "s5pR_WNm_R8W",
          "weight" : 10,
          "label" : "Administratör/Administrativ assistent",
          "legacy_ams_taxonomy_id" : "2787"
        } ],
        "skills" : [ ],
        "education" : [ ],
        "languages" : [ ]
      },
      "occupation_field" : {
        "concept_id" : "X82t_awd_Qyc",
        "label" : "Administration, ekonomi, juridik",
        "legacy_ams_taxonomy_id" : "1"
      },
      "scope_of_work" : {
        "min" : 100,
        "max" : 100
      },
      "salary_type" : {
        "concept_id" : "oG8G_9cW_nRf",
        "label" : "Fast månads- vecko- eller timlön",
        "legacy_ams_taxonomy_id" : "1"
      },
      "removed" : false,
      "salary_description" : "Lön enligt överenskommelse",
      "access_to_own_car" : false,
      "publication_date" : "2022-07-14T08:22:59"
    },
    "name" : "Administratör för omgående start!",
    "user" : "hannes"
  },
  "sha1" : "fb0a5ca1f5fb8d8ea12b55f1a26a46eae0898671",
  "annotations" : [ {
    "preferred-label" : "Administratör/Administrativ assistent",
    "sentiment" : "MUST_HAVE",
    "type" : "occupation-name",
    "start-position" : 0,
    "end-position" : 13,
    "concept-id" : "s5pR_WNm_R8W",
    "matched-string" : "administratör",
    "annotation-id" : 0
  }, {
    "preferred-label" : "Administratör/Administrativ assistent",
    "sentiment" : "MUST_HAVE",
    "type" : "occupation-name",
    "start-position" : 80,
    "end-position" : 93,
    "concept-id" : "s5pR_WNm_R8W",
    "matched-string" : "administratör",
    "annotation-id" : 1
  }, {
    "preferred-label" : "Administrativ konsult",
    "type" : "keyword",
    "start-position" : 371,
    "end-position" : 378,
    "concept-id" : "ym5Z_9vi_b8u",
    "matched-string" : "konsult",
    "annotation-id" : 7
  }, {
    "preferred-label" : "Administratör/Administrativ assistent",
    "sentiment" : "MUST_HAVE",
    "type" : "occupation-name",
    "start-position" : 560,
    "end-position" : 573,
    "concept-id" : "s5pR_WNm_R8W",
    "matched-string" : "administratör",
    "annotation-id" : 2
  }, {
    "preferred-label" : "Månadsrapporter",
    "sentiment" : "MUST_HAVE",
    "type" : "skill",
    "start-position" : 770,
    "end-position" : 785,
    "concept-id" : "5X5B_xr3_VSY",
    "matched-string" : "månadsrapporter",
    "annotation-id" : 3
  }, {
    "preferred-label" : "Microsoft Navision, affärssystem",
    "type" : "skill",
    "start-position" : 1152,
    "end-position" : 1160,
    "concept-id" : "e47M_NXa_4NG",
    "matched-string" : "Navision",
    "annotation-id" : 8
  }, {
    "preferred-label" : "Svenska",
    "sentiment" : "MUST_HAVE",
    "type" : "language",
    "start-position" : 1284,
    "end-position" : 1291,
    "concept-id" : "zSLA_vw2_FXN",
    "matched-string" : "svenska",
    "annotation-id" : 4
  }, {
    "preferred-label" : "Engelska",
    "sentiment" : "MUST_HAVE",
    "type" : "language",
    "start-position" : 1296,
    "end-position" : 1304,
    "concept-id" : "NVxJ_hLg_TYS",
    "matched-string" : "engelska",
    "annotation-id" : 5
  }, {
    "preferred-label" : "MS Office",
    "sentiment" : "MUST_HAVE",
    "type" : "skill",
    "start-position" : 1327,
    "end-position" : 1340,
    "concept-id" : "w8bU_wHe_omF",
    "matched-string" : "officepaketet",
    "annotation-id" : 6
  }, {
    "preferred-label" : "Microsoft Navision, affärssystem",
    "type" : "skill",
    "start-position" : 1441,
    "end-position" : 1449,
    "concept-id" : "e47M_NXa_4NG",
    "matched-string" : "Navision",
    "annotation-id" : 9
  }, {
    "preferred-label" : "noggrannhet",
    "type" : "esco-skill",
    "start-position" : 1726,
    "end-position" : 1734,
    "concept-id" : "mrsW_EkL_KRD",
    "matched-string" : "noggrann",
    "annotation-id" : 10
  }, {
    "preferred-label" : "visa ansvarstagande",
    "type" : "esco-skill",
    "start-position" : 1788,
    "end-position" : 1802,
    "concept-id" : "bcRp_hxV_f5G",
    "matched-string" : "ansvarstagande",
    "annotation-id" : 11
  }, {
    "preferred-label" : "Stockholm",
    "type" : "municipality",
    "start-position" : 1922,
    "end-position" : 1931,
    "concept-id" : "AvNB_uwa_6n6",
    "matched-string" : "Stockholm",
    "annotation-id" : 12
  }, {
    "preferred-label" : "Heltid",
    "type" : "worktime-extent",
    "start-position" : 1945,
    "end-position" : 1966,
    "concept-id" : "6YE1_gAC_R2G",
    "matched-string" : "Heltid, 100% (40 h/v)",
    "annotation-id" : 13
  } ],
  "text" : "Administratör för omgående start!\nOm tjänsten\n\nFör kunds räkning söker vi nu en administratör för ett uppdrag med start omgående. Företaget är i en samhällsviktig bransch som jobbar med drift och underhåll. De söker nu en medarbetare som vill komma in och avlasta med administration kopplat till felavhjälpning.\n\nUppdraget är ett konsultuppdrag där man blir anställd som konsult hos oss på Wrknest och arbetar på plats hos kund. Uppdraget är på 6-12 månader med goda chanser till förlängning eller överrekrytering.\n\nDina framtida arbetsuppgifter\n\nI rollen som administratör med kommer du ha en viktig roll på företaget med fokus på felavhjälpning. Din roll kommer vara varierande och både innefatta skapande och hantering av felanmälningar, mötesprotokoll, fakturering, månadsrapporter och powerpoint presentationer.\n\nRollen innebär att ha övergripande koll i trafikförvaltningen system för att ta emot information kring järnvägsfelen. När ett fel har uppkommit på deras järnvägar så kommer man ta emot felet och kommunicera det till rätt tekniker via telefon och mejl som sedan åker ut och löser problemet. I vissa ärenden kommer man även fakturera i Navision för felärendet.\n\nVi söker dig som har\n\n- Erfarenhet av liknande administrativa arbetsuppgifter\n- Flytande språkkunskaper i svenska och engelska\n- Goda kunskaper inom officepaketet\n- Erfarenhet av någon form av affärssystem\n\n\nVi ser det som meriterande\n\n- Om man har erfarenhet av Navision sedan tidigare\n\nVid denna rekrytering lägger vi stor vikt vid dina personliga egenskaper, då de är avgörande för hur du kommer att lyckas i rollen och företaget. Vi förstår att man inte kan allting från början - men du ska ha en vilja att lära dig! Därför söker vi dig som är noggrann, strukturerad och självgående. Som person är du även ansvarstagande i ditt arbete och kommunikativ i din kontakt med kollegor.\n\nÖvrig information\n\nStart: 1 augusti\n\nPlats: Mörby Centrum, Stockholm\n\nOmfattning: Heltid, 100% (40 h/v)\n\nAnställningsform: Konsult 6-12 mån med chans till överrekrytering.\n\nArbetstider: 7:00-15:30\n\nSök gärna så snart som möjligt då vi jobbar med löpande urval."
}