{
  "meta" : {
    "jobad" : {
      "description" : {
        "requirements" : null,
        "needs" : null,
        "company_information" : null,
        "text_formatted" : "<p>Vi söker två personer för att ingå i specialgruppen. Dessa ska arbeta med fönsterputsning, golvvård och olika behandlingar av olika typer av golv exempelvis linoleum, pvc, trägolv mm. Arbetstiden är heltid (40 tim / vecka) kan både vara dag kväll och helg och arbetsplatsen är StorStockholmsområdet. Du ska vara stresstålig, noggran och ansvarsfull. Lön enligt kollektivavtal.</p>",
        "conditions" : null,
        "text" : "Vi söker två personer för att ingå i specialgruppen. Dessa ska arbeta med fönsterputsning, golvvård och olika behandlingar av olika typer av golv exempelvis linoleum, pvc, trägolv mm. Arbetstiden är heltid (40 tim / vecka) kan både vara dag kväll och helg och arbetsplatsen är StorStockholmsområdet. Du ska vara stresstålig, noggran och ansvarsfull. Lön enligt kollektivavtal."
      },
      "headline" : "Två medarbetare till städbolag sökes",
      "driving_license" : null,
      "employer" : {
        "email" : null,
        "phone_number" : null,
        "organization_number" : "5560688300",
        "name" : "Mellansvenska Städ AB",
        "url" : null,
        "workplace" : "MELLANSVENSKA STÄD AKTIEBOLAG"
      },
      "removed_date" : null,
      "logo_url" : "https://www.arbetsformedlingen.se/rest/arbetsgivare/rest/af/v3/arbetsplatser/80977076/logotyper/logo.png",
      "last_publication_date" : "2022-07-27T23:59:59",
      "number_of_vacancies" : 2,
      "occupation" : {
        "concept_id" : "dYo1_D8c_87U",
        "label" : "Städare/Lokalvårdare",
        "legacy_ams_taxonomy_id" : "464"
      },
      "occupation_group" : {
        "concept_id" : "Z6TY_xDf_Yup",
        "label" : "Städare",
        "legacy_ams_taxonomy_id" : "9111"
      },
      "employment_type" : {
        "concept_id" : "PFZr_Syz_cUq",
        "label" : "Vanlig anställning",
        "legacy_ams_taxonomy_id" : "1"
      },
      "webpage_url" : "https://arbetsformedlingen.se/platsbanken/annonser/26323408",
      "driving_license_required" : false,
      "application_contacts" : [ {
        "description" : null,
        "email" : "argyris.sthlm@mellstad.se",
        "telephone" : null,
        "name" : "Argyris Chatzidis",
        "contact_type" : "Arbetsledare"
      } ],
      "duration" : {
        "concept_id" : "a7uU_j21_mkL",
        "label" : "Tills vidare",
        "legacy_ams_taxonomy_id" : "1"
      },
      "nice_to_have" : {
        "education_level" : [ ],
        "work_experiences" : [ {
          "concept_id" : "dYo1_D8c_87U",
          "weight" : 5,
          "label" : "Städare/Lokalvårdare",
          "legacy_ams_taxonomy_id" : "464"
        } ],
        "skills" : [ ],
        "education" : [ ],
        "languages" : [ {
          "concept_id" : "rod1_aPk_8V5",
          "weight" : 5,
          "label" : "Albanska",
          "legacy_ams_taxonomy_id" : "243"
        }, {
          "concept_id" : "RKH6_hwa_6nk",
          "weight" : 5,
          "label" : "Grekiska",
          "legacy_ams_taxonomy_id" : "306"
        }, {
          "concept_id" : "NVxJ_hLg_TYS",
          "weight" : 5,
          "label" : "Engelska",
          "legacy_ams_taxonomy_id" : "283"
        } ]
      },
      "application_details" : {
        "via_af" : false,
        "email" : "argyris.sthlm@mellstad.se",
        "other" : null,
        "reference" : null,
        "url" : null,
        "information" : null
      },
      "source_type" : "VIA_ANNONSERA",
      "application_deadline" : "2022-07-27T23:59:59",
      "external_id" : null,
      "workplace_address" : {
        "coordinates" : [ 18.016154880638563, 59.356269307547926 ],
        "city" : "SOLNA",
        "postcode" : "17148",
        "municipality" : "Solna",
        "region_concept_id" : "CifL_Rzy_Mku",
        "region" : "Stockholms län",
        "country_code" : "199",
        "region_code" : "01",
        "municipality_concept_id" : "zHxw_uJZ_NJ8",
        "country_concept_id" : "i46j_HmG_v64",
        "municipality_code" : "0184",
        "street_address" : "BANVAKTSVÄGEN 24",
        "country" : "Sverige"
      },
      "id" : "26323408",
      "experience_required" : true,
      "working_hours_type" : {
        "concept_id" : "6YE1_gAC_R2G",
        "label" : "Heltid",
        "legacy_ams_taxonomy_id" : "1"
      },
      "access" : null,
      "timestamp" : 1657706540283,
      "must_have" : {
        "education_level" : [ ],
        "work_experiences" : [ ],
        "skills" : [ ],
        "education" : [ ],
        "languages" : [ ]
      },
      "occupation_field" : {
        "concept_id" : "whao_Q6A_ScE",
        "label" : "Sanering och renhållning",
        "legacy_ams_taxonomy_id" : "12"
      },
      "scope_of_work" : {
        "min" : 0,
        "max" : 100
      },
      "salary_type" : {
        "concept_id" : "oG8G_9cW_nRf",
        "label" : "Fast månads- vecko- eller timlön",
        "legacy_ams_taxonomy_id" : "1"
      },
      "removed" : false,
      "salary_description" : null,
      "access_to_own_car" : false,
      "publication_date" : "2022-07-13T12:02:20"
    },
    "name" : "Två medarbetare till städbolag sökes",
    "user" : "kristof.fischer"
  },
  "sha1" : "50108c7783ca0bfc5db58109a14a180fcfccbfbe",
  "annotations" : [ {
    "preferred-label" : "Fönsterputsning",
    "sentiment" : "MUST_HAVE",
    "type" : "skill",
    "start-position" : 111,
    "end-position" : 126,
    "concept-id" : "BQPp_SQs_dtc",
    "matched-string" : "fönsterputsning",
    "annotation-id" : 0
  }, {
    "preferred-label" : null,
    "sentiment" : "MUST_HAVE",
    "type" : "skill",
    "start-position" : 128,
    "end-position" : 136,
    "concept-id" : null,
    "matched-string" : "golvvård",
    "annotation-id" : 3
  }, {
    "preferred-label" : "Golv, produktkunskap",
    "sentiment" : "MUST_HAVE",
    "type" : "skill",
    "start-position" : 147,
    "end-position" : 182,
    "concept-id" : "iaYF_Mzc_9wq",
    "matched-string" : "behandlingar av olika typer av golv",
    "annotation-id" : 4
  }, {
    "preferred-label" : "Heltid",
    "type" : "worktime-extent",
    "start-position" : 236,
    "end-position" : 242,
    "concept-id" : "6YE1_gAC_R2G",
    "matched-string" : "heltid",
    "annotation-id" : 5
  }, {
    "preferred-label" : "hantera stressande situationer",
    "sentiment" : "MUST_HAVE",
    "type" : "esco-skill",
    "start-position" : 349,
    "end-position" : 360,
    "concept-id" : "qhLq_ZdJ_rqJ",
    "matched-string" : "stresstålig",
    "annotation-id" : 6
  }, {
    "preferred-label" : "noggrannhet",
    "sentiment" : "MUST_HAVE",
    "type" : "esco-skill",
    "start-position" : 362,
    "end-position" : 369,
    "concept-id" : "mrsW_EkL_KRD",
    "matched-string" : "noggran",
    "annotation-id" : 7
  }, {
    "preferred-label" : "visa ansvarstagande",
    "sentiment" : "MUST_HAVE",
    "type" : "esco-skill",
    "start-position" : 374,
    "end-position" : 385,
    "concept-id" : "bcRp_hxV_f5G",
    "matched-string" : "ansvarsfull",
    "annotation-id" : 8
  } ],
  "text" : "Två medarbetare till städbolag sökes\nVi söker två personer för att ingå i specialgruppen. Dessa ska arbeta med fönsterputsning, golvvård och olika behandlingar av olika typer av golv exempelvis linoleum, pvc, trägolv mm. Arbetstiden är heltid (40 tim / vecka) kan både vara dag kväll och helg och arbetsplatsen är StorStockholmsområdet. Du ska vara stresstålig, noggran och ansvarsfull. Lön enligt kollektivavtal."
}