{
  "meta" : {
    "jobad" : {
      "description" : {
        "requirements" : null,
        "needs" : null,
        "company_information" : null,
        "text_formatted" : "<p>Bluebeq är en eventbyrå som framförallt jobbar med mässor, konferenser och event. Inom området event jobbar vi med sampling, utdelning av produkter på gator och torg samt demo i butiker.</p><p>Vi söker nu personer som kan tolka mellan Svenska och Ukrainska eller Engelska och Ukrainska. Vi jobbar med en hel del och event och du bör se detta som ett varierat och roligt extrajobb. Vid begränsade tillfällen kommer att jobba med den del ukrainare med följande uppgifter: </p><p>Vi söker glad och positiva människor som gillar att möta andra människor och inte tvekar att ta sig an nya utmaningar. Vi har ett fåtal krav:</p><ul><li>Flexibel </li><li>Stresstålig </li><li>Serviceinriktad </li></ul><p>Meriterande </p><ul><li>Van vid tunga lyft </li><li>Händig</li><li>Erfarenhet av butik eller lager</li><li>Erfarenhet av service</li></ul><p>Välkommen med din ansökan</p>",
        "conditions" : null,
        "text" : "Bluebeq är en eventbyrå som framförallt jobbar med mässor, konferenser och event. Inom området event jobbar vi med sampling, utdelning av produkter på gator och torg samt demo i butiker.\nVi söker nu personer som kan tolka mellan Svenska och Ukrainska eller Engelska och Ukrainska. Vi jobbar med en hel del och event och du bör se detta som ett varierat och roligt extrajobb. Vid begränsade tillfällen kommer att jobba med den del ukrainare med följande uppgifter: \nVi söker glad och positiva människor som gillar att möta andra människor och inte tvekar att ta sig an nya utmaningar. Vi har ett fåtal krav:\nFlexibel \nStresstålig \nServiceinriktad \n\nMeriterande \nVan vid tunga lyft \nHändig\nErfarenhet av butik eller lager\nErfarenhet av service\n\nVälkommen med din ansökan"
      },
      "headline" : "Tolk - Svenska-Ukrainska/Engelska-Ukrainska ",
      "driving_license" : null,
      "employer" : {
        "email" : null,
        "phone_number" : null,
        "organization_number" : "5569179921",
        "name" : "Bluebeq AB",
        "url" : "http://www.bluebeq.se",
        "workplace" : "Bluebeq AB"
      },
      "removed_date" : null,
      "logo_url" : "https://www.arbetsformedlingen.se/rest/arbetsgivare/rest/af/v3/arbetsplatser/85559527/logotyper/logo.png",
      "last_publication_date" : "2022-08-26T23:59:59",
      "number_of_vacancies" : 1,
      "occupation" : {
        "concept_id" : "vaEY_R9R_LjB",
        "label" : "Tolk",
        "legacy_ams_taxonomy_id" : "6037"
      },
      "occupation_group" : {
        "concept_id" : "PQDm_Z63_zst",
        "label" : "Översättare, tolkar och lingvister m.fl.",
        "legacy_ams_taxonomy_id" : "2643"
      },
      "employment_type" : {
        "concept_id" : "1paU_aCR_nGn",
        "label" : "Behovsanställning",
        "legacy_ams_taxonomy_id" : "4"
      },
      "webpage_url" : "https://arbetsformedlingen.se/platsbanken/annonser/26357917",
      "driving_license_required" : false,
      "application_contacts" : [ ],
      "duration" : {
        "concept_id" : null,
        "label" : null,
        "legacy_ams_taxonomy_id" : null
      },
      "nice_to_have" : {
        "education_level" : [ ],
        "work_experiences" : [ ],
        "skills" : [ ],
        "education" : [ ],
        "languages" : [ {
          "concept_id" : "zSLA_vw2_FXN",
          "weight" : 5,
          "label" : "Svenska",
          "legacy_ams_taxonomy_id" : "502"
        }, {
          "concept_id" : "NVxJ_hLg_TYS",
          "weight" : 5,
          "label" : "Engelska",
          "legacy_ams_taxonomy_id" : "283"
        } ]
      },
      "application_details" : {
        "via_af" : false,
        "email" : "job@bluebeq.se",
        "other" : null,
        "reference" : "Tolk Stockholm ",
        "url" : null,
        "information" : null
      },
      "source_type" : "VIA_ANNONSERA",
      "application_deadline" : "2022-08-26T23:59:59",
      "external_id" : null,
      "workplace_address" : {
        "coordinates" : [ 18.00579114802412, 59.274233975617946 ],
        "city" : "ÄLVSJÖ",
        "postcode" : "12530",
        "municipality" : "Stockholm",
        "region_concept_id" : "CifL_Rzy_Mku",
        "region" : "Stockholms län",
        "country_code" : "199",
        "region_code" : "01",
        "municipality_concept_id" : "AvNB_uwa_6n6",
        "country_concept_id" : "i46j_HmG_v64",
        "municipality_code" : "0180",
        "street_address" : "Mässgatan 6",
        "country" : "Sverige"
      },
      "id" : "26357917",
      "experience_required" : false,
      "working_hours_type" : {
        "concept_id" : null,
        "label" : null,
        "legacy_ams_taxonomy_id" : null
      },
      "access" : null,
      "timestamp" : 1658923050303,
      "must_have" : {
        "education_level" : [ ],
        "work_experiences" : [ ],
        "skills" : [ ],
        "education" : [ ],
        "languages" : [ ]
      },
      "occupation_field" : {
        "concept_id" : "9puE_nYg_crq",
        "label" : "Kultur, media, design",
        "legacy_ams_taxonomy_id" : "11"
      },
      "scope_of_work" : {
        "min" : 0,
        "max" : null
      },
      "salary_type" : {
        "concept_id" : "oG8G_9cW_nRf",
        "label" : "Fast månads- vecko- eller timlön",
        "legacy_ams_taxonomy_id" : "1"
      },
      "removed" : false,
      "salary_description" : null,
      "access_to_own_car" : false,
      "publication_date" : "2022-07-27T13:57:30"
    },
    "name" : "Tolk - Svenska-Ukrainska/Engelska-Ukrainska ",
    "user" : "kristof.fischer"
  },
  "sha1" : "86f3ad28e587af2a559b52971015580f0d85db7c",
  "annotations" : [ {
    "preferred-label" : "Tolk",
    "sentiment" : "MUST_HAVE",
    "type" : "occupation-name",
    "start-position" : 0,
    "end-position" : 4,
    "concept-id" : "vaEY_R9R_LjB",
    "matched-string" : "tolk",
    "annotation-id" : 0
  }, {
    "preferred-label" : "Svenska",
    "sentiment" : "MUST_HAVE",
    "type" : "language",
    "start-position" : 7,
    "end-position" : 14,
    "concept-id" : "zSLA_vw2_FXN",
    "matched-string" : "svenska",
    "annotation-id" : 1
  }, {
    "preferred-label" : "Ukrainska",
    "sentiment" : "MUST_HAVE",
    "type" : "language",
    "start-position" : 15,
    "end-position" : 24,
    "concept-id" : "zkfD_Qwv_kTk",
    "matched-string" : "ukrainska",
    "annotation-id" : 2
  }, {
    "preferred-label" : "Engelska",
    "sentiment" : "MUST_HAVE",
    "type" : "language",
    "start-position" : 25,
    "end-position" : 33,
    "concept-id" : "NVxJ_hLg_TYS",
    "matched-string" : "engelska",
    "annotation-id" : 3
  }, {
    "preferred-label" : "Ukrainska",
    "sentiment" : "MUST_HAVE",
    "type" : "language",
    "start-position" : 34,
    "end-position" : 43,
    "concept-id" : "zkfD_Qwv_kTk",
    "matched-string" : "ukrainska",
    "annotation-id" : 4
  }, {
    "preferred-label" : "Svenska",
    "sentiment" : "MUST_HAVE",
    "type" : "language",
    "start-position" : 274,
    "end-position" : 281,
    "concept-id" : "zSLA_vw2_FXN",
    "matched-string" : "svenska",
    "annotation-id" : 6
  }, {
    "preferred-label" : "Ukrainska",
    "sentiment" : "MUST_HAVE",
    "type" : "language",
    "start-position" : 286,
    "end-position" : 295,
    "concept-id" : "zkfD_Qwv_kTk",
    "matched-string" : "ukrainska",
    "annotation-id" : 7
  }, {
    "preferred-label" : "Engelska",
    "sentiment" : "MUST_HAVE",
    "type" : "language",
    "start-position" : 302,
    "end-position" : 310,
    "concept-id" : "NVxJ_hLg_TYS",
    "matched-string" : "engelska",
    "annotation-id" : 8
  }, {
    "preferred-label" : "Ukrainska",
    "sentiment" : "MUST_HAVE",
    "type" : "language",
    "start-position" : 315,
    "end-position" : 324,
    "concept-id" : "zkfD_Qwv_kTk",
    "matched-string" : "ukrainska",
    "annotation-id" : 9
  }, {
    "preferred-label" : "hantera stressande situationer",
    "sentiment" : "MUST_HAVE",
    "type" : "esco-skill",
    "start-position" : 662,
    "end-position" : 673,
    "concept-id" : "qhLq_ZdJ_rqJ",
    "matched-string" : "Stresstålig",
    "annotation-id" : 12
  }, {
    "preferred-label" : "lyfta tunga föremål",
    "sentiment" : "NICE_TO_HAVE",
    "type" : "esco-skill",
    "start-position" : 706,
    "end-position" : 724,
    "concept-id" : "qAwJ_wS7_3qr",
    "matched-string" : "Van vid tunga lyft",
    "annotation-id" : 13
  } ],
  "text" : "Tolk - Svenska-Ukrainska/Engelska-Ukrainska \nBluebeq är en eventbyrå som framförallt jobbar med mässor, konferenser och event. Inom området event jobbar vi med sampling, utdelning av produkter på gator och torg samt demo i butiker.\nVi söker nu personer som kan tolka mellan Svenska och Ukrainska eller Engelska och Ukrainska. Vi jobbar med en hel del och event och du bör se detta som ett varierat och roligt extrajobb. Vid begränsade tillfällen kommer att jobba med den del ukrainare med följande uppgifter: \nVi söker glad och positiva människor som gillar att möta andra människor och inte tvekar att ta sig an nya utmaningar. Vi har ett fåtal krav:\nFlexibel \nStresstålig \nServiceinriktad \n\nMeriterande \nVan vid tunga lyft \nHändig\nErfarenhet av butik eller lager\nErfarenhet av service\n\nVälkommen med din ansökan"
}