{
  "meta" : {
    "jobad" : {
      "description" : {
        "requirements" : null,
        "needs" : null,
        "company_information" : null,
        "text_formatted" : "Just nu söker vi på Manpower dig som vill ta dig an ett jobb inom industri hos en av våra attraktiva kunder i Sandviken. Förutom det faktum att du får jobba för en spännande aktör är det bästa med det här jobbet att ständigt ställas inför nya och spännande utmaningar. Låter det intressant? Varmt välkommen med din ansökan! #JobbJustNu\n\nDet här är en visstidsanställning med goda chanser till förlängning. Vi har löpande urval vilket innebär att vi kallar till intervjuer löpande under tiden i stället för att vänta tills ansökningstiden har gått ut.\n\nArbetsuppgifter\n\nDu kommer jobba för ett globalt och världsledande företag inom industri för metallbearbetning, maskiner och verktyg, tjänster och tekniska lösningar för Gruv och anläggningsindustrin. Du kommer kunna arbeta på olika avdelningar, där arbetsuppgifterna kan variera. Det kan exempelvis vara montering, svetsning, målning eller att man jobbar som processoperatör. Det förekommer även truckkörning.\n\nAtt arbeta som konsult via Manpower innebär både spännande och lärorika arbetsdagar, och vi lägger stor vikt vid att alla konsulter blir en del av företaget från dag ett.\n\nÄr du rätt person för jobbet?\n\nDet här jobbet passar dig som är driven, engagerad och motiveras av att få ta eget ansvar. Det dagliga arbetet kräver att du är samarbetsvillig, har viljan att lära dig nytt och är flexibel. Vidare är det väldigt viktigt att du besitter ett säkerhetstänk. För att komma in i rollen så snabbt som möjligt är det ett stort plus om du har erfarenhet av industriarbete, men det är inget krav.\n\nVi söker dig som\n\n * har gymnasieexamen\n * har goda kunskaper i svenska i tal och skrift\n * har körkort och tillgång till bil\n * har truckkort\n\nDet är meriterande om du\n\n * har traverskort\n * gått en teknisk utbildning\n * har erfarenhet från industri\n\nDu ska vara flexibel och kunna jobba allt från 2-skift till 5 skift. \n\nErbjudande\n\n \n\nRent formellt bygger en anställning hos oss på samma lagar och regler som på den övriga arbetsmarknaden. Vi har kollektivavtal, med allt vad det innebär vad gäller försäkringar, tjänstepension och fackliga relationer. Det som skiljer sig är att du blir anställd hos oss, men arbetar på olika uppdrag hos våra kunder. Du får chansen att arbeta i olika branscher, med olika arbetsuppgifter och med olika människor. Som konsult erbjuds du även friskvårdsbidrag samt utöver det får alla Manpowers anställda fri tillgång till över 4500 interaktiva utbildningar via vår e-learningportal PowerYOU.\n\nGivetvis har du en konsultchef som finns tillgänglig för dig under hela din anställningsperiod och som är ansvarig för dina uppdrag, att du trivs på din arbetsplats och att du utvecklas i din yrkesroll. \n\nSök tjänsten idag!\n\nDen här tjänsten innebär att du kommer att bli anställd av Manpower men du kommer att tillbringa dina arbetsdagar hos vår kund. Vid frågor är du välkommen att kontakta ansvarig rekryterare Payman Abdullah via e-post: Payman.abdullah@manpower.se\n\nVi ser fram emot att höra från dig!\n\nOm Manpower\n\nManpower är Sveriges ledande rekryterings- och bemanningsföretag med tiotusentals attraktiva arbetsgivare över hela landet som våra kunder. Med vårt omfattande nätverk, lokalt såväl som globalt, kan vi erbjuda mängder av spännande lediga jobb som hjälper dig att bygga din karriär, både på kort och lång sikt. Hos oss kan du söka heltidsjobb eller extrajobb vid sidan av studierna.",
        "conditions" : "Heltid\r\nTemporary",
        "text" : "Just nu söker vi på Manpower dig som vill ta dig an ett jobb inom industri hos en av våra attraktiva kunder i Sandviken. Förutom det faktum att du får jobba för en spännande aktör är det bästa med det här jobbet att ständigt ställas inför nya och spännande utmaningar. Låter det intressant? Varmt välkommen med din ansökan! #JobbJustNu\n\nDet här är en visstidsanställning med goda chanser till förlängning. Vi har löpande urval vilket innebär att vi kallar till intervjuer löpande under tiden i stället för att vänta tills ansökningstiden har gått ut.\n\nArbetsuppgifter\n\nDu kommer jobba för ett globalt och världsledande företag inom industri för metallbearbetning, maskiner och verktyg, tjänster och tekniska lösningar för Gruv och anläggningsindustrin. Du kommer kunna arbeta på olika avdelningar, där arbetsuppgifterna kan variera. Det kan exempelvis vara montering, svetsning, målning eller att man jobbar som processoperatör. Det förekommer även truckkörning.\n\nAtt arbeta som konsult via Manpower innebär både spännande och lärorika arbetsdagar, och vi lägger stor vikt vid att alla konsulter blir en del av företaget från dag ett.\n\nÄr du rätt person för jobbet?\n\nDet här jobbet passar dig som är driven, engagerad och motiveras av att få ta eget ansvar. Det dagliga arbetet kräver att du är samarbetsvillig, har viljan att lära dig nytt och är flexibel. Vidare är det väldigt viktigt att du besitter ett säkerhetstänk. För att komma in i rollen så snabbt som möjligt är det ett stort plus om du har erfarenhet av industriarbete, men det är inget krav.\n\nVi söker dig som\n\n * har gymnasieexamen\n * har goda kunskaper i svenska i tal och skrift\n * har körkort och tillgång till bil\n * har truckkort\n\nDet är meriterande om du\n\n * har traverskort\n * gått en teknisk utbildning\n * har erfarenhet från industri\n\nDu ska vara flexibel och kunna jobba allt från 2-skift till 5 skift. \n\nErbjudande\n\n \n\nRent formellt bygger en anställning hos oss på samma lagar och regler som på den övriga arbetsmarknaden. Vi har kollektivavtal, med allt vad det innebär vad gäller försäkringar, tjänstepension och fackliga relationer. Det som skiljer sig är att du blir anställd hos oss, men arbetar på olika uppdrag hos våra kunder. Du får chansen att arbeta i olika branscher, med olika arbetsuppgifter och med olika människor. Som konsult erbjuds du även friskvårdsbidrag samt utöver det får alla Manpowers anställda fri tillgång till över 4500 interaktiva utbildningar via vår e-learningportal PowerYOU.\n\nGivetvis har du en konsultchef som finns tillgänglig för dig under hela din anställningsperiod och som är ansvarig för dina uppdrag, att du trivs på din arbetsplats och att du utvecklas i din yrkesroll. \n\nSök tjänsten idag!\n\nDen här tjänsten innebär att du kommer att bli anställd av Manpower men du kommer att tillbringa dina arbetsdagar hos vår kund. Vid frågor är du välkommen att kontakta ansvarig rekryterare Payman Abdullah via e-post: Payman.abdullah@manpower.se\n\nVi ser fram emot att höra från dig!\n\nOm Manpower\n\nManpower är Sveriges ledande rekryterings- och bemanningsföretag med tiotusentals attraktiva arbetsgivare över hela landet som våra kunder. Med vårt omfattande nätverk, lokalt såväl som globalt, kan vi erbjuda mängder av spännande lediga jobb som hjälper dig att bygga din karriär, både på kort och lång sikt. Hos oss kan du söka heltidsjobb eller extrajobb vid sidan av studierna."
      },
      "headline" : "Ledigt Jobb som industriarbetare i Sandviken | Lediga jobb",
      "driving_license" : null,
      "employer" : {
        "email" : null,
        "phone_number" : null,
        "organization_number" : "5563481588",
        "name" : "Manpower AB",
        "url" : null,
        "workplace" : "Manpower"
      },
      "removed_date" : null,
      "logo_url" : "https://www.arbetsformedlingen.se/rest/arbetsgivare/rest/af/v3/organisation/5563481588/logotyper/logo.png",
      "last_publication_date" : "2022-08-31T23:59:59",
      "number_of_vacancies" : 10,
      "occupation" : {
        "concept_id" : "rAjz_1xP_f1a",
        "label" : "Montör, metallprodukter",
        "legacy_ams_taxonomy_id" : "297"
      },
      "occupation_group" : {
        "concept_id" : "Kxm9_N3V_shF",
        "label" : "Montörer, metall-, gummi- och plastprodukter",
        "legacy_ams_taxonomy_id" : "8213"
      },
      "employment_type" : {
        "concept_id" : "PFZr_Syz_cUq",
        "label" : "Vanlig anställning",
        "legacy_ams_taxonomy_id" : "1"
      },
      "webpage_url" : "https://arbetsformedlingen.se/platsbanken/annonser/26374995",
      "driving_license_required" : false,
      "application_contacts" : [ {
        "description" : "Payman Abdullah",
        "email" : null,
        "telephone" : null,
        "name" : null,
        "contact_type" : null
      } ],
      "duration" : {
        "concept_id" : "qQUd_4qe_NDT",
        "label" : "6 månader eller längre",
        "legacy_ams_taxonomy_id" : "2"
      },
      "nice_to_have" : {
        "education_level" : [ ],
        "work_experiences" : [ ],
        "skills" : [ ],
        "education" : [ ],
        "languages" : [ ]
      },
      "application_details" : {
        "via_af" : false,
        "email" : null,
        "other" : null,
        "reference" : "90b0e5b2-10a3-",
        "url" : "https://www.aplitrak.com/?adid=cGFiZHVsLjQ2MjEyLjMxMDFAbWFucG93ZXJncm91cG5vcmRpY3MuYXBsaXRyYWsuY29t",
        "information" : null
      },
      "source_type" : "VIA_PLATSBANKEN_DXA",
      "application_deadline" : "2022-08-31T23:59:59",
      "external_id" : "46-556348-1588-90b0e5b2-10a3-",
      "workplace_address" : {
        "coordinates" : [ 16.775917, 60.62161 ],
        "city" : null,
        "postcode" : null,
        "municipality" : "Sandviken",
        "region_concept_id" : "zupA_8Nt_xcD",
        "region" : "Gävleborgs län",
        "country_code" : "199",
        "region_code" : "21",
        "municipality_concept_id" : "BbdN_xLB_k6s",
        "country_concept_id" : "i46j_HmG_v64",
        "municipality_code" : "2181",
        "street_address" : null,
        "country" : "Sverige"
      },
      "id" : "26374995",
      "experience_required" : false,
      "working_hours_type" : {
        "concept_id" : "6YE1_gAC_R2G",
        "label" : "Heltid",
        "legacy_ams_taxonomy_id" : "1"
      },
      "access" : null,
      "timestamp" : 1659525805871,
      "must_have" : {
        "education_level" : [ ],
        "work_experiences" : [ ],
        "skills" : [ ],
        "education" : [ ],
        "languages" : [ ]
      },
      "occupation_field" : {
        "concept_id" : "wTEr_CBC_bqh",
        "label" : "Industriell tillverkning",
        "legacy_ams_taxonomy_id" : "9"
      },
      "scope_of_work" : {
        "min" : 100,
        "max" : 100
      },
      "salary_type" : {
        "concept_id" : "oG8G_9cW_nRf",
        "label" : "Fast månads- vecko- eller timlön",
        "legacy_ams_taxonomy_id" : "1"
      },
      "removed" : false,
      "salary_description" : "Not Specified",
      "access_to_own_car" : false,
      "publication_date" : "2022-08-03T13:23:25"
    },
    "name" : "Ledigt Jobb som industriarbetare i Sandviken | Lediga jobb",
    "user" : "hannes"
  },
  "sha1" : "302ec3944e8160f054efb425020a361b5eacebcd",
  "annotations" : [ {
    "preferred-label" : "Sandviken",
    "type" : "municipality",
    "start-position" : 35,
    "end-position" : 44,
    "concept-id" : "BbdN_xLB_k6s",
    "matched-string" : "Sandviken",
    "annotation-id" : 5
  }, {
    "preferred-label" : "Sandviken",
    "type" : "municipality",
    "start-position" : 169,
    "end-position" : 178,
    "concept-id" : "BbdN_xLB_k6s",
    "matched-string" : "Sandviken",
    "annotation-id" : 6
  }, {
    "preferred-label" : "Allmän visstidsanställning",
    "type" : "keyword",
    "start-position" : 410,
    "end-position" : 429,
    "concept-id" : "hxfz_ayC_9Vd",
    "matched-string" : "visstidsanställning",
    "annotation-id" : 7
  }, {
    "preferred-label" : "metallbearbetning",
    "type" : "esco-skill",
    "start-position" : 704,
    "end-position" : 721,
    "concept-id" : "LFCL_RzT_xoF",
    "matched-string" : "metallbearbetning",
    "annotation-id" : 8
  }, {
    "preferred-label" : "maskiner",
    "type" : "esco-skill",
    "start-position" : 723,
    "end-position" : 731,
    "concept-id" : "Ka3C_YyD_qTA",
    "matched-string" : "maskiner",
    "annotation-id" : 9
  }, {
    "preferred-label" : "Verktyg",
    "sentiment" : "MUST_HAVE",
    "type" : "skill",
    "start-position" : 736,
    "end-position" : 743,
    "concept-id" : "KG9j_WxP_ym2",
    "matched-string" : "verktyg",
    "annotation-id" : 0
  }, {
    "preferred-label" : "Gruvarbetare, gruvor och stenbrott",
    "type" : "isco-level-4",
    "start-position" : 781,
    "end-position" : 785,
    "concept-id" : "VE9W_SnC_Uk2",
    "matched-string" : "Gruv",
    "annotation-id" : 10
  }, {
    "preferred-label" : "Svetsare",
    "type" : "keyword",
    "start-position" : 927,
    "end-position" : 936,
    "concept-id" : "ouXc_F9J_bAC",
    "matched-string" : "svetsning",
    "annotation-id" : 11
  }, {
    "preferred-label" : "Målare",
    "type" : "ssyk-level-4",
    "start-position" : 938,
    "end-position" : 945,
    "concept-id" : "QKvX_v7r_PNL",
    "matched-string" : "målning",
    "annotation-id" : 12
  }, {
    "preferred-label" : "Truck",
    "type" : "keyword",
    "start-position" : 1008,
    "end-position" : 1020,
    "concept-id" : "Wz82_4Xv_ZFr",
    "matched-string" : "truckkörning",
    "annotation-id" : 13
  }, {
    "preferred-label" : "Industriarbete",
    "sentiment" : "MUST_HAVE",
    "type" : "keyword",
    "start-position" : 1576,
    "end-position" : 1590,
    "concept-id" : "fpA8_XFc_122",
    "matched-string" : "industriarbete",
    "annotation-id" : 1
  }, {
    "preferred-label" : "Gymnasial utbildning",
    "type" : "sni-level-3",
    "start-position" : 1641,
    "end-position" : 1655,
    "concept-id" : "t8bn_FTn_FiG",
    "matched-string" : "gymnasieexamen",
    "annotation-id" : 14
  }, {
    "preferred-label" : "Svenska",
    "sentiment" : "MUST_HAVE",
    "type" : "language",
    "start-position" : 1680,
    "end-position" : 1687,
    "concept-id" : "zSLA_vw2_FXN",
    "matched-string" : "svenska",
    "annotation-id" : 2
  }, {
    "preferred-label" : "körkort",
    "type" : "esco-skill",
    "start-position" : 1712,
    "end-position" : 1719,
    "concept-id" : "UvDr_eNo_HSQ",
    "matched-string" : "körkort",
    "annotation-id" : 15
  }, {
    "preferred-label" : "Truck",
    "type" : "keyword",
    "start-position" : 1749,
    "end-position" : 1758,
    "concept-id" : "Wz82_4Xv_ZFr",
    "matched-string" : "truckkort",
    "annotation-id" : 16
  }, {
    "preferred-label" : "Traversförare",
    "type" : "occupation-name",
    "start-position" : 1793,
    "end-position" : 1804,
    "concept-id" : "mBA1_h3T_Aaw",
    "matched-string" : "traverskort",
    "annotation-id" : 17
  }, {
    "preferred-label" : "Teknik och teknisk industri",
    "type" : "sun-education-field-2",
    "start-position" : 1816,
    "end-position" : 1834,
    "concept-id" : "WFCz_teU_KFf",
    "matched-string" : "teknisk utbildning",
    "annotation-id" : 18
  }, {
    "preferred-label" : "Kollektivavtal",
    "sentiment" : "MUST_HAVE",
    "type" : "skill",
    "start-position" : 2066,
    "end-position" : 2080,
    "concept-id" : "z7wE_9xb_3jX",
    "matched-string" : "kollektivavtal",
    "annotation-id" : 3
  }, {
    "preferred-label" : "Rekryterare/Rekryteringskonsult",
    "sentiment" : "MUST_HAVE",
    "type" : "occupation-name",
    "start-position" : 2948,
    "end-position" : 2959,
    "concept-id" : "QaQC_ozP_Bme",
    "matched-string" : "rekryterare",
    "annotation-id" : 4
  } ],
  "text" : "Ledigt Jobb som industriarbetare i Sandviken | Lediga jobb\nJust nu söker vi på Manpower dig som vill ta dig an ett jobb inom industri hos en av våra attraktiva kunder i Sandviken. Förutom det faktum att du får jobba för en spännande aktör är det bästa med det här jobbet att ständigt ställas inför nya och spännande utmaningar. Låter det intressant? Varmt välkommen med din ansökan! #JobbJustNu\n\nDet här är en visstidsanställning med goda chanser till förlängning. Vi har löpande urval vilket innebär att vi kallar till intervjuer löpande under tiden i stället för att vänta tills ansökningstiden har gått ut.\n\nArbetsuppgifter\n\nDu kommer jobba för ett globalt och världsledande företag inom industri för metallbearbetning, maskiner och verktyg, tjänster och tekniska lösningar för Gruv och anläggningsindustrin. Du kommer kunna arbeta på olika avdelningar, där arbetsuppgifterna kan variera. Det kan exempelvis vara montering, svetsning, målning eller att man jobbar som processoperatör. Det förekommer även truckkörning.\n\nAtt arbeta som konsult via Manpower innebär både spännande och lärorika arbetsdagar, och vi lägger stor vikt vid att alla konsulter blir en del av företaget från dag ett.\n\nÄr du rätt person för jobbet?\n\nDet här jobbet passar dig som är driven, engagerad och motiveras av att få ta eget ansvar. Det dagliga arbetet kräver att du är samarbetsvillig, har viljan att lära dig nytt och är flexibel. Vidare är det väldigt viktigt att du besitter ett säkerhetstänk. För att komma in i rollen så snabbt som möjligt är det ett stort plus om du har erfarenhet av industriarbete, men det är inget krav.\n\nVi söker dig som\n\n * har gymnasieexamen\n * har goda kunskaper i svenska i tal och skrift\n * har körkort och tillgång till bil\n * har truckkort\n\nDet är meriterande om du\n\n * har traverskort\n * gått en teknisk utbildning\n * har erfarenhet från industri\n\nDu ska vara flexibel och kunna jobba allt från 2-skift till 5 skift. \n\nErbjudande\n\n \n\nRent formellt bygger en anställning hos oss på samma lagar och regler som på den övriga arbetsmarknaden. Vi har kollektivavtal, med allt vad det innebär vad gäller försäkringar, tjänstepension och fackliga relationer. Det som skiljer sig är att du blir anställd hos oss, men arbetar på olika uppdrag hos våra kunder. Du får chansen att arbeta i olika branscher, med olika arbetsuppgifter och med olika människor. Som konsult erbjuds du även friskvårdsbidrag samt utöver det får alla Manpowers anställda fri tillgång till över 4500 interaktiva utbildningar via vår e-learningportal PowerYOU.\n\nGivetvis har du en konsultchef som finns tillgänglig för dig under hela din anställningsperiod och som är ansvarig för dina uppdrag, att du trivs på din arbetsplats och att du utvecklas i din yrkesroll. \n\nSök tjänsten idag!\n\nDen här tjänsten innebär att du kommer att bli anställd av Manpower men du kommer att tillbringa dina arbetsdagar hos vår kund. Vid frågor är du välkommen att kontakta ansvarig rekryterare Payman Abdullah via e-post: Payman.abdullah@manpower.se\n\nVi ser fram emot att höra från dig!\n\nOm Manpower\n\nManpower är Sveriges ledande rekryterings- och bemanningsföretag med tiotusentals attraktiva arbetsgivare över hela landet som våra kunder. Med vårt omfattande nätverk, lokalt såväl som globalt, kan vi erbjuda mängder av spännande lediga jobb som hjälper dig att bygga din karriär, både på kort och lång sikt. Hos oss kan du söka heltidsjobb eller extrajobb vid sidan av studierna."
}