{
  "meta" : {
    "jobad" : {
      "description" : {
        "requirements" : null,
        "needs" : null,
        "company_information" : null,
        "text_formatted" : "<p>Bussförare i Frövi kommun sökes.</p><p>Gäller skolskjutsuppdrag med stora och små bussar. </p><p>Timanställning ca 6-8 tim per dag. </p>",
        "conditions" : null,
        "text" : "Bussförare i Frövi kommun sökes.\nGäller skolskjutsuppdrag med stora och små bussar. \nTimanställning ca 6-8 tim per dag."
      },
      "headline" : "Bussförare sökes i Frövi",
      "driving_license" : [ {
        "concept_id" : "hK1a_wsQ_4UG",
        "label" : "D",
        "legacy_ams_taxonomy_id" : "5"
      }, {
        "concept_id" : "VTK8_WRx_GcM",
        "label" : "B",
        "legacy_ams_taxonomy_id" : "3"
      } ],
      "employer" : {
        "email" : null,
        "phone_number" : null,
        "organization_number" : "5564148467",
        "name" : "Axelssons Turisttrafik AB",
        "url" : "www.axbuss.se",
        "workplace" : "Axelssons Turisttrafik AB"
      },
      "removed_date" : null,
      "logo_url" : "https://www.arbetsformedlingen.se/rest/arbetsgivare/rest/af/v3/arbetsplatser/87046281/logotyper/logo.png",
      "last_publication_date" : "2022-08-24T23:59:59",
      "number_of_vacancies" : 4,
      "occupation" : {
        "concept_id" : "qSXj_aXc_EGp",
        "label" : "Bussförare/Busschaufför",
        "legacy_ams_taxonomy_id" : "5561"
      },
      "occupation_group" : {
        "concept_id" : "FiDm_2S8_gx7",
        "label" : "Buss- och spårvagnsförare",
        "legacy_ams_taxonomy_id" : "8331"
      },
      "employment_type" : {
        "concept_id" : "1paU_aCR_nGn",
        "label" : "Behovsanställning",
        "legacy_ams_taxonomy_id" : "4"
      },
      "webpage_url" : "https://arbetsformedlingen.se/platsbanken/annonser/26353165",
      "driving_license_required" : true,
      "application_contacts" : [ {
        "description" : null,
        "email" : "fabian@axbuss.se",
        "telephone" : "0736201007, 0736201007",
        "name" : "Fabian von Essen",
        "contact_type" : null
      } ],
      "duration" : {
        "concept_id" : null,
        "label" : null,
        "legacy_ams_taxonomy_id" : null
      },
      "nice_to_have" : {
        "education_level" : [ ],
        "work_experiences" : [ {
          "concept_id" : "qSXj_aXc_EGp",
          "weight" : 5,
          "label" : "Bussförare/Busschaufför",
          "legacy_ams_taxonomy_id" : "5561"
        } ],
        "skills" : [ ],
        "education" : [ ],
        "languages" : [ ]
      },
      "application_details" : {
        "via_af" : false,
        "email" : "fabian@axbuss.se",
        "other" : null,
        "reference" : "Bussförare Frövi",
        "url" : null,
        "information" : null
      },
      "source_type" : "VIA_ANNONSERA",
      "application_deadline" : "2022-08-24T23:59:59",
      "external_id" : null,
      "workplace_address" : {
        "coordinates" : [ 15.376830313527526, 59.46138667268421 ],
        "city" : "FRÖVI",
        "postcode" : "71831",
        "municipality" : "Lindesberg",
        "region_concept_id" : "xTCk_nT5_Zjm",
        "region" : "Örebro län",
        "country_code" : "199",
        "region_code" : "18",
        "municipality_concept_id" : "JQE9_189_Ska",
        "country_concept_id" : "i46j_HmG_v64",
        "municipality_code" : "1885",
        "street_address" : null,
        "country" : "Sverige"
      },
      "id" : "26353165",
      "experience_required" : true,
      "working_hours_type" : {
        "concept_id" : null,
        "label" : null,
        "legacy_ams_taxonomy_id" : null
      },
      "access" : null,
      "timestamp" : 1658780280269,
      "must_have" : {
        "education_level" : [ ],
        "work_experiences" : [ ],
        "skills" : [ {
          "concept_id" : "L31X_f88_viY",
          "weight" : 10,
          "label" : "Yrkeskompetensbevis YKB, buss",
          "legacy_ams_taxonomy_id" : "602359"
        } ],
        "education" : [ ],
        "languages" : [ {
          "concept_id" : "zSLA_vw2_FXN",
          "weight" : 10,
          "label" : "Svenska",
          "legacy_ams_taxonomy_id" : "502"
        }, {
          "concept_id" : "NVxJ_hLg_TYS",
          "weight" : 10,
          "label" : "Engelska",
          "legacy_ams_taxonomy_id" : "283"
        } ]
      },
      "occupation_field" : {
        "concept_id" : "ASGV_zcE_bWf",
        "label" : "Transport, distribution, lager",
        "legacy_ams_taxonomy_id" : "19"
      },
      "scope_of_work" : {
        "min" : 0,
        "max" : null
      },
      "salary_type" : {
        "concept_id" : "oG8G_9cW_nRf",
        "label" : "Fast månads- vecko- eller timlön",
        "legacy_ams_taxonomy_id" : "1"
      },
      "removed" : false,
      "salary_description" : null,
      "access_to_own_car" : false,
      "publication_date" : "2022-07-25T22:18:00"
    },
    "name" : "Bussförare sökes i Frövi",
    "user" : "hannes"
  },
  "sha1" : "307ba56716f2c86bbb5085adead33612735f0ec6",
  "annotations" : [ {
    "preferred-label" : "Bussförare/Busschaufför",
    "sentiment" : "MUST_HAVE",
    "type" : "occupation-name",
    "start-position" : 0,
    "end-position" : 10,
    "concept-id" : "qSXj_aXc_EGp",
    "matched-string" : "bussförare",
    "annotation-id" : 0
  }, {
    "preferred-label" : "Bussförare/Busschaufför",
    "sentiment" : "MUST_HAVE",
    "type" : "occupation-name",
    "start-position" : 25,
    "end-position" : 35,
    "concept-id" : "qSXj_aXc_EGp",
    "matched-string" : "bussförare",
    "annotation-id" : 1
  }, {
    "preferred-label" : "Timanställning",
    "sentiment" : "MUST_HAVE",
    "type" : "keyword",
    "start-position" : 110,
    "end-position" : 124,
    "concept-id" : "kfXw_Vmt_Zzk",
    "matched-string" : "timanställning",
    "annotation-id" : 2
  } ],
  "text" : "Bussförare sökes i Frövi\nBussförare i Frövi kommun sökes.\nGäller skolskjutsuppdrag med stora och små bussar. \nTimanställning ca 6-8 tim per dag."
}