{
  "meta" : {
    "jobad" : {
      "description" : {
        "requirements" : null,
        "needs" : null,
        "company_information" : null,
        "text_formatted" : "<p><strong>Kyltekniker till Teknisk Fastighetsservice AB</strong></p><p><em>Har du ett stort teknikintresse och en lösningsfokuserad inställning? Vill du arbeta i en engagerande och utvecklande miljö? Då kan du vara den vi söker nu när vi behöver förstärka vårt team med ytterligare en skicklig kyltekniker. </em></p><p><strong>Om Teknisk Fastighetsservice AB</strong></p><p>Teknisk Fastighetsservice AB, TFS, är ett Norrlandsbaserat företag som sköter underhåll och utveckling av fastigheter hos kunder som är fastighetsägare och nyttjare inom industri, offentlig och kommersiell verksamhet. Företaget är verksamt inom service och förebyggande underhåll inom fastighetstekniska installationer för ventilation, värme, kyla, el och automation. Verksamheten är belägen i Norrland med kontor på 15 orter från Gävle i söder till Luleå i norr och med huvudkontor i Sundsvall. Teknisk Fastighetsservice ingår i koncernen Fenix Holding AB med drygt 330 medarbetare, varav ca 210 är anställda i TFS.</p><p><strong>Om tjänsten</strong></p><p>I rollen som kyltekniker kommer du till största del arbeta självständigt ute på fältet i många olika typer av serviceuppdrag. Arbetsuppgifterna består av kvalificerade serviceåtaganden, underhåll, felsökning, reparation, samt ny- och ombyggnationer. Arbetet innefattar såväl planerade som mer akuta jobb och är variationsrikt med många sociala kontaktytor. Som kyltekniker kommer du att planera, samordna och utföra service åt våra olika kunder dina arbetsuppgifter kommer främst bestå av:</p><p>·       Servicearbete inom kyla</p><p>·       Felsökningar, åtgärdsförslag, ny- och ombyggnation</p><p>·       Daglig kontakt med våra kunder</p><p>I rollen som kyltekniker är du TFS ansikte utåt och en viktig kontakt för våra kunder då du blir en del av att skapa framtidens fastighetsteknik.</p><p><strong>Kvalifikationer</strong></p><p>Vi söker dig som är behörig kyltekniker, kategori 1, och har ett par års erfarenhet av arbete inom kylservice. Vi ser det som meriterande om du har erfarenhet inom el eller styr och reglerteknik. Vi tror att du som söker har ett teknikintresse, är trygg och har självförtroende i kontakten med nya människor. Dessutom har du en god anpassningsförmåga och ett naturligt driv som präglar ditt arbetssätt. Vi tror vidare att du trivs att arbeta i ett klimat där den ena dagen inte är den andra lik med fokus på att hitta lösningar för våra kunder. Slutligen trivs du att vara en del av ett lag där vardagen präglas av ordning &amp; reda, tydlighet och trivsel.</p><p><strong>Övrig information</strong></p><p><strong>Start:</strong> Enligt överenskommelse</p><p><strong>Omfattning:</strong> Heltid</p><p><strong>Anställning:</strong> Tillsvidare</p><p><strong>Ort:</strong> Hälsingland, på någon av orterna Hudiksvall, Söderhamn eller Bollnäs</p><p><strong>Sista ansökningsdag</strong>: 2022-08-07</p><p><strong>Kontakt: </strong>Peter Wengelin, Platschef, telefon 070-688 72 87</p><p>Skicka din ansökan till <strong>peter.wengelin@tfservice.se</strong> märkt med Kyltekniker.</p><p> </p>",
        "conditions" : null,
        "text" : "Kyltekniker till Teknisk Fastighetsservice AB\nHar du ett stort teknikintresse och en lösningsfokuserad inställning? Vill du arbeta i en engagerande och utvecklande miljö? Då kan du vara den vi söker nu när vi behöver förstärka vårt team med ytterligare en skicklig kyltekniker. \nOm Teknisk Fastighetsservice AB\nTeknisk Fastighetsservice AB, TFS, är ett Norrlandsbaserat företag som sköter underhåll och utveckling av fastigheter hos kunder som är fastighetsägare och nyttjare inom industri, offentlig och kommersiell verksamhet. Företaget är verksamt inom service och förebyggande underhåll inom fastighetstekniska installationer för ventilation, värme, kyla, el och automation. Verksamheten är belägen i Norrland med kontor på 15 orter från Gävle i söder till Luleå i norr och med huvudkontor i Sundsvall. Teknisk Fastighetsservice ingår i koncernen Fenix Holding AB med drygt 330 medarbetare, varav ca 210 är anställda i TFS.\nOm tjänsten\nI rollen som kyltekniker kommer du till största del arbeta självständigt ute på fältet i många olika typer av serviceuppdrag. Arbetsuppgifterna består av kvalificerade serviceåtaganden, underhåll, felsökning, reparation, samt ny- och ombyggnationer. Arbetet innefattar såväl planerade som mer akuta jobb och är variationsrikt med många sociala kontaktytor. Som kyltekniker kommer du att planera, samordna och utföra service åt våra olika kunder dina arbetsuppgifter kommer främst bestå av:\n·       Servicearbete inom kyla\n·       Felsökningar, åtgärdsförslag, ny- och ombyggnation\n·       Daglig kontakt med våra kunder\nI rollen som kyltekniker är du TFS ansikte utåt och en viktig kontakt för våra kunder då du blir en del av att skapa framtidens fastighetsteknik.\nKvalifikationer\nVi söker dig som är behörig kyltekniker, kategori 1, och har ett par års erfarenhet av arbete inom kylservice. Vi ser det som meriterande om du har erfarenhet inom el eller styr och reglerteknik. Vi tror att du som söker har ett teknikintresse, är trygg och har självförtroende i kontakten med nya människor. Dessutom har du en god anpassningsförmåga och ett naturligt driv som präglar ditt arbetssätt. Vi tror vidare att du trivs att arbeta i ett klimat där den ena dagen inte är den andra lik med fokus på att hitta lösningar för våra kunder. Slutligen trivs du att vara en del av ett lag där vardagen präglas av ordning & reda, tydlighet och trivsel.\nÖvrig information\nStart: Enligt överenskommelse\nOmfattning: Heltid\nAnställning: Tillsvidare\nOrt: Hälsingland, på någon av orterna Hudiksvall, Söderhamn eller Bollnäs\nSista ansökningsdag: 2022-08-07\nKontakt: Peter Wengelin, Platschef, telefon 070-688 72 87\nSkicka din ansökan till peter.wengelin@tfservice.se märkt med Kyltekniker."
      },
      "headline" : "Kyltekniker Teknisk Fastighetsservice AB",
      "driving_license" : null,
      "employer" : {
        "email" : null,
        "phone_number" : null,
        "organization_number" : "5564733102",
        "name" : "Teknisk Fastighetsservice i Norrland AB",
        "url" : null,
        "workplace" : "Teknisk Fastighetsservice I Norrland AB"
      },
      "removed_date" : null,
      "logo_url" : "https://www.arbetsformedlingen.se/rest/arbetsgivare/rest/af/v3/arbetsplatser/80648357/logotyper/logo.png",
      "last_publication_date" : "2022-08-07T23:59:59",
      "number_of_vacancies" : 1,
      "occupation" : {
        "concept_id" : "JM78_Rwi_sHx",
        "label" : "Kylmontör/Kyltekniker",
        "legacy_ams_taxonomy_id" : "5819"
      },
      "occupation_group" : {
        "concept_id" : "3UzE_P8A_9sS",
        "label" : "Kyl- och värmepumpstekniker m.fl.",
        "legacy_ams_taxonomy_id" : "7126"
      },
      "employment_type" : {
        "concept_id" : "PFZr_Syz_cUq",
        "label" : "Vanlig anställning",
        "legacy_ams_taxonomy_id" : "1"
      },
      "webpage_url" : "https://arbetsformedlingen.se/platsbanken/annonser/26286989",
      "driving_license_required" : false,
      "application_contacts" : [ {
        "description" : null,
        "email" : "peter.wengelin@tfservice.se",
        "telephone" : "070-688 72 87",
        "name" : "Peter Wengelin",
        "contact_type" : "Platschef"
      } ],
      "duration" : {
        "concept_id" : "a7uU_j21_mkL",
        "label" : "Tills vidare",
        "legacy_ams_taxonomy_id" : "1"
      },
      "nice_to_have" : {
        "education_level" : [ ],
        "work_experiences" : [ ],
        "skills" : [ ],
        "education" : [ ],
        "languages" : [ ]
      },
      "application_details" : {
        "via_af" : false,
        "email" : "peter.wengelin@tfservice.se",
        "other" : null,
        "reference" : null,
        "url" : null,
        "information" : null
      },
      "source_type" : "VIA_ANNONSERA",
      "application_deadline" : "2022-08-07T23:59:59",
      "external_id" : null,
      "workplace_address" : {
        "coordinates" : [ 16.38306063237952, 61.34302632645845 ],
        "city" : "BOLLNÄS",
        "postcode" : "82130",
        "municipality" : "Bollnäs",
        "region_concept_id" : "zupA_8Nt_xcD",
        "region" : "Gävleborgs län",
        "country_code" : "199",
        "region_code" : "21",
        "municipality_concept_id" : "KxjG_ig5_exF",
        "country_concept_id" : "i46j_HmG_v64",
        "municipality_code" : "2183",
        "street_address" : "Aseavägen 1",
        "country" : "Sverige"
      },
      "id" : "26286989",
      "experience_required" : true,
      "working_hours_type" : {
        "concept_id" : "6YE1_gAC_R2G",
        "label" : "Heltid",
        "legacy_ams_taxonomy_id" : "1"
      },
      "access" : null,
      "timestamp" : 1656884620812,
      "must_have" : {
        "education_level" : [ ],
        "work_experiences" : [ ],
        "skills" : [ ],
        "education" : [ ],
        "languages" : [ ]
      },
      "occupation_field" : {
        "concept_id" : "j7Cq_ZJe_GkT",
        "label" : "Bygg och anläggning",
        "legacy_ams_taxonomy_id" : "2"
      },
      "scope_of_work" : {
        "min" : 0,
        "max" : 100
      },
      "salary_type" : {
        "concept_id" : "oG8G_9cW_nRf",
        "label" : "Fast månads- vecko- eller timlön",
        "legacy_ams_taxonomy_id" : "1"
      },
      "removed" : false,
      "salary_description" : null,
      "access_to_own_car" : false,
      "publication_date" : "2022-07-03T23:05:10"
    },
    "name" : "Kyltekniker Teknisk Fastighetsservice AB",
    "user" : "hannes"
  },
  "sha1" : "03dfde5378d3f52d9e5d35f226072e8fca7f144e",
  "annotations" : [ {
    "preferred-label" : "Kylmontör/Kyltekniker",
    "sentiment" : "OFFERED",
    "type" : "occupation-name",
    "start-position" : 0,
    "end-position" : 11,
    "concept-id" : "JM78_Rwi_sHx",
    "matched-string" : "kyltekniker",
    "annotation-id" : 0
  }, {
    "preferred-label" : "Kylmontör/Kyltekniker",
    "sentiment" : "OFFERED",
    "type" : "occupation-name",
    "start-position" : 41,
    "end-position" : 52,
    "concept-id" : "JM78_Rwi_sHx",
    "matched-string" : "kyltekniker",
    "annotation-id" : 1
  }, {
    "preferred-label" : "Kylmontör/Kyltekniker",
    "sentiment" : "OFFERED",
    "type" : "occupation-name",
    "start-position" : 306,
    "end-position" : 317,
    "concept-id" : "JM78_Rwi_sHx",
    "matched-string" : "kyltekniker",
    "annotation-id" : 2
  }, {
    "preferred-label" : "Automation",
    "sentiment" : "MUST_HAVE",
    "type" : "sun-education-field-4",
    "start-position" : 708,
    "end-position" : 718,
    "concept-id" : "tDxT_7oT_NyU",
    "matched-string" : "automation",
    "annotation-id" : 3
  }, {
    "preferred-label" : "Kontor",
    "sentiment" : "MUST_HAVE",
    "type" : "keyword",
    "start-position" : 759,
    "end-position" : 765,
    "concept-id" : "Hyz1_7HF_AkP",
    "matched-string" : "kontor",
    "annotation-id" : 4
  }, {
    "preferred-label" : "Kylmontör/Kyltekniker",
    "sentiment" : "OFFERED",
    "type" : "occupation-name",
    "start-position" : 994,
    "end-position" : 1005,
    "concept-id" : "JM78_Rwi_sHx",
    "matched-string" : "kyltekniker",
    "annotation-id" : 5
  }, {
    "preferred-label" : "Kylanläggning, underhåll",
    "sentiment" : "OFFERED",
    "type" : "skill",
    "start-position" : 1167,
    "end-position" : 1176,
    "concept-id" : "fjoN_ZHr_XG4",
    "matched-string" : "underhåll",
    "annotation-id" : 19
  }, {
    "preferred-label" : null,
    "sentiment" : "OFFERED",
    "type" : "skill",
    "start-position" : 1178,
    "end-position" : 1188,
    "concept-id" : null,
    "matched-string" : "felsökning",
    "annotation-id" : 20
  }, {
    "preferred-label" : null,
    "type" : "skill",
    "start-position" : 1190,
    "end-position" : 1200,
    "concept-id" : null,
    "matched-string" : "reparation",
    "annotation-id" : 21
  }, {
    "preferred-label" : "Kylmontör/Kyltekniker",
    "sentiment" : "MUST_HAVE",
    "type" : "occupation-name",
    "start-position" : 1342,
    "end-position" : 1353,
    "concept-id" : "JM78_Rwi_sHx",
    "matched-string" : "kyltekniker",
    "annotation-id" : 6
  }, {
    "preferred-label" : null,
    "sentiment" : "OFFERED",
    "type" : "skill",
    "start-position" : 1479,
    "end-position" : 1502,
    "concept-id" : null,
    "matched-string" : "Servicearbete inom kyla",
    "annotation-id" : 22
  }, {
    "preferred-label" : null,
    "sentiment" : "OFFERED",
    "type" : "skill",
    "start-position" : 1511,
    "end-position" : 1523,
    "concept-id" : null,
    "matched-string" : "Felsökningar",
    "annotation-id" : 12
  }, {
    "preferred-label" : "Kylmontering",
    "sentiment" : "OFFERED",
    "type" : "skill",
    "start-position" : 1541,
    "end-position" : 1561,
    "concept-id" : "WzYZ_341_Cn9",
    "matched-string" : "ny- och ombyggnation",
    "annotation-id" : 23
  }, {
    "preferred-label" : "Kylmontör/Kyltekniker",
    "sentiment" : "OFFERED",
    "type" : "occupation-name",
    "start-position" : 1614,
    "end-position" : 1625,
    "concept-id" : "JM78_Rwi_sHx",
    "matched-string" : "kyltekniker",
    "annotation-id" : 7
  }, {
    "preferred-label" : "Fastighetsteknik",
    "sentiment" : "OFFERED",
    "type" : "skill",
    "start-position" : 1729,
    "end-position" : 1745,
    "concept-id" : "crzp_WfW_wWC",
    "matched-string" : "fastighetsteknik",
    "annotation-id" : 24
  }, {
    "preferred-label" : "Kylmontör/Kyltekniker",
    "sentiment" : "MUST_HAVE",
    "type" : "occupation-name",
    "start-position" : 1791,
    "end-position" : 1802,
    "concept-id" : "JM78_Rwi_sHx",
    "matched-string" : "kyltekniker",
    "annotation-id" : 9
  }, {
    "preferred-label" : "Certifikat enl köldmedieförordningen Kategori I",
    "sentiment" : "MUST_HAVE",
    "type" : "skill",
    "start-position" : 1804,
    "end-position" : 1814,
    "concept-id" : "t17v_Hrq_yLk",
    "matched-string" : "kategori 1",
    "annotation-id" : 13
  }, {
    "preferred-label" : "2-4 års erfarenhet",
    "sentiment" : "MUST_HAVE",
    "type" : "occupation-experience-year",
    "start-position" : 1824,
    "end-position" : 1846,
    "concept-id" : "RWA2_uu6_udD",
    "matched-string" : "ett par års erfarenhet",
    "annotation-id" : 14
  }, {
    "preferred-label" : "Elteknik",
    "sentiment" : "NICE_TO_HAVE",
    "type" : "skill",
    "start-position" : 1927,
    "end-position" : 1929,
    "concept-id" : "TGZ1_Xb5_77h",
    "matched-string" : "el",
    "annotation-id" : 16
  }, {
    "preferred-label" : "Styr- och reglerteknik",
    "sentiment" : "NICE_TO_HAVE",
    "type" : "skill",
    "start-position" : 1936,
    "end-position" : 1957,
    "concept-id" : "Udbb_Eay_MuR",
    "matched-string" : "styr och reglerteknik",
    "annotation-id" : 15
  }, {
    "preferred-label" : "Heltid",
    "sentiment" : "OFFERED",
    "type" : "worktime-extent",
    "start-position" : 2477,
    "end-position" : 2483,
    "concept-id" : "6YE1_gAC_R2G",
    "matched-string" : "Heltid",
    "annotation-id" : 17
  }, {
    "preferred-label" : "Tillsvidareanställning (inkl. eventuell provanställning)",
    "sentiment" : "OFFERED",
    "type" : "employment-type",
    "start-position" : 2497,
    "end-position" : 2508,
    "concept-id" : "kpPX_CNN_gDU",
    "matched-string" : "Tillsvidare",
    "annotation-id" : 18
  }, {
    "preferred-label" : "Kylmontör/Kyltekniker",
    "sentiment" : "MUST_HAVE",
    "type" : "occupation-name",
    "start-position" : 2735,
    "end-position" : 2746,
    "concept-id" : "JM78_Rwi_sHx",
    "matched-string" : "kyltekniker",
    "annotation-id" : 11
  } ],
  "text" : "Kyltekniker Teknisk Fastighetsservice AB\nKyltekniker till Teknisk Fastighetsservice AB\nHar du ett stort teknikintresse och en lösningsfokuserad inställning? Vill du arbeta i en engagerande och utvecklande miljö? Då kan du vara den vi söker nu när vi behöver förstärka vårt team med ytterligare en skicklig kyltekniker. \nOm Teknisk Fastighetsservice AB\nTeknisk Fastighetsservice AB, TFS, är ett Norrlandsbaserat företag som sköter underhåll och utveckling av fastigheter hos kunder som är fastighetsägare och nyttjare inom industri, offentlig och kommersiell verksamhet. Företaget är verksamt inom service och förebyggande underhåll inom fastighetstekniska installationer för ventilation, värme, kyla, el och automation. Verksamheten är belägen i Norrland med kontor på 15 orter från Gävle i söder till Luleå i norr och med huvudkontor i Sundsvall. Teknisk Fastighetsservice ingår i koncernen Fenix Holding AB med drygt 330 medarbetare, varav ca 210 är anställda i TFS.\nOm tjänsten\nI rollen som kyltekniker kommer du till största del arbeta självständigt ute på fältet i många olika typer av serviceuppdrag. Arbetsuppgifterna består av kvalificerade serviceåtaganden, underhåll, felsökning, reparation, samt ny- och ombyggnationer. Arbetet innefattar såväl planerade som mer akuta jobb och är variationsrikt med många sociala kontaktytor. Som kyltekniker kommer du att planera, samordna och utföra service åt våra olika kunder dina arbetsuppgifter kommer främst bestå av:\n·       Servicearbete inom kyla\n·       Felsökningar, åtgärdsförslag, ny- och ombyggnation\n·       Daglig kontakt med våra kunder\nI rollen som kyltekniker är du TFS ansikte utåt och en viktig kontakt för våra kunder då du blir en del av att skapa framtidens fastighetsteknik.\nKvalifikationer\nVi söker dig som är behörig kyltekniker, kategori 1, och har ett par års erfarenhet av arbete inom kylservice. Vi ser det som meriterande om du har erfarenhet inom el eller styr och reglerteknik. Vi tror att du som söker har ett teknikintresse, är trygg och har självförtroende i kontakten med nya människor. Dessutom har du en god anpassningsförmåga och ett naturligt driv som präglar ditt arbetssätt. Vi tror vidare att du trivs att arbeta i ett klimat där den ena dagen inte är den andra lik med fokus på att hitta lösningar för våra kunder. Slutligen trivs du att vara en del av ett lag där vardagen präglas av ordning & reda, tydlighet och trivsel.\nÖvrig information\nStart: Enligt överenskommelse\nOmfattning: Heltid\nAnställning: Tillsvidare\nOrt: Hälsingland, på någon av orterna Hudiksvall, Söderhamn eller Bollnäs\nSista ansökningsdag: 2022-08-07\nKontakt: Peter Wengelin, Platschef, telefon 070-688 72 87\nSkicka din ansökan till peter.wengelin@tfservice.se märkt med Kyltekniker."
}