{
  "meta" : {
    "jobad" : {
      "description" : {
        "requirements" : null,
        "needs" : null,
        "company_information" : null,
        "text_formatted" : "Motiveras du av att nå resultat tillsammans med ditt team och av att ha högt uppsatta mål? Då kan vi ha rätt utmaning för dig! Just nu söker vi på Manpower en medarbetare till fordonsindustrin till ett uppdrag som varar 6 månader, med goda chanser till förlängning hos vår kund i Vara. Här finns det utmärkta möjligheter att utvecklas och avancera. Vill du vara med på vår kunds resa? Välkommen med din ansökan till oss på Manpower!\n\nDen här bemanningen är ett samarbete mellan oss på Manpower och vår kund. Du kommer att bli anställd av Manpower men arbeta på plats hos kunden.\n\n \n\nOm jobbet som medarbetare till fordonsindustrin\n\nI rollen som medarbetare till fordonsindustrin ansvarar du för att utföra kvalitetskontroller av alla delar i den tillverkande processen och dess verktyg samt ansvara för drift och övervakning av extrudermaskinerna. Dessutom kommer du tillsammans med ditt team arbeta med kontroll av kvalitet, hållfasthet och temperaturer.\n\n \n\nÄr du rätt för rollen som medarbetare till fordonsindustrin?\n\nVi på Manpower söker dig som har en fordonstekniskutbildning alternativ likvärdig erfarenhet.\n\nFör att lyckas i uppdraget är det viktigt att du utför ditt arbete med stor noggrannhet och att du har ett stort driv. Det är också viktigt att du har ett effektivt arbetssätt.\n\nDet är meriterande om du har truckkort.\n\nFör anställning krävs uppvisande av utdrag ur belastningsregistret.\n\n \n\nOm vår kund \n\nKunden är ett välkänt, stort och expansivt bolag med ljusa och moderna lokaler, i utkanten utav Vara.\n\n \n\nVad kan Manpower erbjuda dig? \n\nVi på Manpower hjälper dig att forma din framtid utifrån din kompetens samt dina behov och önskemål. Vi samarbetar med många attraktiva företag och kan öppna dörren till intressanta och spännande uppdrag. Som resurskonsult hos oss får du en anställning med allt vad det innebär i form av marknadsmässig lön, övertidsersättning, semester, tjänstepension och försäkringar enligt kollektivavtal. Friskvårdsbidrag och företagshälsovård ingår också.\n\n \n\nIntresserad?\n\nAnsvarig för den här processen är Emelie Johansson, emelie.johansson@manpower.se\n\nVi arbetar med löpande urval och kan komma att tillsätta uppdraget så fort vi hittat rätt person. Skicka därför in din ansökan så snart som möjligt!\n\nVi ser fram emot din ansökan!\n\n \n\nÖvrigt\n\nUppdragslängd: 6 månader med goda chanser till förlängning Placeringsort: Vara\n\nTyp av anställning: konsultuppdrag\n\n \n\nOm Manpower\n\nManpower är Sveriges ledande rekryterings- och bemanningsföretag med tiotusentals attraktiva arbetsgivare över hela landet som våra kunder. Med vårt omfattande nätverk, lokalt såväl som globalt, kan vi erbjuda mängder av spännande lediga jobb som hjälper dig att bygga din karriär, både på kort och lång sikt. Hos oss kan du söka heltidsjobb eller extrajobb vid sidan av studierna.",
        "conditions" : "Heltid\r\nTemporary",
        "text" : "Motiveras du av att nå resultat tillsammans med ditt team och av att ha högt uppsatta mål? Då kan vi ha rätt utmaning för dig! Just nu söker vi på Manpower en medarbetare till fordonsindustrin till ett uppdrag som varar 6 månader, med goda chanser till förlängning hos vår kund i Vara. Här finns det utmärkta möjligheter att utvecklas och avancera. Vill du vara med på vår kunds resa? Välkommen med din ansökan till oss på Manpower!\n\nDen här bemanningen är ett samarbete mellan oss på Manpower och vår kund. Du kommer att bli anställd av Manpower men arbeta på plats hos kunden.\n\n \n\nOm jobbet som medarbetare till fordonsindustrin\n\nI rollen som medarbetare till fordonsindustrin ansvarar du för att utföra kvalitetskontroller av alla delar i den tillverkande processen och dess verktyg samt ansvara för drift och övervakning av extrudermaskinerna. Dessutom kommer du tillsammans med ditt team arbeta med kontroll av kvalitet, hållfasthet och temperaturer.\n\n \n\nÄr du rätt för rollen som medarbetare till fordonsindustrin?\n\nVi på Manpower söker dig som har en fordonstekniskutbildning alternativ likvärdig erfarenhet.\n\nFör att lyckas i uppdraget är det viktigt att du utför ditt arbete med stor noggrannhet och att du har ett stort driv. Det är också viktigt att du har ett effektivt arbetssätt.\n\nDet är meriterande om du har truckkort.\n\nFör anställning krävs uppvisande av utdrag ur belastningsregistret.\n\n \n\nOm vår kund \n\nKunden är ett välkänt, stort och expansivt bolag med ljusa och moderna lokaler, i utkanten utav Vara.\n\n \n\nVad kan Manpower erbjuda dig? \n\nVi på Manpower hjälper dig att forma din framtid utifrån din kompetens samt dina behov och önskemål. Vi samarbetar med många attraktiva företag och kan öppna dörren till intressanta och spännande uppdrag. Som resurskonsult hos oss får du en anställning med allt vad det innebär i form av marknadsmässig lön, övertidsersättning, semester, tjänstepension och försäkringar enligt kollektivavtal. Friskvårdsbidrag och företagshälsovård ingår också.\n\n \n\nIntresserad?\n\nAnsvarig för den här processen är Emelie Johansson, emelie.johansson@manpower.se\n\nVi arbetar med löpande urval och kan komma att tillsätta uppdraget så fort vi hittat rätt person. Skicka därför in din ansökan så snart som möjligt!\n\nVi ser fram emot din ansökan!\n\n \n\nÖvrigt\n\nUppdragslängd: 6 månader med goda chanser till förlängning Placeringsort: Vara\n\nTyp av anställning: konsultuppdrag\n\n \n\nOm Manpower\n\nManpower är Sveriges ledande rekryterings- och bemanningsföretag med tiotusentals attraktiva arbetsgivare över hela landet som våra kunder. Med vårt omfattande nätverk, lokalt såväl som globalt, kan vi erbjuda mängder av spännande lediga jobb som hjälper dig att bygga din karriär, både på kort och lång sikt. Hos oss kan du söka heltidsjobb eller extrajobb vid sidan av studierna."
      },
      "headline" : "Medarbetare till fordondsindustrin i Vara",
      "driving_license" : null,
      "employer" : {
        "email" : null,
        "phone_number" : null,
        "organization_number" : "5563481588",
        "name" : "Manpower AB",
        "url" : null,
        "workplace" : "Manpower AB"
      },
      "removed_date" : null,
      "logo_url" : "https://www.arbetsformedlingen.se/rest/arbetsgivare/rest/af/v3/organisation/5563481588/logotyper/logo.png",
      "last_publication_date" : "2023-01-04T23:59:59",
      "number_of_vacancies" : 1,
      "occupation" : {
        "concept_id" : "6wcp_7D7_GU7",
        "label" : "Fordonsmontör",
        "legacy_ams_taxonomy_id" : "5508"
      },
      "occupation_group" : {
        "concept_id" : "shkw_ojo_UL2",
        "label" : "Fordonsmontörer",
        "legacy_ams_taxonomy_id" : "8211"
      },
      "employment_type" : {
        "concept_id" : "PFZr_Syz_cUq",
        "label" : "Vanlig anställning",
        "legacy_ams_taxonomy_id" : "1"
      },
      "webpage_url" : "https://arbetsformedlingen.se/platsbanken/annonser/26307977",
      "driving_license_required" : false,
      "application_contacts" : [ {
        "description" : "Emelie Johansson",
        "email" : null,
        "telephone" : null,
        "name" : null,
        "contact_type" : null
      } ],
      "duration" : {
        "concept_id" : "qQUd_4qe_NDT",
        "label" : "6 månader eller längre",
        "legacy_ams_taxonomy_id" : "2"
      },
      "nice_to_have" : {
        "education_level" : [ ],
        "work_experiences" : [ ],
        "skills" : [ ],
        "education" : [ ],
        "languages" : [ ]
      },
      "application_details" : {
        "via_af" : false,
        "email" : null,
        "other" : null,
        "reference" : "998f56fc-f8ba-",
        "url" : "https://www.aplitrak.com/?adid=RUpvaGFuLjIyODE0LjMxMDFAbWFucG93ZXJncm91cG5vcmRpY3MuYXBsaXRyYWsuY29t",
        "information" : null
      },
      "source_type" : "VIA_PLATSBANKEN_DXA",
      "application_deadline" : "2023-01-04T23:59:59",
      "external_id" : "46-556348-1588-998f56fc-f8ba-",
      "workplace_address" : {
        "coordinates" : [ 12.960194, 58.26178 ],
        "city" : null,
        "postcode" : null,
        "municipality" : "Vara",
        "region_concept_id" : "zdoY_6u5_Krt",
        "region" : "Västra Götalands län",
        "country_code" : "199",
        "region_code" : "14",
        "municipality_concept_id" : "fbHM_yhA_BqS",
        "country_concept_id" : "i46j_HmG_v64",
        "municipality_code" : "1470",
        "street_address" : null,
        "country" : "Sverige"
      },
      "id" : "26307977",
      "experience_required" : false,
      "working_hours_type" : {
        "concept_id" : "6YE1_gAC_R2G",
        "label" : "Heltid",
        "legacy_ams_taxonomy_id" : "1"
      },
      "access" : null,
      "timestamp" : 1657266600386,
      "must_have" : {
        "education_level" : [ ],
        "work_experiences" : [ ],
        "skills" : [ ],
        "education" : [ ],
        "languages" : [ ]
      },
      "occupation_field" : {
        "concept_id" : "wTEr_CBC_bqh",
        "label" : "Industriell tillverkning",
        "legacy_ams_taxonomy_id" : "9"
      },
      "scope_of_work" : {
        "min" : 100,
        "max" : 100
      },
      "salary_type" : {
        "concept_id" : "oG8G_9cW_nRf",
        "label" : "Fast månads- vecko- eller timlön",
        "legacy_ams_taxonomy_id" : "1"
      },
      "removed" : false,
      "salary_description" : "Not Specified",
      "access_to_own_car" : false,
      "publication_date" : "2022-07-08T09:50:00"
    },
    "name" : "Medarbetare till fordondsindustrin i Vara",
    "user" : "hannes"
  },
  "sha1" : "fc02e56f3d6fb974000f3e77be02e613a9e206ed",
  "annotations" : [ {
    "preferred-label" : "Vara",
    "type" : "municipality",
    "start-position" : 37,
    "end-position" : 41,
    "concept-id" : "fbHM_yhA_BqS",
    "matched-string" : "Vara",
    "annotation-id" : 3
  }, {
    "preferred-label" : "Vara",
    "type" : "municipality",
    "start-position" : 322,
    "end-position" : 326,
    "concept-id" : "fbHM_yhA_BqS",
    "matched-string" : "Vara",
    "annotation-id" : 4
  }, {
    "preferred-label" : "Kvalitetskontroll",
    "type" : "skill",
    "start-position" : 748,
    "end-position" : 767,
    "concept-id" : "4y7C_Lsh_EPM",
    "matched-string" : "kvalitetskontroller",
    "annotation-id" : 5
  }, {
    "preferred-label" : "Verktyg",
    "sentiment" : "MUST_HAVE",
    "type" : "skill",
    "start-position" : 820,
    "end-position" : 827,
    "concept-id" : "KG9j_WxP_ym2",
    "matched-string" : "verktyg",
    "annotation-id" : 0
  }, {
    "preferred-label" : "Yrkesteknisk högskoleutbildning, fordonsteknik",
    "type" : "keyword",
    "start-position" : 1100,
    "end-position" : 1124,
    "concept-id" : "haU4_MnM_WcE",
    "matched-string" : "fordonstekniskutbildning",
    "annotation-id" : 6
  }, {
    "preferred-label" : "noggrannhet",
    "type" : "esco-skill",
    "start-position" : 1235,
    "end-position" : 1246,
    "concept-id" : "mrsW_EkL_KRD",
    "matched-string" : "noggrannhet",
    "annotation-id" : 7
  }, {
    "preferred-label" : "Kollektivavtal",
    "sentiment" : "MUST_HAVE",
    "type" : "skill",
    "start-position" : 1979,
    "end-position" : 1993,
    "concept-id" : "z7wE_9xb_3jX",
    "matched-string" : "kollektivavtal",
    "annotation-id" : 1
  }, {
    "preferred-label" : "Företagshälsovård",
    "sentiment" : "MUST_HAVE",
    "type" : "skill",
    "start-position" : 2016,
    "end-position" : 2033,
    "concept-id" : "ULfW_rVS_Vpr",
    "matched-string" : "företagshälsovård",
    "annotation-id" : 2
  } ],
  "text" : "Medarbetare till fordondsindustrin i Vara\nMotiveras du av att nå resultat tillsammans med ditt team och av att ha högt uppsatta mål? Då kan vi ha rätt utmaning för dig! Just nu söker vi på Manpower en medarbetare till fordonsindustrin till ett uppdrag som varar 6 månader, med goda chanser till förlängning hos vår kund i Vara. Här finns det utmärkta möjligheter att utvecklas och avancera. Vill du vara med på vår kunds resa? Välkommen med din ansökan till oss på Manpower!\n\nDen här bemanningen är ett samarbete mellan oss på Manpower och vår kund. Du kommer att bli anställd av Manpower men arbeta på plats hos kunden.\n\n \n\nOm jobbet som medarbetare till fordonsindustrin\n\nI rollen som medarbetare till fordonsindustrin ansvarar du för att utföra kvalitetskontroller av alla delar i den tillverkande processen och dess verktyg samt ansvara för drift och övervakning av extrudermaskinerna. Dessutom kommer du tillsammans med ditt team arbeta med kontroll av kvalitet, hållfasthet och temperaturer.\n\n \n\nÄr du rätt för rollen som medarbetare till fordonsindustrin?\n\nVi på Manpower söker dig som har en fordonstekniskutbildning alternativ likvärdig erfarenhet.\n\nFör att lyckas i uppdraget är det viktigt att du utför ditt arbete med stor noggrannhet och att du har ett stort driv. Det är också viktigt att du har ett effektivt arbetssätt.\n\nDet är meriterande om du har truckkort.\n\nFör anställning krävs uppvisande av utdrag ur belastningsregistret.\n\n \n\nOm vår kund \n\nKunden är ett välkänt, stort och expansivt bolag med ljusa och moderna lokaler, i utkanten utav Vara.\n\n \n\nVad kan Manpower erbjuda dig? \n\nVi på Manpower hjälper dig att forma din framtid utifrån din kompetens samt dina behov och önskemål. Vi samarbetar med många attraktiva företag och kan öppna dörren till intressanta och spännande uppdrag. Som resurskonsult hos oss får du en anställning med allt vad det innebär i form av marknadsmässig lön, övertidsersättning, semester, tjänstepension och försäkringar enligt kollektivavtal. Friskvårdsbidrag och företagshälsovård ingår också.\n\n \n\nIntresserad?\n\nAnsvarig för den här processen är Emelie Johansson, emelie.johansson@manpower.se\n\nVi arbetar med löpande urval och kan komma att tillsätta uppdraget så fort vi hittat rätt person. Skicka därför in din ansökan så snart som möjligt!\n\nVi ser fram emot din ansökan!\n\n \n\nÖvrigt\n\nUppdragslängd: 6 månader med goda chanser till förlängning Placeringsort: Vara\n\nTyp av anställning: konsultuppdrag\n\n \n\nOm Manpower\n\nManpower är Sveriges ledande rekryterings- och bemanningsföretag med tiotusentals attraktiva arbetsgivare över hela landet som våra kunder. Med vårt omfattande nätverk, lokalt såväl som globalt, kan vi erbjuda mängder av spännande lediga jobb som hjälper dig att bygga din karriär, både på kort och lång sikt. Hos oss kan du söka heltidsjobb eller extrajobb vid sidan av studierna."
}