{
  "meta" : {
    "jobad" : {
      "description" : {
        "requirements" : null,
        "needs" : null,
        "company_information" : null,
        "text_formatted" : "Om Nannynu! / About Nannynu!\nNanny.nu är ett av Sveriges största, första och mest prisbelönta barnvaktsföretag. Vi är stolta över att ha kollektivavtal och bra villkor våra alla våra anställda.  \n\nVi tror på att leverera barnpassning i världsklass och då vi är ett växande företag söker vi nu Dig som vill ge dig ut på nya äventyr som barnvakt. Vi ser till att du får jobba i en familj som passar in på din profil och att du utbildas i bland annat Barn-HLR och barnolycksfall i samband med att du börjar jobba. Du kommer att ha tät kontakt med din närmaste chef och ett roligt extrajobb som är en merit för livet!\n\nOm uppdraget / About the assignment\nFamilj i Falun med två barn (8 &amp; 9) önskar hjälp med barnpassning 2-3 em/v. Familjen önskar hjälpen mellan ca kl. 15:00-18:00, och vissa gånger mellan kl. 15:00-21:00. Båda barnen har ADHD och aspberger och därför är det viktigt med struktur och långsiktighet hos barnvakten.\n\nDin profil / Your profile\nÄr du en person som vill underlätta andra människors vardag samtidigt som du har ett roligt extrajobb? Vill du ansvara för det finaste en familj har, nämligen barnen, och samtidigt hjälpa föräldrar att få ihop livspusslet? Vill du skratta, busa och bidra till att barnen får en fantastisk stund tillsammans med en person de kan se upp till? Vill du bli en del av ett företag som levererar barnpassning i världsklass? Då ska du söka jobbet som barnvakt hos en av våra familjer!\n\nDå detta är ett extraarbete ser vi gärna att du har en annan huvudsaklig sysselsättning, t.ex. studier eller deltidsjobb och för att det ska bli en långsiktig relation vill vi att du har en rimlig restid till familjen (vi brukar tänka oss runt 30 minuter).\nHär kan du läsa mer om oss och vår kravprofil https://nanny.nu/jobba-hos-oss/\n\n\nVi erbjuder / What we offer\nBörjar du hos oss så kan vi erbjuda dig ett roligt och meningsfullt extraarbete med goda villkor då vi har kollektivavtal. \n\nDu får dessutom:\n– Nannycertifieringskurs\n– Kurs i barn-HLR\n– Försäkring till, från och under arbetet\n– En egen kontaktperson på företaget\n– Vi vill ha ett löneupplägg som känns bra för alla kompetensprofiler och åldrar därför öppnar vi upp för individuell lönesättning för alla som en har gymnasieexamen. För alla som fortfarande går i gymnasiet har vi en fast timlön på 118-148kr/timme inkl. semesterersättning\n– Ob-tillägg samt storhelgstillägg  \n– Möjlighet till fast avtal med garanterade timmar \n– Möjlighet till fortsatt arbete inom koncernen \n\nVid anställning som barnvakt hos Nanny.nu begär vi utdrag ur belastningsregistret.\nVi intervjuar löpande och tipsar dig att vara snabb in med din ansökan. \nSkicka gärna in den på https://nanny.nu/jobba-som-barnvakt/",
        "conditions" : "Deltid - Enligt överenskommelse\r\nTillsvidare",
        "text" : "Om Nannynu! / About Nannynu!\nNanny.nu är ett av Sveriges största, första och mest prisbelönta barnvaktsföretag. Vi är stolta över att ha kollektivavtal och bra villkor våra alla våra anställda.  \n\nVi tror på att leverera barnpassning i världsklass och då vi är ett växande företag söker vi nu Dig som vill ge dig ut på nya äventyr som barnvakt. Vi ser till att du får jobba i en familj som passar in på din profil och att du utbildas i bland annat Barn-HLR och barnolycksfall i samband med att du börjar jobba. Du kommer att ha tät kontakt med din närmaste chef och ett roligt extrajobb som är en merit för livet!\n\nOm uppdraget / About the assignment\nFamilj i Falun med två barn (8 & 9) önskar hjälp med barnpassning 2-3 em/v. Familjen önskar hjälpen mellan ca kl. 15:00-18:00, och vissa gånger mellan kl. 15:00-21:00. Båda barnen har ADHD och aspberger och därför är det viktigt med struktur och långsiktighet hos barnvakten.\n\nDin profil / Your profile\nÄr du en person som vill underlätta andra människors vardag samtidigt som du har ett roligt extrajobb? Vill du ansvara för det finaste en familj har, nämligen barnen, och samtidigt hjälpa föräldrar att få ihop livspusslet? Vill du skratta, busa och bidra till att barnen får en fantastisk stund tillsammans med en person de kan se upp till? Vill du bli en del av ett företag som levererar barnpassning i världsklass? Då ska du söka jobbet som barnvakt hos en av våra familjer!\n\nDå detta är ett extraarbete ser vi gärna att du har en annan huvudsaklig sysselsättning, t.ex. studier eller deltidsjobb och för att det ska bli en långsiktig relation vill vi att du har en rimlig restid till familjen (vi brukar tänka oss runt 30 minuter).\nHär kan du läsa mer om oss och vår kravprofil https://nanny.nu/jobba-hos-oss/\n\n\nVi erbjuder / What we offer\nBörjar du hos oss så kan vi erbjuda dig ett roligt och meningsfullt extraarbete med goda villkor då vi har kollektivavtal. \n\nDu får dessutom:\n– Nannycertifieringskurs\n– Kurs i barn-HLR\n– Försäkring till, från och under arbetet\n– En egen kontaktperson på företaget\n– Vi vill ha ett löneupplägg som känns bra för alla kompetensprofiler och åldrar därför öppnar vi upp för individuell lönesättning för alla som en har gymnasieexamen. För alla som fortfarande går i gymnasiet har vi en fast timlön på 118-148kr/timme inkl. semesterersättning\n– Ob-tillägg samt storhelgstillägg  \n– Möjlighet till fast avtal med garanterade timmar \n– Möjlighet till fortsatt arbete inom koncernen \n\nVid anställning som barnvakt hos Nanny.nu begär vi utdrag ur belastningsregistret.\nVi intervjuar löpande och tipsar dig att vara snabb in med din ansökan. \nSkicka gärna in den på https://nanny.nu/jobba-som-barnvakt/"
      },
      "headline" : "Barnvakt/Nanny Falun 2-3em/v - Kollektivavtal",
      "driving_license" : null,
      "employer" : {
        "email" : null,
        "phone_number" : null,
        "organization_number" : "5566620851",
        "name" : "2007 Nannynu AB",
        "url" : "http://www.nanny.nu",
        "workplace" : "Nannynu! AB Barnvakter i världsklass"
      },
      "removed_date" : null,
      "logo_url" : null,
      "last_publication_date" : "2022-08-25T23:59:59",
      "number_of_vacancies" : 1,
      "occupation" : {
        "concept_id" : "zVkQ_wLL_78i",
        "label" : "Barnflicka/Barnvakt",
        "legacy_ams_taxonomy_id" : "438"
      },
      "occupation_group" : {
        "concept_id" : "o1gn_FoS_fB7",
        "label" : "Övrig hemservicepersonal m.fl.",
        "legacy_ams_taxonomy_id" : "9119"
      },
      "employment_type" : {
        "concept_id" : "PFZr_Syz_cUq",
        "label" : "Vanlig anställning",
        "legacy_ams_taxonomy_id" : "1"
      },
      "webpage_url" : "https://arbetsformedlingen.se/platsbanken/annonser/26397945",
      "driving_license_required" : false,
      "application_contacts" : [ {
        "description" : "_Nannynu!",
        "email" : null,
        "telephone" : null,
        "name" : null,
        "contact_type" : null
      } ],
      "duration" : {
        "concept_id" : "a7uU_j21_mkL",
        "label" : "Tills vidare",
        "legacy_ams_taxonomy_id" : "1"
      },
      "nice_to_have" : {
        "education_level" : [ ],
        "work_experiences" : [ ],
        "skills" : [ ],
        "education" : [ ],
        "languages" : [ ]
      },
      "application_details" : {
        "via_af" : false,
        "email" : null,
        "other" : null,
        "reference" : "10880",
        "url" : "https://nanny.nu/jobba-som-barnvakt/?apply=true&jaid=10880",
        "information" : null
      },
      "source_type" : "VIA_PLATSBANKEN_DXA",
      "application_deadline" : "2022-08-25T23:59:59",
      "external_id" : "46-556662-0851-10880",
      "workplace_address" : {
        "coordinates" : [ 15.6355, 60.60646 ],
        "city" : null,
        "postcode" : null,
        "municipality" : "Falun",
        "region_concept_id" : "oDpK_oZ2_WYt",
        "region" : "Dalarnas län",
        "country_code" : "199",
        "region_code" : "20",
        "municipality_concept_id" : "N1wJ_Cuu_7Cs",
        "country_concept_id" : "i46j_HmG_v64",
        "municipality_code" : "2080",
        "street_address" : null,
        "country" : "Sverige"
      },
      "id" : "26397945",
      "experience_required" : false,
      "working_hours_type" : {
        "concept_id" : "947z_JGS_Uk2",
        "label" : "Deltid",
        "legacy_ams_taxonomy_id" : "2"
      },
      "access" : null,
      "timestamp" : 1660196584330,
      "must_have" : {
        "education_level" : [ ],
        "work_experiences" : [ ],
        "skills" : [ ],
        "education" : [ ],
        "languages" : [ ]
      },
      "occupation_field" : {
        "concept_id" : "whao_Q6A_ScE",
        "label" : "Sanering och renhållning",
        "legacy_ams_taxonomy_id" : "12"
      },
      "scope_of_work" : {
        "min" : 0,
        "max" : 100
      },
      "salary_type" : {
        "concept_id" : "oG8G_9cW_nRf",
        "label" : "Fast månads- vecko- eller timlön",
        "legacy_ams_taxonomy_id" : "1"
      },
      "removed" : false,
      "salary_description" : "Fast lön",
      "access_to_own_car" : false,
      "publication_date" : "2022-08-11T07:43:04"
    },
    "name" : "Barnvakt/Nanny Falun 2-3em/v - Kollektivavtal",
    "user" : "hannes"
  },
  "sha1" : "2179b57da0dd810f63c246be4b5b796d17f531dc",
  "annotations" : [ {
    "preferred-label" : "Barnvakt",
    "sentiment" : "MUST_HAVE",
    "type" : "occupation-name",
    "start-position" : 0,
    "end-position" : 8,
    "concept-id" : "zVkQ_wLL_78i",
    "matched-string" : "barnvakt",
    "annotation-id" : 0
  }, {
    "preferred-label" : "Nanny",
    "sentiment" : "MUST_HAVE",
    "type" : "keyword",
    "start-position" : 9,
    "end-position" : 14,
    "concept-id" : "q8UB_1gQ_Ju5",
    "matched-string" : "nanny",
    "annotation-id" : 1
  }, {
    "preferred-label" : "Falun",
    "type" : "municipality",
    "start-position" : 15,
    "end-position" : 20,
    "concept-id" : "N1wJ_Cuu_7Cs",
    "matched-string" : "Falun",
    "annotation-id" : 16
  }, {
    "preferred-label" : "Deltid",
    "type" : "worktime-extent",
    "start-position" : 21,
    "end-position" : 28,
    "concept-id" : "947z_JGS_Uk2",
    "matched-string" : "2-3em/v",
    "annotation-id" : 14
  }, {
    "preferred-label" : "Kollektivavtal",
    "sentiment" : "OFFERED",
    "type" : "skill",
    "start-position" : 31,
    "end-position" : 45,
    "concept-id" : "z7wE_9xb_3jX",
    "matched-string" : "kollektivavtal",
    "annotation-id" : 2
  }, {
    "preferred-label" : "Sverige",
    "type" : "country",
    "start-position" : 94,
    "end-position" : 102,
    "concept-id" : "i46j_HmG_v64",
    "matched-string" : "Sveriges",
    "annotation-id" : 15
  }, {
    "preferred-label" : "Kollektivavtal",
    "sentiment" : "OFFERED",
    "type" : "skill",
    "start-position" : 183,
    "end-position" : 197,
    "concept-id" : "z7wE_9xb_3jX",
    "matched-string" : "kollektivavtal",
    "annotation-id" : 4
  }, {
    "preferred-label" : "barnpassning",
    "type" : "esco-skill",
    "start-position" : 267,
    "end-position" : 279,
    "concept-id" : "m5G2_tuy_2uZ",
    "matched-string" : "barnpassning",
    "annotation-id" : 17
  }, {
    "preferred-label" : "Barnvakt",
    "sentiment" : "MUST_HAVE",
    "type" : "occupation-name",
    "start-position" : 381,
    "end-position" : 389,
    "concept-id" : "zVkQ_wLL_78i",
    "matched-string" : "barnvakt",
    "annotation-id" : 5
  }, {
    "preferred-label" : "Hjärt- och lungräddning",
    "type" : "skill",
    "start-position" : 499,
    "end-position" : 502,
    "concept-id" : "irju_S7Y_Xbr",
    "matched-string" : "HLR",
    "annotation-id" : 18
  }, {
    "preferred-label" : "Falun",
    "type" : "municipality",
    "start-position" : 706,
    "end-position" : 711,
    "concept-id" : "N1wJ_Cuu_7Cs",
    "matched-string" : "Falun",
    "annotation-id" : 19
  }, {
    "preferred-label" : "barnpassning",
    "sentiment" : "MUST_HAVE",
    "type" : "esco-skill",
    "start-position" : 750,
    "end-position" : 762,
    "concept-id" : "m5G2_tuy_2uZ",
    "matched-string" : "barnpassning",
    "annotation-id" : 20
  }, {
    "preferred-label" : "Deltid",
    "type" : "worktime-extent",
    "start-position" : 763,
    "end-position" : 771,
    "concept-id" : "947z_JGS_Uk2",
    "matched-string" : "2-3 em/v",
    "annotation-id" : 21
  }, {
    "preferred-label" : "barnpassning",
    "type" : "esco-skill",
    "start-position" : 1389,
    "end-position" : 1401,
    "concept-id" : "m5G2_tuy_2uZ",
    "matched-string" : "barnpassning",
    "annotation-id" : 22
  }, {
    "preferred-label" : "Barnvakt",
    "sentiment" : "MUST_HAVE",
    "type" : "occupation-name",
    "start-position" : 1443,
    "end-position" : 1451,
    "concept-id" : "zVkQ_wLL_78i",
    "matched-string" : "barnvakt",
    "annotation-id" : 6
  }, {
    "preferred-label" : "Deltid",
    "type" : "worktime-extent",
    "start-position" : 1587,
    "end-position" : 1598,
    "concept-id" : "947z_JGS_Uk2",
    "matched-string" : "deltidsjobb",
    "annotation-id" : 23
  }, {
    "preferred-label" : "Kollektivavtal",
    "sentiment" : "OFFERED",
    "type" : "skill",
    "start-position" : 1950,
    "end-position" : 1964,
    "concept-id" : "z7wE_9xb_3jX",
    "matched-string" : "kollektivavtal",
    "annotation-id" : 8
  }, {
    "preferred-label" : "Hjärt- och lungräddning",
    "sentiment" : "OFFERED",
    "type" : "skill",
    "start-position" : 2024,
    "end-position" : 2027,
    "concept-id" : "irju_S7Y_Xbr",
    "matched-string" : "HLR",
    "annotation-id" : 24
  }, {
    "preferred-label" : "Försäkring",
    "sentiment" : "OFFERED",
    "type" : "sni-level-3",
    "start-position" : 2030,
    "end-position" : 2040,
    "concept-id" : "wjA9_2f4_Wy8",
    "matched-string" : "försäkring",
    "annotation-id" : 9
  }, {
    "preferred-label" : "Gymnasial utbildning",
    "type" : "sun-education-level-1",
    "start-position" : 2258,
    "end-position" : 2272,
    "concept-id" : "DeBt_ahh_bkx",
    "matched-string" : "gymnasieexamen",
    "annotation-id" : 26
  }, {
    "preferred-label" : "Timanställning",
    "sentiment" : "OFFERED",
    "type" : "keyword",
    "start-position" : 2330,
    "end-position" : 2336,
    "concept-id" : "kfXw_Vmt_Zzk",
    "matched-string" : "timlön",
    "annotation-id" : 25
  }, {
    "preferred-label" : "Barnvakt",
    "sentiment" : "MUST_HAVE",
    "type" : "occupation-name",
    "start-position" : 2540,
    "end-position" : 2548,
    "concept-id" : "zVkQ_wLL_78i",
    "matched-string" : "barnvakt",
    "annotation-id" : 10
  } ],
  "text" : "Barnvakt/Nanny Falun 2-3em/v - Kollektivavtal\nOm Nannynu! / About Nannynu!\nNanny.nu är ett av Sveriges största, första och mest prisbelönta barnvaktsföretag. Vi är stolta över att ha kollektivavtal och bra villkor våra alla våra anställda.  \n\nVi tror på att leverera barnpassning i världsklass och då vi är ett växande företag söker vi nu Dig som vill ge dig ut på nya äventyr som barnvakt. Vi ser till att du får jobba i en familj som passar in på din profil och att du utbildas i bland annat Barn-HLR och barnolycksfall i samband med att du börjar jobba. Du kommer att ha tät kontakt med din närmaste chef och ett roligt extrajobb som är en merit för livet!\n\nOm uppdraget / About the assignment\nFamilj i Falun med två barn (8 & 9) önskar hjälp med barnpassning 2-3 em/v. Familjen önskar hjälpen mellan ca kl. 15:00-18:00, och vissa gånger mellan kl. 15:00-21:00. Båda barnen har ADHD och aspberger och därför är det viktigt med struktur och långsiktighet hos barnvakten.\n\nDin profil / Your profile\nÄr du en person som vill underlätta andra människors vardag samtidigt som du har ett roligt extrajobb? Vill du ansvara för det finaste en familj har, nämligen barnen, och samtidigt hjälpa föräldrar att få ihop livspusslet? Vill du skratta, busa och bidra till att barnen får en fantastisk stund tillsammans med en person de kan se upp till? Vill du bli en del av ett företag som levererar barnpassning i världsklass? Då ska du söka jobbet som barnvakt hos en av våra familjer!\n\nDå detta är ett extraarbete ser vi gärna att du har en annan huvudsaklig sysselsättning, t.ex. studier eller deltidsjobb och för att det ska bli en långsiktig relation vill vi att du har en rimlig restid till familjen (vi brukar tänka oss runt 30 minuter).\nHär kan du läsa mer om oss och vår kravprofil https://nanny.nu/jobba-hos-oss/\n\n\nVi erbjuder / What we offer\nBörjar du hos oss så kan vi erbjuda dig ett roligt och meningsfullt extraarbete med goda villkor då vi har kollektivavtal. \n\nDu får dessutom:\n– Nannycertifieringskurs\n– Kurs i barn-HLR\n– Försäkring till, från och under arbetet\n– En egen kontaktperson på företaget\n– Vi vill ha ett löneupplägg som känns bra för alla kompetensprofiler och åldrar därför öppnar vi upp för individuell lönesättning för alla som en har gymnasieexamen. För alla som fortfarande går i gymnasiet har vi en fast timlön på 118-148kr/timme inkl. semesterersättning\n– Ob-tillägg samt storhelgstillägg  \n– Möjlighet till fast avtal med garanterade timmar \n– Möjlighet till fortsatt arbete inom koncernen \n\nVid anställning som barnvakt hos Nanny.nu begär vi utdrag ur belastningsregistret.\nVi intervjuar löpande och tipsar dig att vara snabb in med din ansökan. \nSkicka gärna in den på https://nanny.nu/jobba-som-barnvakt/"
}