{
  "meta" : {
    "jobad" : {
      "description" : {
        "requirements" : null,
        "needs" : null,
        "company_information" : null,
        "text_formatted" : "Kriminalvården växer – vi bygger nytt, bygger om och bygger till och söker nu nya medarbetare. Vårt viktigaste mål är att minska återfall i brott – att bryta den onda cirkeln. Lyckas vi med det blir samhället tryggare och säkrare för alla. Vi är den myndighet som ansvarar för anstalter, frivård, häkten och klienttransporter.\n\n\r\n\r\nARBETSUPPGIFTER\nDen här annonsen är för dig som vill arbeta som kriminalvårdare och som redan har en godkänd kriminalvårdsutbildning.\n\nSom kriminalvårdare kan du bidra till ett tryggare och säkrare samhälle. Du jobbar i team tillsammans med andra yrkesgrupper och får möjlighet att hjälpa människor att bryta den onda cirkeln och motivera till att inte återfalla i brott. Det är viktigt att du delar Kriminalvårdens grundläggande värderingar om en human människosyn, respekt för individen och tron på att människan kan utvecklas och förändras. \n\nAtt arbeta vid transportenheten innebär att din huvudsakliga uppgift är att transportera frihetsberövade personer, för Kriminalvården och andra myndigheters räkning. Arbetet omfattar också bevakning under t.ex. rättegångar och vid sjukhusbesök. Det varierande uppdraget innebär att arbetstiden kan vara olika dag för dag. \n\r\n\r\nKVALIFIKATIONER\nDina personliga egenskaper är viktiga. Som kriminalvårdare behöver du vara trygg, stabil, ha god självinsikt, gott omdöme och integritet. Tillsammans med dina kollegor driver du verksamheten, så du behöver ha god samarbetsförmåga och vara tydlig i din kommunikation. Du ska kunna agera fysiskt när det krävs.\n\nVi söker dig som har: \n•\tGodkänd kriminalvårdsutbildning. För utbildning äldre än 5 år krävs att du har aktuell kriminalvårdserfarenhet, vilket för oss innebär att du ska ha arbetat som kriminalvårdare i en sammanhängande period på minst 6 månader under de senaste 5 åren.\n•\tArbetslivserfarenhet inom kriminalvård\n•\tGoda kunskaper i svenska språket i både tal och skrift\n•\tGod datorvana\n•\tB-körkort för manuellt växlat fordon och körvana\n\nDet är meriterande om du har: \n•\tArbetslivserfarenhet inom säkerhetsarbete, social omsorg, psykiatri, vård- och omsorgsarbete\n•\tRelevanta språkkunskaper\n•\tKunskap inom relevanta områden, exempelvis beteendevetenskap, kriminologi, psykiatri, juridik och konflikthantering\r\n\nÖVRIGT\nVi ställer höga krav på våra medarbetares säkerhets- och sekretessmedvetande. Därför gör vi en säkerhetskontroll innan vi beslutar om du får anställning hos oss. Vissa tjänster är placerade i säkerhetsklass och då gör vi en säkerhetsprövning med registerkontroll innan vi fattar anställningsbeslut. \n\nKriminalvårdens verksamhet pågår dygnet runt, året runt. Det innebär att du kommer att arbeta dagar, kvällar och helger. Vissa scheman innebär arbete på nätter. \n\nTjänsten tillsätts under förutsättning att erforderliga beslut fattas.\n\nKriminalvården strävar efter en jämn köns- och åldersfördelning och ökad mångfald. \n\nFör att skicka in din ansökan, klicka på ansökningslänken i annonsen. Frågor om hur du ansöker och lägger in ditt CV ställer du direkt till Visma Recruit 0771- 693 693. Frågor om specifika jobb besvaras av den kontaktperson som anges i annonsen. Vi tar inte emot ansökningar i pappersform eller per e-post.\n\nVi undanber oss vänligen men bestämt direktkontakt med bemannings- och rekryteringsföretag och försäljare av rekryteringsannonser. Kriminalvården har upphandlade avtal.",
        "conditions" : "Heltid.  Schema. Schema måndag - fredag.\r\nTillsvidareanställning, tillträde: Tillträde enligt överenskommelse. .",
        "text" : "Kriminalvården växer – vi bygger nytt, bygger om och bygger till och söker nu nya medarbetare. Vårt viktigaste mål är att minska återfall i brott – att bryta den onda cirkeln. Lyckas vi med det blir samhället tryggare och säkrare för alla. Vi är den myndighet som ansvarar för anstalter, frivård, häkten och klienttransporter.\n\n\r\n\r\nARBETSUPPGIFTER\nDen här annonsen är för dig som vill arbeta som kriminalvårdare och som redan har en godkänd kriminalvårdsutbildning.\n\nSom kriminalvårdare kan du bidra till ett tryggare och säkrare samhälle. Du jobbar i team tillsammans med andra yrkesgrupper och får möjlighet att hjälpa människor att bryta den onda cirkeln och motivera till att inte återfalla i brott. Det är viktigt att du delar Kriminalvårdens grundläggande värderingar om en human människosyn, respekt för individen och tron på att människan kan utvecklas och förändras. \n\nAtt arbeta vid transportenheten innebär att din huvudsakliga uppgift är att transportera frihetsberövade personer, för Kriminalvården och andra myndigheters räkning. Arbetet omfattar också bevakning under t.ex. rättegångar och vid sjukhusbesök. Det varierande uppdraget innebär att arbetstiden kan vara olika dag för dag. \n\r\n\r\nKVALIFIKATIONER\nDina personliga egenskaper är viktiga. Som kriminalvårdare behöver du vara trygg, stabil, ha god självinsikt, gott omdöme och integritet. Tillsammans med dina kollegor driver du verksamheten, så du behöver ha god samarbetsförmåga och vara tydlig i din kommunikation. Du ska kunna agera fysiskt när det krävs.\n\nVi söker dig som har: \n•\tGodkänd kriminalvårdsutbildning. För utbildning äldre än 5 år krävs att du har aktuell kriminalvårdserfarenhet, vilket för oss innebär att du ska ha arbetat som kriminalvårdare i en sammanhängande period på minst 6 månader under de senaste 5 åren.\n•\tArbetslivserfarenhet inom kriminalvård\n•\tGoda kunskaper i svenska språket i både tal och skrift\n•\tGod datorvana\n•\tB-körkort för manuellt växlat fordon och körvana\n\nDet är meriterande om du har: \n•\tArbetslivserfarenhet inom säkerhetsarbete, social omsorg, psykiatri, vård- och omsorgsarbete\n•\tRelevanta språkkunskaper\n•\tKunskap inom relevanta områden, exempelvis beteendevetenskap, kriminologi, psykiatri, juridik och konflikthantering\r\n\nÖVRIGT\nVi ställer höga krav på våra medarbetares säkerhets- och sekretessmedvetande. Därför gör vi en säkerhetskontroll innan vi beslutar om du får anställning hos oss. Vissa tjänster är placerade i säkerhetsklass och då gör vi en säkerhetsprövning med registerkontroll innan vi fattar anställningsbeslut. \n\nKriminalvårdens verksamhet pågår dygnet runt, året runt. Det innebär att du kommer att arbeta dagar, kvällar och helger. Vissa scheman innebär arbete på nätter. \n\nTjänsten tillsätts under förutsättning att erforderliga beslut fattas.\n\nKriminalvården strävar efter en jämn köns- och åldersfördelning och ökad mångfald. \n\nFör att skicka in din ansökan, klicka på ansökningslänken i annonsen. Frågor om hur du ansöker och lägger in ditt CV ställer du direkt till Visma Recruit 0771- 693 693. Frågor om specifika jobb besvaras av den kontaktperson som anges i annonsen. Vi tar inte emot ansökningar i pappersform eller per e-post.\n\nVi undanber oss vänligen men bestämt direktkontakt med bemannings- och rekryteringsföretag och försäljare av rekryteringsannonser. Kriminalvården har upphandlade avtal."
      },
      "headline" : "Utbildad Kriminalvårdare till NTE Västerås, placering Sala",
      "driving_license" : [ {
        "concept_id" : "VTK8_WRx_GcM",
        "label" : "B",
        "legacy_ams_taxonomy_id" : "3"
      } ],
      "employer" : {
        "email" : null,
        "phone_number" : null,
        "organization_number" : "2021000225",
        "name" : "Kriminalvården",
        "url" : null,
        "workplace" : "Kriminalvården, Nationella transportenheten (NTE)"
      },
      "removed_date" : null,
      "logo_url" : "https://www.arbetsformedlingen.se/rest/arbetsgivare/rest/af/v3/organisation/2021000225/logotyper/logo.png",
      "last_publication_date" : "2022-07-26T23:59:59",
      "number_of_vacancies" : 3,
      "occupation" : {
        "concept_id" : "NoHX_doS_a8J",
        "label" : "Kriminalvårdare",
        "legacy_ams_taxonomy_id" : "2503"
      },
      "occupation_group" : {
        "concept_id" : "hgAg_gLr_YGg",
        "label" : "Kriminalvårdare",
        "legacy_ams_taxonomy_id" : "5412"
      },
      "employment_type" : {
        "concept_id" : "PFZr_Syz_cUq",
        "label" : "Vanlig anställning",
        "legacy_ams_taxonomy_id" : "1"
      },
      "webpage_url" : "https://arbetsformedlingen.se/platsbanken/annonser/26292871",
      "driving_license_required" : true,
      "application_contacts" : [ {
        "description" : "Richard Backström",
        "email" : null,
        "telephone" : "077-22 80 800",
        "name" : null,
        "contact_type" : "Rekryterare"
      }, {
        "description" : "Bodil Eriksson",
        "email" : null,
        "telephone" : "010-4843850",
        "name" : null,
        "contact_type" : "Kriminalvårdsinspektör"
      } ],
      "duration" : {
        "concept_id" : "a7uU_j21_mkL",
        "label" : "Tills vidare",
        "legacy_ams_taxonomy_id" : "1"
      },
      "nice_to_have" : {
        "education_level" : [ ],
        "work_experiences" : [ ],
        "skills" : [ ],
        "education" : [ ],
        "languages" : [ ]
      },
      "application_details" : {
        "via_af" : false,
        "email" : null,
        "other" : null,
        "reference" : "C94821",
        "url" : "https://recruit.visma.com/Public/Apply.aspx?guidAssignment=feea4c95-4c4a-4dd6-8127-f9ff174a7364&publishCode=AMS&TK=ddacd5d3-9d5c-4987-a444-0cc982bbf9c1",
        "information" : null
      },
      "source_type" : "VIA_PLATSBANKEN_DXA",
      "application_deadline" : "2022-07-26T23:59:59",
      "external_id" : "46-202100-0225-FEEA4C954C4A4DD68127F9FF174A7364",
      "workplace_address" : {
        "coordinates" : [ 16.606327, 59.92086 ],
        "city" : null,
        "postcode" : null,
        "municipality" : "Sala",
        "region_concept_id" : "G6DV_fKE_Viz",
        "region" : "Västmanlands län",
        "country_code" : "199",
        "region_code" : "19",
        "municipality_concept_id" : "dAen_yTK_tqz",
        "country_concept_id" : "i46j_HmG_v64",
        "municipality_code" : "1981",
        "street_address" : null,
        "country" : "Sverige"
      },
      "id" : "26292871",
      "experience_required" : true,
      "working_hours_type" : {
        "concept_id" : "6YE1_gAC_R2G",
        "label" : "Heltid",
        "legacy_ams_taxonomy_id" : "1"
      },
      "access" : null,
      "timestamp" : 1657002930632,
      "must_have" : {
        "education_level" : [ ],
        "work_experiences" : [ {
          "concept_id" : "NoHX_doS_a8J",
          "weight" : 10,
          "label" : "Kriminalvårdare",
          "legacy_ams_taxonomy_id" : "2503"
        } ],
        "skills" : [ ],
        "education" : [ ],
        "languages" : [ ]
      },
      "occupation_field" : {
        "concept_id" : "E7hm_BLq_fqZ",
        "label" : "Säkerhet och bevakning",
        "legacy_ams_taxonomy_id" : "17"
      },
      "scope_of_work" : {
        "min" : 100,
        "max" : 100
      },
      "salary_type" : {
        "concept_id" : "oG8G_9cW_nRf",
        "label" : "Fast månads- vecko- eller timlön",
        "legacy_ams_taxonomy_id" : "1"
      },
      "removed" : false,
      "salary_description" : "Månadslön Individuell lönesättning tillämpas.",
      "access_to_own_car" : false,
      "publication_date" : "2022-07-05T08:35:30"
    },
    "name" : "Utbildad Kriminalvårdare till NTE Västerås, placering Sala",
    "user" : "hannes"
  },
  "sha1" : "1f3ab1a40a6d5e1cb9b8aec19b4485d38e313b2d",
  "annotations" : [ {
    "preferred-label" : "Kriminalvårdare",
    "sentiment" : "MUST_HAVE",
    "type" : "occupation-name",
    "start-position" : 9,
    "end-position" : 24,
    "concept-id" : "NoHX_doS_a8J",
    "matched-string" : "kriminalvårdare",
    "annotation-id" : 0
  }, {
    "preferred-label" : "Västerås",
    "type" : "municipality",
    "start-position" : 34,
    "end-position" : 42,
    "concept-id" : "8deT_FRF_2SP",
    "matched-string" : "Västerås",
    "annotation-id" : 19
  }, {
    "preferred-label" : "Sala",
    "type" : "municipality",
    "start-position" : 54,
    "end-position" : 58,
    "concept-id" : "dAen_yTK_tqz",
    "matched-string" : "Sala",
    "annotation-id" : 20
  }, {
    "preferred-label" : "Kriminalvården",
    "sentiment" : "MUST_HAVE",
    "type" : "keyword",
    "start-position" : 59,
    "end-position" : 73,
    "concept-id" : "S84z_MKP_aV6",
    "matched-string" : "kriminalvården",
    "annotation-id" : 1
  }, {
    "preferred-label" : "Kriminalvårdare",
    "sentiment" : "MUST_HAVE",
    "type" : "occupation-name",
    "start-position" : 455,
    "end-position" : 470,
    "concept-id" : "NoHX_doS_a8J",
    "matched-string" : "kriminalvårdare",
    "annotation-id" : 2
  }, {
    "preferred-label" : "Kriminalvårdsutbildning",
    "sentiment" : "MUST_HAVE",
    "type" : "keyword",
    "start-position" : 500,
    "end-position" : 523,
    "concept-id" : "WW47_z4A_uww",
    "matched-string" : "kriminalvårdsutbildning",
    "annotation-id" : 3
  }, {
    "preferred-label" : "Kriminalvårdare",
    "sentiment" : "MUST_HAVE",
    "type" : "occupation-name",
    "start-position" : 530,
    "end-position" : 545,
    "concept-id" : "NoHX_doS_a8J",
    "matched-string" : "kriminalvårdare",
    "annotation-id" : 4
  }, {
    "preferred-label" : "Kriminalvården",
    "type" : "keyword",
    "start-position" : 791,
    "end-position" : 806,
    "concept-id" : "S84z_MKP_aV6",
    "matched-string" : "Kriminalvårdens",
    "annotation-id" : 21
  }, {
    "preferred-label" : "Kriminalvården",
    "sentiment" : "MUST_HAVE",
    "type" : "keyword",
    "start-position" : 1056,
    "end-position" : 1070,
    "concept-id" : "S84z_MKP_aV6",
    "matched-string" : "kriminalvården",
    "annotation-id" : 5
  }, {
    "preferred-label" : "Kriminalvårdare",
    "sentiment" : "MUST_HAVE",
    "type" : "occupation-name",
    "start-position" : 1323,
    "end-position" : 1338,
    "concept-id" : "NoHX_doS_a8J",
    "matched-string" : "kriminalvårdare",
    "annotation-id" : 6
  }, {
    "preferred-label" : "samarbeta med kolleger",
    "type" : "esco-skill",
    "start-position" : 1493,
    "end-position" : 1509,
    "concept-id" : "X15R_797_q62",
    "matched-string" : "samarbetsförmåga",
    "annotation-id" : 22
  }, {
    "preferred-label" : "Kriminalvårdsutbildning",
    "sentiment" : "MUST_HAVE",
    "type" : "keyword",
    "start-position" : 1623,
    "end-position" : 1646,
    "concept-id" : "WW47_z4A_uww",
    "matched-string" : "kriminalvårdsutbildning",
    "annotation-id" : 7
  }, {
    "preferred-label" : "Kriminalvårdare",
    "sentiment" : "MUST_HAVE",
    "type" : "occupation-name",
    "start-position" : 1776,
    "end-position" : 1791,
    "concept-id" : "NoHX_doS_a8J",
    "matched-string" : "kriminalvårdare",
    "annotation-id" : 8
  }, {
    "preferred-label" : "Kriminalvård",
    "sentiment" : "MUST_HAVE",
    "type" : "sni-level-5",
    "start-position" : 1891,
    "end-position" : 1903,
    "concept-id" : "xVKK_eNQ_jrR",
    "matched-string" : "kriminalvård",
    "annotation-id" : 9
  }, {
    "preferred-label" : "Svenska språket",
    "sentiment" : "MUST_HAVE",
    "type" : "keyword",
    "start-position" : 1923,
    "end-position" : 1938,
    "concept-id" : "BiGm_58D_SSn",
    "matched-string" : "svenska språket",
    "annotation-id" : 10
  }, {
    "preferred-label" : "B",
    "type" : "driving-licence",
    "start-position" : 1979,
    "end-position" : 1988,
    "concept-id" : "VTK8_WRx_GcM",
    "matched-string" : "B-körkort",
    "annotation-id" : 23
  }, {
    "preferred-label" : "Social omsorg",
    "sentiment" : "MUST_HAVE",
    "type" : "keyword",
    "start-position" : 2105,
    "end-position" : 2118,
    "concept-id" : "Sw4N_2Vt_PVD",
    "matched-string" : "social omsorg",
    "annotation-id" : 11
  }, {
    "preferred-label" : "Psykiatri",
    "sentiment" : "MUST_HAVE",
    "type" : "skill",
    "start-position" : 2120,
    "end-position" : 2129,
    "concept-id" : "sXoR_gGY_ycN",
    "matched-string" : "psykiatri",
    "annotation-id" : 12
  }, {
    "preferred-label" : "beteendevetenskap",
    "sentiment" : "MUST_HAVE",
    "type" : "esco-skill",
    "start-position" : 2227,
    "end-position" : 2244,
    "concept-id" : "Q4vC_gZx_HUa",
    "matched-string" : "beteendevetenskap",
    "annotation-id" : 13
  }, {
    "preferred-label" : "Kriminologi",
    "sentiment" : "MUST_HAVE",
    "type" : "skill",
    "start-position" : 2246,
    "end-position" : 2257,
    "concept-id" : "tc2X_KdJ_VEb",
    "matched-string" : "kriminologi",
    "annotation-id" : 14
  }, {
    "preferred-label" : "Psykiatri",
    "sentiment" : "MUST_HAVE",
    "type" : "skill",
    "start-position" : 2259,
    "end-position" : 2268,
    "concept-id" : "sXoR_gGY_ycN",
    "matched-string" : "psykiatri",
    "annotation-id" : 15
  }, {
    "preferred-label" : "Juridik",
    "sentiment" : "MUST_HAVE",
    "type" : "keyword",
    "start-position" : 2270,
    "end-position" : 2277,
    "concept-id" : "Z9ZH_7XU_Kkb",
    "matched-string" : "juridik",
    "annotation-id" : 16
  }, {
    "preferred-label" : "konflikthantering",
    "type" : "esco-skill",
    "start-position" : 2282,
    "end-position" : 2300,
    "concept-id" : "N47j_j55_R2J",
    "matched-string" : "konflikthantering\r",
    "annotation-id" : 24
  }, {
    "preferred-label" : "Kriminalvården",
    "sentiment" : "MUST_HAVE",
    "type" : "keyword",
    "start-position" : 2845,
    "end-position" : 2859,
    "concept-id" : "S84z_MKP_aV6",
    "matched-string" : "kriminalvården",
    "annotation-id" : 17
  }, {
    "preferred-label" : "Kriminalvården",
    "sentiment" : "MUST_HAVE",
    "type" : "keyword",
    "start-position" : 3369,
    "end-position" : 3383,
    "concept-id" : "S84z_MKP_aV6",
    "matched-string" : "kriminalvården",
    "annotation-id" : 18
  } ],
  "text" : "Utbildad Kriminalvårdare till NTE Västerås, placering Sala\nKriminalvården växer – vi bygger nytt, bygger om och bygger till och söker nu nya medarbetare. Vårt viktigaste mål är att minska återfall i brott – att bryta den onda cirkeln. Lyckas vi med det blir samhället tryggare och säkrare för alla. Vi är den myndighet som ansvarar för anstalter, frivård, häkten och klienttransporter.\n\n\r\n\r\nARBETSUPPGIFTER\nDen här annonsen är för dig som vill arbeta som kriminalvårdare och som redan har en godkänd kriminalvårdsutbildning.\n\nSom kriminalvårdare kan du bidra till ett tryggare och säkrare samhälle. Du jobbar i team tillsammans med andra yrkesgrupper och får möjlighet att hjälpa människor att bryta den onda cirkeln och motivera till att inte återfalla i brott. Det är viktigt att du delar Kriminalvårdens grundläggande värderingar om en human människosyn, respekt för individen och tron på att människan kan utvecklas och förändras. \n\nAtt arbeta vid transportenheten innebär att din huvudsakliga uppgift är att transportera frihetsberövade personer, för Kriminalvården och andra myndigheters räkning. Arbetet omfattar också bevakning under t.ex. rättegångar och vid sjukhusbesök. Det varierande uppdraget innebär att arbetstiden kan vara olika dag för dag. \n\r\n\r\nKVALIFIKATIONER\nDina personliga egenskaper är viktiga. Som kriminalvårdare behöver du vara trygg, stabil, ha god självinsikt, gott omdöme och integritet. Tillsammans med dina kollegor driver du verksamheten, så du behöver ha god samarbetsförmåga och vara tydlig i din kommunikation. Du ska kunna agera fysiskt när det krävs.\n\nVi söker dig som har: \n•\tGodkänd kriminalvårdsutbildning. För utbildning äldre än 5 år krävs att du har aktuell kriminalvårdserfarenhet, vilket för oss innebär att du ska ha arbetat som kriminalvårdare i en sammanhängande period på minst 6 månader under de senaste 5 åren.\n•\tArbetslivserfarenhet inom kriminalvård\n•\tGoda kunskaper i svenska språket i både tal och skrift\n•\tGod datorvana\n•\tB-körkort för manuellt växlat fordon och körvana\n\nDet är meriterande om du har: \n•\tArbetslivserfarenhet inom säkerhetsarbete, social omsorg, psykiatri, vård- och omsorgsarbete\n•\tRelevanta språkkunskaper\n•\tKunskap inom relevanta områden, exempelvis beteendevetenskap, kriminologi, psykiatri, juridik och konflikthantering\r\n\nÖVRIGT\nVi ställer höga krav på våra medarbetares säkerhets- och sekretessmedvetande. Därför gör vi en säkerhetskontroll innan vi beslutar om du får anställning hos oss. Vissa tjänster är placerade i säkerhetsklass och då gör vi en säkerhetsprövning med registerkontroll innan vi fattar anställningsbeslut. \n\nKriminalvårdens verksamhet pågår dygnet runt, året runt. Det innebär att du kommer att arbeta dagar, kvällar och helger. Vissa scheman innebär arbete på nätter. \n\nTjänsten tillsätts under förutsättning att erforderliga beslut fattas.\n\nKriminalvården strävar efter en jämn köns- och åldersfördelning och ökad mångfald. \n\nFör att skicka in din ansökan, klicka på ansökningslänken i annonsen. Frågor om hur du ansöker och lägger in ditt CV ställer du direkt till Visma Recruit 0771- 693 693. Frågor om specifika jobb besvaras av den kontaktperson som anges i annonsen. Vi tar inte emot ansökningar i pappersform eller per e-post.\n\nVi undanber oss vänligen men bestämt direktkontakt med bemannings- och rekryteringsföretag och försäljare av rekryteringsannonser. Kriminalvården har upphandlade avtal."
}