{
  "meta" : {
    "jobad" : {
      "description" : {
        "requirements" : null,
        "needs" : null,
        "company_information" : null,
        "text_formatted" : "<p>Vi på Nordecta AB erbjuder företag i hela Sverige entreprenad och tjänster inom svets, smide och industri.</p><p>Sedan Nordecta startade 2009 har ett antal företag inom b.la. industrin, tillverkningsindustrin. verkstadsindustrin och bygg sektorn gett oss sitt förtroende att få hjälp med detta.</p><p>Något som vi är väldigt glada och stolta över. Förutom många års erfarenhet mot Industri, verkstad och bygg har vi själva erfarenhet från att ha arbetat i industrin vilket vi tycker är en viktig egenskap för att kunna ha förståelse och kunskap om kundernas behov och om hur entreprenad ska gå till för att resultatet ska bli det bästa.</p><p>Inom industrin och byggsmide är det vanligt med situationer då man snabbt behöver göra omändringar i produktion och behöver kvalificerad personal. </p><p>*Ta ansvar</p><p>*Arbeta självständig även i grupp</p><p>*Förstå ritningar</p><p>*Vara självgående</p><p>*Flexibel</p><p><br></p><p>Meriterande!</p><p>* Truck kort</p><p>* Traverskort</p><p>* Svetskunskaper</p><p>* B-körkort</p><p>* Heta arbeten</p><p>Snart kommer det att finnas en hel del arbeten hos oss åt en ny kund. </p><p>Det mesta är resejobb så man är borta en hel del givetvis med traktamente och boende.</p><p>Arbetsuppgifterna är varierande. </p><p>Allt från att montera transportörer kan även vara demontering, montage av stålhallar mm </p><p>Att vilja jobba är ett hög merit på detta jobb, kunna ha tempo och absolut vara lyhörd. </p><p><br></p>",
        "conditions" : null,
        "text" : "Vi på Nordecta AB erbjuder företag i hela Sverige entreprenad och tjänster inom svets, smide och industri.\nSedan Nordecta startade 2009 har ett antal företag inom b.la. industrin, tillverkningsindustrin. verkstadsindustrin och bygg sektorn gett oss sitt förtroende att få hjälp med detta.\nNågot som vi är väldigt glada och stolta över. Förutom många års erfarenhet mot Industri, verkstad och bygg har vi själva erfarenhet från att ha arbetat i industrin vilket vi tycker är en viktig egenskap för att kunna ha förståelse och kunskap om kundernas behov och om hur entreprenad ska gå till för att resultatet ska bli det bästa.\nInom industrin och byggsmide är det vanligt med situationer då man snabbt behöver göra omändringar i produktion och behöver kvalificerad personal. \n*Ta ansvar\n*Arbeta självständig även i grupp\n*Förstå ritningar\n*Vara självgående\n*Flexibel\n\n\nMeriterande!\n* Truck kort\n* Traverskort\n* Svetskunskaper\n* B-körkort\n* Heta arbeten\nSnart kommer det att finnas en hel del arbeten hos oss åt en ny kund. \nDet mesta är resejobb så man är borta en hel del givetvis med traktamente och boende.\nArbetsuppgifterna är varierande. \nAllt från att montera transportörer kan även vara demontering, montage av stålhallar mm \nAtt vilja jobba är ett hög merit på detta jobb, kunna ha tempo och absolut vara lyhörd."
      },
      "headline" : "Montörer för resjobb ",
      "driving_license" : null,
      "employer" : {
        "email" : null,
        "phone_number" : null,
        "organization_number" : "5568033160",
        "name" : "Nordecta AB",
        "url" : "http://www.nordecta.se",
        "workplace" : "NORDECTA AB"
      },
      "removed_date" : null,
      "logo_url" : "https://www.arbetsformedlingen.se/rest/arbetsgivare/rest/af/v3/arbetsplatser/83531928/logotyper/logo.png",
      "last_publication_date" : "2022-08-05T00:00:00",
      "number_of_vacancies" : 10,
      "occupation" : {
        "concept_id" : "AfoB_XP5_5Ak",
        "label" : "Originalmontör",
        "legacy_ams_taxonomy_id" : "4665"
      },
      "occupation_group" : {
        "concept_id" : "8Bmh_vtM_zts",
        "label" : "Grafisk formgivare m.fl.",
        "legacy_ams_taxonomy_id" : "2172"
      },
      "employment_type" : {
        "concept_id" : "PFZr_Syz_cUq",
        "label" : "Vanlig anställning",
        "legacy_ams_taxonomy_id" : "1"
      },
      "webpage_url" : "https://arbetsformedlingen.se/platsbanken/annonser/26298431",
      "driving_license_required" : false,
      "application_contacts" : [ ],
      "duration" : {
        "concept_id" : "Xj7x_7yZ_jEn",
        "label" : "3 månader – upp till 6 månader",
        "legacy_ams_taxonomy_id" : "3"
      },
      "nice_to_have" : {
        "education_level" : [ {
          "concept_id" : "DeBt_ahh_bkx",
          "weight" : 5,
          "label" : "Gymnasial utbildning",
          "legacy_ams_taxonomy_id" : "4"
        } ],
        "work_experiences" : [ {
          "concept_id" : "AfoB_XP5_5Ak",
          "weight" : 5,
          "label" : "Originalmontör",
          "legacy_ams_taxonomy_id" : "4665"
        } ],
        "skills" : [ {
          "concept_id" : "bnMZ_Nt5_o48",
          "weight" : 5,
          "label" : "Förarbevis för skylift",
          "legacy_ams_taxonomy_id" : "608606"
        }, {
          "concept_id" : "KfEn_V5y_npV",
          "weight" : 5,
          "label" : "Utbildningsbevis, mobila arbetsplattformar",
          "legacy_ams_taxonomy_id" : "609201"
        }, {
          "concept_id" : "Q7eC_B7g_QiU",
          "weight" : 5,
          "label" : "Certifikat, heta arbeten",
          "legacy_ams_taxonomy_id" : "1028"
        } ],
        "education" : [ {
          "concept_id" : "atFb_xjp_QfB",
          "weight" : 5,
          "label" : "Bred, generell utbildning",
          "legacy_ams_taxonomy_id" : "1"
        } ],
        "languages" : [ {
          "concept_id" : "NVxJ_hLg_TYS",
          "weight" : 5,
          "label" : "Engelska",
          "legacy_ams_taxonomy_id" : "283"
        } ]
      },
      "application_details" : {
        "via_af" : false,
        "email" : "arbeta@nordecta.com",
        "other" : null,
        "reference" : "Transportörer/Stålhallar  ",
        "url" : null,
        "information" : null
      },
      "source_type" : "VIA_ANNONSERA",
      "application_deadline" : "2022-08-05T00:00:00",
      "external_id" : null,
      "workplace_address" : {
        "coordinates" : [ 17.156390230917147, 60.685464297643314 ],
        "city" : "Gävle",
        "postcode" : "80309",
        "municipality" : "Gävle",
        "region_concept_id" : "zupA_8Nt_xcD",
        "region" : "Gävleborgs län",
        "country_code" : "199",
        "region_code" : "21",
        "municipality_concept_id" : "qk8Y_2b6_82D",
        "country_concept_id" : "i46j_HmG_v64",
        "municipality_code" : "2180",
        "street_address" : "Beckasinvägen, 9",
        "country" : "Sverige"
      },
      "id" : "26298431",
      "experience_required" : true,
      "working_hours_type" : {
        "concept_id" : "6YE1_gAC_R2G",
        "label" : "Heltid",
        "legacy_ams_taxonomy_id" : "1"
      },
      "access" : null,
      "timestamp" : 1657095320272,
      "must_have" : {
        "education_level" : [ ],
        "work_experiences" : [ ],
        "skills" : [ ],
        "education" : [ ],
        "languages" : [ {
          "concept_id" : "zSLA_vw2_FXN",
          "weight" : 10,
          "label" : "Svenska",
          "legacy_ams_taxonomy_id" : "502"
        } ]
      },
      "occupation_field" : {
        "concept_id" : "9puE_nYg_crq",
        "label" : "Kultur, media, design",
        "legacy_ams_taxonomy_id" : "11"
      },
      "scope_of_work" : {
        "min" : 0,
        "max" : 100
      },
      "salary_type" : {
        "concept_id" : "oG8G_9cW_nRf",
        "label" : "Fast månads- vecko- eller timlön",
        "legacy_ams_taxonomy_id" : "1"
      },
      "removed" : false,
      "salary_description" : null,
      "access_to_own_car" : false,
      "publication_date" : "2022-07-06T10:15:20"
    },
    "name" : "Montörer för resjobb ",
    "user" : "kristof.fischer"
  },
  "sha1" : "8f435c61b2c0f1764cdc19385f188c3ba5303fdb",
  "annotations" : [ {
    "preferred-label" : "Montörer",
    "sentiment" : "MUST_HAVE",
    "type" : "ssyk-level-3",
    "start-position" : 0,
    "end-position" : 8,
    "concept-id" : "Wz8B_WeK_vUB",
    "matched-string" : "montörer",
    "annotation-id" : 0
  }, {
    "preferred-label" : "visa professionellt ansvarstagande",
    "sentiment" : "MUST_HAVE",
    "type" : "esco-skill",
    "start-position" : 796,
    "end-position" : 805,
    "concept-id" : "DRjM_LSF_w8x",
    "matched-string" : "Ta ansvar",
    "annotation-id" : 6
  }, {
    "preferred-label" : "arbeta självständigt",
    "sentiment" : "MUST_HAVE",
    "type" : "esco-skill",
    "start-position" : 807,
    "end-position" : 826,
    "concept-id" : "NyFu_HHd_zhz",
    "matched-string" : "Arbeta självständig",
    "annotation-id" : 7
  }, {
    "preferred-label" : "tekniska ritningar",
    "sentiment" : "MUST_HAVE",
    "type" : "esco-skill",
    "start-position" : 841,
    "end-position" : 857,
    "concept-id" : "qh6M_7WE_SPC",
    "matched-string" : "Förstå ritningar",
    "annotation-id" : 8
  }, {
    "preferred-label" : "arbeta självständigt",
    "sentiment" : "MUST_HAVE",
    "type" : "esco-skill",
    "start-position" : 859,
    "end-position" : 875,
    "concept-id" : "NyFu_HHd_zhz",
    "matched-string" : "Vara självgående",
    "annotation-id" : 9
  }, {
    "preferred-label" : "Truckvana",
    "sentiment" : "NICE_TO_HAVE",
    "type" : "skill",
    "start-position" : 903,
    "end-position" : 913,
    "concept-id" : "pGts_PKK_c8W",
    "matched-string" : "Truck kort",
    "annotation-id" : 10
  }, {
    "preferred-label" : "Traverskörning",
    "sentiment" : "NICE_TO_HAVE",
    "type" : "skill",
    "start-position" : 916,
    "end-position" : 927,
    "concept-id" : "LhvF_NZc_r6N",
    "matched-string" : "Traverskort",
    "annotation-id" : 11
  }, {
    "preferred-label" : "Svetsteknik",
    "sentiment" : "NICE_TO_HAVE",
    "type" : "skill",
    "start-position" : 930,
    "end-position" : 944,
    "concept-id" : "agUF_zx8_iKE",
    "matched-string" : "Svetskunskaper",
    "annotation-id" : 12
  }, {
    "preferred-label" : "B",
    "sentiment" : "NICE_TO_HAVE",
    "type" : "driving-licence",
    "start-position" : 947,
    "end-position" : 956,
    "concept-id" : "VTK8_WRx_GcM",
    "matched-string" : "B-körkort",
    "annotation-id" : 13
  }, {
    "preferred-label" : "Certifikat, heta arbeten",
    "sentiment" : "NICE_TO_HAVE",
    "type" : "skill",
    "start-position" : 959,
    "end-position" : 971,
    "concept-id" : "Q7eC_B7g_QiU",
    "matched-string" : "Heta arbeten",
    "annotation-id" : 14
  }, {
    "preferred-label" : "Demontering",
    "sentiment" : "MUST_HAVE",
    "type" : "skill",
    "start-position" : 1213,
    "end-position" : 1224,
    "concept-id" : "f8Sz_Xaf_TEU",
    "matched-string" : "demontering",
    "annotation-id" : 5
  }, {
    "preferred-label" : "montera metalldelar",
    "sentiment" : "MUST_HAVE",
    "type" : "esco-skill",
    "start-position" : 1226,
    "end-position" : 1247,
    "concept-id" : "y5mF_AFi_nn4",
    "matched-string" : "montage av stålhallar",
    "annotation-id" : 15
  } ],
  "text" : "Montörer för resjobb \nVi på Nordecta AB erbjuder företag i hela Sverige entreprenad och tjänster inom svets, smide och industri.\nSedan Nordecta startade 2009 har ett antal företag inom b.la. industrin, tillverkningsindustrin. verkstadsindustrin och bygg sektorn gett oss sitt förtroende att få hjälp med detta.\nNågot som vi är väldigt glada och stolta över. Förutom många års erfarenhet mot Industri, verkstad och bygg har vi själva erfarenhet från att ha arbetat i industrin vilket vi tycker är en viktig egenskap för att kunna ha förståelse och kunskap om kundernas behov och om hur entreprenad ska gå till för att resultatet ska bli det bästa.\nInom industrin och byggsmide är det vanligt med situationer då man snabbt behöver göra omändringar i produktion och behöver kvalificerad personal. \n*Ta ansvar\n*Arbeta självständig även i grupp\n*Förstå ritningar\n*Vara självgående\n*Flexibel\n\n\nMeriterande!\n* Truck kort\n* Traverskort\n* Svetskunskaper\n* B-körkort\n* Heta arbeten\nSnart kommer det att finnas en hel del arbeten hos oss åt en ny kund. \nDet mesta är resejobb så man är borta en hel del givetvis med traktamente och boende.\nArbetsuppgifterna är varierande. \nAllt från att montera transportörer kan även vara demontering, montage av stålhallar mm \nAtt vilja jobba är ett hög merit på detta jobb, kunna ha tempo och absolut vara lyhörd."
}