{
  "meta" : {
    "jobad" : {
      "description" : {
        "requirements" : null,
        "needs" : null,
        "company_information" : null,
        "text_formatted" : "<p>Vi söker en glad och social servitris till vår restaurang i Svartbäcken att börja arbeta omgående och jobba tillsvidare. Jobbet är både utvecklande och utmanande. Du behöver kunna ta stort eget ansvar och kunna hantera stress. Arbetsuppgifter är framförallt att servera våra gäster men även en del förberedelser, städning och disk ingår. Arbetstider är kvällar med start ca klockan 15.30 till stängning ca 21-22. Du behöver kunna jobba några dagar i veckan tisdag till söndag. Tidigare erfarenhet är inte ett krav men du behöver vara fokuserad och ta ansvar för att lära dig dina arbetsuppgifter samt vår meny. Du behöver kunna svenska och engelska.</p><p>Ansökningar tas endast emot via mejl. Vi tar inte emot ansökningar vid besök i restaurangen eller telefonsamtal.</p>",
        "conditions" : null,
        "text" : "Vi söker en glad och social servitris till vår restaurang i Svartbäcken att börja arbeta omgående och jobba tillsvidare. Jobbet är både utvecklande och utmanande. Du behöver kunna ta stort eget ansvar och kunna hantera stress. Arbetsuppgifter är framförallt att servera våra gäster men även en del förberedelser, städning och disk ingår. Arbetstider är kvällar med start ca klockan 15.30 till stängning ca 21-22. Du behöver kunna jobba några dagar i veckan tisdag till söndag. Tidigare erfarenhet är inte ett krav men du behöver vara fokuserad och ta ansvar för att lära dig dina arbetsuppgifter samt vår meny. Du behöver kunna svenska och engelska.\nAnsökningar tas endast emot via mejl. Vi tar inte emot ansökningar vid besök i restaurangen eller telefonsamtal."
      },
      "headline" : "Servitris, kvällsjobb",
      "driving_license" : null,
      "employer" : {
        "email" : null,
        "phone_number" : null,
        "organization_number" : "9697717271",
        "name" : "Black Brook HB",
        "url" : "blackbrook.se",
        "workplace" : "Black Brook HB"
      },
      "removed_date" : null,
      "logo_url" : null,
      "last_publication_date" : "2022-09-03T23:59:59",
      "number_of_vacancies" : 3,
      "occupation" : {
        "concept_id" : "rGGf_KLs_To7",
        "label" : "Servitör/Servitris",
        "legacy_ams_taxonomy_id" : "5487"
      },
      "occupation_group" : {
        "concept_id" : "UjoW_meY_Zwt",
        "label" : "Hovmästare och servitörer",
        "legacy_ams_taxonomy_id" : "5131"
      },
      "employment_type" : {
        "concept_id" : "PFZr_Syz_cUq",
        "label" : "Vanlig anställning",
        "legacy_ams_taxonomy_id" : "1"
      },
      "webpage_url" : "https://arbetsformedlingen.se/platsbanken/annonser/26378976",
      "driving_license_required" : false,
      "application_contacts" : [ ],
      "duration" : {
        "concept_id" : "a7uU_j21_mkL",
        "label" : "Tills vidare",
        "legacy_ams_taxonomy_id" : "1"
      },
      "nice_to_have" : {
        "education_level" : [ ],
        "work_experiences" : [ ],
        "skills" : [ ],
        "education" : [ ],
        "languages" : [ ]
      },
      "application_details" : {
        "via_af" : false,
        "email" : "blackbrook_a_k@hotmail.com",
        "other" : null,
        "reference" : "Servitris",
        "url" : null,
        "information" : null
      },
      "source_type" : "VIA_ANNONSERA",
      "application_deadline" : "2022-09-03T23:59:59",
      "external_id" : null,
      "workplace_address" : {
        "coordinates" : [ 17.632880227853732, 59.875882237145575 ],
        "city" : "Uppsala",
        "postcode" : "75334",
        "municipality" : "Uppsala",
        "region_concept_id" : "zBon_eET_fFU",
        "region" : "Uppsala län",
        "country_code" : "199",
        "region_code" : "03",
        "municipality_concept_id" : "otaF_bQY_4ZD",
        "country_concept_id" : "i46j_HmG_v64",
        "municipality_code" : "0380",
        "street_address" : "Anundsgatan 25",
        "country" : "Sverige"
      },
      "id" : "26378976",
      "experience_required" : false,
      "working_hours_type" : {
        "concept_id" : "947z_JGS_Uk2",
        "label" : "Deltid",
        "legacy_ams_taxonomy_id" : "2"
      },
      "access" : null,
      "timestamp" : 1659625160301,
      "must_have" : {
        "education_level" : [ ],
        "work_experiences" : [ ],
        "skills" : [ ],
        "education" : [ ],
        "languages" : [ {
          "concept_id" : "zSLA_vw2_FXN",
          "weight" : 10,
          "label" : "Svenska",
          "legacy_ams_taxonomy_id" : "502"
        }, {
          "concept_id" : "NVxJ_hLg_TYS",
          "weight" : 10,
          "label" : "Engelska",
          "legacy_ams_taxonomy_id" : "283"
        } ]
      },
      "occupation_field" : {
        "concept_id" : "ScKy_FHB_7wT",
        "label" : "Hotell, restaurang, storhushåll",
        "legacy_ams_taxonomy_id" : "7"
      },
      "scope_of_work" : {
        "min" : 0,
        "max" : 100
      },
      "salary_type" : {
        "concept_id" : "oG8G_9cW_nRf",
        "label" : "Fast månads- vecko- eller timlön",
        "legacy_ams_taxonomy_id" : "1"
      },
      "removed" : false,
      "salary_description" : null,
      "access_to_own_car" : false,
      "publication_date" : "2022-08-04T16:59:20"
    },
    "name" : "Servitris, kvällsjobb",
    "user" : "hannes"
  },
  "sha1" : "ca5d5f2be8614e7a64c3603683f09ed66eccda3d",
  "annotations" : [ {
    "preferred-label" : "Servitör/Servitris",
    "sentiment" : "MUST_HAVE",
    "type" : "occupation-name",
    "start-position" : 0,
    "end-position" : 9,
    "concept-id" : "rGGf_KLs_To7",
    "matched-string" : "servitris",
    "annotation-id" : 0
  }, {
    "preferred-label" : "Servitör/Servitris",
    "sentiment" : "MUST_HAVE",
    "type" : "occupation-name",
    "start-position" : 50,
    "end-position" : 59,
    "concept-id" : "rGGf_KLs_To7",
    "matched-string" : "servitris",
    "annotation-id" : 1
  }, {
    "preferred-label" : "Restaurang",
    "sentiment" : "MUST_HAVE",
    "type" : "keyword",
    "start-position" : 69,
    "end-position" : 79,
    "concept-id" : "o2Cg_3Ap_qvK",
    "matched-string" : "restaurang",
    "annotation-id" : 2
  }, {
    "preferred-label" : "visa ansvarstagande",
    "type" : "esco-skill",
    "start-position" : 202,
    "end-position" : 204,
    "concept-id" : "bcRp_hxV_f5G",
    "matched-string" : "ta",
    "annotation-id" : 6
  }, {
    "preferred-label" : "visa ansvarstagande",
    "type" : "esco-skill",
    "start-position" : 216,
    "end-position" : 222,
    "concept-id" : "bcRp_hxV_f5G",
    "matched-string" : "ansvar",
    "annotation-id" : 5
  }, {
    "preferred-label" : "ansvara för städning",
    "type" : "esco-skill",
    "start-position" : 335,
    "end-position" : 343,
    "concept-id" : "2pc1_7xW_uYA",
    "matched-string" : "städning",
    "annotation-id" : 7
  }, {
    "preferred-label" : "Diskare",
    "type" : "occupation-name",
    "start-position" : 348,
    "end-position" : 352,
    "concept-id" : "pKTY_Kwu_sUw",
    "matched-string" : "disk",
    "annotation-id" : 8
  }, {
    "preferred-label" : "Svenska",
    "sentiment" : "MUST_HAVE",
    "type" : "language",
    "start-position" : 650,
    "end-position" : 657,
    "concept-id" : "zSLA_vw2_FXN",
    "matched-string" : "svenska",
    "annotation-id" : 3
  }, {
    "preferred-label" : "Engelska",
    "sentiment" : "MUST_HAVE",
    "type" : "language",
    "start-position" : 662,
    "end-position" : 670,
    "concept-id" : "NVxJ_hLg_TYS",
    "matched-string" : "engelska",
    "annotation-id" : 4
  } ],
  "text" : "Servitris, kvällsjobb\nVi söker en glad och social servitris till vår restaurang i Svartbäcken att börja arbeta omgående och jobba tillsvidare. Jobbet är både utvecklande och utmanande. Du behöver kunna ta stort eget ansvar och kunna hantera stress. Arbetsuppgifter är framförallt att servera våra gäster men även en del förberedelser, städning och disk ingår. Arbetstider är kvällar med start ca klockan 15.30 till stängning ca 21-22. Du behöver kunna jobba några dagar i veckan tisdag till söndag. Tidigare erfarenhet är inte ett krav men du behöver vara fokuserad och ta ansvar för att lära dig dina arbetsuppgifter samt vår meny. Du behöver kunna svenska och engelska.\nAnsökningar tas endast emot via mejl. Vi tar inte emot ansökningar vid besök i restaurangen eller telefonsamtal."
}