{
  "meta" : {
    "jobad" : {
      "description" : {
        "requirements" : null,
        "needs" : null,
        "company_information" : null,
        "text_formatted" : "Vill du arbeta i en rolig och inkluderande miljö med service via inkommande samtal, mail och chatt? Då har du hittat hem!\n\nVi skapar relationer mellan människor och företag och vi gör det väldigt bra. I snart 30 år har vi arbetat med det vi är bäst på och vi är idag en stark arbetsgivare som arbetar med många stora och välkända varumärken.\n\nOm tjänsten\n\nSom kundserviceagent hos oss arbetar du i stora ljusa lokaler i Lund med goda kommunikationsmöjligheter för dig som åker kollektivt. Färdas du med bil har vi en stor kostnadsfri parkering i anslutning till byggnaden. Vi arbetar både på kontoret och på distans.\n\nDu kommer att arbeta i team där ni tillsammans är ansiktet utåt för varumärket, genom att vara första kontakt mot kunderna via samtal, mailhantering och chat. Teamkänsla, arbetsglädje, god service och utveckling är det som genomsyrar en arbetsdag hos oss. Detta uppnår vi tillsammans genom våra drivna medarbetare, en stark gemensam värdegrund och en öppen dialog.\n\nArbetstiden är till största del förlagd på kontorstid, schema läggs utifrån behovet på de uppdrag vi bemannar, därför varierar alltså arbetstiderna något. Vi ser gärna att du är flexibel genom att ibland kunna jobba kväll och helg.\n\nVi arbetar med rörlig lön, då vi vill att det arbete du lägger ner också ska synas i lönekuvertet. Med det sagt så är det viktigt för oss att våra medarbetare ska känna sig trygga, så vi har även en garanterad månadslön enligt vårt kollektivavtal med Unionen.\n\nTillträde: Snarast.\n\nVem söker vi?\n\nFör tjänsten krävs att du\n\n- har fyllt 18 år\n- har goda svenska språkkunskaper i tal och skrift\n- har gymnasieutbildning, eller annan likvärdig erfarenhet\n- har tidigare arbetslivserfarenhet och referenser\n\n\nVidare ser vi att du tycker om människor, är bra på att samarbeta och hjälper till att driva vår inkluderande arbetsplats framåt. Vi jobbar som bäst när vi gör det tillsammans där alla idéer är värdefulla samtidigt som du är mottaglig för feedback och alltid ser på utmaningar utifrån ett lösningsperspektiv.\nDu förstår också vikten av god kommunikation oavsett kontakt med kunder eller kollegor. Att du har erfarenhet av liknande arbete är ett plus, men framförallt lägger vi stor vikt vid vem du är som person och din förmåga att utvecklas med oss.\n\nVi tycker det är spännande att vår nästa medarbetare finns där ute och förhoppningsvis är redo att bli en viktig del av vår verksamhet. Hoppas vi ses snart!",
        "conditions" : "Heltid\r\nAnställningstid enligt överenskommelse",
        "text" : "Vill du arbeta i en rolig och inkluderande miljö med service via inkommande samtal, mail och chatt? Då har du hittat hem!\n\nVi skapar relationer mellan människor och företag och vi gör det väldigt bra. I snart 30 år har vi arbetat med det vi är bäst på och vi är idag en stark arbetsgivare som arbetar med många stora och välkända varumärken.\n\nOm tjänsten\n\nSom kundserviceagent hos oss arbetar du i stora ljusa lokaler i Lund med goda kommunikationsmöjligheter för dig som åker kollektivt. Färdas du med bil har vi en stor kostnadsfri parkering i anslutning till byggnaden. Vi arbetar både på kontoret och på distans.\n\nDu kommer att arbeta i team där ni tillsammans är ansiktet utåt för varumärket, genom att vara första kontakt mot kunderna via samtal, mailhantering och chat. Teamkänsla, arbetsglädje, god service och utveckling är det som genomsyrar en arbetsdag hos oss. Detta uppnår vi tillsammans genom våra drivna medarbetare, en stark gemensam värdegrund och en öppen dialog.\n\nArbetstiden är till största del förlagd på kontorstid, schema läggs utifrån behovet på de uppdrag vi bemannar, därför varierar alltså arbetstiderna något. Vi ser gärna att du är flexibel genom att ibland kunna jobba kväll och helg.\n\nVi arbetar med rörlig lön, då vi vill att det arbete du lägger ner också ska synas i lönekuvertet. Med det sagt så är det viktigt för oss att våra medarbetare ska känna sig trygga, så vi har även en garanterad månadslön enligt vårt kollektivavtal med Unionen.\n\nTillträde: Snarast.\n\nVem söker vi?\n\nFör tjänsten krävs att du\n\n- har fyllt 18 år\n- har goda svenska språkkunskaper i tal och skrift\n- har gymnasieutbildning, eller annan likvärdig erfarenhet\n- har tidigare arbetslivserfarenhet och referenser\n\n\nVidare ser vi att du tycker om människor, är bra på att samarbeta och hjälper till att driva vår inkluderande arbetsplats framåt. Vi jobbar som bäst när vi gör det tillsammans där alla idéer är värdefulla samtidigt som du är mottaglig för feedback och alltid ser på utmaningar utifrån ett lösningsperspektiv.\nDu förstår också vikten av god kommunikation oavsett kontakt med kunder eller kollegor. Att du har erfarenhet av liknande arbete är ett plus, men framförallt lägger vi stor vikt vid vem du är som person och din förmåga att utvecklas med oss.\n\nVi tycker det är spännande att vår nästa medarbetare finns där ute och förhoppningsvis är redo att bli en viktig del av vår verksamhet. Hoppas vi ses snart!"
      },
      "headline" : "Kundservicemedarbetare",
      "driving_license" : null,
      "employer" : {
        "email" : null,
        "phone_number" : null,
        "organization_number" : "5564798733",
        "name" : "Online Fulfillment Sverige AB",
        "url" : "https://onlinesverige.se/",
        "workplace" : "Online Fulfillment Sverige AB"
      },
      "removed_date" : null,
      "logo_url" : "https://www.arbetsformedlingen.se/rest/arbetsgivare/rest/af/v3/organisation/5564798733/logotyper/logo.png",
      "last_publication_date" : "2023-01-18T23:59:59",
      "number_of_vacancies" : 1,
      "occupation" : {
        "concept_id" : "8Uhp_XYo_z5f",
        "label" : "Kundtjänstmedarbetare",
        "legacy_ams_taxonomy_id" : "2291"
      },
      "occupation_group" : {
        "concept_id" : "pwRH_MT1_8nR",
        "label" : "Kundtjänstpersonal",
        "legacy_ams_taxonomy_id" : "4222"
      },
      "employment_type" : {
        "concept_id" : "PFZr_Syz_cUq",
        "label" : "Vanlig anställning",
        "legacy_ams_taxonomy_id" : "1"
      },
      "webpage_url" : "https://arbetsformedlingen.se/platsbanken/annonser/26367188",
      "driving_license_required" : false,
      "application_contacts" : [ {
        "description" : "Lina Rossander",
        "email" : "lina.rossander@onlinesverige.se",
        "telephone" : null,
        "name" : null,
        "contact_type" : null
      } ],
      "duration" : {
        "concept_id" : "a7uU_j21_mkL",
        "label" : "Tills vidare",
        "legacy_ams_taxonomy_id" : "1"
      },
      "nice_to_have" : {
        "education_level" : [ ],
        "work_experiences" : [ ],
        "skills" : [ ],
        "education" : [ ],
        "languages" : [ ]
      },
      "application_details" : {
        "via_af" : false,
        "email" : null,
        "other" : null,
        "reference" : null,
        "url" : "https://framtid.onlinesverige.se/jobs/115020-kundservicemedarbetare?promotion=50435-arbetsformedlingen",
        "information" : null
      },
      "source_type" : "VIA_PLATSBANKEN_DXA",
      "application_deadline" : "2023-01-18T23:59:59",
      "external_id" : "46-556479-8733-115020-6",
      "workplace_address" : {
        "coordinates" : [ 13.191008, 55.70466 ],
        "city" : null,
        "postcode" : null,
        "municipality" : "Lund",
        "region_concept_id" : "CaRE_1nn_cSU",
        "region" : "Skåne län",
        "country_code" : "199",
        "region_code" : "12",
        "municipality_concept_id" : "muSY_tsR_vDZ",
        "country_concept_id" : "i46j_HmG_v64",
        "municipality_code" : "1281",
        "street_address" : null,
        "country" : "Sverige"
      },
      "id" : "26367188",
      "experience_required" : false,
      "working_hours_type" : {
        "concept_id" : "6YE1_gAC_R2G",
        "label" : "Heltid",
        "legacy_ams_taxonomy_id" : "1"
      },
      "access" : null,
      "timestamp" : 1659346827911,
      "must_have" : {
        "education_level" : [ ],
        "work_experiences" : [ ],
        "skills" : [ ],
        "education" : [ ],
        "languages" : [ ]
      },
      "occupation_field" : {
        "concept_id" : "RPTn_bxG_ExZ",
        "label" : "Försäljning, inköp, marknadsföring",
        "legacy_ams_taxonomy_id" : "5"
      },
      "scope_of_work" : {
        "min" : 100,
        "max" : 100
      },
      "salary_type" : {
        "concept_id" : "oG8G_9cW_nRf",
        "label" : "Fast månads- vecko- eller timlön",
        "legacy_ams_taxonomy_id" : "1"
      },
      "removed" : false,
      "salary_description" : "Lön enligt överenskommelse",
      "access_to_own_car" : false,
      "publication_date" : "2022-08-01T11:40:27"
    },
    "name" : "Kundservicemedarbetare",
    "user" : "kristof.fischer"
  },
  "sha1" : "c4a1f41ea704bdf5dbc612352f0bb1898f6778b3",
  "annotations" : [ {
    "preferred-label" : "Kundtjänstmedarbetare",
    "sentiment" : "MUST_HAVE",
    "type" : "occupation-name",
    "start-position" : 0,
    "end-position" : 22,
    "concept-id" : "8Uhp_XYo_z5f",
    "matched-string" : "kundservicemedarbetare",
    "annotation-id" : 0
  }, {
    "preferred-label" : "Kundtjänstmedarbetare",
    "type" : "occupation-name",
    "start-position" : 383,
    "end-position" : 399,
    "concept-id" : "8Uhp_XYo_z5f",
    "matched-string" : "kundserviceagent",
    "annotation-id" : 3
  }, {
    "preferred-label" : "Lund",
    "type" : "municipality",
    "start-position" : 443,
    "end-position" : 447,
    "concept-id" : "muSY_tsR_vDZ",
    "matched-string" : "Lund",
    "annotation-id" : 4
  }, {
    "preferred-label" : "Distansarbete",
    "type" : "work-place-environment",
    "start-position" : 631,
    "end-position" : 638,
    "concept-id" : "uwzb_xcR_vxS",
    "matched-string" : "distans",
    "annotation-id" : 5
  }, {
    "preferred-label" : "Svenska",
    "sentiment" : "MUST_HAVE",
    "type" : "language",
    "start-position" : 1593,
    "end-position" : 1600,
    "concept-id" : "zSLA_vw2_FXN",
    "matched-string" : "svenska",
    "annotation-id" : 2
  }, {
    "preferred-label" : "Gymnasial utbildning",
    "sentiment" : "MUST_HAVE",
    "type" : "sni-level-3",
    "start-position" : 1639,
    "end-position" : 1657,
    "concept-id" : "t8bn_FTn_FiG",
    "matched-string" : "gymnasieutbildning",
    "annotation-id" : 6
  }, {
    "preferred-label" : "samarbeta med kolleger",
    "sentiment" : "MUST_HAVE",
    "type" : "esco-skill",
    "start-position" : 1790,
    "end-position" : 1810,
    "concept-id" : "X15R_797_q62",
    "matched-string" : "bra på att samarbeta",
    "annotation-id" : 7
  }, {
    "preferred-label" : "kommunikation",
    "sentiment" : "MUST_HAVE",
    "type" : "esco-skill",
    "start-position" : 2081,
    "end-position" : 2098,
    "concept-id" : "ahPU_HgE_Jeb",
    "matched-string" : "god kommunikation",
    "annotation-id" : 8
  } ],
  "text" : "Kundservicemedarbetare\nVill du arbeta i en rolig och inkluderande miljö med service via inkommande samtal, mail och chatt? Då har du hittat hem!\n\nVi skapar relationer mellan människor och företag och vi gör det väldigt bra. I snart 30 år har vi arbetat med det vi är bäst på och vi är idag en stark arbetsgivare som arbetar med många stora och välkända varumärken.\n\nOm tjänsten\n\nSom kundserviceagent hos oss arbetar du i stora ljusa lokaler i Lund med goda kommunikationsmöjligheter för dig som åker kollektivt. Färdas du med bil har vi en stor kostnadsfri parkering i anslutning till byggnaden. Vi arbetar både på kontoret och på distans.\n\nDu kommer att arbeta i team där ni tillsammans är ansiktet utåt för varumärket, genom att vara första kontakt mot kunderna via samtal, mailhantering och chat. Teamkänsla, arbetsglädje, god service och utveckling är det som genomsyrar en arbetsdag hos oss. Detta uppnår vi tillsammans genom våra drivna medarbetare, en stark gemensam värdegrund och en öppen dialog.\n\nArbetstiden är till största del förlagd på kontorstid, schema läggs utifrån behovet på de uppdrag vi bemannar, därför varierar alltså arbetstiderna något. Vi ser gärna att du är flexibel genom att ibland kunna jobba kväll och helg.\n\nVi arbetar med rörlig lön, då vi vill att det arbete du lägger ner också ska synas i lönekuvertet. Med det sagt så är det viktigt för oss att våra medarbetare ska känna sig trygga, så vi har även en garanterad månadslön enligt vårt kollektivavtal med Unionen.\n\nTillträde: Snarast.\n\nVem söker vi?\n\nFör tjänsten krävs att du\n\n- har fyllt 18 år\n- har goda svenska språkkunskaper i tal och skrift\n- har gymnasieutbildning, eller annan likvärdig erfarenhet\n- har tidigare arbetslivserfarenhet och referenser\n\n\nVidare ser vi att du tycker om människor, är bra på att samarbeta och hjälper till att driva vår inkluderande arbetsplats framåt. Vi jobbar som bäst när vi gör det tillsammans där alla idéer är värdefulla samtidigt som du är mottaglig för feedback och alltid ser på utmaningar utifrån ett lösningsperspektiv.\nDu förstår också vikten av god kommunikation oavsett kontakt med kunder eller kollegor. Att du har erfarenhet av liknande arbete är ett plus, men framförallt lägger vi stor vikt vid vem du är som person och din förmåga att utvecklas med oss.\n\nVi tycker det är spännande att vår nästa medarbetare finns där ute och förhoppningsvis är redo att bli en viktig del av vår verksamhet. Hoppas vi ses snart!"
}