{
  "meta" : {
    "dataset-id" : "myh-spreadsheet-2021",
    "type" : "education-description",
    "dataset-document-id" : "YH00742",
    "user" : "kristof.fischer"
  },
  "sha1" : "dca823b15904d317c5aefade556d7ac59645fd41",
  "annotations" : [ {
    "preferred-label" : "Högskoleutbildning kortare än två år, yrkesinriktad",
    "sentiment" : "OFFERED",
    "type" : "sun-education-level-3",
    "start-position" : 8,
    "end-position" : 31,
    "concept-id" : "TNYs_h9A_Wxw",
    "matched-string" : "yrkeshögskoleutbildning",
    "annotation-id" : 10
  }, {
    "preferred-label" : "Konstruktör, el-tele",
    "sentiment" : "OFFERED",
    "type" : "occupation-name",
    "start-position" : 77,
    "end-position" : 88,
    "concept-id" : "rhFN_FEC_4Ye",
    "matched-string" : "konstruktör",
    "annotation-id" : 11
  }, {
    "preferred-label" : "Inbyggda system/Embedded system",
    "sentiment" : "OFFERED",
    "type" : "skill",
    "start-position" : 94,
    "end-position" : 109,
    "concept-id" : "XThy_HCH_FFc",
    "matched-string" : "inbyggda system",
    "annotation-id" : 0
  }, {
    "preferred-label" : "VHDL, programmeringsspråk",
    "sentiment" : "OFFERED",
    "type" : "skill",
    "start-position" : 126,
    "end-position" : 130,
    "concept-id" : "4fWV_khE_jfp",
    "matched-string" : "vhdl",
    "annotation-id" : 1
  }, {
    "preferred-label" : "Programmering",
    "sentiment" : "OFFERED",
    "type" : "skill",
    "start-position" : 131,
    "end-position" : 144,
    "concept-id" : "iUew_moc_BRk",
    "matched-string" : "programmering",
    "annotation-id" : 2
  }, {
    "preferred-label" : "FPGA-designer",
    "sentiment" : "OFFERED",
    "type" : "keyword",
    "start-position" : 147,
    "comment" : "finns bara som keyword",
    "end-position" : 158,
    "concept-id" : "Ex79_E8G_8fW",
    "matched-string" : "FPGA-design",
    "annotation-id" : 12
  }, {
    "preferred-label" : "VHDL, programmeringsspråk",
    "sentiment" : "OFFERED",
    "type" : "skill",
    "start-position" : 163,
    "end-position" : 167,
    "concept-id" : "4fWV_khE_jfp",
    "matched-string" : "vhdl",
    "annotation-id" : 3
  }, {
    "preferred-label" : "Systemutvecklare/Programmerare",
    "sentiment" : "OFFERED",
    "type" : "occupation-name",
    "start-position" : 170,
    "comment" : "HW: hardware, SW: software",
    "end-position" : 193,
    "concept-id" : "fg7B_yov_smw",
    "matched-string" : "Avancerade HW/SW-system",
    "annotation-id" : 14
  }, {
    "preferred-label" : "Hårdvarunära programmering",
    "sentiment" : "OFFERED",
    "type" : "skill",
    "start-position" : 196,
    "end-position" : 208,
    "concept-id" : "kjAi_8yN_pgg",
    "matched-string" : "Hårdvarunära",
    "annotation-id" : 13
  }, {
    "preferred-label" : "C, programmeringsspråk",
    "sentiment" : "OFFERED",
    "type" : "skill",
    "start-position" : 209,
    "end-position" : 210,
    "concept-id" : "o8wR_57f_jv9",
    "matched-string" : "c",
    "annotation-id" : 4
  }, {
    "preferred-label" : "Programmering",
    "sentiment" : "OFFERED",
    "type" : "skill",
    "start-position" : 211,
    "end-position" : 224,
    "concept-id" : "iUew_moc_BRk",
    "matched-string" : "programmering",
    "annotation-id" : 5
  }, {
    "preferred-label" : "Produktutveckling",
    "sentiment" : "OFFERED",
    "type" : "skill",
    "start-position" : 246,
    "end-position" : 266,
    "concept-id" : "uwev_L2n_fpz",
    "matched-string" : "Konstruktionsmetodik",
    "annotation-id" : 15
  }, {
    "preferred-label" : "Teknisk dokumentation",
    "sentiment" : "OFFERED",
    "type" : "skill",
    "start-position" : 271,
    "end-position" : 292,
    "concept-id" : "AEgv_4gP_ndv",
    "matched-string" : "teknisk dokumentation",
    "annotation-id" : 6
  }, {
    "preferred-label" : "Ingenjörer och tekniker",
    "type" : "ssyk-level-3",
    "start-position" : 389,
    "end-position" : 399,
    "concept-id" : "DhEP_m8M_qoi",
    "matched-string" : "ingenjörer",
    "annotation-id" : 16
  }, {
    "preferred-label" : "Inbyggda system/Embedded system",
    "sentiment" : "OFFERED",
    "type" : "skill",
    "start-position" : 432,
    "end-position" : 447,
    "concept-id" : "XThy_HCH_FFc",
    "matched-string" : "inbyggda system",
    "annotation-id" : 7
  }, {
    "preferred-label" : "Ingenjörer och tekniker, elektronik",
    "sentiment" : "OFFERED",
    "type" : "isco-level-4",
    "start-position" : 492,
    "end-position" : 515,
    "concept-id" : "Fq5X_uPr_YXt",
    "matched-string" : "arbeta ingenjörsmässigt",
    "annotation-id" : 17
  }, {
    "preferred-label" : "Inbyggda system/Embedded system",
    "sentiment" : "OFFERED",
    "type" : "skill",
    "start-position" : 539,
    "end-position" : 554,
    "concept-id" : "XThy_HCH_FFc",
    "matched-string" : "inbyggda system",
    "annotation-id" : 8
  }, {
    "preferred-label" : "Inbyggda system/Embedded system",
    "sentiment" : "OFFERED",
    "type" : "skill",
    "start-position" : 661,
    "end-position" : 681,
    "concept-id" : "XThy_HCH_FFc",
    "matched-string" : "inbyggda datorsystem",
    "annotation-id" : 18
  }, {
    "preferred-label" : "Annan utbildning i elektronik, datateknik och automation",
    "sentiment" : "OFFERED",
    "type" : "sun-education-field-4",
    "start-position" : 856,
    "end-position" : 876,
    "concept-id" : "3tq2_f1E_Lyh",
    "matched-string" : "Konstruktionsmetodik",
    "annotation-id" : 19
  }, {
    "preferred-label" : "Teknisk dokumentation",
    "sentiment" : "OFFERED",
    "type" : "skill",
    "start-position" : 881,
    "end-position" : 902,
    "concept-id" : "AEgv_4gP_ndv",
    "matched-string" : "teknisk dokumentation",
    "annotation-id" : 20
  } ],
  "text" : "Ettårig yrkeshögskoleutbildning på distans, 220 YH-poäng    Utbilda dig till konstruktör inom inbyggda system med fokus på:  •VHDL-programmering  •FPGA-design med VHDL  •Avancerade HW/SW-system  •Hårdvarunära C-programmering av mikrokontroller  •Konstruktionsmetodik och teknisk dokumentation    Flexibel yrkesutbildning/kompetensutveckling. Passar både personer med gymnasiekompetens och ingenjörer som vill vässa kunskaperna inom inbyggda system.    Målet är att utbilda sig till att kunna arbeta ingenjörsmässigt med tillämpningar inom inbyggda system. Det innebär att man efter genomförd utbildning och LIA (lärande i arbete) ska kunna konstruera och bygga inbyggda datorsystem med de avancerade utvecklingsverktyg som används under utbildningen. Verktygen är de senaste inom branschen. Utbildningen sponsras bland annat av Intel, Silicon Valley, USA. Konstruktionsmetodik och teknisk dokumentation integreras i samtliga kurser. LIA alternativt industriprojekt på distans under 10 veckor erbjuds hos många välkända företag.    Kostnadsfri webbaserad förberedelsekurs till alla sökande!  "
}