{
  "meta" : {
    "jobad" : {
      "description" : {
        "requirements" : null,
        "needs" : null,
        "company_information" : null,
        "text_formatted" : "<p>Vi söker dig som har erfarenhet från möbelsnickeri/finsnickeri inom orientalisk och fransk design med tidigare kunskap av att skulptera med olika träslag. Du ska kunna utföra arbetet med säkerhet och kvalité, med olika typer av material där arbetsområdena är att bl.a. skulptera och snickra fram möbelkonst i stil av Rokoko eller Saltanati via framtagna skisser av förvaringsmöbler, soffgrupper och sovrumsmöbler.</p><p>Du skall utföra dina arbetsuppgifter med noggrannhet samt ha förståelse och känsla över arbetet. Vi söker en person som tidigare arbetat med avancerad möbelsnickeri samt kunna utveckla med nya metoder och maskiner.</p><p><br></p><p>Om dig</p><p>Vi söker dig som är glad och framåt som samtidigt kan hålla fokus, flexibel och inte rädd för att prova nya saker eller möta nya människor och utmaningar.</p>",
        "conditions" : null,
        "text" : "Vi söker dig som har erfarenhet från möbelsnickeri/finsnickeri inom orientalisk och fransk design med tidigare kunskap av att skulptera med olika träslag. Du ska kunna utföra arbetet med säkerhet och kvalité, med olika typer av material där arbetsområdena är att bl.a. skulptera och snickra fram möbelkonst i stil av Rokoko eller Saltanati via framtagna skisser av förvaringsmöbler, soffgrupper och sovrumsmöbler.\nDu skall utföra dina arbetsuppgifter med noggrannhet samt ha förståelse och känsla över arbetet. Vi söker en person som tidigare arbetat med avancerad möbelsnickeri samt kunna utveckla med nya metoder och maskiner.\n\n\nOm dig\nVi söker dig som är glad och framåt som samtidigt kan hålla fokus, flexibel och inte rädd för att prova nya saker eller möta nya människor och utmaningar."
      },
      "headline" : "Möbelsnickare/finsnickare",
      "driving_license" : null,
      "employer" : {
        "email" : null,
        "phone_number" : null,
        "organization_number" : "5591103519",
        "name" : "BIMensions AB",
        "url" : null,
        "workplace" : "BIMensions AB"
      },
      "removed_date" : null,
      "logo_url" : null,
      "last_publication_date" : "2022-08-05T23:59:59",
      "number_of_vacancies" : 1,
      "occupation" : {
        "concept_id" : "cyCt_LLE_qDy",
        "label" : "Inredningssnickare/Specialsnickare",
        "legacy_ams_taxonomy_id" : "5812"
      },
      "occupation_group" : {
        "concept_id" : "1Nwn_GYH_wkH",
        "label" : "Fin-, inrednings- och möbelsnickare",
        "legacy_ams_taxonomy_id" : "7522"
      },
      "employment_type" : {
        "concept_id" : "PFZr_Syz_cUq",
        "label" : "Vanlig anställning",
        "legacy_ams_taxonomy_id" : "1"
      },
      "webpage_url" : "https://arbetsformedlingen.se/platsbanken/annonser/26244969",
      "driving_license_required" : false,
      "application_contacts" : [ ],
      "duration" : {
        "concept_id" : "a7uU_j21_mkL",
        "label" : "Tills vidare",
        "legacy_ams_taxonomy_id" : "1"
      },
      "nice_to_have" : {
        "education_level" : [ ],
        "work_experiences" : [ ],
        "skills" : [ ],
        "education" : [ ],
        "languages" : [ {
          "concept_id" : "zSLA_vw2_FXN",
          "weight" : 5,
          "label" : "Svenska",
          "legacy_ams_taxonomy_id" : "502"
        }, {
          "concept_id" : "NVxJ_hLg_TYS",
          "weight" : 5,
          "label" : "Engelska",
          "legacy_ams_taxonomy_id" : "283"
        } ]
      },
      "application_details" : {
        "via_af" : false,
        "email" : "info@bimensions.se",
        "other" : null,
        "reference" : "Möbelsnickare/Finsnickare",
        "url" : null,
        "information" : null
      },
      "source_type" : "VIA_ANNONSERA",
      "application_deadline" : "2022-08-05T23:59:59",
      "external_id" : null,
      "workplace_address" : {
        "coordinates" : [ 11.966723875561403, 57.721066219292425 ],
        "city" : "GÖTEBORG",
        "postcode" : "41707",
        "municipality" : "Göteborg",
        "region_concept_id" : "zdoY_6u5_Krt",
        "region" : "Västra Götalands län",
        "country_code" : "199",
        "region_code" : "14",
        "municipality_concept_id" : "PVZL_BQT_XtL",
        "country_concept_id" : "i46j_HmG_v64",
        "municipality_code" : "1480",
        "street_address" : "Ringögatan 5",
        "country" : "Sverige"
      },
      "id" : "26244969",
      "experience_required" : true,
      "working_hours_type" : {
        "concept_id" : "6YE1_gAC_R2G",
        "label" : "Heltid",
        "legacy_ams_taxonomy_id" : "1"
      },
      "access" : null,
      "timestamp" : 1655841490807,
      "must_have" : {
        "education_level" : [ ],
        "work_experiences" : [ {
          "concept_id" : "cyCt_LLE_qDy",
          "weight" : 10,
          "label" : "Inredningssnickare/Specialsnickare",
          "legacy_ams_taxonomy_id" : "5812"
        } ],
        "skills" : [ {
          "concept_id" : "K84U_fRp_jCj",
          "weight" : 10,
          "label" : "Möbelsnickeri",
          "legacy_ams_taxonomy_id" : "600893"
        } ],
        "education" : [ ],
        "languages" : [ ]
      },
      "occupation_field" : {
        "concept_id" : "PaxQ_o1G_wWH",
        "label" : "Hantverk",
        "legacy_ams_taxonomy_id" : "6"
      },
      "scope_of_work" : {
        "min" : 0,
        "max" : 100
      },
      "salary_type" : {
        "concept_id" : "oG8G_9cW_nRf",
        "label" : "Fast månads- vecko- eller timlön",
        "legacy_ams_taxonomy_id" : "1"
      },
      "removed" : false,
      "salary_description" : null,
      "access_to_own_car" : false,
      "publication_date" : "2022-06-21T21:58:10"
    },
    "name" : "Möbelsnickare/finsnickare",
    "user" : "hannes"
  },
  "sha1" : "effc924af02646b55f5d10bca8ff2681e06b15e6",
  "annotations" : [ {
    "preferred-label" : "Möbelsnickare",
    "sentiment" : "MUST_HAVE",
    "type" : "occupation-name",
    "start-position" : 0,
    "end-position" : 13,
    "concept-id" : "EVMd_5ES_dRT",
    "matched-string" : "möbelsnickare",
    "annotation-id" : 0
  }, {
    "preferred-label" : "Möbelsnickeri",
    "sentiment" : "MUST_HAVE",
    "type" : "keyword",
    "start-position" : 63,
    "end-position" : 76,
    "concept-id" : "SFD9_68A_oAX",
    "matched-string" : "möbelsnickeri",
    "annotation-id" : 1
  }, {
    "preferred-label" : "Möbeldesign",
    "type" : "skill",
    "start-position" : 117,
    "end-position" : 123,
    "concept-id" : "8Av5_i4R_2do",
    "matched-string" : "design",
    "annotation-id" : 3
  }, {
    "preferred-label" : "typer av möbelträ",
    "type" : "esco-skill",
    "start-position" : 172,
    "end-position" : 179,
    "concept-id" : "PTBF_Y7R_qHT",
    "matched-string" : "träslag",
    "annotation-id" : 7
  }, {
    "preferred-label" : "skulptera",
    "type" : "esco-skill",
    "start-position" : 295,
    "end-position" : 304,
    "concept-id" : "BdN2_yD5_Qei",
    "matched-string" : "skulptera",
    "annotation-id" : 4
  }, {
    "preferred-label" : "Snickare",
    "type" : "keyword",
    "start-position" : 309,
    "end-position" : 316,
    "concept-id" : "ZoAs_CLH_cmJ",
    "matched-string" : "snickra",
    "annotation-id" : 5
  }, {
    "preferred-label" : "konst",
    "type" : "esco-skill",
    "start-position" : 322,
    "end-position" : 332,
    "concept-id" : "iL2F_KFk_GXT",
    "matched-string" : "möbelkonst",
    "annotation-id" : 6
  }, {
    "preferred-label" : "noggrannhet",
    "type" : "esco-skill",
    "start-position" : 481,
    "end-position" : 492,
    "concept-id" : "mrsW_EkL_KRD",
    "matched-string" : "noggrannhet",
    "annotation-id" : 8
  }, {
    "preferred-label" : "Möbelsnickeri",
    "sentiment" : "MUST_HAVE",
    "type" : "keyword",
    "start-position" : 591,
    "end-position" : 604,
    "concept-id" : "SFD9_68A_oAX",
    "matched-string" : "möbelsnickeri",
    "annotation-id" : 2
  } ],
  "text" : "Möbelsnickare/finsnickare\nVi söker dig som har erfarenhet från möbelsnickeri/finsnickeri inom orientalisk och fransk design med tidigare kunskap av att skulptera med olika träslag. Du ska kunna utföra arbetet med säkerhet och kvalité, med olika typer av material där arbetsområdena är att bl.a. skulptera och snickra fram möbelkonst i stil av Rokoko eller Saltanati via framtagna skisser av förvaringsmöbler, soffgrupper och sovrumsmöbler.\nDu skall utföra dina arbetsuppgifter med noggrannhet samt ha förståelse och känsla över arbetet. Vi söker en person som tidigare arbetat med avancerad möbelsnickeri samt kunna utveckla med nya metoder och maskiner.\n\n\nOm dig\nVi söker dig som är glad och framåt som samtidigt kan hålla fokus, flexibel och inte rädd för att prova nya saker eller möta nya människor och utmaningar."
}