{
  "meta" : {
    "dataset-id" : "myh-spreadsheet-2021",
    "type" : "education-description",
    "dataset-document-id" : "YH00065",
    "user" : "kristof.fischer"
  },
  "sha1" : "e421238bbb51c0a6bd0f7c87ee27835c46377c63",
  "annotations" : [ {
    "preferred-label" : "Tandsköterska",
    "sentiment" : "OFFERED",
    "type" : "occupation-name",
    "start-position" : 33,
    "end-position" : 46,
    "concept-id" : "ckkD_JhH_Sc6",
    "matched-string" : "tandsköterska",
    "annotation-id" : 1
  }, {
    "preferred-label" : "Tandsköterska",
    "sentiment" : "OFFERED",
    "type" : "occupation-name",
    "start-position" : 334,
    "end-position" : 347,
    "concept-id" : "ckkD_JhH_Sc6",
    "matched-string" : "tandsköterska",
    "annotation-id" : 2
  }, {
    "preferred-label" : "Tandläkare",
    "sentiment" : "NOT_RELEVANT",
    "type" : "occupation-name",
    "start-position" : 391,
    "end-position" : 401,
    "concept-id" : "TdvW_S8R_CFH",
    "matched-string" : "tandläkare",
    "annotation-id" : 3
  }, {
    "preferred-label" : "Tandhygienist",
    "sentiment" : "NOT_RELEVANT",
    "type" : "occupation-name",
    "start-position" : 406,
    "end-position" : 421,
    "concept-id" : "TPRY_Wze_q6x",
    "matched-string" : "tandhygienister",
    "annotation-id" : 4
  }, {
    "preferred-label" : "assistera tandläkaren vid tandvårdsbehandlingar",
    "sentiment" : "OFFERED",
    "type" : "esco-skill",
    "start-position" : 430,
    "end-position" : 469,
    "concept-id" : "5LfH_HF6_dBU",
    "matched-string" : "assistera vid behandlingar av patienter",
    "annotation-id" : 13
  }, {
    "preferred-label" : null,
    "sentiment" : "OFFERED",
    "type" : "skill",
    "start-position" : 486,
    "end-position" : 512,
    "concept-id" : null,
    "matched-string" : "preventivt tandvårdsarbete",
    "annotation-id" : 14
  }, {
    "preferred-label" : "föra journal",
    "sentiment" : "OFFERED",
    "type" : "esco-skill",
    "start-position" : 549,
    "end-position" : 562,
    "concept-id" : "wc5w_aw2_KBh",
    "matched-string" : "journalföring",
    "annotation-id" : 15
  }, {
    "preferred-label" : null,
    "sentiment" : "OFFERED",
    "type" : "skill",
    "start-position" : 564,
    "end-position" : 578,
    "concept-id" : null,
    "matched-string" : "patientbokning",
    "annotation-id" : 16
  }, {
    "preferred-label" : "sköta reception",
    "sentiment" : "OFFERED",
    "type" : "esco-skill",
    "start-position" : 583,
    "end-position" : 599,
    "concept-id" : "K6XL_6aL_AQ6",
    "matched-string" : "receptionsarbete",
    "annotation-id" : 17
  }, {
    "preferred-label" : "Uppsala",
    "sentiment" : "NOT_RELEVANT",
    "type" : "municipality",
    "start-position" : 824,
    "end-position" : 831,
    "concept-id" : "otaF_bQY_4ZD",
    "matched-string" : "Uppsala",
    "annotation-id" : 18
  }, {
    "preferred-label" : "Stockholm",
    "sentiment" : "NOT_RELEVANT",
    "type" : "municipality",
    "start-position" : 851,
    "end-position" : 861,
    "concept-id" : "AvNB_uwa_6n6",
    "matched-string" : "Stockholms",
    "annotation-id" : 19
  }, {
    "preferred-label" : null,
    "sentiment" : "OFFERED",
    "type" : "sun-education-field-4",
    "start-position" : 883,
    "end-position" : 917,
    "concept-id" : null,
    "matched-string" : "Anatomi, anestesi och farmakologii",
    "annotation-id" : 20
  }, {
    "preferred-label" : null,
    "sentiment" : "OFFERED",
    "type" : "sun-education-field-4",
    "start-position" : 927,
    "end-position" : 960,
    "concept-id" : null,
    "matched-string" : "Etik, bemötande och kommunikation",
    "annotation-id" : 21
  }, {
    "preferred-label" : null,
    "sentiment" : "OFFERED",
    "type" : "sun-education-field-4",
    "start-position" : 970,
    "end-position" : 983,
    "concept-id" : null,
    "matched-string" : "Examensarbete",
    "annotation-id" : 22
  }, {
    "preferred-label" : null,
    "sentiment" : "OFFERED",
    "type" : "sun-education-field-4",
    "start-position" : 993,
    "comment" : "praktik",
    "end-position" : 1011,
    "concept-id" : null,
    "matched-string" : "Lärande i arbete 1",
    "annotation-id" : 23
  }, {
    "preferred-label" : null,
    "sentiment" : "OFFERED",
    "type" : "sun-education-field-4",
    "start-position" : 1020,
    "end-position" : 1038,
    "concept-id" : null,
    "matched-string" : "Lärande i arbete 2",
    "annotation-id" : 24
  }, {
    "preferred-label" : null,
    "sentiment" : "OFFERED",
    "type" : "sun-education-field-4",
    "start-position" : 1048,
    "end-position" : 1066,
    "concept-id" : null,
    "matched-string" : "Lärande i arbete 3",
    "annotation-id" : 25
  }, {
    "preferred-label" : "Miljövetenskap",
    "sentiment" : "OFFERED",
    "type" : "sun-education-field-4",
    "start-position" : 1077,
    "end-position" : 1124,
    "concept-id" : "6n7M_QBo_ryQ",
    "matched-string" : "Material, miljö och hantering av farligt avfall",
    "annotation-id" : 26
  }, {
    "preferred-label" : "Annan utbildning inom tandvård",
    "sentiment" : "OFFERED",
    "type" : "sun-education-field-4",
    "start-position" : 1134,
    "end-position" : 1144,
    "concept-id" : "J8Fy_QgV_Zin",
    "matched-string" : "odontologi",
    "annotation-id" : 8
  }, {
    "preferred-label" : "Annan utbildning inom tandvård",
    "sentiment" : "OFFERED",
    "type" : "sun-education-field-4",
    "start-position" : 1156,
    "end-position" : 1166,
    "concept-id" : "J8Fy_QgV_Zin",
    "matched-string" : "odontologi",
    "annotation-id" : 9
  }, {
    "preferred-label" : "Annan utbildning inom tandvård",
    "sentiment" : "OFFERED",
    "type" : "sun-education-field-4",
    "start-position" : 1178,
    "end-position" : 1188,
    "concept-id" : "J8Fy_QgV_Zin",
    "matched-string" : "Oral hälsa",
    "annotation-id" : 27
  }, {
    "preferred-label" : "Annan utbildning inom tandvård",
    "sentiment" : "OFFERED",
    "type" : "sun-education-field-4",
    "start-position" : 1200,
    "end-position" : 1210,
    "concept-id" : "J8Fy_QgV_Zin",
    "matched-string" : "Oral hälsa",
    "annotation-id" : 28
  }, {
    "preferred-label" : "Annan utbildning inom tandvård",
    "sentiment" : "OFFERED",
    "type" : "sun-education-field-4",
    "start-position" : 1222,
    "end-position" : 1261,
    "concept-id" : "J8Fy_QgV_Zin",
    "matched-string" : "Tandvårdens verksamhet och organisation",
    "annotation-id" : 29
  }, {
    "preferred-label" : "Annan utbildning inom tandvård",
    "sentiment" : "OFFERED",
    "type" : "sun-education-field-4",
    "start-position" : 1271,
    "end-position" : 1296,
    "concept-id" : "J8Fy_QgV_Zin",
    "matched-string" : "Vårdhygien och smittskydd",
    "annotation-id" : 30
  } ],
  "text" : "Utbildning leder till examen som tandsköterska och du kommer vara behörig att arbeta på klinik både inom den offentliga och den privata sektorn. Idag står yrkesgruppen inför flera år av stora pensionsavgångar och därför finns ett stort behov av nyrekryteringar.    Tandsköterskeyrket är ett serviceyrke med mycket patientkontakt. Som tandsköterska arbetar du i tandvårdsteam tillsammans med tandläkare och tandhygienister. Du får assistera vid behandlingar av patienter samt utföra ett preventivt tandvårdsarbete. Många administrativa uppgifter som journalföring, patientbokning och receptionsarbete ingår i yrket.    Utbildningen är upplagd på tre terminer och under varje termin finns en LIA- period. Då är de studerande ute på tandvårdsklinik för att träna sina kunskaper i praktiken. Vi erbjuder LIA-platser inom Region Uppsala och Folktandvården Stockholms läns AB.    Kurser:  Anatomi, anestesi och farmakologii, 25 yhp  Etik, bemötande och kommunikation, 15 yhp  Examensarbete, 20 yhp  Lärande i arbete 1,15 yhp  Lärande i arbete 2,125 yhp  Lärande i arbete 31,140 yhp  Material, miljö och hantering av farligt avfall, 20 yhp  Odontologi 1, 40 yhp  Odontologi 2, 30 yhp  Oral hälsa 1, 25 yhp  Oral hälsa 2, 30 yhp  Tandvårdens verksamhet och organisation, 15 yhp  Vårdhygien och smittskydd, 25 yhp"
}