{
  "meta" : {
    "jobad" : {
      "description" : {
        "requirements" : null,
        "needs" : null,
        "company_information" : null,
        "text_formatted" : "Vill du bli en del av något större och arbeta på en toppmodern klinik och med kollegor som ligger i framkant? Då har vi tjänsten för dig!\n\nOm arbetsgivaren\n\nFamiljen Dagnelid har bedrivit tandvård i Göteborgsområdet sedan 1976. Deras tre kliniker i Göteborg och Falkenberg omsätter drygt 50 miljoner SEK. Klinikerna bedriver allt ifrån allmäntandvård till avancerad specialisttandvård. Här tänker man nytt och annorlunda och lokaler är utrustade med de senaste digitala lösningarna.Verksamheten omfattar 26 behandlingsrum, tandtekniskt laboratorium och utbildningscenter med föreläsningssalar samt digital studio för liveoperationer och utbildning. VD och klinikchef Marcus Dagnelid förklarar varför de slagit ihop sig med Oris Dental:\n\nVi har alltid haft stor passion för yrket och gärna utmanat gamla sanningar. Ofta genom att utveckla nya tekniker och behandlingsmetoder. Vi vill fortsätta vår resa med rätt partner - och det är Oris Dental. Vi har samma syn på yrket, behovet av utbildning och spetskompetens inom alla odontologiska områden. Tillsammans har vi en klar bild av hur vi ska växa i Sverige. Det ska bli mycket spännande att realisera detta med Oris Dental.” Oris Dental startades 2016, när sex norska, välrenommerade kliniker gick samman för att skapa en ny typ av kedja - byggd av tandläkare, ägd av tandläkare och med tandläkare i ledande positioner. Köpet av Dagnelidkliniken innebär att de idag har 38 kliniker, nio tandtekniska laboratorier och över 790 anställda.\n\nVi fokuserar på yrkesstolthet och bästa tänkbara kvalitet i alla led. I Oris Academy, bedriver vi omfattande utbildningsverksamhet, både för egen personal och hela tandvårdsbranschen. Målet är att vi ska bli Nordens ledande odontologiska plattform”, säger Eirik Salvesen.Om tjänsten\nVi söker en utbildad tandsköterska som kan börja jobba heltid hos oss från och med april 2022 eller enligt överenskommelse. Du kommer att få arbeta varierat med sedvanliga arbetsuppgifter med fokus på assistans vid allmän- och specialisttandvård. Du kommer att vara en del av tandsköterskegruppen med ansvar för viss kvalitetssäkring. Vi ser gärna att du är trygg i dig själv och din roll som tandsköterska samt lyhörd för vårt arbetssätt som kanske kan variera med det du är van vid. Du bör vilja utvecklas och vilja ha överblick för att kunna hjälpa till där det behövs.\n\nKvalifikationer\n- Krav: Tandsköterskeutbildning\n- Krav: Flytande svenska och bra engelska i tal och skrift\n- Krav: Du kan ta intraoral röntgen, lägga lokal anestesi, erfarenhet av profylax\n- Önskemål: Erfarenhet av Opus, göra provisorium och ta avtryck\n\n\nVarför ska du välja oss?\nVi är ett varumärke som funnits sedan 1976 där vi drivit tandvård med stor passion. Idag är vi en del av Oris Dental, en tandvårdskedja med starkt fokus på yrket och en av Nordens största odontologiska plattformar. På klinikerna finns tillgång till de flesta specialistdiscipliner och eget tandtekniskt laboratorium. Vi ligger i absoluta framkant vad gäller vår kliniska kompetens och deltar aktivt med flera företag kring forskning- och produktutveckling. Vi har även ett utbildningscenter med föreläsningssalar och studio för liveoperationer och utbildning. Vi erbjuder också fullstort företagsgym, spa och bastu på arbetsplatsen och hos oss får du fantastiska kollegor!\n\n\nDin ansökan ✅\nI denna rekrytering samarbetar Oris Dental - Dagnelidkliniken med Tandfakta för att säkerställa att du får en kompetensbaserad, fördomsfri och rättvis hantering av din ansökan.\n\nSök utan CV på 10 sekunder för att komma i kontakt med ansvarig rekryterare för tjänsten. Urval och intervjuer sker löpande så vänta inte.\n\nVi värnar om din integritet\nMed hänvisning till GDPR och för att säkerställa en säker och rättvis rekryteringsprocess, tar vi endast emot ansökningar via: www.tandfakta.se eller här nedan 👇🏼\nObservera att andra ansökningssätt/ direkt till arbetsgivaren hanteras inte.\n\nKontaktperson\n\nJashar Samadi\n\nSenior rekryteringskonsult\nhej@tandfakta.se\n040 150 115\n\nOm Tandfakta - dentalrekrytering\nTandfakta är Sveriges ledande rekryteringsföretag inom tandvårdsbranschen. Vi har ett eget nätverk med över 10.000 tandvårdspersonal och vårt team består av legitimerad tandvårdspersonal och beteendevetare med gedigen erfarenhet från branschen.\n\nConnecta med oss på 👉🏼  (https://tandfakta.se/) och låt oss hjälpa dig att hitta drömjobbet eller personal inom tandvård!\n\n Dina uppgifter hanteras i enlighet med GDPR, är osynlig för andra och elas inte med tredje part",
        "conditions" : "Heltid\r\nAnställningstid enligt överenskommelse",
        "text" : "Vill du bli en del av något större och arbeta på en toppmodern klinik och med kollegor som ligger i framkant? Då har vi tjänsten för dig!\n\nOm arbetsgivaren\n\nFamiljen Dagnelid har bedrivit tandvård i Göteborgsområdet sedan 1976. Deras tre kliniker i Göteborg och Falkenberg omsätter drygt 50 miljoner SEK. Klinikerna bedriver allt ifrån allmäntandvård till avancerad specialisttandvård. Här tänker man nytt och annorlunda och lokaler är utrustade med de senaste digitala lösningarna.Verksamheten omfattar 26 behandlingsrum, tandtekniskt laboratorium och utbildningscenter med föreläsningssalar samt digital studio för liveoperationer och utbildning. VD och klinikchef Marcus Dagnelid förklarar varför de slagit ihop sig med Oris Dental:\n\nVi har alltid haft stor passion för yrket och gärna utmanat gamla sanningar. Ofta genom att utveckla nya tekniker och behandlingsmetoder. Vi vill fortsätta vår resa med rätt partner - och det är Oris Dental. Vi har samma syn på yrket, behovet av utbildning och spetskompetens inom alla odontologiska områden. Tillsammans har vi en klar bild av hur vi ska växa i Sverige. Det ska bli mycket spännande att realisera detta med Oris Dental.” Oris Dental startades 2016, när sex norska, välrenommerade kliniker gick samman för att skapa en ny typ av kedja - byggd av tandläkare, ägd av tandläkare och med tandläkare i ledande positioner. Köpet av Dagnelidkliniken innebär att de idag har 38 kliniker, nio tandtekniska laboratorier och över 790 anställda.\n\nVi fokuserar på yrkesstolthet och bästa tänkbara kvalitet i alla led. I Oris Academy, bedriver vi omfattande utbildningsverksamhet, både för egen personal och hela tandvårdsbranschen. Målet är att vi ska bli Nordens ledande odontologiska plattform”, säger Eirik Salvesen.Om tjänsten\nVi söker en utbildad tandsköterska som kan börja jobba heltid hos oss från och med april 2022 eller enligt överenskommelse. Du kommer att få arbeta varierat med sedvanliga arbetsuppgifter med fokus på assistans vid allmän- och specialisttandvård. Du kommer att vara en del av tandsköterskegruppen med ansvar för viss kvalitetssäkring. Vi ser gärna att du är trygg i dig själv och din roll som tandsköterska samt lyhörd för vårt arbetssätt som kanske kan variera med det du är van vid. Du bör vilja utvecklas och vilja ha överblick för att kunna hjälpa till där det behövs.\n\nKvalifikationer\n- Krav: Tandsköterskeutbildning\n- Krav: Flytande svenska och bra engelska i tal och skrift\n- Krav: Du kan ta intraoral röntgen, lägga lokal anestesi, erfarenhet av profylax\n- Önskemål: Erfarenhet av Opus, göra provisorium och ta avtryck\n\n\nVarför ska du välja oss?\nVi är ett varumärke som funnits sedan 1976 där vi drivit tandvård med stor passion. Idag är vi en del av Oris Dental, en tandvårdskedja med starkt fokus på yrket och en av Nordens största odontologiska plattformar. På klinikerna finns tillgång till de flesta specialistdiscipliner och eget tandtekniskt laboratorium. Vi ligger i absoluta framkant vad gäller vår kliniska kompetens och deltar aktivt med flera företag kring forskning- och produktutveckling. Vi har även ett utbildningscenter med föreläsningssalar och studio för liveoperationer och utbildning. Vi erbjuder också fullstort företagsgym, spa och bastu på arbetsplatsen och hos oss får du fantastiska kollegor!\n\n\nDin ansökan ✅\nI denna rekrytering samarbetar Oris Dental - Dagnelidkliniken med Tandfakta för att säkerställa att du får en kompetensbaserad, fördomsfri och rättvis hantering av din ansökan.\n\nSök utan CV på 10 sekunder för att komma i kontakt med ansvarig rekryterare för tjänsten. Urval och intervjuer sker löpande så vänta inte.\n\nVi värnar om din integritet\nMed hänvisning till GDPR och för att säkerställa en säker och rättvis rekryteringsprocess, tar vi endast emot ansökningar via: www.tandfakta.se eller här nedan 👇🏼\nObservera att andra ansökningssätt/ direkt till arbetsgivaren hanteras inte.\n\nKontaktperson\n\nJashar Samadi\n\nSenior rekryteringskonsult\nhej@tandfakta.se\n040 150 115\n\nOm Tandfakta - dentalrekrytering\nTandfakta är Sveriges ledande rekryteringsföretag inom tandvårdsbranschen. Vi har ett eget nätverk med över 10.000 tandvårdspersonal och vårt team består av legitimerad tandvårdspersonal och beteendevetare med gedigen erfarenhet från branschen.\n\nConnecta med oss på 👉🏼  (https://tandfakta.se/) och låt oss hjälpa dig att hitta drömjobbet eller personal inom tandvård!\n\n Dina uppgifter hanteras i enlighet med GDPR, är osynlig för andra och elas inte med tredje part"
      },
      "headline" : "Tandsköterskor sökes till Göteborg  - Oris Dental / Dagnelidkliniken",
      "driving_license" : null,
      "employer" : {
        "email" : null,
        "phone_number" : null,
        "organization_number" : "5590401096",
        "name" : "Tandfakta JS AB",
        "url" : "https://tandfakta.se",
        "workplace" : "Tandfakta - dentalrekrytering"
      },
      "removed_date" : null,
      "logo_url" : "https://www.arbetsformedlingen.se/rest/arbetsgivare/rest/af/v3/organisation/5590401096/logotyper/logo.png",
      "last_publication_date" : "2022-07-31T23:59:59",
      "number_of_vacancies" : 1,
      "occupation" : {
        "concept_id" : "ckkD_JhH_Sc6",
        "label" : "Tandsköterska",
        "legacy_ams_taxonomy_id" : "5722"
      },
      "occupation_group" : {
        "concept_id" : "5dxv_nVQ_N8o",
        "label" : "Tandsköterskor",
        "legacy_ams_taxonomy_id" : "5350"
      },
      "employment_type" : {
        "concept_id" : "PFZr_Syz_cUq",
        "label" : "Vanlig anställning",
        "legacy_ams_taxonomy_id" : "1"
      },
      "webpage_url" : "https://arbetsformedlingen.se/platsbanken/annonser/26280382",
      "driving_license_required" : false,
      "application_contacts" : [ {
        "description" : "Jashar Samadi",
        "email" : "hej@tandfakta.se",
        "telephone" : "+46 40 150 115",
        "name" : null,
        "contact_type" : null
      } ],
      "duration" : {
        "concept_id" : "a7uU_j21_mkL",
        "label" : "Tills vidare",
        "legacy_ams_taxonomy_id" : "1"
      },
      "nice_to_have" : {
        "education_level" : [ ],
        "work_experiences" : [ ],
        "skills" : [ ],
        "education" : [ ],
        "languages" : [ ]
      },
      "application_details" : {
        "via_af" : false,
        "email" : null,
        "other" : null,
        "reference" : null,
        "url" : "https://jobb.tandfakta.se/jobs/1561138-tandskoterskor-sokes-till-goteborg-oris-dental-dagnelidkliniken?promotion=345859-arbetsformedlingen",
        "information" : null
      },
      "source_type" : "VIA_PLATSBANKEN_DXA",
      "application_deadline" : "2022-07-31T23:59:59",
      "external_id" : "46-559040-1096-1561138-7",
      "workplace_address" : {
        "coordinates" : [ 11.97456, 57.70887 ],
        "city" : null,
        "postcode" : null,
        "municipality" : "Göteborg",
        "region_concept_id" : "zdoY_6u5_Krt",
        "region" : "Västra Götalands län",
        "country_code" : "199",
        "region_code" : "14",
        "municipality_concept_id" : "PVZL_BQT_XtL",
        "country_concept_id" : "i46j_HmG_v64",
        "municipality_code" : "1480",
        "street_address" : null,
        "country" : "Sverige"
      },
      "id" : "26280382",
      "experience_required" : false,
      "working_hours_type" : {
        "concept_id" : "6YE1_gAC_R2G",
        "label" : "Heltid",
        "legacy_ams_taxonomy_id" : "1"
      },
      "access" : null,
      "timestamp" : 1656656274157,
      "must_have" : {
        "education_level" : [ ],
        "work_experiences" : [ ],
        "skills" : [ ],
        "education" : [ ],
        "languages" : [ ]
      },
      "occupation_field" : {
        "concept_id" : "NYW6_mP6_vwf",
        "label" : "Hälso- och sjukvård",
        "legacy_ams_taxonomy_id" : "8"
      },
      "scope_of_work" : {
        "min" : 100,
        "max" : 100
      },
      "salary_type" : {
        "concept_id" : "oG8G_9cW_nRf",
        "label" : "Fast månads- vecko- eller timlön",
        "legacy_ams_taxonomy_id" : "1"
      },
      "removed" : false,
      "salary_description" : "Lön enligt överenskommelse",
      "access_to_own_car" : false,
      "publication_date" : "2022-07-01T08:17:54"
    },
    "name" : "Tandsköterskor sökes till Göteborg  - Oris Dental / Dagnelidkliniken",
    "user" : "hannes"
  },
  "sha1" : "59d34e2d1900484b66f2b02af5b91baeeb1707e8",
  "annotations" : [ {
    "preferred-label" : "Tandsköterskor",
    "sentiment" : "MUST_HAVE",
    "type" : "forecast-occupation",
    "start-position" : 0,
    "end-position" : 14,
    "concept-id" : "cRLD_LWf_a8p",
    "matched-string" : "tandsköterskor",
    "annotation-id" : 0
  }, {
    "preferred-label" : "Göteborg",
    "type" : "municipality",
    "start-position" : 26,
    "end-position" : 34,
    "concept-id" : "PVZL_BQT_XtL",
    "matched-string" : "Göteborg",
    "annotation-id" : 29
  }, {
    "preferred-label" : "Dental",
    "sentiment" : "MUST_HAVE",
    "type" : "keyword",
    "start-position" : 43,
    "end-position" : 49,
    "concept-id" : "o83B_XFM_uqZ",
    "matched-string" : "dental",
    "annotation-id" : 1
  }, {
    "preferred-label" : "Tandvård",
    "sentiment" : "MUST_HAVE",
    "type" : "keyword",
    "start-position" : 257,
    "end-position" : 265,
    "concept-id" : "ba6n_RTw_PEr",
    "matched-string" : "tandvård",
    "annotation-id" : 2
  }, {
    "preferred-label" : "Göteborg",
    "type" : "municipality",
    "start-position" : 268,
    "end-position" : 284,
    "concept-id" : "PVZL_BQT_XtL",
    "matched-string" : "Göteborgsområdet",
    "annotation-id" : 30
  }, {
    "preferred-label" : "Göteborg",
    "type" : "municipality",
    "start-position" : 318,
    "end-position" : 326,
    "concept-id" : "PVZL_BQT_XtL",
    "matched-string" : "Göteborg",
    "annotation-id" : 31
  }, {
    "preferred-label" : "Falkenberg",
    "type" : "municipality",
    "start-position" : 331,
    "end-position" : 341,
    "concept-id" : "qaJg_wMR_C8T",
    "matched-string" : "Falkenberg",
    "annotation-id" : 32
  }, {
    "preferred-label" : "Tandvård",
    "type" : "keyword",
    "start-position" : 405,
    "end-position" : 419,
    "concept-id" : "ba6n_RTw_PEr",
    "matched-string" : "allmäntandvård",
    "annotation-id" : 33
  }, {
    "preferred-label" : "Specialisttandvård",
    "sentiment" : "MUST_HAVE",
    "type" : "skill",
    "start-position" : 435,
    "end-position" : 453,
    "concept-id" : "Sacc_jcW_oKh",
    "matched-string" : "specialisttandvård",
    "annotation-id" : 3
  }, {
    "preferred-label" : "Dental",
    "sentiment" : "MUST_HAVE",
    "type" : "keyword",
    "start-position" : 797,
    "end-position" : 803,
    "concept-id" : "o83B_XFM_uqZ",
    "matched-string" : "dental",
    "annotation-id" : 4
  }, {
    "preferred-label" : "Dental",
    "sentiment" : "MUST_HAVE",
    "type" : "keyword",
    "start-position" : 1006,
    "end-position" : 1012,
    "concept-id" : "o83B_XFM_uqZ",
    "matched-string" : "dental",
    "annotation-id" : 5
  }, {
    "preferred-label" : "Odontologi",
    "type" : "keyword",
    "start-position" : 1092,
    "end-position" : 1105,
    "concept-id" : "LmSX_u3R_qKg",
    "matched-string" : "odontologiska",
    "annotation-id" : 34
  }, {
    "preferred-label" : "Sverige",
    "type" : "country",
    "start-position" : 1168,
    "end-position" : 1175,
    "concept-id" : "i46j_HmG_v64",
    "matched-string" : "Sverige",
    "annotation-id" : 35
  }, {
    "preferred-label" : "Dental",
    "sentiment" : "MUST_HAVE",
    "type" : "keyword",
    "start-position" : 1235,
    "end-position" : 1241,
    "concept-id" : "o83B_XFM_uqZ",
    "matched-string" : "dental",
    "annotation-id" : 6
  }, {
    "preferred-label" : "Dental",
    "sentiment" : "MUST_HAVE",
    "type" : "keyword",
    "start-position" : 1249,
    "end-position" : 1255,
    "concept-id" : "o83B_XFM_uqZ",
    "matched-string" : "dental",
    "annotation-id" : 7
  }, {
    "preferred-label" : "norska",
    "sentiment" : "MUST_HAVE",
    "type" : "esco-skill",
    "start-position" : 1280,
    "end-position" : 1286,
    "concept-id" : "x1hR_rDo_UUz",
    "matched-string" : "norska",
    "annotation-id" : 8
  }, {
    "preferred-label" : "tandläkare",
    "sentiment" : "MUST_HAVE",
    "type" : "esco-occupation",
    "start-position" : 1368,
    "end-position" : 1378,
    "concept-id" : "teYK_qML_UE3",
    "matched-string" : "tandläkare",
    "annotation-id" : 9
  }, {
    "preferred-label" : "tandläkare",
    "sentiment" : "MUST_HAVE",
    "type" : "esco-occupation",
    "start-position" : 1387,
    "end-position" : 1397,
    "concept-id" : "teYK_qML_UE3",
    "matched-string" : "tandläkare",
    "annotation-id" : 10
  }, {
    "preferred-label" : "tandläkare",
    "sentiment" : "MUST_HAVE",
    "type" : "esco-occupation",
    "start-position" : 1406,
    "end-position" : 1416,
    "concept-id" : "teYK_qML_UE3",
    "matched-string" : "tandläkare",
    "annotation-id" : 11
  }, {
    "preferred-label" : "Personal",
    "sentiment" : "MUST_HAVE",
    "type" : "keyword",
    "start-position" : 1703,
    "end-position" : 1711,
    "concept-id" : "HVxM_6MS_y1c",
    "matched-string" : "personal",
    "annotation-id" : 12
  }, {
    "preferred-label" : "Tandvård",
    "type" : "keyword",
    "start-position" : 1721,
    "end-position" : 1729,
    "concept-id" : "ba6n_RTw_PEr",
    "matched-string" : "tandvård",
    "annotation-id" : 36
  }, {
    "preferred-label" : "Odontologi",
    "type" : "keyword",
    "start-position" : 1781,
    "end-position" : 1794,
    "concept-id" : "LmSX_u3R_qKg",
    "matched-string" : "odontologiska",
    "annotation-id" : 37
  }, {
    "preferred-label" : "Tandsköterska",
    "sentiment" : "MUST_HAVE",
    "type" : "occupation-name",
    "start-position" : 1861,
    "end-position" : 1874,
    "concept-id" : "ckkD_JhH_Sc6",
    "matched-string" : "tandsköterska",
    "annotation-id" : 13
  }, {
    "preferred-label" : "Heltid",
    "type" : "worktime-extent",
    "start-position" : 1895,
    "end-position" : 1901,
    "concept-id" : "6YE1_gAC_R2G",
    "matched-string" : "heltid",
    "annotation-id" : 38
  }, {
    "preferred-label" : "Tandvård",
    "type" : "keyword",
    "start-position" : 2055,
    "end-position" : 2061,
    "concept-id" : "ba6n_RTw_PEr",
    "matched-string" : "allmän",
    "annotation-id" : 39
  }, {
    "preferred-label" : "Specialisttandvård",
    "sentiment" : "MUST_HAVE",
    "type" : "skill",
    "start-position" : 2067,
    "end-position" : 2085,
    "concept-id" : "Sacc_jcW_oKh",
    "matched-string" : "specialisttandvård",
    "annotation-id" : 14
  }, {
    "preferred-label" : "Tandsköterskor",
    "type" : "ssyk-level-4",
    "start-position" : 2116,
    "end-position" : 2129,
    "concept-id" : "5dxv_nVQ_N8o",
    "matched-string" : "tandsköterske",
    "annotation-id" : 40
  }, {
    "preferred-label" : "Kvalitetssäkring",
    "sentiment" : "MUST_HAVE",
    "type" : "skill",
    "start-position" : 2157,
    "end-position" : 2173,
    "concept-id" : "a1Sf_mey_gVk",
    "matched-string" : "kvalitetssäkring",
    "annotation-id" : 15
  }, {
    "preferred-label" : "Tandsköterska",
    "sentiment" : "MUST_HAVE",
    "type" : "occupation-name",
    "start-position" : 2233,
    "end-position" : 2246,
    "concept-id" : "ckkD_JhH_Sc6",
    "matched-string" : "tandsköterska",
    "annotation-id" : 16
  }, {
    "preferred-label" : "Tandsköterskeutbildning",
    "sentiment" : "MUST_HAVE",
    "type" : "sun-education-field-4",
    "start-position" : 2438,
    "end-position" : 2461,
    "concept-id" : "TD6a_dpS_k7s",
    "matched-string" : "tandsköterskeutbildning",
    "annotation-id" : 17
  }, {
    "preferred-label" : "Svenska",
    "sentiment" : "MUST_HAVE",
    "type" : "language",
    "start-position" : 2479,
    "end-position" : 2486,
    "concept-id" : "zSLA_vw2_FXN",
    "matched-string" : "svenska",
    "annotation-id" : 18
  }, {
    "preferred-label" : "Engelska",
    "sentiment" : "MUST_HAVE",
    "type" : "language",
    "start-position" : 2495,
    "end-position" : 2503,
    "concept-id" : "NVxJ_hLg_TYS",
    "matched-string" : "engelska",
    "annotation-id" : 19
  }, {
    "preferred-label" : "ta röntgenbilder",
    "type" : "esco-skill",
    "start-position" : 2549,
    "end-position" : 2556,
    "concept-id" : "LW41_RM7_t4a",
    "matched-string" : "röntgen",
    "annotation-id" : 41
  }, {
    "preferred-label" : "administrera bedövningsmedel till patienter",
    "type" : "esco-skill",
    "start-position" : 2570,
    "end-position" : 2578,
    "concept-id" : "45Fz_whE_knz",
    "matched-string" : "anestesi",
    "annotation-id" : 42
  }, {
    "preferred-label" : "profylax",
    "type" : "esco-skill",
    "start-position" : 2594,
    "end-position" : 2602,
    "concept-id" : "97Qx_Avm_RRF",
    "matched-string" : "profylax",
    "annotation-id" : 43
  }, {
    "preferred-label" : "undersöka tandmodeller och tandavtryck",
    "type" : "esco-skill",
    "start-position" : 2659,
    "end-position" : 2666,
    "concept-id" : "VyfQ_16b_beo",
    "matched-string" : "avtryck",
    "annotation-id" : 44
  }, {
    "preferred-label" : "Tandvård",
    "sentiment" : "MUST_HAVE",
    "type" : "keyword",
    "start-position" : 2751,
    "end-position" : 2759,
    "concept-id" : "ba6n_RTw_PEr",
    "matched-string" : "tandvård",
    "annotation-id" : 20
  }, {
    "preferred-label" : "Dental",
    "sentiment" : "MUST_HAVE",
    "type" : "keyword",
    "start-position" : 2804,
    "end-position" : 2810,
    "concept-id" : "o83B_XFM_uqZ",
    "matched-string" : "dental",
    "annotation-id" : 21
  }, {
    "preferred-label" : "Tandvård",
    "type" : "keyword",
    "start-position" : 2815,
    "end-position" : 2823,
    "concept-id" : "ba6n_RTw_PEr",
    "matched-string" : "tandvård",
    "annotation-id" : 45
  }, {
    "preferred-label" : "Odontologi",
    "type" : "keyword",
    "start-position" : 2882,
    "end-position" : 2895,
    "concept-id" : "LmSX_u3R_qKg",
    "matched-string" : "odontologiska",
    "annotation-id" : 46
  }, {
    "preferred-label" : "Tandteknik",
    "type" : "keyword",
    "start-position" : 2984,
    "end-position" : 2996,
    "concept-id" : "jNZ3_QuF_fwM",
    "matched-string" : "tandtekniskt",
    "annotation-id" : 47
  }, {
    "preferred-label" : "Produktutveckling",
    "sentiment" : "MUST_HAVE",
    "type" : "skill",
    "start-position" : 3132,
    "end-position" : 3149,
    "concept-id" : "uwev_L2n_fpz",
    "matched-string" : "produktutveckling",
    "annotation-id" : 22
  }, {
    "preferred-label" : "Dental",
    "sentiment" : "MUST_HAVE",
    "type" : "keyword",
    "start-position" : 3419,
    "end-position" : 3425,
    "concept-id" : "o83B_XFM_uqZ",
    "matched-string" : "dental",
    "annotation-id" : 23
  }, {
    "preferred-label" : "rekryteringskonsult",
    "sentiment" : "MUST_HAVE",
    "type" : "esco-occupation",
    "start-position" : 4009,
    "end-position" : 4028,
    "concept-id" : "tGyt_via_HNb",
    "matched-string" : "rekryteringskonsult",
    "annotation-id" : 25
  }, {
    "preferred-label" : "beteendevetare",
    "sentiment" : "MUST_HAVE",
    "type" : "esco-occupation",
    "start-position" : 4283,
    "end-position" : 4297,
    "concept-id" : "nu9G_sws_SYE",
    "matched-string" : "beteendevetare",
    "annotation-id" : 26
  }, {
    "preferred-label" : "Personal",
    "sentiment" : "MUST_HAVE",
    "type" : "keyword",
    "start-position" : 4438,
    "end-position" : 4446,
    "concept-id" : "HVxM_6MS_y1c",
    "matched-string" : "personal",
    "annotation-id" : 27
  }, {
    "preferred-label" : "Tandvård",
    "sentiment" : "MUST_HAVE",
    "type" : "keyword",
    "start-position" : 4452,
    "end-position" : 4460,
    "concept-id" : "ba6n_RTw_PEr",
    "matched-string" : "tandvård",
    "annotation-id" : 28
  } ],
  "text" : "Tandsköterskor sökes till Göteborg  - Oris Dental / Dagnelidkliniken\nVill du bli en del av något större och arbeta på en toppmodern klinik och med kollegor som ligger i framkant? Då har vi tjänsten för dig!\n\nOm arbetsgivaren\n\nFamiljen Dagnelid har bedrivit tandvård i Göteborgsområdet sedan 1976. Deras tre kliniker i Göteborg och Falkenberg omsätter drygt 50 miljoner SEK. Klinikerna bedriver allt ifrån allmäntandvård till avancerad specialisttandvård. Här tänker man nytt och annorlunda och lokaler är utrustade med de senaste digitala lösningarna.Verksamheten omfattar 26 behandlingsrum, tandtekniskt laboratorium och utbildningscenter med föreläsningssalar samt digital studio för liveoperationer och utbildning. VD och klinikchef Marcus Dagnelid förklarar varför de slagit ihop sig med Oris Dental:\n\nVi har alltid haft stor passion för yrket och gärna utmanat gamla sanningar. Ofta genom att utveckla nya tekniker och behandlingsmetoder. Vi vill fortsätta vår resa med rätt partner - och det är Oris Dental. Vi har samma syn på yrket, behovet av utbildning och spetskompetens inom alla odontologiska områden. Tillsammans har vi en klar bild av hur vi ska växa i Sverige. Det ska bli mycket spännande att realisera detta med Oris Dental.” Oris Dental startades 2016, när sex norska, välrenommerade kliniker gick samman för att skapa en ny typ av kedja - byggd av tandläkare, ägd av tandläkare och med tandläkare i ledande positioner. Köpet av Dagnelidkliniken innebär att de idag har 38 kliniker, nio tandtekniska laboratorier och över 790 anställda.\n\nVi fokuserar på yrkesstolthet och bästa tänkbara kvalitet i alla led. I Oris Academy, bedriver vi omfattande utbildningsverksamhet, både för egen personal och hela tandvårdsbranschen. Målet är att vi ska bli Nordens ledande odontologiska plattform”, säger Eirik Salvesen.Om tjänsten\nVi söker en utbildad tandsköterska som kan börja jobba heltid hos oss från och med april 2022 eller enligt överenskommelse. Du kommer att få arbeta varierat med sedvanliga arbetsuppgifter med fokus på assistans vid allmän- och specialisttandvård. Du kommer att vara en del av tandsköterskegruppen med ansvar för viss kvalitetssäkring. Vi ser gärna att du är trygg i dig själv och din roll som tandsköterska samt lyhörd för vårt arbetssätt som kanske kan variera med det du är van vid. Du bör vilja utvecklas och vilja ha överblick för att kunna hjälpa till där det behövs.\n\nKvalifikationer\n- Krav: Tandsköterskeutbildning\n- Krav: Flytande svenska och bra engelska i tal och skrift\n- Krav: Du kan ta intraoral röntgen, lägga lokal anestesi, erfarenhet av profylax\n- Önskemål: Erfarenhet av Opus, göra provisorium och ta avtryck\n\n\nVarför ska du välja oss?\nVi är ett varumärke som funnits sedan 1976 där vi drivit tandvård med stor passion. Idag är vi en del av Oris Dental, en tandvårdskedja med starkt fokus på yrket och en av Nordens största odontologiska plattformar. På klinikerna finns tillgång till de flesta specialistdiscipliner och eget tandtekniskt laboratorium. Vi ligger i absoluta framkant vad gäller vår kliniska kompetens och deltar aktivt med flera företag kring forskning- och produktutveckling. Vi har även ett utbildningscenter med föreläsningssalar och studio för liveoperationer och utbildning. Vi erbjuder också fullstort företagsgym, spa och bastu på arbetsplatsen och hos oss får du fantastiska kollegor!\n\n\nDin ansökan ✅\nI denna rekrytering samarbetar Oris Dental - Dagnelidkliniken med Tandfakta för att säkerställa att du får en kompetensbaserad, fördomsfri och rättvis hantering av din ansökan.\n\nSök utan CV på 10 sekunder för att komma i kontakt med ansvarig rekryterare för tjänsten. Urval och intervjuer sker löpande så vänta inte.\n\nVi värnar om din integritet\nMed hänvisning till GDPR och för att säkerställa en säker och rättvis rekryteringsprocess, tar vi endast emot ansökningar via: www.tandfakta.se eller här nedan 👇🏼\nObservera att andra ansökningssätt/ direkt till arbetsgivaren hanteras inte.\n\nKontaktperson\n\nJashar Samadi\n\nSenior rekryteringskonsult\nhej@tandfakta.se\n040 150 115\n\nOm Tandfakta - dentalrekrytering\nTandfakta är Sveriges ledande rekryteringsföretag inom tandvårdsbranschen. Vi har ett eget nätverk med över 10.000 tandvårdspersonal och vårt team består av legitimerad tandvårdspersonal och beteendevetare med gedigen erfarenhet från branschen.\n\nConnecta med oss på 👉🏼  (https://tandfakta.se/) och låt oss hjälpa dig att hitta drömjobbet eller personal inom tandvård!\n\n Dina uppgifter hanteras i enlighet med GDPR, är osynlig för andra och elas inte med tredje part"
}