{
  "meta" : {
    "jobad" : {
      "description" : {
        "requirements" : null,
        "needs" : null,
        "company_information" : null,
        "text_formatted" : "<p><strong>Meet a Student är en jobbplattform för studenter och juniora talanger. </strong></p><p><strong>För kunds räkning söker vi nu:</strong></p><p>Vi söker dig som har ett genuint intresse för barn och gillar ett flexibelt och socialt extrajobb!</p><p>Jobbet som barnvakt passar dig som vill jobba som på ett flexibelt schema med där man känner att man har tid för minst 15 timmar per vecka. Stort plus om du är tillgänglig på förmiddagar och eftermiddagar. Vi ser att man helst har en parallell sysselsättning som studier eller annat deltidsjobb. Vill du även jobba som timvikarie på förskola finns den möjligheten.</p><p>Vi som arbetsgivare erbjuder dig: </p><ul><li>Konkurrenskraftig lön, mellan 110-150 kronor per timme,</li><li>Barnvaktscertifiering utformad av specialpedagoger med tillhörande hjärt och lungräddningsutbildning.</li><li>Toppservice från kontoret som hjälper dig vid frågor eller funderingar</li><li>Och såklart ett väldigt roligt extrajobb med stora möjligheter till personlig och yrkesmässig utveckling.</li></ul><p>Det är viktigt att du har erfarenhet av arbete som barnvakt eller Nanny och alltid tycker det är roligt att vara med barn. Som person ser vi att du är ansvarsfull, social och kreativ för att komma på nya lekar med barnen. Viktigt att du känner dig trygg som barnvakt och kan ta stort ansvar. Då barnen vanligtvis är i åldrarna 0-5 år är det viktigt att du har erfarenhet av dessa åldrar sen tidigare.</p><p>Om våra barnvaktstjänster: Du väljer själv vilken familj du vill jobba för utifrån var de bor, arbetstider och åldrar på barnen. Vi hjälper dig att hitta den perfekta familjen utifrån dina önskemål.</p><p><br></p>",
        "conditions" : null,
        "text" : "Meet a Student är en jobbplattform för studenter och juniora talanger. \nFör kunds räkning söker vi nu:\nVi söker dig som har ett genuint intresse för barn och gillar ett flexibelt och socialt extrajobb!\nJobbet som barnvakt passar dig som vill jobba som på ett flexibelt schema med där man känner att man har tid för minst 15 timmar per vecka. Stort plus om du är tillgänglig på förmiddagar och eftermiddagar. Vi ser att man helst har en parallell sysselsättning som studier eller annat deltidsjobb. Vill du även jobba som timvikarie på förskola finns den möjligheten.\nVi som arbetsgivare erbjuder dig: \nKonkurrenskraftig lön, mellan 110-150 kronor per timme,\nBarnvaktscertifiering utformad av specialpedagoger med tillhörande hjärt och lungräddningsutbildning.\nToppservice från kontoret som hjälper dig vid frågor eller funderingar\nOch såklart ett väldigt roligt extrajobb med stora möjligheter till personlig och yrkesmässig utveckling.\n\nDet är viktigt att du har erfarenhet av arbete som barnvakt eller Nanny och alltid tycker det är roligt att vara med barn. Som person ser vi att du är ansvarsfull, social och kreativ för att komma på nya lekar med barnen. Viktigt att du känner dig trygg som barnvakt och kan ta stort ansvar. Då barnen vanligtvis är i åldrarna 0-5 år är det viktigt att du har erfarenhet av dessa åldrar sen tidigare.\nOm våra barnvaktstjänster: Du väljer själv vilken familj du vill jobba för utifrån var de bor, arbetstider och åldrar på barnen. Vi hjälper dig att hitta den perfekta familjen utifrån dina önskemål."
      },
      "headline" : "Höstens roligaste extrajobb!",
      "driving_license" : null,
      "employer" : {
        "email" : null,
        "phone_number" : null,
        "organization_number" : "5591911747",
        "name" : "Meet a Group international AB",
        "url" : "https://meetastudent.com/sv/",
        "workplace" : "Meet a Group international AB"
      },
      "removed_date" : null,
      "logo_url" : "https://www.arbetsformedlingen.se/rest/arbetsgivare/rest/af/v3/arbetsplatser/87837001/logotyper/logo.png",
      "last_publication_date" : "2022-08-14T23:59:59",
      "number_of_vacancies" : 1,
      "occupation" : {
        "concept_id" : "zVkQ_wLL_78i",
        "label" : "Barnflicka/Barnvakt",
        "legacy_ams_taxonomy_id" : "438"
      },
      "occupation_group" : {
        "concept_id" : "o1gn_FoS_fB7",
        "label" : "Övrig hemservicepersonal m.fl.",
        "legacy_ams_taxonomy_id" : "9119"
      },
      "employment_type" : {
        "concept_id" : "1paU_aCR_nGn",
        "label" : "Behovsanställning",
        "legacy_ams_taxonomy_id" : "4"
      },
      "webpage_url" : "https://arbetsformedlingen.se/platsbanken/annonser/26350927",
      "driving_license_required" : false,
      "application_contacts" : [ ],
      "duration" : {
        "concept_id" : null,
        "label" : null,
        "legacy_ams_taxonomy_id" : null
      },
      "nice_to_have" : {
        "education_level" : [ ],
        "work_experiences" : [ ],
        "skills" : [ ],
        "education" : [ ],
        "languages" : [ ]
      },
      "application_details" : {
        "via_af" : false,
        "email" : null,
        "other" : null,
        "reference" : null,
        "url" : "https://meetastudent.com/sv/ledigajobb/12741-hostens-roligaste-extrajobb-jobba-som-barnvakt-via-nanny-by-tellus-2/",
        "information" : null
      },
      "source_type" : "VIA_ANNONSERA",
      "application_deadline" : "2022-08-14T23:59:59",
      "external_id" : null,
      "workplace_address" : {
        "coordinates" : [ null, null ],
        "city" : null,
        "postcode" : null,
        "municipality" : "Stockholm",
        "region_concept_id" : "CifL_Rzy_Mku",
        "region" : "Stockholms län",
        "country_code" : "199",
        "region_code" : "01",
        "municipality_concept_id" : "AvNB_uwa_6n6",
        "country_concept_id" : "i46j_HmG_v64",
        "municipality_code" : "0180",
        "street_address" : null,
        "country" : "Sverige"
      },
      "id" : "26350927",
      "experience_required" : false,
      "working_hours_type" : {
        "concept_id" : null,
        "label" : null,
        "legacy_ams_taxonomy_id" : null
      },
      "access" : null,
      "timestamp" : 1658742070349,
      "must_have" : {
        "education_level" : [ ],
        "work_experiences" : [ ],
        "skills" : [ ],
        "education" : [ ],
        "languages" : [ ]
      },
      "occupation_field" : {
        "concept_id" : "whao_Q6A_ScE",
        "label" : "Sanering och renhållning",
        "legacy_ams_taxonomy_id" : "12"
      },
      "scope_of_work" : {
        "min" : 0,
        "max" : null
      },
      "salary_type" : {
        "concept_id" : "oG8G_9cW_nRf",
        "label" : "Fast månads- vecko- eller timlön",
        "legacy_ams_taxonomy_id" : "1"
      },
      "removed" : false,
      "salary_description" : null,
      "access_to_own_car" : false,
      "publication_date" : "2022-07-25T11:41:10"
    },
    "name" : "Höstens roligaste extrajobb!",
    "user" : "kristof.fischer"
  },
  "sha1" : "83b04a2f6d77e294976f0684e60a2a2dfc721c7d",
  "annotations" : [ {
    "preferred-label" : "Barnvakt",
    "sentiment" : "MUST_HAVE",
    "type" : "occupation-name",
    "start-position" : 242,
    "end-position" : 250,
    "concept-id" : "zVkQ_wLL_78i",
    "matched-string" : "barnvakt",
    "annotation-id" : 0
  }, {
    "preferred-label" : "Certifikat/licenser",
    "sentiment" : "OFFERED",
    "type" : "skill-headline",
    "start-position" : 687,
    "end-position" : 708,
    "concept-id" : "s48H_Sft_DTn",
    "matched-string" : "Barnvaktscertifiering",
    "annotation-id" : 5
  }, {
    "preferred-label" : "socialpedagog",
    "type" : "esco-occupation",
    "start-position" : 721,
    "end-position" : 737,
    "concept-id" : "NUhh_NSS_itU",
    "matched-string" : "specialpedagoger",
    "annotation-id" : 6
  }, {
    "preferred-label" : "Barnvakt",
    "sentiment" : "MUST_HAVE",
    "type" : "occupation-name",
    "start-position" : 1018,
    "end-position" : 1026,
    "concept-id" : "zVkQ_wLL_78i",
    "matched-string" : "barnvakt",
    "annotation-id" : 2
  }, {
    "preferred-label" : "Barnvakt",
    "sentiment" : "MUST_HAVE",
    "type" : "occupation-name",
    "start-position" : 1033,
    "end-position" : 1038,
    "concept-id" : "zVkQ_wLL_78i",
    "matched-string" : "nanny",
    "annotation-id" : 3
  }, {
    "preferred-label" : "visa ansvarstagande",
    "sentiment" : "MUST_HAVE",
    "type" : "esco-skill",
    "start-position" : 1118,
    "end-position" : 1129,
    "concept-id" : "bcRp_hxV_f5G",
    "matched-string" : "ansvarsfull",
    "annotation-id" : 7
  }, {
    "preferred-label" : "Barnvakt",
    "sentiment" : "MUST_HAVE",
    "type" : "occupation-name",
    "start-position" : 1225,
    "end-position" : 1233,
    "concept-id" : "zVkQ_wLL_78i",
    "matched-string" : "barnvakt",
    "annotation-id" : 4
  }, {
    "preferred-label" : "visa ansvarstagande",
    "sentiment" : "MUST_HAVE",
    "type" : "esco-skill",
    "start-position" : 1242,
    "end-position" : 1257,
    "concept-id" : "bcRp_hxV_f5G",
    "matched-string" : "ta stort ansvar",
    "annotation-id" : 8
  } ],
  "text" : "Höstens roligaste extrajobb!\nMeet a Student är en jobbplattform för studenter och juniora talanger. \nFör kunds räkning söker vi nu:\nVi söker dig som har ett genuint intresse för barn och gillar ett flexibelt och socialt extrajobb!\nJobbet som barnvakt passar dig som vill jobba som på ett flexibelt schema med där man känner att man har tid för minst 15 timmar per vecka. Stort plus om du är tillgänglig på förmiddagar och eftermiddagar. Vi ser att man helst har en parallell sysselsättning som studier eller annat deltidsjobb. Vill du även jobba som timvikarie på förskola finns den möjligheten.\nVi som arbetsgivare erbjuder dig: \nKonkurrenskraftig lön, mellan 110-150 kronor per timme,\nBarnvaktscertifiering utformad av specialpedagoger med tillhörande hjärt och lungräddningsutbildning.\nToppservice från kontoret som hjälper dig vid frågor eller funderingar\nOch såklart ett väldigt roligt extrajobb med stora möjligheter till personlig och yrkesmässig utveckling.\n\nDet är viktigt att du har erfarenhet av arbete som barnvakt eller Nanny och alltid tycker det är roligt att vara med barn. Som person ser vi att du är ansvarsfull, social och kreativ för att komma på nya lekar med barnen. Viktigt att du känner dig trygg som barnvakt och kan ta stort ansvar. Då barnen vanligtvis är i åldrarna 0-5 år är det viktigt att du har erfarenhet av dessa åldrar sen tidigare.\nOm våra barnvaktstjänster: Du väljer själv vilken familj du vill jobba för utifrån var de bor, arbetstider och åldrar på barnen. Vi hjälper dig att hitta den perfekta familjen utifrån dina önskemål."
}