{
  "meta" : {
    "jobad" : {
      "description" : {
        "requirements" : null,
        "needs" : null,
        "company_information" : null,
        "text_formatted" : "ARBETSUPPGIFTER\nVill du ha ett omväxlande arbete med stora utmaningar och utvecklingsmöjligheter? Brinner du för goda affärer och kundrelationer? Kumla växer och behoven av kommunens tjänster både ökar och förändras, därför behöver vi din kompetens. Vill du vara med på vår resa? \nUpphandlarfunktionen är en del av Ekonomiavdelningen och består idag av två upphandlare. Då en av upphandlarna snart går vidare mot nya utmaningar söker vi nu efter en ersättare. Funktionens huvudsakliga uppgifter är att svara för såväl kommunövergripande som specifika upphandlingar samt tillhandahålla rådgivning, information och utbildningsinsatser. Vi hjälper även till med bland annat avtalstolkningar, förnyade konkurrensutsättningar och utvecklar våra leverantörskontakter. I Kumla har vi upphandlingssystemet Mercell Tendsign och vi befinner oss i en process att ansluta leverantörer till vårt E-handelssystem Unit4 Business World.\r\n\r\nKVALIFIKATIONER\nDu som har arbetat med upphandling/inköp och som fortfarande är nyfiken, social och prestigelös kommer att trivas bra hos oss. Du är trygg i din profession och arbetar effektivt, ofta självständigt, och har förmågan att prioritera utan att ge avkall på noggrannheten. Vidare har du förmågan att kunna kommunicera och samarbeta med många olika typer av människor och kan flexibelt anpassa dig efter situationen. \n\nArbetet som upphandlare är omväxlande och vi möter dagligen nya utmaningar. Vi söker därför en person som har en positiv och lösningsfokuserad inställning och som lägger stort engagemang i de olika uppdragen. Att leverera god service och ge ett bra bemötande, både externt och internt, ser du som en självklarhet. Vi kommer att lägga stor vikt vid personlig lämplighet. \n\nDu får gärna vara högskoleutbildad i botten men det är inget krav då vi anser att likvärdig kunskap kan förvärvas genom erfarenhet. Erfarenhet från kommun och/eller kommunala bolag är meriterande, likaså erfarenhet av upphandling enligt LOU. Förmågan att kunna leda upphandlingsprojekt samt att kunna hantera flera parallella projekt är en förutsättning för denna tjänst. Du behöver även god kunskap i Microsoft Office programmen. \n\nVälkommen att söka ett av de roligaste jobben inom offentlig sektor. Vi ser fram emot din ansökan!\n\nHar du frågor om tjänsten kan du vända dig till upphandlare Ulric Öhman ulric.ohman@kumla.se 0722252183 eller teamledare Ewa Rodenfelt ewa.rodenfelt@kumla.se 0705583855 \n\r\n\nÖVRIGT\nDu söker tjänsten via Offentliga jobbs elektroniska ansökningsblankett. Tillsättningen av tjänsten kommer grunda sig på de uppgifter du lämnar och därför är det av största vikt att du är noggrann när du fyller i din ansökan.  \n\nVi undanber oss kontakt med annonsörer och bemannings- och rekryteringsföretag. \n\nKumla kommun är en tillväxtkommun som ligger centralt i Örebro län och har drygt 22 000 invånare. I kommunen finns framgångsrika företag, ett rikt kultur- och fritidsutbud, god kommunal service samt utmärkta kommunikationer. Kumlas Vision 2025 innebär att vi alltid strävar efter att vara lite bättre. Genom att växa smart, satsa på barn och unga, ta hand om våra invånare och att ta tillvara på den närhet som finns blir vi lite bättre. \n\nVi känner oss stolta över vårt Kumla! För att se lite av det som hände under 2021 klicka här:\nhttps://youtu.be/pJ5INELoEXU",
        "conditions" : "Heltid. \r\nTillsvidareanställning, tillträde: Tillträde enligt överenskommelse. .",
        "text" : "ARBETSUPPGIFTER\nVill du ha ett omväxlande arbete med stora utmaningar och utvecklingsmöjligheter? Brinner du för goda affärer och kundrelationer? Kumla växer och behoven av kommunens tjänster både ökar och förändras, därför behöver vi din kompetens. Vill du vara med på vår resa? \nUpphandlarfunktionen är en del av Ekonomiavdelningen och består idag av två upphandlare. Då en av upphandlarna snart går vidare mot nya utmaningar söker vi nu efter en ersättare. Funktionens huvudsakliga uppgifter är att svara för såväl kommunövergripande som specifika upphandlingar samt tillhandahålla rådgivning, information och utbildningsinsatser. Vi hjälper även till med bland annat avtalstolkningar, förnyade konkurrensutsättningar och utvecklar våra leverantörskontakter. I Kumla har vi upphandlingssystemet Mercell Tendsign och vi befinner oss i en process att ansluta leverantörer till vårt E-handelssystem Unit4 Business World.\r\n\r\nKVALIFIKATIONER\nDu som har arbetat med upphandling/inköp och som fortfarande är nyfiken, social och prestigelös kommer att trivas bra hos oss. Du är trygg i din profession och arbetar effektivt, ofta självständigt, och har förmågan att prioritera utan att ge avkall på noggrannheten. Vidare har du förmågan att kunna kommunicera och samarbeta med många olika typer av människor och kan flexibelt anpassa dig efter situationen. \n\nArbetet som upphandlare är omväxlande och vi möter dagligen nya utmaningar. Vi söker därför en person som har en positiv och lösningsfokuserad inställning och som lägger stort engagemang i de olika uppdragen. Att leverera god service och ge ett bra bemötande, både externt och internt, ser du som en självklarhet. Vi kommer att lägga stor vikt vid personlig lämplighet. \n\nDu får gärna vara högskoleutbildad i botten men det är inget krav då vi anser att likvärdig kunskap kan förvärvas genom erfarenhet. Erfarenhet från kommun och/eller kommunala bolag är meriterande, likaså erfarenhet av upphandling enligt LOU. Förmågan att kunna leda upphandlingsprojekt samt att kunna hantera flera parallella projekt är en förutsättning för denna tjänst. Du behöver även god kunskap i Microsoft Office programmen. \n\nVälkommen att söka ett av de roligaste jobben inom offentlig sektor. Vi ser fram emot din ansökan!\n\nHar du frågor om tjänsten kan du vända dig till upphandlare Ulric Öhman ulric.ohman@kumla.se 0722252183 eller teamledare Ewa Rodenfelt ewa.rodenfelt@kumla.se 0705583855 \n\r\n\nÖVRIGT\nDu söker tjänsten via Offentliga jobbs elektroniska ansökningsblankett. Tillsättningen av tjänsten kommer grunda sig på de uppgifter du lämnar och därför är det av största vikt att du är noggrann när du fyller i din ansökan.  \n\nVi undanber oss kontakt med annonsörer och bemannings- och rekryteringsföretag. \n\nKumla kommun är en tillväxtkommun som ligger centralt i Örebro län och har drygt 22 000 invånare. I kommunen finns framgångsrika företag, ett rikt kultur- och fritidsutbud, god kommunal service samt utmärkta kommunikationer. Kumlas Vision 2025 innebär att vi alltid strävar efter att vara lite bättre. Genom att växa smart, satsa på barn och unga, ta hand om våra invånare och att ta tillvara på den närhet som finns blir vi lite bättre. \n\nVi känner oss stolta över vårt Kumla! För att se lite av det som hände under 2021 klicka här:\nhttps://youtu.be/pJ5INELoEXU"
      },
      "headline" : "Upphandlare ",
      "driving_license" : null,
      "employer" : {
        "email" : null,
        "phone_number" : null,
        "organization_number" : "2120001975",
        "name" : "Kumla kommun",
        "url" : null,
        "workplace" : "Kommunledningsförvaltningen, Kumla kommun"
      },
      "removed_date" : null,
      "logo_url" : "https://www.arbetsformedlingen.se/rest/arbetsgivare/rest/af/v3/organisation/2120001975/logotyper/logo.png",
      "last_publication_date" : "2022-08-31T23:59:59",
      "number_of_vacancies" : 1,
      "occupation" : {
        "concept_id" : "ryH6_MAv_QWb",
        "label" : "Upphandlare",
        "legacy_ams_taxonomy_id" : "7503"
      },
      "occupation_group" : {
        "concept_id" : "85cq_6uK_4cK",
        "label" : "Inköpare och upphandlare",
        "legacy_ams_taxonomy_id" : "3323"
      },
      "employment_type" : {
        "concept_id" : "PFZr_Syz_cUq",
        "label" : "Vanlig anställning",
        "legacy_ams_taxonomy_id" : "1"
      },
      "webpage_url" : "https://arbetsformedlingen.se/platsbanken/annonser/26260324",
      "driving_license_required" : false,
      "application_contacts" : [ {
        "description" : "Johan Hultgren",
        "email" : "johan.hultgren@kumla.se",
        "telephone" : "0705589984",
        "name" : null,
        "contact_type" : "Ekonomichef"
      }, {
        "description" : "Ewa Rodenfeldt",
        "email" : "ewa.rodenfelt@kumla.se",
        "telephone" : "0705583855",
        "name" : null,
        "contact_type" : "Teamledare"
      }, {
        "description" : "Ulric Öhman",
        "email" : "ulric.ohman@kumla.se",
        "telephone" : null,
        "name" : null,
        "contact_type" : "Upphandlare"
      } ],
      "duration" : {
        "concept_id" : "a7uU_j21_mkL",
        "label" : "Tills vidare",
        "legacy_ams_taxonomy_id" : "1"
      },
      "nice_to_have" : {
        "education_level" : [ ],
        "work_experiences" : [ ],
        "skills" : [ ],
        "education" : [ ],
        "languages" : [ ]
      },
      "application_details" : {
        "via_af" : false,
        "email" : null,
        "other" : null,
        "reference" : "KLF 10/2022",
        "url" : "https://recruit.visma.com/Public/Apply.aspx?guidAssignment=45302e0d-cfef-4d14-b377-5961d01ba703&publishCode=AMS&TK=ccc334d0-2a5e-4484-8f5d-8ad06120c1f9",
        "information" : null
      },
      "source_type" : "VIA_PLATSBANKEN_DXA",
      "application_deadline" : "2022-08-31T23:59:59",
      "external_id" : "46-212000-1975-45302E0DCFEF4D14B3775961D01BA703",
      "workplace_address" : {
        "coordinates" : [ 15.140105, 59.126537 ],
        "city" : null,
        "postcode" : null,
        "municipality" : "Kumla",
        "region_concept_id" : "xTCk_nT5_Zjm",
        "region" : "Örebro län",
        "country_code" : "199",
        "region_code" : "18",
        "municipality_concept_id" : "viCA_36P_pQp",
        "country_concept_id" : "i46j_HmG_v64",
        "municipality_code" : "1881",
        "street_address" : null,
        "country" : "Sverige"
      },
      "id" : "26260324",
      "experience_required" : true,
      "working_hours_type" : {
        "concept_id" : "6YE1_gAC_R2G",
        "label" : "Heltid",
        "legacy_ams_taxonomy_id" : "1"
      },
      "access" : null,
      "timestamp" : 1656320118533,
      "must_have" : {
        "education_level" : [ ],
        "work_experiences" : [ {
          "concept_id" : "ryH6_MAv_QWb",
          "weight" : 10,
          "label" : "Upphandlare",
          "legacy_ams_taxonomy_id" : "7503"
        } ],
        "skills" : [ ],
        "education" : [ ],
        "languages" : [ ]
      },
      "occupation_field" : {
        "concept_id" : "RPTn_bxG_ExZ",
        "label" : "Försäljning, inköp, marknadsföring",
        "legacy_ams_taxonomy_id" : "5"
      },
      "scope_of_work" : {
        "min" : 100,
        "max" : 100
      },
      "salary_type" : {
        "concept_id" : "oG8G_9cW_nRf",
        "label" : "Fast månads- vecko- eller timlön",
        "legacy_ams_taxonomy_id" : "1"
      },
      "removed" : false,
      "salary_description" : "Enligt avtal.",
      "access_to_own_car" : false,
      "publication_date" : "2022-08-01T00:00:00"
    },
    "name" : "Upphandlare ",
    "user" : "kristof.fischer"
  },
  "sha1" : "01355b096db90313f0b04c9d06820af437b9f791",
  "annotations" : [ {
    "preferred-label" : "Upphandlare",
    "sentiment" : "OFFERED",
    "type" : "occupation-name",
    "start-position" : 0,
    "end-position" : 11,
    "concept-id" : "ryH6_MAv_QWb",
    "matched-string" : "upphandlare",
    "annotation-id" : 0
  }, {
    "preferred-label" : "Kumla",
    "type" : "municipality",
    "start-position" : 159,
    "end-position" : 164,
    "concept-id" : "viCA_36P_pQp",
    "matched-string" : "Kumla",
    "annotation-id" : 11
  }, {
    "preferred-label" : "Upphandlare",
    "sentiment" : "MUST_HAVE",
    "type" : "occupation-name",
    "start-position" : 370,
    "end-position" : 381,
    "concept-id" : "ryH6_MAv_QWb",
    "matched-string" : "upphandlare",
    "annotation-id" : 2
  }, {
    "preferred-label" : "Upphandlare",
    "type" : "occupation-name",
    "start-position" : 392,
    "end-position" : 404,
    "concept-id" : "ryH6_MAv_QWb",
    "matched-string" : "upphandlarna",
    "annotation-id" : 12
  }, {
    "preferred-label" : "Kumla",
    "type" : "municipality",
    "start-position" : 777,
    "end-position" : 782,
    "concept-id" : "viCA_36P_pQp",
    "matched-string" : "Kumla",
    "annotation-id" : 13
  }, {
    "preferred-label" : "Upphandlingsbestämmelser",
    "sentiment" : "MUST_HAVE",
    "type" : "skill",
    "start-position" : 976,
    "end-position" : 987,
    "concept-id" : "SmZd_Jaa_BeY",
    "matched-string" : "upphandling",
    "annotation-id" : 26
  }, {
    "preferred-label" : "Inköpsvana",
    "sentiment" : "MUST_HAVE",
    "type" : "skill",
    "start-position" : 988,
    "end-position" : 993,
    "concept-id" : "eKuz_edm_kmi",
    "matched-string" : "inköp",
    "annotation-id" : 27
  }, {
    "preferred-label" : "arbeta effektivt",
    "sentiment" : "MUST_HAVE",
    "type" : "esco-skill",
    "start-position" : 1113,
    "end-position" : 1130,
    "concept-id" : "6VAn_tFw_oKo",
    "matched-string" : "arbetar effektivt",
    "annotation-id" : 15
  }, {
    "preferred-label" : "arbeta självständigt",
    "sentiment" : "MUST_HAVE",
    "type" : "esco-skill",
    "start-position" : 1137,
    "end-position" : 1150,
    "concept-id" : "NyFu_HHd_zhz",
    "matched-string" : "självständigt",
    "annotation-id" : 16
  }, {
    "preferred-label" : "prioritera uppgifter",
    "sentiment" : "MUST_HAVE",
    "type" : "esco-skill",
    "start-position" : 1173,
    "end-position" : 1183,
    "concept-id" : "j5rg_b5X_nBS",
    "matched-string" : "prioritera",
    "annotation-id" : 17
  }, {
    "preferred-label" : "kommunikation",
    "sentiment" : "MUST_HAVE",
    "type" : "esco-skill",
    "start-position" : 1254,
    "end-position" : 1265,
    "concept-id" : "ahPU_HgE_Jeb",
    "matched-string" : "kommunicera",
    "annotation-id" : 18
  }, {
    "preferred-label" : "samarbeta med kolleger",
    "sentiment" : "MUST_HAVE",
    "type" : "esco-skill",
    "start-position" : 1270,
    "end-position" : 1279,
    "concept-id" : "X15R_797_q62",
    "matched-string" : "samarbeta",
    "annotation-id" : 19
  }, {
    "preferred-label" : "Upphandlare",
    "sentiment" : "OFFERED",
    "type" : "occupation-name",
    "start-position" : 1378,
    "end-position" : 1389,
    "concept-id" : "ryH6_MAv_QWb",
    "matched-string" : "upphandlare",
    "annotation-id" : 5
  }, {
    "preferred-label" : "Lösningsfokuserat arbetssätt",
    "sentiment" : "MUST_HAVE",
    "type" : "skill",
    "start-position" : 1491,
    "end-position" : 1520,
    "concept-id" : "94uF_bkH_QF5",
    "matched-string" : "lösningsfokuserad inställning",
    "annotation-id" : 20
  }, {
    "preferred-label" : "Eftergymnasial utbildning, minst 2 år",
    "sentiment" : "NICE_TO_HAVE",
    "type" : "sun-education-level-1",
    "start-position" : 1756,
    "end-position" : 1772,
    "concept-id" : "KBjB_gpS_ZJL",
    "matched-string" : "högskoleutbildad",
    "annotation-id" : 21
  }, {
    "preferred-label" : null,
    "sentiment" : "NICE_TO_HAVE",
    "type" : "skill",
    "start-position" : 1870,
    "end-position" : 1918,
    "concept-id" : null,
    "matched-string" : "Erfarenhet från kommun och/eller kommunala bolag",
    "annotation-id" : 22
  }, {
    "preferred-label" : "Upphandlingsbestämmelser",
    "sentiment" : "NICE_TO_HAVE",
    "type" : "skill",
    "start-position" : 1956,
    "comment" : "LOU = lagen om offentlig upphandling",
    "end-position" : 1978,
    "concept-id" : "SmZd_Jaa_BeY",
    "matched-string" : "upphandling enligt LOU",
    "annotation-id" : 23
  }, {
    "preferred-label" : "utföra upphandlingsprocesser",
    "sentiment" : "MUST_HAVE",
    "type" : "esco-skill",
    "start-position" : 1999,
    "end-position" : 2023,
    "concept-id" : "DFY6_CRj_i2N",
    "matched-string" : "leda upphandlingsprojekt",
    "annotation-id" : 24
  }, {
    "preferred-label" : null,
    "sentiment" : "MUST_HAVE",
    "type" : "skill",
    "start-position" : 2039,
    "end-position" : 2071,
    "concept-id" : null,
    "matched-string" : "hantera flera parallella projekt",
    "annotation-id" : 25
  }, {
    "preferred-label" : "MS Office",
    "sentiment" : "MUST_HAVE",
    "type" : "skill",
    "start-position" : 2140,
    "end-position" : 2156,
    "concept-id" : "w8bU_wHe_omF",
    "matched-string" : "microsoft office",
    "annotation-id" : 7
  } ],
  "text" : "Upphandlare \nARBETSUPPGIFTER\nVill du ha ett omväxlande arbete med stora utmaningar och utvecklingsmöjligheter? Brinner du för goda affärer och kundrelationer? Kumla växer och behoven av kommunens tjänster både ökar och förändras, därför behöver vi din kompetens. Vill du vara med på vår resa? \nUpphandlarfunktionen är en del av Ekonomiavdelningen och består idag av två upphandlare. Då en av upphandlarna snart går vidare mot nya utmaningar söker vi nu efter en ersättare. Funktionens huvudsakliga uppgifter är att svara för såväl kommunövergripande som specifika upphandlingar samt tillhandahålla rådgivning, information och utbildningsinsatser. Vi hjälper även till med bland annat avtalstolkningar, förnyade konkurrensutsättningar och utvecklar våra leverantörskontakter. I Kumla har vi upphandlingssystemet Mercell Tendsign och vi befinner oss i en process att ansluta leverantörer till vårt E-handelssystem Unit4 Business World.\r\n\r\nKVALIFIKATIONER\nDu som har arbetat med upphandling/inköp och som fortfarande är nyfiken, social och prestigelös kommer att trivas bra hos oss. Du är trygg i din profession och arbetar effektivt, ofta självständigt, och har förmågan att prioritera utan att ge avkall på noggrannheten. Vidare har du förmågan att kunna kommunicera och samarbeta med många olika typer av människor och kan flexibelt anpassa dig efter situationen. \n\nArbetet som upphandlare är omväxlande och vi möter dagligen nya utmaningar. Vi söker därför en person som har en positiv och lösningsfokuserad inställning och som lägger stort engagemang i de olika uppdragen. Att leverera god service och ge ett bra bemötande, både externt och internt, ser du som en självklarhet. Vi kommer att lägga stor vikt vid personlig lämplighet. \n\nDu får gärna vara högskoleutbildad i botten men det är inget krav då vi anser att likvärdig kunskap kan förvärvas genom erfarenhet. Erfarenhet från kommun och/eller kommunala bolag är meriterande, likaså erfarenhet av upphandling enligt LOU. Förmågan att kunna leda upphandlingsprojekt samt att kunna hantera flera parallella projekt är en förutsättning för denna tjänst. Du behöver även god kunskap i Microsoft Office programmen. \n\nVälkommen att söka ett av de roligaste jobben inom offentlig sektor. Vi ser fram emot din ansökan!\n\nHar du frågor om tjänsten kan du vända dig till upphandlare Ulric Öhman ulric.ohman@kumla.se 0722252183 eller teamledare Ewa Rodenfelt ewa.rodenfelt@kumla.se 0705583855 \n\r\n\nÖVRIGT\nDu söker tjänsten via Offentliga jobbs elektroniska ansökningsblankett. Tillsättningen av tjänsten kommer grunda sig på de uppgifter du lämnar och därför är det av största vikt att du är noggrann när du fyller i din ansökan.  \n\nVi undanber oss kontakt med annonsörer och bemannings- och rekryteringsföretag. \n\nKumla kommun är en tillväxtkommun som ligger centralt i Örebro län och har drygt 22 000 invånare. I kommunen finns framgångsrika företag, ett rikt kultur- och fritidsutbud, god kommunal service samt utmärkta kommunikationer. Kumlas Vision 2025 innebär att vi alltid strävar efter att vara lite bättre. Genom att växa smart, satsa på barn och unga, ta hand om våra invånare och att ta tillvara på den närhet som finns blir vi lite bättre. \n\nVi känner oss stolta över vårt Kumla! För att se lite av det som hände under 2021 klicka här:\nhttps://youtu.be/pJ5INELoEXU"
}