{
  "meta" : {
    "jobad" : {
      "description" : {
        "requirements" : null,
        "needs" : null,
        "company_information" : null,
        "text_formatted" : "<p>Vi expanderar och söker fler installatörer. Heltidsjobb vardagar 08-17. Sörmlands Tv och Teletjänst AB säljer, installerar och utför servicejobb åt Allente (Viasat &amp; Canal digital) och antal uppdrag ökar. </p><p>I tjänsten som installatör kommer du åka hem till ett antal kunder om dagen där du antingen installerar ny parabolanläggning eller utför service på befintlig. </p><p>Du behöver vara bekväm med att klättra på tak och stege då parabolerna ofta sitter på lite höjd. Sökande med erfarenhet av liknande tjänst kommer prioriteras då vi behöver få igång ny personal så snart som möjligt. Liknande tjänster kan vara till exempel elektriker, larmtekniker, installatörer av övrig hemelektronik.</p><p id=\"oppenforalla\">Öppen för alla\nVi fokuserar på din kompetens, inte dina övriga förutsättningar. Vi är öppna för att anpassa rollen eller arbetsplatsen efter dina behov.</p>",
        "conditions" : null,
        "text" : "Vi expanderar och söker fler installatörer. Heltidsjobb vardagar 08-17. Sörmlands Tv och Teletjänst AB säljer, installerar och utför servicejobb åt Allente (Viasat & Canal digital) och antal uppdrag ökar. \nI tjänsten som installatör kommer du åka hem till ett antal kunder om dagen där du antingen installerar ny parabolanläggning eller utför service på befintlig. \nDu behöver vara bekväm med att klättra på tak och stege då parabolerna ofta sitter på lite höjd. Sökande med erfarenhet av liknande tjänst kommer prioriteras då vi behöver få igång ny personal så snart som möjligt. Liknande tjänster kan vara till exempel elektriker, larmtekniker, installatörer av övrig hemelektronik.\nÖppen för alla\nVi fokuserar på din kompetens, inte dina övriga förutsättningar. Vi är öppna för att anpassa rollen eller arbetsplatsen efter dina behov."
      },
      "headline" : "Installatör Hemelektronik inriktning parabol-tv",
      "driving_license" : [ {
        "concept_id" : "VTK8_WRx_GcM",
        "label" : "B",
        "legacy_ams_taxonomy_id" : "3"
      } ],
      "employer" : {
        "email" : null,
        "phone_number" : null,
        "organization_number" : "5591041974",
        "name" : "Sörmlands tv och teletjänst AB",
        "url" : null,
        "workplace" : "Sörmlands tv & teletjänst AB"
      },
      "removed_date" : null,
      "logo_url" : "https://www.arbetsformedlingen.se/rest/arbetsgivare/rest/af/v3/arbetsplatser/87956840/logotyper/logo.png",
      "last_publication_date" : "2022-08-25T23:59:59",
      "number_of_vacancies" : 2,
      "occupation" : {
        "concept_id" : "TjbV_fUb_Ltx",
        "label" : "TV-tekniker/Hemelektroniktekniker",
        "legacy_ams_taxonomy_id" : "847"
      },
      "occupation_group" : {
        "concept_id" : "fWrt_sLg_koW",
        "label" : "Elektronikreparatörer och kommunikationselektriker m.fl.",
        "legacy_ams_taxonomy_id" : "7420"
      },
      "employment_type" : {
        "concept_id" : "PFZr_Syz_cUq",
        "label" : "Vanlig anställning",
        "legacy_ams_taxonomy_id" : "1"
      },
      "webpage_url" : "https://arbetsformedlingen.se/platsbanken/annonser/26356038",
      "driving_license_required" : true,
      "application_contacts" : [ {
        "description" : null,
        "email" : "tvochteletjanst@gmail.com",
        "telephone" : "0735554473",
        "name" : "Fredrik Hultberg",
        "contact_type" : null
      } ],
      "duration" : {
        "concept_id" : "a7uU_j21_mkL",
        "label" : "Tills vidare",
        "legacy_ams_taxonomy_id" : "1"
      },
      "nice_to_have" : {
        "education_level" : [ {
          "concept_id" : "DeBt_ahh_bkx",
          "weight" : 5,
          "label" : "Gymnasial utbildning",
          "legacy_ams_taxonomy_id" : "4"
        } ],
        "work_experiences" : [ ],
        "skills" : [ ],
        "education" : [ {
          "concept_id" : "atFb_xjp_QfB",
          "weight" : 5,
          "label" : "Bred, generell utbildning",
          "legacy_ams_taxonomy_id" : "1"
        } ],
        "languages" : [ ]
      },
      "application_details" : {
        "via_af" : false,
        "email" : "tvochteletjanst@gmail.com",
        "other" : null,
        "reference" : null,
        "url" : null,
        "information" : null
      },
      "source_type" : "VIA_ANNONSERA",
      "application_deadline" : "2022-08-25T23:59:59",
      "external_id" : null,
      "workplace_address" : {
        "coordinates" : [ 16.66521751035563, 59.40560883460671 ],
        "city" : "Eskilstuna",
        "postcode" : "63506",
        "municipality" : "Eskilstuna",
        "region_concept_id" : "s93u_BEb_sx2",
        "region" : "Södermanlands län",
        "country_code" : "199",
        "region_code" : "04",
        "municipality_concept_id" : "kMxr_NiX_YrU",
        "country_concept_id" : "i46j_HmG_v64",
        "municipality_code" : "0484",
        "street_address" : "Kjulaby Backsippan 1",
        "country" : "Sverige"
      },
      "id" : "26356038",
      "experience_required" : false,
      "working_hours_type" : {
        "concept_id" : "6YE1_gAC_R2G",
        "label" : "Heltid",
        "legacy_ams_taxonomy_id" : "1"
      },
      "access" : null,
      "timestamp" : 1658870240270,
      "must_have" : {
        "education_level" : [ ],
        "work_experiences" : [ ],
        "skills" : [ ],
        "education" : [ ],
        "languages" : [ {
          "concept_id" : "zSLA_vw2_FXN",
          "weight" : 10,
          "label" : "Svenska",
          "legacy_ams_taxonomy_id" : "502"
        } ]
      },
      "occupation_field" : {
        "concept_id" : "yhCP_AqT_tns",
        "label" : "Installation, drift, underhåll",
        "legacy_ams_taxonomy_id" : "10"
      },
      "scope_of_work" : {
        "min" : 0,
        "max" : 100
      },
      "salary_type" : {
        "concept_id" : "oG8G_9cW_nRf",
        "label" : "Fast månads- vecko- eller timlön",
        "legacy_ams_taxonomy_id" : "1"
      },
      "removed" : false,
      "salary_description" : null,
      "access_to_own_car" : false,
      "publication_date" : "2022-07-26T23:17:20"
    },
    "name" : "Installatör Hemelektronik inriktning parabol-tv",
    "user" : "kristof.fischer"
  },
  "sha1" : "47e1b707d9435392a39c699d83d4bcf3ed9de70f",
  "annotations" : [ {
    "preferred-label" : null,
    "type" : "occupation-name",
    "start-position" : 0,
    "end-position" : 11,
    "concept-id" : null,
    "matched-string" : "Installatör",
    "annotation-id" : 2
  }, {
    "preferred-label" : null,
    "type" : "occupation-name",
    "start-position" : 77,
    "end-position" : 90,
    "concept-id" : null,
    "matched-string" : "installatörer",
    "annotation-id" : 3
  }, {
    "preferred-label" : "Heltid",
    "type" : "worktime-extent",
    "start-position" : 92,
    "end-position" : 103,
    "concept-id" : "6YE1_gAC_R2G",
    "matched-string" : "Heltidsjobb",
    "annotation-id" : 4
  }, {
    "preferred-label" : null,
    "type" : "occupation-name",
    "start-position" : 269,
    "end-position" : 280,
    "concept-id" : null,
    "matched-string" : "installatör",
    "annotation-id" : 5
  }, {
    "preferred-label" : "Serviceelektriker, installation",
    "type" : "occupation-name",
    "start-position" : 669,
    "end-position" : 679,
    "concept-id" : "K3iK_iEb_41Y",
    "matched-string" : "elektriker",
    "annotation-id" : 6
  }, {
    "preferred-label" : "Larminstallatör/Larmtekniker",
    "sentiment" : "MUST_HAVE",
    "type" : "occupation-name",
    "start-position" : 681,
    "end-position" : 693,
    "concept-id" : "yUZ5_WDk_24i",
    "matched-string" : "larmtekniker",
    "annotation-id" : 1
  }, {
    "preferred-label" : null,
    "type" : "occupation-name",
    "start-position" : 695,
    "end-position" : 708,
    "concept-id" : null,
    "matched-string" : "installatörer",
    "annotation-id" : 7
  } ],
  "text" : "Installatör Hemelektronik inriktning parabol-tv\nVi expanderar och söker fler installatörer. Heltidsjobb vardagar 08-17. Sörmlands Tv och Teletjänst AB säljer, installerar och utför servicejobb åt Allente (Viasat & Canal digital) och antal uppdrag ökar. \nI tjänsten som installatör kommer du åka hem till ett antal kunder om dagen där du antingen installerar ny parabolanläggning eller utför service på befintlig. \nDu behöver vara bekväm med att klättra på tak och stege då parabolerna ofta sitter på lite höjd. Sökande med erfarenhet av liknande tjänst kommer prioriteras då vi behöver få igång ny personal så snart som möjligt. Liknande tjänster kan vara till exempel elektriker, larmtekniker, installatörer av övrig hemelektronik.\nÖppen för alla\nVi fokuserar på din kompetens, inte dina övriga förutsättningar. Vi är öppna för att anpassa rollen eller arbetsplatsen efter dina behov."
}