{
  "meta" : {
    "jobad" : {
      "description" : {
        "requirements" : null,
        "needs" : null,
        "company_information" : null,
        "text_formatted" : "<p>Solna Hus AB är ett byggföretag som söker Grovarbetare, bygg- och anläggning, gipsarbete, villa  arbete, Mark arbete, måla spackla.trädgårds arbete,sten och plattsättningarbete</p><p><br></p><p><br></p><p><br></p><p>Vi söker duktiga medarbetare som har tidigare erfarenhet av bygg och anläggning.</p><p><br></p><p><br></p><p><br></p><p>Vi söker dig med tidigare erfarenhet inom yrket. Du ska ha lätt för att samarbeta med andra människor och tar ansvar för ditt arbete.</p>",
        "conditions" : null,
        "text" : "Solna Hus AB är ett byggföretag som söker Grovarbetare, bygg- och anläggning, gipsarbete, villa  arbete, Mark arbete, måla spackla.trädgårds arbete,sten och plattsättningarbete\n\n\n\n\n\n\nVi söker duktiga medarbetare som har tidigare erfarenhet av bygg och anläggning.\n\n\n\n\n\n\nVi söker dig med tidigare erfarenhet inom yrket. Du ska ha lätt för att samarbeta med andra människor och tar ansvar för ditt arbete."
      },
      "headline" : "Grovarbetare, bygg och anläggning",
      "driving_license" : null,
      "employer" : {
        "email" : null,
        "phone_number" : null,
        "organization_number" : "5569512600",
        "name" : "Solna Hus AB",
        "url" : null,
        "workplace" : "Solna Hus AB"
      },
      "removed_date" : null,
      "logo_url" : null,
      "last_publication_date" : "2022-09-07T23:59:59",
      "number_of_vacancies" : null,
      "occupation" : {
        "concept_id" : "NLEL_3vn_mTB",
        "label" : "Gruvbyggare",
        "legacy_ams_taxonomy_id" : "7543"
      },
      "occupation_group" : {
        "concept_id" : "9mJN_VwW_Xjg",
        "label" : "Träarbetare, snickare m.fl.",
        "legacy_ams_taxonomy_id" : "7111"
      },
      "employment_type" : {
        "concept_id" : "1paU_aCR_nGn",
        "label" : "Behovsanställning",
        "legacy_ams_taxonomy_id" : "4"
      },
      "webpage_url" : "https://arbetsformedlingen.se/platsbanken/annonser/26388890",
      "driving_license_required" : false,
      "application_contacts" : [ ],
      "duration" : {
        "concept_id" : null,
        "label" : null,
        "legacy_ams_taxonomy_id" : null
      },
      "nice_to_have" : {
        "education_level" : [ ],
        "work_experiences" : [ {
          "concept_id" : "NLEL_3vn_mTB",
          "weight" : 5,
          "label" : "Gruvbyggare",
          "legacy_ams_taxonomy_id" : "7543"
        } ],
        "skills" : [ ],
        "education" : [ ],
        "languages" : [ ]
      },
      "application_details" : {
        "via_af" : false,
        "email" : "info@solnahus.se",
        "other" : null,
        "reference" : "Arbete Bygg Sollentuna",
        "url" : null,
        "information" : null
      },
      "source_type" : "VIA_ANNONSERA",
      "application_deadline" : "2022-09-07T23:59:59",
      "external_id" : null,
      "workplace_address" : {
        "coordinates" : [ 17.947400197739938, 59.42016093279332 ],
        "city" : "SOLLENTUNA",
        "postcode" : "19144",
        "municipality" : "Sollentuna",
        "region_concept_id" : "CifL_Rzy_Mku",
        "region" : "Stockholms län",
        "country_code" : "199",
        "region_code" : "01",
        "municipality_concept_id" : "Z5Cq_SgB_dsB",
        "country_concept_id" : "i46j_HmG_v64",
        "municipality_code" : "0163",
        "street_address" : null,
        "country" : "Sverige"
      },
      "id" : "26388890",
      "experience_required" : true,
      "working_hours_type" : {
        "concept_id" : null,
        "label" : null,
        "legacy_ams_taxonomy_id" : null
      },
      "access" : null,
      "timestamp" : 1659986560284,
      "must_have" : {
        "education_level" : [ ],
        "work_experiences" : [ ],
        "skills" : [ ],
        "education" : [ ],
        "languages" : [ ]
      },
      "occupation_field" : {
        "concept_id" : "j7Cq_ZJe_GkT",
        "label" : "Bygg och anläggning",
        "legacy_ams_taxonomy_id" : "2"
      },
      "scope_of_work" : {
        "min" : 0,
        "max" : null
      },
      "salary_type" : {
        "concept_id" : "asrX_9Df_ukn",
        "label" : "Fast och rörlig lön",
        "legacy_ams_taxonomy_id" : "7"
      },
      "removed" : false,
      "salary_description" : null,
      "access_to_own_car" : false,
      "publication_date" : "2022-08-08T21:22:40"
    },
    "name" : "Grovarbetare, bygg och anläggning",
    "user" : "kristof.fischer"
  },
  "sha1" : "ab400c4eb8465cad7d457f917c0b9d1166b25660",
  "annotations" : [ {
    "preferred-label" : "Grovarbetare, bygg och anläggning",
    "sentiment" : "MUST_HAVE",
    "type" : "occupation-name",
    "start-position" : 0,
    "end-position" : 33,
    "concept-id" : "3uEE_35U_U6j",
    "matched-string" : "grovarbetare, bygg och anläggning",
    "annotation-id" : 0
  }, {
    "preferred-label" : "Anläggningsarbete",
    "sentiment" : "MUST_HAVE",
    "type" : "skill",
    "start-position" : 277,
    "end-position" : 296,
    "concept-id" : "myMG_ygC_kDW",
    "matched-string" : "bygg och anläggning",
    "annotation-id" : 2
  }, {
    "preferred-label" : "samarbeta med kolleger",
    "sentiment" : "MUST_HAVE",
    "type" : "esco-skill",
    "start-position" : 376,
    "end-position" : 385,
    "concept-id" : "X15R_797_q62",
    "matched-string" : "samarbeta",
    "annotation-id" : 3
  } ],
  "text" : "Grovarbetare, bygg och anläggning\nSolna Hus AB är ett byggföretag som söker Grovarbetare, bygg- och anläggning, gipsarbete, villa  arbete, Mark arbete, måla spackla.trädgårds arbete,sten och plattsättningarbete\n\n\n\n\n\n\nVi söker duktiga medarbetare som har tidigare erfarenhet av bygg och anläggning.\n\n\n\n\n\n\nVi söker dig med tidigare erfarenhet inom yrket. Du ska ha lätt för att samarbeta med andra människor och tar ansvar för ditt arbete."
}