{
  "meta" : {
    "jobad" : {
      "description" : {
        "requirements" : null,
        "needs" : null,
        "company_information" : null,
        "text_formatted" : "Om kunden\nVi söker maskinoperatörer, gärna med erfarenhet av att arbeta i industrimiljö åt en kund i Katrineholm.\n\nOm oss\nA-Staffing är auktoriserade inom bemanning samt medlemmar i Almega kompetensföretagen, Byggföretagen och Installatörsföretagen (IN) så du kan vara säker på vår kompetens samt att du alltid har rätt anställningsvillkor. Inom A-Staffing verkar A-Staffing Sweden AB, A-Staffing Construction AB och A-Staffing Nordic AB.\n\nVår prioritet är öppenhet och tillgänglighet samt din trivsel, hälsa och säkerhet. Vi är även kvalitets- och miljöcertifierade enligt ISO 9001 och 14001.\n\nVi levererar tjänster inom bygg-, anläggnings- och elteknikbranschen samt tillverkningsindustrin. Det tidigare namnet har varit VMP Group AB, namnändringen gjordes under 2021.\n\nArbetsbeskrivning\nProgrammering och körning av CNC/NC-maskin. Jobbet innefattar ritningsläsning och kontrollmätning med olika mätdon. Övriga arbetsuppgifter är klassificering och återrapportering av materialet, tillsyn och upprätthållande av maskiner. Det ingår även ansvar för planering och förberedelser utifrån arbetsorder så att arbetet flyter på utan onödiga avbrott. Till arbetet hör att utföra eget planerat underhåll av maskinen samt hjälpa underhållspersonalen vid planerade stopp. Du kommer jobba i team och vara en viktig del i det ständiga förbättringsarbetet.\n\nUtbildning\nMinst gymnasieutbildning med praktisk inriktning, helst inom industri. Truck- och traverskort är meriterande. Heta arbeten är önskvärt. CNC utbildning är meriterande men praktisk erfarenhet väger tyngst.\n\nErfarenhet\nErfarenhet från industri eller annan praktisk bakgrund är ett krav. Vi ser helst att du har minst ett par års erfarenhet av liknande arbetsuppgifter samt erfarenhet av ritningsläsning och att du kan använda olika mätdon. Är du erfaren CNC-operatör och har jobbat i Okumas styrsystem så är det väldigt meriterande.\n\nPersonliga kvalifikationer\nHar du ett bra omdöme med högt säkerhetstänk så passar denna tjänst perfekt för dig. Flera arbetsmoment är tunga och kräver därför en god fysik. Du ska vara händig och van vid att arbeta med verktyg och gärna i en industrimiljö. Du ska även ha möjlighet att jobba skift. För samtliga tjänster krävs god svenska i tal och skrift då arbetsplatsen har säkerhet som högsta prioritet. Företaget värdesätter god samarbetsförmåga, lojalitet, engagemang och ansvarstagande.\n\nAnsökan\nIntervjuer, urval och tillsättning kommer att ske löpande under annonseringstiden. Vänta därför inte med att skicka in din ansökan om du är intresserad!",
        "conditions" : "Heltid\r\nVisstid, mer än 6 månader",
        "text" : "Om kunden\nVi söker maskinoperatörer, gärna med erfarenhet av att arbeta i industrimiljö åt en kund i Katrineholm.\n\nOm oss\nA-Staffing är auktoriserade inom bemanning samt medlemmar i Almega kompetensföretagen, Byggföretagen och Installatörsföretagen (IN) så du kan vara säker på vår kompetens samt att du alltid har rätt anställningsvillkor. Inom A-Staffing verkar A-Staffing Sweden AB, A-Staffing Construction AB och A-Staffing Nordic AB.\n\nVår prioritet är öppenhet och tillgänglighet samt din trivsel, hälsa och säkerhet. Vi är även kvalitets- och miljöcertifierade enligt ISO 9001 och 14001.\n\nVi levererar tjänster inom bygg-, anläggnings- och elteknikbranschen samt tillverkningsindustrin. Det tidigare namnet har varit VMP Group AB, namnändringen gjordes under 2021.\n\nArbetsbeskrivning\nProgrammering och körning av CNC/NC-maskin. Jobbet innefattar ritningsläsning och kontrollmätning med olika mätdon. Övriga arbetsuppgifter är klassificering och återrapportering av materialet, tillsyn och upprätthållande av maskiner. Det ingår även ansvar för planering och förberedelser utifrån arbetsorder så att arbetet flyter på utan onödiga avbrott. Till arbetet hör att utföra eget planerat underhåll av maskinen samt hjälpa underhållspersonalen vid planerade stopp. Du kommer jobba i team och vara en viktig del i det ständiga förbättringsarbetet.\n\nUtbildning\nMinst gymnasieutbildning med praktisk inriktning, helst inom industri. Truck- och traverskort är meriterande. Heta arbeten är önskvärt. CNC utbildning är meriterande men praktisk erfarenhet väger tyngst.\n\nErfarenhet\nErfarenhet från industri eller annan praktisk bakgrund är ett krav. Vi ser helst att du har minst ett par års erfarenhet av liknande arbetsuppgifter samt erfarenhet av ritningsläsning och att du kan använda olika mätdon. Är du erfaren CNC-operatör och har jobbat i Okumas styrsystem så är det väldigt meriterande.\n\nPersonliga kvalifikationer\nHar du ett bra omdöme med högt säkerhetstänk så passar denna tjänst perfekt för dig. Flera arbetsmoment är tunga och kräver därför en god fysik. Du ska vara händig och van vid att arbeta med verktyg och gärna i en industrimiljö. Du ska även ha möjlighet att jobba skift. För samtliga tjänster krävs god svenska i tal och skrift då arbetsplatsen har säkerhet som högsta prioritet. Företaget värdesätter god samarbetsförmåga, lojalitet, engagemang och ansvarstagande.\n\nAnsökan\nIntervjuer, urval och tillsättning kommer att ske löpande under annonseringstiden. Vänta därför inte med att skicka in din ansökan om du är intresserad!"
      },
      "headline" : "Maskinoperatörer sökes till kund i Katrineholm",
      "driving_license" : [ {
        "concept_id" : "VTK8_WRx_GcM",
        "label" : "B",
        "legacy_ams_taxonomy_id" : "3"
      } ],
      "employer" : {
        "email" : null,
        "phone_number" : null,
        "organization_number" : "5565795332",
        "name" : "A-Staffing Sweden AB",
        "url" : "https://www.astaffing.se/",
        "workplace" : "A-Staffing Sweden AB"
      },
      "removed_date" : null,
      "logo_url" : "https://www.arbetsformedlingen.se/rest/arbetsgivare/rest/af/v3/organisation/5565795332/logotyper/logo.png",
      "last_publication_date" : "2022-09-02T23:59:59",
      "number_of_vacancies" : 5,
      "occupation" : {
        "concept_id" : "EvmU_s9w_euP",
        "label" : "CNC-operatör/FMS-operatör",
        "legacy_ams_taxonomy_id" : "6004"
      },
      "occupation_group" : {
        "concept_id" : "vaEp_iBS_c5h",
        "label" : "Maskinställare och maskinoperatörer, metallarbete",
        "legacy_ams_taxonomy_id" : "7223"
      },
      "employment_type" : {
        "concept_id" : "PFZr_Syz_cUq",
        "label" : "Vanlig anställning",
        "legacy_ams_taxonomy_id" : "1"
      },
      "webpage_url" : "https://arbetsformedlingen.se/platsbanken/annonser/26361658",
      "driving_license_required" : true,
      "application_contacts" : [ {
        "description" : "Pernilla  Svensson",
        "email" : "pernilla.svensson@astaffing.se",
        "telephone" : null,
        "name" : null,
        "contact_type" : null
      } ],
      "duration" : {
        "concept_id" : "qQUd_4qe_NDT",
        "label" : "6 månader eller längre",
        "legacy_ams_taxonomy_id" : "2"
      },
      "nice_to_have" : {
        "education_level" : [ ],
        "work_experiences" : [ ],
        "skills" : [ ],
        "education" : [ ],
        "languages" : [ ]
      },
      "application_details" : {
        "via_af" : false,
        "email" : null,
        "other" : null,
        "reference" : "5271",
        "url" : "https://www.astaffing.se/jobb/5271",
        "information" : null
      },
      "source_type" : "VIA_PLATSBANKEN_DXA",
      "application_deadline" : "2022-09-02T23:59:59",
      "external_id" : "46-556579-5332-5271",
      "workplace_address" : {
        "coordinates" : [ 16.205475, 58.995552 ],
        "city" : null,
        "postcode" : null,
        "municipality" : "Katrineholm",
        "region_concept_id" : "s93u_BEb_sx2",
        "region" : "Södermanlands län",
        "country_code" : "199",
        "region_code" : "04",
        "municipality_concept_id" : "snx9_qVD_Dr1",
        "country_concept_id" : "i46j_HmG_v64",
        "municipality_code" : "0483",
        "street_address" : null,
        "country" : "Sverige"
      },
      "id" : "26361658",
      "experience_required" : true,
      "working_hours_type" : {
        "concept_id" : "6YE1_gAC_R2G",
        "label" : "Heltid",
        "legacy_ams_taxonomy_id" : "1"
      },
      "access" : null,
      "timestamp" : 1659073893692,
      "must_have" : {
        "education_level" : [ ],
        "work_experiences" : [ {
          "concept_id" : "EvmU_s9w_euP",
          "weight" : 10,
          "label" : "CNC-operatör/FMS-operatör",
          "legacy_ams_taxonomy_id" : "6004"
        } ],
        "skills" : [ ],
        "education" : [ ],
        "languages" : [ ]
      },
      "occupation_field" : {
        "concept_id" : "wTEr_CBC_bqh",
        "label" : "Industriell tillverkning",
        "legacy_ams_taxonomy_id" : "9"
      },
      "scope_of_work" : {
        "min" : 100,
        "max" : 100
      },
      "salary_type" : {
        "concept_id" : "oG8G_9cW_nRf",
        "label" : "Fast månads- vecko- eller timlön",
        "legacy_ams_taxonomy_id" : "1"
      },
      "removed" : false,
      "salary_description" : "Fast lön",
      "access_to_own_car" : false,
      "publication_date" : "2022-07-29T07:51:33"
    },
    "name" : "Maskinoperatörer sökes till kund i Katrineholm",
    "user" : "kristof.fischer"
  },
  "sha1" : "bcacaa69244be43841f1948f842a53817134987b",
  "annotations" : [ {
    "preferred-label" : "CNC-operatör/FMS-operatör",
    "type" : "occupation-name",
    "start-position" : 0,
    "end-position" : 16,
    "concept-id" : "EvmU_s9w_euP",
    "matched-string" : "Maskinoperatörer",
    "annotation-id" : 9
  }, {
    "preferred-label" : "Katrineholm",
    "type" : "municipality",
    "start-position" : 35,
    "end-position" : 46,
    "concept-id" : "snx9_qVD_Dr1",
    "matched-string" : "Katrineholm",
    "annotation-id" : 10
  }, {
    "preferred-label" : "CNC-operatör/FMS-operatör",
    "type" : "occupation-name",
    "start-position" : 66,
    "end-position" : 82,
    "concept-id" : "EvmU_s9w_euP",
    "matched-string" : "maskinoperatörer",
    "annotation-id" : 11
  }, {
    "preferred-label" : "Katrineholm",
    "type" : "municipality",
    "start-position" : 148,
    "end-position" : 159,
    "concept-id" : "snx9_qVD_Dr1",
    "matched-string" : "Katrineholm",
    "annotation-id" : 12
  }, {
    "preferred-label" : "Programmering",
    "sentiment" : "MUST_HAVE",
    "type" : "skill",
    "start-position" : 837,
    "end-position" : 850,
    "concept-id" : "iUew_moc_BRk",
    "matched-string" : "programmering",
    "annotation-id" : 1
  }, {
    "preferred-label" : null,
    "sentiment" : "MUST_HAVE",
    "type" : "skill",
    "start-position" : 855,
    "end-position" : 879,
    "concept-id" : null,
    "matched-string" : "körning av CNC/NC-maskin",
    "annotation-id" : 13
  }, {
    "preferred-label" : "Ritningsläsning",
    "sentiment" : "MUST_HAVE",
    "type" : "skill",
    "start-position" : 899,
    "end-position" : 914,
    "concept-id" : "aHCV_VsV_LiD",
    "matched-string" : "ritningsläsning",
    "annotation-id" : 2
  }, {
    "preferred-label" : null,
    "sentiment" : "MUST_HAVE",
    "type" : "skill",
    "start-position" : 919,
    "end-position" : 934,
    "concept-id" : null,
    "matched-string" : "kontrollmätning",
    "annotation-id" : 14
  }, {
    "preferred-label" : "Gymnasial utbildning",
    "sentiment" : "MUST_HAVE",
    "type" : "sni-level-3",
    "start-position" : 1410,
    "end-position" : 1428,
    "concept-id" : "t8bn_FTn_FiG",
    "matched-string" : "gymnasieutbildning",
    "annotation-id" : 15
  }, {
    "preferred-label" : "Truckvana",
    "sentiment" : "NICE_TO_HAVE",
    "type" : "skill",
    "start-position" : 1475,
    "end-position" : 1480,
    "concept-id" : "pGts_PKK_c8W",
    "matched-string" : "Truck",
    "annotation-id" : 16
  }, {
    "preferred-label" : "Traverskörning",
    "sentiment" : "NICE_TO_HAVE",
    "type" : "skill",
    "start-position" : 1486,
    "end-position" : 1497,
    "concept-id" : "LhvF_NZc_r6N",
    "matched-string" : "traverskort",
    "annotation-id" : 17
  }, {
    "preferred-label" : "Certifikat, heta arbeten",
    "sentiment" : "MUST_HAVE",
    "type" : "skill",
    "start-position" : 1514,
    "end-position" : 1526,
    "concept-id" : "Q7eC_B7g_QiU",
    "matched-string" : "Heta arbeten",
    "annotation-id" : 18
  }, {
    "preferred-label" : null,
    "sentiment" : "NICE_TO_HAVE",
    "type" : "sni-level-4",
    "start-position" : 1540,
    "end-position" : 1554,
    "concept-id" : null,
    "matched-string" : "CNC utbildning",
    "annotation-id" : 19
  }, {
    "preferred-label" : null,
    "sentiment" : "MUST_HAVE",
    "type" : "skill",
    "start-position" : 1620,
    "end-position" : 1644,
    "concept-id" : null,
    "matched-string" : "Erfarenhet från industri",
    "annotation-id" : 20
  }, {
    "preferred-label" : "2-4 års erfarenhet",
    "sentiment" : "MUST_HAVE",
    "type" : "occupation-experience-year",
    "start-position" : 1718,
    "end-position" : 1740,
    "concept-id" : "RWA2_uu6_udD",
    "matched-string" : "ett par års erfarenhet",
    "annotation-id" : 21
  }, {
    "preferred-label" : "Ritningsläsning",
    "sentiment" : "MUST_HAVE",
    "type" : "skill",
    "start-position" : 1788,
    "end-position" : 1803,
    "concept-id" : "aHCV_VsV_LiD",
    "matched-string" : "ritningsläsning",
    "annotation-id" : 4
  }, {
    "preferred-label" : "CNC-operatör",
    "sentiment" : "MUST_HAVE",
    "type" : "esco-occupation",
    "start-position" : 1855,
    "end-position" : 1867,
    "concept-id" : "ezxx_3Jf_Li6",
    "matched-string" : "cnc-operatör",
    "annotation-id" : 5
  }, {
    "preferred-label" : "CNC-programmering, Okuma",
    "sentiment" : "NICE_TO_HAVE",
    "type" : "skill",
    "start-position" : 1885,
    "end-position" : 1902,
    "concept-id" : "yYvR_uTu_o6c",
    "matched-string" : "Okumas styrsystem",
    "annotation-id" : 22
  }, {
    "preferred-label" : "God fysik (tunga lyft)",
    "sentiment" : "MUST_HAVE",
    "type" : "skill",
    "start-position" : 2096,
    "end-position" : 2105,
    "concept-id" : "rwir_xvu_443",
    "matched-string" : "god fysik",
    "annotation-id" : 23
  }, {
    "preferred-label" : "Verktyg",
    "sentiment" : "MUST_HAVE",
    "type" : "skill",
    "start-position" : 2153,
    "end-position" : 2160,
    "concept-id" : "KG9j_WxP_ym2",
    "matched-string" : "verktyg",
    "annotation-id" : 7
  }, {
    "preferred-label" : "Skiftarbete",
    "type" : "work-place-environment",
    "start-position" : 2220,
    "end-position" : 2231,
    "concept-id" : "YnG9_nVP_CsZ",
    "matched-string" : "jobba skift",
    "annotation-id" : 24
  }, {
    "preferred-label" : "Svenska",
    "sentiment" : "MUST_HAVE",
    "type" : "language",
    "start-position" : 2265,
    "end-position" : 2272,
    "concept-id" : "zSLA_vw2_FXN",
    "matched-string" : "svenska",
    "annotation-id" : 8
  }, {
    "preferred-label" : "samarbeta med kolleger",
    "sentiment" : "MUST_HAVE",
    "type" : "esco-skill",
    "start-position" : 2368,
    "end-position" : 2384,
    "concept-id" : "X15R_797_q62",
    "matched-string" : "samarbetsförmåga",
    "annotation-id" : 25
  }, {
    "preferred-label" : "visa ansvarstagande",
    "sentiment" : "MUST_HAVE",
    "type" : "esco-skill",
    "start-position" : 2412,
    "end-position" : 2426,
    "concept-id" : "bcRp_hxV_f5G",
    "matched-string" : "ansvarstagande",
    "annotation-id" : 26
  } ],
  "text" : "Maskinoperatörer sökes till kund i Katrineholm\nOm kunden\nVi söker maskinoperatörer, gärna med erfarenhet av att arbeta i industrimiljö åt en kund i Katrineholm.\n\nOm oss\nA-Staffing är auktoriserade inom bemanning samt medlemmar i Almega kompetensföretagen, Byggföretagen och Installatörsföretagen (IN) så du kan vara säker på vår kompetens samt att du alltid har rätt anställningsvillkor. Inom A-Staffing verkar A-Staffing Sweden AB, A-Staffing Construction AB och A-Staffing Nordic AB.\n\nVår prioritet är öppenhet och tillgänglighet samt din trivsel, hälsa och säkerhet. Vi är även kvalitets- och miljöcertifierade enligt ISO 9001 och 14001.\n\nVi levererar tjänster inom bygg-, anläggnings- och elteknikbranschen samt tillverkningsindustrin. Det tidigare namnet har varit VMP Group AB, namnändringen gjordes under 2021.\n\nArbetsbeskrivning\nProgrammering och körning av CNC/NC-maskin. Jobbet innefattar ritningsläsning och kontrollmätning med olika mätdon. Övriga arbetsuppgifter är klassificering och återrapportering av materialet, tillsyn och upprätthållande av maskiner. Det ingår även ansvar för planering och förberedelser utifrån arbetsorder så att arbetet flyter på utan onödiga avbrott. Till arbetet hör att utföra eget planerat underhåll av maskinen samt hjälpa underhållspersonalen vid planerade stopp. Du kommer jobba i team och vara en viktig del i det ständiga förbättringsarbetet.\n\nUtbildning\nMinst gymnasieutbildning med praktisk inriktning, helst inom industri. Truck- och traverskort är meriterande. Heta arbeten är önskvärt. CNC utbildning är meriterande men praktisk erfarenhet väger tyngst.\n\nErfarenhet\nErfarenhet från industri eller annan praktisk bakgrund är ett krav. Vi ser helst att du har minst ett par års erfarenhet av liknande arbetsuppgifter samt erfarenhet av ritningsläsning och att du kan använda olika mätdon. Är du erfaren CNC-operatör och har jobbat i Okumas styrsystem så är det väldigt meriterande.\n\nPersonliga kvalifikationer\nHar du ett bra omdöme med högt säkerhetstänk så passar denna tjänst perfekt för dig. Flera arbetsmoment är tunga och kräver därför en god fysik. Du ska vara händig och van vid att arbeta med verktyg och gärna i en industrimiljö. Du ska även ha möjlighet att jobba skift. För samtliga tjänster krävs god svenska i tal och skrift då arbetsplatsen har säkerhet som högsta prioritet. Företaget värdesätter god samarbetsförmåga, lojalitet, engagemang och ansvarstagande.\n\nAnsökan\nIntervjuer, urval och tillsättning kommer att ske löpande under annonseringstiden. Vänta därför inte med att skicka in din ansökan om du är intresserad!"
}