{
  "meta" : {
    "jobad" : {
      "description" : {
        "requirements" : null,
        "needs" : null,
        "company_information" : null,
        "text_formatted" : "<p><strong>Industrielektriker</strong>  </p><p><strong>Vattenfall Services företagskultur</strong> präglas av säkerhets- och entreprenörsanda där kreativitet, självständighet och resultatorientering är nyckelbegrepp. Vi arbetar kundinriktat i en mål- och projektorienterad organisation.</p><p>  </p><p><strong>Är du samarbetsorienterad och tycker om att arbeta med olika arbetsuppgifter i omväxlande miljöer på ett strukturerat sätt? Då kan det vara dig vi söker till vår verksamhet när vi nu rekryterar Industrielekteriker till Stenungsunds Kraftverk.</strong></p><p>  </p><p><strong>Din roll som Industrielektriker</strong></p><p>I denna roll kommer du att arbeta med drift och förvaltning av kraftverk, gasturbiner, vattenverk och hamn. I arbetet ingår underhåll, felsökning, kontrollanläggningsmontage, provning, ny montage och revision. Ombyggnader och omkonstruktioner gör vi till stor del i egen regi. Vi har flera olika spänningsnivåer inom lågspänning, och högspänning, då vi arbetar i ställverk med spänningsnivåer mellan 130kV- 400V. Arbete med likström, jordfel och signaler förekommer också. Allt inom el på anläggningen ingår i tjänsten, till exempel brandlarm, telesystem, fiber, etc. </p><p>Tillsammans med dina arbetskamrater arbetar du också med förbättringar för ökad driftsäkerhet och problemlösning vid driftstörningar. Vi erbjuder stort utrymme för att ta egna initiativ och möjlighet till delaktighet i större projekt på anläggningen. I tjänsten ingår även att agera arbetsledare för entreprenörer.</p><p>Tjänsten är en dagtidstjänst och utryckning/beredskap kan förekomma vid behov. Arbete på annan ort förekommer.</p><p>  </p><p><strong>Dina kvalifikationer som Industrielektriker</strong></p><p>Vi söker dig som har teknisk utbildning på gymnasienivå inom el eller motsvarande kompetens. Erfarenhet av arbete som Industrielektriker är ett krav. Vi ser gärna att du har utbildningar för ESA men det är inte ett krav. B-körkort är ett krav.</p><p>Som person är du strukturerad och har lätt att anpassa dig efter olika situationer.</p><p>Att arbeta säkert i alla moment är en självklarhet för dig och du samarbetar väl med både kollegor och kunder. Som tekniker tar du stort ansvar när det gäller kvalité och resultat. Då tjänsten innebär mycket kontakt med andra yrkesgrupper ställer vi krav på god samarbetsförmåga och kommunikation. Vidare kräver arbetet att du är noggrann, gillar ordning och reda och är van att arbeta med förbättringar. Vi lägger stor vikt vid dina personliga egenskaper.</p><p>  </p><p><strong>Mer information</strong></p><p>Under semesterperioden kommer vi ha begränsade möjligheter att svara på frågor. Vi kommer hantera urval och eventuella frågor från 1 aug.</p><p>För frågor kring tjänsten kontakta rekryterande chef Stig Karlsson (072-242 54 82).</p><p>För mer information kring själva rekryteringsprocessen, kontakta ansvariga rekryterare Evelyn Fjellsdotter (evelyn.fjellsdotter@vattenfall.com).</p><p>  </p><p><strong>Fackliga representanter:</strong> Alma Svensson, Unionen, Kaisa Lithander, SEKO, Torbjörn Blom Akademikerna och Magnus Tjergefors, Ledarna. Du når dem via Vattenfalls växel, tfn 08-739 50 00.</p><p><br></p><p><strong>Placeringsort:</strong> Stenungsund</p><p>  </p><p>Vattenfall är en del av Sveriges kritiska infrastruktur, därmed är många av våra tjänster säkerhetsklassade. Är denna tjänst säkerhetsklassad kommer säkerhetsprövning genomföras innan anställning, i enlighet med säkerhetsskyddslagen.</p><p>Vi är övertygade om att mångfald bidrar till att bygga ett mer lönsamt och tilltalande företag och strävar efter att vara goda förebilder när det gäller mångfald. Vattenfall arbetar aktivt för att alla anställda ska ha samma möjligheter och rättigheter oavsett ålder, etnisk eller kulturell bakgrund, könsidentitet och köns uttryck, religion/tro, sexuell läggning eller funktionsförutsättning.</p><p>  </p><p><strong>Känns detta som ett jobb för dig? Vi ser fram emot din ansökan senast 31 juli 2022!</strong></p><p>Vi tar inte emot ansökningar via mail.</p><p>  </p><p><em>Vattenfall Services bygger, underhåller och utvecklar energilösningar för näringsliv och offentlig verksamhet. Bland våra kunder hittar du nät- och energibolag, industrier, kommuner, landsting och entreprenadbolag. I Sverige har vi drygt 2 300 medarbetare på ett 90-tal orter. Våra verksamhetsområden är byggnation - underhåll - konsulttjänster. Läs mer på https://www.vattenfall.se/services/</em></p><p><br></p><p><em>Tillsammans skapar vi Sveriges säkraste arbetsplats!</em></p><p><em>Linkedin – Vattenfall Services Nordic AB</em></p><p><em>Instagram – vattenfallservices</em></p><p id=\"oppenforalla\">Öppen för alla\nVi fokuserar på din kompetens, inte dina övriga förutsättningar. Vi är öppna för att anpassa rollen eller arbetsplatsen efter dina behov.</p>",
        "conditions" : null,
        "text" : "Industrielektriker \nVattenfall Services företagskultur präglas av säkerhets- och entreprenörsanda där kreativitet, självständighet och resultatorientering är nyckelbegrepp. Vi arbetar kundinriktat i en mål- och projektorienterad organisation.\n \nÄr du samarbetsorienterad och tycker om att arbeta med olika arbetsuppgifter i omväxlande miljöer på ett strukturerat sätt? Då kan det vara dig vi söker till vår verksamhet när vi nu rekryterar Industrielekteriker till Stenungsunds Kraftverk.\n \nDin roll som Industrielektriker\nI denna roll kommer du att arbeta med drift och förvaltning av kraftverk, gasturbiner, vattenverk och hamn. I arbetet ingår underhåll, felsökning, kontrollanläggningsmontage, provning, ny montage och revision. Ombyggnader och omkonstruktioner gör vi till stor del i egen regi. Vi har flera olika spänningsnivåer inom lågspänning, och högspänning, då vi arbetar i ställverk med spänningsnivåer mellan 130kV- 400V. Arbete med likström, jordfel och signaler förekommer också. Allt inom el på anläggningen ingår i tjänsten, till exempel brandlarm, telesystem, fiber, etc. \nTillsammans med dina arbetskamrater arbetar du också med förbättringar för ökad driftsäkerhet och problemlösning vid driftstörningar. Vi erbjuder stort utrymme för att ta egna initiativ och möjlighet till delaktighet i större projekt på anläggningen. I tjänsten ingår även att agera arbetsledare för entreprenörer.\nTjänsten är en dagtidstjänst och utryckning/beredskap kan förekomma vid behov. Arbete på annan ort förekommer.\n \nDina kvalifikationer som Industrielektriker\nVi söker dig som har teknisk utbildning på gymnasienivå inom el eller motsvarande kompetens. Erfarenhet av arbete som Industrielektriker är ett krav. Vi ser gärna att du har utbildningar för ESA men det är inte ett krav. B-körkort är ett krav.\nSom person är du strukturerad och har lätt att anpassa dig efter olika situationer.\nAtt arbeta säkert i alla moment är en självklarhet för dig och du samarbetar väl med både kollegor och kunder. Som tekniker tar du stort ansvar när det gäller kvalité och resultat. Då tjänsten innebär mycket kontakt med andra yrkesgrupper ställer vi krav på god samarbetsförmåga och kommunikation. Vidare kräver arbetet att du är noggrann, gillar ordning och reda och är van att arbeta med förbättringar. Vi lägger stor vikt vid dina personliga egenskaper.\n \nMer information\nUnder semesterperioden kommer vi ha begränsade möjligheter att svara på frågor. Vi kommer hantera urval och eventuella frågor från 1 aug.\nFör frågor kring tjänsten kontakta rekryterande chef Stig Karlsson (072-242 54 82).\nFör mer information kring själva rekryteringsprocessen, kontakta ansvariga rekryterare Evelyn Fjellsdotter (evelyn.fjellsdotter@vattenfall.com).\n \nFackliga representanter: Alma Svensson, Unionen, Kaisa Lithander, SEKO, Torbjörn Blom Akademikerna och Magnus Tjergefors, Ledarna. Du når dem via Vattenfalls växel, tfn 08-739 50 00.\n\n\nPlaceringsort: Stenungsund\n \nVattenfall är en del av Sveriges kritiska infrastruktur, därmed är många av våra tjänster säkerhetsklassade. Är denna tjänst säkerhetsklassad kommer säkerhetsprövning genomföras innan anställning, i enlighet med säkerhetsskyddslagen.\nVi är övertygade om att mångfald bidrar till att bygga ett mer lönsamt och tilltalande företag och strävar efter att vara goda förebilder när det gäller mångfald. Vattenfall arbetar aktivt för att alla anställda ska ha samma möjligheter och rättigheter oavsett ålder, etnisk eller kulturell bakgrund, könsidentitet och köns uttryck, religion/tro, sexuell läggning eller funktionsförutsättning.\n \nKänns detta som ett jobb för dig? Vi ser fram emot din ansökan senast 31 juli 2022!\nVi tar inte emot ansökningar via mail.\n \nVattenfall Services bygger, underhåller och utvecklar energilösningar för näringsliv och offentlig verksamhet. Bland våra kunder hittar du nät- och energibolag, industrier, kommuner, landsting och entreprenadbolag. I Sverige har vi drygt 2 300 medarbetare på ett 90-tal orter. Våra verksamhetsområden är byggnation - underhåll - konsulttjänster. Läs mer på https://www.vattenfall.se/services/\n\n\nTillsammans skapar vi Sveriges säkraste arbetsplats!\nLinkedin – Vattenfall Services Nordic AB\nInstagram – vattenfallservices\nÖppen för alla\nVi fokuserar på din kompetens, inte dina övriga förutsättningar. Vi är öppna för att anpassa rollen eller arbetsplatsen efter dina behov."
      },
      "headline" : "Industrielektriker",
      "driving_license" : null,
      "employer" : {
        "email" : null,
        "phone_number" : null,
        "organization_number" : "5560362138",
        "name" : "Vattenfall AB",
        "url" : null,
        "workplace" : "Vattenfall"
      },
      "removed_date" : null,
      "logo_url" : "https://www.arbetsformedlingen.se/rest/arbetsgivare/rest/af/v3/arbetsplatser/81623320/logotyper/logo.png",
      "last_publication_date" : "2022-07-31T00:00:00",
      "number_of_vacancies" : 1,
      "occupation" : {
        "concept_id" : "uZU6_oxo_Dpd",
        "label" : "Industrielektriker",
        "legacy_ams_taxonomy_id" : "5607"
      },
      "occupation_group" : {
        "concept_id" : "a75S_eLg_JWH",
        "label" : "Industrielektriker",
        "legacy_ams_taxonomy_id" : "7412"
      },
      "employment_type" : {
        "concept_id" : "PFZr_Syz_cUq",
        "label" : "Vanlig anställning",
        "legacy_ams_taxonomy_id" : "1"
      },
      "webpage_url" : "https://arbetsformedlingen.se/platsbanken/annonser/26287426",
      "driving_license_required" : false,
      "application_contacts" : [ ],
      "duration" : {
        "concept_id" : "a7uU_j21_mkL",
        "label" : "Tills vidare",
        "legacy_ams_taxonomy_id" : "1"
      },
      "nice_to_have" : {
        "education_level" : [ ],
        "work_experiences" : [ ],
        "skills" : [ ],
        "education" : [ ],
        "languages" : [ ]
      },
      "application_details" : {
        "via_af" : false,
        "email" : null,
        "other" : null,
        "reference" : null,
        "url" : "https://careers.vattenfall.com/se/jobb/industrielektriker-stenungsund/",
        "information" : null
      },
      "source_type" : "VIA_ANNONSERA",
      "application_deadline" : "2022-07-31T00:00:00",
      "external_id" : null,
      "workplace_address" : {
        "coordinates" : [ null, null ],
        "city" : null,
        "postcode" : null,
        "municipality" : "Stenungsund",
        "region_concept_id" : "zdoY_6u5_Krt",
        "region" : "Västra Götalands län",
        "country_code" : "199",
        "region_code" : "14",
        "municipality_concept_id" : "wHrG_FBH_hoD",
        "country_concept_id" : "i46j_HmG_v64",
        "municipality_code" : "1415",
        "street_address" : null,
        "country" : "Sverige"
      },
      "id" : "26287426",
      "experience_required" : true,
      "working_hours_type" : {
        "concept_id" : "6YE1_gAC_R2G",
        "label" : "Heltid",
        "legacy_ams_taxonomy_id" : "1"
      },
      "access" : null,
      "timestamp" : 1656915920795,
      "must_have" : {
        "education_level" : [ ],
        "work_experiences" : [ ],
        "skills" : [ ],
        "education" : [ ],
        "languages" : [ ]
      },
      "occupation_field" : {
        "concept_id" : "yhCP_AqT_tns",
        "label" : "Installation, drift, underhåll",
        "legacy_ams_taxonomy_id" : "10"
      },
      "scope_of_work" : {
        "min" : 0,
        "max" : 100
      },
      "salary_type" : {
        "concept_id" : "oG8G_9cW_nRf",
        "label" : "Fast månads- vecko- eller timlön",
        "legacy_ams_taxonomy_id" : "1"
      },
      "removed" : false,
      "salary_description" : null,
      "access_to_own_car" : false,
      "publication_date" : "2022-07-04T08:25:20"
    },
    "name" : "Industrielektriker",
    "user" : "kristof.fischer"
  },
  "sha1" : "a139b47288e3ab069eda80450ef069cf1446738c",
  "annotations" : [ {
    "preferred-label" : "Industrielektriker",
    "sentiment" : "MUST_HAVE",
    "type" : "occupation-name",
    "start-position" : 0,
    "end-position" : 18,
    "concept-id" : "uZU6_oxo_Dpd",
    "matched-string" : "industrielektriker",
    "annotation-id" : 0
  }, {
    "preferred-label" : "Industrielektriker",
    "sentiment" : "MUST_HAVE",
    "type" : "occupation-name",
    "start-position" : 19,
    "end-position" : 37,
    "concept-id" : "uZU6_oxo_Dpd",
    "matched-string" : "industrielektriker",
    "annotation-id" : 1
  }, {
    "preferred-label" : "samarbeta med kolleger",
    "sentiment" : "MUST_HAVE",
    "type" : "esco-skill",
    "start-position" : 270,
    "end-position" : 289,
    "concept-id" : "X15R_797_q62",
    "matched-string" : "samarbetsorienterad",
    "annotation-id" : 14
  }, {
    "preferred-label" : "Industrielektriker",
    "sentiment" : "MUST_HAVE",
    "type" : "occupation-name",
    "start-position" : 522,
    "end-position" : 540,
    "concept-id" : "uZU6_oxo_Dpd",
    "matched-string" : "industrielektriker",
    "annotation-id" : 3
  }, {
    "preferred-label" : "Drift och underhåll av elanläggningar",
    "sentiment" : "MUST_HAVE",
    "type" : "skill",
    "start-position" : 579,
    "end-position" : 600,
    "concept-id" : "caWZ_HUm_yNp",
    "matched-string" : "drift och förvaltning",
    "annotation-id" : 15
  }, {
    "preferred-label" : "Drift och underhåll av elanläggningar",
    "sentiment" : "MUST_HAVE",
    "type" : "skill",
    "start-position" : 665,
    "end-position" : 674,
    "concept-id" : "caWZ_HUm_yNp",
    "matched-string" : "underhåll",
    "annotation-id" : 16
  }, {
    "preferred-label" : "göra felsökning",
    "sentiment" : "MUST_HAVE",
    "type" : "esco-skill",
    "start-position" : 676,
    "end-position" : 686,
    "concept-id" : "HqC8_fVY_ACM",
    "matched-string" : "felsökning",
    "annotation-id" : 17
  }, {
    "preferred-label" : "montera elektromekaniska system",
    "sentiment" : "MUST_HAVE",
    "type" : "esco-skill",
    "start-position" : 688,
    "end-position" : 714,
    "concept-id" : "WW2L_iZ6_79v",
    "matched-string" : "kontrollanläggningsmontage",
    "annotation-id" : 18
  }, {
    "preferred-label" : "Industrielektriker",
    "sentiment" : "MUST_HAVE",
    "type" : "occupation-name",
    "start-position" : 1563,
    "end-position" : 1581,
    "concept-id" : "uZU6_oxo_Dpd",
    "matched-string" : "industrielektriker",
    "annotation-id" : 8
  }, {
    "preferred-label" : "Annan utbildning inom teknik och teknisk industri",
    "sentiment" : "MUST_HAVE",
    "type" : "sun-education-field-4",
    "start-position" : 1603,
    "end-position" : 1645,
    "concept-id" : "NKNc_sE8_2ok",
    "matched-string" : "teknisk utbildning på gymnasienivå inom el",
    "annotation-id" : 19
  }, {
    "preferred-label" : "Industrielektriker",
    "sentiment" : "MUST_HAVE",
    "type" : "occupation-name",
    "start-position" : 1700,
    "end-position" : 1718,
    "concept-id" : "uZU6_oxo_Dpd",
    "matched-string" : "industrielektriker",
    "annotation-id" : 9
  }, {
    "preferred-label" : "ESA (Elsäkerhetsanvisningarna)",
    "sentiment" : "NICE_TO_HAVE",
    "type" : "skill",
    "start-position" : 1773,
    "end-position" : 1776,
    "concept-id" : "4bwR_JVU_usd",
    "matched-string" : "esa",
    "annotation-id" : 10
  }, {
    "preferred-label" : "B",
    "sentiment" : "MUST_HAVE",
    "type" : "driving-licence",
    "start-position" : 1803,
    "end-position" : 1812,
    "concept-id" : "VTK8_WRx_GcM",
    "matched-string" : "B-körkort",
    "annotation-id" : 20
  }, {
    "preferred-label" : "anpassa sig till förändringar",
    "sentiment" : "MUST_HAVE",
    "type" : "esco-skill",
    "start-position" : 1864,
    "end-position" : 1909,
    "concept-id" : "YRWS_ozr_w33",
    "matched-string" : "lätt att anpassa dig efter olika situationer.",
    "annotation-id" : 21
  }, {
    "preferred-label" : "samarbeta med kolleger",
    "sentiment" : "MUST_HAVE",
    "type" : "esco-skill",
    "start-position" : 2172,
    "end-position" : 2188,
    "concept-id" : "X15R_797_q62",
    "matched-string" : "samarbetsförmåga",
    "annotation-id" : 22
  }, {
    "preferred-label" : "kommunikation",
    "sentiment" : "MUST_HAVE",
    "type" : "esco-skill",
    "start-position" : 2193,
    "end-position" : 2206,
    "concept-id" : "ahPU_HgE_Jeb",
    "matched-string" : "kommunikation",
    "annotation-id" : 23
  }, {
    "preferred-label" : "noggrannhet",
    "sentiment" : "MUST_HAVE",
    "type" : "esco-skill",
    "start-position" : 2240,
    "end-position" : 2248,
    "concept-id" : "mrsW_EkL_KRD",
    "matched-string" : "noggrann",
    "annotation-id" : 24
  }, {
    "preferred-label" : "Religion",
    "sentiment" : "MUST_HAVE",
    "type" : "keyword",
    "start-position" : 3535,
    "end-position" : 3543,
    "concept-id" : "pLEo_8vZ_jG5",
    "matched-string" : "religion",
    "annotation-id" : 13
  } ],
  "text" : "Industrielektriker\nIndustrielektriker \nVattenfall Services företagskultur präglas av säkerhets- och entreprenörsanda där kreativitet, självständighet och resultatorientering är nyckelbegrepp. Vi arbetar kundinriktat i en mål- och projektorienterad organisation.\n \nÄr du samarbetsorienterad och tycker om att arbeta med olika arbetsuppgifter i omväxlande miljöer på ett strukturerat sätt? Då kan det vara dig vi söker till vår verksamhet när vi nu rekryterar Industrielekteriker till Stenungsunds Kraftverk.\n \nDin roll som Industrielektriker\nI denna roll kommer du att arbeta med drift och förvaltning av kraftverk, gasturbiner, vattenverk och hamn. I arbetet ingår underhåll, felsökning, kontrollanläggningsmontage, provning, ny montage och revision. Ombyggnader och omkonstruktioner gör vi till stor del i egen regi. Vi har flera olika spänningsnivåer inom lågspänning, och högspänning, då vi arbetar i ställverk med spänningsnivåer mellan 130kV- 400V. Arbete med likström, jordfel och signaler förekommer också. Allt inom el på anläggningen ingår i tjänsten, till exempel brandlarm, telesystem, fiber, etc. \nTillsammans med dina arbetskamrater arbetar du också med förbättringar för ökad driftsäkerhet och problemlösning vid driftstörningar. Vi erbjuder stort utrymme för att ta egna initiativ och möjlighet till delaktighet i större projekt på anläggningen. I tjänsten ingår även att agera arbetsledare för entreprenörer.\nTjänsten är en dagtidstjänst och utryckning/beredskap kan förekomma vid behov. Arbete på annan ort förekommer.\n \nDina kvalifikationer som Industrielektriker\nVi söker dig som har teknisk utbildning på gymnasienivå inom el eller motsvarande kompetens. Erfarenhet av arbete som Industrielektriker är ett krav. Vi ser gärna att du har utbildningar för ESA men det är inte ett krav. B-körkort är ett krav.\nSom person är du strukturerad och har lätt att anpassa dig efter olika situationer.\nAtt arbeta säkert i alla moment är en självklarhet för dig och du samarbetar väl med både kollegor och kunder. Som tekniker tar du stort ansvar när det gäller kvalité och resultat. Då tjänsten innebär mycket kontakt med andra yrkesgrupper ställer vi krav på god samarbetsförmåga och kommunikation. Vidare kräver arbetet att du är noggrann, gillar ordning och reda och är van att arbeta med förbättringar. Vi lägger stor vikt vid dina personliga egenskaper.\n \nMer information\nUnder semesterperioden kommer vi ha begränsade möjligheter att svara på frågor. Vi kommer hantera urval och eventuella frågor från 1 aug.\nFör frågor kring tjänsten kontakta rekryterande chef Stig Karlsson (072-242 54 82).\nFör mer information kring själva rekryteringsprocessen, kontakta ansvariga rekryterare Evelyn Fjellsdotter (evelyn.fjellsdotter@vattenfall.com).\n \nFackliga representanter: Alma Svensson, Unionen, Kaisa Lithander, SEKO, Torbjörn Blom Akademikerna och Magnus Tjergefors, Ledarna. Du når dem via Vattenfalls växel, tfn 08-739 50 00.\n\n\nPlaceringsort: Stenungsund\n \nVattenfall är en del av Sveriges kritiska infrastruktur, därmed är många av våra tjänster säkerhetsklassade. Är denna tjänst säkerhetsklassad kommer säkerhetsprövning genomföras innan anställning, i enlighet med säkerhetsskyddslagen.\nVi är övertygade om att mångfald bidrar till att bygga ett mer lönsamt och tilltalande företag och strävar efter att vara goda förebilder när det gäller mångfald. Vattenfall arbetar aktivt för att alla anställda ska ha samma möjligheter och rättigheter oavsett ålder, etnisk eller kulturell bakgrund, könsidentitet och köns uttryck, religion/tro, sexuell läggning eller funktionsförutsättning.\n \nKänns detta som ett jobb för dig? Vi ser fram emot din ansökan senast 31 juli 2022!\nVi tar inte emot ansökningar via mail.\n \nVattenfall Services bygger, underhåller och utvecklar energilösningar för näringsliv och offentlig verksamhet. Bland våra kunder hittar du nät- och energibolag, industrier, kommuner, landsting och entreprenadbolag. I Sverige har vi drygt 2 300 medarbetare på ett 90-tal orter. Våra verksamhetsområden är byggnation - underhåll - konsulttjänster. Läs mer på https://www.vattenfall.se/services/\n\n\nTillsammans skapar vi Sveriges säkraste arbetsplats!\nLinkedin – Vattenfall Services Nordic AB\nInstagram – vattenfallservices\nÖppen för alla\nVi fokuserar på din kompetens, inte dina övriga förutsättningar. Vi är öppna för att anpassa rollen eller arbetsplatsen efter dina behov."
}