{
  "meta" : {
    "jobad" : {
      "description" : {
        "requirements" : null,
        "needs" : null,
        "company_information" : null,
        "text_formatted" : "Om Praktikertjänst AB\nFrån Karesuando i norr till Ystad i söder, och med verksamheter i fler än 200 kommuner, är Praktikertjänst hela Sveriges välfärd. En av fem vårdpatienter går till någon av våra mottagningar – och en av tre tandvårdspatienter väljer oss.\n\nVår affärsidé är att skapa förutsättningar för att vi som arbetar inom vården ska kunna göra ett så bra jobb som möjligt – och skapa högsta värde för patienten. Det är vi som utför vården som gemensamt äger Praktikertjänst.\n\nVår unika affärsmodell har funnits i 60 år, och innebär att företagets 1 300 aktieägare själva arbetar i verksamheterna som läkare, tandläkare, tandtekniker, tandhygienister, fysioterapeuter, dietister, psykologer, psykoanalytiker/terapeuter, sjuksköterskor, barnmorskor och logopeder. Det gör oss till Sveriges största företag inom privat tandvård och hälso- och sjukvård.\n\nPraktikertjänst omsätter cirka 8,5 miljarder kronor och har drygt 7 100 medarbetare.\r\n\r\nOm Rosendals Vårdcentral\nVårdcentralen Rosendal är en ny vårdcentral i Uppsala med tillhörande BVC. Vi vill ge våra barn och deras familjer stöd och vård av hög kvalité. Eftersom vi är nystartade kommer du vara drivande i utvecklingen av BVC samtidigt som du kommer ha stöd från vårdcentralen där du kommer ingå i sjuksköterskegruppen. Där vi som grupp arbetar gemensamt med utvecklingen av vår verksamhet.\nVi erbjuder dig en attraktiv arbetsplats med eget ansvar, möjlighet till utveckling och trivsam arbetsmiljö tillsammans med trevliga kollegor.\r\n\r\nArbetsuppgifter\nDitt arbete följer barnhälsovårdens basprogram och vill \n• Främja barns hälsa och utveckling. \n• Förebygga ohälsa hos barn. \n• Tidigt identifiera och initiera åtgärder vid problem i barns hälsa, utveckling och uppväxtmiljö. \n• Växelvis arbeta på Vårdcentralen med sedvanliga arbetsuppgifter inom primärvård\nArbetet sker på många olika sätt med till exempel mottagningsbesök, telefonrådgivning, föräldragrupper, digital kontakt och läkarmottagningar. Du samverkar med andra professioner på vårdcentralen och inom barnhälsovården.\n\nÖvrig information\nIntervjuer sker löpande och tjänsten kan tillsättas innan ansökningstiden gått ut.\r\n\r\nKvalifikationer\nSjuksköterska med inriktning distriktssköterska eller med inriktning hälso- och sjukvård för barn och ungdom. Meriterande är om du har erfarenhet från BVC arbete.\n\r\nPersonliga egenskaper\nVi söker dig som är positiv till arbetsuppgifter som är omväxlande och varierande. Du jobbar både självständigt och i samarbete med kollegor och andra yrkesgrupper. Du tycker om att ha personlig kontakt med barnen och deras familjer. Vi lägger stor vikt vid personlig lämplighet.",
        "conditions" : "40 timmar per vecka. Tillträde: Enligt överenskommelse.\r\nTillsvidare med provanställning.",
        "text" : "Om Praktikertjänst AB\nFrån Karesuando i norr till Ystad i söder, och med verksamheter i fler än 200 kommuner, är Praktikertjänst hela Sveriges välfärd. En av fem vårdpatienter går till någon av våra mottagningar – och en av tre tandvårdspatienter väljer oss.\n\nVår affärsidé är att skapa förutsättningar för att vi som arbetar inom vården ska kunna göra ett så bra jobb som möjligt – och skapa högsta värde för patienten. Det är vi som utför vården som gemensamt äger Praktikertjänst.\n\nVår unika affärsmodell har funnits i 60 år, och innebär att företagets 1 300 aktieägare själva arbetar i verksamheterna som läkare, tandläkare, tandtekniker, tandhygienister, fysioterapeuter, dietister, psykologer, psykoanalytiker/terapeuter, sjuksköterskor, barnmorskor och logopeder. Det gör oss till Sveriges största företag inom privat tandvård och hälso- och sjukvård.\n\nPraktikertjänst omsätter cirka 8,5 miljarder kronor och har drygt 7 100 medarbetare.\r\n\r\nOm Rosendals Vårdcentral\nVårdcentralen Rosendal är en ny vårdcentral i Uppsala med tillhörande BVC. Vi vill ge våra barn och deras familjer stöd och vård av hög kvalité. Eftersom vi är nystartade kommer du vara drivande i utvecklingen av BVC samtidigt som du kommer ha stöd från vårdcentralen där du kommer ingå i sjuksköterskegruppen. Där vi som grupp arbetar gemensamt med utvecklingen av vår verksamhet.\nVi erbjuder dig en attraktiv arbetsplats med eget ansvar, möjlighet till utveckling och trivsam arbetsmiljö tillsammans med trevliga kollegor.\r\n\r\nArbetsuppgifter\nDitt arbete följer barnhälsovårdens basprogram och vill \n• Främja barns hälsa och utveckling. \n• Förebygga ohälsa hos barn. \n• Tidigt identifiera och initiera åtgärder vid problem i barns hälsa, utveckling och uppväxtmiljö. \n• Växelvis arbeta på Vårdcentralen med sedvanliga arbetsuppgifter inom primärvård\nArbetet sker på många olika sätt med till exempel mottagningsbesök, telefonrådgivning, föräldragrupper, digital kontakt och läkarmottagningar. Du samverkar med andra professioner på vårdcentralen och inom barnhälsovården.\n\nÖvrig information\nIntervjuer sker löpande och tjänsten kan tillsättas innan ansökningstiden gått ut.\r\n\r\nKvalifikationer\nSjuksköterska med inriktning distriktssköterska eller med inriktning hälso- och sjukvård för barn och ungdom. Meriterande är om du har erfarenhet från BVC arbete.\n\r\nPersonliga egenskaper\nVi söker dig som är positiv till arbetsuppgifter som är omväxlande och varierande. Du jobbar både självständigt och i samarbete med kollegor och andra yrkesgrupper. Du tycker om att ha personlig kontakt med barnen och deras familjer. Vi lägger stor vikt vid personlig lämplighet."
      },
      "headline" : "BHV sjuksköterska",
      "driving_license" : null,
      "employer" : {
        "email" : null,
        "phone_number" : null,
        "organization_number" : "5560772419",
        "name" : "Praktikertjänst AB",
        "url" : null,
        "workplace" : "Rosendals Vårdcentral"
      },
      "removed_date" : null,
      "logo_url" : "https://www.arbetsformedlingen.se/rest/arbetsgivare/rest/af/v3/organisation/5560772419/logotyper/logo.png",
      "last_publication_date" : "2022-09-23T23:59:59",
      "number_of_vacancies" : 1,
      "occupation" : {
        "concept_id" : "bXNH_MNX_dUR",
        "label" : "Sjuksköterska, grundutbildad",
        "legacy_ams_taxonomy_id" : "7296"
      },
      "occupation_group" : {
        "concept_id" : "Z8ci_bBE_tmx",
        "label" : "Grundutbildade sjuksköterskor",
        "legacy_ams_taxonomy_id" : "2221"
      },
      "employment_type" : {
        "concept_id" : "PFZr_Syz_cUq",
        "label" : "Vanlig anställning",
        "legacy_ams_taxonomy_id" : "1"
      },
      "webpage_url" : "https://arbetsformedlingen.se/platsbanken/annonser/26369237",
      "driving_license_required" : false,
      "application_contacts" : [ {
        "description" : "David Zehlertz",
        "email" : "david.zehlertz@ptj.se",
        "telephone" : null,
        "name" : null,
        "contact_type" : null
      } ],
      "duration" : {
        "concept_id" : "a7uU_j21_mkL",
        "label" : "Tills vidare",
        "legacy_ams_taxonomy_id" : "1"
      },
      "nice_to_have" : {
        "education_level" : [ ],
        "work_experiences" : [ ],
        "skills" : [ ],
        "education" : [ ],
        "languages" : [ ]
      },
      "application_details" : {
        "via_af" : false,
        "email" : "david.zehlertz@ptj.se",
        "other" : null,
        "reference" : "46-556077-2419-I222",
        "url" : null,
        "information" : null
      },
      "source_type" : "VIA_PLATSBANKEN_DXA",
      "application_deadline" : "2022-09-23T23:59:59",
      "external_id" : "46-556077-2419-I222",
      "workplace_address" : {
        "coordinates" : [ 17.638927, 59.858562 ],
        "city" : null,
        "postcode" : null,
        "municipality" : "Uppsala",
        "region_concept_id" : "zBon_eET_fFU",
        "region" : "Uppsala län",
        "country_code" : "199",
        "region_code" : "03",
        "municipality_concept_id" : "otaF_bQY_4ZD",
        "country_concept_id" : "i46j_HmG_v64",
        "municipality_code" : "0380",
        "street_address" : null,
        "country" : "Sverige"
      },
      "id" : "26369237",
      "experience_required" : true,
      "working_hours_type" : {
        "concept_id" : "6YE1_gAC_R2G",
        "label" : "Heltid",
        "legacy_ams_taxonomy_id" : "1"
      },
      "access" : null,
      "timestamp" : 1659365006052,
      "must_have" : {
        "education_level" : [ ],
        "work_experiences" : [ {
          "concept_id" : "bXNH_MNX_dUR",
          "weight" : 10,
          "label" : "Sjuksköterska, grundutbildad",
          "legacy_ams_taxonomy_id" : "7296"
        } ],
        "skills" : [ ],
        "education" : [ ],
        "languages" : [ ]
      },
      "occupation_field" : {
        "concept_id" : "NYW6_mP6_vwf",
        "label" : "Hälso- och sjukvård",
        "legacy_ams_taxonomy_id" : "8"
      },
      "scope_of_work" : {
        "min" : 100,
        "max" : 100
      },
      "salary_type" : {
        "concept_id" : "oG8G_9cW_nRf",
        "label" : "Fast månads- vecko- eller timlön",
        "legacy_ams_taxonomy_id" : "1"
      },
      "removed" : false,
      "salary_description" : "Individuell lönesättning",
      "access_to_own_car" : false,
      "publication_date" : "2022-08-01T16:43:26"
    },
    "name" : "BHV sjuksköterska",
    "user" : "hannes"
  },
  "sha1" : "eeb3a7835c501df196d4bffbd831392940934951",
  "annotations" : [ {
    "preferred-label" : "Sjuksköterskor",
    "sentiment" : "MUST_HAVE",
    "type" : "ssyk-level-3",
    "start-position" : 4,
    "end-position" : 17,
    "concept-id" : "jzaN_Vqk_TP1",
    "matched-string" : "sjuksköterska",
    "annotation-id" : 0
  }, {
    "preferred-label" : "Ystad",
    "type" : "municipality",
    "start-position" : 68,
    "end-position" : 73,
    "concept-id" : "hdYk_hnP_uju",
    "matched-string" : "Ystad",
    "annotation-id" : 24
  }, {
    "preferred-label" : "Sverige",
    "type" : "country",
    "start-position" : 152,
    "end-position" : 160,
    "concept-id" : "i46j_HmG_v64",
    "matched-string" : "Sveriges",
    "annotation-id" : 25
  }, {
    "preferred-label" : "Läkare",
    "sentiment" : "MUST_HAVE",
    "type" : "ssyk-level-3",
    "start-position" : 627,
    "end-position" : 633,
    "concept-id" : "AfZy_9gj_XCb",
    "matched-string" : "läkare",
    "annotation-id" : 1
  }, {
    "preferred-label" : "Tandläkare",
    "sentiment" : "MUST_HAVE",
    "type" : "ssyk-level-4",
    "start-position" : 635,
    "end-position" : 645,
    "concept-id" : "HPxT_fQJ_zwT",
    "matched-string" : "tandläkare",
    "annotation-id" : 2
  }, {
    "preferred-label" : "Tandtekniker och ortopedingenjörer m.fl.",
    "sentiment" : "MUST_HAVE",
    "type" : "ssyk-level-4",
    "start-position" : 647,
    "end-position" : 659,
    "concept-id" : "39yB_xPQ_ozd",
    "matched-string" : "tandtekniker",
    "annotation-id" : 3
  }, {
    "preferred-label" : "Tandhygienister",
    "sentiment" : "MUST_HAVE",
    "type" : "ssyk-level-4",
    "start-position" : 661,
    "end-position" : 676,
    "concept-id" : "4F9o_Jzv_Pwz",
    "matched-string" : "tandhygienister",
    "annotation-id" : 4
  }, {
    "preferred-label" : "Fysioterapeuter och sjukgymnaster",
    "type" : "ssyk-level-4",
    "start-position" : 678,
    "end-position" : 693,
    "concept-id" : "s7vU_FhY_L5Z",
    "matched-string" : "fysioterapeuter",
    "annotation-id" : 26
  }, {
    "preferred-label" : "Dietister",
    "sentiment" : "MUST_HAVE",
    "type" : "ssyk-level-4",
    "start-position" : 695,
    "end-position" : 704,
    "concept-id" : "Pq5C_SPC_bRA",
    "matched-string" : "dietister",
    "annotation-id" : 5
  }, {
    "preferred-label" : "Psykologer",
    "sentiment" : "MUST_HAVE",
    "type" : "ssyk-level-4",
    "start-position" : 706,
    "end-position" : 716,
    "concept-id" : "VYeq_GDF_a2g",
    "matched-string" : "psykologer",
    "annotation-id" : 6
  }, {
    "preferred-label" : "Psykoanalytiker",
    "type" : "occupation-name",
    "start-position" : 718,
    "end-position" : 733,
    "concept-id" : "Jf1N_Tta_fME",
    "matched-string" : "psykoanalytiker",
    "annotation-id" : 27
  }, {
    "preferred-label" : "Sjuksköterskor",
    "sentiment" : "MUST_HAVE",
    "type" : "ssyk-level-3",
    "start-position" : 746,
    "end-position" : 760,
    "concept-id" : "jzaN_Vqk_TP1",
    "matched-string" : "sjuksköterskor",
    "annotation-id" : 7
  }, {
    "preferred-label" : "Barnmorskor",
    "sentiment" : "MUST_HAVE",
    "type" : "ssyk-level-4",
    "start-position" : 762,
    "end-position" : 773,
    "concept-id" : "7XXd_4St_nit",
    "matched-string" : "barnmorskor",
    "annotation-id" : 8
  }, {
    "preferred-label" : "Audionomer och logopeder",
    "type" : "ssyk-level-4",
    "start-position" : 778,
    "end-position" : 787,
    "concept-id" : "pzch_NRY_9ZF",
    "matched-string" : "logopeder",
    "annotation-id" : 28
  }, {
    "preferred-label" : "Sverige",
    "type" : "country",
    "start-position" : 806,
    "end-position" : 814,
    "concept-id" : "i46j_HmG_v64",
    "matched-string" : "Sveriges",
    "annotation-id" : 29
  }, {
    "preferred-label" : "Tandvård",
    "sentiment" : "MUST_HAVE",
    "type" : "keyword",
    "start-position" : 843,
    "end-position" : 851,
    "concept-id" : "ba6n_RTw_PEr",
    "matched-string" : "tandvård",
    "annotation-id" : 9
  }, {
    "preferred-label" : "Hälso- och sjukvård",
    "type" : "sni-level-2",
    "start-position" : 856,
    "end-position" : 875,
    "concept-id" : "KhNL_Quq_Xjk",
    "matched-string" : "hälso- och sjukvård",
    "annotation-id" : 30
  }, {
    "preferred-label" : "Vårdcentral",
    "sentiment" : "MUST_HAVE",
    "type" : "skill",
    "start-position" : 979,
    "end-position" : 990,
    "concept-id" : "FJjr_4pF_LEY",
    "matched-string" : "vårdcentral",
    "annotation-id" : 11
  }, {
    "preferred-label" : "Vårdcentral",
    "type" : "skill",
    "start-position" : 991,
    "end-position" : 1004,
    "concept-id" : "FJjr_4pF_LEY",
    "matched-string" : "Vårdcentralen",
    "annotation-id" : 31
  }, {
    "preferred-label" : "Vårdcentral",
    "sentiment" : "MUST_HAVE",
    "type" : "skill",
    "start-position" : 1023,
    "end-position" : 1034,
    "concept-id" : "FJjr_4pF_LEY",
    "matched-string" : "vårdcentral",
    "annotation-id" : 12
  }, {
    "preferred-label" : "Uppsala",
    "type" : "municipality",
    "start-position" : 1037,
    "end-position" : 1044,
    "concept-id" : "otaF_bQY_4ZD",
    "matched-string" : "Uppsala",
    "annotation-id" : 32
  }, {
    "preferred-label" : "Barnhälsovård/BVC",
    "sentiment" : "MUST_HAVE",
    "type" : "skill",
    "start-position" : 1061,
    "end-position" : 1064,
    "concept-id" : "kXEj_s4x_ATw",
    "matched-string" : "bvc",
    "annotation-id" : 13
  }, {
    "preferred-label" : "Barnhälsovård/BVC",
    "sentiment" : "MUST_HAVE",
    "type" : "skill",
    "start-position" : 1204,
    "end-position" : 1207,
    "concept-id" : "kXEj_s4x_ATw",
    "matched-string" : "bvc",
    "annotation-id" : 14
  }, {
    "preferred-label" : "Vårdcentral",
    "type" : "skill",
    "start-position" : 1245,
    "end-position" : 1258,
    "concept-id" : "FJjr_4pF_LEY",
    "matched-string" : "vårdcentralen",
    "annotation-id" : 33
  }, {
    "preferred-label" : "arbetsmiljö",
    "sentiment" : "MUST_HAVE",
    "type" : "esco-skill",
    "start-position" : 1469,
    "end-position" : 1480,
    "concept-id" : "zdQY_QJh_nUH",
    "matched-string" : "arbetsmiljö",
    "annotation-id" : 15
  }, {
    "preferred-label" : "Hälsa",
    "sentiment" : "MUST_HAVE",
    "type" : "keyword",
    "start-position" : 1607,
    "end-position" : 1612,
    "concept-id" : "Abys_5p1_Cnq",
    "matched-string" : "hälsa",
    "annotation-id" : 16
  }, {
    "preferred-label" : "Hälsa",
    "sentiment" : "MUST_HAVE",
    "type" : "keyword",
    "start-position" : 1723,
    "end-position" : 1728,
    "concept-id" : "Abys_5p1_Cnq",
    "matched-string" : "hälsa",
    "annotation-id" : 17
  }, {
    "preferred-label" : "Vårdcentral",
    "type" : "skill",
    "start-position" : 1781,
    "end-position" : 1794,
    "concept-id" : "FJjr_4pF_LEY",
    "matched-string" : "Vårdcentralen",
    "annotation-id" : 34
  }, {
    "preferred-label" : "primärvård",
    "sentiment" : "MUST_HAVE",
    "type" : "esco-skill",
    "start-position" : 1831,
    "end-position" : 1841,
    "concept-id" : "WvGv_6YE_mun",
    "matched-string" : "primärvård",
    "annotation-id" : 18
  }, {
    "preferred-label" : "Sjuksköterskor",
    "sentiment" : "MUST_HAVE",
    "type" : "ssyk-level-3",
    "start-position" : 2185,
    "end-position" : 2198,
    "concept-id" : "jzaN_Vqk_TP1",
    "matched-string" : "sjuksköterska",
    "annotation-id" : 19
  }, {
    "preferred-label" : "Distriktssköterskor",
    "sentiment" : "MUST_HAVE",
    "type" : "ssyk-level-4",
    "start-position" : 2214,
    "end-position" : 2232,
    "concept-id" : "oj4c_P4b_cja",
    "matched-string" : "distriktssköterska",
    "annotation-id" : 20
  }, {
    "preferred-label" : "Hälso- och sjukvård",
    "type" : "sni-level-2",
    "start-position" : 2254,
    "end-position" : 2273,
    "concept-id" : "KhNL_Quq_Xjk",
    "matched-string" : "hälso- och sjukvård",
    "annotation-id" : 35
  }, {
    "preferred-label" : "Barn och ungdom",
    "sentiment" : "MUST_HAVE",
    "type" : "skill",
    "start-position" : 2278,
    "end-position" : 2293,
    "concept-id" : "qkyH_MC1_YKU",
    "matched-string" : "barn och ungdom",
    "annotation-id" : 22
  }, {
    "preferred-label" : "Barnhälsovård/BVC",
    "sentiment" : "MUST_HAVE",
    "type" : "skill",
    "start-position" : 2336,
    "end-position" : 2339,
    "concept-id" : "kXEj_s4x_ATw",
    "matched-string" : "bvc",
    "annotation-id" : 23
  } ],
  "text" : "BHV sjuksköterska\nOm Praktikertjänst AB\nFrån Karesuando i norr till Ystad i söder, och med verksamheter i fler än 200 kommuner, är Praktikertjänst hela Sveriges välfärd. En av fem vårdpatienter går till någon av våra mottagningar – och en av tre tandvårdspatienter väljer oss.\n\nVår affärsidé är att skapa förutsättningar för att vi som arbetar inom vården ska kunna göra ett så bra jobb som möjligt – och skapa högsta värde för patienten. Det är vi som utför vården som gemensamt äger Praktikertjänst.\n\nVår unika affärsmodell har funnits i 60 år, och innebär att företagets 1 300 aktieägare själva arbetar i verksamheterna som läkare, tandläkare, tandtekniker, tandhygienister, fysioterapeuter, dietister, psykologer, psykoanalytiker/terapeuter, sjuksköterskor, barnmorskor och logopeder. Det gör oss till Sveriges största företag inom privat tandvård och hälso- och sjukvård.\n\nPraktikertjänst omsätter cirka 8,5 miljarder kronor och har drygt 7 100 medarbetare.\r\n\r\nOm Rosendals Vårdcentral\nVårdcentralen Rosendal är en ny vårdcentral i Uppsala med tillhörande BVC. Vi vill ge våra barn och deras familjer stöd och vård av hög kvalité. Eftersom vi är nystartade kommer du vara drivande i utvecklingen av BVC samtidigt som du kommer ha stöd från vårdcentralen där du kommer ingå i sjuksköterskegruppen. Där vi som grupp arbetar gemensamt med utvecklingen av vår verksamhet.\nVi erbjuder dig en attraktiv arbetsplats med eget ansvar, möjlighet till utveckling och trivsam arbetsmiljö tillsammans med trevliga kollegor.\r\n\r\nArbetsuppgifter\nDitt arbete följer barnhälsovårdens basprogram och vill \n• Främja barns hälsa och utveckling. \n• Förebygga ohälsa hos barn. \n• Tidigt identifiera och initiera åtgärder vid problem i barns hälsa, utveckling och uppväxtmiljö. \n• Växelvis arbeta på Vårdcentralen med sedvanliga arbetsuppgifter inom primärvård\nArbetet sker på många olika sätt med till exempel mottagningsbesök, telefonrådgivning, föräldragrupper, digital kontakt och läkarmottagningar. Du samverkar med andra professioner på vårdcentralen och inom barnhälsovården.\n\nÖvrig information\nIntervjuer sker löpande och tjänsten kan tillsättas innan ansökningstiden gått ut.\r\n\r\nKvalifikationer\nSjuksköterska med inriktning distriktssköterska eller med inriktning hälso- och sjukvård för barn och ungdom. Meriterande är om du har erfarenhet från BVC arbete.\n\r\nPersonliga egenskaper\nVi söker dig som är positiv till arbetsuppgifter som är omväxlande och varierande. Du jobbar både självständigt och i samarbete med kollegor och andra yrkesgrupper. Du tycker om att ha personlig kontakt med barnen och deras familjer. Vi lägger stor vikt vid personlig lämplighet."
}