{
  "meta" : {
    "jobad" : {
      "description" : {
        "requirements" : null,
        "needs" : null,
        "company_information" : null,
        "text_formatted" : "Om tjänsten\nVi söker en maskinoperatör till en av våra kunder i Halmstad området. \n\nDina arbetsuppgifter kommer innebära operera stansmaskin och bockning. även arbete efter ritningar och att justera maskin kommer vara en del av arbetsuppgifterna. \nVi ser gärna att du har tidigare erfarenhet av liknande arbete. \n\nStarttid: Omgående eller enligt överrenskommelse. \nArbetstider: Dagtid \n\n\n\n\nDin profil\nÖnskemål/ krav \n\n- Tidigare erfarenhet.\n\n\nSom person vill vi att du är ansvarstagande, målinriktad, flexibel, positiv, ordningsam och har en god samarbetsförmåga eftersom arbetet sker ute hos våra kunder.\nVi arbetar löpande med inkomna ansökningar och kontaktar endast de som motsvarar ansökningskraven.\n\nVälkommen med din ansökan idag!\n\nOm Ikett Personalpartner AB\nIkett Personalpartner AB är ett auktoriserat bemanningsföretag som arbetar med uthyrning och rekrytering av kvalificerad kollektivpersonal och tjänstemän. Främst inom yrkesområdena industri, el, bygg och administration. \n\nSom konsult hos Ikett har du möjligheten att söka lokala arbeten och researbeten i Sverige samt Norge. Vi arbetar kontinuerligt för att du och kunden ska trivas så bra som möjligt med varandra och för att era önskemål ska tillgodoses. \n\nIkett är medlem i Almega Kompetensföretagen och har kollektivavtal med LO, Unionen och Akademikerförbunden. Ikett är certifierat enligt ISO 9001.\n\nMålet med vårt arbete är nöjda kunder och skickliga medarbetare som trivs. Detta vill vi uppnå genom kvalitet, kompetens och effektivitet.\n\nFör mer information och nyheter, följ oss gärna på: \nFacebook: www.facebook.com/ikettpersonalpartner \nLinkedIn: www.linkedin.com/company/ikett-personalpartner-ab-as",
        "conditions" : "Heltid\r\nTillsvidare",
        "text" : "Om tjänsten\nVi söker en maskinoperatör till en av våra kunder i Halmstad området. \n\nDina arbetsuppgifter kommer innebära operera stansmaskin och bockning. även arbete efter ritningar och att justera maskin kommer vara en del av arbetsuppgifterna. \nVi ser gärna att du har tidigare erfarenhet av liknande arbete. \n\nStarttid: Omgående eller enligt överrenskommelse. \nArbetstider: Dagtid \n\n\n\n\nDin profil\nÖnskemål/ krav \n\n- Tidigare erfarenhet.\n\n\nSom person vill vi att du är ansvarstagande, målinriktad, flexibel, positiv, ordningsam och har en god samarbetsförmåga eftersom arbetet sker ute hos våra kunder.\nVi arbetar löpande med inkomna ansökningar och kontaktar endast de som motsvarar ansökningskraven.\n\nVälkommen med din ansökan idag!\n\nOm Ikett Personalpartner AB\nIkett Personalpartner AB är ett auktoriserat bemanningsföretag som arbetar med uthyrning och rekrytering av kvalificerad kollektivpersonal och tjänstemän. Främst inom yrkesområdena industri, el, bygg och administration. \n\nSom konsult hos Ikett har du möjligheten att söka lokala arbeten och researbeten i Sverige samt Norge. Vi arbetar kontinuerligt för att du och kunden ska trivas så bra som möjligt med varandra och för att era önskemål ska tillgodoses. \n\nIkett är medlem i Almega Kompetensföretagen och har kollektivavtal med LO, Unionen och Akademikerförbunden. Ikett är certifierat enligt ISO 9001.\n\nMålet med vårt arbete är nöjda kunder och skickliga medarbetare som trivs. Detta vill vi uppnå genom kvalitet, kompetens och effektivitet.\n\nFör mer information och nyheter, följ oss gärna på: \nFacebook: www.facebook.com/ikettpersonalpartner \nLinkedIn: www.linkedin.com/company/ikett-personalpartner-ab-as"
      },
      "headline" : "Maskinoperatör",
      "driving_license" : [ {
        "concept_id" : "VTK8_WRx_GcM",
        "label" : "B",
        "legacy_ams_taxonomy_id" : "3"
      } ],
      "employer" : {
        "email" : null,
        "phone_number" : null,
        "organization_number" : "5562711134",
        "name" : "Ikett Personalpartner AB",
        "url" : "http://www.ikett.com/",
        "workplace" : "Ikett Personalpartner"
      },
      "removed_date" : null,
      "logo_url" : "https://www.arbetsformedlingen.se/rest/arbetsgivare/rest/af/v3/organisation/5562711134/logotyper/logo.png",
      "last_publication_date" : "2022-08-07T23:59:59",
      "number_of_vacancies" : 1,
      "occupation" : {
        "concept_id" : "Z4Tt_Gwt_NGP",
        "label" : "Maskinoperatör, mekanisk verkstad",
        "legacy_ams_taxonomy_id" : "5305"
      },
      "occupation_group" : {
        "concept_id" : "vaEp_iBS_c5h",
        "label" : "Maskinställare och maskinoperatörer, metallarbete",
        "legacy_ams_taxonomy_id" : "7223"
      },
      "employment_type" : {
        "concept_id" : "PFZr_Syz_cUq",
        "label" : "Vanlig anställning",
        "legacy_ams_taxonomy_id" : "1"
      },
      "webpage_url" : "https://arbetsformedlingen.se/platsbanken/annonser/26313102",
      "driving_license_required" : true,
      "application_contacts" : [ {
        "description" : "Elin  Voss",
        "email" : "elin.voss@ikett.com",
        "telephone" : null,
        "name" : null,
        "contact_type" : null
      } ],
      "duration" : {
        "concept_id" : "a7uU_j21_mkL",
        "label" : "Tills vidare",
        "legacy_ams_taxonomy_id" : "1"
      },
      "nice_to_have" : {
        "education_level" : [ ],
        "work_experiences" : [ ],
        "skills" : [ ],
        "education" : [ ],
        "languages" : [ ]
      },
      "application_details" : {
        "via_af" : false,
        "email" : null,
        "other" : null,
        "reference" : "14725",
        "url" : "https://www.ikett.com/lediga-jobb?jaid=14725",
        "information" : null
      },
      "source_type" : "VIA_PLATSBANKEN_DXA",
      "application_deadline" : "2022-08-07T23:59:59",
      "external_id" : "46-556271-1134-14725",
      "workplace_address" : {
        "coordinates" : [ 12.82, 56.690834 ],
        "city" : null,
        "postcode" : null,
        "municipality" : "Halmstad",
        "region_concept_id" : "wjee_qH2_yb6",
        "region" : "Hallands län",
        "country_code" : "199",
        "region_code" : "13",
        "municipality_concept_id" : "kUQB_KdK_kAh",
        "country_concept_id" : "i46j_HmG_v64",
        "municipality_code" : "1380",
        "street_address" : null,
        "country" : "Sverige"
      },
      "id" : "26313102",
      "experience_required" : true,
      "working_hours_type" : {
        "concept_id" : "6YE1_gAC_R2G",
        "label" : "Heltid",
        "legacy_ams_taxonomy_id" : "1"
      },
      "access" : null,
      "timestamp" : 1657518738090,
      "must_have" : {
        "education_level" : [ ],
        "work_experiences" : [ {
          "concept_id" : "Z4Tt_Gwt_NGP",
          "weight" : 10,
          "label" : "Maskinoperatör, mekanisk verkstad",
          "legacy_ams_taxonomy_id" : "5305"
        } ],
        "skills" : [ ],
        "education" : [ ],
        "languages" : [ ]
      },
      "occupation_field" : {
        "concept_id" : "wTEr_CBC_bqh",
        "label" : "Industriell tillverkning",
        "legacy_ams_taxonomy_id" : "9"
      },
      "scope_of_work" : {
        "min" : 100,
        "max" : 100
      },
      "salary_type" : {
        "concept_id" : "oG8G_9cW_nRf",
        "label" : "Fast månads- vecko- eller timlön",
        "legacy_ams_taxonomy_id" : "1"
      },
      "removed" : false,
      "salary_description" : "Fast lön",
      "access_to_own_car" : false,
      "publication_date" : "2022-07-11T07:52:18"
    },
    "name" : "Maskinoperatör",
    "user" : "hannes"
  },
  "sha1" : "970e89f1793568737aefbbedc4a98087514df6cb",
  "annotations" : [ {
    "preferred-label" : "Process- och maskinoperatörer",
    "type" : "ssyk-level-2",
    "start-position" : 0,
    "end-position" : 14,
    "concept-id" : "XnLr_FQp_c82",
    "matched-string" : "Maskinoperatör",
    "annotation-id" : 3
  }, {
    "preferred-label" : "Process- och maskinoperatörer",
    "type" : "ssyk-level-2",
    "start-position" : 39,
    "end-position" : 53,
    "concept-id" : "XnLr_FQp_c82",
    "matched-string" : "maskinoperatör",
    "annotation-id" : 4
  }, {
    "preferred-label" : "Halmstad",
    "type" : "municipality",
    "start-position" : 79,
    "end-position" : 87,
    "concept-id" : "kUQB_KdK_kAh",
    "matched-string" : "Halmstad",
    "annotation-id" : 5
  }, {
    "preferred-label" : "använda stansmaskin",
    "type" : "esco-skill",
    "start-position" : 144,
    "end-position" : 155,
    "concept-id" : "MMuh_d9u_myu",
    "matched-string" : "stansmaskin",
    "annotation-id" : 6
  }, {
    "preferred-label" : "Bockning, konventionell maskin",
    "type" : "skill",
    "start-position" : 160,
    "end-position" : 168,
    "concept-id" : "9VNa_4MW_EYC",
    "matched-string" : "bockning",
    "annotation-id" : 7
  }, {
    "preferred-label" : "ritningar",
    "type" : "esco-skill",
    "start-position" : 188,
    "end-position" : 197,
    "concept-id" : "RcYZ_omY_is7",
    "matched-string" : "ritningar",
    "annotation-id" : 8
  }, {
    "preferred-label" : "visa ansvarstagande",
    "type" : "esco-skill",
    "start-position" : 487,
    "end-position" : 501,
    "concept-id" : "bcRp_hxV_f5G",
    "matched-string" : "ansvarstagande",
    "annotation-id" : 9
  }, {
    "preferred-label" : "Kollektivavtal",
    "sentiment" : "MUST_HAVE",
    "type" : "skill",
    "start-position" : 1293,
    "end-position" : 1307,
    "concept-id" : "z7wE_9xb_3jX",
    "matched-string" : "kollektivavtal",
    "annotation-id" : 0
  } ],
  "text" : "Maskinoperatör\nOm tjänsten\nVi söker en maskinoperatör till en av våra kunder i Halmstad området. \n\nDina arbetsuppgifter kommer innebära operera stansmaskin och bockning. även arbete efter ritningar och att justera maskin kommer vara en del av arbetsuppgifterna. \nVi ser gärna att du har tidigare erfarenhet av liknande arbete. \n\nStarttid: Omgående eller enligt överrenskommelse. \nArbetstider: Dagtid \n\n\n\n\nDin profil\nÖnskemål/ krav \n\n- Tidigare erfarenhet.\n\n\nSom person vill vi att du är ansvarstagande, målinriktad, flexibel, positiv, ordningsam och har en god samarbetsförmåga eftersom arbetet sker ute hos våra kunder.\nVi arbetar löpande med inkomna ansökningar och kontaktar endast de som motsvarar ansökningskraven.\n\nVälkommen med din ansökan idag!\n\nOm Ikett Personalpartner AB\nIkett Personalpartner AB är ett auktoriserat bemanningsföretag som arbetar med uthyrning och rekrytering av kvalificerad kollektivpersonal och tjänstemän. Främst inom yrkesområdena industri, el, bygg och administration. \n\nSom konsult hos Ikett har du möjligheten att söka lokala arbeten och researbeten i Sverige samt Norge. Vi arbetar kontinuerligt för att du och kunden ska trivas så bra som möjligt med varandra och för att era önskemål ska tillgodoses. \n\nIkett är medlem i Almega Kompetensföretagen och har kollektivavtal med LO, Unionen och Akademikerförbunden. Ikett är certifierat enligt ISO 9001.\n\nMålet med vårt arbete är nöjda kunder och skickliga medarbetare som trivs. Detta vill vi uppnå genom kvalitet, kompetens och effektivitet.\n\nFör mer information och nyheter, följ oss gärna på: \nFacebook: www.facebook.com/ikettpersonalpartner \nLinkedIn: www.linkedin.com/company/ikett-personalpartner-ab-as"
}