{
  "meta" : {
    "jobad" : {
      "description" : {
        "requirements" : null,
        "needs" : null,
        "company_information" : null,
        "text_formatted" : "Vi söker kassa/serveringspersonal till vårt team!\nArbetsuppgifter:\nKassa och servering\n\nRenhållning, städning och diskhantering\n\nEnklare tillredning av mat\n\nMottagande av leveranser\n\nVem är du?\n\nDu drivs av att alltid leverera bästa kvalitet\n\nDu brinner för att sätta gästen i centrum\n\nDu har god samarbetsförmåga och en positiv utstrålning\n\nDu tycker om att verka i ett företag som ständigt utvecklas\n\nDu kan ta eget ansvar och arbeta självständigt\n\nDu kan hantera stress\n\nDu är engagerad och vill göra ditt bästa i alla lägen\n\nDu talar och skriver flytande svenska\n\nVi lägger stor vikt vid personkemi, yrkesstolthet och att du har ett öga för detaljer.\n\n\n\nJust nu söker vi dig som främst vill jobba fredag-söndag, dag och kvällstid.\nEtt plus är om du även kan arbeta övriga dagar i veckan vid behov.\n10-25h i veckan, start september 2022.\n\nVi ser fram emot att höra från dig!=)",
        "conditions" : "Deltid\r\nAnställningstid enligt överenskommelse",
        "text" : "Vi söker kassa/serveringspersonal till vårt team!\nArbetsuppgifter:\nKassa och servering\n\nRenhållning, städning och diskhantering\n\nEnklare tillredning av mat\n\nMottagande av leveranser\n\nVem är du?\n\nDu drivs av att alltid leverera bästa kvalitet\n\nDu brinner för att sätta gästen i centrum\n\nDu har god samarbetsförmåga och en positiv utstrålning\n\nDu tycker om att verka i ett företag som ständigt utvecklas\n\nDu kan ta eget ansvar och arbeta självständigt\n\nDu kan hantera stress\n\nDu är engagerad och vill göra ditt bästa i alla lägen\n\nDu talar och skriver flytande svenska\n\nVi lägger stor vikt vid personkemi, yrkesstolthet och att du har ett öga för detaljer.\n\n\n\nJust nu söker vi dig som främst vill jobba fredag-söndag, dag och kvällstid.\nEtt plus är om du även kan arbeta övriga dagar i veckan vid behov.\n10-25h i veckan, start september 2022.\n\nVi ser fram emot att höra från dig!=)"
      },
      "headline" : "Kassa- och serveringspersonal",
      "driving_license" : null,
      "employer" : {
        "email" : null,
        "phone_number" : null,
        "organization_number" : "5567531602",
        "name" : "Sushi Centralen AB",
        "url" : "https://www.sushiyama.se",
        "workplace" : "Sushi Yama"
      },
      "removed_date" : null,
      "logo_url" : "https://www.arbetsformedlingen.se/rest/arbetsgivare/rest/af/v3/organisation/5567531602/logotyper/logo.png",
      "last_publication_date" : "2023-01-21T23:59:59",
      "number_of_vacancies" : 1,
      "occupation" : {
        "concept_id" : "yXRQ_Ad9_E8V",
        "label" : "Restaurangbiträde",
        "legacy_ams_taxonomy_id" : "5555"
      },
      "occupation_group" : {
        "concept_id" : "tPox_ie4_X9X",
        "label" : "Restaurang- och köksbiträden m.fl.",
        "legacy_ams_taxonomy_id" : "9412"
      },
      "employment_type" : {
        "concept_id" : "PFZr_Syz_cUq",
        "label" : "Vanlig anställning",
        "legacy_ams_taxonomy_id" : "1"
      },
      "webpage_url" : "https://arbetsformedlingen.se/platsbanken/annonser/26378841",
      "driving_license_required" : false,
      "application_contacts" : [ {
        "description" : "Alexandra Carlsson",
        "email" : null,
        "telephone" : null,
        "name" : null,
        "contact_type" : null
      } ],
      "duration" : {
        "concept_id" : "a7uU_j21_mkL",
        "label" : "Tills vidare",
        "legacy_ams_taxonomy_id" : "1"
      },
      "nice_to_have" : {
        "education_level" : [ ],
        "work_experiences" : [ ],
        "skills" : [ ],
        "education" : [ ],
        "languages" : [ ]
      },
      "application_details" : {
        "via_af" : false,
        "email" : null,
        "other" : null,
        "reference" : null,
        "url" : "https://career.sushiyama.se/jobs/1956848-kassa-och-serveringspersonal?promotion=458809-arbetsformedlingen",
        "information" : null
      },
      "source_type" : "VIA_PLATSBANKEN_DXA",
      "application_deadline" : "2023-01-21T23:59:59",
      "external_id" : "46-556753-1602-1956848-1",
      "workplace_address" : {
        "coordinates" : [ 12.82, 56.690834 ],
        "city" : null,
        "postcode" : null,
        "municipality" : "Halmstad",
        "region_concept_id" : "wjee_qH2_yb6",
        "region" : "Hallands län",
        "country_code" : "199",
        "region_code" : "13",
        "municipality_concept_id" : "kUQB_KdK_kAh",
        "country_concept_id" : "i46j_HmG_v64",
        "municipality_code" : "1380",
        "street_address" : null,
        "country" : "Sverige"
      },
      "id" : "26378841",
      "experience_required" : false,
      "working_hours_type" : {
        "concept_id" : "947z_JGS_Uk2",
        "label" : "Deltid",
        "legacy_ams_taxonomy_id" : "2"
      },
      "access" : null,
      "timestamp" : 1659622522347,
      "must_have" : {
        "education_level" : [ ],
        "work_experiences" : [ ],
        "skills" : [ ],
        "education" : [ ],
        "languages" : [ ]
      },
      "occupation_field" : {
        "concept_id" : "ScKy_FHB_7wT",
        "label" : "Hotell, restaurang, storhushåll",
        "legacy_ams_taxonomy_id" : "7"
      },
      "scope_of_work" : {
        "min" : 0,
        "max" : 100
      },
      "salary_type" : {
        "concept_id" : "oG8G_9cW_nRf",
        "label" : "Fast månads- vecko- eller timlön",
        "legacy_ams_taxonomy_id" : "1"
      },
      "removed" : false,
      "salary_description" : "Lön enligt överenskommelse",
      "access_to_own_car" : false,
      "publication_date" : "2022-08-04T16:15:22"
    },
    "name" : "Kassa- och serveringspersonal",
    "user" : "hannes"
  },
  "sha1" : "3f9a604597c6789deefa12e34e8c5288d42b269c",
  "annotations" : [ {
    "preferred-label" : "Kassapersonal",
    "type" : "occupation-name",
    "start-position" : 0,
    "end-position" : 5,
    "concept-id" : "j8X2_KhG_6ty",
    "matched-string" : "Kassa",
    "annotation-id" : 4
  }, {
    "preferred-label" : "Serveringspersonal",
    "sentiment" : "MUST_HAVE",
    "type" : "keyword",
    "start-position" : 11,
    "end-position" : 29,
    "concept-id" : "VqRa_738_v98",
    "matched-string" : "serveringspersonal",
    "annotation-id" : 0
  }, {
    "preferred-label" : "Kassapersonal",
    "type" : "occupation-name",
    "start-position" : 39,
    "end-position" : 44,
    "concept-id" : "j8X2_KhG_6ty",
    "matched-string" : "kassa",
    "annotation-id" : 5
  }, {
    "preferred-label" : "Serveringspersonal",
    "sentiment" : "MUST_HAVE",
    "type" : "keyword",
    "start-position" : 45,
    "end-position" : 63,
    "concept-id" : "VqRa_738_v98",
    "matched-string" : "serveringspersonal",
    "annotation-id" : 1
  }, {
    "preferred-label" : "sköta en kassa",
    "type" : "esco-skill",
    "start-position" : 97,
    "end-position" : 102,
    "concept-id" : "USNU_LMY_prY",
    "matched-string" : "Kassa",
    "annotation-id" : 6
  }, {
    "preferred-label" : "Restaurang, servering",
    "type" : "keyword",
    "start-position" : 107,
    "end-position" : 116,
    "concept-id" : "GqXD_ArB_Mmg",
    "matched-string" : "servering",
    "annotation-id" : 7
  }, {
    "preferred-label" : "Renhållning",
    "sentiment" : "MUST_HAVE",
    "type" : "keyword",
    "start-position" : 118,
    "end-position" : 129,
    "concept-id" : "1eVm_yZa_9yi",
    "matched-string" : "renhållning",
    "annotation-id" : 2
  }, {
    "preferred-label" : "ansvara för städning",
    "type" : "esco-skill",
    "start-position" : 131,
    "end-position" : 139,
    "concept-id" : "2pc1_7xW_uYA",
    "matched-string" : "städning",
    "annotation-id" : 8
  }, {
    "preferred-label" : "arbeta självständigt",
    "type" : "esco-skill",
    "start-position" : 459,
    "end-position" : 479,
    "concept-id" : "NyFu_HHd_zhz",
    "matched-string" : "arbeta självständigt",
    "annotation-id" : 9
  }, {
    "preferred-label" : "Svenska",
    "sentiment" : "MUST_HAVE",
    "type" : "language",
    "start-position" : 589,
    "end-position" : 596,
    "concept-id" : "zSLA_vw2_FXN",
    "matched-string" : "svenska",
    "annotation-id" : 3
  }, {
    "preferred-label" : "Deltid",
    "type" : "worktime-extent",
    "start-position" : 832,
    "end-position" : 838,
    "concept-id" : "947z_JGS_Uk2",
    "matched-string" : "10-25h",
    "annotation-id" : 10
  } ],
  "text" : "Kassa- och serveringspersonal\nVi söker kassa/serveringspersonal till vårt team!\nArbetsuppgifter:\nKassa och servering\n\nRenhållning, städning och diskhantering\n\nEnklare tillredning av mat\n\nMottagande av leveranser\n\nVem är du?\n\nDu drivs av att alltid leverera bästa kvalitet\n\nDu brinner för att sätta gästen i centrum\n\nDu har god samarbetsförmåga och en positiv utstrålning\n\nDu tycker om att verka i ett företag som ständigt utvecklas\n\nDu kan ta eget ansvar och arbeta självständigt\n\nDu kan hantera stress\n\nDu är engagerad och vill göra ditt bästa i alla lägen\n\nDu talar och skriver flytande svenska\n\nVi lägger stor vikt vid personkemi, yrkesstolthet och att du har ett öga för detaljer.\n\n\n\nJust nu söker vi dig som främst vill jobba fredag-söndag, dag och kvällstid.\nEtt plus är om du även kan arbeta övriga dagar i veckan vid behov.\n10-25h i veckan, start september 2022.\n\nVi ser fram emot att höra från dig!=)"
}