{
  "meta" : {
    "jobad" : {
      "description" : {
        "requirements" : null,
        "needs" : null,
        "company_information" : null,
        "text_formatted" : "...till vår kund utanför Växjö. Som plåtslagare arbetar du med att tillverka och montera byggnadsplåt såsom rännor, rör, kupor, skorstenar, vindskivor etc.\n \nVi ser att:\n \n- Du har en gymnasieutbildning inom relevant område\n- Du har förhoppningsvis yrkesbevis och några års erfarenhet, eller…\n- Du är kanske lärling idag och lär dig yrket just nu, eller…\n- Du har relevant erfarenhet inom området och är en allmänt händig person\n- Du har en bra inställning, arbetsmoral och attityd\n- Du gillar att själv få driva arbetet och lägga upp dina projekt och dagar\n- Du uppskattar det mindre bolaget, där alla känner alla och service och kvalitet är ledord\n- Du har B-körkort.\n\nTjänsten inleds med en anställning hos TopWork med ett mål om att kandidaten senare ska övergå till en anställning hos kund. Som konsult hos TopWork får du en konsultchef som stöttar dig i ditt uppdrag hos kund. Vi ger dig råd och rekommendationer om hur du kan utvecklas i ditt arbete.\n\n\nTopWork är ett auktoriserat företag som arbetar med bemanning och rekrytering. Våra kunder finns inom branscher som industri, lager, logistik, bygg och administration. Vi är din trygga, professionella partner oavsett om du söker nya medarbetare eller nya utmaningar. TopWork - vi hittar rätt medarbetare till rätt arbetsgivare och arbetsplats. \r\n\r\nKrav:\n\nKörkort:\n* B (Personbil)",
        "conditions" : "Heltid\r\nVisstid",
        "text" : "...till vår kund utanför Växjö. Som plåtslagare arbetar du med att tillverka och montera byggnadsplåt såsom rännor, rör, kupor, skorstenar, vindskivor etc.\n \nVi ser att:\n \n- Du har en gymnasieutbildning inom relevant område\n- Du har förhoppningsvis yrkesbevis och några års erfarenhet, eller…\n- Du är kanske lärling idag och lär dig yrket just nu, eller…\n- Du har relevant erfarenhet inom området och är en allmänt händig person\n- Du har en bra inställning, arbetsmoral och attityd\n- Du gillar att själv få driva arbetet och lägga upp dina projekt och dagar\n- Du uppskattar det mindre bolaget, där alla känner alla och service och kvalitet är ledord\n- Du har B-körkort.\n\nTjänsten inleds med en anställning hos TopWork med ett mål om att kandidaten senare ska övergå till en anställning hos kund. Som konsult hos TopWork får du en konsultchef som stöttar dig i ditt uppdrag hos kund. Vi ger dig råd och rekommendationer om hur du kan utvecklas i ditt arbete.\n\n\nTopWork är ett auktoriserat företag som arbetar med bemanning och rekrytering. Våra kunder finns inom branscher som industri, lager, logistik, bygg och administration. Vi är din trygga, professionella partner oavsett om du söker nya medarbetare eller nya utmaningar. TopWork - vi hittar rätt medarbetare till rätt arbetsgivare och arbetsplats. \r\n\r\nKrav:\n\nKörkort:\n* B (Personbil)"
      },
      "headline" : "TopWork söker plåtslagare...",
      "driving_license" : [ {
        "concept_id" : "VTK8_WRx_GcM",
        "label" : "B",
        "legacy_ams_taxonomy_id" : "3"
      } ],
      "employer" : {
        "email" : null,
        "phone_number" : null,
        "organization_number" : "5569026767",
        "name" : "TopWork Sverige AB",
        "url" : "http://www.topwork.se",
        "workplace" : "TopWork"
      },
      "removed_date" : null,
      "logo_url" : "https://www.arbetsformedlingen.se/rest/arbetsgivare/rest/af/v3/organisation/5569026767/logotyper/logo.png",
      "last_publication_date" : "2022-08-07T23:59:59",
      "number_of_vacancies" : 1,
      "occupation" : {
        "concept_id" : "D7ee_h2b_7GJ",
        "label" : "Lärling, byggnadsplåtslagare",
        "legacy_ams_taxonomy_id" : "6923"
      },
      "occupation_group" : {
        "concept_id" : "bXfo_4hb_SXx",
        "label" : "Byggnads- och ventilationsplåtslagare",
        "legacy_ams_taxonomy_id" : "7213"
      },
      "employment_type" : {
        "concept_id" : "PFZr_Syz_cUq",
        "label" : "Vanlig anställning",
        "legacy_ams_taxonomy_id" : "1"
      },
      "webpage_url" : "https://arbetsformedlingen.se/platsbanken/annonser/26362744",
      "driving_license_required" : true,
      "application_contacts" : [ {
        "description" : "Peter Hogla",
        "email" : "peter.hogla@topwork.se",
        "telephone" : "0760-969593",
        "name" : null,
        "contact_type" : "VD"
      } ],
      "duration" : {
        "concept_id" : "qQUd_4qe_NDT",
        "label" : "6 månader eller längre",
        "legacy_ams_taxonomy_id" : "2"
      },
      "nice_to_have" : {
        "education_level" : [ ],
        "work_experiences" : [ ],
        "skills" : [ ],
        "education" : [ ],
        "languages" : [ ]
      },
      "application_details" : {
        "via_af" : false,
        "email" : null,
        "other" : null,
        "reference" : null,
        "url" : "https://www.recruto.se/apps/ads/view/id/49473-topwork-care-hogsby-topwork-soker-pltslagare/tracking/5",
        "information" : null
      },
      "source_type" : "VIA_PLATSBANKEN_DXA",
      "application_deadline" : "2022-08-07T23:59:59",
      "external_id" : "46-556902-6767-500-49473-4",
      "workplace_address" : {
        "coordinates" : [ 16.020618, 57.172604 ],
        "city" : null,
        "postcode" : null,
        "municipality" : "Högsby",
        "region_concept_id" : "9QUH_2bb_6Np",
        "region" : "Kalmar län",
        "country_code" : "199",
        "region_code" : "08",
        "municipality_concept_id" : "WPDh_pMr_RLZ",
        "country_concept_id" : "i46j_HmG_v64",
        "municipality_code" : "0821",
        "street_address" : null,
        "country" : "Sverige"
      },
      "id" : "26362744",
      "experience_required" : true,
      "working_hours_type" : {
        "concept_id" : "6YE1_gAC_R2G",
        "label" : "Heltid",
        "legacy_ams_taxonomy_id" : "1"
      },
      "access" : null,
      "timestamp" : 1659085320498,
      "must_have" : {
        "education_level" : [ ],
        "work_experiences" : [ {
          "concept_id" : "D7ee_h2b_7GJ",
          "weight" : 10,
          "label" : "Lärling, byggnadsplåtslagare",
          "legacy_ams_taxonomy_id" : "6923"
        } ],
        "skills" : [ ],
        "education" : [ ],
        "languages" : [ ]
      },
      "occupation_field" : {
        "concept_id" : "j7Cq_ZJe_GkT",
        "label" : "Bygg och anläggning",
        "legacy_ams_taxonomy_id" : "2"
      },
      "scope_of_work" : {
        "min" : 100,
        "max" : 100
      },
      "salary_type" : {
        "concept_id" : "oG8G_9cW_nRf",
        "label" : "Fast månads- vecko- eller timlön",
        "legacy_ams_taxonomy_id" : "1"
      },
      "removed" : false,
      "salary_description" : "Fast",
      "access_to_own_car" : false,
      "publication_date" : "2022-07-29T11:02:00"
    },
    "name" : "TopWork söker plåtslagare...",
    "user" : "hannes"
  },
  "sha1" : "eafa1864add92a7ec4eb265f1eddc57b46e33079",
  "annotations" : [ {
    "preferred-label" : "Plåtslagare",
    "sentiment" : "MUST_HAVE",
    "type" : "keyword",
    "start-position" : 14,
    "end-position" : 25,
    "concept-id" : "JezX_oUD_TZr",
    "matched-string" : "plåtslagare",
    "annotation-id" : 0
  }, {
    "preferred-label" : "Växjö",
    "type" : "municipality",
    "start-position" : 54,
    "end-position" : 59,
    "concept-id" : "mmot_H3A_auW",
    "matched-string" : "Växjö",
    "annotation-id" : 5
  }, {
    "preferred-label" : "Plåtslagare",
    "sentiment" : "MUST_HAVE",
    "type" : "keyword",
    "start-position" : 65,
    "end-position" : 76,
    "concept-id" : "JezX_oUD_TZr",
    "matched-string" : "plåtslagare",
    "annotation-id" : 1
  }, {
    "preferred-label" : "Gymnasial utbildning",
    "type" : "sun-education-level-1",
    "start-position" : 213,
    "end-position" : 231,
    "concept-id" : "wyLL_K3a_HRC",
    "matched-string" : "gymnasieutbildning",
    "annotation-id" : 6
  }, {
    "preferred-label" : "Yrkesbevis/examen",
    "sentiment" : "MUST_HAVE",
    "type" : "skill-headline",
    "start-position" : 278,
    "end-position" : 288,
    "concept-id" : "HjPN_99i_cFD",
    "matched-string" : "yrkesbevis",
    "annotation-id" : 2
  }, {
    "preferred-label" : "B",
    "type" : "driving-licence",
    "start-position" : 688,
    "end-position" : 697,
    "concept-id" : "VTK8_WRx_GcM",
    "matched-string" : "B-körkort",
    "annotation-id" : 7
  }, {
    "preferred-label" : "Lager",
    "sentiment" : "MUST_HAVE",
    "type" : "keyword",
    "start-position" : 1115,
    "end-position" : 1120,
    "concept-id" : "J5gJ_6vV_egQ",
    "matched-string" : "lager",
    "annotation-id" : 3
  }, {
    "preferred-label" : "Logistik",
    "sentiment" : "MUST_HAVE",
    "type" : "skill",
    "start-position" : 1122,
    "end-position" : 1130,
    "concept-id" : "yXmf_iKi_7ci",
    "matched-string" : "logistik",
    "annotation-id" : 4
  }, {
    "preferred-label" : "Bygg",
    "type" : "occupation-collection",
    "start-position" : 1132,
    "end-position" : 1136,
    "concept-id" : "ja7J_P8X_YC9",
    "matched-string" : "bygg",
    "annotation-id" : 8
  }, {
    "preferred-label" : "B",
    "type" : "driving-licence",
    "start-position" : 1344,
    "end-position" : 1368,
    "concept-id" : "VTK8_WRx_GcM",
    "matched-string" : "Körkort:\n* B (Personbil)",
    "annotation-id" : 9
  } ],
  "text" : "TopWork söker plåtslagare...\n...till vår kund utanför Växjö. Som plåtslagare arbetar du med att tillverka och montera byggnadsplåt såsom rännor, rör, kupor, skorstenar, vindskivor etc.\n \nVi ser att:\n \n- Du har en gymnasieutbildning inom relevant område\n- Du har förhoppningsvis yrkesbevis och några års erfarenhet, eller…\n- Du är kanske lärling idag och lär dig yrket just nu, eller…\n- Du har relevant erfarenhet inom området och är en allmänt händig person\n- Du har en bra inställning, arbetsmoral och attityd\n- Du gillar att själv få driva arbetet och lägga upp dina projekt och dagar\n- Du uppskattar det mindre bolaget, där alla känner alla och service och kvalitet är ledord\n- Du har B-körkort.\n\nTjänsten inleds med en anställning hos TopWork med ett mål om att kandidaten senare ska övergå till en anställning hos kund. Som konsult hos TopWork får du en konsultchef som stöttar dig i ditt uppdrag hos kund. Vi ger dig råd och rekommendationer om hur du kan utvecklas i ditt arbete.\n\n\nTopWork är ett auktoriserat företag som arbetar med bemanning och rekrytering. Våra kunder finns inom branscher som industri, lager, logistik, bygg och administration. Vi är din trygga, professionella partner oavsett om du söker nya medarbetare eller nya utmaningar. TopWork - vi hittar rätt medarbetare till rätt arbetsgivare och arbetsplats. \r\n\r\nKrav:\n\nKörkort:\n* B (Personbil)"
}