{
  "meta" : {
    "jobad" : {
      "description" : {
        "requirements" : null,
        "needs" : null,
        "company_information" : null,
        "text_formatted" : "Vi söker en Visual Merchandiser/Butikssäljare som vill vara med och vidareutveckla Cubus och säkra att vi är det bästa valet när folk ska handla sina favoritplagg!\n\nFörsta intrycket och helhetsupplevelsen av butiken är avgörande för om kunden väljer att handla på Cubus. Som Visual Merchandiser ska du se till att presentera varorna så att butiken är kommersiell, inspirerande och säljande. Som Butikssäljare hos oss är din uppgift att ta hand om våra kunder på bästa möjliga sätt. Detta gör du genom att hjälpa och se till att butiken är attraktiv och spännande. Tillsammans med dina kollegor sprider du glädje och gör det enkelt för kunden att hitta sina favoritplagg och må bra!\r\nViktigaste ansvar i rollen:\n\n - Dra kundens uppmärksamhet till butiken\n - Hålla kundens uppmärksamhet\n - Säkra att kunden rör sig genom hela butiken och hittar sina favoriter\n\nViktigaste arbetsuppgifter:\n\n - I samarbete med butikschef, stötta och bidra med visuell kompetens till teamet som du är en del av\n - Säkra att koncept och visuella guidelines följs, med lokala anpassningar\n - Bidra och planlägga för maximal effekt av kampanjer\n - Med kunden i fokus skapar du en inspirerande, relevant och överskådlig köpupplevelse\n - Jobba aktivt och kontinuerligt med golvstruktur, varubärare och ljussättning\n - Använda externa och interna kommunikationskanaler för att inhämta och dela bästa praxis\n - Ge bästa tänkbara kundservice och se till att våra kunder får en köpupplevelse utöver det vanliga\n\nVi kan erbjuda:\n\n - En varierande och spännande arbetsvardag i en inkluderande gemenskap, där vår «big family» kultur genomsyrar allt vi gör\n - Bonussystem\n - Förmånlig personalrabatt i Varners butiker \n\nArbetstiderna är varierande, dag-, kväll-, och helg. \n\nHar du ett «big smile» och de egenskaperna vi letar efter? Då hoppas vi att du vill skicka in din ansökan redan i dag.\n\nVi ser fram emot att höra ifrån dig!\n\nCubus är en av Nordens största modekedjor med 300 butiker i Norge, Sverige och Finland. Vi betonar garderobens viktigaste plagg, bra material och rimliga priser, vi erbjuder kläder för spädbarn, barn, kvinnor och män. Naturmaterial, moderna, bekväma passformar och bra funktion anpassad till alla årstider beskriver konceptet väl. På Cubus älskar vi tempo och strävar mot att skapa den perfekta shoppingupplevelsen, vi arbetar tillsammans och firar framgångar. Vårt mål är att erbjuda kundens favoriter, och vi uppnår detta eftersom vi har världens bästa kollegor!   \n\nCubus är en del av modekoncernen Varner som består av flera profilerade kedjor; Dressmann, Carlings, Bik Bok, Junkyard och Levi’s Store. Verksamheten omfattar för närvarande 6 nätbutiker och över 1200 fysiska butiker i Norge, Sverige, Finland, Island och Danmark.",
        "conditions" : "Deltid\r\nTillsvidare",
        "text" : "Vi söker en Visual Merchandiser/Butikssäljare som vill vara med och vidareutveckla Cubus och säkra att vi är det bästa valet när folk ska handla sina favoritplagg!\n\nFörsta intrycket och helhetsupplevelsen av butiken är avgörande för om kunden väljer att handla på Cubus. Som Visual Merchandiser ska du se till att presentera varorna så att butiken är kommersiell, inspirerande och säljande. Som Butikssäljare hos oss är din uppgift att ta hand om våra kunder på bästa möjliga sätt. Detta gör du genom att hjälpa och se till att butiken är attraktiv och spännande. Tillsammans med dina kollegor sprider du glädje och gör det enkelt för kunden att hitta sina favoritplagg och må bra!\r\nViktigaste ansvar i rollen:\n\n - Dra kundens uppmärksamhet till butiken\n - Hålla kundens uppmärksamhet\n - Säkra att kunden rör sig genom hela butiken och hittar sina favoriter\n\nViktigaste arbetsuppgifter:\n\n - I samarbete med butikschef, stötta och bidra med visuell kompetens till teamet som du är en del av\n - Säkra att koncept och visuella guidelines följs, med lokala anpassningar\n - Bidra och planlägga för maximal effekt av kampanjer\n - Med kunden i fokus skapar du en inspirerande, relevant och överskådlig köpupplevelse\n - Jobba aktivt och kontinuerligt med golvstruktur, varubärare och ljussättning\n - Använda externa och interna kommunikationskanaler för att inhämta och dela bästa praxis\n - Ge bästa tänkbara kundservice och se till att våra kunder får en köpupplevelse utöver det vanliga\n\nVi kan erbjuda:\n\n - En varierande och spännande arbetsvardag i en inkluderande gemenskap, där vår «big family» kultur genomsyrar allt vi gör\n - Bonussystem\n - Förmånlig personalrabatt i Varners butiker \n\nArbetstiderna är varierande, dag-, kväll-, och helg. \n\nHar du ett «big smile» och de egenskaperna vi letar efter? Då hoppas vi att du vill skicka in din ansökan redan i dag.\n\nVi ser fram emot att höra ifrån dig!\n\nCubus är en av Nordens största modekedjor med 300 butiker i Norge, Sverige och Finland. Vi betonar garderobens viktigaste plagg, bra material och rimliga priser, vi erbjuder kläder för spädbarn, barn, kvinnor och män. Naturmaterial, moderna, bekväma passformar och bra funktion anpassad till alla årstider beskriver konceptet väl. På Cubus älskar vi tempo och strävar mot att skapa den perfekta shoppingupplevelsen, vi arbetar tillsammans och firar framgångar. Vårt mål är att erbjuda kundens favoriter, och vi uppnår detta eftersom vi har världens bästa kollegor!   \n\nCubus är en del av modekoncernen Varner som består av flera profilerade kedjor; Dressmann, Carlings, Bik Bok, Junkyard och Levi’s Store. Verksamheten omfattar för närvarande 6 nätbutiker och över 1200 fysiska butiker i Norge, Sverige, Finland, Island och Danmark."
      },
      "headline" : "Visual Merchandiser/Butikssäljare ca. 50% Cubus Karlshamn Drottninggatan",
      "driving_license" : null,
      "employer" : {
        "email" : null,
        "phone_number" : null,
        "organization_number" : "5561167213",
        "name" : "Varner Retail AB",
        "url" : "https://cubus.com/sv/",
        "workplace" : "Cubus"
      },
      "removed_date" : null,
      "logo_url" : null,
      "last_publication_date" : "2023-01-13T23:59:59",
      "number_of_vacancies" : 1,
      "occupation" : {
        "concept_id" : "GTFy_iPM_msj",
        "label" : "Butikskommunikatör/Visual merchandiser",
        "legacy_ams_taxonomy_id" : "7211"
      },
      "occupation_group" : {
        "concept_id" : "CSUf_ZVM_a7Z",
        "label" : "Inredare, dekoratörer och scenografer m.fl.",
        "legacy_ams_taxonomy_id" : "3432"
      },
      "employment_type" : {
        "concept_id" : "PFZr_Syz_cUq",
        "label" : "Vanlig anställning",
        "legacy_ams_taxonomy_id" : "1"
      },
      "webpage_url" : "https://arbetsformedlingen.se/platsbanken/annonser/26337699",
      "driving_license_required" : false,
      "application_contacts" : [ ],
      "duration" : {
        "concept_id" : "a7uU_j21_mkL",
        "label" : "Tills vidare",
        "legacy_ams_taxonomy_id" : "1"
      },
      "nice_to_have" : {
        "education_level" : [ ],
        "work_experiences" : [ ],
        "skills" : [ ],
        "education" : [ ],
        "languages" : [ ]
      },
      "application_details" : {
        "via_af" : false,
        "email" : null,
        "other" : null,
        "reference" : null,
        "url" : "https://emp.jobylon.com/applications/jobs/141540/create/?utm_source=ams&utm_medium=promotionserializer",
        "information" : null
      },
      "source_type" : "VIA_PLATSBANKEN_DXA",
      "application_deadline" : "2023-01-13T23:59:59",
      "external_id" : "46-556116-7213-141540-72239",
      "workplace_address" : {
        "coordinates" : [ 14.863073, 56.170303 ],
        "city" : null,
        "postcode" : null,
        "municipality" : "Karlshamn",
        "region_concept_id" : "DQZd_uYs_oKb",
        "region" : "Blekinge län",
        "country_code" : "199",
        "region_code" : "10",
        "municipality_concept_id" : "HtGW_WgR_dpE",
        "country_concept_id" : "i46j_HmG_v64",
        "municipality_code" : "1082",
        "street_address" : null,
        "country" : "Sverige"
      },
      "id" : "26337699",
      "experience_required" : true,
      "working_hours_type" : {
        "concept_id" : "947z_JGS_Uk2",
        "label" : "Deltid",
        "legacy_ams_taxonomy_id" : "2"
      },
      "access" : null,
      "timestamp" : 1658182744081,
      "must_have" : {
        "education_level" : [ ],
        "work_experiences" : [ {
          "concept_id" : "GTFy_iPM_msj",
          "weight" : 10,
          "label" : "Butikskommunikatör/Visual merchandiser",
          "legacy_ams_taxonomy_id" : "7211"
        } ],
        "skills" : [ ],
        "education" : [ ],
        "languages" : [ ]
      },
      "occupation_field" : {
        "concept_id" : "9puE_nYg_crq",
        "label" : "Kultur, media, design",
        "legacy_ams_taxonomy_id" : "11"
      },
      "scope_of_work" : {
        "min" : 0,
        "max" : 100
      },
      "salary_type" : {
        "concept_id" : "oG8G_9cW_nRf",
        "label" : "Fast månads- vecko- eller timlön",
        "legacy_ams_taxonomy_id" : "1"
      },
      "removed" : false,
      "salary_description" : "Fast månads- vecko- eller timlön",
      "access_to_own_car" : false,
      "publication_date" : "2022-07-19T00:19:04"
    },
    "name" : "Visual Merchandiser/Butikssäljare ca. 50% Cubus Karlshamn Drottninggatan",
    "user" : "hannes"
  },
  "sha1" : "d0c3df23018ef3371ebd523dded6dac92d99288e",
  "annotations" : [ {
    "preferred-label" : "Butikskommunikatör/Visual merchandiser",
    "type" : "occupation-name",
    "start-position" : 0,
    "end-position" : 19,
    "concept-id" : "GTFy_iPM_msj",
    "matched-string" : "Visual Merchandiser",
    "annotation-id" : 5
  }, {
    "preferred-label" : "Butikssäljare",
    "type" : "isco-level-4",
    "start-position" : 20,
    "end-position" : 34,
    "concept-id" : "JVsN_YXp_9mq",
    "matched-string" : "Butikssäljare ",
    "annotation-id" : 6
  }, {
    "preferred-label" : "Deltid",
    "type" : "worktime-extent",
    "start-position" : 38,
    "end-position" : 41,
    "concept-id" : "947z_JGS_Uk2",
    "matched-string" : "50%",
    "annotation-id" : 7
  }, {
    "preferred-label" : "Karlshamn",
    "type" : "municipality",
    "start-position" : 48,
    "end-position" : 57,
    "concept-id" : "HtGW_WgR_dpE",
    "matched-string" : "Karlshamn",
    "annotation-id" : 8
  }, {
    "preferred-label" : "Butikskommunikatör/Visual merchandiser",
    "sentiment" : "MUST_HAVE",
    "type" : "occupation-name",
    "start-position" : 85,
    "end-position" : 104,
    "concept-id" : "GTFy_iPM_msj",
    "matched-string" : "visual merchandiser",
    "annotation-id" : 0
  }, {
    "preferred-label" : "Butikssäljare",
    "type" : "isco-level-4",
    "start-position" : 105,
    "end-position" : 118,
    "concept-id" : "JVsN_YXp_9mq",
    "matched-string" : "Butikssäljare",
    "annotation-id" : 9
  }, {
    "preferred-label" : "Butik",
    "type" : "keyword",
    "start-position" : 281,
    "end-position" : 288,
    "concept-id" : "xLsd_zjY_5wr",
    "matched-string" : "butiken",
    "annotation-id" : 10
  }, {
    "preferred-label" : "Butikskommunikatör/Visual merchandiser",
    "sentiment" : "MUST_HAVE",
    "type" : "occupation-name",
    "start-position" : 348,
    "end-position" : 367,
    "concept-id" : "GTFy_iPM_msj",
    "matched-string" : "visual merchandiser",
    "annotation-id" : 1
  }, {
    "preferred-label" : "Butik",
    "type" : "keyword",
    "start-position" : 413,
    "end-position" : 420,
    "concept-id" : "xLsd_zjY_5wr",
    "matched-string" : "butiken",
    "annotation-id" : 11
  }, {
    "preferred-label" : "Butikssäljare",
    "type" : "isco-level-4",
    "start-position" : 468,
    "end-position" : 481,
    "concept-id" : "JVsN_YXp_9mq",
    "matched-string" : "Butikssäljare",
    "annotation-id" : 12
  }, {
    "preferred-label" : "Butik",
    "type" : "keyword",
    "start-position" : 601,
    "end-position" : 608,
    "concept-id" : "xLsd_zjY_5wr",
    "matched-string" : "butiken",
    "annotation-id" : 13
  }, {
    "preferred-label" : "butikschef",
    "sentiment" : "MUST_HAVE",
    "type" : "esco-occupation",
    "start-position" : 980,
    "end-position" : 990,
    "concept-id" : "bRZF_sdj_cdk",
    "matched-string" : "butikschef",
    "annotation-id" : 2
  }, {
    "preferred-label" : "kundservice",
    "sentiment" : "MUST_HAVE",
    "type" : "esco-skill",
    "start-position" : 1474,
    "end-position" : 1485,
    "concept-id" : "WykS_79d_Fz7",
    "matched-string" : "kundservice",
    "annotation-id" : 3
  }, {
    "preferred-label" : "Kläder/Mode",
    "sentiment" : "MUST_HAVE",
    "type" : "skill",
    "start-position" : 2146,
    "end-position" : 2152,
    "concept-id" : "agGK_Zte_X2y",
    "matched-string" : "kläder",
    "annotation-id" : 4
  } ],
  "text" : "Visual Merchandiser/Butikssäljare ca. 50% Cubus Karlshamn Drottninggatan\nVi söker en Visual Merchandiser/Butikssäljare som vill vara med och vidareutveckla Cubus och säkra att vi är det bästa valet när folk ska handla sina favoritplagg!\n\nFörsta intrycket och helhetsupplevelsen av butiken är avgörande för om kunden väljer att handla på Cubus. Som Visual Merchandiser ska du se till att presentera varorna så att butiken är kommersiell, inspirerande och säljande. Som Butikssäljare hos oss är din uppgift att ta hand om våra kunder på bästa möjliga sätt. Detta gör du genom att hjälpa och se till att butiken är attraktiv och spännande. Tillsammans med dina kollegor sprider du glädje och gör det enkelt för kunden att hitta sina favoritplagg och må bra!\r\nViktigaste ansvar i rollen:\n\n - Dra kundens uppmärksamhet till butiken\n - Hålla kundens uppmärksamhet\n - Säkra att kunden rör sig genom hela butiken och hittar sina favoriter\n\nViktigaste arbetsuppgifter:\n\n - I samarbete med butikschef, stötta och bidra med visuell kompetens till teamet som du är en del av\n - Säkra att koncept och visuella guidelines följs, med lokala anpassningar\n - Bidra och planlägga för maximal effekt av kampanjer\n - Med kunden i fokus skapar du en inspirerande, relevant och överskådlig köpupplevelse\n - Jobba aktivt och kontinuerligt med golvstruktur, varubärare och ljussättning\n - Använda externa och interna kommunikationskanaler för att inhämta och dela bästa praxis\n - Ge bästa tänkbara kundservice och se till att våra kunder får en köpupplevelse utöver det vanliga\n\nVi kan erbjuda:\n\n - En varierande och spännande arbetsvardag i en inkluderande gemenskap, där vår «big family» kultur genomsyrar allt vi gör\n - Bonussystem\n - Förmånlig personalrabatt i Varners butiker \n\nArbetstiderna är varierande, dag-, kväll-, och helg. \n\nHar du ett «big smile» och de egenskaperna vi letar efter? Då hoppas vi att du vill skicka in din ansökan redan i dag.\n\nVi ser fram emot att höra ifrån dig!\n\nCubus är en av Nordens största modekedjor med 300 butiker i Norge, Sverige och Finland. Vi betonar garderobens viktigaste plagg, bra material och rimliga priser, vi erbjuder kläder för spädbarn, barn, kvinnor och män. Naturmaterial, moderna, bekväma passformar och bra funktion anpassad till alla årstider beskriver konceptet väl. På Cubus älskar vi tempo och strävar mot att skapa den perfekta shoppingupplevelsen, vi arbetar tillsammans och firar framgångar. Vårt mål är att erbjuda kundens favoriter, och vi uppnår detta eftersom vi har världens bästa kollegor!   \n\nCubus är en del av modekoncernen Varner som består av flera profilerade kedjor; Dressmann, Carlings, Bik Bok, Junkyard och Levi’s Store. Verksamheten omfattar för närvarande 6 nätbutiker och över 1200 fysiska butiker i Norge, Sverige, Finland, Island och Danmark."
}