{
  "meta" : {
    "jobad" : {
      "description" : {
        "requirements" : null,
        "needs" : null,
        "company_information" : null,
        "text_formatted" : "<p><br></p><p>Köksbiträde </p><p>Lilla Italy i Visby är glädjande nog i behov av förstärkning till vår mycket populära resturang. Vi erbjuder våra gäster det bästa från Medelhavet i en genuin miljö. Vi söker ett antal köksbiträden som är förtrogna med det arabiska matkulturen och även behärskar arabisk i tal och skrift då vi har utökat meny med mezerätter. </p><p>Tjänsterna är heltid med sedvanliga villkor erbjuds.</p><p>Alla frågor besvaras enbart via mejl. </p><p><br></p>",
        "conditions" : null,
        "text" : "Köksbiträde \nLilla Italy i Visby är glädjande nog i behov av förstärkning till vår mycket populära resturang. Vi erbjuder våra gäster det bästa från Medelhavet i en genuin miljö. Vi söker ett antal köksbiträden som är förtrogna med det arabiska matkulturen och även behärskar arabisk i tal och skrift då vi har utökat meny med mezerätter. \nTjänsterna är heltid med sedvanliga villkor erbjuds.\nAlla frågor besvaras enbart via mejl."
      },
      "headline" : "Restaurant ",
      "driving_license" : null,
      "employer" : {
        "email" : null,
        "phone_number" : null,
        "organization_number" : "5591901722",
        "name" : "Lilla Italy i Visby AB",
        "url" : null,
        "workplace" : "Lilla Italy i Visby AB"
      },
      "removed_date" : null,
      "logo_url" : null,
      "last_publication_date" : "2022-07-26T00:00:00",
      "number_of_vacancies" : 3,
      "occupation" : {
        "concept_id" : "oRB5_b7i_Qzv",
        "label" : "Köksbiträde",
        "legacy_ams_taxonomy_id" : "483"
      },
      "occupation_group" : {
        "concept_id" : "tPox_ie4_X9X",
        "label" : "Restaurang- och köksbiträden m.fl.",
        "legacy_ams_taxonomy_id" : "9412"
      },
      "employment_type" : {
        "concept_id" : "PFZr_Syz_cUq",
        "label" : "Vanlig anställning",
        "legacy_ams_taxonomy_id" : "1"
      },
      "webpage_url" : "https://arbetsformedlingen.se/platsbanken/annonser/26257954",
      "driving_license_required" : false,
      "application_contacts" : [ ],
      "duration" : {
        "concept_id" : "a7uU_j21_mkL",
        "label" : "Tills vidare",
        "legacy_ams_taxonomy_id" : "1"
      },
      "nice_to_have" : {
        "education_level" : [ ],
        "work_experiences" : [ ],
        "skills" : [ ],
        "education" : [ ],
        "languages" : [ ]
      },
      "application_details" : {
        "via_af" : false,
        "email" : "Lilla_italy@hotmail.com",
        "other" : null,
        "reference" : "Köksbiträde",
        "url" : null,
        "information" : null
      },
      "source_type" : "VIA_ANNONSERA",
      "application_deadline" : "2022-07-26T00:00:00",
      "external_id" : null,
      "workplace_address" : {
        "coordinates" : [ 18.29151041769158, 57.638684845862834 ],
        "city" : "Visby",
        "postcode" : "62157",
        "municipality" : "Gotland",
        "region_concept_id" : "K8iD_VQv_2BA",
        "region" : "Gotlands län",
        "country_code" : "199",
        "region_code" : "09",
        "municipality_concept_id" : "Ft9P_E8F_VLJ",
        "country_concept_id" : "i46j_HmG_v64",
        "municipality_code" : "0980",
        "street_address" : "Donners Plats 6",
        "country" : "Sverige"
      },
      "id" : "26257954",
      "experience_required" : false,
      "working_hours_type" : {
        "concept_id" : "6YE1_gAC_R2G",
        "label" : "Heltid",
        "legacy_ams_taxonomy_id" : "1"
      },
      "access" : null,
      "timestamp" : 1656280600774,
      "must_have" : {
        "education_level" : [ ],
        "work_experiences" : [ ],
        "skills" : [ ],
        "education" : [ ],
        "languages" : [ ]
      },
      "occupation_field" : {
        "concept_id" : "ScKy_FHB_7wT",
        "label" : "Hotell, restaurang, storhushåll",
        "legacy_ams_taxonomy_id" : "7"
      },
      "scope_of_work" : {
        "min" : 0,
        "max" : 100
      },
      "salary_type" : {
        "concept_id" : "oG8G_9cW_nRf",
        "label" : "Fast månads- vecko- eller timlön",
        "legacy_ams_taxonomy_id" : "1"
      },
      "removed" : false,
      "salary_description" : null,
      "access_to_own_car" : false,
      "publication_date" : "2022-06-26T23:56:40"
    },
    "name" : "Restaurant ",
    "user" : "kristof.fischer"
  },
  "sha1" : "532105b8fe4654ea7ea7f50ba7fc1d5d2686053e",
  "annotations" : [ {
    "preferred-label" : "Köksbiträde",
    "type" : "occupation-name",
    "start-position" : 12,
    "end-position" : 23,
    "concept-id" : "oRB5_b7i_Qzv",
    "matched-string" : "Köksbiträde",
    "annotation-id" : 2
  }, {
    "preferred-label" : "Köksbiträde",
    "type" : "occupation-name",
    "start-position" : 210,
    "end-position" : 222,
    "concept-id" : "oRB5_b7i_Qzv",
    "matched-string" : "köksbiträden",
    "annotation-id" : 3
  }, {
    "preferred-label" : "Arabiska",
    "sentiment" : "MUST_HAVE",
    "type" : "language",
    "start-position" : 288,
    "end-position" : 295,
    "concept-id" : "3iEY_RGP_qXq",
    "matched-string" : "arabisk",
    "annotation-id" : 4
  }, {
    "preferred-label" : "Heltid",
    "type" : "worktime-extent",
    "start-position" : 366,
    "end-position" : 372,
    "concept-id" : "6YE1_gAC_R2G",
    "matched-string" : "heltid",
    "annotation-id" : 5
  } ],
  "text" : "Restaurant \nKöksbiträde \nLilla Italy i Visby är glädjande nog i behov av förstärkning till vår mycket populära resturang. Vi erbjuder våra gäster det bästa från Medelhavet i en genuin miljö. Vi söker ett antal köksbiträden som är förtrogna med det arabiska matkulturen och även behärskar arabisk i tal och skrift då vi har utökat meny med mezerätter. \nTjänsterna är heltid med sedvanliga villkor erbjuds.\nAlla frågor besvaras enbart via mejl."
}