{
  "meta" : {
    "jobad" : {
      "description" : {
        "requirements" : null,
        "needs" : null,
        "company_information" : null,
        "text_formatted" : "APL, Apotek Produktion & Laboratorier AB, är en av Europas största tillverkare av extempore(individanpassade) läkemedel. APL är också en ledande kontraktstillverkare inom Life Science i Skandinavien med resurser för utveckling, tillverkning och analys av läkemedel. APLs dryga 500 medarbetare är verksamma vid fyra produktionsanläggningar runt om i Sverige. APL har till uppgift att tillverka extemporeläkemedel som skräddarsys för den enskilde patienten. Många beredningar görs till barn och till patienter med olika typer av överkänslighet. APL bidrar till läkemedel som förbättrar och räddar liv.\n\nLäs gärna mer på www.apl.se\r\n\r\nLockas du av varierande och stimulerande arbetsuppgifter, där självledarskap är en viktig pusselbit? Då är det till APL du ska söka dig och där du kommer att trivas!\n\nPositionen är placerad på sektionen Analytisk Utveckling (AU) i Kungens kurva. AU ansvarar för metodutvecklingar och valideringar för nya produkter, produktvårdsutredringar, och utvecklingsuppdrag till både interna och externa kunder. AU stödjer i detta arbete samtligas APLs anläggningar. AU hanterar även stabilitetsstudier samt frisläppningsanalyser av kliniskt prövningsmaterial.\n\n \n\nTjänsten\n\nRollen är bred och mycket utvecklande och intressant! Det ingå exempelvis att vara analysrepresentant i utvecklingsprojekt både i interna och externa projekt, leda, delta i samt koordinera projektarbeten för metod och analysutveckling, rapportskrivning och resultatrapportering i LIMS\n\nDessutom kommer rollen innehålla:\n\n * Laborativt arbete såsom metodutveckling och validering av kemiska analysmetoder, analyser av olika typer av prover enligt fastställda metoder, främst med HPLC/UPLC men även andra tekniker såsom GC, frisättning, titreringar, UV och FTIR.\n * Produktvårdsarbete och utredningsarbete\n * Ansvara för delar av Analytisk Utvecklings analysinstrument och/eller gemensamma arbetsuppgifter\n\nDin bakgrund och profil\n\nDu har en akademisk examen med inriktning mot analytisk kemi samt har arbetat med analys och utvecklingsarbete inom läkemedelsindustrin i några år.\n\nErfarenhet från arbete med metodutveckling och validering av kromatografiska metoder samt att planera och utföra stabilitetsstudier är meriterande.\n\nSom person är du:\n\n * Noggrann och analytisk\n * Du har förmåga att arbeta självständigt såväl som i grupp\n * Tycker om att nätverka, söka information, samt att arbeta tvärfunktionellt med människor i olika funktioner\n * Ödmjuk och vågar be om hjälp\n\nVi erbjuder\n\nTjänsten är heltid, tillsvidare med start efter överenskommelse.\n\nAPL kännetecknas av en öppen och dynamisk atmosfär med korta beslutsvägar. Affärsmässig, lyhörd, lösningsorienterad och ansvarstagande är några av de ledord som APLs chefer och medarbetare arbetar efter och för att du ska trivas bör dessa värderingar även passa in på dig.\n\n \n\nAnsökan och kontakt?\n\n \n I den här rekryteringen samarbetar APL med Jefferson Wells, du ansöker med ett uppdaterat CV och personligt brev. Vi arbetar med löpande urval, därför uppmuntrar vi dig att skicka in din ansökan så snart som möjligt även om urval och intervjuer kommer att påbörjas i mitten av augusti.\n\nHar du frågor avseende tjänsten är du välkommen att kontakta rekryteringskonsult Håkan Kempel på 0730-211 833 eller via mail till hakan.kempel@jeffersonwells.se .\n\nAnsökan görs via länken. Vi tar inte emot ansökningar via e-mail.\n\n \n\nÖvrigt\n\nAPL genomför en alkohol-/drogtest samt bakgrundskontroll på slutkandidat.",
        "conditions" : "Heltid\r\nPermanent",
        "text" : "APL, Apotek Produktion & Laboratorier AB, är en av Europas största tillverkare av extempore(individanpassade) läkemedel. APL är också en ledande kontraktstillverkare inom Life Science i Skandinavien med resurser för utveckling, tillverkning och analys av läkemedel. APLs dryga 500 medarbetare är verksamma vid fyra produktionsanläggningar runt om i Sverige. APL har till uppgift att tillverka extemporeläkemedel som skräddarsys för den enskilde patienten. Många beredningar görs till barn och till patienter med olika typer av överkänslighet. APL bidrar till läkemedel som förbättrar och räddar liv.\n\nLäs gärna mer på www.apl.se\r\n\r\nLockas du av varierande och stimulerande arbetsuppgifter, där självledarskap är en viktig pusselbit? Då är det till APL du ska söka dig och där du kommer att trivas!\n\nPositionen är placerad på sektionen Analytisk Utveckling (AU) i Kungens kurva. AU ansvarar för metodutvecklingar och valideringar för nya produkter, produktvårdsutredringar, och utvecklingsuppdrag till både interna och externa kunder. AU stödjer i detta arbete samtligas APLs anläggningar. AU hanterar även stabilitetsstudier samt frisläppningsanalyser av kliniskt prövningsmaterial.\n\n \n\nTjänsten\n\nRollen är bred och mycket utvecklande och intressant! Det ingå exempelvis att vara analysrepresentant i utvecklingsprojekt både i interna och externa projekt, leda, delta i samt koordinera projektarbeten för metod och analysutveckling, rapportskrivning och resultatrapportering i LIMS\n\nDessutom kommer rollen innehålla:\n\n * Laborativt arbete såsom metodutveckling och validering av kemiska analysmetoder, analyser av olika typer av prover enligt fastställda metoder, främst med HPLC/UPLC men även andra tekniker såsom GC, frisättning, titreringar, UV och FTIR.\n * Produktvårdsarbete och utredningsarbete\n * Ansvara för delar av Analytisk Utvecklings analysinstrument och/eller gemensamma arbetsuppgifter\n\nDin bakgrund och profil\n\nDu har en akademisk examen med inriktning mot analytisk kemi samt har arbetat med analys och utvecklingsarbete inom läkemedelsindustrin i några år.\n\nErfarenhet från arbete med metodutveckling och validering av kromatografiska metoder samt att planera och utföra stabilitetsstudier är meriterande.\n\nSom person är du:\n\n * Noggrann och analytisk\n * Du har förmåga att arbeta självständigt såväl som i grupp\n * Tycker om att nätverka, söka information, samt att arbeta tvärfunktionellt med människor i olika funktioner\n * Ödmjuk och vågar be om hjälp\n\nVi erbjuder\n\nTjänsten är heltid, tillsvidare med start efter överenskommelse.\n\nAPL kännetecknas av en öppen och dynamisk atmosfär med korta beslutsvägar. Affärsmässig, lyhörd, lösningsorienterad och ansvarstagande är några av de ledord som APLs chefer och medarbetare arbetar efter och för att du ska trivas bör dessa värderingar även passa in på dig.\n\n \n\nAnsökan och kontakt?\n\n \n I den här rekryteringen samarbetar APL med Jefferson Wells, du ansöker med ett uppdaterat CV och personligt brev. Vi arbetar med löpande urval, därför uppmuntrar vi dig att skicka in din ansökan så snart som möjligt även om urval och intervjuer kommer att påbörjas i mitten av augusti.\n\nHar du frågor avseende tjänsten är du välkommen att kontakta rekryteringskonsult Håkan Kempel på 0730-211 833 eller via mail till hakan.kempel@jeffersonwells.se .\n\nAnsökan görs via länken. Vi tar inte emot ansökningar via e-mail.\n\n \n\nÖvrigt\n\nAPL genomför en alkohol-/drogtest samt bakgrundskontroll på slutkandidat."
      },
      "headline" : "Analytisk kemist till Analytisk Utveckling på APL i Stockholm",
      "driving_license" : null,
      "employer" : {
        "email" : null,
        "phone_number" : null,
        "organization_number" : "5563481588",
        "name" : "Manpower AB",
        "url" : null,
        "workplace" : "APL AB"
      },
      "removed_date" : null,
      "logo_url" : "https://www.arbetsformedlingen.se/rest/arbetsgivare/rest/af/v3/organisation/5563481588/logotyper/logo.png",
      "last_publication_date" : "2022-09-02T23:59:59",
      "number_of_vacancies" : 1,
      "occupation" : {
        "concept_id" : "KZsj_HrG_iKS",
        "label" : "Analytisk kemist",
        "legacy_ams_taxonomy_id" : "1836"
      },
      "occupation_group" : {
        "concept_id" : "eofS_oZs_RZi",
        "label" : "Kemister",
        "legacy_ams_taxonomy_id" : "2113"
      },
      "employment_type" : {
        "concept_id" : "PFZr_Syz_cUq",
        "label" : "Vanlig anställning",
        "legacy_ams_taxonomy_id" : "1"
      },
      "webpage_url" : "https://arbetsformedlingen.se/platsbanken/annonser/26347820",
      "driving_license_required" : false,
      "application_contacts" : [ {
        "description" : "Håkan Kempel",
        "email" : null,
        "telephone" : null,
        "name" : null,
        "contact_type" : null
      } ],
      "duration" : {
        "concept_id" : "a7uU_j21_mkL",
        "label" : "Tills vidare",
        "legacy_ams_taxonomy_id" : "1"
      },
      "nice_to_have" : {
        "education_level" : [ ],
        "work_experiences" : [ ],
        "skills" : [ ],
        "education" : [ ],
        "languages" : [ ]
      },
      "application_details" : {
        "via_af" : false,
        "email" : null,
        "other" : null,
        "reference" : "b8bc76f3-d44d-",
        "url" : "https://www.aplitrak.com/?adid=aGtlbXBlLjcxMjA2LjMxMDFAbWFucG93ZXJncm91cG5vcmRpY3MuYXBsaXRyYWsuY29t",
        "information" : null
      },
      "source_type" : "VIA_PLATSBANKEN_DXA",
      "application_deadline" : "2022-09-02T23:59:59",
      "external_id" : "46-556348-1588-b8bc76f3-d44d-",
      "workplace_address" : {
        "coordinates" : [ 17.982157, 59.23633 ],
        "city" : null,
        "postcode" : null,
        "municipality" : "Huddinge",
        "region_concept_id" : "CifL_Rzy_Mku",
        "region" : "Stockholms län",
        "country_code" : "199",
        "region_code" : "01",
        "municipality_concept_id" : "g1Gc_aXK_EKu",
        "country_concept_id" : "i46j_HmG_v64",
        "municipality_code" : "0126",
        "street_address" : null,
        "country" : "Sverige"
      },
      "id" : "26347820",
      "experience_required" : false,
      "working_hours_type" : {
        "concept_id" : "6YE1_gAC_R2G",
        "label" : "Heltid",
        "legacy_ams_taxonomy_id" : "1"
      },
      "access" : null,
      "timestamp" : 1658496016029,
      "must_have" : {
        "education_level" : [ ],
        "work_experiences" : [ ],
        "skills" : [ ],
        "education" : [ ],
        "languages" : [ ]
      },
      "occupation_field" : {
        "concept_id" : "kJeN_wmw_9wX",
        "label" : "Naturvetenskap",
        "legacy_ams_taxonomy_id" : "14"
      },
      "scope_of_work" : {
        "min" : 100,
        "max" : 100
      },
      "salary_type" : {
        "concept_id" : "oG8G_9cW_nRf",
        "label" : "Fast månads- vecko- eller timlön",
        "legacy_ams_taxonomy_id" : "1"
      },
      "removed" : false,
      "salary_description" : "Not Specified",
      "access_to_own_car" : false,
      "publication_date" : "2022-07-22T14:31:05"
    },
    "name" : "Analytisk kemist till Analytisk Utveckling på APL i Stockholm",
    "user" : "hannes"
  },
  "sha1" : "2bbfdf80c5f6fe0ce8aa7b730f9f9e33a1411262",
  "annotations" : [ {
    "preferred-label" : "analytisk kemist",
    "sentiment" : "MUST_HAVE",
    "type" : "esco-occupation",
    "start-position" : 0,
    "end-position" : 16,
    "concept-id" : "L9vf_Evf_Cnq",
    "matched-string" : "analytisk kemist",
    "annotation-id" : 0
  }, {
    "preferred-label" : "Stockholm",
    "type" : "municipality",
    "start-position" : 52,
    "end-position" : 61,
    "concept-id" : "AvNB_uwa_6n6",
    "matched-string" : "Stockholm",
    "annotation-id" : 20
  }, {
    "preferred-label" : "Läkemedel/Sjukvårdsprodukter",
    "sentiment" : "MUST_HAVE",
    "type" : "skill",
    "start-position" : 172,
    "end-position" : 181,
    "concept-id" : "vVXb_pYT_E1z",
    "matched-string" : "läkemedel",
    "annotation-id" : 3
  }, {
    "preferred-label" : "Life science",
    "sentiment" : "MUST_HAVE",
    "type" : "keyword",
    "start-position" : 233,
    "end-position" : 245,
    "concept-id" : "CpFD_aoS_pkZ",
    "matched-string" : "life science",
    "annotation-id" : 5
  }, {
    "preferred-label" : "Tillverkning",
    "sentiment" : "MUST_HAVE",
    "type" : "sni-level-1",
    "start-position" : 290,
    "end-position" : 302,
    "concept-id" : "trPt_iHy_oFP",
    "matched-string" : "tillverkning",
    "annotation-id" : 6
  }, {
    "preferred-label" : "Läkemedel/Sjukvårdsprodukter",
    "sentiment" : "MUST_HAVE",
    "type" : "skill",
    "start-position" : 317,
    "end-position" : 326,
    "concept-id" : "vVXb_pYT_E1z",
    "matched-string" : "läkemedel",
    "annotation-id" : 7
  }, {
    "preferred-label" : "Sverige",
    "type" : "country",
    "start-position" : 411,
    "end-position" : 418,
    "concept-id" : "i46j_HmG_v64",
    "matched-string" : "Sverige",
    "annotation-id" : 21
  }, {
    "preferred-label" : "Läkemedel/Sjukvårdsprodukter",
    "sentiment" : "MUST_HAVE",
    "type" : "skill",
    "start-position" : 621,
    "end-position" : 630,
    "concept-id" : "vVXb_pYT_E1z",
    "matched-string" : "läkemedel",
    "annotation-id" : 10
  }, {
    "preferred-label" : "Högskoleutbildning, generell, 3 år",
    "type" : "sun-education-level-3",
    "start-position" : 1999,
    "end-position" : 2015,
    "concept-id" : "u9Qr_2wJ_nVu",
    "matched-string" : "akademisk examen",
    "annotation-id" : 22
  }, {
    "preferred-label" : "Analytisk kemi",
    "sentiment" : "MUST_HAVE",
    "type" : "keyword",
    "start-position" : 2035,
    "end-position" : 2049,
    "concept-id" : "iHMb_zvr_ygD",
    "matched-string" : "analytisk kemi",
    "annotation-id" : 14
  }, {
    "preferred-label" : "Utvecklingsarbete",
    "sentiment" : "MUST_HAVE",
    "type" : "skill",
    "start-position" : 2082,
    "end-position" : 2099,
    "concept-id" : "LsGo_Kh2_3kH",
    "matched-string" : "utvecklingsarbete",
    "annotation-id" : 15
  }, {
    "preferred-label" : "noggrannhet",
    "type" : "esco-skill",
    "start-position" : 2309,
    "end-position" : 2317,
    "concept-id" : "mrsW_EkL_KRD",
    "matched-string" : "Noggrann",
    "annotation-id" : 23
  }, {
    "preferred-label" : "arbeta självständigt",
    "type" : "esco-skill",
    "start-position" : 2354,
    "end-position" : 2374,
    "concept-id" : "NyFu_HHd_zhz",
    "matched-string" : "arbeta självständigt",
    "annotation-id" : 24
  }, {
    "preferred-label" : "Heltid",
    "type" : "worktime-extent",
    "start-position" : 2562,
    "end-position" : 2568,
    "concept-id" : "6YE1_gAC_R2G",
    "matched-string" : "heltid",
    "annotation-id" : 25
  }, {
    "preferred-label" : "Tillsvidareanställning (inkl. eventuell provanställning)",
    "type" : "employment-type",
    "start-position" : 2570,
    "end-position" : 2581,
    "concept-id" : "kpPX_CNN_gDU",
    "matched-string" : "tillsvidare",
    "annotation-id" : 26
  }, {
    "preferred-label" : "visa ansvarstagande",
    "type" : "esco-skill",
    "start-position" : 2736,
    "end-position" : 2750,
    "concept-id" : "bcRp_hxV_f5G",
    "matched-string" : "ansvarstagande",
    "annotation-id" : 27
  }, {
    "preferred-label" : "rekryteringskonsult",
    "sentiment" : "MUST_HAVE",
    "type" : "esco-occupation",
    "start-position" : 3266,
    "end-position" : 3285,
    "concept-id" : "tGyt_via_HNb",
    "matched-string" : "rekryteringskonsult",
    "annotation-id" : 18
  } ],
  "text" : "Analytisk kemist till Analytisk Utveckling på APL i Stockholm\nAPL, Apotek Produktion & Laboratorier AB, är en av Europas största tillverkare av extempore(individanpassade) läkemedel. APL är också en ledande kontraktstillverkare inom Life Science i Skandinavien med resurser för utveckling, tillverkning och analys av läkemedel. APLs dryga 500 medarbetare är verksamma vid fyra produktionsanläggningar runt om i Sverige. APL har till uppgift att tillverka extemporeläkemedel som skräddarsys för den enskilde patienten. Många beredningar görs till barn och till patienter med olika typer av överkänslighet. APL bidrar till läkemedel som förbättrar och räddar liv.\n\nLäs gärna mer på www.apl.se\r\n\r\nLockas du av varierande och stimulerande arbetsuppgifter, där självledarskap är en viktig pusselbit? Då är det till APL du ska söka dig och där du kommer att trivas!\n\nPositionen är placerad på sektionen Analytisk Utveckling (AU) i Kungens kurva. AU ansvarar för metodutvecklingar och valideringar för nya produkter, produktvårdsutredringar, och utvecklingsuppdrag till både interna och externa kunder. AU stödjer i detta arbete samtligas APLs anläggningar. AU hanterar även stabilitetsstudier samt frisläppningsanalyser av kliniskt prövningsmaterial.\n\n \n\nTjänsten\n\nRollen är bred och mycket utvecklande och intressant! Det ingå exempelvis att vara analysrepresentant i utvecklingsprojekt både i interna och externa projekt, leda, delta i samt koordinera projektarbeten för metod och analysutveckling, rapportskrivning och resultatrapportering i LIMS\n\nDessutom kommer rollen innehålla:\n\n * Laborativt arbete såsom metodutveckling och validering av kemiska analysmetoder, analyser av olika typer av prover enligt fastställda metoder, främst med HPLC/UPLC men även andra tekniker såsom GC, frisättning, titreringar, UV och FTIR.\n * Produktvårdsarbete och utredningsarbete\n * Ansvara för delar av Analytisk Utvecklings analysinstrument och/eller gemensamma arbetsuppgifter\n\nDin bakgrund och profil\n\nDu har en akademisk examen med inriktning mot analytisk kemi samt har arbetat med analys och utvecklingsarbete inom läkemedelsindustrin i några år.\n\nErfarenhet från arbete med metodutveckling och validering av kromatografiska metoder samt att planera och utföra stabilitetsstudier är meriterande.\n\nSom person är du:\n\n * Noggrann och analytisk\n * Du har förmåga att arbeta självständigt såväl som i grupp\n * Tycker om att nätverka, söka information, samt att arbeta tvärfunktionellt med människor i olika funktioner\n * Ödmjuk och vågar be om hjälp\n\nVi erbjuder\n\nTjänsten är heltid, tillsvidare med start efter överenskommelse.\n\nAPL kännetecknas av en öppen och dynamisk atmosfär med korta beslutsvägar. Affärsmässig, lyhörd, lösningsorienterad och ansvarstagande är några av de ledord som APLs chefer och medarbetare arbetar efter och för att du ska trivas bör dessa värderingar även passa in på dig.\n\n \n\nAnsökan och kontakt?\n\n \n I den här rekryteringen samarbetar APL med Jefferson Wells, du ansöker med ett uppdaterat CV och personligt brev. Vi arbetar med löpande urval, därför uppmuntrar vi dig att skicka in din ansökan så snart som möjligt även om urval och intervjuer kommer att påbörjas i mitten av augusti.\n\nHar du frågor avseende tjänsten är du välkommen att kontakta rekryteringskonsult Håkan Kempel på 0730-211 833 eller via mail till hakan.kempel@jeffersonwells.se .\n\nAnsökan görs via länken. Vi tar inte emot ansökningar via e-mail.\n\n \n\nÖvrigt\n\nAPL genomför en alkohol-/drogtest samt bakgrundskontroll på slutkandidat."
}