{
  "meta" : {
    "jobad" : {
      "description" : {
        "requirements" : null,
        "needs" : null,
        "company_information" : null,
        "text_formatted" : "Cuckoo’s Nest är en restaurang & bar och en mötesplats för visionärer och drömmare, kreatörer och tvärtomtänkare, innovatörer och möjlighetsmänniskor. Beläget i Radisson Blu Riverside Hotel på Lindholmen, Göteborg.\nAtt Cuckoo’s Nest är en plats där man befinner sig i gränslandet mellan genialitet och galenskap avspeglar sig i allt från inredning till servicen till våra gäster. Restaurangen är tvåfaldig vinnare av priset Europas Bästa Bar.\n\nEftersom gränsen mellan genialitet och galenskap är hårfin, döpte vi restaurangen till Cuckoo’s Nest. Vi tror att du kommer att känna dig som hemma.\n\nRadisson Blu är ett internationellt varumärke med hotell världen över och vad är det inte som säger att detta kan vara en dörr ut i världen.\n\nNu söker vi dig som är passionerad, driven och älskar människor, du är inte rädd att bjuda på dig själv för att skapa en oförglömlig gästupplevelse. Du gillar att jobba i ett tight team, samt självständigt på din station som du tar dig an med stort ansvar\nDu kan jobba flexibelt både kvällar och helger.\nDu kommer att ingå i ett härligt team där vi tillsammans skapar en fantastisk arbetsplats och mötesplats för våra gäster. Du bjuder på dig själv, är engagerad i kollegor och gäster på hotellet och har alltid nära till skratt.\n\nFör att söka detta jobb bör du ha ett par års erfarenhet inom restaurangyrket och\na la cartéservering, ordningsam, ansvarsfull tillsammans med en fantastisk personlighet. Naturligtvis älskar du mat & dryck i kombination och att alltid ge det extra till våra gäster.\n\nAnställningsform: 100% start mitten av Juli\nIntervjuer kommer att ske löpande under perioden.\nLön enligt överenskommelse\n\nTycker du att det här låter spännande så passa på och sök.\nHos oss har du massa kul förmåner! Bara inte förmånen att arbeta med grymma kollegor utan även ett av världens största hotellvarumärke. Du har fina personalpriser världen över och även chansen att göra karriär ute i världen på något av våra hotell. Du har även fina förmåner på Winn hotell groups hotell, friskvårdsbidrag och massa fina utbildningar.\n\nHotellet ägs och drivs av  Winn Hotel Group AB (https://www.winn.se/) som äger, driver och utvecklar hotell med personlighet, engagemang och glädje.\n\nWinn Hotel Group driver även sina egna affärsakademi kallad  Winn Business School (https://www.winn.se/winn-business-school/).",
        "conditions" : "Heltid\r\nAnställningstid enligt överenskommelse",
        "text" : "Cuckoo’s Nest är en restaurang & bar och en mötesplats för visionärer och drömmare, kreatörer och tvärtomtänkare, innovatörer och möjlighetsmänniskor. Beläget i Radisson Blu Riverside Hotel på Lindholmen, Göteborg.\nAtt Cuckoo’s Nest är en plats där man befinner sig i gränslandet mellan genialitet och galenskap avspeglar sig i allt från inredning till servicen till våra gäster. Restaurangen är tvåfaldig vinnare av priset Europas Bästa Bar.\n\nEftersom gränsen mellan genialitet och galenskap är hårfin, döpte vi restaurangen till Cuckoo’s Nest. Vi tror att du kommer att känna dig som hemma.\n\nRadisson Blu är ett internationellt varumärke med hotell världen över och vad är det inte som säger att detta kan vara en dörr ut i världen.\n\nNu söker vi dig som är passionerad, driven och älskar människor, du är inte rädd att bjuda på dig själv för att skapa en oförglömlig gästupplevelse. Du gillar att jobba i ett tight team, samt självständigt på din station som du tar dig an med stort ansvar\nDu kan jobba flexibelt både kvällar och helger.\nDu kommer att ingå i ett härligt team där vi tillsammans skapar en fantastisk arbetsplats och mötesplats för våra gäster. Du bjuder på dig själv, är engagerad i kollegor och gäster på hotellet och har alltid nära till skratt.\n\nFör att söka detta jobb bör du ha ett par års erfarenhet inom restaurangyrket och\na la cartéservering, ordningsam, ansvarsfull tillsammans med en fantastisk personlighet. Naturligtvis älskar du mat & dryck i kombination och att alltid ge det extra till våra gäster.\n\nAnställningsform: 100% start mitten av Juli\nIntervjuer kommer att ske löpande under perioden.\nLön enligt överenskommelse\n\nTycker du att det här låter spännande så passa på och sök.\nHos oss har du massa kul förmåner! Bara inte förmånen att arbeta med grymma kollegor utan även ett av världens största hotellvarumärke. Du har fina personalpriser världen över och även chansen att göra karriär ute i världen på något av våra hotell. Du har även fina förmåner på Winn hotell groups hotell, friskvårdsbidrag och massa fina utbildningar.\n\nHotellet ägs och drivs av  Winn Hotel Group AB (https://www.winn.se/) som äger, driver och utvecklar hotell med personlighet, engagemang och glädje.\n\nWinn Hotel Group driver även sina egna affärsakademi kallad  Winn Business School (https://www.winn.se/winn-business-school/)."
      },
      "headline" : "Servispersonal 100% -  Cuckoo's Nest Restaurang & Bar",
      "driving_license" : null,
      "employer" : {
        "email" : null,
        "phone_number" : null,
        "organization_number" : "5564223096",
        "name" : "Winn Hotel Group AB",
        "url" : "http://www.winn.se/",
        "workplace" : "Winn Hotel Group AB"
      },
      "removed_date" : null,
      "logo_url" : null,
      "last_publication_date" : "2022-08-31T23:59:59",
      "number_of_vacancies" : 1,
      "occupation" : {
        "concept_id" : "rGGf_KLs_To7",
        "label" : "Servitör/Servitris",
        "legacy_ams_taxonomy_id" : "5487"
      },
      "occupation_group" : {
        "concept_id" : "UjoW_meY_Zwt",
        "label" : "Hovmästare och servitörer",
        "legacy_ams_taxonomy_id" : "5131"
      },
      "employment_type" : {
        "concept_id" : "PFZr_Syz_cUq",
        "label" : "Vanlig anställning",
        "legacy_ams_taxonomy_id" : "1"
      },
      "webpage_url" : "https://arbetsformedlingen.se/platsbanken/annonser/26368128",
      "driving_license_required" : false,
      "application_contacts" : [ {
        "description" : "Josefine Thelin",
        "email" : "josefine.thelin@radissonblu.com",
        "telephone" : null,
        "name" : null,
        "contact_type" : null
      } ],
      "duration" : {
        "concept_id" : "a7uU_j21_mkL",
        "label" : "Tills vidare",
        "legacy_ams_taxonomy_id" : "1"
      },
      "nice_to_have" : {
        "education_level" : [ ],
        "work_experiences" : [ ],
        "skills" : [ ],
        "education" : [ ],
        "languages" : [ ]
      },
      "application_details" : {
        "via_af" : false,
        "email" : null,
        "other" : null,
        "reference" : null,
        "url" : "https://karriar.winn.se/jobs/1219780-servispersonal-100-cuckoo-s-nest-restaurang-bar?promotion=279824-arbetsformedlingen",
        "information" : null
      },
      "source_type" : "VIA_PLATSBANKEN_DXA",
      "application_deadline" : "2022-08-31T23:59:59",
      "external_id" : "46-556422-3096-1219780-8",
      "workplace_address" : {
        "coordinates" : [ 11.97456, 57.70887 ],
        "city" : null,
        "postcode" : null,
        "municipality" : "Göteborg",
        "region_concept_id" : "zdoY_6u5_Krt",
        "region" : "Västra Götalands län",
        "country_code" : "199",
        "region_code" : "14",
        "municipality_concept_id" : "PVZL_BQT_XtL",
        "country_concept_id" : "i46j_HmG_v64",
        "municipality_code" : "1480",
        "street_address" : null,
        "country" : "Sverige"
      },
      "id" : "26368128",
      "experience_required" : true,
      "working_hours_type" : {
        "concept_id" : "6YE1_gAC_R2G",
        "label" : "Heltid",
        "legacy_ams_taxonomy_id" : "1"
      },
      "access" : null,
      "timestamp" : 1659354804893,
      "must_have" : {
        "education_level" : [ ],
        "work_experiences" : [ {
          "concept_id" : "rGGf_KLs_To7",
          "weight" : 10,
          "label" : "Servitör/Servitris",
          "legacy_ams_taxonomy_id" : "5487"
        } ],
        "skills" : [ ],
        "education" : [ ],
        "languages" : [ ]
      },
      "occupation_field" : {
        "concept_id" : "ScKy_FHB_7wT",
        "label" : "Hotell, restaurang, storhushåll",
        "legacy_ams_taxonomy_id" : "7"
      },
      "scope_of_work" : {
        "min" : 100,
        "max" : 100
      },
      "salary_type" : {
        "concept_id" : "oG8G_9cW_nRf",
        "label" : "Fast månads- vecko- eller timlön",
        "legacy_ams_taxonomy_id" : "1"
      },
      "removed" : false,
      "salary_description" : "Lön enligt överenskommelse",
      "access_to_own_car" : false,
      "publication_date" : "2022-08-01T13:53:24"
    },
    "name" : "Servispersonal 100% -  Cuckoo's Nest Restaurang & Bar",
    "user" : "hannes"
  },
  "sha1" : "8dc47e8ceedb5d83cb5d18176d5a6334f0677d2d",
  "annotations" : [ {
    "preferred-label" : "Serveringspersonal",
    "type" : "keyword",
    "start-position" : 0,
    "end-position" : 14,
    "concept-id" : "VqRa_738_v98",
    "matched-string" : "Servispersonal",
    "annotation-id" : 9
  }, {
    "preferred-label" : "Heltid",
    "type" : "worktime-extent",
    "start-position" : 15,
    "end-position" : 19,
    "concept-id" : "6YE1_gAC_R2G",
    "matched-string" : "100%",
    "annotation-id" : 8
  }, {
    "preferred-label" : "Restaurang",
    "sentiment" : "MUST_HAVE",
    "type" : "keyword",
    "start-position" : 37,
    "end-position" : 47,
    "concept-id" : "o2Cg_3Ap_qvK",
    "matched-string" : "restaurang",
    "annotation-id" : 0
  }, {
    "preferred-label" : "Restaurang",
    "sentiment" : "MUST_HAVE",
    "type" : "keyword",
    "start-position" : 74,
    "end-position" : 84,
    "concept-id" : "o2Cg_3Ap_qvK",
    "matched-string" : "restaurang",
    "annotation-id" : 1
  }, {
    "preferred-label" : "Göteborg",
    "type" : "municipality",
    "start-position" : 259,
    "end-position" : 267,
    "concept-id" : "PVZL_BQT_XtL",
    "matched-string" : "Göteborg",
    "annotation-id" : 10
  }, {
    "preferred-label" : "Restaurang",
    "type" : "keyword",
    "start-position" : 434,
    "end-position" : 446,
    "concept-id" : "o2Cg_3Ap_qvK",
    "matched-string" : "Restaurangen",
    "annotation-id" : 11
  }, {
    "preferred-label" : "Hotell",
    "sentiment" : "MUST_HAVE",
    "type" : "keyword",
    "start-position" : 698,
    "end-position" : 704,
    "concept-id" : "Jrrg_iiS_2yp",
    "matched-string" : "hotell",
    "annotation-id" : 3
  }, {
    "preferred-label" : "arbeta självständigt",
    "type" : "esco-skill",
    "start-position" : 982,
    "end-position" : 995,
    "concept-id" : "NyFu_HHd_zhz",
    "matched-string" : "självständigt",
    "annotation-id" : 12
  }, {
    "preferred-label" : "Heltid",
    "type" : "worktime-extent",
    "start-position" : 1606,
    "end-position" : 1610,
    "concept-id" : "6YE1_gAC_R2G",
    "matched-string" : "100%",
    "annotation-id" : 13
  }, {
    "preferred-label" : "Hotell",
    "sentiment" : "MUST_HAVE",
    "type" : "keyword",
    "start-position" : 2010,
    "end-position" : 2016,
    "concept-id" : "Jrrg_iiS_2yp",
    "matched-string" : "hotell",
    "annotation-id" : 4
  }, {
    "preferred-label" : "Hotell",
    "sentiment" : "MUST_HAVE",
    "type" : "keyword",
    "start-position" : 2052,
    "end-position" : 2058,
    "concept-id" : "Jrrg_iiS_2yp",
    "matched-string" : "hotell",
    "annotation-id" : 5
  }, {
    "preferred-label" : "Hotell",
    "sentiment" : "MUST_HAVE",
    "type" : "keyword",
    "start-position" : 2066,
    "end-position" : 2072,
    "concept-id" : "Jrrg_iiS_2yp",
    "matched-string" : "hotell",
    "annotation-id" : 6
  }, {
    "preferred-label" : "Hotell",
    "sentiment" : "MUST_HAVE",
    "type" : "keyword",
    "start-position" : 2222,
    "end-position" : 2228,
    "concept-id" : "Jrrg_iiS_2yp",
    "matched-string" : "hotell",
    "annotation-id" : 7
  } ],
  "text" : "Servispersonal 100% -  Cuckoo's Nest Restaurang & Bar\nCuckoo’s Nest är en restaurang & bar och en mötesplats för visionärer och drömmare, kreatörer och tvärtomtänkare, innovatörer och möjlighetsmänniskor. Beläget i Radisson Blu Riverside Hotel på Lindholmen, Göteborg.\nAtt Cuckoo’s Nest är en plats där man befinner sig i gränslandet mellan genialitet och galenskap avspeglar sig i allt från inredning till servicen till våra gäster. Restaurangen är tvåfaldig vinnare av priset Europas Bästa Bar.\n\nEftersom gränsen mellan genialitet och galenskap är hårfin, döpte vi restaurangen till Cuckoo’s Nest. Vi tror att du kommer att känna dig som hemma.\n\nRadisson Blu är ett internationellt varumärke med hotell världen över och vad är det inte som säger att detta kan vara en dörr ut i världen.\n\nNu söker vi dig som är passionerad, driven och älskar människor, du är inte rädd att bjuda på dig själv för att skapa en oförglömlig gästupplevelse. Du gillar att jobba i ett tight team, samt självständigt på din station som du tar dig an med stort ansvar\nDu kan jobba flexibelt både kvällar och helger.\nDu kommer att ingå i ett härligt team där vi tillsammans skapar en fantastisk arbetsplats och mötesplats för våra gäster. Du bjuder på dig själv, är engagerad i kollegor och gäster på hotellet och har alltid nära till skratt.\n\nFör att söka detta jobb bör du ha ett par års erfarenhet inom restaurangyrket och\na la cartéservering, ordningsam, ansvarsfull tillsammans med en fantastisk personlighet. Naturligtvis älskar du mat & dryck i kombination och att alltid ge det extra till våra gäster.\n\nAnställningsform: 100% start mitten av Juli\nIntervjuer kommer att ske löpande under perioden.\nLön enligt överenskommelse\n\nTycker du att det här låter spännande så passa på och sök.\nHos oss har du massa kul förmåner! Bara inte förmånen att arbeta med grymma kollegor utan även ett av världens största hotellvarumärke. Du har fina personalpriser världen över och även chansen att göra karriär ute i världen på något av våra hotell. Du har även fina förmåner på Winn hotell groups hotell, friskvårdsbidrag och massa fina utbildningar.\n\nHotellet ägs och drivs av  Winn Hotel Group AB (https://www.winn.se/) som äger, driver och utvecklar hotell med personlighet, engagemang och glädje.\n\nWinn Hotel Group driver även sina egna affärsakademi kallad  Winn Business School (https://www.winn.se/winn-business-school/)."
}