{
  "meta" : {
    "jobad" : {
      "description" : {
        "requirements" : null,
        "needs" : null,
        "company_information" : null,
        "text_formatted" : "SEN STREET KTICHEN är ett restaurangkoncept som återskapar de autentiska smakerna, dofterna och känslorna vid de livliga gatumarknader och precis som alla andra gatukök över hela östra Asien. Enkelt, snabbt, nyttigt och fräscht.\n\nVem söker vi?\n\nVi söker dig som är glad, utåtriktad och brinner för att kunna leverera service på högsta nivå. Du ska kunna hålla flera bollar i luften under stressiga situationer, ha god samarbetsförmåga och det är viktigt att du trivs att arbeta i restaurangmiljön.\n\nVem är du?\n\nOavsett om du är erfaren eller mindre erfaren, så är du välkommen att lämna in en ansökan. Vi ger utbildning på plats, det viktiga är att du har ett starkt engagemang och viljan att lära dig nya saker. Social och lätt för att prata.\n\nArbetsuppgifter:\n\n- Ta beställningar av gäst.\n- Vara ansiktet utåt för företaget och våra kunder.\n- Kassahantering.\n- Städ och disk.\n\n\nVälkommen med din ansökan så berättar jag mer för dig!",
        "conditions" : "Deltid\r\nAnställningstid enligt överenskommelse",
        "text" : "SEN STREET KTICHEN är ett restaurangkoncept som återskapar de autentiska smakerna, dofterna och känslorna vid de livliga gatumarknader och precis som alla andra gatukök över hela östra Asien. Enkelt, snabbt, nyttigt och fräscht.\n\nVem söker vi?\n\nVi söker dig som är glad, utåtriktad och brinner för att kunna leverera service på högsta nivå. Du ska kunna hålla flera bollar i luften under stressiga situationer, ha god samarbetsförmåga och det är viktigt att du trivs att arbeta i restaurangmiljön.\n\nVem är du?\n\nOavsett om du är erfaren eller mindre erfaren, så är du välkommen att lämna in en ansökan. Vi ger utbildning på plats, det viktiga är att du har ett starkt engagemang och viljan att lära dig nya saker. Social och lätt för att prata.\n\nArbetsuppgifter:\n\n- Ta beställningar av gäst.\n- Vara ansiktet utåt för företaget och våra kunder.\n- Kassahantering.\n- Städ och disk.\n\n\nVälkommen med din ansökan så berättar jag mer för dig!"
      },
      "headline" : "Kassabiträde till SEN Street kitchen - ASECS",
      "driving_license" : null,
      "employer" : {
        "email" : null,
        "phone_number" : null,
        "organization_number" : "5569970113",
        "name" : "Se ngroup AB",
        "url" : "http://www.example.com",
        "workplace" : "SENGROUP"
      },
      "removed_date" : null,
      "logo_url" : "https://www.arbetsformedlingen.se/rest/arbetsgivare/rest/af/v3/organisation/5569970113/logotyper/logo.png",
      "last_publication_date" : "2023-01-26T23:59:59",
      "number_of_vacancies" : 1,
      "occupation" : {
        "concept_id" : "yXRQ_Ad9_E8V",
        "label" : "Restaurangbiträde",
        "legacy_ams_taxonomy_id" : "5555"
      },
      "occupation_group" : {
        "concept_id" : "tPox_ie4_X9X",
        "label" : "Restaurang- och köksbiträden m.fl.",
        "legacy_ams_taxonomy_id" : "9412"
      },
      "employment_type" : {
        "concept_id" : "PFZr_Syz_cUq",
        "label" : "Vanlig anställning",
        "legacy_ams_taxonomy_id" : "1"
      },
      "webpage_url" : "https://arbetsformedlingen.se/platsbanken/annonser/26390268",
      "driving_license_required" : false,
      "application_contacts" : [ {
        "description" : "Ida Fjellström",
        "email" : null,
        "telephone" : null,
        "name" : null,
        "contact_type" : null
      } ],
      "duration" : {
        "concept_id" : "qQUd_4qe_NDT",
        "label" : "6 månader eller längre",
        "legacy_ams_taxonomy_id" : "2"
      },
      "nice_to_have" : {
        "education_level" : [ ],
        "work_experiences" : [ ],
        "skills" : [ ],
        "education" : [ ],
        "languages" : [ ]
      },
      "application_details" : {
        "via_af" : false,
        "email" : null,
        "other" : null,
        "reference" : null,
        "url" : "https://jobs.sengroup.se/jobs/1863488-kassabitrade-till-sen-street-kitchen-asecs?promotion=433662-arbetsformedlingen",
        "information" : null
      },
      "source_type" : "VIA_PLATSBANKEN_DXA",
      "application_deadline" : "2023-01-26T23:59:59",
      "external_id" : "46-556997-0113-1863488-13",
      "workplace_address" : {
        "coordinates" : [ 14.161788, 57.78261 ],
        "city" : null,
        "postcode" : null,
        "municipality" : "Jönköping",
        "region_concept_id" : "MtbE_xWT_eMi",
        "region" : "Jönköpings län",
        "country_code" : "199",
        "region_code" : "06",
        "municipality_concept_id" : "KURg_KJF_Lwc",
        "country_concept_id" : "i46j_HmG_v64",
        "municipality_code" : "0680",
        "street_address" : null,
        "country" : "Sverige"
      },
      "id" : "26390268",
      "experience_required" : false,
      "working_hours_type" : {
        "concept_id" : "947z_JGS_Uk2",
        "label" : "Deltid",
        "legacy_ams_taxonomy_id" : "2"
      },
      "access" : null,
      "timestamp" : 1660033204850,
      "must_have" : {
        "education_level" : [ ],
        "work_experiences" : [ ],
        "skills" : [ ],
        "education" : [ ],
        "languages" : [ ]
      },
      "occupation_field" : {
        "concept_id" : "ScKy_FHB_7wT",
        "label" : "Hotell, restaurang, storhushåll",
        "legacy_ams_taxonomy_id" : "7"
      },
      "scope_of_work" : {
        "min" : 0,
        "max" : 100
      },
      "salary_type" : {
        "concept_id" : "oG8G_9cW_nRf",
        "label" : "Fast månads- vecko- eller timlön",
        "legacy_ams_taxonomy_id" : "1"
      },
      "removed" : false,
      "salary_description" : "Lön enligt överenskommelse",
      "access_to_own_car" : false,
      "publication_date" : "2022-08-09T10:20:04"
    },
    "name" : "Kassabiträde till SEN Street kitchen - ASECS",
    "user" : "hannes"
  },
  "sha1" : "bc56472e83ce5e32d54247e7f96c2ca2caa49c8e",
  "annotations" : [ {
    "preferred-label" : "Kassapersonal",
    "type" : "occupation-name",
    "start-position" : 0,
    "end-position" : 12,
    "concept-id" : "j8X2_KhG_6ty",
    "matched-string" : "Kassabiträde",
    "annotation-id" : 1
  }, {
    "preferred-label" : "Gatukök",
    "sentiment" : "MUST_HAVE",
    "type" : "skill",
    "start-position" : 206,
    "end-position" : 213,
    "concept-id" : "dmi6_Jfs_pso",
    "matched-string" : "gatukök",
    "annotation-id" : 0
  }, {
    "preferred-label" : "sköta en kassa",
    "type" : "esco-skill",
    "start-position" : 890,
    "end-position" : 904,
    "concept-id" : "USNU_LMY_prY",
    "matched-string" : "Kassahantering",
    "annotation-id" : 2
  } ],
  "text" : "Kassabiträde till SEN Street kitchen - ASECS\nSEN STREET KTICHEN är ett restaurangkoncept som återskapar de autentiska smakerna, dofterna och känslorna vid de livliga gatumarknader och precis som alla andra gatukök över hela östra Asien. Enkelt, snabbt, nyttigt och fräscht.\n\nVem söker vi?\n\nVi söker dig som är glad, utåtriktad och brinner för att kunna leverera service på högsta nivå. Du ska kunna hålla flera bollar i luften under stressiga situationer, ha god samarbetsförmåga och det är viktigt att du trivs att arbeta i restaurangmiljön.\n\nVem är du?\n\nOavsett om du är erfaren eller mindre erfaren, så är du välkommen att lämna in en ansökan. Vi ger utbildning på plats, det viktiga är att du har ett starkt engagemang och viljan att lära dig nya saker. Social och lätt för att prata.\n\nArbetsuppgifter:\n\n- Ta beställningar av gäst.\n- Vara ansiktet utåt för företaget och våra kunder.\n- Kassahantering.\n- Städ och disk.\n\n\nVälkommen med din ansökan så berättar jag mer för dig!"
}