{
  "meta" : {
    "jobad" : {
      "description" : {
        "requirements" : null,
        "needs" : null,
        "company_information" : null,
        "text_formatted" : "Kura Omsorg i Sverige AB fokuserar på att sätta kunden i centrum och att det ska vara roligt att gå till jobbet.\n\nOM TJÄNSTEN\n\nJust nu söker vi efter flera kvinnliga personliga assistenter som vill arbeta tillsammans med en lekfull tjej bosatt i centrala Karlstad. Tjänsten innebär att du arbetar som timvikarie åt vår kund, vilket innebär att du får själv ansöka om arbetspass och hoppa in vid behov. Vi söker därför efter dig som är en flexibel person som är villig att ställa upp för att stötta upp arbetsgruppen. Tillträde sker enligt överenskommelse men vi ser gärna att du kan börja inskolas omgående.\n\nArbetstiden är förlagd på vardagar 07:00-14:00 & 14:00-21:00.\n\nArbetstiden är förlag på helger 08:00-15:00 & 15:00 - 21:00\n\nOM KUNDEN\n\nVår kund är en flicka som är 15 år gammal och bor tillsammans med sin familj i centrala Karlstad. Tjejen är väldigt aktiv av sig och gillar att hitta på saker, exempelvis gillar hon att vara ute i naturen för att leka, titta på filmer och göra utflykter. Vår kund har en stark vilja och det är viktigt att du som assistent kan fatta beslut som är väl genomtänkta. I arbetet igår bland annat personlig hygien och du ska vara ett stöd i hennes vardag.\n\nVEM SÖKER VI?\n\nSom person bör du vara lyhörd, positiv, ha bra tålamod och kunna hålla fokus i ditt arbete. Då du kommer spendera mycket tid med kunden på egen hand ser vi gärna att du är trygg i dig själv och känner dig bekväm med arbeta självständigt. Vi söker dig som har kompetensen att balansera mellan lekfullhet och ansvarstagande samt lättsamhet och gränssättning. Den personliga kemin är avgörande.\n\nKVALIFIKATIONER\n- Körkort och gärna tillgång till egen bil\n\n- Erfarenhet av tecken med stöd/ eller att du är intresserad av att lära dig det\n\n- Du måste ha ett registerutdrag för att arbeta med barn, detta behövs innan anställning kan påbörjas.\n\n- Du har ett stort tålamod och är tydlig i ditt ledarskap\n\n- Du har god fysik\n\nRekrytering kommer påbörjas under ansökningsprocessen så vänta inte med att ansöka!\n\nATT ARBETA PÅ KURA OMSORG\n\nSom anställd personlig assistent hos oss omfattas du av kollektivavtal samt avtalspension. Du är försäkrad på och till/från arbetet om något oförutsett skulle inträffa. Vi erbjuder friskvårdsbidrag till alla våra anställda. Dessutom anordnar vi aktiviteter som riktar sig både till dig som anställd och till kunden du arbetar med. Vi är måna om att du som medarbetare ska trivas hos oss!",
        "conditions" : "Deltid\r\nAnställningstid enligt överenskommelse",
        "text" : "Kura Omsorg i Sverige AB fokuserar på att sätta kunden i centrum och att det ska vara roligt att gå till jobbet.\n\nOM TJÄNSTEN\n\nJust nu söker vi efter flera kvinnliga personliga assistenter som vill arbeta tillsammans med en lekfull tjej bosatt i centrala Karlstad. Tjänsten innebär att du arbetar som timvikarie åt vår kund, vilket innebär att du får själv ansöka om arbetspass och hoppa in vid behov. Vi söker därför efter dig som är en flexibel person som är villig att ställa upp för att stötta upp arbetsgruppen. Tillträde sker enligt överenskommelse men vi ser gärna att du kan börja inskolas omgående.\n\nArbetstiden är förlagd på vardagar 07:00-14:00 & 14:00-21:00.\n\nArbetstiden är förlag på helger 08:00-15:00 & 15:00 - 21:00\n\nOM KUNDEN\n\nVår kund är en flicka som är 15 år gammal och bor tillsammans med sin familj i centrala Karlstad. Tjejen är väldigt aktiv av sig och gillar att hitta på saker, exempelvis gillar hon att vara ute i naturen för att leka, titta på filmer och göra utflykter. Vår kund har en stark vilja och det är viktigt att du som assistent kan fatta beslut som är väl genomtänkta. I arbetet igår bland annat personlig hygien och du ska vara ett stöd i hennes vardag.\n\nVEM SÖKER VI?\n\nSom person bör du vara lyhörd, positiv, ha bra tålamod och kunna hålla fokus i ditt arbete. Då du kommer spendera mycket tid med kunden på egen hand ser vi gärna att du är trygg i dig själv och känner dig bekväm med arbeta självständigt. Vi söker dig som har kompetensen att balansera mellan lekfullhet och ansvarstagande samt lättsamhet och gränssättning. Den personliga kemin är avgörande.\n\nKVALIFIKATIONER\n- Körkort och gärna tillgång till egen bil\n\n- Erfarenhet av tecken med stöd/ eller att du är intresserad av att lära dig det\n\n- Du måste ha ett registerutdrag för att arbeta med barn, detta behövs innan anställning kan påbörjas.\n\n- Du har ett stort tålamod och är tydlig i ditt ledarskap\n\n- Du har god fysik\n\nRekrytering kommer påbörjas under ansökningsprocessen så vänta inte med att ansöka!\n\nATT ARBETA PÅ KURA OMSORG\n\nSom anställd personlig assistent hos oss omfattas du av kollektivavtal samt avtalspension. Du är försäkrad på och till/från arbetet om något oförutsett skulle inträffa. Vi erbjuder friskvårdsbidrag till alla våra anställda. Dessutom anordnar vi aktiviteter som riktar sig både till dig som anställd och till kunden du arbetar med. Vi är måna om att du som medarbetare ska trivas hos oss!"
      },
      "headline" : "Kvinnlig personlig assistent till lekfull tjej i Karlstad",
      "driving_license" : null,
      "employer" : {
        "email" : null,
        "phone_number" : null,
        "organization_number" : "5567337364",
        "name" : "Kura Omsorg i Sverige AB",
        "url" : "https://kuraomsorg.se",
        "workplace" : "Kura Omsorg"
      },
      "removed_date" : null,
      "logo_url" : "https://www.arbetsformedlingen.se/rest/arbetsgivare/rest/af/v3/organisation/5567337364/logotyper/logo.png",
      "last_publication_date" : "2022-08-14T23:59:59",
      "number_of_vacancies" : 1,
      "occupation" : {
        "concept_id" : "eU1q_zvL_9Rf",
        "label" : "Personlig assistent",
        "legacy_ams_taxonomy_id" : "5798"
      },
      "occupation_group" : {
        "concept_id" : "sq3e_WVv_Fjd",
        "label" : "Personliga assistenter",
        "legacy_ams_taxonomy_id" : "5343"
      },
      "employment_type" : {
        "concept_id" : "PFZr_Syz_cUq",
        "label" : "Vanlig anställning",
        "legacy_ams_taxonomy_id" : "1"
      },
      "webpage_url" : "https://arbetsformedlingen.se/platsbanken/annonser/26372802",
      "driving_license_required" : false,
      "application_contacts" : [ {
        "description" : "Jessica Wessman",
        "email" : "jessica.wessman@kuraomsorg.se",
        "telephone" : null,
        "name" : null,
        "contact_type" : null
      } ],
      "duration" : {
        "concept_id" : "a7uU_j21_mkL",
        "label" : "Tills vidare",
        "legacy_ams_taxonomy_id" : "1"
      },
      "nice_to_have" : {
        "education_level" : [ ],
        "work_experiences" : [ ],
        "skills" : [ ],
        "education" : [ ],
        "languages" : [ ]
      },
      "application_details" : {
        "via_af" : false,
        "email" : null,
        "other" : null,
        "reference" : null,
        "url" : "https://kuraomsorg.teamtailor.com/jobs/1902240-kvinnlig-personlig-assistent-till-lekfull-tjej-i-karlstad?promotion=443458-arbetsformedlingen",
        "information" : null
      },
      "source_type" : "VIA_PLATSBANKEN_DXA",
      "application_deadline" : "2022-08-14T23:59:59",
      "external_id" : "46-556733-7364-1902240-35",
      "workplace_address" : {
        "coordinates" : [ 13.500804, 59.379135 ],
        "city" : null,
        "postcode" : null,
        "municipality" : "Karlstad",
        "region_concept_id" : "EVVp_h6U_GSZ",
        "region" : "Värmlands län",
        "country_code" : "199",
        "region_code" : "17",
        "municipality_concept_id" : "hRDj_PoV_sFU",
        "country_concept_id" : "i46j_HmG_v64",
        "municipality_code" : "1780",
        "street_address" : null,
        "country" : "Sverige"
      },
      "id" : "26372802",
      "experience_required" : false,
      "working_hours_type" : {
        "concept_id" : "947z_JGS_Uk2",
        "label" : "Deltid",
        "legacy_ams_taxonomy_id" : "2"
      },
      "access" : null,
      "timestamp" : 1659457187436,
      "must_have" : {
        "education_level" : [ ],
        "work_experiences" : [ ],
        "skills" : [ ],
        "education" : [ ],
        "languages" : [ ]
      },
      "occupation_field" : {
        "concept_id" : "GazW_2TU_kJw",
        "label" : "Yrken med social inriktning",
        "legacy_ams_taxonomy_id" : "16"
      },
      "scope_of_work" : {
        "min" : 0,
        "max" : 100
      },
      "salary_type" : {
        "concept_id" : "oG8G_9cW_nRf",
        "label" : "Fast månads- vecko- eller timlön",
        "legacy_ams_taxonomy_id" : "1"
      },
      "removed" : false,
      "salary_description" : "Lön enligt överenskommelse",
      "access_to_own_car" : false,
      "publication_date" : "2022-08-02T18:19:47"
    },
    "name" : "Kvinnlig personlig assistent till lekfull tjej i Karlstad",
    "user" : "kristof.fischer"
  },
  "sha1" : "de86b339482461d42524effc3df9a2b6544c3577",
  "annotations" : [ {
    "preferred-label" : "Personlig assistent",
    "sentiment" : "MUST_HAVE",
    "type" : "occupation-name",
    "start-position" : 9,
    "end-position" : 28,
    "concept-id" : "eU1q_zvL_9Rf",
    "matched-string" : "personlig assistent",
    "annotation-id" : 0
  }, {
    "preferred-label" : "Karlstad",
    "type" : "municipality",
    "start-position" : 49,
    "end-position" : 57,
    "concept-id" : "hRDj_PoV_sFU",
    "matched-string" : "Karlstad",
    "annotation-id" : 5
  }, {
    "preferred-label" : "Personlig assistent",
    "sentiment" : "MUST_HAVE",
    "type" : "occupation-name",
    "start-position" : 224,
    "end-position" : 246,
    "concept-id" : "eU1q_zvL_9Rf",
    "matched-string" : "personliga assistenter",
    "annotation-id" : 1
  }, {
    "preferred-label" : "Karlstad",
    "type" : "municipality",
    "start-position" : 313,
    "end-position" : 321,
    "concept-id" : "hRDj_PoV_sFU",
    "matched-string" : "Karlstad",
    "annotation-id" : 6
  }, {
    "preferred-label" : "Behovsanställning",
    "type" : "employment-type",
    "start-position" : 449,
    "end-position" : 458,
    "concept-id" : "1paU_aCR_nGn",
    "matched-string" : "vid behov",
    "annotation-id" : 7
  }, {
    "preferred-label" : "Karlstad",
    "type" : "municipality",
    "start-position" : 890,
    "end-position" : 898,
    "concept-id" : "hRDj_PoV_sFU",
    "matched-string" : "Karlstad",
    "annotation-id" : 8
  }, {
    "preferred-label" : "arbeta självständigt",
    "sentiment" : "MUST_HAVE",
    "type" : "esco-skill",
    "start-position" : 1484,
    "end-position" : 1504,
    "concept-id" : "NyFu_HHd_zhz",
    "matched-string" : "arbeta självständigt",
    "annotation-id" : 9
  }, {
    "preferred-label" : "visa ansvarstagande",
    "sentiment" : "MUST_HAVE",
    "type" : "esco-skill",
    "start-position" : 1575,
    "end-position" : 1589,
    "concept-id" : "bcRp_hxV_f5G",
    "matched-string" : "ansvarstagande",
    "annotation-id" : 10
  }, {
    "preferred-label" : "B",
    "sentiment" : "MUST_HAVE",
    "type" : "driving-licence",
    "start-position" : 1679,
    "end-position" : 1686,
    "concept-id" : "VTK8_WRx_GcM",
    "matched-string" : "Körkort",
    "annotation-id" : 11
  }, {
    "preferred-label" : "God fysik (tunga lyft)",
    "sentiment" : "MUST_HAVE",
    "type" : "skill",
    "start-position" : 1975,
    "end-position" : 1984,
    "concept-id" : "rwir_xvu_443",
    "matched-string" : "god fysik",
    "annotation-id" : 12
  }, {
    "preferred-label" : "Personlig assistent",
    "sentiment" : "MUST_HAVE",
    "type" : "occupation-name",
    "start-position" : 2111,
    "end-position" : 2130,
    "concept-id" : "eU1q_zvL_9Rf",
    "matched-string" : "personlig assistent",
    "annotation-id" : 3
  } ],
  "text" : "Kvinnlig personlig assistent till lekfull tjej i Karlstad\nKura Omsorg i Sverige AB fokuserar på att sätta kunden i centrum och att det ska vara roligt att gå till jobbet.\n\nOM TJÄNSTEN\n\nJust nu söker vi efter flera kvinnliga personliga assistenter som vill arbeta tillsammans med en lekfull tjej bosatt i centrala Karlstad. Tjänsten innebär att du arbetar som timvikarie åt vår kund, vilket innebär att du får själv ansöka om arbetspass och hoppa in vid behov. Vi söker därför efter dig som är en flexibel person som är villig att ställa upp för att stötta upp arbetsgruppen. Tillträde sker enligt överenskommelse men vi ser gärna att du kan börja inskolas omgående.\n\nArbetstiden är förlagd på vardagar 07:00-14:00 & 14:00-21:00.\n\nArbetstiden är förlag på helger 08:00-15:00 & 15:00 - 21:00\n\nOM KUNDEN\n\nVår kund är en flicka som är 15 år gammal och bor tillsammans med sin familj i centrala Karlstad. Tjejen är väldigt aktiv av sig och gillar att hitta på saker, exempelvis gillar hon att vara ute i naturen för att leka, titta på filmer och göra utflykter. Vår kund har en stark vilja och det är viktigt att du som assistent kan fatta beslut som är väl genomtänkta. I arbetet igår bland annat personlig hygien och du ska vara ett stöd i hennes vardag.\n\nVEM SÖKER VI?\n\nSom person bör du vara lyhörd, positiv, ha bra tålamod och kunna hålla fokus i ditt arbete. Då du kommer spendera mycket tid med kunden på egen hand ser vi gärna att du är trygg i dig själv och känner dig bekväm med arbeta självständigt. Vi söker dig som har kompetensen att balansera mellan lekfullhet och ansvarstagande samt lättsamhet och gränssättning. Den personliga kemin är avgörande.\n\nKVALIFIKATIONER\n- Körkort och gärna tillgång till egen bil\n\n- Erfarenhet av tecken med stöd/ eller att du är intresserad av att lära dig det\n\n- Du måste ha ett registerutdrag för att arbeta med barn, detta behövs innan anställning kan påbörjas.\n\n- Du har ett stort tålamod och är tydlig i ditt ledarskap\n\n- Du har god fysik\n\nRekrytering kommer påbörjas under ansökningsprocessen så vänta inte med att ansöka!\n\nATT ARBETA PÅ KURA OMSORG\n\nSom anställd personlig assistent hos oss omfattas du av kollektivavtal samt avtalspension. Du är försäkrad på och till/från arbetet om något oförutsett skulle inträffa. Vi erbjuder friskvårdsbidrag till alla våra anställda. Dessutom anordnar vi aktiviteter som riktar sig både till dig som anställd och till kunden du arbetar med. Vi är måna om att du som medarbetare ska trivas hos oss!"
}