{
  "meta" : {
    "jobad" : {
      "description" : {
        "requirements" : null,
        "needs" : null,
        "company_information" : null,
        "text_formatted" : "Vill du bidra till en bättre miljö och arbeta med problemlösning? Som Kyltekniker till Indoor Energy får du en viktig och meningsfull roll med stor frihet i ett företag som arbetar med att förbättra sina kunders inomhusklimat med lägre energiförbrukning.\n\nOm tjänsten\nIndoor Energy är kompetensmässigt Sveriges femte största kylföretag. De hanterar allt från glassfrysarna på Preem till de gigantiska industriella applikationer som styr kylan i nya Karolinska Sjukhuset. Deras metod utgår från en helhetssyn där kyla, värme, ventilation och styr- och reglerteknik samverkar för ett inomhusklimat med lägre energiförbrukning.\n\nIndoor Energy önskar nu utöka sitt nuvarande team i södra Stockholm med en positiv person med stort eget driv. Tjänsten kommer innebära att du självständigt ska planera, samordna och utföra serviceuppdrag och driftunderhåll med fokus på kyla åt Indoor Energys kunder vilket innebär stor frihet under ansvar. Kontoret ligger i Skarpnäck men du kommer att få en servicebil som du kan utgå hemifrån med. Majoriteten av uppdragen är i södra Stockholm, men det kan förekomma att du ibland stöttar upp på andra upptagningsområden. På Indoor är det viktigt med personlig utveckling och det finns stora möjligheter till både vidareutbildningar och att utvecklas internt.\n\nDetta är en direktrekrytering till Indoor Energy där Wrknest sköter rekryteringsprocessen.\n\nDina framtida arbetsuppgifter\nRollen som Klimattekniker med inriktning kyla kommer innebära att ta hand om Indoor Energys befintliga serviceavtalskunder. Arbetsuppgifterna kommer exempelvis att innebära:\n\n- Planera, samordna och utföra serviceuppdrag och övrigt driftunderhåll åt Indoor Energys kunder i såväl förebyggande som felavhjälpande syfte.\n- Felsökning och mindre montage\n- Stötta kollegor med din specialistkompetens inom kylteknik\n- Proaktivt föreslå förbättringar i kundernas anläggningar för att minska energianvändningen samt förebygga icke planerade stopp.\n\n\nVi söker dig som har\n\n- Kylcertifikat\n- B-körkort\n- Flytande kunskaper i svenska i tal och skrift\n\n\nVid denna rekrytering lägger vi stor vikt vid dina personliga egenskaper, då de är avgörande för hur du kommer att lyckas i rollen och företaget. Vi förstår att man inte kan allting från början - men du ska ha en vilja att lära dig! Därför söker vi dig som är social, flexibel och ansvarstagande. Som person är du även noggrann i ditt arbete och serviceinriktad i din kontakt med kunder och kollegor.\n\nÖvrig information\n\nStart: Enligt överenskommelse\n\nPlats: Stockholm, Skarpnäck\n\nOmfattning: Heltid, 40h/ vecka\n\nAnställningsform: Tillsvidareanställning\n\nSök gärna så snart som möjligt då vi jobbar med löpande urval.",
        "conditions" : "Heltid\r\nAnställningstid enligt överenskommelse",
        "text" : "Vill du bidra till en bättre miljö och arbeta med problemlösning? Som Kyltekniker till Indoor Energy får du en viktig och meningsfull roll med stor frihet i ett företag som arbetar med att förbättra sina kunders inomhusklimat med lägre energiförbrukning.\n\nOm tjänsten\nIndoor Energy är kompetensmässigt Sveriges femte största kylföretag. De hanterar allt från glassfrysarna på Preem till de gigantiska industriella applikationer som styr kylan i nya Karolinska Sjukhuset. Deras metod utgår från en helhetssyn där kyla, värme, ventilation och styr- och reglerteknik samverkar för ett inomhusklimat med lägre energiförbrukning.\n\nIndoor Energy önskar nu utöka sitt nuvarande team i södra Stockholm med en positiv person med stort eget driv. Tjänsten kommer innebära att du självständigt ska planera, samordna och utföra serviceuppdrag och driftunderhåll med fokus på kyla åt Indoor Energys kunder vilket innebär stor frihet under ansvar. Kontoret ligger i Skarpnäck men du kommer att få en servicebil som du kan utgå hemifrån med. Majoriteten av uppdragen är i södra Stockholm, men det kan förekomma att du ibland stöttar upp på andra upptagningsområden. På Indoor är det viktigt med personlig utveckling och det finns stora möjligheter till både vidareutbildningar och att utvecklas internt.\n\nDetta är en direktrekrytering till Indoor Energy där Wrknest sköter rekryteringsprocessen.\n\nDina framtida arbetsuppgifter\nRollen som Klimattekniker med inriktning kyla kommer innebära att ta hand om Indoor Energys befintliga serviceavtalskunder. Arbetsuppgifterna kommer exempelvis att innebära:\n\n- Planera, samordna och utföra serviceuppdrag och övrigt driftunderhåll åt Indoor Energys kunder i såväl förebyggande som felavhjälpande syfte.\n- Felsökning och mindre montage\n- Stötta kollegor med din specialistkompetens inom kylteknik\n- Proaktivt föreslå förbättringar i kundernas anläggningar för att minska energianvändningen samt förebygga icke planerade stopp.\n\n\nVi söker dig som har\n\n- Kylcertifikat\n- B-körkort\n- Flytande kunskaper i svenska i tal och skrift\n\n\nVid denna rekrytering lägger vi stor vikt vid dina personliga egenskaper, då de är avgörande för hur du kommer att lyckas i rollen och företaget. Vi förstår att man inte kan allting från början - men du ska ha en vilja att lära dig! Därför söker vi dig som är social, flexibel och ansvarstagande. Som person är du även noggrann i ditt arbete och serviceinriktad i din kontakt med kunder och kollegor.\n\nÖvrig information\n\nStart: Enligt överenskommelse\n\nPlats: Stockholm, Skarpnäck\n\nOmfattning: Heltid, 40h/ vecka\n\nAnställningsform: Tillsvidareanställning\n\nSök gärna så snart som möjligt då vi jobbar med löpande urval."
      },
      "headline" : "Klimattekniker/kyltekniker till Indoor Energy 🔧",
      "driving_license" : null,
      "employer" : {
        "email" : null,
        "phone_number" : null,
        "organization_number" : "5592932213",
        "name" : "Wrknest AB",
        "url" : "http://www.wrknest.se",
        "workplace" : "Wrknest"
      },
      "removed_date" : null,
      "logo_url" : null,
      "last_publication_date" : "2022-12-21T23:59:59",
      "number_of_vacancies" : 1,
      "occupation" : {
        "concept_id" : "JM78_Rwi_sHx",
        "label" : "Kylmontör/Kyltekniker",
        "legacy_ams_taxonomy_id" : "5819"
      },
      "occupation_group" : {
        "concept_id" : "3UzE_P8A_9sS",
        "label" : "Kyl- och värmepumpstekniker m.fl.",
        "legacy_ams_taxonomy_id" : "7126"
      },
      "employment_type" : {
        "concept_id" : "PFZr_Syz_cUq",
        "label" : "Vanlig anställning",
        "legacy_ams_taxonomy_id" : "1"
      },
      "webpage_url" : "https://arbetsformedlingen.se/platsbanken/annonser/26287402",
      "driving_license_required" : false,
      "application_contacts" : [ {
        "description" : "Linnea Neldemo",
        "email" : null,
        "telephone" : null,
        "name" : null,
        "contact_type" : null
      } ],
      "duration" : {
        "concept_id" : "a7uU_j21_mkL",
        "label" : "Tills vidare",
        "legacy_ams_taxonomy_id" : "1"
      },
      "nice_to_have" : {
        "education_level" : [ ],
        "work_experiences" : [ ],
        "skills" : [ ],
        "education" : [ ],
        "languages" : [ ]
      },
      "application_details" : {
        "via_af" : false,
        "email" : null,
        "other" : null,
        "reference" : null,
        "url" : "https://careers.wrknest.se/jobs/1863759-klimattekniker-kyltekniker-till-indoor-energy?promotion=434333-arbetsformedlingen",
        "information" : null
      },
      "source_type" : "VIA_PLATSBANKEN_DXA",
      "application_deadline" : "2022-12-21T23:59:59",
      "external_id" : "46-559293-2213-1863759-7",
      "workplace_address" : {
        "coordinates" : [ 18.06858, 59.329323 ],
        "city" : null,
        "postcode" : null,
        "municipality" : "Stockholm",
        "region_concept_id" : "CifL_Rzy_Mku",
        "region" : "Stockholms län",
        "country_code" : "199",
        "region_code" : "01",
        "municipality_concept_id" : "AvNB_uwa_6n6",
        "country_concept_id" : "i46j_HmG_v64",
        "municipality_code" : "0180",
        "street_address" : null,
        "country" : "Sverige"
      },
      "id" : "26287402",
      "experience_required" : true,
      "working_hours_type" : {
        "concept_id" : "6YE1_gAC_R2G",
        "label" : "Heltid",
        "legacy_ams_taxonomy_id" : "1"
      },
      "access" : null,
      "timestamp" : 1656915758199,
      "must_have" : {
        "education_level" : [ ],
        "work_experiences" : [ {
          "concept_id" : "JM78_Rwi_sHx",
          "weight" : 10,
          "label" : "Kylmontör/Kyltekniker",
          "legacy_ams_taxonomy_id" : "5819"
        } ],
        "skills" : [ ],
        "education" : [ ],
        "languages" : [ ]
      },
      "occupation_field" : {
        "concept_id" : "j7Cq_ZJe_GkT",
        "label" : "Bygg och anläggning",
        "legacy_ams_taxonomy_id" : "2"
      },
      "scope_of_work" : {
        "min" : 100,
        "max" : 100
      },
      "salary_type" : {
        "concept_id" : "oG8G_9cW_nRf",
        "label" : "Fast månads- vecko- eller timlön",
        "legacy_ams_taxonomy_id" : "1"
      },
      "removed" : false,
      "salary_description" : "Lön enligt överenskommelse",
      "access_to_own_car" : false,
      "publication_date" : "2022-07-04T08:22:38"
    },
    "name" : "Klimattekniker/kyltekniker till Indoor Energy 🔧",
    "user" : "hannes"
  },
  "sha1" : "0faff9de0372b8ff13dbc6a621ce0c25c1003187",
  "annotations" : [ {
    "preferred-label" : "Klimatteknik",
    "type" : "skill",
    "start-position" : 0,
    "end-position" : 14,
    "concept-id" : "VvvT_DJ3_aPH",
    "matched-string" : "Klimattekniker",
    "annotation-id" : 7
  }, {
    "preferred-label" : "Kylmontör/Kyltekniker",
    "sentiment" : "MUST_HAVE",
    "type" : "occupation-name",
    "start-position" : 15,
    "end-position" : 26,
    "concept-id" : "JM78_Rwi_sHx",
    "matched-string" : "kyltekniker",
    "annotation-id" : 0
  }, {
    "preferred-label" : "Kylmontör/Kyltekniker",
    "sentiment" : "MUST_HAVE",
    "type" : "occupation-name",
    "start-position" : 119,
    "end-position" : 130,
    "concept-id" : "JM78_Rwi_sHx",
    "matched-string" : "kyltekniker",
    "annotation-id" : 1
  }, {
    "preferred-label" : "Sverige",
    "type" : "country",
    "start-position" : 351,
    "end-position" : 359,
    "concept-id" : "i46j_HmG_v64",
    "matched-string" : "Sveriges",
    "annotation-id" : 8
  }, {
    "preferred-label" : "Styr- och reglerteknik",
    "sentiment" : "MUST_HAVE",
    "type" : "skill",
    "start-position" : 590,
    "end-position" : 612,
    "concept-id" : "Udbb_Eay_MuR",
    "matched-string" : "styr- och reglerteknik",
    "annotation-id" : 2
  }, {
    "preferred-label" : "Stockholm",
    "type" : "municipality",
    "start-position" : 733,
    "end-position" : 742,
    "concept-id" : "AvNB_uwa_6n6",
    "matched-string" : "Stockholm",
    "annotation-id" : 9
  }, {
    "preferred-label" : "arbeta självständigt",
    "type" : "esco-skill",
    "start-position" : 818,
    "end-position" : 831,
    "concept-id" : "NyFu_HHd_zhz",
    "matched-string" : "självständigt",
    "annotation-id" : 10
  }, {
    "preferred-label" : "Installation, drift, underhåll",
    "type" : "occupation-field",
    "start-position" : 884,
    "end-position" : 898,
    "concept-id" : "yhCP_AqT_tns",
    "matched-string" : "driftunderhåll",
    "annotation-id" : 11
  }, {
    "preferred-label" : "Stockholm",
    "type" : "municipality",
    "start-position" : 1112,
    "end-position" : 1121,
    "concept-id" : "AvNB_uwa_6n6",
    "matched-string" : "Stockholm",
    "annotation-id" : 12
  }, {
    "preferred-label" : "personlig utveckling",
    "sentiment" : "MUST_HAVE",
    "type" : "esco-skill",
    "start-position" : 1229,
    "end-position" : 1249,
    "concept-id" : "wkQj_Dah_2GD",
    "matched-string" : "personlig utveckling",
    "annotation-id" : 3
  }, {
    "preferred-label" : "Klimatteknik",
    "type" : "skill",
    "start-position" : 1472,
    "end-position" : 1486,
    "concept-id" : "VvvT_DJ3_aPH",
    "matched-string" : "Klimattekniker",
    "annotation-id" : 13
  }, {
    "preferred-label" : "Energi, drift och underhåll",
    "type" : "sun-education-field-4",
    "start-position" : 1693,
    "end-position" : 1707,
    "concept-id" : "6V78_5GY_XTu",
    "matched-string" : "driftunderhåll",
    "annotation-id" : 14
  }, {
    "preferred-label" : "göra felsökning",
    "type" : "esco-skill",
    "start-position" : 1782,
    "end-position" : 1792,
    "concept-id" : "HqC8_fVY_ACM",
    "matched-string" : "Felsökning",
    "annotation-id" : 15
  }, {
    "preferred-label" : "Kylteknik",
    "sentiment" : "MUST_HAVE",
    "type" : "skill",
    "start-position" : 1863,
    "end-position" : 1872,
    "concept-id" : "11L4_Q2Z_8tM",
    "matched-string" : "kylteknik",
    "annotation-id" : 4
  }, {
    "preferred-label" : "Kylcertifikat",
    "sentiment" : "MUST_HAVE",
    "type" : "skill",
    "start-position" : 2029,
    "end-position" : 2042,
    "concept-id" : "VWmQ_9fd_GLL",
    "matched-string" : "kylcertifikat",
    "annotation-id" : 5
  }, {
    "preferred-label" : "B",
    "type" : "driving-licence",
    "start-position" : 2045,
    "end-position" : 2054,
    "concept-id" : "VTK8_WRx_GcM",
    "matched-string" : "B-körkort",
    "annotation-id" : 16
  }, {
    "preferred-label" : "Svenska",
    "sentiment" : "MUST_HAVE",
    "type" : "language",
    "start-position" : 2078,
    "end-position" : 2085,
    "concept-id" : "zSLA_vw2_FXN",
    "matched-string" : "svenska",
    "annotation-id" : 6
  }, {
    "preferred-label" : "visa professionellt ansvarstagande",
    "type" : "esco-skill",
    "start-position" : 2386,
    "end-position" : 2400,
    "concept-id" : "DRjM_LSF_w8x",
    "matched-string" : "ansvarstagande",
    "annotation-id" : 17
  }, {
    "preferred-label" : "noggrannhet",
    "type" : "esco-skill",
    "start-position" : 2424,
    "end-position" : 2432,
    "concept-id" : "mrsW_EkL_KRD",
    "matched-string" : "noggrann",
    "annotation-id" : 18
  }, {
    "preferred-label" : "Stockholm",
    "type" : "municipality",
    "start-position" : 2564,
    "end-position" : 2573,
    "concept-id" : "AvNB_uwa_6n6",
    "matched-string" : "Stockholm",
    "annotation-id" : 19
  }, {
    "preferred-label" : "Heltid",
    "type" : "worktime-extent",
    "start-position" : 2598,
    "end-position" : 2616,
    "concept-id" : "6YE1_gAC_R2G",
    "matched-string" : "Heltid, 40h/ vecka",
    "annotation-id" : 20
  }, {
    "preferred-label" : "Tillsvidareanställning (inkl. eventuell provanställning)",
    "type" : "employment-type",
    "start-position" : 2636,
    "end-position" : 2658,
    "concept-id" : "kpPX_CNN_gDU",
    "matched-string" : "Tillsvidareanställning",
    "annotation-id" : 21
  } ],
  "text" : "Klimattekniker/kyltekniker till Indoor Energy 🔧\nVill du bidra till en bättre miljö och arbeta med problemlösning? Som Kyltekniker till Indoor Energy får du en viktig och meningsfull roll med stor frihet i ett företag som arbetar med att förbättra sina kunders inomhusklimat med lägre energiförbrukning.\n\nOm tjänsten\nIndoor Energy är kompetensmässigt Sveriges femte största kylföretag. De hanterar allt från glassfrysarna på Preem till de gigantiska industriella applikationer som styr kylan i nya Karolinska Sjukhuset. Deras metod utgår från en helhetssyn där kyla, värme, ventilation och styr- och reglerteknik samverkar för ett inomhusklimat med lägre energiförbrukning.\n\nIndoor Energy önskar nu utöka sitt nuvarande team i södra Stockholm med en positiv person med stort eget driv. Tjänsten kommer innebära att du självständigt ska planera, samordna och utföra serviceuppdrag och driftunderhåll med fokus på kyla åt Indoor Energys kunder vilket innebär stor frihet under ansvar. Kontoret ligger i Skarpnäck men du kommer att få en servicebil som du kan utgå hemifrån med. Majoriteten av uppdragen är i södra Stockholm, men det kan förekomma att du ibland stöttar upp på andra upptagningsområden. På Indoor är det viktigt med personlig utveckling och det finns stora möjligheter till både vidareutbildningar och att utvecklas internt.\n\nDetta är en direktrekrytering till Indoor Energy där Wrknest sköter rekryteringsprocessen.\n\nDina framtida arbetsuppgifter\nRollen som Klimattekniker med inriktning kyla kommer innebära att ta hand om Indoor Energys befintliga serviceavtalskunder. Arbetsuppgifterna kommer exempelvis att innebära:\n\n- Planera, samordna och utföra serviceuppdrag och övrigt driftunderhåll åt Indoor Energys kunder i såväl förebyggande som felavhjälpande syfte.\n- Felsökning och mindre montage\n- Stötta kollegor med din specialistkompetens inom kylteknik\n- Proaktivt föreslå förbättringar i kundernas anläggningar för att minska energianvändningen samt förebygga icke planerade stopp.\n\n\nVi söker dig som har\n\n- Kylcertifikat\n- B-körkort\n- Flytande kunskaper i svenska i tal och skrift\n\n\nVid denna rekrytering lägger vi stor vikt vid dina personliga egenskaper, då de är avgörande för hur du kommer att lyckas i rollen och företaget. Vi förstår att man inte kan allting från början - men du ska ha en vilja att lära dig! Därför söker vi dig som är social, flexibel och ansvarstagande. Som person är du även noggrann i ditt arbete och serviceinriktad i din kontakt med kunder och kollegor.\n\nÖvrig information\n\nStart: Enligt överenskommelse\n\nPlats: Stockholm, Skarpnäck\n\nOmfattning: Heltid, 40h/ vecka\n\nAnställningsform: Tillsvidareanställning\n\nSök gärna så snart som möjligt då vi jobbar med löpande urval."
}