{
  "meta" : {
    "jobad" : {
      "description" : {
        "requirements" : null,
        "needs" : null,
        "company_information" : null,
        "text_formatted" : "Akutkliniken Mälarsjukhuset Eskilstuna\r\n\r\nVälkommen att skapa Sveriges friskaste län tillsammans med oss!\n\n\n\"Redan under min praktik väcktes mitt intresse för akutsjukvård. Det varierande arbetet, att man får en bred grund att stå på och sammanhållningen! Man känner sig aldrig ensam och vi har roligt på jobbet\" Lovisa Englund sjuksköterska.\n\nOm oss\nHar du intresse för akutsjukvård och söker en arbetsplats där du kan utvecklas i din roll som sjuksköterska och få en bred kompetens? Då är akutvårdsavdelningen rätt arbetsplats för dig. Vi söker nu nya kollegor!\n\nAkutvårdsavdelningen (AVA) och intermediärvårdsavdelningen (IMA) är en del av akutkliniken. En klinik i ständig utveckling där stort fokus ligger på utvecklings- och förbättringsarbete. En del av detta är planeringen för det nya akuthuset som byggs på Mälarsjukhuset.\n\nAVA är en akutvårdsavdelning vilket innebär att patienterna vårdas en kortare tid hos oss. Vi samarbetar med många olika professioner vilket ger en god kompensutveckling för våra medarbetare. Du kommer ha ett nära samarbete med läkare från olika specialiteter, fysioterapeut, kurator, arbetsterapeut och dietist.\n\nIMA är en avdelning med högre vårdnivå som ligger integrerad på AVA. Här vårdas patienter med svikt i vitala funktioner som behöver tätare övervakningsbehov och andra insatser. Vi har b.la andningsstöd och artärnål. För att jobba på IMA behöver man erfarenhet av akutsjukvård - exempelvis AVA - och utbildning av våra utbildningssköterskor. I dagsläget har IMA fyra vårdplatser öppna men vi rekryterar nu med målet att kunna öppna fyra platser till.\n\nVi erbjuder: \nIndividuellt anpassad inskolning med vårdledare som följer upp dig både under och efter avslutad inskolning.\nIndividuell schemaplanering.\nFokus på utbildning och kompetensförsörjning. Vi har egna utbildningssköterskor som har utbildningar och utbildningsplaner.\nEn arbetsmiljö där stöd av kollegor är en självklarhet. Teamkänslan är en central del hos oss och tack vare att vi är en stor avdelning finns det alltid möjlighet att få stöd från flera andra kollegor. Du behöver aldrig känna dig ensam!\nVi strävar mot en personcentrerad vård och använder oss därför av funktioner för att avlasta sjuksköterskan tex utskrivningssamordnare, farmaceutiskt stöd etc. Detta för att du ska kunna arbeta så nära dina patienter som möjligt.\nMöjlighet att utvecklas inom samma klinik under flera år. Rotationstjänst mot akutmottagningen- AVA-IMA.\nVill du ta steget och fördjupa dig mer inom akutsjukvård finns möjligheten till betald specialistutbildning!\n\nDina arbetsuppgifter\nDu arbetar med att övervaka, behandla, utreda och i möjligaste mån färdigbehandla patienterna. Vanliga sjukdomstillstånd hos våra patienter är bröstsmärta, kramper, andningsbesvär, intoxikationer, buksmärta, blödningar och infektioner. Arbetet är mycket varierande då vårdtiderna är korta och ingen dag är den andra lik. Hos oss får du en bred grund att stå på!\n\nDin kompetens\nVi söker dig som är legitimerad sjuksköterska. Erfarenhet av akutsjukvård är meriterande men inget krav. Det viktigaste är att du är en person som trivs med varierande arbetsuppgifter, med ett intresse av att lära dig nya saker, har god samarbetsförmåga och trivs med teamarbete. Vi lägger stor vikt vid personliga egenskaper.\n\nAnställningsform\nTillsvidareanställning med tillträde enligt överenskommelse. Dag-, kväll- och nattjänstgöring.\nDu är välkommen att hospitera på AVA/IMA för att träffa oss och få en inblick i akutsjukvården.\n\nInformation om tjänsten lämnas av\nVårdenhetschef Sofie Saamel, 016-10 43 72.\nBiträdande vårdenhetschef Annika Forssman, 016-10 39 16.\nFackliga företrädare söks via kontaktcenter, 0155-24 50 00.\n\n\nKom och jobba hos oss på akutvårdsavdelningen/intermediärvårdsavdelningen!\n\n\nVälkommen med din ansökan, inklusive CV, senast 2022-07-31.\nIntervjuer kan komma att ske löpande.\n\nSe våra förmåner (http://regionsormland.se/jobb-och-utbildning/vara-formaner/)\n\nFölj oss gärna på Facebook (http://facebook.com/regionsormlandJobbahososs/)\n\r\n\nVi har i vissa fall skyldighet att kontrollera om en person förekommer i misstanke- och eller belastningsregistret. Det kan ske på två sätt, endera begär regionen ut uppgiften själv eller också uppmanas du att begära ut utdrag för att kunna visa upp innan anställning. Vi begär i undantagsfall att du visar upp registerutdrag även vid tillsättning av andra tjänster än de som avses ovan. Blir du aktuell för anställning kommer du att informeras om vad som gäller för den tjänst du sökt.\n\nVi gör aktiva val vid exponering och rekryteringsstöd och undanber oss därför direktkontakt av bemannings- och rekryteringsföretag.",
        "conditions" : "Tillsvidare, 100%, Tillträde enligt överenskommelse\r\n\n-",
        "text" : "Akutkliniken Mälarsjukhuset Eskilstuna\r\n\r\nVälkommen att skapa Sveriges friskaste län tillsammans med oss!\n\n\n\"Redan under min praktik väcktes mitt intresse för akutsjukvård. Det varierande arbetet, att man får en bred grund att stå på och sammanhållningen! Man känner sig aldrig ensam och vi har roligt på jobbet\" Lovisa Englund sjuksköterska.\n\nOm oss\nHar du intresse för akutsjukvård och söker en arbetsplats där du kan utvecklas i din roll som sjuksköterska och få en bred kompetens? Då är akutvårdsavdelningen rätt arbetsplats för dig. Vi söker nu nya kollegor!\n\nAkutvårdsavdelningen (AVA) och intermediärvårdsavdelningen (IMA) är en del av akutkliniken. En klinik i ständig utveckling där stort fokus ligger på utvecklings- och förbättringsarbete. En del av detta är planeringen för det nya akuthuset som byggs på Mälarsjukhuset.\n\nAVA är en akutvårdsavdelning vilket innebär att patienterna vårdas en kortare tid hos oss. Vi samarbetar med många olika professioner vilket ger en god kompensutveckling för våra medarbetare. Du kommer ha ett nära samarbete med läkare från olika specialiteter, fysioterapeut, kurator, arbetsterapeut och dietist.\n\nIMA är en avdelning med högre vårdnivå som ligger integrerad på AVA. Här vårdas patienter med svikt i vitala funktioner som behöver tätare övervakningsbehov och andra insatser. Vi har b.la andningsstöd och artärnål. För att jobba på IMA behöver man erfarenhet av akutsjukvård - exempelvis AVA - och utbildning av våra utbildningssköterskor. I dagsläget har IMA fyra vårdplatser öppna men vi rekryterar nu med målet att kunna öppna fyra platser till.\n\nVi erbjuder: \nIndividuellt anpassad inskolning med vårdledare som följer upp dig både under och efter avslutad inskolning.\nIndividuell schemaplanering.\nFokus på utbildning och kompetensförsörjning. Vi har egna utbildningssköterskor som har utbildningar och utbildningsplaner.\nEn arbetsmiljö där stöd av kollegor är en självklarhet. Teamkänslan är en central del hos oss och tack vare att vi är en stor avdelning finns det alltid möjlighet att få stöd från flera andra kollegor. Du behöver aldrig känna dig ensam!\nVi strävar mot en personcentrerad vård och använder oss därför av funktioner för att avlasta sjuksköterskan tex utskrivningssamordnare, farmaceutiskt stöd etc. Detta för att du ska kunna arbeta så nära dina patienter som möjligt.\nMöjlighet att utvecklas inom samma klinik under flera år. Rotationstjänst mot akutmottagningen- AVA-IMA.\nVill du ta steget och fördjupa dig mer inom akutsjukvård finns möjligheten till betald specialistutbildning!\n\nDina arbetsuppgifter\nDu arbetar med att övervaka, behandla, utreda och i möjligaste mån färdigbehandla patienterna. Vanliga sjukdomstillstånd hos våra patienter är bröstsmärta, kramper, andningsbesvär, intoxikationer, buksmärta, blödningar och infektioner. Arbetet är mycket varierande då vårdtiderna är korta och ingen dag är den andra lik. Hos oss får du en bred grund att stå på!\n\nDin kompetens\nVi söker dig som är legitimerad sjuksköterska. Erfarenhet av akutsjukvård är meriterande men inget krav. Det viktigaste är att du är en person som trivs med varierande arbetsuppgifter, med ett intresse av att lära dig nya saker, har god samarbetsförmåga och trivs med teamarbete. Vi lägger stor vikt vid personliga egenskaper.\n\nAnställningsform\nTillsvidareanställning med tillträde enligt överenskommelse. Dag-, kväll- och nattjänstgöring.\nDu är välkommen att hospitera på AVA/IMA för att träffa oss och få en inblick i akutsjukvården.\n\nInformation om tjänsten lämnas av\nVårdenhetschef Sofie Saamel, 016-10 43 72.\nBiträdande vårdenhetschef Annika Forssman, 016-10 39 16.\nFackliga företrädare söks via kontaktcenter, 0155-24 50 00.\n\n\nKom och jobba hos oss på akutvårdsavdelningen/intermediärvårdsavdelningen!\n\n\nVälkommen med din ansökan, inklusive CV, senast 2022-07-31.\nIntervjuer kan komma att ske löpande.\n\nSe våra förmåner (http://regionsormland.se/jobb-och-utbildning/vara-formaner/)\n\nFölj oss gärna på Facebook (http://facebook.com/regionsormlandJobbahososs/)\n\r\n\nVi har i vissa fall skyldighet att kontrollera om en person förekommer i misstanke- och eller belastningsregistret. Det kan ske på två sätt, endera begär regionen ut uppgiften själv eller också uppmanas du att begära ut utdrag för att kunna visa upp innan anställning. Vi begär i undantagsfall att du visar upp registerutdrag även vid tillsättning av andra tjänster än de som avses ovan. Blir du aktuell för anställning kommer du att informeras om vad som gäller för den tjänst du sökt.\n\nVi gör aktiva val vid exponering och rekryteringsstöd och undanber oss därför direktkontakt av bemannings- och rekryteringsföretag."
      },
      "headline" : "Sjuksköterska till akutvårdsavdelningen AVA/intermediärvårdsavdelningen IMA",
      "driving_license" : null,
      "employer" : {
        "email" : null,
        "phone_number" : null,
        "organization_number" : "2321000032",
        "name" : "REGION SÖRMLAND",
        "url" : null,
        "workplace" : "Region Sörmland"
      },
      "removed_date" : null,
      "logo_url" : "https://www.arbetsformedlingen.se/rest/arbetsgivare/rest/af/v3/organisation/2321000032/logotyper/logo.png",
      "last_publication_date" : "2022-07-31T23:59:59",
      "number_of_vacancies" : 1,
      "occupation" : {
        "concept_id" : "bXNH_MNX_dUR",
        "label" : "Sjuksköterska, grundutbildad",
        "legacy_ams_taxonomy_id" : "7296"
      },
      "occupation_group" : {
        "concept_id" : "Z8ci_bBE_tmx",
        "label" : "Grundutbildade sjuksköterskor",
        "legacy_ams_taxonomy_id" : "2221"
      },
      "employment_type" : {
        "concept_id" : "PFZr_Syz_cUq",
        "label" : "Vanlig anställning",
        "legacy_ams_taxonomy_id" : "1"
      },
      "webpage_url" : "https://arbetsformedlingen.se/platsbanken/annonser/26280338",
      "driving_license_required" : false,
      "application_contacts" : [ ],
      "duration" : {
        "concept_id" : "a7uU_j21_mkL",
        "label" : "Tills vidare",
        "legacy_ams_taxonomy_id" : "1"
      },
      "nice_to_have" : {
        "education_level" : [ ],
        "work_experiences" : [ ],
        "skills" : [ ],
        "education" : [ ],
        "languages" : [ ]
      },
      "application_details" : {
        "via_af" : false,
        "email" : null,
        "other" : null,
        "reference" : "RLSV-22-408",
        "url" : "https://sormland.powerinit.com/Modules/Recruitments/Public/?JobPositionId=21580&RefNo=RLSV-22-408",
        "information" : null
      },
      "source_type" : "VIA_PLATSBANKEN_DXA",
      "application_deadline" : "2022-07-31T23:59:59",
      "external_id" : "46-232100-0032-21580",
      "workplace_address" : {
        "coordinates" : [ 16.509804, 59.37125 ],
        "city" : null,
        "postcode" : null,
        "municipality" : "Eskilstuna",
        "region_concept_id" : "s93u_BEb_sx2",
        "region" : "Södermanlands län",
        "country_code" : "199",
        "region_code" : "04",
        "municipality_concept_id" : "kMxr_NiX_YrU",
        "country_concept_id" : "i46j_HmG_v64",
        "municipality_code" : "0484",
        "street_address" : null,
        "country" : "Sverige"
      },
      "id" : "26280338",
      "experience_required" : true,
      "working_hours_type" : {
        "concept_id" : "6YE1_gAC_R2G",
        "label" : "Heltid",
        "legacy_ams_taxonomy_id" : "1"
      },
      "access" : null,
      "timestamp" : 1656655928790,
      "must_have" : {
        "education_level" : [ ],
        "work_experiences" : [ {
          "concept_id" : "bXNH_MNX_dUR",
          "weight" : 10,
          "label" : "Sjuksköterska, grundutbildad",
          "legacy_ams_taxonomy_id" : "7296"
        } ],
        "skills" : [ ],
        "education" : [ ],
        "languages" : [ ]
      },
      "occupation_field" : {
        "concept_id" : "NYW6_mP6_vwf",
        "label" : "Hälso- och sjukvård",
        "legacy_ams_taxonomy_id" : "8"
      },
      "scope_of_work" : {
        "min" : 100,
        "max" : 100
      },
      "salary_type" : {
        "concept_id" : "oG8G_9cW_nRf",
        "label" : "Fast månads- vecko- eller timlön",
        "legacy_ams_taxonomy_id" : "1"
      },
      "removed" : false,
      "salary_description" : "-",
      "access_to_own_car" : false,
      "publication_date" : "2022-07-01T08:12:08"
    },
    "name" : "Sjuksköterska till akutvårdsavdelningen AVA/intermediärvårdsavdelningen IMA",
    "user" : "hannes"
  },
  "sha1" : "ee05e45e7cd7a736ee2e7c12a1f9f332188936d8",
  "annotations" : [ {
    "preferred-label" : "Sjuksköterska",
    "sentiment" : "MUST_HAVE",
    "type" : "keyword",
    "start-position" : 0,
    "end-position" : 13,
    "concept-id" : "jrjV_wcz_fxg",
    "matched-string" : "sjuksköterska",
    "annotation-id" : 0
  }, {
    "preferred-label" : "akutvård",
    "type" : "esco-skill",
    "start-position" : 19,
    "end-position" : 27,
    "concept-id" : "qsst_tTk_cv8",
    "matched-string" : "akutvård",
    "annotation-id" : 18
  }, {
    "preferred-label" : "Eskilstuna",
    "type" : "municipality",
    "start-position" : 104,
    "end-position" : 115,
    "concept-id" : "kMxr_NiX_YrU",
    "matched-string" : "Eskilstuna\r",
    "annotation-id" : 19
  }, {
    "preferred-label" : "Sverige",
    "type" : "country",
    "start-position" : 138,
    "end-position" : 146,
    "concept-id" : "i46j_HmG_v64",
    "matched-string" : "Sveriges",
    "annotation-id" : 20
  }, {
    "preferred-label" : "Akutsjukvård",
    "sentiment" : "MUST_HAVE",
    "type" : "skill",
    "start-position" : 235,
    "end-position" : 247,
    "concept-id" : "azXF_rgu_EWv",
    "matched-string" : "akutsjukvård",
    "annotation-id" : 1
  }, {
    "preferred-label" : "Sjuksköterska",
    "sentiment" : "MUST_HAVE",
    "type" : "keyword",
    "start-position" : 404,
    "end-position" : 417,
    "concept-id" : "jrjV_wcz_fxg",
    "matched-string" : "sjuksköterska",
    "annotation-id" : 2
  }, {
    "preferred-label" : "Akutsjukvård",
    "sentiment" : "MUST_HAVE",
    "type" : "skill",
    "start-position" : 447,
    "end-position" : 459,
    "concept-id" : "azXF_rgu_EWv",
    "matched-string" : "akutsjukvård",
    "annotation-id" : 3
  }, {
    "preferred-label" : "Sjuksköterska",
    "sentiment" : "MUST_HAVE",
    "type" : "keyword",
    "start-position" : 521,
    "end-position" : 534,
    "concept-id" : "jrjV_wcz_fxg",
    "matched-string" : "sjuksköterska",
    "annotation-id" : 4
  }, {
    "preferred-label" : "akutvård",
    "type" : "esco-skill",
    "start-position" : 567,
    "end-position" : 575,
    "concept-id" : "qsst_tTk_cv8",
    "matched-string" : "akutvård",
    "annotation-id" : 21
  }, {
    "preferred-label" : "akutvård",
    "type" : "esco-skill",
    "start-position" : 641,
    "end-position" : 649,
    "concept-id" : "qsst_tTk_cv8",
    "matched-string" : "Akutvård",
    "annotation-id" : 22
  }, {
    "preferred-label" : "akutvård",
    "type" : "esco-skill",
    "start-position" : 920,
    "end-position" : 928,
    "concept-id" : "qsst_tTk_cv8",
    "matched-string" : "akutvård",
    "annotation-id" : 23
  }, {
    "preferred-label" : "läkare",
    "sentiment" : "MUST_HAVE",
    "type" : "esco-occupation",
    "start-position" : 1138,
    "end-position" : 1144,
    "concept-id" : "snUT_QSf_LG9",
    "matched-string" : "läkare",
    "annotation-id" : 5
  }, {
    "preferred-label" : "Fysioterapeut/Sjukgymnast",
    "sentiment" : "MUST_HAVE",
    "type" : "occupation-name",
    "start-position" : 1171,
    "end-position" : 1184,
    "concept-id" : "raVz_oTw_N3e",
    "matched-string" : "fysioterapeut",
    "annotation-id" : 6
  }, {
    "preferred-label" : "Kurator",
    "sentiment" : "MUST_HAVE",
    "type" : "occupation-name",
    "start-position" : 1186,
    "end-position" : 1193,
    "concept-id" : "YpRs_ybt_47a",
    "matched-string" : "kurator",
    "annotation-id" : 7
  }, {
    "preferred-label" : "Arbetsterapeut",
    "sentiment" : "MUST_HAVE",
    "type" : "occupation-name",
    "start-position" : 1195,
    "end-position" : 1209,
    "concept-id" : "heGV_uHh_o8W",
    "matched-string" : "arbetsterapeut",
    "annotation-id" : 8
  }, {
    "preferred-label" : "dietist",
    "sentiment" : "MUST_HAVE",
    "type" : "esco-occupation",
    "start-position" : 1214,
    "end-position" : 1221,
    "concept-id" : "KBEP_U5Y_xLr",
    "matched-string" : "dietist",
    "annotation-id" : 9
  }, {
    "preferred-label" : "Akutsjukvård",
    "sentiment" : "MUST_HAVE",
    "type" : "skill",
    "start-position" : 1487,
    "end-position" : 1499,
    "concept-id" : "azXF_rgu_EWv",
    "matched-string" : "akutsjukvård",
    "annotation-id" : 10
  }, {
    "preferred-label" : "arbetsmiljö",
    "sentiment" : "MUST_HAVE",
    "type" : "esco-skill",
    "start-position" : 1954,
    "end-position" : 1965,
    "concept-id" : "zdQY_QJh_nUH",
    "matched-string" : "arbetsmiljö",
    "annotation-id" : 11
  }, {
    "preferred-label" : "Sjuksköterska",
    "type" : "keyword",
    "start-position" : 2281,
    "end-position" : 2295,
    "concept-id" : "jrjV_wcz_fxg",
    "matched-string" : "sjuksköterskan",
    "annotation-id" : 24
  }, {
    "preferred-label" : "farmaceut",
    "type" : "esco-occupation",
    "start-position" : 2324,
    "end-position" : 2337,
    "concept-id" : "y3gj_k8b_oMw",
    "matched-string" : "farmaceutiskt",
    "annotation-id" : 25
  }, {
    "preferred-label" : "Akutsjukvård",
    "sentiment" : "MUST_HAVE",
    "type" : "skill",
    "start-position" : 2567,
    "end-position" : 2579,
    "concept-id" : "azXF_rgu_EWv",
    "matched-string" : "akutsjukvård",
    "annotation-id" : 12
  }, {
    "preferred-label" : "Sjuksköterska",
    "sentiment" : "MUST_HAVE",
    "type" : "keyword",
    "start-position" : 3063,
    "end-position" : 3076,
    "concept-id" : "jrjV_wcz_fxg",
    "matched-string" : "sjuksköterska",
    "annotation-id" : 13
  }, {
    "preferred-label" : "Akutsjukvård",
    "sentiment" : "MUST_HAVE",
    "type" : "skill",
    "start-position" : 3092,
    "end-position" : 3104,
    "concept-id" : "azXF_rgu_EWv",
    "matched-string" : "akutsjukvård",
    "annotation-id" : 14
  }, {
    "preferred-label" : "Tillsvidareanställning (inkl. eventuell provanställning)",
    "type" : "employment-type",
    "start-position" : 3376,
    "end-position" : 3398,
    "concept-id" : "kpPX_CNN_gDU",
    "matched-string" : "Tillsvidareanställning",
    "annotation-id" : 26
  }, {
    "preferred-label" : "Akutsjukvård",
    "type" : "skill",
    "start-position" : 3551,
    "end-position" : 3565,
    "concept-id" : "azXF_rgu_EWv",
    "matched-string" : "akutsjukvården",
    "annotation-id" : 27
  }, {
    "preferred-label" : "Vårdenhetschef",
    "sentiment" : "MUST_HAVE",
    "type" : "keyword",
    "start-position" : 3602,
    "end-position" : 3616,
    "concept-id" : "KQUX_kug_Ujm",
    "matched-string" : "vårdenhetschef",
    "annotation-id" : 15
  }, {
    "preferred-label" : "Vårdenhetschef",
    "sentiment" : "MUST_HAVE",
    "type" : "keyword",
    "start-position" : 3656,
    "end-position" : 3670,
    "concept-id" : "KQUX_kug_Ujm",
    "matched-string" : "vårdenhetschef",
    "annotation-id" : 16
  }, {
    "preferred-label" : "akutvård",
    "type" : "esco-skill",
    "start-position" : 3789,
    "end-position" : 3797,
    "concept-id" : "qsst_tTk_cv8",
    "matched-string" : "akutvård",
    "annotation-id" : 28
  } ],
  "text" : "Sjuksköterska till akutvårdsavdelningen AVA/intermediärvårdsavdelningen IMA\nAkutkliniken Mälarsjukhuset Eskilstuna\r\n\r\nVälkommen att skapa Sveriges friskaste län tillsammans med oss!\n\n\n\"Redan under min praktik väcktes mitt intresse för akutsjukvård. Det varierande arbetet, att man får en bred grund att stå på och sammanhållningen! Man känner sig aldrig ensam och vi har roligt på jobbet\" Lovisa Englund sjuksköterska.\n\nOm oss\nHar du intresse för akutsjukvård och söker en arbetsplats där du kan utvecklas i din roll som sjuksköterska och få en bred kompetens? Då är akutvårdsavdelningen rätt arbetsplats för dig. Vi söker nu nya kollegor!\n\nAkutvårdsavdelningen (AVA) och intermediärvårdsavdelningen (IMA) är en del av akutkliniken. En klinik i ständig utveckling där stort fokus ligger på utvecklings- och förbättringsarbete. En del av detta är planeringen för det nya akuthuset som byggs på Mälarsjukhuset.\n\nAVA är en akutvårdsavdelning vilket innebär att patienterna vårdas en kortare tid hos oss. Vi samarbetar med många olika professioner vilket ger en god kompensutveckling för våra medarbetare. Du kommer ha ett nära samarbete med läkare från olika specialiteter, fysioterapeut, kurator, arbetsterapeut och dietist.\n\nIMA är en avdelning med högre vårdnivå som ligger integrerad på AVA. Här vårdas patienter med svikt i vitala funktioner som behöver tätare övervakningsbehov och andra insatser. Vi har b.la andningsstöd och artärnål. För att jobba på IMA behöver man erfarenhet av akutsjukvård - exempelvis AVA - och utbildning av våra utbildningssköterskor. I dagsläget har IMA fyra vårdplatser öppna men vi rekryterar nu med målet att kunna öppna fyra platser till.\n\nVi erbjuder: \nIndividuellt anpassad inskolning med vårdledare som följer upp dig både under och efter avslutad inskolning.\nIndividuell schemaplanering.\nFokus på utbildning och kompetensförsörjning. Vi har egna utbildningssköterskor som har utbildningar och utbildningsplaner.\nEn arbetsmiljö där stöd av kollegor är en självklarhet. Teamkänslan är en central del hos oss och tack vare att vi är en stor avdelning finns det alltid möjlighet att få stöd från flera andra kollegor. Du behöver aldrig känna dig ensam!\nVi strävar mot en personcentrerad vård och använder oss därför av funktioner för att avlasta sjuksköterskan tex utskrivningssamordnare, farmaceutiskt stöd etc. Detta för att du ska kunna arbeta så nära dina patienter som möjligt.\nMöjlighet att utvecklas inom samma klinik under flera år. Rotationstjänst mot akutmottagningen- AVA-IMA.\nVill du ta steget och fördjupa dig mer inom akutsjukvård finns möjligheten till betald specialistutbildning!\n\nDina arbetsuppgifter\nDu arbetar med att övervaka, behandla, utreda och i möjligaste mån färdigbehandla patienterna. Vanliga sjukdomstillstånd hos våra patienter är bröstsmärta, kramper, andningsbesvär, intoxikationer, buksmärta, blödningar och infektioner. Arbetet är mycket varierande då vårdtiderna är korta och ingen dag är den andra lik. Hos oss får du en bred grund att stå på!\n\nDin kompetens\nVi söker dig som är legitimerad sjuksköterska. Erfarenhet av akutsjukvård är meriterande men inget krav. Det viktigaste är att du är en person som trivs med varierande arbetsuppgifter, med ett intresse av att lära dig nya saker, har god samarbetsförmåga och trivs med teamarbete. Vi lägger stor vikt vid personliga egenskaper.\n\nAnställningsform\nTillsvidareanställning med tillträde enligt överenskommelse. Dag-, kväll- och nattjänstgöring.\nDu är välkommen att hospitera på AVA/IMA för att träffa oss och få en inblick i akutsjukvården.\n\nInformation om tjänsten lämnas av\nVårdenhetschef Sofie Saamel, 016-10 43 72.\nBiträdande vårdenhetschef Annika Forssman, 016-10 39 16.\nFackliga företrädare söks via kontaktcenter, 0155-24 50 00.\n\n\nKom och jobba hos oss på akutvårdsavdelningen/intermediärvårdsavdelningen!\n\n\nVälkommen med din ansökan, inklusive CV, senast 2022-07-31.\nIntervjuer kan komma att ske löpande.\n\nSe våra förmåner (http://regionsormland.se/jobb-och-utbildning/vara-formaner/)\n\nFölj oss gärna på Facebook (http://facebook.com/regionsormlandJobbahososs/)\n\r\n\nVi har i vissa fall skyldighet att kontrollera om en person förekommer i misstanke- och eller belastningsregistret. Det kan ske på två sätt, endera begär regionen ut uppgiften själv eller också uppmanas du att begära ut utdrag för att kunna visa upp innan anställning. Vi begär i undantagsfall att du visar upp registerutdrag även vid tillsättning av andra tjänster än de som avses ovan. Blir du aktuell för anställning kommer du att informeras om vad som gäller för den tjänst du sökt.\n\nVi gör aktiva val vid exponering och rekryteringsstöd och undanber oss därför direktkontakt av bemannings- och rekryteringsföretag."
}