{
  "meta" : {
    "jobad" : {
      "description" : {
        "requirements" : null,
        "needs" : null,
        "company_information" : null,
        "text_formatted" : "Kriminalvården växer – vi bygger nytt, bygger om och bygger till och söker nu nya medarbetare. Vårt viktigaste mål är att minska återfall i brott – att bryta den onda cirkeln. Lyckas vi med det blir samhället tryggare och säkrare för alla. Vi är den myndighet som ansvarar för anstalter, frivård, häkten och klienttransporter.\n\nVill du veta mer? Hör vad våra medarbetare tycker om att arbeta inom Kriminalvården: https://www.kriminalvarden.se/jobba-hos-oss/ \n\nLäs mer om anstalten Täbys verksamhet på vår hemsida: https://www.kriminalvarden.se/hitta-och-kontakta/verksamhet/anstalt/taby/#om\r\n\r\nARBETSUPPGIFTER\nSom produktionsledare har du direktkontakt med våra klienter i anstaltens produktion. Anstaltens produktion består huvudsakligen av sömnad men även en del montering och förpacknings arbeten. Arbetet innebär handledning i klienternas dagliga arbete.\nEfter introduktion kommer du som produktionsledare att vara med och ansvara för den dagliga verksamheten tillsammans med kollegor.  Du planerar, arbetsfördelar samt säkerställer att våra leveranser sker enligt avtal.\nTjänsten innebär inget personalansvar utan endast arbetsledning av de intagna.\n\r\n\r\nKVALIFIKATIONER\nDu  är trygg, stabil och har självinsikt. Du har lätt för att samarbeta med andra människor och har väl grundade och tydliga värderingar. I stressituationer är du lugn, stabil och kontrollerad. Du har förmågan att göra korrekta avvägningar och prioriteringar. Du har god förståelse för hur människan tar till sig kunskap och anpassar ditt sätt att förmedla budskap utifrån mottagares förutsättningar. \n\nFör att trivas och lyckas i ditt uppdrag är det viktigt att du delar Kriminalvårdens grundläggande värderingar om en human människosyn, respekt för individen och tron på att människan är utvecklingsbar. Du är även medveten om och har förståelse för hur bakgrund, kultur och grupptillhörighet påverkar dig själv och andra. Vidare förväntas du med ditt förhållningssätt bidra till att alla blir likvärdigt bemötta. Vi lägger stor vikt vid personlig lämplighet.\n\nKrav\n• Fullständig gymnasieutbildning alternativt annan utbildning i kombination med \n   arbetslivserfarenhet som kriminalvården bedömer relevant.\n• Erfarenhet av sömnad och kreativ/skapande miljö.\n• God datavana och administrativ förmåga.\n• Förmåga att uttrycka dig väl i tal och skrift på svenska.  \n• God logistisk förmåga.\n\nMeriterande\n• B-körkort\n• Erfarenhet av arbetsledning\n• Arbetslivserfarenhet inom kriminalvård, social omsorg, psykiatri eller vård- \n   och omsorgsarbete\n• Pedagogisk erfarenhet\n• Erfarenhet av kundbemötande\n • Relevanta språkkunskaper\n• Kunskaper ISO9000",
        "conditions" : "Heltid.  Dagtid.\r\nTillsvidareanställning, tillträde: Tillträde enligt överenskommelse.",
        "text" : "Kriminalvården växer – vi bygger nytt, bygger om och bygger till och söker nu nya medarbetare. Vårt viktigaste mål är att minska återfall i brott – att bryta den onda cirkeln. Lyckas vi med det blir samhället tryggare och säkrare för alla. Vi är den myndighet som ansvarar för anstalter, frivård, häkten och klienttransporter.\n\nVill du veta mer? Hör vad våra medarbetare tycker om att arbeta inom Kriminalvården: https://www.kriminalvarden.se/jobba-hos-oss/ \n\nLäs mer om anstalten Täbys verksamhet på vår hemsida: https://www.kriminalvarden.se/hitta-och-kontakta/verksamhet/anstalt/taby/#om\r\n\r\nARBETSUPPGIFTER\nSom produktionsledare har du direktkontakt med våra klienter i anstaltens produktion. Anstaltens produktion består huvudsakligen av sömnad men även en del montering och förpacknings arbeten. Arbetet innebär handledning i klienternas dagliga arbete.\nEfter introduktion kommer du som produktionsledare att vara med och ansvara för den dagliga verksamheten tillsammans med kollegor.  Du planerar, arbetsfördelar samt säkerställer att våra leveranser sker enligt avtal.\nTjänsten innebär inget personalansvar utan endast arbetsledning av de intagna.\n\r\n\r\nKVALIFIKATIONER\nDu  är trygg, stabil och har självinsikt. Du har lätt för att samarbeta med andra människor och har väl grundade och tydliga värderingar. I stressituationer är du lugn, stabil och kontrollerad. Du har förmågan att göra korrekta avvägningar och prioriteringar. Du har god förståelse för hur människan tar till sig kunskap och anpassar ditt sätt att förmedla budskap utifrån mottagares förutsättningar. \n\nFör att trivas och lyckas i ditt uppdrag är det viktigt att du delar Kriminalvårdens grundläggande värderingar om en human människosyn, respekt för individen och tron på att människan är utvecklingsbar. Du är även medveten om och har förståelse för hur bakgrund, kultur och grupptillhörighet påverkar dig själv och andra. Vidare förväntas du med ditt förhållningssätt bidra till att alla blir likvärdigt bemötta. Vi lägger stor vikt vid personlig lämplighet.\n\nKrav\n• Fullständig gymnasieutbildning alternativt annan utbildning i kombination med \n   arbetslivserfarenhet som kriminalvården bedömer relevant.\n• Erfarenhet av sömnad och kreativ/skapande miljö.\n• God datavana och administrativ förmåga.\n• Förmåga att uttrycka dig väl i tal och skrift på svenska.  \n• God logistisk förmåga.\n\nMeriterande\n• B-körkort\n• Erfarenhet av arbetsledning\n• Arbetslivserfarenhet inom kriminalvård, social omsorg, psykiatri eller vård- \n   och omsorgsarbete\n• Pedagogisk erfarenhet\n• Erfarenhet av kundbemötande\n • Relevanta språkkunskaper\n• Kunskaper ISO9000"
      },
      "headline" : "Produktionsledare till anstalten Täby",
      "driving_license" : [ {
        "concept_id" : "VTK8_WRx_GcM",
        "label" : "B",
        "legacy_ams_taxonomy_id" : "3"
      } ],
      "employer" : {
        "email" : null,
        "phone_number" : null,
        "organization_number" : "2021000225",
        "name" : "Kriminalvården",
        "url" : null,
        "workplace" : "Kriminalvården, Anstalten Täby"
      },
      "removed_date" : null,
      "logo_url" : "https://www.arbetsformedlingen.se/rest/arbetsgivare/rest/af/v3/organisation/2021000225/logotyper/logo.png",
      "last_publication_date" : "2022-08-21T23:59:59",
      "number_of_vacancies" : 1,
      "occupation" : {
        "concept_id" : "bS4M_dZq_39m",
        "label" : "Produkttekniker, konfektion",
        "legacy_ams_taxonomy_id" : "7498"
      },
      "occupation_group" : {
        "concept_id" : "mwVN_oEH_g9k",
        "label" : "Skräddare och ateljésömmerskor m.fl.",
        "legacy_ams_taxonomy_id" : "7531"
      },
      "employment_type" : {
        "concept_id" : "PFZr_Syz_cUq",
        "label" : "Vanlig anställning",
        "legacy_ams_taxonomy_id" : "1"
      },
      "webpage_url" : "https://arbetsformedlingen.se/platsbanken/annonser/26327065",
      "driving_license_required" : true,
      "application_contacts" : [ {
        "description" : "Elisabeth Malmqvist",
        "email" : "elilsabeth.malmqvist@kriminalvarden.se",
        "telephone" : "08-559 376 01",
        "name" : null,
        "contact_type" : "Kriminalvårdsinspektör"
      } ],
      "duration" : {
        "concept_id" : "a7uU_j21_mkL",
        "label" : "Tills vidare",
        "legacy_ams_taxonomy_id" : "1"
      },
      "nice_to_have" : {
        "education_level" : [ ],
        "work_experiences" : [ ],
        "skills" : [ ],
        "education" : [ ],
        "languages" : [ ]
      },
      "application_details" : {
        "via_af" : false,
        "email" : null,
        "other" : null,
        "reference" : "A1143699",
        "url" : "https://recruit.visma.com/Public/Apply.aspx?guidAssignment=55a95c5f-0498-4468-8524-834b52c46457&publishCode=AMS&TK=2c3d9c89-0b39-4fde-adf1-8dc7ff749f8b",
        "information" : null
      },
      "source_type" : "VIA_PLATSBANKEN_DXA",
      "application_deadline" : "2022-08-21T23:59:59",
      "external_id" : "46-202100-0225-55A95C5F049844688524834B52C46457",
      "workplace_address" : {
        "coordinates" : [ 18.07033, 59.4419 ],
        "city" : null,
        "postcode" : null,
        "municipality" : "Täby",
        "region_concept_id" : "CifL_Rzy_Mku",
        "region" : "Stockholms län",
        "country_code" : "199",
        "region_code" : "01",
        "municipality_concept_id" : "onpA_B5a_zfv",
        "country_concept_id" : "i46j_HmG_v64",
        "municipality_code" : "0160",
        "street_address" : null,
        "country" : "Sverige"
      },
      "id" : "26327065",
      "experience_required" : true,
      "working_hours_type" : {
        "concept_id" : "6YE1_gAC_R2G",
        "label" : "Heltid",
        "legacy_ams_taxonomy_id" : "1"
      },
      "access" : null,
      "timestamp" : 1657794608438,
      "must_have" : {
        "education_level" : [ ],
        "work_experiences" : [ {
          "concept_id" : "bS4M_dZq_39m",
          "weight" : 10,
          "label" : "Produkttekniker, konfektion",
          "legacy_ams_taxonomy_id" : "7498"
        } ],
        "skills" : [ ],
        "education" : [ ],
        "languages" : [ ]
      },
      "occupation_field" : {
        "concept_id" : "PaxQ_o1G_wWH",
        "label" : "Hantverk",
        "legacy_ams_taxonomy_id" : "6"
      },
      "scope_of_work" : {
        "min" : 100,
        "max" : 100
      },
      "salary_type" : {
        "concept_id" : "oG8G_9cW_nRf",
        "label" : "Fast månads- vecko- eller timlön",
        "legacy_ams_taxonomy_id" : "1"
      },
      "removed" : false,
      "salary_description" : "Månadslön",
      "access_to_own_car" : false,
      "publication_date" : "2022-07-25T00:00:00"
    },
    "name" : "Produktionsledare till anstalten Täby",
    "user" : "hannes"
  },
  "sha1" : "d9628ef0ffab2c57c84f6830c830238c9fbef6a9",
  "annotations" : [ {
    "preferred-label" : "produktionsledare",
    "type" : "esco-occupation",
    "start-position" : 0,
    "end-position" : 17,
    "concept-id" : "c45A_Cvx_xmD",
    "matched-string" : "Produktionsledare",
    "annotation-id" : 10
  }, {
    "preferred-label" : "Täby",
    "type" : "municipality",
    "start-position" : 33,
    "end-position" : 37,
    "concept-id" : "onpA_B5a_zfv",
    "matched-string" : "Täby",
    "annotation-id" : 11
  }, {
    "preferred-label" : "Kriminalvården",
    "sentiment" : "MUST_HAVE",
    "type" : "keyword",
    "start-position" : 38,
    "end-position" : 52,
    "concept-id" : "S84z_MKP_aV6",
    "matched-string" : "kriminalvården",
    "annotation-id" : 0
  }, {
    "preferred-label" : "Kriminalvården",
    "sentiment" : "MUST_HAVE",
    "type" : "keyword",
    "start-position" : 435,
    "end-position" : 449,
    "concept-id" : "S84z_MKP_aV6",
    "matched-string" : "kriminalvården",
    "annotation-id" : 1
  }, {
    "preferred-label" : "Täby",
    "type" : "municipality",
    "start-position" : 519,
    "end-position" : 524,
    "concept-id" : "onpA_B5a_zfv",
    "matched-string" : "Täbys",
    "annotation-id" : 12
  }, {
    "preferred-label" : "produktionsledare",
    "type" : "esco-occupation",
    "start-position" : 652,
    "end-position" : 669,
    "concept-id" : "c45A_Cvx_xmD",
    "matched-string" : "produktionsledare",
    "annotation-id" : 13
  }, {
    "preferred-label" : "Sömnad",
    "sentiment" : "MUST_HAVE",
    "type" : "skill",
    "start-position" : 780,
    "end-position" : 786,
    "concept-id" : "2H6W_q67_ygJ",
    "matched-string" : "sömnad",
    "annotation-id" : 2
  }, {
    "preferred-label" : "produktionsledare",
    "type" : "esco-occupation",
    "start-position" : 930,
    "end-position" : 947,
    "concept-id" : "c45A_Cvx_xmD",
    "matched-string" : "produktionsledare",
    "annotation-id" : 14
  }, {
    "preferred-label" : "Personalansvar",
    "sentiment" : "MUST_HAVE",
    "type" : "skill",
    "start-position" : 1137,
    "end-position" : 1151,
    "concept-id" : "ZzN5_m7B_5CY",
    "matched-string" : "personalansvar",
    "annotation-id" : 3
  }, {
    "preferred-label" : "Kriminalvården",
    "type" : "keyword",
    "start-position" : 1685,
    "end-position" : 1700,
    "concept-id" : "S84z_MKP_aV6",
    "matched-string" : "Kriminalvårdens",
    "annotation-id" : 15
  }, {
    "preferred-label" : "Kriminalvården",
    "sentiment" : "MUST_HAVE",
    "type" : "keyword",
    "start-position" : 2190,
    "end-position" : 2204,
    "concept-id" : "S84z_MKP_aV6",
    "matched-string" : "kriminalvården",
    "annotation-id" : 4
  }, {
    "preferred-label" : "Sömnad",
    "sentiment" : "MUST_HAVE",
    "type" : "skill",
    "start-position" : 2239,
    "end-position" : 2245,
    "concept-id" : "2H6W_q67_ygJ",
    "matched-string" : "sömnad",
    "annotation-id" : 5
  }, {
    "preferred-label" : "Svenska",
    "sentiment" : "MUST_HAVE",
    "type" : "language",
    "start-position" : 2367,
    "end-position" : 2374,
    "concept-id" : "zSLA_vw2_FXN",
    "matched-string" : "svenska",
    "annotation-id" : 6
  }, {
    "preferred-label" : "B",
    "type" : "driving-licence",
    "start-position" : 2418,
    "end-position" : 2427,
    "concept-id" : "VTK8_WRx_GcM",
    "matched-string" : "B-körkort",
    "annotation-id" : 16
  }, {
    "preferred-label" : "Kriminalvård",
    "sentiment" : "MUST_HAVE",
    "type" : "sni-level-5",
    "start-position" : 2486,
    "end-position" : 2498,
    "concept-id" : "xVKK_eNQ_jrR",
    "matched-string" : "kriminalvård",
    "annotation-id" : 7
  }, {
    "preferred-label" : "Social omsorg",
    "sentiment" : "MUST_HAVE",
    "type" : "keyword",
    "start-position" : 2500,
    "end-position" : 2513,
    "concept-id" : "Sw4N_2Vt_PVD",
    "matched-string" : "social omsorg",
    "annotation-id" : 8
  }, {
    "preferred-label" : "Psykiatri",
    "sentiment" : "MUST_HAVE",
    "type" : "skill",
    "start-position" : 2515,
    "end-position" : 2524,
    "concept-id" : "sXoR_gGY_ycN",
    "matched-string" : "psykiatri",
    "annotation-id" : 9
  }, {
    "preferred-label" : "Ledningssystem (ISO 9000-serien)",
    "type" : "skill",
    "start-position" : 2653,
    "end-position" : 2660,
    "concept-id" : "2rqG_WLp_em4",
    "matched-string" : "ISO9000",
    "annotation-id" : 17
  } ],
  "text" : "Produktionsledare till anstalten Täby\nKriminalvården växer – vi bygger nytt, bygger om och bygger till och söker nu nya medarbetare. Vårt viktigaste mål är att minska återfall i brott – att bryta den onda cirkeln. Lyckas vi med det blir samhället tryggare och säkrare för alla. Vi är den myndighet som ansvarar för anstalter, frivård, häkten och klienttransporter.\n\nVill du veta mer? Hör vad våra medarbetare tycker om att arbeta inom Kriminalvården: https://www.kriminalvarden.se/jobba-hos-oss/ \n\nLäs mer om anstalten Täbys verksamhet på vår hemsida: https://www.kriminalvarden.se/hitta-och-kontakta/verksamhet/anstalt/taby/#om\r\n\r\nARBETSUPPGIFTER\nSom produktionsledare har du direktkontakt med våra klienter i anstaltens produktion. Anstaltens produktion består huvudsakligen av sömnad men även en del montering och förpacknings arbeten. Arbetet innebär handledning i klienternas dagliga arbete.\nEfter introduktion kommer du som produktionsledare att vara med och ansvara för den dagliga verksamheten tillsammans med kollegor.  Du planerar, arbetsfördelar samt säkerställer att våra leveranser sker enligt avtal.\nTjänsten innebär inget personalansvar utan endast arbetsledning av de intagna.\n\r\n\r\nKVALIFIKATIONER\nDu  är trygg, stabil och har självinsikt. Du har lätt för att samarbeta med andra människor och har väl grundade och tydliga värderingar. I stressituationer är du lugn, stabil och kontrollerad. Du har förmågan att göra korrekta avvägningar och prioriteringar. Du har god förståelse för hur människan tar till sig kunskap och anpassar ditt sätt att förmedla budskap utifrån mottagares förutsättningar. \n\nFör att trivas och lyckas i ditt uppdrag är det viktigt att du delar Kriminalvårdens grundläggande värderingar om en human människosyn, respekt för individen och tron på att människan är utvecklingsbar. Du är även medveten om och har förståelse för hur bakgrund, kultur och grupptillhörighet påverkar dig själv och andra. Vidare förväntas du med ditt förhållningssätt bidra till att alla blir likvärdigt bemötta. Vi lägger stor vikt vid personlig lämplighet.\n\nKrav\n• Fullständig gymnasieutbildning alternativt annan utbildning i kombination med \n   arbetslivserfarenhet som kriminalvården bedömer relevant.\n• Erfarenhet av sömnad och kreativ/skapande miljö.\n• God datavana och administrativ förmåga.\n• Förmåga att uttrycka dig väl i tal och skrift på svenska.  \n• God logistisk förmåga.\n\nMeriterande\n• B-körkort\n• Erfarenhet av arbetsledning\n• Arbetslivserfarenhet inom kriminalvård, social omsorg, psykiatri eller vård- \n   och omsorgsarbete\n• Pedagogisk erfarenhet\n• Erfarenhet av kundbemötande\n • Relevanta språkkunskaper\n• Kunskaper ISO9000"
}