{
  "meta" : {
    "jobad" : {
      "description" : {
        "requirements" : null,
        "needs" : null,
        "company_information" : null,
        "text_formatted" : "Beskrivning\nJust nu söker vi efter teamledare med erfarenhet av fönsterputs, kontorsstädning och trappstädning i Örebro! Tjänsten är vid behov men kan leda till fast anställning.\r\n\r\nSom teamledare är du en av våra nyckelpersoner företaget. Du samarbetar samt coachar ditt team och säkerställer kvalitet ute på plats hos våra kunder. Du hanterar kundernas synpunkter och önskemål, du har daglig kontakt med medarbetare. \n\nArbetsuppgifter\nTjänsten innebär att ta emot beställningar från kunder, rapportering till närmaste chef, planering av jobbet för personal, kvalitetskontroll samt vara ute och utföra städningen om det behövs.\n\nKvalifikationer\nDet är viktigt att du behärskar svenska språket i både tal och skrift samt att du är en van datoranvändare. B-körkort är ett krav. Vi ser gärna att du har branscherfarenhet eller erfarenhet från andra serviceyrken.\n\nVi söker dig som har ett brinnande intresse och engagemang för service och vet hur olika typer av människor skall bemötas. Som person är du social, utåtriktad, flexibel och du utför ditt jobb med god kvalité. Att forma ditt eget och gruppens arbete ser du som en självklarhet. Du strävar efter att göra ett noggrant arbete med ett bra bemötande där nöjd kund är i fokus.\n\nVillkor\nAnställning vid behov med timlön enligt vårt Kollektivavtal ",
        "conditions" : "Heltid/Deltid. 50%\r\nTillsvidareanställning",
        "text" : "Beskrivning\nJust nu söker vi efter teamledare med erfarenhet av fönsterputs, kontorsstädning och trappstädning i Örebro! Tjänsten är vid behov men kan leda till fast anställning.\r\n\r\nSom teamledare är du en av våra nyckelpersoner företaget. Du samarbetar samt coachar ditt team och säkerställer kvalitet ute på plats hos våra kunder. Du hanterar kundernas synpunkter och önskemål, du har daglig kontakt med medarbetare. \n\nArbetsuppgifter\nTjänsten innebär att ta emot beställningar från kunder, rapportering till närmaste chef, planering av jobbet för personal, kvalitetskontroll samt vara ute och utföra städningen om det behövs.\n\nKvalifikationer\nDet är viktigt att du behärskar svenska språket i både tal och skrift samt att du är en van datoranvändare. B-körkort är ett krav. Vi ser gärna att du har branscherfarenhet eller erfarenhet från andra serviceyrken.\n\nVi söker dig som har ett brinnande intresse och engagemang för service och vet hur olika typer av människor skall bemötas. Som person är du social, utåtriktad, flexibel och du utför ditt jobb med god kvalité. Att forma ditt eget och gruppens arbete ser du som en självklarhet. Du strävar efter att göra ett noggrant arbete med ett bra bemötande där nöjd kund är i fokus.\n\nVillkor\nAnställning vid behov med timlön enligt vårt Kollektivavtal"
      },
      "headline" : "Teamledare inom städ till Örebro",
      "driving_license" : [ {
        "concept_id" : "VTK8_WRx_GcM",
        "label" : "B",
        "legacy_ams_taxonomy_id" : "3"
      } ],
      "employer" : {
        "email" : null,
        "phone_number" : null,
        "organization_number" : "5591351860",
        "name" : "Kleni Förvaltning Personal Management AB",
        "url" : null,
        "workplace" : "Kleni Förvaltning Personal Management AB"
      },
      "removed_date" : null,
      "logo_url" : null,
      "last_publication_date" : "2022-09-04T23:59:59",
      "number_of_vacancies" : 1,
      "occupation" : {
        "concept_id" : "dYo1_D8c_87U",
        "label" : "Städare/Lokalvårdare",
        "legacy_ams_taxonomy_id" : "464"
      },
      "occupation_group" : {
        "concept_id" : "Z6TY_xDf_Yup",
        "label" : "Städare",
        "legacy_ams_taxonomy_id" : "9111"
      },
      "employment_type" : {
        "concept_id" : "PFZr_Syz_cUq",
        "label" : "Vanlig anställning",
        "legacy_ams_taxonomy_id" : "1"
      },
      "webpage_url" : "https://arbetsformedlingen.se/platsbanken/annonser/26378602",
      "driving_license_required" : true,
      "application_contacts" : [ ],
      "duration" : {
        "concept_id" : "a7uU_j21_mkL",
        "label" : "Tills vidare",
        "legacy_ams_taxonomy_id" : "1"
      },
      "nice_to_have" : {
        "education_level" : [ ],
        "work_experiences" : [ ],
        "skills" : [ ],
        "education" : [ ],
        "languages" : [ ]
      },
      "application_details" : {
        "via_af" : false,
        "email" : null,
        "other" : null,
        "reference" : "2022/12",
        "url" : "https://kleniforvaltning.varbi.com/what:job/jobID:533235/type:job/where:1/apply:1",
        "information" : null
      },
      "source_type" : "VIA_PLATSBANKEN_DXA",
      "application_deadline" : "2022-09-04T23:59:59",
      "external_id" : "46-559135-1860-533235",
      "workplace_address" : {
        "coordinates" : [ 15.21341, 59.27526 ],
        "city" : null,
        "postcode" : null,
        "municipality" : "Örebro",
        "region_concept_id" : "xTCk_nT5_Zjm",
        "region" : "Örebro län",
        "country_code" : "199",
        "region_code" : "18",
        "municipality_concept_id" : "kuMn_feU_hXx",
        "country_concept_id" : "i46j_HmG_v64",
        "municipality_code" : "1880",
        "street_address" : null,
        "country" : "Sverige"
      },
      "id" : "26378602",
      "experience_required" : true,
      "working_hours_type" : {
        "concept_id" : "947z_JGS_Uk2",
        "label" : "Deltid",
        "legacy_ams_taxonomy_id" : "2"
      },
      "access" : null,
      "timestamp" : 1659619405231,
      "must_have" : {
        "education_level" : [ ],
        "work_experiences" : [ {
          "concept_id" : "dYo1_D8c_87U",
          "weight" : 10,
          "label" : "Städare/Lokalvårdare",
          "legacy_ams_taxonomy_id" : "464"
        } ],
        "skills" : [ ],
        "education" : [ ],
        "languages" : [ ]
      },
      "occupation_field" : {
        "concept_id" : "whao_Q6A_ScE",
        "label" : "Sanering och renhållning",
        "legacy_ams_taxonomy_id" : "12"
      },
      "scope_of_work" : {
        "min" : 50,
        "max" : 100
      },
      "salary_type" : {
        "concept_id" : "oG8G_9cW_nRf",
        "label" : "Fast månads- vecko- eller timlön",
        "legacy_ams_taxonomy_id" : "1"
      },
      "removed" : false,
      "salary_description" : "Timlön",
      "access_to_own_car" : false,
      "publication_date" : "2022-08-04T15:23:25"
    },
    "name" : "Teamledare inom städ till Örebro",
    "user" : "kristof.fischer"
  },
  "sha1" : "bae2d9690b0e37ad84dd764db5f1fc72d823189c",
  "annotations" : [ {
    "preferred-label" : "Teamledare",
    "sentiment" : "MUST_HAVE",
    "type" : "occupation-name",
    "start-position" : 0,
    "end-position" : 10,
    "concept-id" : "FC86_VDF_rqB",
    "matched-string" : "teamledare",
    "annotation-id" : 0
  }, {
    "preferred-label" : "Örebro",
    "type" : "municipality",
    "start-position" : 26,
    "end-position" : 32,
    "concept-id" : "kuMn_feU_hXx",
    "matched-string" : "Örebro",
    "annotation-id" : 11
  }, {
    "preferred-label" : "Teamledare",
    "sentiment" : "MUST_HAVE",
    "type" : "occupation-name",
    "start-position" : 68,
    "end-position" : 78,
    "concept-id" : "FC86_VDF_rqB",
    "matched-string" : "teamledare",
    "annotation-id" : 1
  }, {
    "preferred-label" : "Fönsterputsning",
    "sentiment" : "MUST_HAVE",
    "type" : "skill",
    "start-position" : 97,
    "end-position" : 108,
    "concept-id" : "BQPp_SQs_dtc",
    "matched-string" : "fönsterputs",
    "annotation-id" : 12
  }, {
    "preferred-label" : "Kontorsstädning",
    "sentiment" : "MUST_HAVE",
    "type" : "skill",
    "start-position" : 110,
    "end-position" : 125,
    "concept-id" : "beHF_mum_ANM",
    "matched-string" : "kontorsstädning",
    "annotation-id" : 2
  }, {
    "preferred-label" : "Trappstädning",
    "sentiment" : "MUST_HAVE",
    "type" : "skill",
    "start-position" : 130,
    "end-position" : 143,
    "concept-id" : "iLB3_qb9_a1D",
    "matched-string" : "trappstädning",
    "annotation-id" : 3
  }, {
    "preferred-label" : "Örebro",
    "type" : "municipality",
    "start-position" : 146,
    "end-position" : 152,
    "concept-id" : "kuMn_feU_hXx",
    "matched-string" : "Örebro",
    "annotation-id" : 13
  }, {
    "preferred-label" : "Behovsanställning",
    "type" : "employment-type",
    "start-position" : 166,
    "end-position" : 175,
    "concept-id" : "1paU_aCR_nGn",
    "matched-string" : "vid behov",
    "annotation-id" : 14
  }, {
    "preferred-label" : "Vanlig anställning",
    "sentiment" : "MUST_HAVE",
    "type" : "employment-type",
    "start-position" : 194,
    "end-position" : 210,
    "concept-id" : "PFZr_Syz_cUq",
    "matched-string" : "fast anställning",
    "annotation-id" : 4
  }, {
    "preferred-label" : "Teamledare",
    "sentiment" : "MUST_HAVE",
    "type" : "occupation-name",
    "start-position" : 219,
    "end-position" : 229,
    "concept-id" : "FC86_VDF_rqB",
    "matched-string" : "teamledare",
    "annotation-id" : 5
  }, {
    "preferred-label" : "samarbeta med kolleger",
    "sentiment" : "MUST_HAVE",
    "type" : "esco-skill",
    "start-position" : 276,
    "end-position" : 286,
    "concept-id" : "X15R_797_q62",
    "matched-string" : "samarbetar",
    "annotation-id" : 15
  }, {
    "preferred-label" : "coacha anställda",
    "sentiment" : "MUST_HAVE",
    "type" : "esco-skill",
    "start-position" : 292,
    "end-position" : 309,
    "concept-id" : "Cwf5_CUW_XJi",
    "matched-string" : "coachar ditt team",
    "annotation-id" : 16
  }, {
    "preferred-label" : "ta emot varor",
    "sentiment" : "MUST_HAVE",
    "type" : "esco-skill",
    "start-position" : 491,
    "end-position" : 512,
    "concept-id" : "aSuH_Se7_Jxi",
    "matched-string" : "ta emot beställningar",
    "annotation-id" : 18
  }, {
    "preferred-label" : "Allmän rapportering",
    "sentiment" : "MUST_HAVE",
    "type" : "skill",
    "start-position" : 526,
    "end-position" : 538,
    "concept-id" : "vGPg_Tih_VSw",
    "matched-string" : "rapportering",
    "annotation-id" : 19
  }, {
    "preferred-label" : "Kvalitetskontroll",
    "sentiment" : "MUST_HAVE",
    "type" : "skill",
    "start-position" : 593,
    "end-position" : 610,
    "concept-id" : "4y7C_Lsh_EPM",
    "matched-string" : "kvalitetskontroll",
    "annotation-id" : 7
  }, {
    "preferred-label" : "ansvara för städning",
    "sentiment" : "MUST_HAVE",
    "type" : "esco-skill",
    "start-position" : 629,
    "end-position" : 646,
    "concept-id" : "2pc1_7xW_uYA",
    "matched-string" : "utföra städningen",
    "annotation-id" : 17
  }, {
    "preferred-label" : "Svenska",
    "sentiment" : "MUST_HAVE",
    "type" : "language",
    "start-position" : 711,
    "end-position" : 726,
    "concept-id" : "zSLA_vw2_FXN",
    "matched-string" : "svenska språket",
    "annotation-id" : 8
  }, {
    "preferred-label" : "använda dator",
    "sentiment" : "MUST_HAVE",
    "type" : "esco-skill",
    "start-position" : 771,
    "end-position" : 785,
    "concept-id" : "HEbR_xrb_MpT",
    "matched-string" : "datoranvändare",
    "annotation-id" : 20
  }, {
    "preferred-label" : "B",
    "sentiment" : "MUST_HAVE",
    "type" : "driving-licence",
    "start-position" : 787,
    "end-position" : 796,
    "concept-id" : "VTK8_WRx_GcM",
    "matched-string" : "B-körkort",
    "annotation-id" : 21
  }, {
    "preferred-label" : "noggrannhet",
    "sentiment" : "MUST_HAVE",
    "type" : "esco-skill",
    "start-position" : 1202,
    "end-position" : 1210,
    "concept-id" : "mrsW_EkL_KRD",
    "matched-string" : "noggrant",
    "annotation-id" : 22
  }, {
    "preferred-label" : "se till att kunderna är nöjda",
    "sentiment" : "MUST_HAVE",
    "type" : "esco-skill",
    "start-position" : 1244,
    "end-position" : 1264,
    "concept-id" : "GcZm_VYN_2VR",
    "matched-string" : "nöjd kund är i fokus",
    "annotation-id" : 23
  }, {
    "preferred-label" : "Behovsanställning",
    "type" : "employment-type",
    "start-position" : 1287,
    "end-position" : 1296,
    "concept-id" : "1paU_aCR_nGn",
    "matched-string" : "vid behov",
    "annotation-id" : 24
  } ],
  "text" : "Teamledare inom städ till Örebro\nBeskrivning\nJust nu söker vi efter teamledare med erfarenhet av fönsterputs, kontorsstädning och trappstädning i Örebro! Tjänsten är vid behov men kan leda till fast anställning.\r\n\r\nSom teamledare är du en av våra nyckelpersoner företaget. Du samarbetar samt coachar ditt team och säkerställer kvalitet ute på plats hos våra kunder. Du hanterar kundernas synpunkter och önskemål, du har daglig kontakt med medarbetare. \n\nArbetsuppgifter\nTjänsten innebär att ta emot beställningar från kunder, rapportering till närmaste chef, planering av jobbet för personal, kvalitetskontroll samt vara ute och utföra städningen om det behövs.\n\nKvalifikationer\nDet är viktigt att du behärskar svenska språket i både tal och skrift samt att du är en van datoranvändare. B-körkort är ett krav. Vi ser gärna att du har branscherfarenhet eller erfarenhet från andra serviceyrken.\n\nVi söker dig som har ett brinnande intresse och engagemang för service och vet hur olika typer av människor skall bemötas. Som person är du social, utåtriktad, flexibel och du utför ditt jobb med god kvalité. Att forma ditt eget och gruppens arbete ser du som en självklarhet. Du strävar efter att göra ett noggrant arbete med ett bra bemötande där nöjd kund är i fokus.\n\nVillkor\nAnställning vid behov med timlön enligt vårt Kollektivavtal"
}