{
  "meta" : {
    "jobad" : {
      "description" : {
        "requirements" : null,
        "needs" : null,
        "company_information" : null,
        "text_formatted" : "Har du erfarenhet inom samhällsbyggnad och söker efter en roll där du får leda multidisciplinära projekt av varierande karaktär mot olika kunder? Då har vi jobbet för dig! Vi söker nu för Swecos räkning en uppdragsledare till Gävleteamet. Vi tillämpar löpande urval, så se till att skicka in din ansökan redan idag!\n\nOM TJÄNSTEN \nSweco planerar och utformar framtidens hållbara samhällen och städer. De levererar kvalificerade tekniska konsulttjänster inom teknik, miljö och arkitektur. Sweco utför tiotusentals uppdrag i 70 länder runt om i världen för att säkerställa rent vatten, effektiv infrastruktur och hållbara energilösningar.\n\nSom uppdragsledare får du jobba i intressanta projekt med de senaste verktygen, omgiven av kompetenta kollegor. Swecos uppdrag är av varierande karaktär mot både privata och offentliga kunder. Här får du arbeta i gränsöverskridande team tillsammans med medarbetare inom andra kompetensområden, på andra orter och i andra länder.\n\n\"Som ledare är jag flexibel, effektiv och driven. Jag inspireras av människor som drivs av att förändra och förbättra. Jag tror på teamwork och att hjälpa varandra. På Sweco värnar vi om ett hållbart arbetsliv och min roll är att vara en god ledare som stöttar dig och din utveckling. Jag tror på individens potential och att det mesta är nåbart så länge man är villig att jobba för det.”- Jacob Sjöström, Gruppchef\n\nARBETSUPPGIFTER \n- Leda multidisciplinära projekt av varierande karaktär mot olika kunder\n- Hjälpa Swecos kunder att genomföra sina projekt, från förstudier och utredningar till detaljprojektering\n- Ansvara för att säkerställa att kundens och övriga intressenters mål och krav uppfylls i den produkt som ska levereras\n- Utveckla kundrelationer och sälja in egna uppdrag\n- Jobba med intern och extern granskning\n\nVI SÖKER DIG SOM \n- Har en eftergymnasial utbildning inom bygg och anläggning, alternativt arbetslivserfarenhet som bedöms likvärdig\n- Minst tre års erfarenhet av en ledande roll inom samhällsbyggnad\n- Har goda kunskaper i svenska och engelska i såväl tal som skrift då kommunikation med kollegor och kunder sker på bägge språken\n- Har B-körkort\n\nVi ser det meriterande om du har kunskap i MS Project.\n\nSom person är du:\n\n\n* Samarbetsvillig\n* Serviceinriktad\n* Flexibel\n* Affärsmässig\n\n\nÖvrig information\n\n\n* Start: Omgående med hänsyn till uppsägningstid\n* Omfattning: Heltid\n* Placering: Gävle\n\n\nRekryteringsprocessen hanteras av Academic Work och kundens önskemål är att alla frågor rörande tjänsten hanteras av Academic Work.\n\nVi går igenom urvalet löpande och annonsen kan stängas ner innan tjänsten är tillsatt om vi gått över till urvals- och intervjufasen.\n\nINFORMATION OM FÖRETAGET \nLäs mer om Sweco och hur de presenterar sig här",
        "conditions" : "08:00-17:00",
        "text" : "Har du erfarenhet inom samhällsbyggnad och söker efter en roll där du får leda multidisciplinära projekt av varierande karaktär mot olika kunder? Då har vi jobbet för dig! Vi söker nu för Swecos räkning en uppdragsledare till Gävleteamet. Vi tillämpar löpande urval, så se till att skicka in din ansökan redan idag!\n\nOM TJÄNSTEN \nSweco planerar och utformar framtidens hållbara samhällen och städer. De levererar kvalificerade tekniska konsulttjänster inom teknik, miljö och arkitektur. Sweco utför tiotusentals uppdrag i 70 länder runt om i världen för att säkerställa rent vatten, effektiv infrastruktur och hållbara energilösningar.\n\nSom uppdragsledare får du jobba i intressanta projekt med de senaste verktygen, omgiven av kompetenta kollegor. Swecos uppdrag är av varierande karaktär mot både privata och offentliga kunder. Här får du arbeta i gränsöverskridande team tillsammans med medarbetare inom andra kompetensområden, på andra orter och i andra länder.\n\n\"Som ledare är jag flexibel, effektiv och driven. Jag inspireras av människor som drivs av att förändra och förbättra. Jag tror på teamwork och att hjälpa varandra. På Sweco värnar vi om ett hållbart arbetsliv och min roll är att vara en god ledare som stöttar dig och din utveckling. Jag tror på individens potential och att det mesta är nåbart så länge man är villig att jobba för det.”- Jacob Sjöström, Gruppchef\n\nARBETSUPPGIFTER \n- Leda multidisciplinära projekt av varierande karaktär mot olika kunder\n- Hjälpa Swecos kunder att genomföra sina projekt, från förstudier och utredningar till detaljprojektering\n- Ansvara för att säkerställa att kundens och övriga intressenters mål och krav uppfylls i den produkt som ska levereras\n- Utveckla kundrelationer och sälja in egna uppdrag\n- Jobba med intern och extern granskning\n\nVI SÖKER DIG SOM \n- Har en eftergymnasial utbildning inom bygg och anläggning, alternativt arbetslivserfarenhet som bedöms likvärdig\n- Minst tre års erfarenhet av en ledande roll inom samhällsbyggnad\n- Har goda kunskaper i svenska och engelska i såväl tal som skrift då kommunikation med kollegor och kunder sker på bägge språken\n- Har B-körkort\n\nVi ser det meriterande om du har kunskap i MS Project.\n\nSom person är du:\n\n\n* Samarbetsvillig\n* Serviceinriktad\n* Flexibel\n* Affärsmässig\n\n\nÖvrig information\n\n\n* Start: Omgående med hänsyn till uppsägningstid\n* Omfattning: Heltid\n* Placering: Gävle\n\n\nRekryteringsprocessen hanteras av Academic Work och kundens önskemål är att alla frågor rörande tjänsten hanteras av Academic Work.\n\nVi går igenom urvalet löpande och annonsen kan stängas ner innan tjänsten är tillsatt om vi gått över till urvals- och intervjufasen.\n\nINFORMATION OM FÖRETAGET \nLäs mer om Sweco och hur de presenterar sig här"
      },
      "headline" : "Uppdragsledare väg och mark till Sweco!",
      "driving_license" : null,
      "employer" : {
        "email" : null,
        "phone_number" : null,
        "organization_number" : "5565595450",
        "name" : "Academic Work Sweden AB",
        "url" : "http://www.academicwork.se",
        "workplace" : "Academic Work"
      },
      "removed_date" : null,
      "logo_url" : "https://www.arbetsformedlingen.se/rest/arbetsgivare/rest/af/v3/organisation/5565595450/logotyper/logo.png",
      "last_publication_date" : "2022-07-29T23:59:59",
      "number_of_vacancies" : 1,
      "occupation" : {
        "concept_id" : "z5AM_ayf_WcL",
        "label" : "Projektledare, IT",
        "legacy_ams_taxonomy_id" : "5388"
      },
      "occupation_group" : {
        "concept_id" : "DJh5_yyF_hEM",
        "label" : "Mjukvaru- och systemutvecklare m.fl.",
        "legacy_ams_taxonomy_id" : "2512"
      },
      "employment_type" : {
        "concept_id" : "PFZr_Syz_cUq",
        "label" : "Vanlig anställning",
        "legacy_ams_taxonomy_id" : "1"
      },
      "webpage_url" : "https://arbetsformedlingen.se/platsbanken/annonser/26269624",
      "driving_license_required" : false,
      "application_contacts" : [ {
        "description" : "Nellie Sundström",
        "email" : null,
        "telephone" : null,
        "name" : null,
        "contact_type" : null
      } ],
      "duration" : {
        "concept_id" : "qQUd_4qe_NDT",
        "label" : "6 månader eller längre",
        "legacy_ams_taxonomy_id" : "2"
      },
      "nice_to_have" : {
        "education_level" : [ ],
        "work_experiences" : [ ],
        "skills" : [ ],
        "education" : [ ],
        "languages" : [ ]
      },
      "application_details" : {
        "via_af" : false,
        "email" : null,
        "other" : null,
        "reference" : "15077778",
        "url" : "http://www.academicwork.se/jobad/uppdragsledare-vag-och-mark-till-sweco/15077778?apply=1",
        "information" : null
      },
      "source_type" : "VIA_PLATSBANKEN_DXA",
      "application_deadline" : "2022-07-29T23:59:59",
      "external_id" : "46-556559-5450-15077778",
      "workplace_address" : {
        "coordinates" : [ 17.141273, 60.67488 ],
        "city" : null,
        "postcode" : null,
        "municipality" : "Gävle",
        "region_concept_id" : "zupA_8Nt_xcD",
        "region" : "Gävleborgs län",
        "country_code" : "199",
        "region_code" : "21",
        "municipality_concept_id" : "qk8Y_2b6_82D",
        "country_concept_id" : "i46j_HmG_v64",
        "municipality_code" : "2180",
        "street_address" : null,
        "country" : "Sverige"
      },
      "id" : "26269624",
      "experience_required" : true,
      "working_hours_type" : {
        "concept_id" : "6YE1_gAC_R2G",
        "label" : "Heltid",
        "legacy_ams_taxonomy_id" : "1"
      },
      "access" : null,
      "timestamp" : 1656453718612,
      "must_have" : {
        "education_level" : [ ],
        "work_experiences" : [ {
          "concept_id" : "z5AM_ayf_WcL",
          "weight" : 10,
          "label" : "Projektledare, IT",
          "legacy_ams_taxonomy_id" : "5388"
        } ],
        "skills" : [ ],
        "education" : [ ],
        "languages" : [ ]
      },
      "occupation_field" : {
        "concept_id" : "apaJ_2ja_LuF",
        "label" : "Data/IT",
        "legacy_ams_taxonomy_id" : "3"
      },
      "scope_of_work" : {
        "min" : 100,
        "max" : 100
      },
      "salary_type" : {
        "concept_id" : "oG8G_9cW_nRf",
        "label" : "Fast månads- vecko- eller timlön",
        "legacy_ams_taxonomy_id" : "1"
      },
      "removed" : false,
      "salary_description" : "Enligt avtal",
      "access_to_own_car" : false,
      "publication_date" : "2022-06-29T00:01:58"
    },
    "name" : "Uppdragsledare väg och mark till Sweco!",
    "user" : "hannes"
  },
  "sha1" : "60baed686fcbf61b102a69d8126acf52db5f643e",
  "annotations" : [ {
    "preferred-label" : "Samhällsbyggnad",
    "sentiment" : "MUST_HAVE",
    "type" : "skill",
    "start-position" : 63,
    "end-position" : 78,
    "concept-id" : "KEPE_tsb_fB8",
    "matched-string" : "samhällsbyggnad",
    "annotation-id" : 1
  }, {
    "preferred-label" : "Gävle",
    "type" : "municipality",
    "start-position" : 268,
    "end-position" : 279,
    "concept-id" : "qk8Y_2b6_82D",
    "matched-string" : "Gävleteamet",
    "annotation-id" : 10
  }, {
    "preferred-label" : "Arbetsliv",
    "sentiment" : "MUST_HAVE",
    "type" : "keyword",
    "start-position" : 1229,
    "end-position" : 1238,
    "concept-id" : "UceZ_JCp_23T",
    "matched-string" : "arbetsliv",
    "annotation-id" : 2
  }, {
    "preferred-label" : "projektledare",
    "type" : "esco-occupation",
    "start-position" : 1476,
    "end-position" : 1480,
    "concept-id" : "nzMp_xN5_r6G",
    "matched-string" : "Leda",
    "annotation-id" : 11
  }, {
    "preferred-label" : "projektledare",
    "type" : "esco-occupation",
    "start-position" : 1500,
    "end-position" : 1507,
    "concept-id" : "nzMp_xN5_r6G",
    "matched-string" : "projekt",
    "annotation-id" : 12
  }, {
    "preferred-label" : "Kundrelationer",
    "sentiment" : "MUST_HAVE",
    "type" : "keyword",
    "start-position" : 1797,
    "end-position" : 1811,
    "concept-id" : "hPWL_HNB_UFP",
    "matched-string" : "kundrelationer",
    "annotation-id" : 3
  }, {
    "preferred-label" : "Eftergymnasial utbildning",
    "sentiment" : "MUST_HAVE",
    "type" : "sni-level-3",
    "start-position" : 1908,
    "end-position" : 1933,
    "concept-id" : "bg6r_KVf_KNN",
    "matched-string" : "eftergymnasial utbildning",
    "annotation-id" : 4
  }, {
    "preferred-label" : "Bygg och anläggning",
    "sentiment" : "MUST_HAVE",
    "type" : "occupation-field",
    "start-position" : 1939,
    "end-position" : 1958,
    "concept-id" : "j7Cq_ZJe_GkT",
    "matched-string" : "bygg och anläggning",
    "annotation-id" : 5
  }, {
    "preferred-label" : "2-4 års erfarenhet",
    "type" : "occupation-experience-year",
    "start-position" : 2022,
    "end-position" : 2040,
    "concept-id" : "RWA2_uu6_udD",
    "matched-string" : "tre års erfarenhet",
    "annotation-id" : 13
  }, {
    "preferred-label" : "Samhällsbyggnad",
    "sentiment" : "MUST_HAVE",
    "type" : "skill",
    "start-position" : 2065,
    "end-position" : 2080,
    "concept-id" : "KEPE_tsb_fB8",
    "matched-string" : "samhällsbyggnad",
    "annotation-id" : 6
  }, {
    "preferred-label" : "Svenska",
    "sentiment" : "MUST_HAVE",
    "type" : "language",
    "start-position" : 2104,
    "end-position" : 2111,
    "concept-id" : "zSLA_vw2_FXN",
    "matched-string" : "svenska",
    "annotation-id" : 7
  }, {
    "preferred-label" : "Engelska",
    "sentiment" : "MUST_HAVE",
    "type" : "language",
    "start-position" : 2116,
    "end-position" : 2124,
    "concept-id" : "NVxJ_hLg_TYS",
    "matched-string" : "engelska",
    "annotation-id" : 8
  }, {
    "preferred-label" : "B",
    "type" : "driving-licence",
    "start-position" : 2217,
    "end-position" : 2226,
    "concept-id" : "VTK8_WRx_GcM",
    "matched-string" : "B-körkort",
    "annotation-id" : 14
  }, {
    "preferred-label" : "MS Project",
    "sentiment" : "MUST_HAVE",
    "type" : "skill",
    "start-position" : 2271,
    "end-position" : 2281,
    "concept-id" : "DJgq_zBj_bKt",
    "matched-string" : "ms project",
    "annotation-id" : 9
  }, {
    "preferred-label" : "samarbeta med kolleger",
    "type" : "esco-skill",
    "start-position" : 2306,
    "end-position" : 2321,
    "concept-id" : "X15R_797_q62",
    "matched-string" : "Samarbetsvillig",
    "annotation-id" : 15
  }, {
    "preferred-label" : "Heltid",
    "type" : "worktime-extent",
    "start-position" : 2451,
    "end-position" : 2457,
    "concept-id" : "6YE1_gAC_R2G",
    "matched-string" : "Heltid",
    "annotation-id" : 16
  }, {
    "preferred-label" : "Gävle",
    "type" : "municipality",
    "start-position" : 2471,
    "end-position" : 2476,
    "concept-id" : "qk8Y_2b6_82D",
    "matched-string" : "Gävle",
    "annotation-id" : 17
  } ],
  "text" : "Uppdragsledare väg och mark till Sweco!\nHar du erfarenhet inom samhällsbyggnad och söker efter en roll där du får leda multidisciplinära projekt av varierande karaktär mot olika kunder? Då har vi jobbet för dig! Vi söker nu för Swecos räkning en uppdragsledare till Gävleteamet. Vi tillämpar löpande urval, så se till att skicka in din ansökan redan idag!\n\nOM TJÄNSTEN \nSweco planerar och utformar framtidens hållbara samhällen och städer. De levererar kvalificerade tekniska konsulttjänster inom teknik, miljö och arkitektur. Sweco utför tiotusentals uppdrag i 70 länder runt om i världen för att säkerställa rent vatten, effektiv infrastruktur och hållbara energilösningar.\n\nSom uppdragsledare får du jobba i intressanta projekt med de senaste verktygen, omgiven av kompetenta kollegor. Swecos uppdrag är av varierande karaktär mot både privata och offentliga kunder. Här får du arbeta i gränsöverskridande team tillsammans med medarbetare inom andra kompetensområden, på andra orter och i andra länder.\n\n\"Som ledare är jag flexibel, effektiv och driven. Jag inspireras av människor som drivs av att förändra och förbättra. Jag tror på teamwork och att hjälpa varandra. På Sweco värnar vi om ett hållbart arbetsliv och min roll är att vara en god ledare som stöttar dig och din utveckling. Jag tror på individens potential och att det mesta är nåbart så länge man är villig att jobba för det.”- Jacob Sjöström, Gruppchef\n\nARBETSUPPGIFTER \n- Leda multidisciplinära projekt av varierande karaktär mot olika kunder\n- Hjälpa Swecos kunder att genomföra sina projekt, från förstudier och utredningar till detaljprojektering\n- Ansvara för att säkerställa att kundens och övriga intressenters mål och krav uppfylls i den produkt som ska levereras\n- Utveckla kundrelationer och sälja in egna uppdrag\n- Jobba med intern och extern granskning\n\nVI SÖKER DIG SOM \n- Har en eftergymnasial utbildning inom bygg och anläggning, alternativt arbetslivserfarenhet som bedöms likvärdig\n- Minst tre års erfarenhet av en ledande roll inom samhällsbyggnad\n- Har goda kunskaper i svenska och engelska i såväl tal som skrift då kommunikation med kollegor och kunder sker på bägge språken\n- Har B-körkort\n\nVi ser det meriterande om du har kunskap i MS Project.\n\nSom person är du:\n\n\n* Samarbetsvillig\n* Serviceinriktad\n* Flexibel\n* Affärsmässig\n\n\nÖvrig information\n\n\n* Start: Omgående med hänsyn till uppsägningstid\n* Omfattning: Heltid\n* Placering: Gävle\n\n\nRekryteringsprocessen hanteras av Academic Work och kundens önskemål är att alla frågor rörande tjänsten hanteras av Academic Work.\n\nVi går igenom urvalet löpande och annonsen kan stängas ner innan tjänsten är tillsatt om vi gått över till urvals- och intervjufasen.\n\nINFORMATION OM FÖRETAGET \nLäs mer om Sweco och hur de presenterar sig här"
}