{
  "meta" : {
    "dataset-id" : "myh-spreadsheet-2021",
    "type" : "education-description",
    "dataset-document-id" : "YH01467",
    "user" : "kristof.fischer"
  },
  "sha1" : "53c7908ee5e704bbc224fdff3bbc8042e76ac6c6",
  "annotations" : [ {
    "preferred-label" : "Systemutveckling",
    "sentiment" : "OFFERED",
    "type" : "skill",
    "start-position" : 58,
    "end-position" : 87,
    "concept-id" : "D7Ns_RG6_hD2",
    "matched-string" : "utveckla framtidens IT-system",
    "annotation-id" : 10
  }, {
    "preferred-label" : "Systemutvecklare/Programmerare",
    "sentiment" : "OFFERED",
    "type" : "occupation-name",
    "start-position" : 94,
    "end-position" : 108,
    "concept-id" : "fg7B_yov_smw",
    "matched-string" : "javautvecklare",
    "annotation-id" : 1
  }, {
    "preferred-label" : "Systemutvecklare/Programmerare",
    "sentiment" : "OFFERED",
    "type" : "occupation-name",
    "start-position" : 207,
    "end-position" : 223,
    "concept-id" : "fg7B_yov_smw",
    "matched-string" : "systemutvecklare",
    "annotation-id" : 2
  }, {
    "preferred-label" : "Agila arbetsmetoder",
    "sentiment" : "OFFERED",
    "type" : "skill",
    "start-position" : 285,
    "end-position" : 309,
    "concept-id" : "TMVb_DnH_etF",
    "matched-string" : "agila utvecklingsmetoder",
    "annotation-id" : 11
  }, {
    "preferred-label" : "Ramverk",
    "sentiment" : "OFFERED",
    "type" : "skill-headline",
    "start-position" : 329,
    "end-position" : 336,
    "concept-id" : "srsj_GQb_CE1",
    "matched-string" : "ramverk",
    "annotation-id" : 3
  }, {
    "preferred-label" : "JavaScript, programmeringsspråk",
    "sentiment" : "OFFERED",
    "type" : "skill",
    "start-position" : 371,
    "end-position" : 390,
    "concept-id" : "DHhX_uVf_y6X",
    "matched-string" : "javascriptbibliotek",
    "annotation-id" : 12
  }, {
    "preferred-label" : "Systemutvecklare/Programmerare",
    "sentiment" : "OFFERED",
    "type" : "occupation-name",
    "start-position" : 398,
    "end-position" : 414,
    "concept-id" : "fg7B_yov_smw",
    "matched-string" : "systemutvecklare",
    "annotation-id" : 4
  }, {
    "preferred-label" : "Java, programmeringsspråk",
    "sentiment" : "OFFERED",
    "type" : "skill",
    "start-position" : 420,
    "end-position" : 424,
    "concept-id" : "jCsR_WQX_CKD",
    "matched-string" : "java",
    "annotation-id" : 5
  }, {
    "preferred-label" : "Systemutveckling",
    "sentiment" : "OFFERED",
    "type" : "skill",
    "start-position" : 453,
    "end-position" : 476,
    "concept-id" : "D7Ns_RG6_hD2",
    "matched-string" : "utveckla data/IT-system",
    "annotation-id" : 13
  }, {
    "preferred-label" : "Systemutvecklare/Programmerare",
    "sentiment" : "OFFERED",
    "type" : "occupation-name",
    "start-position" : 520,
    "end-position" : 537,
    "concept-id" : "fg7B_yov_smw",
    "matched-string" : "systemutvecklaren",
    "annotation-id" : 14
  }, {
    "preferred-label" : "Programmering",
    "sentiment" : "OFFERED",
    "type" : "skill",
    "start-position" : 541,
    "end-position" : 554,
    "concept-id" : "iUew_moc_BRk",
    "matched-string" : "programmering",
    "annotation-id" : 7
  }, {
    "preferred-label" : "Agila arbetsmetoder",
    "sentiment" : "OFFERED",
    "type" : "skill",
    "start-position" : 579,
    "end-position" : 603,
    "concept-id" : "TMVb_DnH_etF",
    "matched-string" : "agila utvecklingsmetoder",
    "annotation-id" : 15
  }, {
    "preferred-label" : "Ramverk",
    "sentiment" : "OFFERED",
    "type" : "skill-headline",
    "start-position" : 613,
    "end-position" : 620,
    "concept-id" : "srsj_GQb_CE1",
    "matched-string" : "ramverk",
    "annotation-id" : 8
  }, {
    "preferred-label" : "Java, programmeringsspråk",
    "sentiment" : "OFFERED",
    "type" : "skill",
    "start-position" : 655,
    "end-position" : 668,
    "concept-id" : "jCsR_WQX_CKD",
    "matched-string" : "javabibliotek",
    "annotation-id" : 16
  }, {
    "preferred-label" : "Java, programmeringsspråk",
    "sentiment" : "OFFERED",
    "type" : "skill",
    "start-position" : 670,
    "end-position" : 674,
    "concept-id" : "jCsR_WQX_CKD",
    "matched-string" : "java",
    "annotation-id" : 9
  } ],
  "text" : "Utbildningen ger dig allt du behöver för att vara med och utveckla framtidens IT-system. Agil Javautvecklare är en mycket eftertraktad utbildning och företagen i branschen har ett stort rekryteringsbehov av systemutvecklare med just den kompetens som utbildningen ger. Du får lära dig agila utvecklingsmetoder, jobba med moderna ramverk och plattformar samt nya populära javascriptbibliotek.    En systemutvecklare inom Java arbetar med att ta fram och utveckla data/IT-system eller delar av system. Kärnkompetensen för systemutvecklaren är programmering. Man förväntas behärska agila utvecklingsmetoder, moderna ramverk och plattformar samt nya populära javabibliotek. Java finns idag på ett stort antal företag och myndigheter, och dessa behöver löpande underhåll och utveckling."
}