{
  "meta" : {
    "jobad" : {
      "description" : {
        "requirements" : null,
        "needs" : null,
        "company_information" : null,
        "text_formatted" : "Vi söker dig som är en lagspelare, samarbetsvillig och prestigelös. I detta projekt efterfrågas förmågor som lösningsorienterade och samtidigt ett bra detaljfokus. Som junior projektledare rapporterar du till senior projektledare och fördelar din tid mellan två arbetsflöden, operativ förändring samt kommunikation och support. Du kommer ge stöd till butikskommunikation i form av att att säkerställa en plan gällande informationsspridning, utbildning och budskap till butiken, inom affärsutveckling kommer du att vara en samordnande part mellan reklam, IT och Profil. \n\nVi söker dig som har erfarenhet av att stötta, koordinera och skapa framsteg i flera parallella projekt under ledning av huvudprojektledaren. Du har även erfarenhet av att leda och stötta medarbetare som har möjlighet att bidra med en del av sin tid till detta projekt. Arbetsspråket är svenska och engelska. \nStart omgående, heltid, tillsvidare.\n\nDin ansökan\n\nLåter rollen intressant och passande? Ansök i så fall omgående för vi intervjuar löpande och rollen kan tillsättas innan sista ansökningsdatum. \n\nVi är flera rekryterare som hanterar rekryteringen av denna tjänst, vid frågor gällande den här rekryteringen eller tjänsten når du oss enklast på e-post info@quest.se \n\nVi kan enbart ta emot och bearbeta din ansökan genom att du registrerar ditt CV i vår portal. Med avseende på GDPR kan vi ej ta emot ansökningar via e-post. \n\nVarmt välkommen med din ansökan! \n\nUppdraget är en del av Quest Consulting personaluthyrning. Du kommer att vara anställd av Quest Consulting och arbeta som konsult hos vår kund.\n\nOm Quest Consulting\n\nQuest Consulting är ett auktoriserat konsultbolag med kollektivavtal, försäkringar, friskvård och tjänstepension. Vi är specialiserade inom IT, Teknik, HR, Administration och Ekonomi. Vår målsättning är att vara din personliga samarbetspartner och just därför är det så viktigt för oss att arbeta efter våra kärnvärden där våra ledord är att vara Personliga, Nyskapande och Professionella.",
        "conditions" : "Heltid\r\nTillsvidare",
        "text" : "Vi söker dig som är en lagspelare, samarbetsvillig och prestigelös. I detta projekt efterfrågas förmågor som lösningsorienterade och samtidigt ett bra detaljfokus. Som junior projektledare rapporterar du till senior projektledare och fördelar din tid mellan två arbetsflöden, operativ förändring samt kommunikation och support. Du kommer ge stöd till butikskommunikation i form av att att säkerställa en plan gällande informationsspridning, utbildning och budskap till butiken, inom affärsutveckling kommer du att vara en samordnande part mellan reklam, IT och Profil. \n\nVi söker dig som har erfarenhet av att stötta, koordinera och skapa framsteg i flera parallella projekt under ledning av huvudprojektledaren. Du har även erfarenhet av att leda och stötta medarbetare som har möjlighet att bidra med en del av sin tid till detta projekt. Arbetsspråket är svenska och engelska. \nStart omgående, heltid, tillsvidare.\n\nDin ansökan\n\nLåter rollen intressant och passande? Ansök i så fall omgående för vi intervjuar löpande och rollen kan tillsättas innan sista ansökningsdatum. \n\nVi är flera rekryterare som hanterar rekryteringen av denna tjänst, vid frågor gällande den här rekryteringen eller tjänsten når du oss enklast på e-post info@quest.se \n\nVi kan enbart ta emot och bearbeta din ansökan genom att du registrerar ditt CV i vår portal. Med avseende på GDPR kan vi ej ta emot ansökningar via e-post. \n\nVarmt välkommen med din ansökan! \n\nUppdraget är en del av Quest Consulting personaluthyrning. Du kommer att vara anställd av Quest Consulting och arbeta som konsult hos vår kund.\n\nOm Quest Consulting\n\nQuest Consulting är ett auktoriserat konsultbolag med kollektivavtal, försäkringar, friskvård och tjänstepension. Vi är specialiserade inom IT, Teknik, HR, Administration och Ekonomi. Vår målsättning är att vara din personliga samarbetspartner och just därför är det så viktigt för oss att arbeta efter våra kärnvärden där våra ledord är att vara Personliga, Nyskapande och Professionella."
      },
      "headline" : "Junior projektledare",
      "driving_license" : null,
      "employer" : {
        "email" : null,
        "phone_number" : null,
        "organization_number" : "5569456659",
        "name" : "Quest Consulting Sverige AB",
        "url" : null,
        "workplace" : "Quest Consulting"
      },
      "removed_date" : null,
      "logo_url" : "https://www.arbetsformedlingen.se/rest/arbetsgivare/rest/af/v3/organisation/5569456659/logotyper/logo.png",
      "last_publication_date" : "2022-08-04T23:59:59",
      "number_of_vacancies" : 1,
      "occupation" : {
        "concept_id" : "z5AM_ayf_WcL",
        "label" : "Projektledare, IT",
        "legacy_ams_taxonomy_id" : "5388"
      },
      "occupation_group" : {
        "concept_id" : "DJh5_yyF_hEM",
        "label" : "Mjukvaru- och systemutvecklare m.fl.",
        "legacy_ams_taxonomy_id" : "2512"
      },
      "employment_type" : {
        "concept_id" : "PFZr_Syz_cUq",
        "label" : "Vanlig anställning",
        "legacy_ams_taxonomy_id" : "1"
      },
      "webpage_url" : "https://arbetsformedlingen.se/platsbanken/annonser/26349652",
      "driving_license_required" : false,
      "application_contacts" : [ {
        "description" : "Quest Consulting",
        "email" : null,
        "telephone" : null,
        "name" : null,
        "contact_type" : null
      } ],
      "duration" : {
        "concept_id" : "a7uU_j21_mkL",
        "label" : "Tills vidare",
        "legacy_ams_taxonomy_id" : "1"
      },
      "nice_to_have" : {
        "education_level" : [ ],
        "work_experiences" : [ ],
        "skills" : [ ],
        "education" : [ ],
        "languages" : [ ]
      },
      "application_details" : {
        "via_af" : false,
        "email" : null,
        "other" : null,
        "reference" : null,
        "url" : "https://www.quest.se/lediga-jobb?mtrpage=assignment&mtrt=ams&mtrid=3550",
        "information" : null
      },
      "source_type" : "VIA_PLATSBANKEN_DXA",
      "application_deadline" : "2022-08-04T23:59:59",
      "external_id" : "46-556945-6659-3550",
      "workplace_address" : {
        "coordinates" : [ 18.06858, 59.329323 ],
        "city" : null,
        "postcode" : null,
        "municipality" : "Stockholm",
        "region_concept_id" : "CifL_Rzy_Mku",
        "region" : "Stockholms län",
        "country_code" : "199",
        "region_code" : "01",
        "municipality_concept_id" : "AvNB_uwa_6n6",
        "country_concept_id" : "i46j_HmG_v64",
        "municipality_code" : "0180",
        "street_address" : null,
        "country" : "Sverige"
      },
      "id" : "26349652",
      "experience_required" : true,
      "working_hours_type" : {
        "concept_id" : "6YE1_gAC_R2G",
        "label" : "Heltid",
        "legacy_ams_taxonomy_id" : "1"
      },
      "access" : null,
      "timestamp" : 1658729554423,
      "must_have" : {
        "education_level" : [ ],
        "work_experiences" : [ {
          "concept_id" : "z5AM_ayf_WcL",
          "weight" : 10,
          "label" : "Projektledare, IT",
          "legacy_ams_taxonomy_id" : "5388"
        } ],
        "skills" : [ ],
        "education" : [ ],
        "languages" : [ ]
      },
      "occupation_field" : {
        "concept_id" : "apaJ_2ja_LuF",
        "label" : "Data/IT",
        "legacy_ams_taxonomy_id" : "3"
      },
      "scope_of_work" : {
        "min" : 100,
        "max" : 100
      },
      "salary_type" : {
        "concept_id" : "oG8G_9cW_nRf",
        "label" : "Fast månads- vecko- eller timlön",
        "legacy_ams_taxonomy_id" : "1"
      },
      "removed" : false,
      "salary_description" : "Månadslön",
      "access_to_own_car" : false,
      "publication_date" : "2022-07-25T08:12:34"
    },
    "name" : "Junior projektledare",
    "user" : "hannes"
  },
  "sha1" : "4ce505f9a7a17a146375260972d57cb72833d8f9",
  "annotations" : [ {
    "preferred-label" : "Projektledare, IT",
    "type" : "occupation-name",
    "start-position" : 7,
    "end-position" : 20,
    "concept-id" : "z5AM_ayf_WcL",
    "matched-string" : "projektledare",
    "annotation-id" : 11
  }, {
    "preferred-label" : "Projektledare, IT",
    "type" : "occupation-name",
    "start-position" : 196,
    "end-position" : 209,
    "concept-id" : "z5AM_ayf_WcL",
    "matched-string" : "projektledare",
    "annotation-id" : 12
  }, {
    "preferred-label" : "Projektledare, IT",
    "type" : "occupation-name",
    "start-position" : 237,
    "end-position" : 250,
    "concept-id" : "z5AM_ayf_WcL",
    "matched-string" : "projektledare",
    "annotation-id" : 13
  }, {
    "preferred-label" : "Butikskommunikation",
    "sentiment" : "MUST_HAVE",
    "type" : "keyword",
    "start-position" : 372,
    "end-position" : 391,
    "concept-id" : "nYan_zib_hXG",
    "matched-string" : "butikskommunikation",
    "annotation-id" : 0
  }, {
    "preferred-label" : "Affärsutveckling",
    "sentiment" : "MUST_HAVE",
    "type" : "skill",
    "start-position" : 504,
    "end-position" : 520,
    "concept-id" : "TzHP_38y_mhm",
    "matched-string" : "affärsutveckling",
    "annotation-id" : 1
  }, {
    "preferred-label" : "Data/IT",
    "sentiment" : "MUST_HAVE",
    "type" : "occupation-field",
    "start-position" : 575,
    "end-position" : 577,
    "concept-id" : "apaJ_2ja_LuF",
    "matched-string" : "it",
    "annotation-id" : 2
  }, {
    "preferred-label" : "Svenska",
    "sentiment" : "MUST_HAVE",
    "type" : "language",
    "start-position" : 879,
    "end-position" : 886,
    "concept-id" : "zSLA_vw2_FXN",
    "matched-string" : "svenska",
    "annotation-id" : 3
  }, {
    "preferred-label" : "Engelska",
    "sentiment" : "MUST_HAVE",
    "type" : "language",
    "start-position" : 891,
    "end-position" : 899,
    "concept-id" : "NVxJ_hLg_TYS",
    "matched-string" : "engelska",
    "annotation-id" : 4
  }, {
    "preferred-label" : "Heltid",
    "type" : "worktime-extent",
    "start-position" : 918,
    "end-position" : 924,
    "concept-id" : "6YE1_gAC_R2G",
    "matched-string" : "heltid",
    "annotation-id" : 14
  }, {
    "preferred-label" : "Tillsvidareanställning (inkl. eventuell provanställning)",
    "type" : "employment-type",
    "start-position" : 926,
    "end-position" : 937,
    "concept-id" : "kpPX_CNN_gDU",
    "matched-string" : "tillsvidare",
    "annotation-id" : 15
  }, {
    "preferred-label" : "Rekryterare/Rekryteringskonsult",
    "sentiment" : "MUST_HAVE",
    "type" : "occupation-name",
    "start-position" : 1111,
    "end-position" : 1122,
    "concept-id" : "QaQC_ozP_Bme",
    "matched-string" : "rekryterare",
    "annotation-id" : 5
  }, {
    "preferred-label" : "Konsulttjänster till företag",
    "type" : "sni-level-3",
    "start-position" : 1585,
    "end-position" : 1592,
    "concept-id" : "APkH_QHR_9X2",
    "matched-string" : "konsult",
    "annotation-id" : 16
  }, {
    "preferred-label" : "Kollektivavtal",
    "sentiment" : "MUST_HAVE",
    "type" : "skill",
    "start-position" : 1683,
    "end-position" : 1697,
    "concept-id" : "z7wE_9xb_3jX",
    "matched-string" : "kollektivavtal",
    "annotation-id" : 7
  }, {
    "preferred-label" : "Friskvård",
    "sentiment" : "MUST_HAVE",
    "type" : "keyword",
    "start-position" : 1713,
    "end-position" : 1722,
    "concept-id" : "yoHe_xjK_qjH",
    "matched-string" : "friskvård",
    "annotation-id" : 8
  }, {
    "preferred-label" : "Data/IT",
    "sentiment" : "MUST_HAVE",
    "type" : "occupation-field",
    "start-position" : 1769,
    "end-position" : 1771,
    "concept-id" : "apaJ_2ja_LuF",
    "matched-string" : "it",
    "annotation-id" : 9
  }, {
    "preferred-label" : "HR",
    "type" : "keyword",
    "start-position" : 1781,
    "end-position" : 1783,
    "concept-id" : "YxV3_BQC_eMP",
    "matched-string" : "HR",
    "annotation-id" : 17
  }, {
    "preferred-label" : "Ekonomi",
    "sentiment" : "MUST_HAVE",
    "type" : "keyword",
    "start-position" : 1804,
    "end-position" : 1811,
    "concept-id" : "PW4f_bmT_new",
    "matched-string" : "ekonomi",
    "annotation-id" : 10
  } ],
  "text" : "Junior projektledare\nVi söker dig som är en lagspelare, samarbetsvillig och prestigelös. I detta projekt efterfrågas förmågor som lösningsorienterade och samtidigt ett bra detaljfokus. Som junior projektledare rapporterar du till senior projektledare och fördelar din tid mellan två arbetsflöden, operativ förändring samt kommunikation och support. Du kommer ge stöd till butikskommunikation i form av att att säkerställa en plan gällande informationsspridning, utbildning och budskap till butiken, inom affärsutveckling kommer du att vara en samordnande part mellan reklam, IT och Profil. \n\nVi söker dig som har erfarenhet av att stötta, koordinera och skapa framsteg i flera parallella projekt under ledning av huvudprojektledaren. Du har även erfarenhet av att leda och stötta medarbetare som har möjlighet att bidra med en del av sin tid till detta projekt. Arbetsspråket är svenska och engelska. \nStart omgående, heltid, tillsvidare.\n\nDin ansökan\n\nLåter rollen intressant och passande? Ansök i så fall omgående för vi intervjuar löpande och rollen kan tillsättas innan sista ansökningsdatum. \n\nVi är flera rekryterare som hanterar rekryteringen av denna tjänst, vid frågor gällande den här rekryteringen eller tjänsten når du oss enklast på e-post info@quest.se \n\nVi kan enbart ta emot och bearbeta din ansökan genom att du registrerar ditt CV i vår portal. Med avseende på GDPR kan vi ej ta emot ansökningar via e-post. \n\nVarmt välkommen med din ansökan! \n\nUppdraget är en del av Quest Consulting personaluthyrning. Du kommer att vara anställd av Quest Consulting och arbeta som konsult hos vår kund.\n\nOm Quest Consulting\n\nQuest Consulting är ett auktoriserat konsultbolag med kollektivavtal, försäkringar, friskvård och tjänstepension. Vi är specialiserade inom IT, Teknik, HR, Administration och Ekonomi. Vår målsättning är att vara din personliga samarbetspartner och just därför är det så viktigt för oss att arbeta efter våra kärnvärden där våra ledord är att vara Personliga, Nyskapande och Professionella."
}