{
  "meta" : {
    "jobad" : {
      "description" : {
        "requirements" : null,
        "needs" : null,
        "company_information" : null,
        "text_formatted" : "Start Omgående till Göteborg\n\nVi söker dig som har erfarenhet av svetsning och armering. Som person bör du ha god fysik, vara noggrann och arbeta strukturerat med en positiv inställning. Du arbetar efter uppsatta mål. \n\nVi ser att du är engagerad och brinner för detta, du är lika lyhörd som du är kommunikativ med din grupp som med kunderna.\n\nTjänsten innebär arbete utomhus.\n\nHuvudsakliga arbetsuppgifter\nDu kommer att arbeta med armering och tillhörande uppgifter såsom, armering, ritningsläsning, gasskärning mm.\r\n\r\nKvalifikationer\n\n • Erfarenhet av arbeten som Betongarbetare/armerare.\n • Ritningsläsning i armering\n • Svetsning\n • Gasskärning\n\nFör oss är dina personliga egenskaper viktiga. Vi söker dig som är lättlärd, har stor drivkraft och som jobbar bra både i grupp och på egen hand. En positiv attityd, stort engagemang är egenskaper som vi värderar högt. Som person ser vi att du är ansvarsfull och kvalitetsmedveten. Du är en problemlösare och gillar utmaningar. För rätt person leder uppdraget till anställning hos vår kund.\n\nTycker du att det här låter intressant? Vänta inte med din ansökan, vi kommer börja gå igenom ansökningarna och kalla på intervju snarast möjligt.",
        "conditions" : "Heltid\r\nHeltid",
        "text" : "Start Omgående till Göteborg\n\nVi söker dig som har erfarenhet av svetsning och armering. Som person bör du ha god fysik, vara noggrann och arbeta strukturerat med en positiv inställning. Du arbetar efter uppsatta mål. \n\nVi ser att du är engagerad och brinner för detta, du är lika lyhörd som du är kommunikativ med din grupp som med kunderna.\n\nTjänsten innebär arbete utomhus.\n\nHuvudsakliga arbetsuppgifter\nDu kommer att arbeta med armering och tillhörande uppgifter såsom, armering, ritningsläsning, gasskärning mm.\r\n\r\nKvalifikationer\n\n • Erfarenhet av arbeten som Betongarbetare/armerare.\n • Ritningsläsning i armering\n • Svetsning\n • Gasskärning\n\nFör oss är dina personliga egenskaper viktiga. Vi söker dig som är lättlärd, har stor drivkraft och som jobbar bra både i grupp och på egen hand. En positiv attityd, stort engagemang är egenskaper som vi värderar högt. Som person ser vi att du är ansvarsfull och kvalitetsmedveten. Du är en problemlösare och gillar utmaningar. För rätt person leder uppdraget till anställning hos vår kund.\n\nTycker du att det här låter intressant? Vänta inte med din ansökan, vi kommer börja gå igenom ansökningarna och kalla på intervju snarast möjligt."
      },
      "headline" : "Armerare / Svetsare",
      "driving_license" : null,
      "employer" : {
        "email" : null,
        "phone_number" : null,
        "organization_number" : "5592070238",
        "name" : "Tigerns industribemanning AB",
        "url" : "https://tigerns.se/",
        "workplace" : "Tigerns Industribemanning AB"
      },
      "removed_date" : null,
      "logo_url" : null,
      "last_publication_date" : "2022-08-31T23:59:59",
      "number_of_vacancies" : 3,
      "occupation" : {
        "concept_id" : "3uEE_35U_U6j",
        "label" : "Grovarbetare, bygg och anläggning",
        "legacy_ams_taxonomy_id" : "5874"
      },
      "occupation_group" : {
        "concept_id" : "iHrC_aRv_fVm",
        "label" : "Grovarbetare inom bygg och anläggning",
        "legacy_ams_taxonomy_id" : "9310"
      },
      "employment_type" : {
        "concept_id" : "PFZr_Syz_cUq",
        "label" : "Vanlig anställning",
        "legacy_ams_taxonomy_id" : "1"
      },
      "webpage_url" : "https://arbetsformedlingen.se/platsbanken/annonser/26362945",
      "driving_license_required" : false,
      "application_contacts" : [ {
        "description" : "Patrik Tigermark",
        "email" : null,
        "telephone" : null,
        "name" : null,
        "contact_type" : "Rekryterare"
      } ],
      "duration" : {
        "concept_id" : "Xj7x_7yZ_jEn",
        "label" : "3 månader – upp till 6 månader",
        "legacy_ams_taxonomy_id" : "3"
      },
      "nice_to_have" : {
        "education_level" : [ ],
        "work_experiences" : [ ],
        "skills" : [ ],
        "education" : [ ],
        "languages" : [ ]
      },
      "application_details" : {
        "via_af" : false,
        "email" : null,
        "other" : null,
        "reference" : null,
        "url" : "https://tigerns.zerolime.se/show.aspx?src=AMS&id=0692D91F-3F0A-45D2-9432-D4F732CDAF9D",
        "information" : null
      },
      "source_type" : "VIA_PLATSBANKEN_DXA",
      "application_deadline" : "2022-08-31T23:59:59",
      "external_id" : "46-559207-0238-0000000069B57CF6CF",
      "workplace_address" : {
        "coordinates" : [ 11.97456, 57.70887 ],
        "city" : null,
        "postcode" : null,
        "municipality" : "Göteborg",
        "region_concept_id" : "zdoY_6u5_Krt",
        "region" : "Västra Götalands län",
        "country_code" : "199",
        "region_code" : "14",
        "municipality_concept_id" : "PVZL_BQT_XtL",
        "country_concept_id" : "i46j_HmG_v64",
        "municipality_code" : "1480",
        "street_address" : null,
        "country" : "Sverige"
      },
      "id" : "26362945",
      "experience_required" : true,
      "working_hours_type" : {
        "concept_id" : "6YE1_gAC_R2G",
        "label" : "Heltid",
        "legacy_ams_taxonomy_id" : "1"
      },
      "access" : null,
      "timestamp" : 1659088995161,
      "must_have" : {
        "education_level" : [ ],
        "work_experiences" : [ {
          "concept_id" : "3uEE_35U_U6j",
          "weight" : 10,
          "label" : "Grovarbetare, bygg och anläggning",
          "legacy_ams_taxonomy_id" : "5874"
        } ],
        "skills" : [ ],
        "education" : [ ],
        "languages" : [ ]
      },
      "occupation_field" : {
        "concept_id" : "j7Cq_ZJe_GkT",
        "label" : "Bygg och anläggning",
        "legacy_ams_taxonomy_id" : "2"
      },
      "scope_of_work" : {
        "min" : 100,
        "max" : 100
      },
      "salary_type" : {
        "concept_id" : "oG8G_9cW_nRf",
        "label" : "Fast månads- vecko- eller timlön",
        "legacy_ams_taxonomy_id" : "1"
      },
      "removed" : false,
      "salary_description" : "Enligt avtal",
      "access_to_own_car" : false,
      "publication_date" : "2022-07-29T11:47:13"
    },
    "name" : "Armerare / Svetsare",
    "user" : "hannes"
  },
  "sha1" : "57ce6cce36c08b9c16b2481bca3d0c423d0fe5f4",
  "annotations" : [ {
    "preferred-label" : "Armerare",
    "sentiment" : "MUST_HAVE",
    "type" : "keyword",
    "start-position" : 0,
    "end-position" : 8,
    "concept-id" : "85fS_BpT_RsU",
    "matched-string" : "armerare",
    "annotation-id" : 0
  }, {
    "preferred-label" : "Svetsare",
    "sentiment" : "MUST_HAVE",
    "type" : "keyword",
    "start-position" : 11,
    "end-position" : 19,
    "concept-id" : "ouXc_F9J_bAC",
    "matched-string" : "svetsare",
    "annotation-id" : 1
  }, {
    "preferred-label" : "Göteborg",
    "type" : "municipality",
    "start-position" : 40,
    "end-position" : 48,
    "concept-id" : "PVZL_BQT_XtL",
    "matched-string" : "Göteborg",
    "annotation-id" : 13
  }, {
    "preferred-label" : "Svets",
    "type" : "keyword",
    "start-position" : 85,
    "end-position" : 94,
    "concept-id" : "Emhe_ce6_MYC",
    "matched-string" : "svetsning",
    "annotation-id" : 14
  }, {
    "preferred-label" : "Armering",
    "sentiment" : "MUST_HAVE",
    "type" : "skill",
    "start-position" : 99,
    "end-position" : 107,
    "concept-id" : "Q6ez_byQ_HQj",
    "matched-string" : "armering",
    "annotation-id" : 2
  }, {
    "preferred-label" : "God fysik (tunga lyft)",
    "type" : "skill",
    "start-position" : 130,
    "end-position" : 139,
    "concept-id" : "rwir_xvu_443",
    "matched-string" : "god fysik",
    "annotation-id" : 15
  }, {
    "preferred-label" : "noggrannhet",
    "type" : "esco-skill",
    "start-position" : 146,
    "end-position" : 154,
    "concept-id" : "mrsW_EkL_KRD",
    "matched-string" : "noggrann",
    "annotation-id" : 16
  }, {
    "preferred-label" : "Armering",
    "sentiment" : "MUST_HAVE",
    "type" : "skill",
    "start-position" : 452,
    "end-position" : 460,
    "concept-id" : "Q6ez_byQ_HQj",
    "matched-string" : "armering",
    "annotation-id" : 4
  }, {
    "preferred-label" : "Armering",
    "sentiment" : "MUST_HAVE",
    "type" : "skill",
    "start-position" : 494,
    "end-position" : 502,
    "concept-id" : "Q6ez_byQ_HQj",
    "matched-string" : "armering",
    "annotation-id" : 5
  }, {
    "preferred-label" : "Ritningsläsning",
    "sentiment" : "MUST_HAVE",
    "type" : "skill",
    "start-position" : 504,
    "end-position" : 519,
    "concept-id" : "aHCV_VsV_LiD",
    "matched-string" : "ritningsläsning",
    "annotation-id" : 6
  }, {
    "preferred-label" : "Gasskärning",
    "sentiment" : "MUST_HAVE",
    "type" : "skill",
    "start-position" : 521,
    "end-position" : 532,
    "concept-id" : "oZmV_VcV_sHi",
    "matched-string" : "gasskärning",
    "annotation-id" : 7
  }, {
    "preferred-label" : "Betongarbetare",
    "sentiment" : "MUST_HAVE",
    "type" : "ssyk-level-4",
    "start-position" : 586,
    "end-position" : 600,
    "concept-id" : "q2Ge_zrQ_zJb",
    "matched-string" : "betongarbetare",
    "annotation-id" : 8
  }, {
    "preferred-label" : "Armerare",
    "sentiment" : "MUST_HAVE",
    "type" : "keyword",
    "start-position" : 601,
    "end-position" : 609,
    "concept-id" : "85fS_BpT_RsU",
    "matched-string" : "armerare",
    "annotation-id" : 9
  }, {
    "preferred-label" : "Ritningsläsning",
    "sentiment" : "MUST_HAVE",
    "type" : "skill",
    "start-position" : 614,
    "end-position" : 629,
    "concept-id" : "aHCV_VsV_LiD",
    "matched-string" : "ritningsläsning",
    "annotation-id" : 10
  }, {
    "preferred-label" : "Armering",
    "sentiment" : "MUST_HAVE",
    "type" : "skill",
    "start-position" : 632,
    "end-position" : 640,
    "concept-id" : "Q6ez_byQ_HQj",
    "matched-string" : "armering",
    "annotation-id" : 11
  }, {
    "preferred-label" : "Svets",
    "type" : "keyword",
    "start-position" : 644,
    "end-position" : 653,
    "concept-id" : "Emhe_ce6_MYC",
    "matched-string" : "Svetsning",
    "annotation-id" : 17
  }, {
    "preferred-label" : "Gasskärning",
    "sentiment" : "MUST_HAVE",
    "type" : "skill",
    "start-position" : 657,
    "end-position" : 668,
    "concept-id" : "oZmV_VcV_sHi",
    "matched-string" : "gasskärning",
    "annotation-id" : 12
  } ],
  "text" : "Armerare / Svetsare\nStart Omgående till Göteborg\n\nVi söker dig som har erfarenhet av svetsning och armering. Som person bör du ha god fysik, vara noggrann och arbeta strukturerat med en positiv inställning. Du arbetar efter uppsatta mål. \n\nVi ser att du är engagerad och brinner för detta, du är lika lyhörd som du är kommunikativ med din grupp som med kunderna.\n\nTjänsten innebär arbete utomhus.\n\nHuvudsakliga arbetsuppgifter\nDu kommer att arbeta med armering och tillhörande uppgifter såsom, armering, ritningsläsning, gasskärning mm.\r\n\r\nKvalifikationer\n\n • Erfarenhet av arbeten som Betongarbetare/armerare.\n • Ritningsläsning i armering\n • Svetsning\n • Gasskärning\n\nFör oss är dina personliga egenskaper viktiga. Vi söker dig som är lättlärd, har stor drivkraft och som jobbar bra både i grupp och på egen hand. En positiv attityd, stort engagemang är egenskaper som vi värderar högt. Som person ser vi att du är ansvarsfull och kvalitetsmedveten. Du är en problemlösare och gillar utmaningar. För rätt person leder uppdraget till anställning hos vår kund.\n\nTycker du att det här låter intressant? Vänta inte med din ansökan, vi kommer börja gå igenom ansökningarna och kalla på intervju snarast möjligt."
}