{
  "meta" : {
    "dataset-id" : "myh-spreadsheet-2021",
    "type" : "education-description",
    "dataset-document-id" : "YH00361",
    "user" : "kristof.fischer"
  },
  "sha1" : "f85adeac476670e0be8bbe1178377a1d0c2af987",
  "annotations" : [ {
    "preferred-label" : "webbutvecklare",
    "sentiment" : "OFFERED",
    "type" : "esco-occupation",
    "start-position" : 18,
    "end-position" : 32,
    "concept-id" : "AkVP_op7_dSC",
    "matched-string" : "webbutvecklare",
    "annotation-id" : 0
  }, {
    "preferred-label" : "webbutvecklare",
    "sentiment" : "OFFERED",
    "type" : "esco-occupation",
    "start-position" : 414,
    "end-position" : 428,
    "concept-id" : "AkVP_op7_dSC",
    "matched-string" : "webbutvecklare",
    "annotation-id" : 2
  }, {
    "preferred-label" : "webbutvecklare",
    "sentiment" : "OFFERED",
    "type" : "esco-occupation",
    "start-position" : 474,
    "end-position" : 488,
    "concept-id" : "AkVP_op7_dSC",
    "matched-string" : "webbutvecklare",
    "annotation-id" : 4
  }, {
    "preferred-label" : "Webbutveckling",
    "sentiment" : "OFFERED",
    "type" : "skill",
    "start-position" : 636,
    "end-position" : 650,
    "concept-id" : "AfJ4_Pvv_YBa",
    "matched-string" : "webbutveckling",
    "annotation-id" : 26
  }, {
    "preferred-label" : "User experience",
    "sentiment" : "OFFERED",
    "type" : "skill",
    "start-position" : 745,
    "end-position" : 747,
    "concept-id" : "AdgQ_txR_S3M",
    "matched-string" : "UX",
    "annotation-id" : 27
  }, {
    "preferred-label" : "Grafiska gränssnitt/GUI",
    "sentiment" : "OFFERED",
    "type" : "skill",
    "start-position" : 748,
    "end-position" : 750,
    "concept-id" : "5Vk5_FW2_ceH",
    "matched-string" : "UI",
    "annotation-id" : 28
  }, {
    "preferred-label" : "använda databaser",
    "sentiment" : "OFFERED",
    "type" : "esco-skill",
    "start-position" : 772,
    "end-position" : 781,
    "concept-id" : "GbAF_v3z_PeS",
    "matched-string" : "databaser",
    "annotation-id" : 29
  }, {
    "preferred-label" : "Hemsideproduktion, undervisning",
    "sentiment" : "OFFERED",
    "type" : "skill",
    "start-position" : 804,
    "end-position" : 815,
    "concept-id" : "3zuH_m51_LHq",
    "matched-string" : "webbplatser",
    "annotation-id" : 30
  }, {
    "preferred-label" : "Systemutveckling",
    "sentiment" : "OFFERED",
    "type" : "skill",
    "start-position" : 845,
    "end-position" : 858,
    "concept-id" : "D7Ns_RG6_hD2",
    "matched-string" : "skapar system",
    "annotation-id" : 31
  }, {
    "preferred-label" : "utveckla professionella nätverk",
    "sentiment" : "OFFERED",
    "type" : "esco-skill",
    "start-position" : 1153,
    "end-position" : 1172,
    "concept-id" : "fS7r_bUJ_kF3",
    "matched-string" : "bygger ditt nätverk",
    "annotation-id" : 32
  }, {
    "preferred-label" : "upprätthålla arbetsmässiga relationer",
    "sentiment" : "OFFERED",
    "type" : "esco-skill",
    "start-position" : 1177,
    "end-position" : 1220,
    "concept-id" : "FSSe_5dD_kXc",
    "matched-string" : "skapar relationer med framtida arbetsgivare",
    "annotation-id" : 33
  }, {
    "preferred-label" : "webbutvecklare",
    "sentiment" : "OFFERED",
    "type" : "esco-occupation",
    "start-position" : 1913,
    "end-position" : 1927,
    "concept-id" : "AkVP_op7_dSC",
    "matched-string" : "webbutvecklare",
    "annotation-id" : 13
  }, {
    "preferred-label" : "webbutvecklare",
    "sentiment" : "OFFERED",
    "type" : "esco-occupation",
    "start-position" : 2165,
    "end-position" : 2179,
    "concept-id" : "AkVP_op7_dSC",
    "matched-string" : "webbutvecklare",
    "annotation-id" : 17
  }, {
    "preferred-label" : "webbutvecklare",
    "sentiment" : "OFFERED",
    "type" : "esco-occupation",
    "start-position" : 2303,
    "end-position" : 2317,
    "concept-id" : "AkVP_op7_dSC",
    "matched-string" : "webbutvecklare",
    "annotation-id" : 19
  }, {
    "preferred-label" : "Systemutvecklare/Programmerare",
    "sentiment" : "OFFERED",
    "type" : "occupation-name",
    "start-position" : 2321,
    "end-position" : 2338,
    "concept-id" : "fg7B_yov_smw",
    "matched-string" : "Webbprogrammerare",
    "annotation-id" : 34
  }, {
    "preferred-label" : null,
    "sentiment" : "OFFERED",
    "type" : "occupation-name",
    "start-position" : 2342,
    "comment" : "finns som keyword",
    "end-position" : 2361,
    "concept-id" : null,
    "matched-string" : "e-handelsutvecklare",
    "annotation-id" : 20
  }, {
    "preferred-label" : "Applikationsutvecklare",
    "sentiment" : "OFFERED",
    "type" : "occupation-name",
    "start-position" : 2365,
    "end-position" : 2391,
    "concept-id" : "CZkP_hCz_KM8",
    "matched-string" : "webbapplikationsutvecklare",
    "annotation-id" : 21
  }, {
    "preferred-label" : "projektledare",
    "sentiment" : "OFFERED",
    "type" : "esco-occupation",
    "start-position" : 2395,
    "end-position" : 2408,
    "concept-id" : "nzMp_xN5_r6G",
    "matched-string" : "Projektledare",
    "annotation-id" : 35
  }, {
    "preferred-label" : "Webbdesigner",
    "sentiment" : "OFFERED",
    "type" : "occupation-name",
    "start-position" : 2426,
    "end-position" : 2438,
    "concept-id" : "PTs4_wYQ_zDP",
    "matched-string" : "webbdesigner",
    "annotation-id" : 24
  }, {
    "preferred-label" : "UX-designer",
    "sentiment" : "OFFERED",
    "type" : "occupation-name",
    "start-position" : 2442,
    "end-position" : 2453,
    "concept-id" : "iwJU_gW4_SxT",
    "matched-string" : "ux-designer",
    "annotation-id" : 25
  } ],
  "text" : "E-handeln behöver webbutvecklare med fokus på kundens affärsnytta och UX. Idag handlar 9 av 10 svenskar varor och tjänster på nätet. Dynamisk webbutveckling, apputveckling, mobile first, responsiv design och UX-design utvecklas i högt tempo. Digitala strategier och digitala kampanjer är viktiga framgångsfaktorer. Vill du vara med och utveckla dagens och framtidens e-handelslösningar? Då ska du satsa på att bli webbutvecklare inom e-handel!    Genom att utbilda dig till webbutvecklare inom e-handel får du en unik kompetensmix som är starkt efterfrågad på arbetsmarknaden. Du får en överblick över e-handeln och du lär dig dynamisk webbutveckling där design, layout och webshopens funktioner samverkar och stödjer kundens totala upplevelse (UX/UI). Du lär dig hantera databaser, du bygger responsiva webbplatser för mobila plattformar, samt skapar system och integrationer för flöden inom dagens e-handel.    Som en del av utbildningen gör du LIA (Lärande i arbete, praktik, internship) hos ledande branschföretag. LIAn fördjupar och breddar ditt lärande och du får arbetserfarenheter som krävs för att utveckla dagens och morgondagens e-handel. Du bygger ditt nätverk och skapar relationer med framtida arbetsgivare redan under studietiden.    9 av 10 svenskar väljer att handla via digitala plattformar. Utbudet är enormt, det är enkelt att jämföra priser och e-butiken är öppen dygnet runt. Företagen måste hela tiden utvecklas för att kunna mäta sig mot svenska och utländska konkurrenter. Det är viktigt att förstå kundens totala köpupplevelse, som omfattar e-butikens design och funktioner, den faktiska varan/tjänsten, marknadsföringen, servicen, kvalitén och leveransvillkoren. Erbjudandet ska fungera oavsett om kunden vill handla via dator, läsplatta, mobiltelefon, smartwatch eller annan digital enhet.    Vi samarbetar med en rad företag och organisationer som alla uttrycker ett växande behov av webbutvecklare inom e-handel. Vi har samlat några av branschens mest kunniga utvecklare och föreläsare inom webbutveckling, webbprogrammering, webbdesign och e-commerce under ett och samma tak. Du får möjlighet att utbilda dig till framtidens vassaste webbutvecklare inom e-handel. Du sätter själv ribban för hur långt du vill nå under dina två år hos oss.    Exempel på yrkesroller är:  • Webbutvecklare  • Webbprogrammerare  • E-handelsutvecklare  • Webbapplikationsutvecklare  • Projektledare Webb/E-handel  • Webbdesigner  • UX-designer  "
}