{
  "meta" : {
    "jobad" : {
      "description" : {
        "requirements" : null,
        "needs" : null,
        "company_information" : null,
        "text_formatted" : "Vill du vara med och göra skillnad i ett av Sveriges viktigaste jobb? Välkommen att söka någon av våra två tjänster som Vårdare i Daglig verksamhet. Verksamheten bedrivs i ändamålsenliga lokaler i Lagan. \n\nBesök oss gärna på www.ljungby.se/jobb  för att läsa mer om Ljungby kommun som arbetsgivare.\r\n\r\nARBETSUPPGIFTER\nMed ett pedagogiskt, coachande och motiverande arbetssätt bidrar du till en meningsfull vardag för två kvinnor med autism. Arbetet innebär att stödja dem i dagliga verksamhetens aktiviteter, vilket förutsätter salutogent förhållningssätt och lågaffektivt bemötande. Vård och omvårdnad ingår. Du arbetar omväxlande hos de bägge.\n\nDokumentation förekommer.\r\n\r\nKVALIFIKATIONER\nÖnskvärt är utbildning som stödpedagog, undersköterska, barn- och fritid eller annan utbildning som arbetsgivaren bedömer som likvärdig. Vi ser gärna att du har utbildning i lågaffektivt bemötande samt erfarenhet från liknande arbete. Du behöver vara lyhörd och flexibel.\n\nDu behöver ha B-körkort och IT-vana.\n\nVi lägger stor vikt vid personlig lämplighet för tjänsten.\r\n\nÖVRIGT\nIntervjuer sker löpande under ansökningstiden. Betyg och intyg behöver inte bifogas ansökan utan tas med vid en eventuell intervju.\n\nKommunen tar ansvar för hela rekryteringen\noch undanber sig därför samtal från rekryteringsfirmor och annonssäljare.",
        "conditions" : "Deltid. ca 80% \r\nTillsvidareanställning, tillträde: Tillträde enligt överenskommelse. Provanställning 6 mån kan komma att tillämpas.",
        "text" : "Vill du vara med och göra skillnad i ett av Sveriges viktigaste jobb? Välkommen att söka någon av våra två tjänster som Vårdare i Daglig verksamhet. Verksamheten bedrivs i ändamålsenliga lokaler i Lagan. \n\nBesök oss gärna på www.ljungby.se/jobb  för att läsa mer om Ljungby kommun som arbetsgivare.\r\n\r\nARBETSUPPGIFTER\nMed ett pedagogiskt, coachande och motiverande arbetssätt bidrar du till en meningsfull vardag för två kvinnor med autism. Arbetet innebär att stödja dem i dagliga verksamhetens aktiviteter, vilket förutsätter salutogent förhållningssätt och lågaffektivt bemötande. Vård och omvårdnad ingår. Du arbetar omväxlande hos de bägge.\n\nDokumentation förekommer.\r\n\r\nKVALIFIKATIONER\nÖnskvärt är utbildning som stödpedagog, undersköterska, barn- och fritid eller annan utbildning som arbetsgivaren bedömer som likvärdig. Vi ser gärna att du har utbildning i lågaffektivt bemötande samt erfarenhet från liknande arbete. Du behöver vara lyhörd och flexibel.\n\nDu behöver ha B-körkort och IT-vana.\n\nVi lägger stor vikt vid personlig lämplighet för tjänsten.\r\n\nÖVRIGT\nIntervjuer sker löpande under ansökningstiden. Betyg och intyg behöver inte bifogas ansökan utan tas med vid en eventuell intervju.\n\nKommunen tar ansvar för hela rekryteringen\noch undanber sig därför samtal från rekryteringsfirmor och annonssäljare."
      },
      "headline" : "Vårdare, 2 tjänster",
      "driving_license" : null,
      "employer" : {
        "email" : null,
        "phone_number" : null,
        "organization_number" : "2120000670",
        "name" : "Ljungby kommun",
        "url" : null,
        "workplace" : "Ljungby kommun, Socialförvaltningen"
      },
      "removed_date" : null,
      "logo_url" : "https://www.arbetsformedlingen.se/rest/arbetsgivare/rest/af/v3/organisation/2120000670/logotyper/logo.png",
      "last_publication_date" : "2022-08-21T23:59:59",
      "number_of_vacancies" : 2,
      "occupation" : {
        "concept_id" : "c32f_KpH_CfN",
        "label" : "Vårdare/Arbetshandledare/Boendestödjare",
        "legacy_ams_taxonomy_id" : "6317"
      },
      "occupation_group" : {
        "concept_id" : "7pz9_eY9_D2s",
        "label" : "Vårdare, boendestödjare",
        "legacy_ams_taxonomy_id" : "5342"
      },
      "employment_type" : {
        "concept_id" : "PFZr_Syz_cUq",
        "label" : "Vanlig anställning",
        "legacy_ams_taxonomy_id" : "1"
      },
      "webpage_url" : "https://arbetsformedlingen.se/platsbanken/annonser/26372790",
      "driving_license_required" : false,
      "application_contacts" : [ {
        "description" : "Jonas Carlsson",
        "email" : "jonas.carlsson@ljungby.se",
        "telephone" : "0372 - 78 98 24",
        "name" : null,
        "contact_type" : "Sektionschef"
      }, {
        "description" : "Maritha Karlsson",
        "email" : "maritha.karlsson@ljungby.se",
        "telephone" : "0372- 78 97 61",
        "name" : null,
        "contact_type" : "Samordnare OF"
      } ],
      "duration" : {
        "concept_id" : "a7uU_j21_mkL",
        "label" : "Tills vidare",
        "legacy_ams_taxonomy_id" : "1"
      },
      "nice_to_have" : {
        "education_level" : [ ],
        "work_experiences" : [ ],
        "skills" : [ ],
        "education" : [ ],
        "languages" : [ ]
      },
      "application_details" : {
        "via_af" : false,
        "email" : null,
        "other" : null,
        "reference" : "A1145984",
        "url" : "https://recruit.visma.com/Public/Apply.aspx?guidAssignment=26b60662-5b2a-4cf4-9b8b-4c01d36b1cfd&publishCode=AMS&TK=20ff91e3-21e6-468f-a723-27c1d6553d25",
        "information" : null
      },
      "source_type" : "VIA_PLATSBANKEN_DXA",
      "application_deadline" : "2022-08-21T23:59:59",
      "external_id" : "46-212000-0670-26B606625B2A4CF49B8B4C01D36B1CFD",
      "workplace_address" : {
        "coordinates" : [ 13.941042, 56.833878 ],
        "city" : null,
        "postcode" : null,
        "municipality" : "Ljungby",
        "region_concept_id" : "tF3y_MF9_h5G",
        "region" : "Kronobergs län",
        "country_code" : "199",
        "region_code" : "07",
        "municipality_concept_id" : "GzKo_S48_QCm",
        "country_concept_id" : "i46j_HmG_v64",
        "municipality_code" : "0781",
        "street_address" : null,
        "country" : "Sverige"
      },
      "id" : "26372790",
      "experience_required" : true,
      "working_hours_type" : {
        "concept_id" : "947z_JGS_Uk2",
        "label" : "Deltid",
        "legacy_ams_taxonomy_id" : "2"
      },
      "access" : null,
      "timestamp" : 1659456023952,
      "must_have" : {
        "education_level" : [ ],
        "work_experiences" : [ {
          "concept_id" : "c32f_KpH_CfN",
          "weight" : 10,
          "label" : "Vårdare/Arbetshandledare/Boendestödjare",
          "legacy_ams_taxonomy_id" : "6317"
        } ],
        "skills" : [ ],
        "education" : [ ],
        "languages" : [ ]
      },
      "occupation_field" : {
        "concept_id" : "GazW_2TU_kJw",
        "label" : "Yrken med social inriktning",
        "legacy_ams_taxonomy_id" : "16"
      },
      "scope_of_work" : {
        "min" : 80,
        "max" : 100
      },
      "salary_type" : {
        "concept_id" : "oG8G_9cW_nRf",
        "label" : "Fast månads- vecko- eller timlön",
        "legacy_ams_taxonomy_id" : "1"
      },
      "removed" : false,
      "salary_description" : "Enligt avtal.",
      "access_to_own_car" : false,
      "publication_date" : "2022-08-02T18:00:23"
    },
    "name" : "Vårdare, 2 tjänster",
    "user" : "kristof.fischer"
  },
  "sha1" : "37c2eda73d86f34dc50b240eb6d8104ce1ea7748",
  "annotations" : [ {
    "preferred-label" : "Vårdare/Arbetshandledare/Boendestödjare",
    "sentiment" : "MUST_HAVE",
    "type" : "occupation-name",
    "start-position" : 0,
    "end-position" : 7,
    "concept-id" : "c32f_KpH_CfN",
    "matched-string" : "vårdare",
    "annotation-id" : 0
  }, {
    "preferred-label" : "Sverige",
    "type" : "country",
    "start-position" : 64,
    "end-position" : 72,
    "concept-id" : "i46j_HmG_v64",
    "matched-string" : "Sveriges",
    "annotation-id" : 8
  }, {
    "preferred-label" : "Vårdare/Arbetshandledare/Boendestödjare",
    "sentiment" : "MUST_HAVE",
    "type" : "occupation-name",
    "start-position" : 140,
    "end-position" : 147,
    "concept-id" : "c32f_KpH_CfN",
    "matched-string" : "vårdare",
    "annotation-id" : 1
  }, {
    "preferred-label" : "Daglig verksamhet",
    "sentiment" : "MUST_HAVE",
    "type" : "skill",
    "start-position" : 150,
    "end-position" : 167,
    "concept-id" : "zMr8_cTC_PCB",
    "matched-string" : "daglig verksamhet",
    "annotation-id" : 2
  }, {
    "preferred-label" : "Ljungby",
    "type" : "municipality",
    "start-position" : 286,
    "end-position" : 293,
    "concept-id" : "GzKo_S48_QCm",
    "matched-string" : "Ljungby",
    "annotation-id" : 9
  }, {
    "preferred-label" : "Pedagogiskt förhållningssätt",
    "type" : "skill",
    "start-position" : 346,
    "end-position" : 357,
    "concept-id" : "qMfa_U8e_Lto",
    "matched-string" : "pedagogiskt",
    "annotation-id" : 10
  }, {
    "preferred-label" : "Omvårdnad",
    "sentiment" : "MUST_HAVE",
    "type" : "skill",
    "start-position" : 604,
    "end-position" : 622,
    "concept-id" : "MR4H_FFT_mTj",
    "matched-string" : "Vård och omvårdnad",
    "annotation-id" : 11
  }, {
    "preferred-label" : "tillhandahålla dokumentation",
    "sentiment" : "MUST_HAVE",
    "type" : "esco-skill",
    "start-position" : 667,
    "end-position" : 680,
    "concept-id" : "5uMi_uQS_9Sd",
    "matched-string" : "dokumentation",
    "annotation-id" : 4
  }, {
    "preferred-label" : "Övriga pedagoger med teoretisk specialistkompetens",
    "sentiment" : "MUST_HAVE",
    "type" : "ssyk-level-4",
    "start-position" : 739,
    "end-position" : 750,
    "concept-id" : "mcRJ_kq2_jFr",
    "matched-string" : "stödpedagog",
    "annotation-id" : 5
  }, {
    "preferred-label" : "Annan omvårdnadsutbildning, allmän vård och omsorg",
    "sentiment" : "MUST_HAVE",
    "type" : "sun-education-field-4",
    "start-position" : 752,
    "end-position" : 766,
    "concept-id" : "hLkE_Bx6_riR",
    "matched-string" : "undersköterska",
    "annotation-id" : 12
  }, {
    "preferred-label" : "Fritidsverksamhet för barn och ungdom",
    "sentiment" : "MUST_HAVE",
    "type" : "sun-education-field-4",
    "start-position" : 768,
    "end-position" : 784,
    "concept-id" : "YDQ6_VYd_ow2",
    "matched-string" : "barn- och fritid",
    "annotation-id" : 13
  }, {
    "preferred-label" : "B",
    "sentiment" : "MUST_HAVE",
    "type" : "driving-licence",
    "start-position" : 999,
    "end-position" : 1008,
    "concept-id" : "VTK8_WRx_GcM",
    "matched-string" : "B-körkort",
    "annotation-id" : 14
  }, {
    "preferred-label" : "använda dator",
    "sentiment" : "MUST_HAVE",
    "type" : "esco-skill",
    "start-position" : 1013,
    "end-position" : 1020,
    "concept-id" : "HEbR_xrb_MpT",
    "matched-string" : "IT-vana",
    "annotation-id" : 15
  } ],
  "text" : "Vårdare, 2 tjänster\nVill du vara med och göra skillnad i ett av Sveriges viktigaste jobb? Välkommen att söka någon av våra två tjänster som Vårdare i Daglig verksamhet. Verksamheten bedrivs i ändamålsenliga lokaler i Lagan. \n\nBesök oss gärna på www.ljungby.se/jobb  för att läsa mer om Ljungby kommun som arbetsgivare.\r\n\r\nARBETSUPPGIFTER\nMed ett pedagogiskt, coachande och motiverande arbetssätt bidrar du till en meningsfull vardag för två kvinnor med autism. Arbetet innebär att stödja dem i dagliga verksamhetens aktiviteter, vilket förutsätter salutogent förhållningssätt och lågaffektivt bemötande. Vård och omvårdnad ingår. Du arbetar omväxlande hos de bägge.\n\nDokumentation förekommer.\r\n\r\nKVALIFIKATIONER\nÖnskvärt är utbildning som stödpedagog, undersköterska, barn- och fritid eller annan utbildning som arbetsgivaren bedömer som likvärdig. Vi ser gärna att du har utbildning i lågaffektivt bemötande samt erfarenhet från liknande arbete. Du behöver vara lyhörd och flexibel.\n\nDu behöver ha B-körkort och IT-vana.\n\nVi lägger stor vikt vid personlig lämplighet för tjänsten.\r\n\nÖVRIGT\nIntervjuer sker löpande under ansökningstiden. Betyg och intyg behöver inte bifogas ansökan utan tas med vid en eventuell intervju.\n\nKommunen tar ansvar för hela rekryteringen\noch undanber sig därför samtal från rekryteringsfirmor och annonssäljare."
}