{
  "meta" : {
    "jobad" : {
      "description" : {
        "requirements" : null,
        "needs" : null,
        "company_information" : null,
        "text_formatted" : "<p>Nu söker Hemglass Umeå glada och engagerade säljare som vill serva våra kunder i Umeådistriktet med omnejd under sensommar och höst. Rekrytering sker löpande, du bör kunna börja arbeta omgående.</p><p><br></p><p>Vi söker dig som:</p><p><br></p><p>* Är glad, vänlig och engagerad</p><p>* Gillar det personliga mötet</p><p>* Bjuder på ett varmt kundmottagande</p><p>* Har ett naturligt säljfokus och tydlig</p><p>tävlingsinstinkt</p><p>* Är ansvarsfull mot din omgivning.</p><p>* Beredd att jobba eftermiddag/kväll och helger</p><p><br></p><p>Vi erbjuder:</p><p><br></p><p>* Introduktion och utbildning</p><p>* Ansvar och utveckling för egna säljturer</p><p>* Säljstöd och coachning från chefer och övriga</p><p>säljare.</p><p>* Fast timlön med provision</p>",
        "conditions" : null,
        "text" : "Nu söker Hemglass Umeå glada och engagerade säljare som vill serva våra kunder i Umeådistriktet med omnejd under sensommar och höst. Rekrytering sker löpande, du bör kunna börja arbeta omgående.\n\n\nVi söker dig som:\n\n\n* Är glad, vänlig och engagerad\n* Gillar det personliga mötet\n* Bjuder på ett varmt kundmottagande\n* Har ett naturligt säljfokus och tydlig\ntävlingsinstinkt\n* Är ansvarsfull mot din omgivning.\n* Beredd att jobba eftermiddag/kväll och helger\n\n\nVi erbjuder:\n\n\n* Introduktion och utbildning\n* Ansvar och utveckling för egna säljturer\n* Säljstöd och coachning från chefer och övriga\nsäljare.\n* Fast timlön med provision"
      },
      "headline" : "Säljare på Hemglass i Umeå",
      "driving_license" : [ {
        "concept_id" : "VTK8_WRx_GcM",
        "label" : "B",
        "legacy_ams_taxonomy_id" : "3"
      } ],
      "employer" : {
        "email" : null,
        "phone_number" : null,
        "organization_number" : "5565803219",
        "name" : "M Bystedt Invest AB",
        "url" : null,
        "workplace" : "Hemglass Umeå"
      },
      "removed_date" : null,
      "logo_url" : "https://www.arbetsformedlingen.se/rest/arbetsgivare/rest/af/v3/arbetsplatser/87007518/logotyper/logo.png",
      "last_publication_date" : "2022-09-02T23:59:59",
      "number_of_vacancies" : 2,
      "occupation" : {
        "concept_id" : "p17k_znk_osi",
        "label" : "Utesäljare",
        "legacy_ams_taxonomy_id" : "7117"
      },
      "occupation_group" : {
        "concept_id" : "oXSW_fbY_XrY",
        "label" : "Företagssäljare",
        "legacy_ams_taxonomy_id" : "3322"
      },
      "employment_type" : {
        "concept_id" : "Jh8f_q9J_pbJ",
        "label" : "Sommarjobb / feriejobb",
        "legacy_ams_taxonomy_id" : "2"
      },
      "webpage_url" : "https://arbetsformedlingen.se/platsbanken/annonser/26375302",
      "driving_license_required" : true,
      "application_contacts" : [ {
        "description" : null,
        "email" : "umea@hemglass.se",
        "telephone" : "073-801 16 01",
        "name" : "Adam Nyhlén",
        "contact_type" : "Platschef"
      } ],
      "duration" : {
        "concept_id" : "Sy9J_aRd_ALx",
        "label" : "11 dagar - upp till 3 månader",
        "legacy_ams_taxonomy_id" : "7"
      },
      "nice_to_have" : {
        "education_level" : [ ],
        "work_experiences" : [ {
          "concept_id" : "p17k_znk_osi",
          "weight" : 5,
          "label" : "Utesäljare",
          "legacy_ams_taxonomy_id" : "7117"
        } ],
        "skills" : [ ],
        "education" : [ ],
        "languages" : [ ]
      },
      "application_details" : {
        "via_af" : false,
        "email" : "umea@hemglass.se",
        "other" : null,
        "reference" : "Säljare Hemglass Umeå",
        "url" : null,
        "information" : null
      },
      "source_type" : "VIA_ANNONSERA",
      "application_deadline" : "2022-09-02T23:59:59",
      "external_id" : null,
      "workplace_address" : {
        "coordinates" : [ 20.245541960882765, 63.83851259874261 ],
        "city" : "Umeå",
        "postcode" : "90131",
        "municipality" : "Umeå",
        "region_concept_id" : "g5Tt_CAV_zBd",
        "region" : "Västerbottens län",
        "country_code" : "199",
        "region_code" : "24",
        "municipality_concept_id" : "QiGt_BLu_amP",
        "country_concept_id" : "i46j_HmG_v64",
        "municipality_code" : "2480",
        "street_address" : "Spårvägen 2",
        "country" : "Sverige"
      },
      "id" : "26375302",
      "experience_required" : true,
      "working_hours_type" : {
        "concept_id" : "6YE1_gAC_R2G",
        "label" : "Heltid",
        "legacy_ams_taxonomy_id" : "1"
      },
      "access" : null,
      "timestamp" : 1659529005275,
      "must_have" : {
        "education_level" : [ ],
        "work_experiences" : [ ],
        "skills" : [ ],
        "education" : [ ],
        "languages" : [ ]
      },
      "occupation_field" : {
        "concept_id" : "RPTn_bxG_ExZ",
        "label" : "Försäljning, inköp, marknadsföring",
        "legacy_ams_taxonomy_id" : "5"
      },
      "scope_of_work" : {
        "min" : 0,
        "max" : 100
      },
      "salary_type" : {
        "concept_id" : "asrX_9Df_ukn",
        "label" : "Fast och rörlig lön",
        "legacy_ams_taxonomy_id" : "7"
      },
      "removed" : false,
      "salary_description" : null,
      "access_to_own_car" : false,
      "publication_date" : "2022-08-03T14:16:45"
    },
    "name" : "Säljare på Hemglass i Umeå",
    "user" : "hannes"
  },
  "sha1" : "dcfb5ada426feecd785f0dd525c1a7da7153d638",
  "annotations" : [ {
    "preferred-label" : "Säljare",
    "sentiment" : "MUST_HAVE",
    "type" : "keyword",
    "start-position" : 0,
    "end-position" : 7,
    "concept-id" : "rDcj_Tao_TJJ",
    "matched-string" : "säljare",
    "annotation-id" : 0
  }, {
    "preferred-label" : "Umeå",
    "type" : "municipality",
    "start-position" : 22,
    "end-position" : 26,
    "concept-id" : "QiGt_BLu_amP",
    "matched-string" : "Umeå",
    "annotation-id" : 4
  }, {
    "preferred-label" : "Umeå",
    "type" : "municipality",
    "start-position" : 45,
    "end-position" : 49,
    "concept-id" : "QiGt_BLu_amP",
    "matched-string" : "Umeå",
    "annotation-id" : 5
  }, {
    "preferred-label" : "Säljare",
    "sentiment" : "MUST_HAVE",
    "type" : "keyword",
    "start-position" : 71,
    "end-position" : 78,
    "concept-id" : "rDcj_Tao_TJJ",
    "matched-string" : "säljare",
    "annotation-id" : 1
  }, {
    "preferred-label" : "Umeå",
    "type" : "municipality",
    "start-position" : 108,
    "end-position" : 122,
    "concept-id" : "QiGt_BLu_amP",
    "matched-string" : "Umeådistriktet",
    "annotation-id" : 6
  }, {
    "preferred-label" : "Coaching/Coachning",
    "sentiment" : "MUST_HAVE",
    "type" : "skill",
    "start-position" : 590,
    "end-position" : 599,
    "concept-id" : "91Ef_58Y_jX4",
    "matched-string" : "coachning",
    "annotation-id" : 2
  }, {
    "preferred-label" : "Säljare",
    "sentiment" : "MUST_HAVE",
    "type" : "keyword",
    "start-position" : 623,
    "end-position" : 630,
    "concept-id" : "rDcj_Tao_TJJ",
    "matched-string" : "säljare",
    "annotation-id" : 3
  } ],
  "text" : "Säljare på Hemglass i Umeå\nNu söker Hemglass Umeå glada och engagerade säljare som vill serva våra kunder i Umeådistriktet med omnejd under sensommar och höst. Rekrytering sker löpande, du bör kunna börja arbeta omgående.\n\n\nVi söker dig som:\n\n\n* Är glad, vänlig och engagerad\n* Gillar det personliga mötet\n* Bjuder på ett varmt kundmottagande\n* Har ett naturligt säljfokus och tydlig\ntävlingsinstinkt\n* Är ansvarsfull mot din omgivning.\n* Beredd att jobba eftermiddag/kväll och helger\n\n\nVi erbjuder:\n\n\n* Introduktion och utbildning\n* Ansvar och utveckling för egna säljturer\n* Säljstöd och coachning från chefer och övriga\nsäljare.\n* Fast timlön med provision"
}