{
  "meta" : {
    "jobad" : {
      "description" : {
        "requirements" : null,
        "needs" : null,
        "company_information" : null,
        "text_formatted" : "<p><strong>Projektledare digital kommunikation och grafisk formgivning till MHF Motorförarnas Helnykterhetsförbund</strong></p><p>Är du en kreativ kommunikatör med gedigen kunskap om digital marknadsföring och grafisk form? MHF är en viktig organisation med ett specifikt uppdrag. Vår nollvision är att ingen ska dö av rattfylleri. Vi söker en projektledare digital kommunikation och grafisk form. Du blir en viktig del i vårt team där du är med och producerar innehåll för att skapa opinion för nykter trafik och nå fler med vårt budskap om att höja trafiksäkerheten i Sverige. </p><p><strong>Din profil:</strong></p><ul><li>En projektledare som kan digital kommunikation och grafisk formgivning</li><li>En kreativ innehållsproducent som skapar format för digitala kanaler</li><li>Du behärskar Wordpress, Adobe InDesign och andra program inom Adobe CS.</li><li>Du arbetar i kanaler som Google, Youtube, Facebook och andra sociala medier.  </li></ul><p><br></p><p><strong>Ansökan</strong></p><p>Tjänsten är heltid. Din arbetsplats är i Stockholm. Intervjuer sker löpande. Skicka din ansökan till dicran@mhf.se </p><p><strong>Om MHF</strong></p><p>MHF Motorförarnas Helnykterhetsförbund bildades 1926, och arbetar för att ingen ska dö av rattfylleri. Vi har 9 000 medlemmar uppdelade i sju regioner och 150 lokalavdelningar. MHF tillhör de mest aktiva trafiksäkerhetsorganisationerna i landet.</p>",
        "conditions" : null,
        "text" : "Projektledare digital kommunikation och grafisk formgivning till MHF Motorförarnas Helnykterhetsförbund\nÄr du en kreativ kommunikatör med gedigen kunskap om digital marknadsföring och grafisk form? MHF är en viktig organisation med ett specifikt uppdrag. Vår nollvision är att ingen ska dö av rattfylleri. Vi söker en projektledare digital kommunikation och grafisk form. Du blir en viktig del i vårt team där du är med och producerar innehåll för att skapa opinion för nykter trafik och nå fler med vårt budskap om att höja trafiksäkerheten i Sverige. \nDin profil:\nEn projektledare som kan digital kommunikation och grafisk formgivning\nEn kreativ innehållsproducent som skapar format för digitala kanaler\nDu behärskar Wordpress, Adobe InDesign och andra program inom Adobe CS.\nDu arbetar i kanaler som Google, Youtube, Facebook och andra sociala medier.  \n\n\n\nAnsökan\nTjänsten är heltid. Din arbetsplats är i Stockholm. Intervjuer sker löpande. Skicka din ansökan till dicran@mhf.se \nOm MHF\nMHF Motorförarnas Helnykterhetsförbund bildades 1926, och arbetar för att ingen ska dö av rattfylleri. Vi har 9 000 medlemmar uppdelade i sju regioner och 150 lokalavdelningar. MHF tillhör de mest aktiva trafiksäkerhetsorganisationerna i landet."
      },
      "headline" : "Projektledare digital kommunikation och grafisk formgivning till MHF ",
      "driving_license" : [ {
        "concept_id" : "VTK8_WRx_GcM",
        "label" : "B",
        "legacy_ams_taxonomy_id" : "3"
      } ],
      "employer" : {
        "email" : null,
        "phone_number" : null,
        "organization_number" : "8020023399",
        "name" : "Motorförarnas Helnykterhetsförbund",
        "url" : "www.mhf.se",
        "workplace" : "Motorförarnas Helnykterhetsförbund"
      },
      "removed_date" : null,
      "logo_url" : "https://www.arbetsformedlingen.se/rest/arbetsgivare/rest/af/v3/arbetsplatser/82186947/logotyper/logo.png",
      "last_publication_date" : "2022-09-30T00:00:00",
      "number_of_vacancies" : 1,
      "occupation" : {
        "concept_id" : "VpYo_k5f_N9R",
        "label" : "Grafisk formgivare",
        "legacy_ams_taxonomy_id" : "4039"
      },
      "occupation_group" : {
        "concept_id" : "8Bmh_vtM_zts",
        "label" : "Grafisk formgivare m.fl.",
        "legacy_ams_taxonomy_id" : "2172"
      },
      "employment_type" : {
        "concept_id" : "PFZr_Syz_cUq",
        "label" : "Vanlig anställning",
        "legacy_ams_taxonomy_id" : "1"
      },
      "webpage_url" : "https://arbetsformedlingen.se/platsbanken/annonser/26202991",
      "driving_license_required" : true,
      "application_contacts" : [ ],
      "duration" : {
        "concept_id" : "a7uU_j21_mkL",
        "label" : "Tills vidare",
        "legacy_ams_taxonomy_id" : "1"
      },
      "nice_to_have" : {
        "education_level" : [ ],
        "work_experiences" : [ ],
        "skills" : [ ],
        "education" : [ ],
        "languages" : [ ]
      },
      "application_details" : {
        "via_af" : false,
        "email" : "dicran@mhf.se",
        "other" : null,
        "reference" : null,
        "url" : null,
        "information" : null
      },
      "source_type" : "VIA_ANNONSERA",
      "application_deadline" : "2022-09-30T00:00:00",
      "external_id" : null,
      "workplace_address" : {
        "coordinates" : [ 18.0517700590878, 59.28930004613054 ],
        "city" : "Årsta",
        "postcode" : "12040",
        "municipality" : "Stockholm",
        "region_concept_id" : "CifL_Rzy_Mku",
        "region" : "Stockholms län",
        "country_code" : "199",
        "region_code" : "01",
        "municipality_concept_id" : "AvNB_uwa_6n6",
        "country_concept_id" : "i46j_HmG_v64",
        "municipality_code" : "0180",
        "street_address" : "Byängsgränd 8 2TR",
        "country" : "Sverige"
      },
      "id" : "26202991",
      "experience_required" : true,
      "working_hours_type" : {
        "concept_id" : "6YE1_gAC_R2G",
        "label" : "Heltid",
        "legacy_ams_taxonomy_id" : "1"
      },
      "access" : null,
      "timestamp" : 1654941835786,
      "must_have" : {
        "education_level" : [ ],
        "work_experiences" : [ {
          "concept_id" : "VpYo_k5f_N9R",
          "weight" : 10,
          "label" : "Grafisk formgivare",
          "legacy_ams_taxonomy_id" : "4039"
        } ],
        "skills" : [ ],
        "education" : [ ],
        "languages" : [ ]
      },
      "occupation_field" : {
        "concept_id" : "9puE_nYg_crq",
        "label" : "Kultur, media, design",
        "legacy_ams_taxonomy_id" : "11"
      },
      "scope_of_work" : {
        "min" : 0,
        "max" : 100
      },
      "salary_type" : {
        "concept_id" : "oG8G_9cW_nRf",
        "label" : "Fast månads- vecko- eller timlön",
        "legacy_ams_taxonomy_id" : "1"
      },
      "removed" : false,
      "salary_description" : null,
      "access_to_own_car" : false,
      "publication_date" : "2022-06-11T12:03:55"
    },
    "name" : "Projektledare digital kommunikation och grafisk formgivning till MHF ",
    "user" : "hannes"
  },
  "sha1" : "909a3ed0f68e04de735875ad0033de7b10bf2821",
  "annotations" : [ {
    "preferred-label" : "Digital kompetens - Kommunikatör",
    "type" : "swedish-retail-and-wholesale-council-skill",
    "start-position" : 14,
    "end-position" : 35,
    "concept-id" : "hSpM_D7g_9A5",
    "matched-string" : "digital kommunikation",
    "annotation-id" : 6
  }, {
    "preferred-label" : "Grafisk formgivare",
    "type" : "occupation-name",
    "start-position" : 40,
    "end-position" : 59,
    "concept-id" : "VpYo_k5f_N9R",
    "matched-string" : "grafisk formgivning",
    "annotation-id" : 8
  }, {
    "preferred-label" : "Digital kompetens - Kommunikatör",
    "type" : "swedish-retail-and-wholesale-council-skill",
    "start-position" : 84,
    "end-position" : 105,
    "concept-id" : "hSpM_D7g_9A5",
    "matched-string" : "digital kommunikation",
    "annotation-id" : 7
  }, {
    "preferred-label" : "Grafisk formgivare",
    "type" : "occupation-name",
    "start-position" : 110,
    "end-position" : 129,
    "concept-id" : "VpYo_k5f_N9R",
    "matched-string" : "grafisk formgivning",
    "annotation-id" : 9
  }, {
    "preferred-label" : "Informatör/Kommunikatör",
    "sentiment" : "MUST_HAVE",
    "type" : "occupation-name",
    "start-position" : 191,
    "end-position" : 203,
    "concept-id" : "aRp4_qjZ_tPV",
    "matched-string" : "kommunikatör",
    "annotation-id" : 2
  }, {
    "preferred-label" : "Digital marknadsföring/Onlinemarknadsföring",
    "sentiment" : "MUST_HAVE",
    "type" : "skill",
    "start-position" : 227,
    "end-position" : 249,
    "concept-id" : "Lz84_K5d_CcL",
    "matched-string" : "digital marknadsföring",
    "annotation-id" : 3
  }, {
    "preferred-label" : "Grafisk formgivare",
    "type" : "occupation-name",
    "start-position" : 254,
    "end-position" : 266,
    "concept-id" : "VpYo_k5f_N9R",
    "matched-string" : "grafisk form",
    "annotation-id" : 10
  }, {
    "preferred-label" : "Digital kompetens - Kommunikatör",
    "type" : "swedish-retail-and-wholesale-council-skill",
    "start-position" : 402,
    "end-position" : 423,
    "concept-id" : "hSpM_D7g_9A5",
    "matched-string" : "digital kommunikation",
    "annotation-id" : 11
  }, {
    "preferred-label" : "Grafisk formgivare",
    "type" : "occupation-name",
    "start-position" : 428,
    "end-position" : 440,
    "concept-id" : "VpYo_k5f_N9R",
    "matched-string" : "grafisk form",
    "annotation-id" : 12
  }, {
    "preferred-label" : "Digital kompetens - Kommunikatör",
    "type" : "swedish-retail-and-wholesale-council-skill",
    "start-position" : 661,
    "end-position" : 682,
    "concept-id" : "hSpM_D7g_9A5",
    "matched-string" : "digital kommunikation",
    "annotation-id" : 13
  }, {
    "preferred-label" : "Grafisk formgivare",
    "type" : "occupation-name",
    "start-position" : 687,
    "end-position" : 706,
    "concept-id" : "VpYo_k5f_N9R",
    "matched-string" : "grafisk formgivning",
    "annotation-id" : 14
  }, {
    "preferred-label" : "utveckla kreativa idéer",
    "type" : "esco-skill",
    "start-position" : 710,
    "end-position" : 717,
    "concept-id" : "4jnH_nbm_Fwb",
    "matched-string" : "kreativ",
    "annotation-id" : 15
  }, {
    "preferred-label" : "WordPress",
    "sentiment" : "MUST_HAVE",
    "type" : "esco-skill",
    "start-position" : 789,
    "end-position" : 798,
    "concept-id" : "N7bn_VwH_iPS",
    "matched-string" : "wordpress",
    "annotation-id" : 5
  }, {
    "preferred-label" : "Layout-Adobe InDesign",
    "type" : "skill",
    "start-position" : 800,
    "end-position" : 814,
    "concept-id" : "Y2t4_aS8_tGo",
    "matched-string" : "Adobe InDesign",
    "annotation-id" : 16
  }, {
    "preferred-label" : "Layout-Adobe Creative Suite",
    "type" : "skill",
    "start-position" : 838,
    "end-position" : 846,
    "concept-id" : "qK2A_9oq_zx6",
    "matched-string" : "Adobe CS",
    "annotation-id" : 17
  }, {
    "preferred-label" : "hantering av sociala medier",
    "type" : "esco-skill",
    "start-position" : 909,
    "end-position" : 923,
    "concept-id" : "MgRt_szJ_YYJ",
    "matched-string" : "sociala medier",
    "annotation-id" : 18
  }, {
    "preferred-label" : "Heltid",
    "type" : "worktime-extent",
    "start-position" : 950,
    "end-position" : 956,
    "concept-id" : "6YE1_gAC_R2G",
    "matched-string" : "heltid",
    "annotation-id" : 19
  }, {
    "preferred-label" : "Stockholm",
    "type" : "municipality",
    "start-position" : 979,
    "end-position" : 988,
    "concept-id" : "AvNB_uwa_6n6",
    "matched-string" : "Stockholm",
    "annotation-id" : 20
  } ],
  "text" : "Projektledare digital kommunikation och grafisk formgivning till MHF \nProjektledare digital kommunikation och grafisk formgivning till MHF Motorförarnas Helnykterhetsförbund\nÄr du en kreativ kommunikatör med gedigen kunskap om digital marknadsföring och grafisk form? MHF är en viktig organisation med ett specifikt uppdrag. Vår nollvision är att ingen ska dö av rattfylleri. Vi söker en projektledare digital kommunikation och grafisk form. Du blir en viktig del i vårt team där du är med och producerar innehåll för att skapa opinion för nykter trafik och nå fler med vårt budskap om att höja trafiksäkerheten i Sverige. \nDin profil:\nEn projektledare som kan digital kommunikation och grafisk formgivning\nEn kreativ innehållsproducent som skapar format för digitala kanaler\nDu behärskar Wordpress, Adobe InDesign och andra program inom Adobe CS.\nDu arbetar i kanaler som Google, Youtube, Facebook och andra sociala medier.  \n\n\n\nAnsökan\nTjänsten är heltid. Din arbetsplats är i Stockholm. Intervjuer sker löpande. Skicka din ansökan till dicran@mhf.se \nOm MHF\nMHF Motorförarnas Helnykterhetsförbund bildades 1926, och arbetar för att ingen ska dö av rattfylleri. Vi har 9 000 medlemmar uppdelade i sju regioner och 150 lokalavdelningar. MHF tillhör de mest aktiva trafiksäkerhetsorganisationerna i landet."
}