{
  "meta" : {
    "jobad" : {
      "description" : {
        "requirements" : null,
        "needs" : null,
        "company_information" : null,
        "text_formatted" : "<p>Vi söker dig som är serviceinriktad och som är intresserad av det italienska köket. Det är också viktigt att du är självständig med positiv attityd och som är stresstålig då arbetet ibland kan bli hektiskt.</p><p>Vi har möjlighet att utöka dina kunskaper inom vin och mat och det förväntas att intresse finns för utveckling inom dessa områden. I restaurangarbete är det nödvändigt att alla anställda arbetar skift både lunch, kväll och helger.</p><p><br></p><p>La Locandiera har funnit sedan 2013 och är beläget i centrala Jönköping. Vi erbjuder våra gäster rätter från olika delar av Italien. Vi erbjuda konferens och äffarslunch måndag till törsdag samt varje fredag vi har lunchbuffé. På fredagar dukar vi om till \"after work\" som är en av stans populäraste. Vi har även \"a la carte\" alla vardagar från kl 16.00 och lördag från kl 12.00. Söndag restaurangen är stängt. Vi värderar våra gäster högt och vill ge dem god mat med fina råvaror och bra service. Just nu satsar vi på catering och kan erbjuda god mat vid olika tillställningar. </p><p>Restaurangen har alkoholserveringstillstånd.</p>",
        "conditions" : null,
        "text" : "Vi söker dig som är serviceinriktad och som är intresserad av det italienska köket. Det är också viktigt att du är självständig med positiv attityd och som är stresstålig då arbetet ibland kan bli hektiskt.\nVi har möjlighet att utöka dina kunskaper inom vin och mat och det förväntas att intresse finns för utveckling inom dessa områden. I restaurangarbete är det nödvändigt att alla anställda arbetar skift både lunch, kväll och helger.\n\n\nLa Locandiera har funnit sedan 2013 och är beläget i centrala Jönköping. Vi erbjuder våra gäster rätter från olika delar av Italien. Vi erbjuda konferens och äffarslunch måndag till törsdag samt varje fredag vi har lunchbuffé. På fredagar dukar vi om till \"after work\" som är en av stans populäraste. Vi har även \"a la carte\" alla vardagar från kl 16.00 och lördag från kl 12.00. Söndag restaurangen är stängt. Vi värderar våra gäster högt och vill ge dem god mat med fina råvaror och bra service. Just nu satsar vi på catering och kan erbjuda god mat vid olika tillställningar. \nRestaurangen har alkoholserveringstillstånd."
      },
      "headline" : "Servitör / Servitris",
      "driving_license" : null,
      "employer" : {
        "email" : null,
        "phone_number" : null,
        "organization_number" : "5590175682",
        "name" : "Valtellinese AB",
        "url" : "lalocandiera.se",
        "workplace" : "La Locandiera ristorante & bar"
      },
      "removed_date" : null,
      "logo_url" : null,
      "last_publication_date" : "2022-09-01T23:59:59",
      "number_of_vacancies" : 1,
      "occupation" : {
        "concept_id" : "rGGf_KLs_To7",
        "label" : "Servitör/Servitris",
        "legacy_ams_taxonomy_id" : "5487"
      },
      "occupation_group" : {
        "concept_id" : "UjoW_meY_Zwt",
        "label" : "Hovmästare och servitörer",
        "legacy_ams_taxonomy_id" : "5131"
      },
      "employment_type" : {
        "concept_id" : "PFZr_Syz_cUq",
        "label" : "Vanlig anställning",
        "legacy_ams_taxonomy_id" : "1"
      },
      "webpage_url" : "https://arbetsformedlingen.se/platsbanken/annonser/26371594",
      "driving_license_required" : false,
      "application_contacts" : [ ],
      "duration" : {
        "concept_id" : "qQUd_4qe_NDT",
        "label" : "6 månader eller längre",
        "legacy_ams_taxonomy_id" : "2"
      },
      "nice_to_have" : {
        "education_level" : [ ],
        "work_experiences" : [ ],
        "skills" : [ ],
        "education" : [ ],
        "languages" : [ {
          "concept_id" : "b9cE_KXy_Yxv",
          "weight" : 5,
          "label" : "Italienska",
          "legacy_ams_taxonomy_id" : "322"
        } ]
      },
      "application_details" : {
        "via_af" : false,
        "email" : "info@lalocandiera.se",
        "other" : null,
        "reference" : "Jobb",
        "url" : null,
        "information" : null
      },
      "source_type" : "VIA_ANNONSERA",
      "application_deadline" : "2022-09-01T23:59:59",
      "external_id" : null,
      "workplace_address" : {
        "coordinates" : [ 14.17761136115917, 57.78188333203543 ],
        "city" : "Jönköping",
        "postcode" : "55321",
        "municipality" : "Jönköping",
        "region_concept_id" : "MtbE_xWT_eMi",
        "region" : "Jönköpings län",
        "country_code" : "199",
        "region_code" : "06",
        "municipality_concept_id" : "KURg_KJF_Lwc",
        "country_concept_id" : "i46j_HmG_v64",
        "municipality_code" : "0680",
        "street_address" : "Östra Storgatan 39",
        "country" : "Sverige"
      },
      "id" : "26371594",
      "experience_required" : true,
      "working_hours_type" : {
        "concept_id" : "6YE1_gAC_R2G",
        "label" : "Heltid",
        "legacy_ams_taxonomy_id" : "1"
      },
      "access" : null,
      "timestamp" : 1659439750313,
      "must_have" : {
        "education_level" : [ ],
        "work_experiences" : [ {
          "concept_id" : "rGGf_KLs_To7",
          "weight" : 10,
          "label" : "Servitör/Servitris",
          "legacy_ams_taxonomy_id" : "5487"
        } ],
        "skills" : [ ],
        "education" : [ ],
        "languages" : [ {
          "concept_id" : "zSLA_vw2_FXN",
          "weight" : 10,
          "label" : "Svenska",
          "legacy_ams_taxonomy_id" : "502"
        }, {
          "concept_id" : "NVxJ_hLg_TYS",
          "weight" : 10,
          "label" : "Engelska",
          "legacy_ams_taxonomy_id" : "283"
        } ]
      },
      "occupation_field" : {
        "concept_id" : "ScKy_FHB_7wT",
        "label" : "Hotell, restaurang, storhushåll",
        "legacy_ams_taxonomy_id" : "7"
      },
      "scope_of_work" : {
        "min" : 0,
        "max" : 100
      },
      "salary_type" : {
        "concept_id" : "oG8G_9cW_nRf",
        "label" : "Fast månads- vecko- eller timlön",
        "legacy_ams_taxonomy_id" : "1"
      },
      "removed" : false,
      "salary_description" : null,
      "access_to_own_car" : false,
      "publication_date" : "2022-08-02T13:29:10"
    },
    "name" : "Servitör / Servitris",
    "user" : "hannes"
  },
  "sha1" : "c085c6bf976cb3ad5c2a406c67b4147619fc3004",
  "annotations" : [ {
    "preferred-label" : "Servitör/Servitris",
    "type" : "occupation-name",
    "start-position" : 0,
    "end-position" : 20,
    "concept-id" : "rGGf_KLs_To7",
    "matched-string" : "Servitör / Servitris",
    "annotation-id" : 5
  }, {
    "preferred-label" : "Italienskt kök",
    "type" : "skill",
    "start-position" : 87,
    "end-position" : 103,
    "concept-id" : "T38R_QfY_piB",
    "matched-string" : "italienska köket",
    "annotation-id" : 6
  }, {
    "preferred-label" : "arbeta självständigt",
    "type" : "esco-skill",
    "start-position" : 136,
    "end-position" : 148,
    "concept-id" : "NyFu_HHd_zhz",
    "matched-string" : "självständig",
    "annotation-id" : 7
  }, {
    "preferred-label" : "hantera stress",
    "type" : "esco-skill",
    "start-position" : 180,
    "end-position" : 191,
    "concept-id" : "z5Zo_DVb_VEK",
    "matched-string" : "stresstålig",
    "annotation-id" : 8
  }, {
    "preferred-label" : "Sprit/Vin",
    "sentiment" : "MUST_HAVE",
    "type" : "skill",
    "start-position" : 275,
    "end-position" : 278,
    "concept-id" : "S4vL_AVu_s6q",
    "matched-string" : "vin",
    "annotation-id" : 3
  }, {
    "preferred-label" : "Restaurangverksamhet",
    "type" : "sni-level-5",
    "start-position" : 361,
    "end-position" : 377,
    "concept-id" : "CK7M_gYV_9ea",
    "matched-string" : "restaurangarbete",
    "annotation-id" : 9
  }, {
    "preferred-label" : "Jönköping",
    "type" : "municipality",
    "start-position" : 523,
    "end-position" : 532,
    "concept-id" : "KURg_KJF_Lwc",
    "matched-string" : "Jönköping",
    "annotation-id" : 10
  }, {
    "preferred-label" : "A la carte",
    "sentiment" : "MUST_HAVE",
    "type" : "skill",
    "start-position" : 775,
    "end-position" : 785,
    "concept-id" : "Bb4Q_Vou_pbq",
    "matched-string" : "a la carte",
    "annotation-id" : 4
  }, {
    "preferred-label" : "Restaurang",
    "type" : "keyword",
    "start-position" : 848,
    "end-position" : 860,
    "concept-id" : "o2Cg_3Ap_qvK",
    "matched-string" : "restaurangen",
    "annotation-id" : 11
  }, {
    "preferred-label" : "Restaurang",
    "type" : "keyword",
    "start-position" : 1041,
    "end-position" : 1053,
    "concept-id" : "o2Cg_3Ap_qvK",
    "matched-string" : "Restaurangen",
    "annotation-id" : 12
  } ],
  "text" : "Servitör / Servitris\nVi söker dig som är serviceinriktad och som är intresserad av det italienska köket. Det är också viktigt att du är självständig med positiv attityd och som är stresstålig då arbetet ibland kan bli hektiskt.\nVi har möjlighet att utöka dina kunskaper inom vin och mat och det förväntas att intresse finns för utveckling inom dessa områden. I restaurangarbete är det nödvändigt att alla anställda arbetar skift både lunch, kväll och helger.\n\n\nLa Locandiera har funnit sedan 2013 och är beläget i centrala Jönköping. Vi erbjuder våra gäster rätter från olika delar av Italien. Vi erbjuda konferens och äffarslunch måndag till törsdag samt varje fredag vi har lunchbuffé. På fredagar dukar vi om till \"after work\" som är en av stans populäraste. Vi har även \"a la carte\" alla vardagar från kl 16.00 och lördag från kl 12.00. Söndag restaurangen är stängt. Vi värderar våra gäster högt och vill ge dem god mat med fina råvaror och bra service. Just nu satsar vi på catering och kan erbjuda god mat vid olika tillställningar. \nRestaurangen har alkoholserveringstillstånd."
}