{
  "meta" : {
    "jobad" : {
      "description" : {
        "requirements" : null,
        "needs" : null,
        "company_information" : null,
        "text_formatted" : "Vivab, Vatten & Miljö i Väst AB, jobbar för en hållbar framtid med friskare hav, ett rent och gott dricksvatten och en hållbar konsumtion med minskat avfall. Vivab är en viktig aktör inom grön samhällsutveckling på västkustens mittpunkt. Vi har ett hjärta för en hållbar framtid och nu söker vi dig som vill vara med och göra det möjligt! \n\nVill du vara en viktig del i att förse mer än 100 000 personer med rent och friskt vatten?\nDå ska du söka tjänsten som rörmontör hos oss!\r\n\r\nARBETSUPPGIFTER\nSom rörmontör arbetar du och dina kollegor med installationer vid ny- och ombyggnation och med reparationer och service i ledningsnätet. Arbetet sker utomhus med omväxlande arbetsuppgifter. Beredskapstjänst kan ingå. \nTjänsten är placerad i Varberg.\r\n\r\nKVALIFIKATIONER\nDu trivs med ett omväxlande arbete, är lösningsfokuserad och gillar att jobba i team. \nAtt arbeta utomhus passar dig bra, du är hjälpsam och gillar ordning och reda. \nDu är handlingskraftig, tar initiativ och ser till att slutföra det du påbörjar. \nDu har:\n• en relevant utbildning inom rörteknik eller anläggning\n• datorvana\n• B-körkort\n\nErfarenhet från diverse rör-, VVS- och anläggningsarbeten värdesätts.\r\n\nÖVRIGT\nEn bra arbetsmiljö ligger högt upp på vår agenda och vi vill att våra medarbetare har en bra balans mellan arbete och fritid. \nVivab vill främja en hälsosam livsstil och erbjuder bland annat en friskvårdstimme i veckan, friskvårdsbidrag och möjlighet till att hyra förmånscykel. \n\nOBS! Vi undanber oss alla erbjudanden om ytterligare annonsering både i tryck och digitalt.",
        "conditions" : "Heltid. \r\nTillsvidareanställning, tillträde: Tillträde enligt överenskommelse.",
        "text" : "Vivab, Vatten & Miljö i Väst AB, jobbar för en hållbar framtid med friskare hav, ett rent och gott dricksvatten och en hållbar konsumtion med minskat avfall. Vivab är en viktig aktör inom grön samhällsutveckling på västkustens mittpunkt. Vi har ett hjärta för en hållbar framtid och nu söker vi dig som vill vara med och göra det möjligt! \n\nVill du vara en viktig del i att förse mer än 100 000 personer med rent och friskt vatten?\nDå ska du söka tjänsten som rörmontör hos oss!\r\n\r\nARBETSUPPGIFTER\nSom rörmontör arbetar du och dina kollegor med installationer vid ny- och ombyggnation och med reparationer och service i ledningsnätet. Arbetet sker utomhus med omväxlande arbetsuppgifter. Beredskapstjänst kan ingå. \nTjänsten är placerad i Varberg.\r\n\r\nKVALIFIKATIONER\nDu trivs med ett omväxlande arbete, är lösningsfokuserad och gillar att jobba i team. \nAtt arbeta utomhus passar dig bra, du är hjälpsam och gillar ordning och reda. \nDu är handlingskraftig, tar initiativ och ser till att slutföra det du påbörjar. \nDu har:\n• en relevant utbildning inom rörteknik eller anläggning\n• datorvana\n• B-körkort\n\nErfarenhet från diverse rör-, VVS- och anläggningsarbeten värdesätts.\r\n\nÖVRIGT\nEn bra arbetsmiljö ligger högt upp på vår agenda och vi vill att våra medarbetare har en bra balans mellan arbete och fritid. \nVivab vill främja en hälsosam livsstil och erbjuder bland annat en friskvårdstimme i veckan, friskvårdsbidrag och möjlighet till att hyra förmånscykel. \n\nOBS! Vi undanber oss alla erbjudanden om ytterligare annonsering både i tryck och digitalt."
      },
      "headline" : "Rörmontör",
      "driving_license" : null,
      "employer" : {
        "email" : null,
        "phone_number" : null,
        "organization_number" : "5567647606",
        "name" : "Vatten & Miljö i Väst AB",
        "url" : null,
        "workplace" : "Vivab"
      },
      "removed_date" : null,
      "logo_url" : null,
      "last_publication_date" : "2022-08-28T23:59:59",
      "number_of_vacancies" : 1,
      "occupation" : {
        "concept_id" : "MQHi_q9J_x2d",
        "label" : "Väg-och anläggningsarbetare",
        "legacy_ams_taxonomy_id" : "5871"
      },
      "occupation_group" : {
        "concept_id" : "bZ4J_riZ_zK6",
        "label" : "Anläggningsarbetare",
        "legacy_ams_taxonomy_id" : "7114"
      },
      "employment_type" : {
        "concept_id" : "PFZr_Syz_cUq",
        "label" : "Vanlig anställning",
        "legacy_ams_taxonomy_id" : "1"
      },
      "webpage_url" : "https://arbetsformedlingen.se/platsbanken/annonser/26238149",
      "driving_license_required" : false,
      "application_contacts" : [ {
        "description" : "Peter Heimroth (semester v.31-34)",
        "email" : "peter.heimroth@vivab.info",
        "telephone" : "0757-27 42 20",
        "name" : null,
        "contact_type" : "Driftchef"
      } ],
      "duration" : {
        "concept_id" : "a7uU_j21_mkL",
        "label" : "Tills vidare",
        "legacy_ams_taxonomy_id" : "1"
      },
      "nice_to_have" : {
        "education_level" : [ ],
        "work_experiences" : [ ],
        "skills" : [ ],
        "education" : [ ],
        "languages" : [ ]
      },
      "application_details" : {
        "via_af" : false,
        "email" : null,
        "other" : null,
        "reference" : "A1126827",
        "url" : "https://recruit.visma.com/Public/Apply.aspx?guidAssignment=879817e3-8bed-418a-b41d-33d2e2134798&publishCode=AMS&TK=12a53be4-b93f-4ba8-84da-2e6b0e78b55e",
        "information" : null
      },
      "source_type" : "VIA_PLATSBANKEN_DXA",
      "application_deadline" : "2022-08-28T23:59:59",
      "external_id" : "46-556764-7606-879817E38BED418AB41D33D2E2134798",
      "workplace_address" : {
        "coordinates" : [ 12.25209, 57.107117 ],
        "city" : null,
        "postcode" : null,
        "municipality" : "Varberg",
        "region_concept_id" : "wjee_qH2_yb6",
        "region" : "Hallands län",
        "country_code" : "199",
        "region_code" : "13",
        "municipality_concept_id" : "AkUx_yAq_kGr",
        "country_concept_id" : "i46j_HmG_v64",
        "municipality_code" : "1383",
        "street_address" : null,
        "country" : "Sverige"
      },
      "id" : "26238149",
      "experience_required" : true,
      "working_hours_type" : {
        "concept_id" : "6YE1_gAC_R2G",
        "label" : "Heltid",
        "legacy_ams_taxonomy_id" : "1"
      },
      "access" : null,
      "timestamp" : 1655732118215,
      "must_have" : {
        "education_level" : [ ],
        "work_experiences" : [ {
          "concept_id" : "MQHi_q9J_x2d",
          "weight" : 10,
          "label" : "Väg- och anläggningsarbetare",
          "legacy_ams_taxonomy_id" : "5871"
        } ],
        "skills" : [ ],
        "education" : [ ],
        "languages" : [ ]
      },
      "occupation_field" : {
        "concept_id" : "j7Cq_ZJe_GkT",
        "label" : "Bygg och anläggning",
        "legacy_ams_taxonomy_id" : "2"
      },
      "scope_of_work" : {
        "min" : 100,
        "max" : 100
      },
      "salary_type" : {
        "concept_id" : "oG8G_9cW_nRf",
        "label" : "Fast månads- vecko- eller timlön",
        "legacy_ams_taxonomy_id" : "1"
      },
      "removed" : false,
      "salary_description" : "Enligt avtal.",
      "access_to_own_car" : false,
      "publication_date" : "2022-07-04T00:00:00"
    },
    "name" : "Rörmontör",
    "user" : "hannes"
  },
  "sha1" : "f429f242ec18ffab856f54cbeaf35e3d105a8e17",
  "annotations" : [ {
    "preferred-label" : "Hållbar utveckling",
    "type" : "keyword",
    "start-position" : 57,
    "end-position" : 64,
    "concept-id" : "RKw3_zWW_1pf",
    "matched-string" : "hållbar",
    "annotation-id" : 5
  }, {
    "preferred-label" : "Hållbar utveckling",
    "type" : "keyword",
    "start-position" : 129,
    "end-position" : 136,
    "concept-id" : "RKw3_zWW_1pf",
    "matched-string" : "hållbar",
    "annotation-id" : 6
  }, {
    "preferred-label" : "Konsumtion",
    "sentiment" : "MUST_HAVE",
    "type" : "keyword",
    "start-position" : 137,
    "end-position" : 147,
    "concept-id" : "9m5g_y5G_Ajx",
    "matched-string" : "konsumtion",
    "annotation-id" : 0
  }, {
    "preferred-label" : "Avfall",
    "sentiment" : "MUST_HAVE",
    "type" : "keyword",
    "start-position" : 160,
    "end-position" : 166,
    "concept-id" : "Kx4Q_7TA_MuR",
    "matched-string" : "avfall",
    "annotation-id" : 1
  }, {
    "preferred-label" : "Hållbar utveckling",
    "type" : "keyword",
    "start-position" : 273,
    "end-position" : 280,
    "concept-id" : "RKw3_zWW_1pf",
    "matched-string" : "hållbar",
    "annotation-id" : 7
  }, {
    "preferred-label" : "Varberg",
    "type" : "municipality",
    "start-position" : 749,
    "end-position" : 756,
    "concept-id" : "AkUx_yAq_kGr",
    "matched-string" : "Varberg",
    "annotation-id" : 8
  }, {
    "preferred-label" : "arbeta utomhus",
    "type" : "esco-skill",
    "start-position" : 868,
    "end-position" : 882,
    "concept-id" : "Jvu2_Ain_MsJ",
    "matched-string" : "arbeta utomhus",
    "annotation-id" : 9
  }, {
    "preferred-label" : "B",
    "type" : "driving-licence",
    "start-position" : 1105,
    "end-position" : 1114,
    "concept-id" : "VTK8_WRx_GcM",
    "matched-string" : "B-körkort",
    "annotation-id" : 10
  }, {
    "preferred-label" : "Vvsare",
    "type" : "keyword",
    "start-position" : 1146,
    "end-position" : 1149,
    "concept-id" : "Thzd_jiq_7SF",
    "matched-string" : "VVS",
    "annotation-id" : 11
  }, {
    "preferred-label" : "Anläggningsarbeten",
    "sentiment" : "MUST_HAVE",
    "type" : "sni-level-2",
    "start-position" : 1155,
    "end-position" : 1173,
    "concept-id" : "pSzC_2YX_dkE",
    "matched-string" : "anläggningsarbeten",
    "annotation-id" : 2
  }, {
    "preferred-label" : "arbetsmiljö",
    "sentiment" : "MUST_HAVE",
    "type" : "esco-skill",
    "start-position" : 1202,
    "end-position" : 1213,
    "concept-id" : "zdQY_QJh_nUH",
    "matched-string" : "arbetsmiljö",
    "annotation-id" : 3
  } ],
  "text" : "Rörmontör\nVivab, Vatten & Miljö i Väst AB, jobbar för en hållbar framtid med friskare hav, ett rent och gott dricksvatten och en hållbar konsumtion med minskat avfall. Vivab är en viktig aktör inom grön samhällsutveckling på västkustens mittpunkt. Vi har ett hjärta för en hållbar framtid och nu söker vi dig som vill vara med och göra det möjligt! \n\nVill du vara en viktig del i att förse mer än 100 000 personer med rent och friskt vatten?\nDå ska du söka tjänsten som rörmontör hos oss!\r\n\r\nARBETSUPPGIFTER\nSom rörmontör arbetar du och dina kollegor med installationer vid ny- och ombyggnation och med reparationer och service i ledningsnätet. Arbetet sker utomhus med omväxlande arbetsuppgifter. Beredskapstjänst kan ingå. \nTjänsten är placerad i Varberg.\r\n\r\nKVALIFIKATIONER\nDu trivs med ett omväxlande arbete, är lösningsfokuserad och gillar att jobba i team. \nAtt arbeta utomhus passar dig bra, du är hjälpsam och gillar ordning och reda. \nDu är handlingskraftig, tar initiativ och ser till att slutföra det du påbörjar. \nDu har:\n• en relevant utbildning inom rörteknik eller anläggning\n• datorvana\n• B-körkort\n\nErfarenhet från diverse rör-, VVS- och anläggningsarbeten värdesätts.\r\n\nÖVRIGT\nEn bra arbetsmiljö ligger högt upp på vår agenda och vi vill att våra medarbetare har en bra balans mellan arbete och fritid. \nVivab vill främja en hälsosam livsstil och erbjuder bland annat en friskvårdstimme i veckan, friskvårdsbidrag och möjlighet till att hyra förmånscykel. \n\nOBS! Vi undanber oss alla erbjudanden om ytterligare annonsering både i tryck och digitalt."
}