{
  "meta" : {
    "jobad" : {
      "description" : {
        "requirements" : null,
        "needs" : null,
        "company_information" : null,
        "text_formatted" : "Älskar du kundkontakt, många frågor och många bollar i luften?\n\nDet är vad vi gör varje dag och natt i receptionen på hotell Bellora. Vi ligger mitt på Avenyn och vi jobbar nära vår restaurang som har fullt varje dag och natt. Vi älskar att ge våra kunder det lilla extra och hjälpa till med vad som behövs.\n\nVi söker extra personal med start omgående, 30-50%.\n\nVi ser gärna att du har arbetat med service i reception eller liknande innan, är minst 18 år och är bra på att sätta dig in i system snabbt. Vi arbetar med Protel så det är en fördel om du har arbetat i det innan, om du inte har det - så lär vi dig.\n\nVi pratar engelska och svenska i receptionen. Arbetstiderna är varierande 06:45-14:45, 10:00-18:00 eller 14:00-22:00.\n\nIntresserad? Perfekt, svara på frågorna och sänd med ditt CV.",
        "conditions" : "Heltid\r\nAnställningstid enligt överenskommelse",
        "text" : "Älskar du kundkontakt, många frågor och många bollar i luften?\n\nDet är vad vi gör varje dag och natt i receptionen på hotell Bellora. Vi ligger mitt på Avenyn och vi jobbar nära vår restaurang som har fullt varje dag och natt. Vi älskar att ge våra kunder det lilla extra och hjälpa till med vad som behövs.\n\nVi söker extra personal med start omgående, 30-50%.\n\nVi ser gärna att du har arbetat med service i reception eller liknande innan, är minst 18 år och är bra på att sätta dig in i system snabbt. Vi arbetar med Protel så det är en fördel om du har arbetat i det innan, om du inte har det - så lär vi dig.\n\nVi pratar engelska och svenska i receptionen. Arbetstiderna är varierande 06:45-14:45, 10:00-18:00 eller 14:00-22:00.\n\nIntresserad? Perfekt, svara på frågorna och sänd med ditt CV."
      },
      "headline" : "Receptionist extra till Hotel Bellora",
      "driving_license" : null,
      "employer" : {
        "email" : null,
        "phone_number" : null,
        "organization_number" : "5567108047",
        "name" : "ESS Hotel Group AB",
        "url" : "http://www.essgroup.se",
        "workplace" : "ESS Group"
      },
      "removed_date" : null,
      "logo_url" : "https://www.arbetsformedlingen.se/rest/arbetsgivare/rest/af/v3/organisation/5567108047/logotyper/logo.png",
      "last_publication_date" : "2022-12-14T23:59:59",
      "number_of_vacancies" : 1,
      "occupation" : {
        "concept_id" : "3kFW_XLk_v9H",
        "label" : "Hotellreceptionist",
        "legacy_ams_taxonomy_id" : "5596"
      },
      "occupation_group" : {
        "concept_id" : "bYde_Frc_xcB",
        "label" : "Hotellreceptionister m.fl.",
        "legacy_ams_taxonomy_id" : "4224"
      },
      "employment_type" : {
        "concept_id" : "PFZr_Syz_cUq",
        "label" : "Vanlig anställning",
        "legacy_ams_taxonomy_id" : "1"
      },
      "webpage_url" : "https://arbetsformedlingen.se/platsbanken/annonser/26263265",
      "driving_license_required" : false,
      "application_contacts" : [ {
        "description" : "Anna Petersson",
        "email" : null,
        "telephone" : null,
        "name" : null,
        "contact_type" : null
      } ],
      "duration" : {
        "concept_id" : "a7uU_j21_mkL",
        "label" : "Tills vidare",
        "legacy_ams_taxonomy_id" : "1"
      },
      "nice_to_have" : {
        "education_level" : [ ],
        "work_experiences" : [ ],
        "skills" : [ ],
        "education" : [ ],
        "languages" : [ ]
      },
      "application_details" : {
        "via_af" : false,
        "email" : null,
        "other" : null,
        "reference" : null,
        "url" : "https://work.essgroup.se/jobs/1880920-receptionist-extra-till-hotel-bellora?promotion=438099-arbetsformedlingen",
        "information" : null
      },
      "source_type" : "VIA_PLATSBANKEN_DXA",
      "application_deadline" : "2022-12-14T23:59:59",
      "external_id" : "46-556710-8047-1880920-1",
      "workplace_address" : {
        "coordinates" : [ 11.97456, 57.70887 ],
        "city" : null,
        "postcode" : null,
        "municipality" : "Göteborg",
        "region_concept_id" : "zdoY_6u5_Krt",
        "region" : "Västra Götalands län",
        "country_code" : "199",
        "region_code" : "14",
        "municipality_concept_id" : "PVZL_BQT_XtL",
        "country_concept_id" : "i46j_HmG_v64",
        "municipality_code" : "1480",
        "street_address" : null,
        "country" : "Sverige"
      },
      "id" : "26263265",
      "experience_required" : false,
      "working_hours_type" : {
        "concept_id" : "6YE1_gAC_R2G",
        "label" : "Heltid",
        "legacy_ams_taxonomy_id" : "1"
      },
      "access" : null,
      "timestamp" : 1656337534536,
      "must_have" : {
        "education_level" : [ ],
        "work_experiences" : [ ],
        "skills" : [ ],
        "education" : [ ],
        "languages" : [ ]
      },
      "occupation_field" : {
        "concept_id" : "ScKy_FHB_7wT",
        "label" : "Hotell, restaurang, storhushåll",
        "legacy_ams_taxonomy_id" : "7"
      },
      "scope_of_work" : {
        "min" : 100,
        "max" : 100
      },
      "salary_type" : {
        "concept_id" : "oG8G_9cW_nRf",
        "label" : "Fast månads- vecko- eller timlön",
        "legacy_ams_taxonomy_id" : "1"
      },
      "removed" : false,
      "salary_description" : "Lön enligt överenskommelse",
      "access_to_own_car" : false,
      "publication_date" : "2022-06-27T15:45:34"
    },
    "name" : "Receptionist extra till Hotel Bellora",
    "user" : "hannes"
  },
  "sha1" : "160d8342af45cdb1484e274875acb1484548dbfc",
  "annotations" : [ {
    "preferred-label" : "Receptionist",
    "sentiment" : "MUST_HAVE",
    "type" : "keyword",
    "start-position" : 0,
    "end-position" : 12,
    "concept-id" : "gAAz_Lo5_WRR",
    "matched-string" : "receptionist",
    "annotation-id" : 0
  }, {
    "preferred-label" : "Hotell",
    "type" : "keyword",
    "start-position" : 24,
    "end-position" : 29,
    "concept-id" : "Jrrg_iiS_2yp",
    "matched-string" : "Hotel",
    "annotation-id" : 7
  }, {
    "preferred-label" : "Reception",
    "type" : "keyword",
    "start-position" : 141,
    "end-position" : 152,
    "concept-id" : "zRKv_kwY_uw4",
    "matched-string" : "receptionen",
    "annotation-id" : 8
  }, {
    "preferred-label" : "Hotell",
    "sentiment" : "MUST_HAVE",
    "type" : "keyword",
    "start-position" : 156,
    "end-position" : 162,
    "concept-id" : "Jrrg_iiS_2yp",
    "matched-string" : "hotell",
    "annotation-id" : 1
  }, {
    "preferred-label" : "Restaurang",
    "sentiment" : "MUST_HAVE",
    "type" : "keyword",
    "start-position" : 220,
    "end-position" : 230,
    "concept-id" : "o2Cg_3Ap_qvK",
    "matched-string" : "restaurang",
    "annotation-id" : 2
  }, {
    "preferred-label" : "Deltid",
    "type" : "worktime-extent",
    "start-position" : 391,
    "end-position" : 397,
    "concept-id" : "947z_JGS_Uk2",
    "matched-string" : "30-50%",
    "annotation-id" : 9
  }, {
    "preferred-label" : "Reception",
    "sentiment" : "MUST_HAVE",
    "type" : "keyword",
    "start-position" : 446,
    "end-position" : 455,
    "concept-id" : "zRKv_kwY_uw4",
    "matched-string" : "reception",
    "annotation-id" : 4
  }, {
    "preferred-label" : "Engelska",
    "sentiment" : "MUST_HAVE",
    "type" : "language",
    "start-position" : 661,
    "end-position" : 669,
    "concept-id" : "NVxJ_hLg_TYS",
    "matched-string" : "engelska",
    "annotation-id" : 5
  }, {
    "preferred-label" : "Svenska",
    "sentiment" : "MUST_HAVE",
    "type" : "language",
    "start-position" : 674,
    "end-position" : 681,
    "concept-id" : "zSLA_vw2_FXN",
    "matched-string" : "svenska",
    "annotation-id" : 6
  }, {
    "preferred-label" : "Reception",
    "type" : "keyword",
    "start-position" : 684,
    "end-position" : 695,
    "concept-id" : "zRKv_kwY_uw4",
    "matched-string" : "receptionen",
    "annotation-id" : 10
  } ],
  "text" : "Receptionist extra till Hotel Bellora\nÄlskar du kundkontakt, många frågor och många bollar i luften?\n\nDet är vad vi gör varje dag och natt i receptionen på hotell Bellora. Vi ligger mitt på Avenyn och vi jobbar nära vår restaurang som har fullt varje dag och natt. Vi älskar att ge våra kunder det lilla extra och hjälpa till med vad som behövs.\n\nVi söker extra personal med start omgående, 30-50%.\n\nVi ser gärna att du har arbetat med service i reception eller liknande innan, är minst 18 år och är bra på att sätta dig in i system snabbt. Vi arbetar med Protel så det är en fördel om du har arbetat i det innan, om du inte har det - så lär vi dig.\n\nVi pratar engelska och svenska i receptionen. Arbetstiderna är varierande 06:45-14:45, 10:00-18:00 eller 14:00-22:00.\n\nIntresserad? Perfekt, svara på frågorna och sänd med ditt CV."
}