{
  "meta" : {
    "jobad" : {
      "description" : {
        "requirements" : null,
        "needs" : null,
        "company_information" : null,
        "text_formatted" : "<p><strong>Meet a Student är en jobbplattform för studenter och juniora talanger. </strong></p><p><strong>För kunds räkning söker vi nu:</strong></p><p>Nu söker vi en Finance Engineer/Business Controller till Moanks huvudkontor i centrala Stockholm. </p><p>Är du i början av karriären och vill arbeta i en utvecklande kvantitativ roll på ett modernt och entreprenöriellt fintechbolag? Moank är ett fintechbolag under tillsyn av Finansinspektionen. Med hjälp av innovation och ny teknik erbjuder Moank lån till attraktiva villkor. Det är alltid enkelt, personligt och anpassat efter våra kunders behov. Du kommer hos oss erbjudas en bred, utvecklande och spännande roll där du får arbeta strategiskt och analytiskt.</p><p>Bank- och finansbranschen är under stor förändring. Moank grundades 2015 med en strävan efter att föra den finansiella bankvärlden närmare den mänskliga, och att bli den aktör som saknades i branschen – ett företag som satte människan i första rummet. Genom innovativ teknik och mänsklig närvaro skapar vi en djup förståelse för varje enskild kund. Vi erbjuder trygga produkter till hållbara villkor som främjar en sund, ansvarsfull och långsiktig privatekonomi.</p><p>Vad erbjuder vi dig?</p><p>Hos oss blir du del av ett entreprenöriellt bolag där du tillsammans med drivna kollegor får möjlighet att bygga framtidens bank! Vi är en platt organisation med korta beslutsvägar där du ges stora möjligheter att påverka. Du fyller en viktig funktion i vår organisation och ges därför ett stort ansvar och vi erbjuder dig goda utvecklingsmöjligheter.</p><p>Om rollen</p><p>I rollen som Finance Engineer/Business Controller kommer du med stöd från bolagets finanschef och analysavdelning arbeta med det finansiella arbetet i Moank. Du kommer att delta i utvecklingen av datadrivna processer inom statistik och maskininlärning med inriktning mot finansiell rapportering och analys.</p><p>Rollen innefattar bland annat att:</p><ul><li>Utveckla processer och analyser, både ifrån ett övergripande bolagsperspektiv samt på affärsområdesnivå för att utveckla affären.</li><li>Effektivisera informationsflöden och bygga processer som underlättar rapportering.</li><li>Regelbundet skapa finansiella prognoser och budget på gruppnivå samt för enskilda produkter. </li><li>Vara delaktig i upprättande av affärsplaner samt stödja affärsansvariga i finansiella frågor. </li><li>Rapportering till Finansinspektionen, finansiell rapportering till ledningsgrupp samt styrelse, och sammanställning av annan extern finansiell information.</li></ul><p>Om dig</p><p>Vi ser positivt på dig som är nyexaminerad civilingenjör och som är redo att ta steget in i arbetslivet. Vidare har du väldigt god förmåga att hantera data och känner dig bekväm i något programmerings- och analysverktyg för att snabbt få fram svar på frågor. Har du något eller några års arbetslivserfarenhet inom exempelvis bankväsendet eller har arbetat som managementkonsult med inriktning på finansiella företag är detta meriterande. </p><p>Dessutom besitter du följande egenskaper:</p><ul><li>Hög genomförandeförmåga och har lätt för att sätta dig in i problemformuleringar och nå en lösning.</li><li>God förmåga att förklara komplexa samband på ett pedagogiskt sätt.</li><li>God kommunikativ förmåga och vana att uttrycka dig i tal och skrift på svenska och engelska.</li></ul><p>Som person är du nyfiken, gillar högt tempo men tummar inte på kvalitet. Du är ödmjuk inför arbetsuppgifter och mot dina kollegor. Som Finance Engineer vill du vara med och bidra med dina kunskaper i Moanks fortsatta resa att bygga framtidens bank.</p><p><br></p>",
        "conditions" : null,
        "text" : "Meet a Student är en jobbplattform för studenter och juniora talanger. \nFör kunds räkning söker vi nu:\nNu söker vi en Finance Engineer/Business Controller till Moanks huvudkontor i centrala Stockholm. \nÄr du i början av karriären och vill arbeta i en utvecklande kvantitativ roll på ett modernt och entreprenöriellt fintechbolag? Moank är ett fintechbolag under tillsyn av Finansinspektionen. Med hjälp av innovation och ny teknik erbjuder Moank lån till attraktiva villkor. Det är alltid enkelt, personligt och anpassat efter våra kunders behov. Du kommer hos oss erbjudas en bred, utvecklande och spännande roll där du får arbeta strategiskt och analytiskt.\nBank- och finansbranschen är under stor förändring. Moank grundades 2015 med en strävan efter att föra den finansiella bankvärlden närmare den mänskliga, och att bli den aktör som saknades i branschen – ett företag som satte människan i första rummet. Genom innovativ teknik och mänsklig närvaro skapar vi en djup förståelse för varje enskild kund. Vi erbjuder trygga produkter till hållbara villkor som främjar en sund, ansvarsfull och långsiktig privatekonomi.\nVad erbjuder vi dig?\nHos oss blir du del av ett entreprenöriellt bolag där du tillsammans med drivna kollegor får möjlighet att bygga framtidens bank! Vi är en platt organisation med korta beslutsvägar där du ges stora möjligheter att påverka. Du fyller en viktig funktion i vår organisation och ges därför ett stort ansvar och vi erbjuder dig goda utvecklingsmöjligheter.\nOm rollen\nI rollen som Finance Engineer/Business Controller kommer du med stöd från bolagets finanschef och analysavdelning arbeta med det finansiella arbetet i Moank. Du kommer att delta i utvecklingen av datadrivna processer inom statistik och maskininlärning med inriktning mot finansiell rapportering och analys.\nRollen innefattar bland annat att:\nUtveckla processer och analyser, både ifrån ett övergripande bolagsperspektiv samt på affärsområdesnivå för att utveckla affären.\nEffektivisera informationsflöden och bygga processer som underlättar rapportering.\nRegelbundet skapa finansiella prognoser och budget på gruppnivå samt för enskilda produkter. \nVara delaktig i upprättande av affärsplaner samt stödja affärsansvariga i finansiella frågor. \nRapportering till Finansinspektionen, finansiell rapportering till ledningsgrupp samt styrelse, och sammanställning av annan extern finansiell information.\n\nOm dig\nVi ser positivt på dig som är nyexaminerad civilingenjör och som är redo att ta steget in i arbetslivet. Vidare har du väldigt god förmåga att hantera data och känner dig bekväm i något programmerings- och analysverktyg för att snabbt få fram svar på frågor. Har du något eller några års arbetslivserfarenhet inom exempelvis bankväsendet eller har arbetat som managementkonsult med inriktning på finansiella företag är detta meriterande. \nDessutom besitter du följande egenskaper:\nHög genomförandeförmåga och har lätt för att sätta dig in i problemformuleringar och nå en lösning.\nGod förmåga att förklara komplexa samband på ett pedagogiskt sätt.\nGod kommunikativ förmåga och vana att uttrycka dig i tal och skrift på svenska och engelska.\n\nSom person är du nyfiken, gillar högt tempo men tummar inte på kvalitet. Du är ödmjuk inför arbetsuppgifter och mot dina kollegor. Som Finance Engineer vill du vara med och bidra med dina kunskaper i Moanks fortsatta resa att bygga framtidens bank."
      },
      "headline" : "Nyexaminerad/Junior Civilingenjör",
      "driving_license" : null,
      "employer" : {
        "email" : null,
        "phone_number" : null,
        "organization_number" : "5591911747",
        "name" : "Meet a Group international AB",
        "url" : "https://meetastudent.com/sv/",
        "workplace" : "Meet a Group international AB"
      },
      "removed_date" : null,
      "logo_url" : "https://www.arbetsformedlingen.se/rest/arbetsgivare/rest/af/v3/arbetsplatser/87837001/logotyper/logo.png",
      "last_publication_date" : "2022-08-04T23:59:59",
      "number_of_vacancies" : 1,
      "occupation" : {
        "concept_id" : "roHu_JVn_w1y",
        "label" : "Finansekonom",
        "legacy_ams_taxonomy_id" : "5669"
      },
      "occupation_group" : {
        "concept_id" : "pTr9_RBT_9ur",
        "label" : "Finansanalytiker och investeringsrådgivare m.fl.",
        "legacy_ams_taxonomy_id" : "2413"
      },
      "employment_type" : {
        "concept_id" : "PFZr_Syz_cUq",
        "label" : "Vanlig anställning",
        "legacy_ams_taxonomy_id" : "1"
      },
      "webpage_url" : "https://arbetsformedlingen.se/platsbanken/annonser/26335081",
      "driving_license_required" : false,
      "application_contacts" : [ ],
      "duration" : {
        "concept_id" : "a7uU_j21_mkL",
        "label" : "Tills vidare",
        "legacy_ams_taxonomy_id" : "1"
      },
      "nice_to_have" : {
        "education_level" : [ ],
        "work_experiences" : [ ],
        "skills" : [ ],
        "education" : [ ],
        "languages" : [ ]
      },
      "application_details" : {
        "via_af" : false,
        "email" : null,
        "other" : null,
        "reference" : null,
        "url" : "https://meetastudent.com/sv/ledigajobb/16281-ar-du-nyexaminerad-civilingenjor-se-hit/",
        "information" : null
      },
      "source_type" : "VIA_ANNONSERA",
      "application_deadline" : "2022-08-04T23:59:59",
      "external_id" : null,
      "workplace_address" : {
        "coordinates" : [ null, null ],
        "city" : null,
        "postcode" : null,
        "municipality" : "Stockholm",
        "region_concept_id" : "CifL_Rzy_Mku",
        "region" : "Stockholms län",
        "country_code" : "199",
        "region_code" : "01",
        "municipality_concept_id" : "AvNB_uwa_6n6",
        "country_concept_id" : "i46j_HmG_v64",
        "municipality_code" : "0180",
        "street_address" : null,
        "country" : "Sverige"
      },
      "id" : "26335081",
      "experience_required" : false,
      "working_hours_type" : {
        "concept_id" : "6YE1_gAC_R2G",
        "label" : "Heltid",
        "legacy_ams_taxonomy_id" : "1"
      },
      "access" : null,
      "timestamp" : 1658133890334,
      "must_have" : {
        "education_level" : [ ],
        "work_experiences" : [ ],
        "skills" : [ ],
        "education" : [ ],
        "languages" : [ ]
      },
      "occupation_field" : {
        "concept_id" : "X82t_awd_Qyc",
        "label" : "Administration, ekonomi, juridik",
        "legacy_ams_taxonomy_id" : "1"
      },
      "scope_of_work" : {
        "min" : 0,
        "max" : 100
      },
      "salary_type" : {
        "concept_id" : "oG8G_9cW_nRf",
        "label" : "Fast månads- vecko- eller timlön",
        "legacy_ams_taxonomy_id" : "1"
      },
      "removed" : false,
      "salary_description" : null,
      "access_to_own_car" : false,
      "publication_date" : "2022-07-18T10:44:50"
    },
    "name" : "Nyexaminerad/Junior Civilingenjör",
    "user" : "hannes"
  },
  "sha1" : "9ee858f9d1d712ff480b28b121419a906f84b214",
  "annotations" : [ {
    "preferred-label" : "Civilingenjörsyrken",
    "type" : "ssyk-level-3",
    "start-position" : 20,
    "end-position" : 33,
    "concept-id" : "4jZs_twz_epW",
    "matched-string" : "Civilingenjör",
    "annotation-id" : 13
  }, {
    "preferred-label" : "Business controller",
    "sentiment" : "MUST_HAVE",
    "type" : "occupation-name",
    "start-position" : 169,
    "end-position" : 188,
    "concept-id" : "8tSq_t1z_MRT",
    "matched-string" : "business controller",
    "annotation-id" : 0
  }, {
    "preferred-label" : "Stockholm",
    "type" : "municipality",
    "start-position" : 224,
    "end-position" : 233,
    "concept-id" : "AvNB_uwa_6n6",
    "matched-string" : "Stockholm",
    "annotation-id" : 14
  }, {
    "preferred-label" : "Bank",
    "sentiment" : "MUST_HAVE",
    "type" : "keyword",
    "start-position" : 694,
    "end-position" : 698,
    "concept-id" : "xqgq_CRg_5mv",
    "matched-string" : "bank",
    "annotation-id" : 1
  }, {
    "preferred-label" : "Bank",
    "sentiment" : "MUST_HAVE",
    "type" : "keyword",
    "start-position" : 1302,
    "end-position" : 1306,
    "concept-id" : "xqgq_CRg_5mv",
    "matched-string" : "bank",
    "annotation-id" : 2
  }, {
    "preferred-label" : "Business controller",
    "sentiment" : "MUST_HAVE",
    "type" : "occupation-name",
    "start-position" : 1570,
    "end-position" : 1589,
    "concept-id" : "8tSq_t1z_MRT",
    "matched-string" : "business controller",
    "annotation-id" : 3
  }, {
    "preferred-label" : "Ekonomidirektör/Finanschef",
    "sentiment" : "MUST_HAVE",
    "type" : "occupation-name",
    "start-position" : 1623,
    "end-position" : 1633,
    "concept-id" : "jgo4_iYd_cr6",
    "matched-string" : "finanschef",
    "annotation-id" : 4
  }, {
    "preferred-label" : "Statistik",
    "sentiment" : "MUST_HAVE",
    "type" : "keyword",
    "start-position" : 1762,
    "end-position" : 1771,
    "concept-id" : "QV1q_coS_XtX",
    "matched-string" : "statistik",
    "annotation-id" : 5
  }, {
    "preferred-label" : "Machine learning/Maskininlärning",
    "sentiment" : "MUST_HAVE",
    "type" : "skill",
    "start-position" : 1776,
    "end-position" : 1791,
    "concept-id" : "XEhm_7YA_qKM",
    "matched-string" : "maskininlärning",
    "annotation-id" : 6
  }, {
    "preferred-label" : "Civilingenjörsyrken",
    "type" : "ssyk-level-3",
    "start-position" : 2491,
    "end-position" : 2504,
    "concept-id" : "4jZs_twz_epW",
    "matched-string" : "civilingenjör",
    "annotation-id" : 15
  }, {
    "preferred-label" : "Data/IT",
    "sentiment" : "MUST_HAVE",
    "type" : "occupation-field",
    "start-position" : 2599,
    "end-position" : 2603,
    "concept-id" : "apaJ_2ja_LuF",
    "matched-string" : "data",
    "annotation-id" : 7
  }, {
    "preferred-label" : "Programmering",
    "type" : "skill",
    "start-position" : 2634,
    "end-position" : 2648,
    "concept-id" : "iUew_moc_BRk",
    "matched-string" : "programmerings",
    "annotation-id" : 16
  }, {
    "preferred-label" : "Analysverktyg",
    "sentiment" : "MUST_HAVE",
    "type" : "skill",
    "start-position" : 2654,
    "end-position" : 2667,
    "concept-id" : "bwYY_qC7_5xE",
    "matched-string" : "analysverktyg",
    "annotation-id" : 8
  }, {
    "preferred-label" : "Managementkonsult",
    "sentiment" : "MUST_HAVE",
    "type" : "keyword",
    "start-position" : 2808,
    "end-position" : 2825,
    "concept-id" : "sXfH_wMW_bAz",
    "matched-string" : "managementkonsult",
    "annotation-id" : 9
  }, {
    "preferred-label" : "Svenska",
    "sentiment" : "MUST_HAVE",
    "type" : "language",
    "start-position" : 3167,
    "end-position" : 3174,
    "concept-id" : "zSLA_vw2_FXN",
    "matched-string" : "svenska",
    "annotation-id" : 10
  }, {
    "preferred-label" : "Engelska",
    "sentiment" : "MUST_HAVE",
    "type" : "language",
    "start-position" : 3179,
    "end-position" : 3187,
    "concept-id" : "NVxJ_hLg_TYS",
    "matched-string" : "engelska",
    "annotation-id" : 11
  }, {
    "preferred-label" : "Bank",
    "sentiment" : "MUST_HAVE",
    "type" : "keyword",
    "start-position" : 3433,
    "end-position" : 3437,
    "concept-id" : "xqgq_CRg_5mv",
    "matched-string" : "bank",
    "annotation-id" : 12
  } ],
  "text" : "Nyexaminerad/Junior Civilingenjör\nMeet a Student är en jobbplattform för studenter och juniora talanger. \nFör kunds räkning söker vi nu:\nNu söker vi en Finance Engineer/Business Controller till Moanks huvudkontor i centrala Stockholm. \nÄr du i början av karriären och vill arbeta i en utvecklande kvantitativ roll på ett modernt och entreprenöriellt fintechbolag? Moank är ett fintechbolag under tillsyn av Finansinspektionen. Med hjälp av innovation och ny teknik erbjuder Moank lån till attraktiva villkor. Det är alltid enkelt, personligt och anpassat efter våra kunders behov. Du kommer hos oss erbjudas en bred, utvecklande och spännande roll där du får arbeta strategiskt och analytiskt.\nBank- och finansbranschen är under stor förändring. Moank grundades 2015 med en strävan efter att föra den finansiella bankvärlden närmare den mänskliga, och att bli den aktör som saknades i branschen – ett företag som satte människan i första rummet. Genom innovativ teknik och mänsklig närvaro skapar vi en djup förståelse för varje enskild kund. Vi erbjuder trygga produkter till hållbara villkor som främjar en sund, ansvarsfull och långsiktig privatekonomi.\nVad erbjuder vi dig?\nHos oss blir du del av ett entreprenöriellt bolag där du tillsammans med drivna kollegor får möjlighet att bygga framtidens bank! Vi är en platt organisation med korta beslutsvägar där du ges stora möjligheter att påverka. Du fyller en viktig funktion i vår organisation och ges därför ett stort ansvar och vi erbjuder dig goda utvecklingsmöjligheter.\nOm rollen\nI rollen som Finance Engineer/Business Controller kommer du med stöd från bolagets finanschef och analysavdelning arbeta med det finansiella arbetet i Moank. Du kommer att delta i utvecklingen av datadrivna processer inom statistik och maskininlärning med inriktning mot finansiell rapportering och analys.\nRollen innefattar bland annat att:\nUtveckla processer och analyser, både ifrån ett övergripande bolagsperspektiv samt på affärsområdesnivå för att utveckla affären.\nEffektivisera informationsflöden och bygga processer som underlättar rapportering.\nRegelbundet skapa finansiella prognoser och budget på gruppnivå samt för enskilda produkter. \nVara delaktig i upprättande av affärsplaner samt stödja affärsansvariga i finansiella frågor. \nRapportering till Finansinspektionen, finansiell rapportering till ledningsgrupp samt styrelse, och sammanställning av annan extern finansiell information.\n\nOm dig\nVi ser positivt på dig som är nyexaminerad civilingenjör och som är redo att ta steget in i arbetslivet. Vidare har du väldigt god förmåga att hantera data och känner dig bekväm i något programmerings- och analysverktyg för att snabbt få fram svar på frågor. Har du något eller några års arbetslivserfarenhet inom exempelvis bankväsendet eller har arbetat som managementkonsult med inriktning på finansiella företag är detta meriterande. \nDessutom besitter du följande egenskaper:\nHög genomförandeförmåga och har lätt för att sätta dig in i problemformuleringar och nå en lösning.\nGod förmåga att förklara komplexa samband på ett pedagogiskt sätt.\nGod kommunikativ förmåga och vana att uttrycka dig i tal och skrift på svenska och engelska.\n\nSom person är du nyfiken, gillar högt tempo men tummar inte på kvalitet. Du är ödmjuk inför arbetsuppgifter och mot dina kollegor. Som Finance Engineer vill du vara med och bidra med dina kunskaper i Moanks fortsatta resa att bygga framtidens bank."
}