{
  "meta" : {
    "jobad" : {
      "description" : {
        "requirements" : null,
        "needs" : null,
        "company_information" : null,
        "text_formatted" : "Om tjänsten\nJust nu söker vi en finsktalande medarbetare till ett roligt och växande e-bolag. Du kommer att arbeta med kundrelationer och att både bygga och behålla de kundrelationer som finns i och runt bolaget. I rollen kommer man även att besvara frågor som kunderna kan ha. Du kommer få möjlighet att arbeta i ett litet och härligt team som stöttar varandra.\n\nDina arbetsuppgifter\n\n• Hantera inkommande samtal \n• Kundmöten\n• Administrativa sysslor så som mail-hantering \n• Ge kunderna snabb och rätt service kring deras frågor.\n\nArbetsgivarens förhoppning är att du är intresserad av ett långsiktigt arbete där de gärna ser att du som medarbetare utvecklas i rollen och har viljan att ta nästa steg.\n\nArbetstiden är vanligtvis dagtid måndag-fredag.Tillträde sker enligt överenskommelse, gärna omgående.\n\n\nDin profil\nVi söker dig som:\n• Är flytande i tal och skrift i finska och svenska. \n• Är serviceinriktad och är duktig på att uttrycka dig i både tal och i skrift.\n• Är ansvarsfull och flexibel\n• Trivs med att arbeta i högt tempo.\n• Har fullbordad gymnasieexamen.\n\nDin erfarenhet:\n• Tidigare erfarenhet från serviceyrken är ett krav. Vi lägger också stor vikt vid personliga egenskaper!\n\nVi erbjuder\n• Utvecklingsmöjligheter i ett expansivt företag\n• Ett företag som tänker på din fysiska arbetsmiljö\n• Lön enligt kollektivavtal.\n\nOm företaget\nKunden är ett växande bolag som finns i större delar av världen. Bolaget prioriterar att man ska få utvecklas och växa tillsammans med dom. \n\nVi ser fram emot att presentera oss närmare under rekryteringsprocessen. Skicka in CV och personligt brev redan idag. Urval sker löpande! \n\n\nOm oss\nRecruitive är en oberoende tjänsteleverantör inom rekrytering och bemanning med ett heltäckande erbjudande inom tjänstemannasektorn. Vårt erbjudande innefattar tjänster och branschlösningar inom våra tjänsteområden Administration, Ekonomi, Kundtjänst och Försäljning. \nVi är medlemmar i Almega Bemanningsföretagen och har kollektivavtal med Unionen och Akademikerförbundet.",
        "conditions" : "Heltid\r\nTillsvidare",
        "text" : "Om tjänsten\nJust nu söker vi en finsktalande medarbetare till ett roligt och växande e-bolag. Du kommer att arbeta med kundrelationer och att både bygga och behålla de kundrelationer som finns i och runt bolaget. I rollen kommer man även att besvara frågor som kunderna kan ha. Du kommer få möjlighet att arbeta i ett litet och härligt team som stöttar varandra.\n\nDina arbetsuppgifter\n\n• Hantera inkommande samtal \n• Kundmöten\n• Administrativa sysslor så som mail-hantering \n• Ge kunderna snabb och rätt service kring deras frågor.\n\nArbetsgivarens förhoppning är att du är intresserad av ett långsiktigt arbete där de gärna ser att du som medarbetare utvecklas i rollen och har viljan att ta nästa steg.\n\nArbetstiden är vanligtvis dagtid måndag-fredag.Tillträde sker enligt överenskommelse, gärna omgående.\n\n\nDin profil\nVi söker dig som:\n• Är flytande i tal och skrift i finska och svenska. \n• Är serviceinriktad och är duktig på att uttrycka dig i både tal och i skrift.\n• Är ansvarsfull och flexibel\n• Trivs med att arbeta i högt tempo.\n• Har fullbordad gymnasieexamen.\n\nDin erfarenhet:\n• Tidigare erfarenhet från serviceyrken är ett krav. Vi lägger också stor vikt vid personliga egenskaper!\n\nVi erbjuder\n• Utvecklingsmöjligheter i ett expansivt företag\n• Ett företag som tänker på din fysiska arbetsmiljö\n• Lön enligt kollektivavtal.\n\nOm företaget\nKunden är ett växande bolag som finns i större delar av världen. Bolaget prioriterar att man ska få utvecklas och växa tillsammans med dom. \n\nVi ser fram emot att presentera oss närmare under rekryteringsprocessen. Skicka in CV och personligt brev redan idag. Urval sker löpande! \n\n\nOm oss\nRecruitive är en oberoende tjänsteleverantör inom rekrytering och bemanning med ett heltäckande erbjudande inom tjänstemannasektorn. Vårt erbjudande innefattar tjänster och branschlösningar inom våra tjänsteområden Administration, Ekonomi, Kundtjänst och Försäljning. \nVi är medlemmar i Almega Bemanningsföretagen och har kollektivavtal med Unionen och Akademikerförbundet."
      },
      "headline" : "Finsktalande medarbetare till växande bolag",
      "driving_license" : null,
      "employer" : {
        "email" : null,
        "phone_number" : null,
        "organization_number" : "5590729546",
        "name" : "Recruitive AB",
        "url" : "http://www.recruitive.se/",
        "workplace" : "Recruitive AB"
      },
      "removed_date" : null,
      "logo_url" : "https://www.arbetsformedlingen.se/rest/arbetsgivare/rest/af/v3/organisation/5590729546/logotyper/logo.png",
      "last_publication_date" : "2022-08-13T23:59:59",
      "number_of_vacancies" : 1,
      "occupation" : {
        "concept_id" : "8Uhp_XYo_z5f",
        "label" : "Kundtjänstmedarbetare",
        "legacy_ams_taxonomy_id" : "2291"
      },
      "occupation_group" : {
        "concept_id" : "pwRH_MT1_8nR",
        "label" : "Kundtjänstpersonal",
        "legacy_ams_taxonomy_id" : "4222"
      },
      "employment_type" : {
        "concept_id" : "PFZr_Syz_cUq",
        "label" : "Vanlig anställning",
        "legacy_ams_taxonomy_id" : "1"
      },
      "webpage_url" : "https://arbetsformedlingen.se/platsbanken/annonser/26329792",
      "driving_license_required" : false,
      "application_contacts" : [ ],
      "duration" : {
        "concept_id" : "a7uU_j21_mkL",
        "label" : "Tills vidare",
        "legacy_ams_taxonomy_id" : "1"
      },
      "nice_to_have" : {
        "education_level" : [ ],
        "work_experiences" : [ ],
        "skills" : [ ],
        "education" : [ ],
        "languages" : [ ]
      },
      "application_details" : {
        "via_af" : false,
        "email" : null,
        "other" : null,
        "reference" : "5820",
        "url" : "http://recruitive.se/lediga-jobb/visa-annons/?jaid=5820",
        "information" : null
      },
      "source_type" : "VIA_PLATSBANKEN_DXA",
      "application_deadline" : "2022-08-13T23:59:59",
      "external_id" : "46-559072-9546-5820",
      "workplace_address" : {
        "coordinates" : [ 18.06858, 59.329323 ],
        "city" : null,
        "postcode" : null,
        "municipality" : "Stockholm",
        "region_concept_id" : "CifL_Rzy_Mku",
        "region" : "Stockholms län",
        "country_code" : "199",
        "region_code" : "01",
        "municipality_concept_id" : "AvNB_uwa_6n6",
        "country_concept_id" : "i46j_HmG_v64",
        "municipality_code" : "0180",
        "street_address" : null,
        "country" : "Sverige"
      },
      "id" : "26329792",
      "experience_required" : true,
      "working_hours_type" : {
        "concept_id" : "6YE1_gAC_R2G",
        "label" : "Heltid",
        "legacy_ams_taxonomy_id" : "1"
      },
      "access" : null,
      "timestamp" : 1657872738520,
      "must_have" : {
        "education_level" : [ ],
        "work_experiences" : [ {
          "concept_id" : "8Uhp_XYo_z5f",
          "weight" : 10,
          "label" : "Kundtjänstmedarbetare",
          "legacy_ams_taxonomy_id" : "2291"
        } ],
        "skills" : [ ],
        "education" : [ ],
        "languages" : [ ]
      },
      "occupation_field" : {
        "concept_id" : "RPTn_bxG_ExZ",
        "label" : "Försäljning, inköp, marknadsföring",
        "legacy_ams_taxonomy_id" : "5"
      },
      "scope_of_work" : {
        "min" : 100,
        "max" : 100
      },
      "salary_type" : {
        "concept_id" : "oG8G_9cW_nRf",
        "label" : "Fast månads- vecko- eller timlön",
        "legacy_ams_taxonomy_id" : "1"
      },
      "removed" : false,
      "salary_description" : "Fast lön",
      "access_to_own_car" : false,
      "publication_date" : "2022-07-15T10:12:18"
    },
    "name" : "Finsktalande medarbetare till växande bolag",
    "user" : "hannes"
  },
  "sha1" : "b471455c75227d8c8db437b02033add2b6c64241",
  "annotations" : [ {
    "preferred-label" : "Kundrelationer",
    "sentiment" : "MUST_HAVE",
    "type" : "keyword",
    "start-position" : 163,
    "end-position" : 177,
    "concept-id" : "hPWL_HNB_UFP",
    "matched-string" : "kundrelationer",
    "annotation-id" : 0
  }, {
    "preferred-label" : "Kundrelationer",
    "sentiment" : "MUST_HAVE",
    "type" : "keyword",
    "start-position" : 212,
    "end-position" : 226,
    "concept-id" : "hPWL_HNB_UFP",
    "matched-string" : "kundrelationer",
    "annotation-id" : 1
  }, {
    "preferred-label" : "Finska",
    "sentiment" : "MUST_HAVE",
    "type" : "language",
    "start-position" : 915,
    "end-position" : 921,
    "concept-id" : "Swhq_4Fg_qfm",
    "matched-string" : "finska",
    "annotation-id" : 2
  }, {
    "preferred-label" : "Svenska",
    "sentiment" : "MUST_HAVE",
    "type" : "language",
    "start-position" : 926,
    "end-position" : 933,
    "concept-id" : "zSLA_vw2_FXN",
    "matched-string" : "svenska",
    "annotation-id" : 3
  }, {
    "preferred-label" : "visa ansvarstagande",
    "type" : "esco-skill",
    "start-position" : 1021,
    "end-position" : 1032,
    "concept-id" : "bcRp_hxV_f5G",
    "matched-string" : "ansvarsfull",
    "annotation-id" : 10
  }, {
    "preferred-label" : "Gymnasial utbildning, 3 år",
    "type" : "sun-education-level-2",
    "start-position" : 1100,
    "end-position" : 1114,
    "concept-id" : "7wEe_uui_q7S",
    "matched-string" : "gymnasieexamen",
    "annotation-id" : 11
  }, {
    "preferred-label" : "Serviceyrken",
    "sentiment" : "MUST_HAVE",
    "type" : "ssyk-level-2",
    "start-position" : 1160,
    "end-position" : 1172,
    "concept-id" : "UVxV_4Bz_JeR",
    "matched-string" : "serviceyrken",
    "annotation-id" : 4
  }, {
    "preferred-label" : "arbetsmiljö",
    "sentiment" : "MUST_HAVE",
    "type" : "esco-skill",
    "start-position" : 1341,
    "end-position" : 1352,
    "concept-id" : "zdQY_QJh_nUH",
    "matched-string" : "arbetsmiljö",
    "annotation-id" : 5
  }, {
    "preferred-label" : "Kollektivavtal",
    "sentiment" : "MUST_HAVE",
    "type" : "skill",
    "start-position" : 1366,
    "end-position" : 1380,
    "concept-id" : "z7wE_9xb_3jX",
    "matched-string" : "kollektivavtal",
    "annotation-id" : 6
  }, {
    "preferred-label" : "Ekonomi",
    "sentiment" : "MUST_HAVE",
    "type" : "keyword",
    "start-position" : 1917,
    "end-position" : 1924,
    "concept-id" : "PW4f_bmT_new",
    "matched-string" : "ekonomi",
    "annotation-id" : 7
  }, {
    "preferred-label" : "Kundtjänst",
    "sentiment" : "MUST_HAVE",
    "type" : "skill",
    "start-position" : 1926,
    "end-position" : 1936,
    "concept-id" : "aMyW_hB7_TpU",
    "matched-string" : "kundtjänst",
    "annotation-id" : 8
  } ],
  "text" : "Finsktalande medarbetare till växande bolag\nOm tjänsten\nJust nu söker vi en finsktalande medarbetare till ett roligt och växande e-bolag. Du kommer att arbeta med kundrelationer och att både bygga och behålla de kundrelationer som finns i och runt bolaget. I rollen kommer man även att besvara frågor som kunderna kan ha. Du kommer få möjlighet att arbeta i ett litet och härligt team som stöttar varandra.\n\nDina arbetsuppgifter\n\n• Hantera inkommande samtal \n• Kundmöten\n• Administrativa sysslor så som mail-hantering \n• Ge kunderna snabb och rätt service kring deras frågor.\n\nArbetsgivarens förhoppning är att du är intresserad av ett långsiktigt arbete där de gärna ser att du som medarbetare utvecklas i rollen och har viljan att ta nästa steg.\n\nArbetstiden är vanligtvis dagtid måndag-fredag.Tillträde sker enligt överenskommelse, gärna omgående.\n\n\nDin profil\nVi söker dig som:\n• Är flytande i tal och skrift i finska och svenska. \n• Är serviceinriktad och är duktig på att uttrycka dig i både tal och i skrift.\n• Är ansvarsfull och flexibel\n• Trivs med att arbeta i högt tempo.\n• Har fullbordad gymnasieexamen.\n\nDin erfarenhet:\n• Tidigare erfarenhet från serviceyrken är ett krav. Vi lägger också stor vikt vid personliga egenskaper!\n\nVi erbjuder\n• Utvecklingsmöjligheter i ett expansivt företag\n• Ett företag som tänker på din fysiska arbetsmiljö\n• Lön enligt kollektivavtal.\n\nOm företaget\nKunden är ett växande bolag som finns i större delar av världen. Bolaget prioriterar att man ska få utvecklas och växa tillsammans med dom. \n\nVi ser fram emot att presentera oss närmare under rekryteringsprocessen. Skicka in CV och personligt brev redan idag. Urval sker löpande! \n\n\nOm oss\nRecruitive är en oberoende tjänsteleverantör inom rekrytering och bemanning med ett heltäckande erbjudande inom tjänstemannasektorn. Vårt erbjudande innefattar tjänster och branschlösningar inom våra tjänsteområden Administration, Ekonomi, Kundtjänst och Försäljning. \nVi är medlemmar i Almega Bemanningsföretagen och har kollektivavtal med Unionen och Akademikerförbundet."
}