{
  "meta" : {
    "jobad" : {
      "description" : {
        "requirements" : null,
        "needs" : null,
        "company_information" : null,
        "text_formatted" : "Vår KAM-avdelning växer och vi tror att du vill vara med på den resan!&#xA;&#xA;På Framtiden är Key Account Management är ett arbetssätt. Ett arbetssätt som bygger på strategisk, kvalitativ och långsiktig försäljning och leverans mot utvalda potentiella nyckelkunder samt befintliga nyckelkunder. Nyckeln till framgång är teamwork, både internt och externt.&#xA;&#xA;Rollen som KAM:&#xA;&#xA;Du som KAM förväntas bearbeta utvalda potentiella nyckelkunder samt bearbeta och leda bearbetningen av Framtidens befintliga nyckelkunder.&#xA;&#xA;Detta görs genom att:&#xA;&#x2022;Prospektera &amp; analysera bolag tillsammans med avdelningens Key Account Analyst&#xA;&#x2022;Kontakta &amp; kvalificera bolag genom kontakt med primärt HR och inköpsfunktioner&#xA;&#x2022;Influera &amp; bearbeta bolag i samspel med övriga KAM och Framtidens marknadsavdelning&#xA;&#x2022;Forma fungerande samarbeten med bolagen genom att exempelvis forma ett ramavtal&#xA;&#x2022;Involvera &amp; leda den interna org. i bearbetningen genom att sätta mål, plan och riktning&#xA;&#x2022;Utveckla &amp; följa upp både internt och externt genom exempelvis intern/kundundersökningar &#xA;&#xA;Som KAM tillhör du Framtidens KAM-avdelning bestående av tre Key Account Managers samt en Key Account Analysts / Bid Manager vars uppgift är att stötta avdelningen genom analys, identifiering, datahantering, statistik och stöd vid ramavtalsskrivning / upphandling. Avdelningen leds av en dedikerad Head of Key Account Management.&#xA;&#xA;”Key Account Management på Framtiden är ett arbetssätt som i slutändan hjälper människor att hitta rätt jobb och företag att hitta rätt personal. – Jakob Prim, Head of Key Account Management&#xA;&#xA;Skallkrav:&#xA;•\t3 års relevant erfarenhet inom B2B-försäljning&#xA;•\tFlytande svenska &amp; engelska i tal och skrift&#xA;•\tKörkort B&#xA;&#xA;Meriterande:&#xA;•\tErfarenhet inom bemanning och rekrytering eller konsultverksamhet&#xA;•\tErfarenhet av att ha arbetat mot större bolag&#xA;&#xA;Som person ser vi att du är:&#xA;•\tGrundlig&#xA;•\tRelationsskapande&#xA;•\tStrategisk&#xA;•\tDuktig kommunikativt&#xA;•\tEngagerande&#xA;•\tStrukturerad&#xA;•\tLångsiktig&#xA;&#xA;Om Framtiden&#xA;Framtiden arbetar med både bemanning och rekrytering, vi vill göra skillnad i människors liv. Vi gör skillnad genom att hjälpa människor att hitta rätt jobb och rätt kollega. Vi är specialister på att rekrytera talanger till rätt företag främst inom IT/Teknik, ekonomi och kontor. Framtiden finns på sju orter i Sverige samt i Oslo.&#xA;Som medarbetare på Framtiden skall det vara roligt att gå till jobbet! Vi är ett ambitiöst och härligt gäng som gillar att umgås med varandra och samtidigt alltid vill utvecklas tillsammans. Här strävar vi alltid efter att bli vårt bästa jag genom utbildning, träning och ständig utveckling i våra roller.&#xA;&#xA;För oss på Framtiden är balansen mellan jobb och privatliv viktigt, därför tillämpar vi förtroendetid och flexibel arbetsplats. Vi har också förmåner som tex hushållsnära tjänster till upphandlade och förmånliga priser, väl tilltaget friskvårdsbidrag och gemensam frukost varje dag.&#xA;&#xA;Vi står för hög service, kvalitet och har ett klimat som är familjärt och grundat i sunda värderingar. Om du vill ha en arbetsplats präglad av en positiv kultur där vi, medarbetarna, är i fokus är Framtiden rätt ställe för dig.&#xA;&#xA;Välkommen med din ansökan!&#xA;&#xA;Villkor:&#xA;Startdatum: Oktober/November&#xA;Placeringsort: Stockholm, Malmö eller Göteborg&#xA;Sista ansökan: Behandlar ansökningar löpande&#xA;Omfattning: 100%&#xA;&#xA;",
        "conditions" : "Tillsvidareanställning\r\nnull Timmar",
        "text" : "Vår KAM-avdelning växer och vi tror att du vill vara med på den resan!\n\nPå Framtiden är Key Account Management är ett arbetssätt. Ett arbetssätt som bygger på strategisk, kvalitativ och långsiktig försäljning och leverans mot utvalda potentiella nyckelkunder samt befintliga nyckelkunder. Nyckeln till framgång är teamwork, både internt och externt.\n\nRollen som KAM:\n\nDu som KAM förväntas bearbeta utvalda potentiella nyckelkunder samt bearbeta och leda bearbetningen av Framtidens befintliga nyckelkunder.\n\nDetta görs genom att:\n•Prospektera & analysera bolag tillsammans med avdelningens Key Account Analyst\n•Kontakta & kvalificera bolag genom kontakt med primärt HR och inköpsfunktioner\n•Influera & bearbeta bolag i samspel med övriga KAM och Framtidens marknadsavdelning\n•Forma fungerande samarbeten med bolagen genom att exempelvis forma ett ramavtal\n•Involvera & leda den interna org. i bearbetningen genom att sätta mål, plan och riktning\n•Utveckla & följa upp både internt och externt genom exempelvis intern/kundundersökningar \n\nSom KAM tillhör du Framtidens KAM-avdelning bestående av tre Key Account Managers samt en Key Account Analysts / Bid Manager vars uppgift är att stötta avdelningen genom analys, identifiering, datahantering, statistik och stöd vid ramavtalsskrivning / upphandling. Avdelningen leds av en dedikerad Head of Key Account Management.\n\n”Key Account Management på Framtiden är ett arbetssätt som i slutändan hjälper människor att hitta rätt jobb och företag att hitta rätt personal. – Jakob Prim, Head of Key Account Management\n\nSkallkrav:\n•\t3 års relevant erfarenhet inom B2B-försäljning\n•\tFlytande svenska & engelska i tal och skrift\n•\tKörkort B\n\nMeriterande:\n•\tErfarenhet inom bemanning och rekrytering eller konsultverksamhet\n•\tErfarenhet av att ha arbetat mot större bolag\n\nSom person ser vi att du är:\n•\tGrundlig\n•\tRelationsskapande\n•\tStrategisk\n•\tDuktig kommunikativt\n•\tEngagerande\n•\tStrukturerad\n•\tLångsiktig\n\nOm Framtiden\nFramtiden arbetar med både bemanning och rekrytering, vi vill göra skillnad i människors liv. Vi gör skillnad genom att hjälpa människor att hitta rätt jobb och rätt kollega. Vi är specialister på att rekrytera talanger till rätt företag främst inom IT/Teknik, ekonomi och kontor. Framtiden finns på sju orter i Sverige samt i Oslo.\nSom medarbetare på Framtiden skall det vara roligt att gå till jobbet! Vi är ett ambitiöst och härligt gäng som gillar att umgås med varandra och samtidigt alltid vill utvecklas tillsammans. Här strävar vi alltid efter att bli vårt bästa jag genom utbildning, träning och ständig utveckling i våra roller.\n\nFör oss på Framtiden är balansen mellan jobb och privatliv viktigt, därför tillämpar vi förtroendetid och flexibel arbetsplats. Vi har också förmåner som tex hushållsnära tjänster till upphandlade och förmånliga priser, väl tilltaget friskvårdsbidrag och gemensam frukost varje dag.\n\nVi står för hög service, kvalitet och har ett klimat som är familjärt och grundat i sunda värderingar. Om du vill ha en arbetsplats präglad av en positiv kultur där vi, medarbetarna, är i fokus är Framtiden rätt ställe för dig.\n\nVälkommen med din ansökan!\n\nVillkor:\nStartdatum: Oktober/November\nPlaceringsort: Stockholm, Malmö eller Göteborg\nSista ansökan: Behandlar ansökningar löpande\nOmfattning: 100%"
      },
      "headline" : "Key Account Manager till Framtiden i Göteborg",
      "driving_license" : null,
      "employer" : {
        "email" : null,
        "phone_number" : null,
        "organization_number" : "5566865142",
        "name" : "Framtiden i Sverige AB",
        "url" : "http://www.framtiden.com",
        "workplace" : "Framtiden AB"
      },
      "removed_date" : null,
      "logo_url" : "https://www.arbetsformedlingen.se/rest/arbetsgivare/rest/af/v3/organisation/5566865142/logotyper/logo.png",
      "last_publication_date" : "2022-08-26T23:59:59",
      "number_of_vacancies" : 1,
      "occupation" : {
        "concept_id" : "TTDZ_Neo_9GJ",
        "label" : "Key account manager",
        "legacy_ams_taxonomy_id" : "6729"
      },
      "occupation_group" : {
        "concept_id" : "oXSW_fbY_XrY",
        "label" : "Företagssäljare",
        "legacy_ams_taxonomy_id" : "3322"
      },
      "employment_type" : {
        "concept_id" : "PFZr_Syz_cUq",
        "label" : "Vanlig anställning",
        "legacy_ams_taxonomy_id" : "1"
      },
      "webpage_url" : "https://arbetsformedlingen.se/platsbanken/annonser/26375170",
      "driving_license_required" : false,
      "application_contacts" : [ {
        "description" : "Joel Skogmalm",
        "email" : "joel.skogmalm@framtiden.com",
        "telephone" : null,
        "name" : null,
        "contact_type" : null
      } ],
      "duration" : {
        "concept_id" : "a7uU_j21_mkL",
        "label" : "Tills vidare",
        "legacy_ams_taxonomy_id" : "1"
      },
      "nice_to_have" : {
        "education_level" : [ ],
        "work_experiences" : [ ],
        "skills" : [ ],
        "education" : [ ],
        "languages" : [ ]
      },
      "application_details" : {
        "via_af" : false,
        "email" : null,
        "other" : null,
        "reference" : "ZR_46709_JOB",
        "url" : "https://framtiden.zohorecruit.eu/jobs/Careers/35955000116592120",
        "information" : null
      },
      "source_type" : "VIA_PLATSBANKEN_DXA",
      "application_deadline" : "2022-08-26T23:59:59",
      "external_id" : "46-556686-5142-ZR_46709_JOB",
      "workplace_address" : {
        "coordinates" : [ 11.97456, 57.70887 ],
        "city" : null,
        "postcode" : null,
        "municipality" : "Göteborg",
        "region_concept_id" : "zdoY_6u5_Krt",
        "region" : "Västra Götalands län",
        "country_code" : "199",
        "region_code" : "14",
        "municipality_concept_id" : "PVZL_BQT_XtL",
        "country_concept_id" : "i46j_HmG_v64",
        "municipality_code" : "1480",
        "street_address" : null,
        "country" : "Sverige"
      },
      "id" : "26375170",
      "experience_required" : true,
      "working_hours_type" : {
        "concept_id" : "6YE1_gAC_R2G",
        "label" : "Heltid",
        "legacy_ams_taxonomy_id" : "1"
      },
      "access" : null,
      "timestamp" : 1659527675338,
      "must_have" : {
        "education_level" : [ ],
        "work_experiences" : [ {
          "concept_id" : "TTDZ_Neo_9GJ",
          "weight" : 10,
          "label" : "Key account manager",
          "legacy_ams_taxonomy_id" : "6729"
        } ],
        "skills" : [ ],
        "education" : [ ],
        "languages" : [ ]
      },
      "occupation_field" : {
        "concept_id" : "RPTn_bxG_ExZ",
        "label" : "Försäljning, inköp, marknadsföring",
        "legacy_ams_taxonomy_id" : "5"
      },
      "scope_of_work" : {
        "min" : 100,
        "max" : 100
      },
      "salary_type" : {
        "concept_id" : "oG8G_9cW_nRf",
        "label" : "Fast månads- vecko- eller timlön",
        "legacy_ams_taxonomy_id" : "1"
      },
      "removed" : false,
      "salary_description" : "Fast + rörlig",
      "access_to_own_car" : false,
      "publication_date" : "2022-08-03T13:54:35"
    },
    "name" : "Key Account Manager till Framtiden i Göteborg",
    "user" : "hannes"
  },
  "sha1" : "1fbd76d57a61664c8996ed921b736e2aaf033809",
  "annotations" : [ {
    "preferred-label" : "Key account manager",
    "sentiment" : "MUST_HAVE",
    "type" : "occupation-name",
    "start-position" : 0,
    "end-position" : 19,
    "concept-id" : "TTDZ_Neo_9GJ",
    "matched-string" : "key account manager",
    "annotation-id" : 0
  }, {
    "preferred-label" : "Göteborg",
    "type" : "municipality",
    "start-position" : 37,
    "end-position" : 45,
    "concept-id" : "PVZL_BQT_XtL",
    "matched-string" : "Göteborg",
    "annotation-id" : 17
  }, {
    "preferred-label" : "Key account manager",
    "sentiment" : "MUST_HAVE",
    "type" : "occupation-name",
    "start-position" : 50,
    "end-position" : 53,
    "concept-id" : "TTDZ_Neo_9GJ",
    "matched-string" : "kam",
    "annotation-id" : 1
  }, {
    "preferred-label" : "Key account manager",
    "type" : "occupation-name",
    "start-position" : 134,
    "end-position" : 156,
    "concept-id" : "TTDZ_Neo_9GJ",
    "matched-string" : "Key Account Management",
    "annotation-id" : 18
  }, {
    "preferred-label" : "Key account manager",
    "sentiment" : "MUST_HAVE",
    "type" : "occupation-name",
    "start-position" : 408,
    "end-position" : 411,
    "concept-id" : "TTDZ_Neo_9GJ",
    "matched-string" : "kam",
    "annotation-id" : 2
  }, {
    "preferred-label" : "Key account manager",
    "sentiment" : "MUST_HAVE",
    "type" : "occupation-name",
    "start-position" : 421,
    "end-position" : 424,
    "concept-id" : "TTDZ_Neo_9GJ",
    "matched-string" : "kam",
    "annotation-id" : 3
  }, {
    "preferred-label" : "HR",
    "type" : "keyword",
    "start-position" : 712,
    "end-position" : 714,
    "concept-id" : "YxV3_BQC_eMP",
    "matched-string" : "HR",
    "annotation-id" : 19
  }, {
    "preferred-label" : "Key account manager",
    "sentiment" : "MUST_HAVE",
    "type" : "occupation-name",
    "start-position" : 784,
    "end-position" : 787,
    "concept-id" : "TTDZ_Neo_9GJ",
    "matched-string" : "kam",
    "annotation-id" : 4
  }, {
    "preferred-label" : "Key account manager",
    "sentiment" : "MUST_HAVE",
    "type" : "occupation-name",
    "start-position" : 1088,
    "end-position" : 1091,
    "concept-id" : "TTDZ_Neo_9GJ",
    "matched-string" : "kam",
    "annotation-id" : 5
  }, {
    "preferred-label" : "Key account manager",
    "sentiment" : "MUST_HAVE",
    "type" : "occupation-name",
    "start-position" : 1114,
    "end-position" : 1117,
    "concept-id" : "TTDZ_Neo_9GJ",
    "matched-string" : "kam",
    "annotation-id" : 6
  }, {
    "preferred-label" : "Key account manager",
    "type" : "occupation-name",
    "start-position" : 1145,
    "end-position" : 1164,
    "concept-id" : "TTDZ_Neo_9GJ",
    "matched-string" : "Key Account Manager",
    "annotation-id" : 20
  }, {
    "preferred-label" : "Anbudsansvarig/Bid Manager",
    "sentiment" : "MUST_HAVE",
    "type" : "occupation-name",
    "start-position" : 1197,
    "end-position" : 1208,
    "concept-id" : "g2XL_xyr_wS7",
    "matched-string" : "bid manager",
    "annotation-id" : 7
  }, {
    "preferred-label" : "Statistik",
    "sentiment" : "MUST_HAVE",
    "type" : "keyword",
    "start-position" : 1292,
    "end-position" : 1301,
    "concept-id" : "QV1q_coS_XtX",
    "matched-string" : "statistik",
    "annotation-id" : 8
  }, {
    "preferred-label" : "Upphandling",
    "sentiment" : "MUST_HAVE",
    "type" : "keyword",
    "start-position" : 1336,
    "end-position" : 1347,
    "concept-id" : "zPkP_5oY_WvW",
    "matched-string" : "upphandling",
    "annotation-id" : 9
  }, {
    "preferred-label" : "Key account manager",
    "type" : "occupation-name",
    "start-position" : 1390,
    "end-position" : 1412,
    "concept-id" : "TTDZ_Neo_9GJ",
    "matched-string" : "Key Account Management",
    "annotation-id" : 21
  }, {
    "preferred-label" : "Personal",
    "sentiment" : "MUST_HAVE",
    "type" : "keyword",
    "start-position" : 1551,
    "end-position" : 1559,
    "concept-id" : "HVxM_6MS_y1c",
    "matched-string" : "personal",
    "annotation-id" : 10
  }, {
    "preferred-label" : "B2B-säljare",
    "type" : "keyword",
    "start-position" : 1651,
    "end-position" : 1666,
    "concept-id" : "gyej_EdX_JSE",
    "matched-string" : "B2B-försäljning",
    "annotation-id" : 22
  }, {
    "preferred-label" : "Svenska",
    "sentiment" : "MUST_HAVE",
    "type" : "language",
    "start-position" : 1678,
    "end-position" : 1685,
    "concept-id" : "zSLA_vw2_FXN",
    "matched-string" : "svenska",
    "annotation-id" : 11
  }, {
    "preferred-label" : "Engelska",
    "sentiment" : "MUST_HAVE",
    "type" : "language",
    "start-position" : 1688,
    "end-position" : 1696,
    "concept-id" : "NVxJ_hLg_TYS",
    "matched-string" : "engelska",
    "annotation-id" : 12
  }, {
    "preferred-label" : "B",
    "type" : "driving-licence",
    "start-position" : 1716,
    "end-position" : 1725,
    "concept-id" : "VTK8_WRx_GcM",
    "matched-string" : "Körkort B",
    "annotation-id" : 23
  }, {
    "preferred-label" : "Data/IT",
    "sentiment" : "MUST_HAVE",
    "type" : "occupation-field",
    "start-position" : 2259,
    "end-position" : 2261,
    "concept-id" : "apaJ_2ja_LuF",
    "matched-string" : "it",
    "annotation-id" : 13
  }, {
    "preferred-label" : "Ekonomi",
    "sentiment" : "MUST_HAVE",
    "type" : "keyword",
    "start-position" : 2270,
    "end-position" : 2277,
    "concept-id" : "PW4f_bmT_new",
    "matched-string" : "ekonomi",
    "annotation-id" : 14
  }, {
    "preferred-label" : "Kontor",
    "sentiment" : "MUST_HAVE",
    "type" : "keyword",
    "start-position" : 2282,
    "end-position" : 2288,
    "concept-id" : "Hyz1_7HF_AkP",
    "matched-string" : "kontor",
    "annotation-id" : 15
  }, {
    "preferred-label" : "Stockholm",
    "type" : "municipality",
    "start-position" : 3243,
    "end-position" : 3252,
    "concept-id" : "AvNB_uwa_6n6",
    "matched-string" : "Stockholm",
    "annotation-id" : 25
  }, {
    "preferred-label" : "Malmö",
    "type" : "municipality",
    "start-position" : 3254,
    "end-position" : 3259,
    "concept-id" : "oYPt_yRA_Smm",
    "matched-string" : "Malmö",
    "annotation-id" : 26
  }, {
    "preferred-label" : "Göteborg",
    "type" : "municipality",
    "start-position" : 3266,
    "end-position" : 3274,
    "concept-id" : "PVZL_BQT_XtL",
    "matched-string" : "Göteborg",
    "annotation-id" : 27
  }, {
    "preferred-label" : "Heltid",
    "type" : "worktime-extent",
    "start-position" : 3332,
    "end-position" : 3336,
    "concept-id" : "6YE1_gAC_R2G",
    "matched-string" : "100%",
    "annotation-id" : 24
  } ],
  "text" : "Key Account Manager till Framtiden i Göteborg\nVår KAM-avdelning växer och vi tror att du vill vara med på den resan!\n\nPå Framtiden är Key Account Management är ett arbetssätt. Ett arbetssätt som bygger på strategisk, kvalitativ och långsiktig försäljning och leverans mot utvalda potentiella nyckelkunder samt befintliga nyckelkunder. Nyckeln till framgång är teamwork, både internt och externt.\n\nRollen som KAM:\n\nDu som KAM förväntas bearbeta utvalda potentiella nyckelkunder samt bearbeta och leda bearbetningen av Framtidens befintliga nyckelkunder.\n\nDetta görs genom att:\n•Prospektera & analysera bolag tillsammans med avdelningens Key Account Analyst\n•Kontakta & kvalificera bolag genom kontakt med primärt HR och inköpsfunktioner\n•Influera & bearbeta bolag i samspel med övriga KAM och Framtidens marknadsavdelning\n•Forma fungerande samarbeten med bolagen genom att exempelvis forma ett ramavtal\n•Involvera & leda den interna org. i bearbetningen genom att sätta mål, plan och riktning\n•Utveckla & följa upp både internt och externt genom exempelvis intern/kundundersökningar \n\nSom KAM tillhör du Framtidens KAM-avdelning bestående av tre Key Account Managers samt en Key Account Analysts / Bid Manager vars uppgift är att stötta avdelningen genom analys, identifiering, datahantering, statistik och stöd vid ramavtalsskrivning / upphandling. Avdelningen leds av en dedikerad Head of Key Account Management.\n\n”Key Account Management på Framtiden är ett arbetssätt som i slutändan hjälper människor att hitta rätt jobb och företag att hitta rätt personal. – Jakob Prim, Head of Key Account Management\n\nSkallkrav:\n•\t3 års relevant erfarenhet inom B2B-försäljning\n•\tFlytande svenska & engelska i tal och skrift\n•\tKörkort B\n\nMeriterande:\n•\tErfarenhet inom bemanning och rekrytering eller konsultverksamhet\n•\tErfarenhet av att ha arbetat mot större bolag\n\nSom person ser vi att du är:\n•\tGrundlig\n•\tRelationsskapande\n•\tStrategisk\n•\tDuktig kommunikativt\n•\tEngagerande\n•\tStrukturerad\n•\tLångsiktig\n\nOm Framtiden\nFramtiden arbetar med både bemanning och rekrytering, vi vill göra skillnad i människors liv. Vi gör skillnad genom att hjälpa människor att hitta rätt jobb och rätt kollega. Vi är specialister på att rekrytera talanger till rätt företag främst inom IT/Teknik, ekonomi och kontor. Framtiden finns på sju orter i Sverige samt i Oslo.\nSom medarbetare på Framtiden skall det vara roligt att gå till jobbet! Vi är ett ambitiöst och härligt gäng som gillar att umgås med varandra och samtidigt alltid vill utvecklas tillsammans. Här strävar vi alltid efter att bli vårt bästa jag genom utbildning, träning och ständig utveckling i våra roller.\n\nFör oss på Framtiden är balansen mellan jobb och privatliv viktigt, därför tillämpar vi förtroendetid och flexibel arbetsplats. Vi har också förmåner som tex hushållsnära tjänster till upphandlade och förmånliga priser, väl tilltaget friskvårdsbidrag och gemensam frukost varje dag.\n\nVi står för hög service, kvalitet och har ett klimat som är familjärt och grundat i sunda värderingar. Om du vill ha en arbetsplats präglad av en positiv kultur där vi, medarbetarna, är i fokus är Framtiden rätt ställe för dig.\n\nVälkommen med din ansökan!\n\nVillkor:\nStartdatum: Oktober/November\nPlaceringsort: Stockholm, Malmö eller Göteborg\nSista ansökan: Behandlar ansökningar löpande\nOmfattning: 100%"
}