{
  "meta" : {
    "jobad" : {
      "description" : {
        "requirements" : null,
        "needs" : null,
        "company_information" : null,
        "text_formatted" : "<p><strong>Om jobbet!</strong></p><p>Söker du ett extrajobb som du kan kombinera med skola eller liknande? Då har du hittat rätt! Vi på Uniq Dialog söker nu nya stjärnskott till vårt sälj-team.</p><p>Du väljer själv ditt schema och får dessutom lön varje fredag!</p><p>För att söka till oss behöver du nödvändigtvis inte ha erfarenhet från försäljning sedan tidigare men givetvis är det meriterande! Det absolut viktigaste för oss är att du som söker är social, motiverad, trevlig och behärskar det svenska språket i både tal och skrift. Skulle det vara så att du tidigare jobbat med försäljning så är det viktigt att förstå att försäljning bygger på relationer, inte på att en säljare argumenterar ner en kund.</p><p>Våra arbetspass är måndag-torsdag 16:45-21:00 samt söndag 12:30-16:45. Du bokar själv ditt schema med vilka kvällar och helger du vill jobba och du får jobba hur mycket du vill utifrån de pass som vi erbjuder men minst 2 pass i veckan.</p><p>Har du drivet, hungern och snacket för att kunna bli en av våra nya toppsäljare? Hör då av dig genom att skicka en ansökan till oss via vår hemsida. Där kan du även hitta ytterligare info om Malmös bästa arbetsplats för gymnasieelever!</p><p>______________________________________________________________________</p><p>Arbetet består av att erbjuda prenumerationsprodukter till kunder som sedan tidigare har en koppling till produkten, men kan även omfatta försäljning av tjänster, marknadsundersökningar eller mötesbokning. Du representerar alltid väldigt stora varumärken inom respektive segment. Kunderna som kontaktas har som sagt i de flesta fall använt produkten tidigare vilket gör att försäljningen bygger på en befintlig relation med kunden.</p><p>De första dagarna kombinerar vi teori med praktik och du kommer att få lära dig allt du behöver för att sälja på alla typer av kundunderlag. ALLA som jobbar här är måna om att du som börjar hos oss ska trivas och få den hjälp som just du behöver för att lyckas riktigt bra! Vi erbjuder alla verktyg som du behöver i form av utbildning, kontinuerlig coachning och säljtävlingar.</p><p><strong>Arbetstider: </strong>Måndag-torsdag 16:45-21:00 söndag 12:30-16:45. (Minst 2 pass/vecka)</p><p><strong>Krav: </strong>Behärska svenska språket i tal och skrift</p><p><strong>Lönetyp:</strong> Rörlig ackords- eller provisionslön (Veckolön)</p>",
        "conditions" : null,
        "text" : "Om jobbet!\nSöker du ett extrajobb som du kan kombinera med skola eller liknande? Då har du hittat rätt! Vi på Uniq Dialog söker nu nya stjärnskott till vårt sälj-team.\nDu väljer själv ditt schema och får dessutom lön varje fredag!\nFör att söka till oss behöver du nödvändigtvis inte ha erfarenhet från försäljning sedan tidigare men givetvis är det meriterande! Det absolut viktigaste för oss är att du som söker är social, motiverad, trevlig och behärskar det svenska språket i både tal och skrift. Skulle det vara så att du tidigare jobbat med försäljning så är det viktigt att förstå att försäljning bygger på relationer, inte på att en säljare argumenterar ner en kund.\nVåra arbetspass är måndag-torsdag 16:45-21:00 samt söndag 12:30-16:45. Du bokar själv ditt schema med vilka kvällar och helger du vill jobba och du får jobba hur mycket du vill utifrån de pass som vi erbjuder men minst 2 pass i veckan.\nHar du drivet, hungern och snacket för att kunna bli en av våra nya toppsäljare? Hör då av dig genom att skicka en ansökan till oss via vår hemsida. Där kan du även hitta ytterligare info om Malmös bästa arbetsplats för gymnasieelever!\n______________________________________________________________________\nArbetet består av att erbjuda prenumerationsprodukter till kunder som sedan tidigare har en koppling till produkten, men kan även omfatta försäljning av tjänster, marknadsundersökningar eller mötesbokning. Du representerar alltid väldigt stora varumärken inom respektive segment. Kunderna som kontaktas har som sagt i de flesta fall använt produkten tidigare vilket gör att försäljningen bygger på en befintlig relation med kunden.\nDe första dagarna kombinerar vi teori med praktik och du kommer att få lära dig allt du behöver för att sälja på alla typer av kundunderlag. ALLA som jobbar här är måna om att du som börjar hos oss ska trivas och få den hjälp som just du behöver för att lyckas riktigt bra! Vi erbjuder alla verktyg som du behöver i form av utbildning, kontinuerlig coachning och säljtävlingar.\nArbetstider: Måndag-torsdag 16:45-21:00 söndag 12:30-16:45. (Minst 2 pass/vecka)\nKrav: Behärska svenska språket i tal och skrift\nLönetyp: Rörlig ackords- eller provisionslön (Veckolön)"
      },
      "headline" : "Vi söker fler säljare på deltid, där du får lönen utbetald varje vecka!",
      "driving_license" : null,
      "employer" : {
        "email" : null,
        "phone_number" : null,
        "organization_number" : "5567316616",
        "name" : "Uniq Dialog i Malmö AB",
        "url" : "https://uniqdialog.teamtailor.com/",
        "workplace" : "UNIQ DIALOG I MALMÖ AB"
      },
      "removed_date" : null,
      "logo_url" : "https://www.arbetsformedlingen.se/rest/arbetsgivare/rest/af/v3/arbetsplatser/82614908/logotyper/logo.png",
      "last_publication_date" : "2022-09-02T23:59:59",
      "number_of_vacancies" : 3,
      "occupation" : {
        "concept_id" : "WZ2C_vH9_8ek",
        "label" : "Telefonförsäljare",
        "legacy_ams_taxonomy_id" : "7468"
      },
      "occupation_group" : {
        "concept_id" : "PxXc_16t_oZo",
        "label" : "Telefonförsäljare m.fl.",
        "legacy_ams_taxonomy_id" : "5242"
      },
      "employment_type" : {
        "concept_id" : "PFZr_Syz_cUq",
        "label" : "Vanlig anställning",
        "legacy_ams_taxonomy_id" : "1"
      },
      "webpage_url" : "https://arbetsformedlingen.se/platsbanken/annonser/26375303",
      "driving_license_required" : false,
      "application_contacts" : [ ],
      "duration" : {
        "concept_id" : "a7uU_j21_mkL",
        "label" : "Tills vidare",
        "legacy_ams_taxonomy_id" : "1"
      },
      "nice_to_have" : {
        "education_level" : [ ],
        "work_experiences" : [ ],
        "skills" : [ ],
        "education" : [ ],
        "languages" : [ ]
      },
      "application_details" : {
        "via_af" : false,
        "email" : null,
        "other" : null,
        "reference" : null,
        "url" : "https://uniqdialog.teamtailor.com/jobs/992692-saljare-deltid-malmo",
        "information" : null
      },
      "source_type" : "VIA_ANNONSERA",
      "application_deadline" : "2022-09-02T23:59:59",
      "external_id" : null,
      "workplace_address" : {
        "coordinates" : [ 13.009050613842115, 55.581449347964 ],
        "city" : "MALMÖ",
        "postcode" : "21431",
        "municipality" : "Malmö",
        "region_concept_id" : "CaRE_1nn_cSU",
        "region" : "Skåne län",
        "country_code" : "199",
        "region_code" : "12",
        "municipality_concept_id" : "oYPt_yRA_Smm",
        "country_concept_id" : "i46j_HmG_v64",
        "municipality_code" : "1280",
        "street_address" : "FOSIEVÄGEN 6",
        "country" : "Sverige"
      },
      "id" : "26375303",
      "experience_required" : false,
      "working_hours_type" : {
        "concept_id" : "947z_JGS_Uk2",
        "label" : "Deltid",
        "legacy_ams_taxonomy_id" : "2"
      },
      "access" : null,
      "timestamp" : 1659528950287,
      "must_have" : {
        "education_level" : [ ],
        "work_experiences" : [ ],
        "skills" : [ ],
        "education" : [ ],
        "languages" : [ {
          "concept_id" : "zSLA_vw2_FXN",
          "weight" : 10,
          "label" : "Svenska",
          "legacy_ams_taxonomy_id" : "502"
        } ]
      },
      "occupation_field" : {
        "concept_id" : "RPTn_bxG_ExZ",
        "label" : "Försäljning, inköp, marknadsföring",
        "legacy_ams_taxonomy_id" : "5"
      },
      "scope_of_work" : {
        "min" : 20,
        "max" : 80
      },
      "salary_type" : {
        "concept_id" : "vVtj_qm6_GQu",
        "label" : "Rörlig ackords- eller provisionslön",
        "legacy_ams_taxonomy_id" : "8"
      },
      "removed" : false,
      "salary_description" : null,
      "access_to_own_car" : false,
      "publication_date" : "2022-08-03T14:15:50"
    },
    "name" : "Vi söker fler säljare på deltid, där du får lönen utbetald varje vecka!",
    "user" : "hannes"
  },
  "sha1" : "6593e777eae9e83b513b6b6a973b2fbc4f8cd00d",
  "annotations" : [ {
    "preferred-label" : "Säljare",
    "sentiment" : "MUST_HAVE",
    "type" : "keyword",
    "start-position" : 14,
    "end-position" : 21,
    "concept-id" : "rDcj_Tao_TJJ",
    "matched-string" : "säljare",
    "annotation-id" : 0
  }, {
    "preferred-label" : "Deltid",
    "type" : "worktime-extent",
    "start-position" : 25,
    "end-position" : 31,
    "concept-id" : "947z_JGS_Uk2",
    "matched-string" : "deltid",
    "annotation-id" : 8
  }, {
    "preferred-label" : "Sälj",
    "sentiment" : "MUST_HAVE",
    "type" : "keyword",
    "start-position" : 229,
    "end-position" : 233,
    "concept-id" : "QaXB_Zd5_gmh",
    "matched-string" : "sälj",
    "annotation-id" : 1
  }, {
    "preferred-label" : "Svenska språket",
    "sentiment" : "MUST_HAVE",
    "type" : "keyword",
    "start-position" : 533,
    "end-position" : 548,
    "concept-id" : "BiGm_58D_SSn",
    "matched-string" : "svenska språket",
    "annotation-id" : 2
  }, {
    "preferred-label" : "Säljare",
    "sentiment" : "MUST_HAVE",
    "type" : "keyword",
    "start-position" : 712,
    "end-position" : 719,
    "concept-id" : "rDcj_Tao_TJJ",
    "matched-string" : "säljare",
    "annotation-id" : 3
  }, {
    "preferred-label" : "Malmö",
    "type" : "municipality",
    "start-position" : 1173,
    "end-position" : 1179,
    "concept-id" : "oYPt_yRA_Smm",
    "matched-string" : "Malmös",
    "annotation-id" : 9
  }, {
    "preferred-label" : "Marknadsundersökningar/Resultatanalys",
    "sentiment" : "MUST_HAVE",
    "type" : "skill",
    "start-position" : 1452,
    "end-position" : 1474,
    "concept-id" : "u3bU_va9_8dx",
    "matched-string" : "marknadsundersökningar",
    "annotation-id" : 4
  }, {
    "preferred-label" : "Verktyg",
    "sentiment" : "MUST_HAVE",
    "type" : "skill",
    "start-position" : 2012,
    "end-position" : 2019,
    "concept-id" : "KG9j_WxP_ym2",
    "matched-string" : "verktyg",
    "annotation-id" : 5
  }, {
    "preferred-label" : "Coaching/Coachning",
    "sentiment" : "MUST_HAVE",
    "type" : "skill",
    "start-position" : 2070,
    "end-position" : 2079,
    "concept-id" : "91Ef_58Y_jX4",
    "matched-string" : "coachning",
    "annotation-id" : 6
  }, {
    "preferred-label" : "Svenska språket",
    "sentiment" : "MUST_HAVE",
    "type" : "keyword",
    "start-position" : 2195,
    "end-position" : 2210,
    "concept-id" : "BiGm_58D_SSn",
    "matched-string" : "svenska språket",
    "annotation-id" : 7
  }, {
    "preferred-label" : "Rörlig ackords- eller provisionslön",
    "type" : "wage-type",
    "start-position" : 2237,
    "end-position" : 2272,
    "concept-id" : "vVtj_qm6_GQu",
    "matched-string" : "Rörlig ackords- eller provisionslön",
    "annotation-id" : 10
  } ],
  "text" : "Vi söker fler säljare på deltid, där du får lönen utbetald varje vecka!\nOm jobbet!\nSöker du ett extrajobb som du kan kombinera med skola eller liknande? Då har du hittat rätt! Vi på Uniq Dialog söker nu nya stjärnskott till vårt sälj-team.\nDu väljer själv ditt schema och får dessutom lön varje fredag!\nFör att söka till oss behöver du nödvändigtvis inte ha erfarenhet från försäljning sedan tidigare men givetvis är det meriterande! Det absolut viktigaste för oss är att du som söker är social, motiverad, trevlig och behärskar det svenska språket i både tal och skrift. Skulle det vara så att du tidigare jobbat med försäljning så är det viktigt att förstå att försäljning bygger på relationer, inte på att en säljare argumenterar ner en kund.\nVåra arbetspass är måndag-torsdag 16:45-21:00 samt söndag 12:30-16:45. Du bokar själv ditt schema med vilka kvällar och helger du vill jobba och du får jobba hur mycket du vill utifrån de pass som vi erbjuder men minst 2 pass i veckan.\nHar du drivet, hungern och snacket för att kunna bli en av våra nya toppsäljare? Hör då av dig genom att skicka en ansökan till oss via vår hemsida. Där kan du även hitta ytterligare info om Malmös bästa arbetsplats för gymnasieelever!\n______________________________________________________________________\nArbetet består av att erbjuda prenumerationsprodukter till kunder som sedan tidigare har en koppling till produkten, men kan även omfatta försäljning av tjänster, marknadsundersökningar eller mötesbokning. Du representerar alltid väldigt stora varumärken inom respektive segment. Kunderna som kontaktas har som sagt i de flesta fall använt produkten tidigare vilket gör att försäljningen bygger på en befintlig relation med kunden.\nDe första dagarna kombinerar vi teori med praktik och du kommer att få lära dig allt du behöver för att sälja på alla typer av kundunderlag. ALLA som jobbar här är måna om att du som börjar hos oss ska trivas och få den hjälp som just du behöver för att lyckas riktigt bra! Vi erbjuder alla verktyg som du behöver i form av utbildning, kontinuerlig coachning och säljtävlingar.\nArbetstider: Måndag-torsdag 16:45-21:00 söndag 12:30-16:45. (Minst 2 pass/vecka)\nKrav: Behärska svenska språket i tal och skrift\nLönetyp: Rörlig ackords- eller provisionslön (Veckolön)"
}