{
  "meta" : {
    "jobad" : {
      "description" : {
        "requirements" : null,
        "needs" : null,
        "company_information" : null,
        "text_formatted" : "Region Västernorrland är en av länets största arbetsgivare med cirka 6500 medarbetare. Tillsammans arbetar vi för att utveckla regionen, hälso- och sjukvården och tandvården. Hos oss får du möjlighet till ett arbete där du gör skillnad för invånarna, i ett län som erbjuder både aktivitet och avkoppling.\r\n\r\nLänssjukvård somatik samordnar länssjukvården för den specialiserade somatiska vården i Region Västernorrland. Området somatik består av elva länssjukvårdsverksamheter. Länssjukvårdsverksamheterna bedrivs vid tre sjukhus, Sundsvall, Sollefteå och Örnsköldsvik och ett antal mottagningar förlagda till flera orter i länet. Området har cirka 2 400 anställda.\n\nLänsverksamhet Kirurgi, Urologi, Öron- Näsa och Hals (ÖNH) bedriver verksamhet på alla tre sjukhusortet. Hos oss arbetar cirka 370 medarbetare. De stora yrkesgrupperna är sjuksköterskor, undersköterskor, läkare och medicinska sekreterare.\n\nNu söker vi en kvalitetssjuksköterska även kallad sjuksköterska med funktionsansvar för tillsvidareanställning till Kirurgi/Urologi/ÖNH i Sundvall. Tillsättning sker enligt överenskommelse,\r\n\r\nROLLEN SOM KVALITETSSJUKSKÖTERSKA\r\n\r\nI rollen arbetar du med kvalité och patientsäkerhetsarbete för länsverksamheten samt  medverkar till att utveckla samarbete för gemensamma rutiner. Ett nära samarbete sker med Kvalitet och patientsäkerhetsavdelningen (KP).\n\nI arbetsuppgifterna ingår även att;\n\n.\tTillsammans med enhetschefer och länsverksamhetschef handlägga verksamhetens avvikelser.\n.\tAnsvara för länsverksamhetens styrdokument. \n.\tHandlägga styrdokument i Platina. \n.\tUtarbeta styrdokument samt vara behjälplig vid framtagning, revidering och utformning utifrån medarbetares förslag.\n.\tVara länsverksamhetschefen behjälplig i hanteringen av IVO ärenden, PEN-ärenden samt patientklagomål/missnöje i vården. Initiera behov av händelse- eller riskanalys i samverkan med verksamhetschef.\n\nVi erbjuder ett varierat arbete med goda utvecklingsmöjligheter. Arbete sker dagtid måndag-fredag.\r\n\r\nDin formella kompetens är legitimerad sjuksköterska. Bred erfarenhet av sjuksköterskeyrket samt erfarenhet av kvalitetsarbete eller liknande ses som meriterande för tjänsten. Vi ser gärna att du har erfarenhet av administrativt arbetet i olika datasystem som ex Systeam Cross och  Platina. Du är en van användare av Officepaketet. Du behärskar det svenska språket i tal och skrift. Det är viktigt att du har god samarbetsförmåga. Det är angeläget att du tar ansvar för dina uppgifter och strukturerar och driver själv ditt arbete framåt. Du är noggrann och väl medveten om mål och kvalitetsstandard. Vi lägger stor vikt vid personliga kompetenser.\n\nVarm välkommen med din ansökan, \nUrvalsarbete och intervjuer kan komma att ske löpande, ansök redan idag!\n\nRegionen arbetar sedan många år med att skapa förutsättningar för att bidra till friska och hälsosamma medarbetare. Du får tillgång till regionens friskvårdsanläggningar i Sundsvall, Härnösand, Örnsköldsvik samt Sollefteå. Genom din anställning hos oss har du flera anställningsförmåner som exempelvis tillägg till föräldraförsäkringen, extra semesterdagar när du fyllt 40 år, möjlighet att löneväxla till tjänstepension. Att du mår bra och trivs är viktigt för oss. Region Västernorrlands arbetsplatser är rökfria och vi tillämpar rökfri arbetstid.\n\nVi har gjort vårt medieval för rekrytering och undanber oss därför kontakt med annonssäljare eller andra säljare av rekryteringstjänster.",
        "conditions" : "Tillsvidareanställning.\r\nTillträde enligt överenskommelse.",
        "text" : "Region Västernorrland är en av länets största arbetsgivare med cirka 6500 medarbetare. Tillsammans arbetar vi för att utveckla regionen, hälso- och sjukvården och tandvården. Hos oss får du möjlighet till ett arbete där du gör skillnad för invånarna, i ett län som erbjuder både aktivitet och avkoppling.\r\n\r\nLänssjukvård somatik samordnar länssjukvården för den specialiserade somatiska vården i Region Västernorrland. Området somatik består av elva länssjukvårdsverksamheter. Länssjukvårdsverksamheterna bedrivs vid tre sjukhus, Sundsvall, Sollefteå och Örnsköldsvik och ett antal mottagningar förlagda till flera orter i länet. Området har cirka 2 400 anställda.\n\nLänsverksamhet Kirurgi, Urologi, Öron- Näsa och Hals (ÖNH) bedriver verksamhet på alla tre sjukhusortet. Hos oss arbetar cirka 370 medarbetare. De stora yrkesgrupperna är sjuksköterskor, undersköterskor, läkare och medicinska sekreterare.\n\nNu söker vi en kvalitetssjuksköterska även kallad sjuksköterska med funktionsansvar för tillsvidareanställning till Kirurgi/Urologi/ÖNH i Sundvall. Tillsättning sker enligt överenskommelse,\r\n\r\nROLLEN SOM KVALITETSSJUKSKÖTERSKA\r\n\r\nI rollen arbetar du med kvalité och patientsäkerhetsarbete för länsverksamheten samt  medverkar till att utveckla samarbete för gemensamma rutiner. Ett nära samarbete sker med Kvalitet och patientsäkerhetsavdelningen (KP).\n\nI arbetsuppgifterna ingår även att;\n\n.\tTillsammans med enhetschefer och länsverksamhetschef handlägga verksamhetens avvikelser.\n.\tAnsvara för länsverksamhetens styrdokument. \n.\tHandlägga styrdokument i Platina. \n.\tUtarbeta styrdokument samt vara behjälplig vid framtagning, revidering och utformning utifrån medarbetares förslag.\n.\tVara länsverksamhetschefen behjälplig i hanteringen av IVO ärenden, PEN-ärenden samt patientklagomål/missnöje i vården. Initiera behov av händelse- eller riskanalys i samverkan med verksamhetschef.\n\nVi erbjuder ett varierat arbete med goda utvecklingsmöjligheter. Arbete sker dagtid måndag-fredag.\r\n\r\nDin formella kompetens är legitimerad sjuksköterska. Bred erfarenhet av sjuksköterskeyrket samt erfarenhet av kvalitetsarbete eller liknande ses som meriterande för tjänsten. Vi ser gärna att du har erfarenhet av administrativt arbetet i olika datasystem som ex Systeam Cross och  Platina. Du är en van användare av Officepaketet. Du behärskar det svenska språket i tal och skrift. Det är viktigt att du har god samarbetsförmåga. Det är angeläget att du tar ansvar för dina uppgifter och strukturerar och driver själv ditt arbete framåt. Du är noggrann och väl medveten om mål och kvalitetsstandard. Vi lägger stor vikt vid personliga kompetenser.\n\nVarm välkommen med din ansökan, \nUrvalsarbete och intervjuer kan komma att ske löpande, ansök redan idag!\n\nRegionen arbetar sedan många år med att skapa förutsättningar för att bidra till friska och hälsosamma medarbetare. Du får tillgång till regionens friskvårdsanläggningar i Sundsvall, Härnösand, Örnsköldsvik samt Sollefteå. Genom din anställning hos oss har du flera anställningsförmåner som exempelvis tillägg till föräldraförsäkringen, extra semesterdagar när du fyllt 40 år, möjlighet att löneväxla till tjänstepension. Att du mår bra och trivs är viktigt för oss. Region Västernorrlands arbetsplatser är rökfria och vi tillämpar rökfri arbetstid.\n\nVi har gjort vårt medieval för rekrytering och undanber oss därför kontakt med annonssäljare eller andra säljare av rekryteringstjänster."
      },
      "headline" : "Kvalitetssjuksköterska till Kirurgi/Urologi/ÖNH, Sundvall",
      "driving_license" : null,
      "employer" : {
        "email" : null,
        "phone_number" : null,
        "organization_number" : "2321000206",
        "name" : "REGION VÄSTERNORRLAND",
        "url" : "www.rvn.se",
        "workplace" : "Region Västernorrland"
      },
      "removed_date" : null,
      "logo_url" : "https://www.arbetsformedlingen.se/rest/arbetsgivare/rest/af/v3/organisation/2321000206/logotyper/logo.png",
      "last_publication_date" : "2022-08-17T23:59:59",
      "number_of_vacancies" : 1,
      "occupation" : {
        "concept_id" : "bXNH_MNX_dUR",
        "label" : "Sjuksköterska, grundutbildad",
        "legacy_ams_taxonomy_id" : "7296"
      },
      "occupation_group" : {
        "concept_id" : "Z8ci_bBE_tmx",
        "label" : "Grundutbildade sjuksköterskor",
        "legacy_ams_taxonomy_id" : "2221"
      },
      "employment_type" : {
        "concept_id" : "PFZr_Syz_cUq",
        "label" : "Vanlig anställning",
        "legacy_ams_taxonomy_id" : "1"
      },
      "webpage_url" : "https://arbetsformedlingen.se/platsbanken/annonser/26412781",
      "driving_license_required" : false,
      "application_contacts" : [ {
        "description" : "Åsa Mattsson-Rumm",
        "email" : "asa.mattsson.rumm@rvn.se",
        "telephone" : "+4660181479",
        "name" : null,
        "contact_type" : "Länsverksamhetschef"
      } ],
      "duration" : {
        "concept_id" : "a7uU_j21_mkL",
        "label" : "Tills vidare",
        "legacy_ams_taxonomy_id" : "1"
      },
      "nice_to_have" : {
        "education_level" : [ ],
        "work_experiences" : [ ],
        "skills" : [ ],
        "education" : [ ],
        "languages" : [ ]
      },
      "application_details" : {
        "via_af" : false,
        "email" : null,
        "other" : null,
        "reference" : "130:2022:181",
        "url" : "https://www.rvn.se/sv/jobb-och-utbildning/lediga-jobb/?eid=7081219475147053156",
        "information" : null
      },
      "source_type" : "VIA_PLATSBANKEN_DXA",
      "application_deadline" : "2022-08-17T23:59:59",
      "external_id" : "46-232100-0206-7081219475147053553",
      "workplace_address" : {
        "coordinates" : [ 17.306927, 62.390812 ],
        "city" : null,
        "postcode" : null,
        "municipality" : "Sundsvall",
        "region_concept_id" : "NvUF_SP1_1zo",
        "region" : "Västernorrlands län",
        "country_code" : "199",
        "region_code" : "22",
        "municipality_concept_id" : "dJbx_FWY_tK6",
        "country_concept_id" : "i46j_HmG_v64",
        "municipality_code" : "2281",
        "street_address" : null,
        "country" : "Sverige"
      },
      "id" : "26412781",
      "experience_required" : true,
      "working_hours_type" : {
        "concept_id" : "6YE1_gAC_R2G",
        "label" : "Heltid",
        "legacy_ams_taxonomy_id" : "1"
      },
      "access" : null,
      "timestamp" : 1660630222445,
      "must_have" : {
        "education_level" : [ ],
        "work_experiences" : [ {
          "concept_id" : "bXNH_MNX_dUR",
          "weight" : 10,
          "label" : "Sjuksköterska, grundutbildad",
          "legacy_ams_taxonomy_id" : "7296"
        } ],
        "skills" : [ ],
        "education" : [ ],
        "languages" : [ ]
      },
      "occupation_field" : {
        "concept_id" : "NYW6_mP6_vwf",
        "label" : "Hälso- och sjukvård",
        "legacy_ams_taxonomy_id" : "8"
      },
      "scope_of_work" : {
        "min" : 100,
        "max" : 100
      },
      "salary_type" : {
        "concept_id" : "oG8G_9cW_nRf",
        "label" : "Fast månads- vecko- eller timlön",
        "legacy_ams_taxonomy_id" : "1"
      },
      "removed" : false,
      "salary_description" : "Månadslön.",
      "access_to_own_car" : false,
      "publication_date" : "2022-08-16T08:10:22"
    },
    "name" : "Kvalitetssjuksköterska till Kirurgi/Urologi/ÖNH, Sundvall",
    "user" : "hannes"
  },
  "sha1" : "d1010c89687be77c39d3a766dd534de551a42ed6",
  "annotations" : [ {
    "preferred-label" : "Sjuksköterska, grundutbildad",
    "sentiment" : "MUST_HAVE",
    "type" : "occupation-name",
    "start-position" : 0,
    "end-position" : 22,
    "concept-id" : "bXNH_MNX_dUR",
    "matched-string" : "Kvalitetssjuksköterska",
    "annotation-id" : 18
  }, {
    "preferred-label" : "Kirurgi",
    "sentiment" : "MUST_HAVE",
    "type" : "skill",
    "start-position" : 28,
    "end-position" : 35,
    "concept-id" : "iD5y_V1Z_Exw",
    "matched-string" : "kirurgi",
    "annotation-id" : 0
  }, {
    "preferred-label" : "urologi",
    "sentiment" : "MUST_HAVE",
    "type" : "esco-skill",
    "start-position" : 36,
    "end-position" : 43,
    "concept-id" : "wo9D_SWi_LUa",
    "matched-string" : "urologi",
    "annotation-id" : 1
  }, {
    "preferred-label" : "Öron-, näs- och halssjukdomar",
    "sentiment" : "MUST_HAVE",
    "type" : "skill",
    "start-position" : 44,
    "end-position" : 47,
    "concept-id" : "WBhS_w1X_B3f",
    "matched-string" : "ÖNH",
    "annotation-id" : 20
  }, {
    "preferred-label" : "Sundsvall",
    "sentiment" : "NOT_RELEVANT",
    "type" : "municipality",
    "start-position" : 49,
    "end-position" : 57,
    "concept-id" : "dJbx_FWY_tK6",
    "matched-string" : "Sundvall",
    "annotation-id" : 21
  }, {
    "preferred-label" : "Västernorrlands län",
    "sentiment" : "NOT_RELEVANT",
    "type" : "region",
    "start-position" : 58,
    "end-position" : 79,
    "concept-id" : "NvUF_SP1_1zo",
    "matched-string" : "Region Västernorrland",
    "annotation-id" : 19
  }, {
    "preferred-label" : "Hälso- och sjukvård",
    "sentiment" : "NOT_RELEVANT",
    "type" : "sni-level-2",
    "start-position" : 195,
    "end-position" : 216,
    "concept-id" : "KhNL_Quq_Xjk",
    "matched-string" : "hälso- och sjukvården",
    "annotation-id" : 22
  }, {
    "preferred-label" : "Tandvård",
    "sentiment" : "NOT_RELEVANT",
    "type" : "keyword",
    "start-position" : 221,
    "end-position" : 231,
    "concept-id" : "ba6n_RTw_PEr",
    "matched-string" : "tandvården",
    "annotation-id" : 23
  }, {
    "preferred-label" : "Idrott/aktivitet",
    "sentiment" : "NOT_RELEVANT",
    "type" : "skill-headline",
    "start-position" : 337,
    "end-position" : 346,
    "concept-id" : "LeJk_Xa1_TuS",
    "matched-string" : "aktivitet",
    "annotation-id" : 3
  }, {
    "preferred-label" : "Kirurgi",
    "sentiment" : "NOT_RELEVANT",
    "type" : "skill",
    "start-position" : 739,
    "end-position" : 746,
    "concept-id" : "iD5y_V1Z_Exw",
    "matched-string" : "kirurgi",
    "annotation-id" : 4
  }, {
    "preferred-label" : "urologi",
    "sentiment" : "NOT_RELEVANT",
    "type" : "esco-skill",
    "start-position" : 748,
    "end-position" : 755,
    "concept-id" : "wo9D_SWi_LUa",
    "matched-string" : "urologi",
    "annotation-id" : 5
  }, {
    "preferred-label" : "Öron-, näs- och halssjukdomar",
    "sentiment" : "NOT_RELEVANT",
    "type" : "skill",
    "start-position" : 757,
    "end-position" : 782,
    "concept-id" : "WBhS_w1X_B3f",
    "matched-string" : "Öron- Näsa och Hals (ÖNH)",
    "annotation-id" : 24
  }, {
    "preferred-label" : "Sjuksköterskor",
    "sentiment" : "NOT_RELEVANT",
    "type" : "ssyk-level-3",
    "start-position" : 895,
    "end-position" : 909,
    "concept-id" : "jzaN_Vqk_TP1",
    "matched-string" : "sjuksköterskor",
    "annotation-id" : 6
  }, {
    "preferred-label" : "Undersköterskor",
    "sentiment" : "NOT_RELEVANT",
    "type" : "ssyk-level-3",
    "start-position" : 911,
    "end-position" : 926,
    "concept-id" : "3EJj_WLs_kgD",
    "matched-string" : "undersköterskor",
    "annotation-id" : 7
  }, {
    "preferred-label" : "läkare",
    "sentiment" : "NOT_RELEVANT",
    "type" : "esco-occupation",
    "start-position" : 928,
    "end-position" : 934,
    "concept-id" : "snUT_QSf_LG9",
    "matched-string" : "läkare",
    "annotation-id" : 8
  }, {
    "preferred-label" : "Medicinska sekreterare, vårdadministratörer m.fl.",
    "sentiment" : "NOT_RELEVANT",
    "type" : "ssyk-level-4",
    "start-position" : 939,
    "end-position" : 961,
    "concept-id" : "2kLc_pto_DpV",
    "matched-string" : "medicinska sekreterare",
    "annotation-id" : 25
  }, {
    "preferred-label" : "sjuksköterska, grundutbildad",
    "sentiment" : "MUST_HAVE",
    "type" : "esco-occupation",
    "start-position" : 1014,
    "end-position" : 1027,
    "concept-id" : "Hor3_xxW_6Tt",
    "matched-string" : "sjuksköterska",
    "annotation-id" : 10
  }, {
    "preferred-label" : "Tillsvidareanställning (inkl. eventuell provanställning)",
    "sentiment" : "OFFERED",
    "type" : "employment-type",
    "start-position" : 1052,
    "end-position" : 1074,
    "concept-id" : "kpPX_CNN_gDU",
    "matched-string" : "tillsvidareanställning",
    "annotation-id" : 26
  }, {
    "preferred-label" : "Kirurgi",
    "sentiment" : "MUST_HAVE",
    "type" : "skill",
    "start-position" : 1080,
    "end-position" : 1087,
    "concept-id" : "iD5y_V1Z_Exw",
    "matched-string" : "kirurgi",
    "annotation-id" : 11
  }, {
    "preferred-label" : "urologi",
    "sentiment" : "MUST_HAVE",
    "type" : "esco-skill",
    "start-position" : 1088,
    "end-position" : 1095,
    "concept-id" : "wo9D_SWi_LUa",
    "matched-string" : "urologi",
    "annotation-id" : 12
  }, {
    "preferred-label" : "Öron-, näs- och halssjukdomar",
    "sentiment" : "MUST_HAVE",
    "type" : "skill",
    "start-position" : 1096,
    "end-position" : 1099,
    "concept-id" : "WBhS_w1X_B3f",
    "matched-string" : "ÖNH",
    "annotation-id" : 27
  }, {
    "preferred-label" : "Sundsvall",
    "sentiment" : "NOT_RELEVANT",
    "type" : "municipality",
    "start-position" : 1102,
    "end-position" : 1110,
    "concept-id" : "dJbx_FWY_tK6",
    "matched-string" : "Sundvall",
    "annotation-id" : 28
  }, {
    "preferred-label" : "Enhetschef, hälso- och sjukvård",
    "sentiment" : "NOT_RELEVANT",
    "type" : "occupation-name",
    "start-position" : 1473,
    "end-position" : 1485,
    "concept-id" : "ZKKT_4bd_Sxs",
    "matched-string" : "enhetschefer",
    "annotation-id" : 29
  }, {
    "preferred-label" : "Verksamhetschef, hälso- och sjukvård",
    "sentiment" : "NOT_RELEVANT",
    "type" : "occupation-name",
    "start-position" : 1931,
    "end-position" : 1946,
    "concept-id" : "41Vq_aR6_yRb",
    "matched-string" : "verksamhetschef",
    "annotation-id" : 30
  }, {
    "preferred-label" : "Sjuksköterska, grundutbildad",
    "sentiment" : "MUST_HAVE",
    "type" : "occupation-name",
    "start-position" : 2089,
    "end-position" : 2102,
    "concept-id" : "bXNH_MNX_dUR",
    "matched-string" : "sjuksköterska",
    "annotation-id" : 13
  }, {
    "preferred-label" : "utföra administrativt arbete",
    "sentiment" : "NICE_TO_HAVE",
    "type" : "esco-skill",
    "start-position" : 2264,
    "end-position" : 2286,
    "concept-id" : "2x13_sLi_EzG",
    "matched-string" : "administrativt arbetet",
    "annotation-id" : 31
  }, {
    "preferred-label" : "MS Office",
    "sentiment" : "MUST_HAVE",
    "type" : "skill",
    "start-position" : 2367,
    "end-position" : 2380,
    "concept-id" : "w8bU_wHe_omF",
    "matched-string" : "officepaketet",
    "annotation-id" : 14
  }, {
    "preferred-label" : "Svenska språket",
    "sentiment" : "MUST_HAVE",
    "type" : "keyword",
    "start-position" : 2399,
    "end-position" : 2414,
    "concept-id" : "BiGm_58D_SSn",
    "matched-string" : "svenska språket",
    "annotation-id" : 15
  }, {
    "preferred-label" : "Annonssäljare",
    "sentiment" : "NOT_RELEVANT",
    "type" : "keyword",
    "start-position" : 3437,
    "end-position" : 3450,
    "concept-id" : "mw6w_UmF_4HF",
    "matched-string" : "annonssäljare",
    "annotation-id" : 16
  }, {
    "preferred-label" : "Säljare",
    "sentiment" : "NOT_RELEVANT",
    "type" : "keyword",
    "start-position" : 3463,
    "end-position" : 3470,
    "concept-id" : "rDcj_Tao_TJJ",
    "matched-string" : "säljare",
    "annotation-id" : 17
  } ],
  "text" : "Kvalitetssjuksköterska till Kirurgi/Urologi/ÖNH, Sundvall\nRegion Västernorrland är en av länets största arbetsgivare med cirka 6500 medarbetare. Tillsammans arbetar vi för att utveckla regionen, hälso- och sjukvården och tandvården. Hos oss får du möjlighet till ett arbete där du gör skillnad för invånarna, i ett län som erbjuder både aktivitet och avkoppling.\r\n\r\nLänssjukvård somatik samordnar länssjukvården för den specialiserade somatiska vården i Region Västernorrland. Området somatik består av elva länssjukvårdsverksamheter. Länssjukvårdsverksamheterna bedrivs vid tre sjukhus, Sundsvall, Sollefteå och Örnsköldsvik och ett antal mottagningar förlagda till flera orter i länet. Området har cirka 2 400 anställda.\n\nLänsverksamhet Kirurgi, Urologi, Öron- Näsa och Hals (ÖNH) bedriver verksamhet på alla tre sjukhusortet. Hos oss arbetar cirka 370 medarbetare. De stora yrkesgrupperna är sjuksköterskor, undersköterskor, läkare och medicinska sekreterare.\n\nNu söker vi en kvalitetssjuksköterska även kallad sjuksköterska med funktionsansvar för tillsvidareanställning till Kirurgi/Urologi/ÖNH i Sundvall. Tillsättning sker enligt överenskommelse,\r\n\r\nROLLEN SOM KVALITETSSJUKSKÖTERSKA\r\n\r\nI rollen arbetar du med kvalité och patientsäkerhetsarbete för länsverksamheten samt  medverkar till att utveckla samarbete för gemensamma rutiner. Ett nära samarbete sker med Kvalitet och patientsäkerhetsavdelningen (KP).\n\nI arbetsuppgifterna ingår även att;\n\n.\tTillsammans med enhetschefer och länsverksamhetschef handlägga verksamhetens avvikelser.\n.\tAnsvara för länsverksamhetens styrdokument. \n.\tHandlägga styrdokument i Platina. \n.\tUtarbeta styrdokument samt vara behjälplig vid framtagning, revidering och utformning utifrån medarbetares förslag.\n.\tVara länsverksamhetschefen behjälplig i hanteringen av IVO ärenden, PEN-ärenden samt patientklagomål/missnöje i vården. Initiera behov av händelse- eller riskanalys i samverkan med verksamhetschef.\n\nVi erbjuder ett varierat arbete med goda utvecklingsmöjligheter. Arbete sker dagtid måndag-fredag.\r\n\r\nDin formella kompetens är legitimerad sjuksköterska. Bred erfarenhet av sjuksköterskeyrket samt erfarenhet av kvalitetsarbete eller liknande ses som meriterande för tjänsten. Vi ser gärna att du har erfarenhet av administrativt arbetet i olika datasystem som ex Systeam Cross och  Platina. Du är en van användare av Officepaketet. Du behärskar det svenska språket i tal och skrift. Det är viktigt att du har god samarbetsförmåga. Det är angeläget att du tar ansvar för dina uppgifter och strukturerar och driver själv ditt arbete framåt. Du är noggrann och väl medveten om mål och kvalitetsstandard. Vi lägger stor vikt vid personliga kompetenser.\n\nVarm välkommen med din ansökan, \nUrvalsarbete och intervjuer kan komma att ske löpande, ansök redan idag!\n\nRegionen arbetar sedan många år med att skapa förutsättningar för att bidra till friska och hälsosamma medarbetare. Du får tillgång till regionens friskvårdsanläggningar i Sundsvall, Härnösand, Örnsköldsvik samt Sollefteå. Genom din anställning hos oss har du flera anställningsförmåner som exempelvis tillägg till föräldraförsäkringen, extra semesterdagar när du fyllt 40 år, möjlighet att löneväxla till tjänstepension. Att du mår bra och trivs är viktigt för oss. Region Västernorrlands arbetsplatser är rökfria och vi tillämpar rökfri arbetstid.\n\nVi har gjort vårt medieval för rekrytering och undanber oss därför kontakt med annonssäljare eller andra säljare av rekryteringstjänster."
}