{
  "meta" : {
    "jobad" : {
      "description" : {
        "requirements" : null,
        "needs" : null,
        "company_information" : null,
        "text_formatted" : "<p>Vi erbjuder ett omväxlande och fartfyllt arbete där arbetsuppgifterna varierar dag till dag. Vi söker nya medarbetare som brinner för att jobba i lag med god samarbete och som ta ansvar även kunna jobba självständigt.</p><p>Vid intresset mejla in CV och personligt brev tillsammans med ett foto.</p><p>Adressen är Norra Förmansvägen 26, 857 53 Sundsvall.</p>",
        "conditions" : null,
        "text" : "Vi erbjuder ett omväxlande och fartfyllt arbete där arbetsuppgifterna varierar dag till dag. Vi söker nya medarbetare som brinner för att jobba i lag med god samarbete och som ta ansvar även kunna jobba självständigt.\nVid intresset mejla in CV och personligt brev tillsammans med ett foto.\nAdressen är Norra Förmansvägen 26, 857 53 Sundsvall."
      },
      "headline" : "YumYum söker sushi kock",
      "driving_license" : null,
      "employer" : {
        "email" : null,
        "phone_number" : null,
        "organization_number" : "5591792725",
        "name" : "YumYum Birsta AB",
        "url" : null,
        "workplace" : "YumYum Birsta "
      },
      "removed_date" : null,
      "logo_url" : null,
      "last_publication_date" : "2022-08-18T23:59:59",
      "number_of_vacancies" : 5,
      "occupation" : {
        "concept_id" : "YKhj_n5P_g4P",
        "label" : "Specialkock",
        "legacy_ams_taxonomy_id" : "5483"
      },
      "occupation_group" : {
        "concept_id" : "BStc_SJh_DKG",
        "label" : "Kockar och kallskänkor",
        "legacy_ams_taxonomy_id" : "5120"
      },
      "employment_type" : {
        "concept_id" : "PFZr_Syz_cUq",
        "label" : "Vanlig anställning",
        "legacy_ams_taxonomy_id" : "1"
      },
      "webpage_url" : "https://arbetsformedlingen.se/platsbanken/annonser/26379178",
      "driving_license_required" : false,
      "application_contacts" : [ ],
      "duration" : {
        "concept_id" : "qQUd_4qe_NDT",
        "label" : "6 månader eller längre",
        "legacy_ams_taxonomy_id" : "2"
      },
      "nice_to_have" : {
        "education_level" : [ ],
        "work_experiences" : [ {
          "concept_id" : "YKhj_n5P_g4P",
          "weight" : 5,
          "label" : "Specialkock",
          "legacy_ams_taxonomy_id" : "5483"
        } ],
        "skills" : [ ],
        "education" : [ ],
        "languages" : [ ]
      },
      "application_details" : {
        "via_af" : false,
        "email" : "tai@yumyum.se",
        "other" : null,
        "reference" : "Söker diskare i Birsta",
        "url" : null,
        "information" : null
      },
      "source_type" : "VIA_ANNONSERA",
      "application_deadline" : "2022-08-18T23:59:59",
      "external_id" : null,
      "workplace_address" : {
        "coordinates" : [ 17.33162519665766, 62.44592730702008 ],
        "city" : "Sundsvall",
        "postcode" : "86341",
        "municipality" : "Sundsvall",
        "region_concept_id" : "NvUF_SP1_1zo",
        "region" : "Västernorrlands län",
        "country_code" : "199",
        "region_code" : "22",
        "municipality_concept_id" : "dJbx_FWY_tK6",
        "country_concept_id" : "i46j_HmG_v64",
        "municipality_code" : "2281",
        "street_address" : "Norra Förmansvägen 26",
        "country" : "Sverige"
      },
      "id" : "26379178",
      "experience_required" : true,
      "working_hours_type" : {
        "concept_id" : "6YE1_gAC_R2G",
        "label" : "Heltid",
        "legacy_ams_taxonomy_id" : "1"
      },
      "access" : null,
      "timestamp" : 1659644265290,
      "must_have" : {
        "education_level" : [ ],
        "work_experiences" : [ ],
        "skills" : [ ],
        "education" : [ ],
        "languages" : [ ]
      },
      "occupation_field" : {
        "concept_id" : "ScKy_FHB_7wT",
        "label" : "Hotell, restaurang, storhushåll",
        "legacy_ams_taxonomy_id" : "7"
      },
      "scope_of_work" : {
        "min" : 0,
        "max" : 100
      },
      "salary_type" : {
        "concept_id" : "oG8G_9cW_nRf",
        "label" : "Fast månads- vecko- eller timlön",
        "legacy_ams_taxonomy_id" : "1"
      },
      "removed" : false,
      "salary_description" : null,
      "access_to_own_car" : false,
      "publication_date" : "2022-08-04T22:09:10"
    },
    "name" : "YumYum söker sushi kock",
    "user" : "hannes"
  },
  "sha1" : "afa527af7b8e177062330b484832dd3c8860b4ea",
  "annotations" : [ {
    "preferred-label" : "Sushi",
    "sentiment" : "MUST_HAVE",
    "type" : "keyword",
    "start-position" : 13,
    "end-position" : 18,
    "concept-id" : "of6o_sJT_K7k",
    "matched-string" : "sushi",
    "annotation-id" : 0
  }, {
    "preferred-label" : "kock",
    "sentiment" : "MUST_HAVE",
    "type" : "esco-occupation",
    "start-position" : 19,
    "end-position" : 23,
    "concept-id" : "Ti2H_QoQ_EMX",
    "matched-string" : "kock",
    "annotation-id" : 1
  }, {
    "preferred-label" : "arbeta självständigt",
    "type" : "esco-skill",
    "start-position" : 221,
    "end-position" : 240,
    "concept-id" : "NyFu_HHd_zhz",
    "matched-string" : "jobba självständigt",
    "annotation-id" : 3
  }, {
    "preferred-label" : "Sundsvall",
    "type" : "municipality",
    "start-position" : 356,
    "end-position" : 365,
    "concept-id" : "dJbx_FWY_tK6",
    "matched-string" : "Sundsvall",
    "annotation-id" : 2
  } ],
  "text" : "YumYum söker sushi kock\nVi erbjuder ett omväxlande och fartfyllt arbete där arbetsuppgifterna varierar dag till dag. Vi söker nya medarbetare som brinner för att jobba i lag med god samarbete och som ta ansvar även kunna jobba självständigt.\nVid intresset mejla in CV och personligt brev tillsammans med ett foto.\nAdressen är Norra Förmansvägen 26, 857 53 Sundsvall."
}