{
  "meta" : {
    "jobad" : {
      "description" : {
        "requirements" : null,
        "needs" : null,
        "company_information" : null,
        "text_formatted" : "Din nya arbetsplats är ingen vanlig sådan! Vårt stora upplevelsecenter har restaurang,  konferensanläggning, barer och mängder med aktiviteter - allt från shuffleboard till bowlinghall. Här på Ballbreaker arbetar vi som ett team där vår gemensamma nämnare är att sprida glädje, inte bara till alla våra besökare, men också till varandra. Vi tycker det är viktigt att ha roligt på jobbet, helt enkelt!\n\nNu söker vi härliga Bartender till kvällarna.\n\nService för dig är ingen ansträngning, det är något du gör av bara farten för andras trivsel, både gästers och kollegornas. Att ha mycket att göra på jobbet är en drivkraft och du backar inte för stötta kollegorna när och där det behövs. Du har en skön energi som skapar lugn och trygghet.\n\nInför öppningen efter sommaren söker vi dig som har jobbat som bartender tidigare, arbetstid är kvällar och helger. Vi söker både deltid, heltid och extrapersonal.",
        "conditions" : "Deltid\r\nAnställningstid enligt överenskommelse",
        "text" : "Din nya arbetsplats är ingen vanlig sådan! Vårt stora upplevelsecenter har restaurang,  konferensanläggning, barer och mängder med aktiviteter - allt från shuffleboard till bowlinghall. Här på Ballbreaker arbetar vi som ett team där vår gemensamma nämnare är att sprida glädje, inte bara till alla våra besökare, men också till varandra. Vi tycker det är viktigt att ha roligt på jobbet, helt enkelt!\n\nNu söker vi härliga Bartender till kvällarna.\n\nService för dig är ingen ansträngning, det är något du gör av bara farten för andras trivsel, både gästers och kollegornas. Att ha mycket att göra på jobbet är en drivkraft och du backar inte för stötta kollegorna när och där det behövs. Du har en skön energi som skapar lugn och trygghet.\n\nInför öppningen efter sommaren söker vi dig som har jobbat som bartender tidigare, arbetstid är kvällar och helger. Vi söker både deltid, heltid och extrapersonal."
      },
      "headline" : "Bartender - Ballbreaker",
      "driving_license" : null,
      "employer" : {
        "email" : null,
        "phone_number" : null,
        "organization_number" : "5564360948",
        "name" : "2Entertain AB",
        "url" : "http://www.momentgroup.com",
        "workplace" : "Moment Group"
      },
      "removed_date" : null,
      "logo_url" : null,
      "last_publication_date" : "2022-08-31T23:59:59",
      "number_of_vacancies" : 1,
      "occupation" : {
        "concept_id" : "fLps_qRU_1CC",
        "label" : "Bartender",
        "legacy_ams_taxonomy_id" : "5488"
      },
      "occupation_group" : {
        "concept_id" : "XFXX_Jq9_Y2a",
        "label" : "Bartendrar",
        "legacy_ams_taxonomy_id" : "5132"
      },
      "employment_type" : {
        "concept_id" : "PFZr_Syz_cUq",
        "label" : "Vanlig anställning",
        "legacy_ams_taxonomy_id" : "1"
      },
      "webpage_url" : "https://arbetsformedlingen.se/platsbanken/annonser/26390293",
      "driving_license_required" : false,
      "application_contacts" : [ {
        "description" : "Karin Ives",
        "email" : "karin@ballbreaker.se",
        "telephone" : null,
        "name" : null,
        "contact_type" : null
      } ],
      "duration" : {
        "concept_id" : "a7uU_j21_mkL",
        "label" : "Tills vidare",
        "legacy_ams_taxonomy_id" : "1"
      },
      "nice_to_have" : {
        "education_level" : [ ],
        "work_experiences" : [ ],
        "skills" : [ ],
        "education" : [ ],
        "languages" : [ ]
      },
      "application_details" : {
        "via_af" : false,
        "email" : null,
        "other" : null,
        "reference" : null,
        "url" : "https://jobb.momentgroup.com/jobs/1422570-bartender-ballbreaker?promotion=302734-arbetsformedlingen",
        "information" : null
      },
      "source_type" : "VIA_PLATSBANKEN_DXA",
      "application_deadline" : "2022-08-31T23:59:59",
      "external_id" : "46-556436-0948-1422570-5",
      "workplace_address" : {
        "coordinates" : [ 18.06858, 59.329323 ],
        "city" : null,
        "postcode" : null,
        "municipality" : "Stockholm",
        "region_concept_id" : "CifL_Rzy_Mku",
        "region" : "Stockholms län",
        "country_code" : "199",
        "region_code" : "01",
        "municipality_concept_id" : "AvNB_uwa_6n6",
        "country_concept_id" : "i46j_HmG_v64",
        "municipality_code" : "0180",
        "street_address" : null,
        "country" : "Sverige"
      },
      "id" : "26390293",
      "experience_required" : true,
      "working_hours_type" : {
        "concept_id" : "947z_JGS_Uk2",
        "label" : "Deltid",
        "legacy_ams_taxonomy_id" : "2"
      },
      "access" : null,
      "timestamp" : 1660033334771,
      "must_have" : {
        "education_level" : [ ],
        "work_experiences" : [ {
          "concept_id" : "fLps_qRU_1CC",
          "weight" : 10,
          "label" : "Bartender",
          "legacy_ams_taxonomy_id" : "5488"
        } ],
        "skills" : [ ],
        "education" : [ ],
        "languages" : [ ]
      },
      "occupation_field" : {
        "concept_id" : "ScKy_FHB_7wT",
        "label" : "Hotell, restaurang, storhushåll",
        "legacy_ams_taxonomy_id" : "7"
      },
      "scope_of_work" : {
        "min" : 0,
        "max" : 100
      },
      "salary_type" : {
        "concept_id" : "oG8G_9cW_nRf",
        "label" : "Fast månads- vecko- eller timlön",
        "legacy_ams_taxonomy_id" : "1"
      },
      "removed" : false,
      "salary_description" : "Lön enligt överenskommelse",
      "access_to_own_car" : false,
      "publication_date" : "2022-08-09T10:22:14"
    },
    "name" : "Bartender - Ballbreaker",
    "user" : "hannes"
  },
  "sha1" : "e9a35e43e25bd5884b44074f3ef0b9edeefa269c",
  "annotations" : [ {
    "preferred-label" : "bartender",
    "sentiment" : "MUST_HAVE",
    "type" : "esco-occupation",
    "start-position" : 0,
    "end-position" : 9,
    "concept-id" : "tr5M_uUa_wdz",
    "matched-string" : "bartender",
    "annotation-id" : 0
  }, {
    "preferred-label" : "Restaurang",
    "sentiment" : "MUST_HAVE",
    "type" : "keyword",
    "start-position" : 99,
    "end-position" : 109,
    "concept-id" : "o2Cg_3Ap_qvK",
    "matched-string" : "restaurang",
    "annotation-id" : 1
  }, {
    "preferred-label" : "bartender",
    "sentiment" : "MUST_HAVE",
    "type" : "esco-occupation",
    "start-position" : 446,
    "end-position" : 455,
    "concept-id" : "tr5M_uUa_wdz",
    "matched-string" : "bartender",
    "annotation-id" : 2
  }, {
    "preferred-label" : "bartender",
    "sentiment" : "MUST_HAVE",
    "type" : "esco-occupation",
    "start-position" : 827,
    "end-position" : 836,
    "concept-id" : "tr5M_uUa_wdz",
    "matched-string" : "bartender",
    "annotation-id" : 3
  }, {
    "preferred-label" : "Heltid/Deltid",
    "type" : "worktime-extent",
    "start-position" : 894,
    "end-position" : 908,
    "concept-id" : "hGCt_6Ni_XPz",
    "matched-string" : "deltid, heltid",
    "annotation-id" : 4
  } ],
  "text" : "Bartender - Ballbreaker\nDin nya arbetsplats är ingen vanlig sådan! Vårt stora upplevelsecenter har restaurang,  konferensanläggning, barer och mängder med aktiviteter - allt från shuffleboard till bowlinghall. Här på Ballbreaker arbetar vi som ett team där vår gemensamma nämnare är att sprida glädje, inte bara till alla våra besökare, men också till varandra. Vi tycker det är viktigt att ha roligt på jobbet, helt enkelt!\n\nNu söker vi härliga Bartender till kvällarna.\n\nService för dig är ingen ansträngning, det är något du gör av bara farten för andras trivsel, både gästers och kollegornas. Att ha mycket att göra på jobbet är en drivkraft och du backar inte för stötta kollegorna när och där det behövs. Du har en skön energi som skapar lugn och trygghet.\n\nInför öppningen efter sommaren söker vi dig som har jobbat som bartender tidigare, arbetstid är kvällar och helger. Vi söker både deltid, heltid och extrapersonal."
}