{
  "meta" : {
    "jobad" : {
      "description" : {
        "requirements" : null,
        "needs" : null,
        "company_information" : null,
        "text_formatted" : "<p><strong>Restaurang Casa Buongiorno som ligger i Huddinge och  serverar italienska pizzor, söker nu en pizzabagare</strong></p><p><strong>Dina arbetsuppgifter kommer bestå av förberedda råvaror, deg och baka olika pizzor samt andra förekommande uppgifter inom köket. </strong></p><p id=\"oppenforalla\">Öppen för alla\nVi fokuserar på din kompetens, inte dina övriga förutsättningar. Vi är öppna för att anpassa rollen eller arbetsplatsen efter dina behov.</p>",
        "conditions" : null,
        "text" : "Restaurang Casa Buongiorno som ligger i Huddinge och  serverar italienska pizzor, söker nu en pizzabagare\nDina arbetsuppgifter kommer bestå av förberedda råvaror, deg och baka olika pizzor samt andra förekommande uppgifter inom köket. \nÖppen för alla\nVi fokuserar på din kompetens, inte dina övriga förutsättningar. Vi är öppna för att anpassa rollen eller arbetsplatsen efter dina behov."
      },
      "headline" : "Pizzabagare",
      "driving_license" : null,
      "employer" : {
        "email" : null,
        "phone_number" : null,
        "organization_number" : "5591732382",
        "name" : "Harslan Restaurang AB",
        "url" : null,
        "workplace" : "Harslan Restaurang AB"
      },
      "removed_date" : null,
      "logo_url" : null,
      "last_publication_date" : "2022-09-04T23:59:59",
      "number_of_vacancies" : 1,
      "occupation" : {
        "concept_id" : "9YaE_Syg_5ZB",
        "label" : "Pizzabagare",
        "legacy_ams_taxonomy_id" : "5505"
      },
      "occupation_group" : {
        "concept_id" : "a8gg_ktU_w8V",
        "label" : "Pizzabagare m.fl.",
        "legacy_ams_taxonomy_id" : "9411"
      },
      "employment_type" : {
        "concept_id" : "PFZr_Syz_cUq",
        "label" : "Vanlig anställning",
        "legacy_ams_taxonomy_id" : "1"
      },
      "webpage_url" : "https://arbetsformedlingen.se/platsbanken/annonser/26427997",
      "driving_license_required" : false,
      "application_contacts" : [ ],
      "duration" : {
        "concept_id" : "a7uU_j21_mkL",
        "label" : "Tills vidare",
        "legacy_ams_taxonomy_id" : "1"
      },
      "nice_to_have" : {
        "education_level" : [ ],
        "work_experiences" : [ {
          "concept_id" : "9YaE_Syg_5ZB",
          "weight" : 5,
          "label" : "Pizzabagare",
          "legacy_ams_taxonomy_id" : "5505"
        } ],
        "skills" : [ ],
        "education" : [ ],
        "languages" : [ ]
      },
      "application_details" : {
        "via_af" : false,
        "email" : "kontakta.casabuongiorno@gmail.com",
        "other" : null,
        "reference" : null,
        "url" : null,
        "information" : null
      },
      "source_type" : "VIA_ANNONSERA",
      "application_deadline" : "2022-09-04T23:59:59",
      "external_id" : null,
      "workplace_address" : {
        "coordinates" : [ 17.983776375181186, 59.23485879408909 ],
        "city" : "Huddinge",
        "postcode" : "14147",
        "municipality" : "Huddinge",
        "region_concept_id" : "CifL_Rzy_Mku",
        "region" : "Stockholms län",
        "country_code" : "199",
        "region_code" : "01",
        "municipality_concept_id" : "g1Gc_aXK_EKu",
        "country_concept_id" : "i46j_HmG_v64",
        "municipality_code" : "0126",
        "street_address" : "Sjödalsvägen 16",
        "country" : "Sverige"
      },
      "id" : "26427997",
      "experience_required" : true,
      "working_hours_type" : {
        "concept_id" : "6YE1_gAC_R2G",
        "label" : "Heltid",
        "legacy_ams_taxonomy_id" : "1"
      },
      "access" : null,
      "timestamp" : 1660839685273,
      "must_have" : {
        "education_level" : [ ],
        "work_experiences" : [ ],
        "skills" : [ ],
        "education" : [ ],
        "languages" : [ ]
      },
      "occupation_field" : {
        "concept_id" : "ScKy_FHB_7wT",
        "label" : "Hotell, restaurang, storhushåll",
        "legacy_ams_taxonomy_id" : "7"
      },
      "scope_of_work" : {
        "min" : 0,
        "max" : 100
      },
      "salary_type" : {
        "concept_id" : "oG8G_9cW_nRf",
        "label" : "Fast månads- vecko- eller timlön",
        "legacy_ams_taxonomy_id" : "1"
      },
      "removed" : false,
      "salary_description" : null,
      "access_to_own_car" : false,
      "publication_date" : "2022-08-18T18:21:25"
    },
    "name" : "Pizzabagare",
    "user" : "hannes"
  },
  "sha1" : "c77a84a7829d30913526366ee562a2f7c1adab63",
  "annotations" : [ {
    "preferred-label" : "Pizzabagare",
    "sentiment" : "MUST_HAVE",
    "type" : "occupation-name",
    "start-position" : 0,
    "end-position" : 11,
    "concept-id" : "9YaE_Syg_5ZB",
    "matched-string" : "pizzabagare",
    "annotation-id" : 0
  }, {
    "preferred-label" : "Restaurang",
    "sentiment" : "NOT_RELEVANT",
    "type" : "keyword",
    "start-position" : 12,
    "end-position" : 22,
    "concept-id" : "o2Cg_3Ap_qvK",
    "matched-string" : "restaurang",
    "annotation-id" : 1
  }, {
    "preferred-label" : "Italienskt kök",
    "sentiment" : "MUST_HAVE",
    "type" : "skill",
    "start-position" : 75,
    "end-position" : 85,
    "concept-id" : "T38R_QfY_piB",
    "matched-string" : "italienska",
    "annotation-id" : 2
  }, {
    "preferred-label" : "Pizzabagare",
    "sentiment" : "MUST_HAVE",
    "type" : "occupation-name",
    "start-position" : 106,
    "end-position" : 117,
    "concept-id" : "9YaE_Syg_5ZB",
    "matched-string" : "pizzabagare",
    "annotation-id" : 3
  } ],
  "text" : "Pizzabagare\nRestaurang Casa Buongiorno som ligger i Huddinge och  serverar italienska pizzor, söker nu en pizzabagare\nDina arbetsuppgifter kommer bestå av förberedda råvaror, deg och baka olika pizzor samt andra förekommande uppgifter inom köket. \nÖppen för alla\nVi fokuserar på din kompetens, inte dina övriga förutsättningar. Vi är öppna för att anpassa rollen eller arbetsplatsen efter dina behov."
}