{
  "meta" : {
    "jobad" : {
      "description" : {
        "requirements" : null,
        "needs" : null,
        "company_information" : null,
        "text_formatted" : "Jollyroom etablerades år 2010 och är Nordens ledande barn- och babybutik på nätet. Vi befinner oss i stark tillväxt och är ett av de snabbaste växande bolagen inom e-handeln i Europa. Vi servar idag fler än 2 000 000 kunder och har allt för barnen mellan 0 till 12 år samt ett heltäckande sortiment för gravida. I vårt 75 000 kvm stora lager, med över 35 000 artiklar finner barnfamiljen både välkända och nya varumärken. Ett brett sortiment, en tillgänglig webbutik, snabba leveranser och kunnig kundservice är våra grundpelare som gör Jollyroom till det självklara valet i barnfamiljens vardag. I Göteborg ligger Campus Jollyroom, här finns ett stort nybyggt kontor, flera moderna lager, showroom för våra kunder samt gym och restaurang för våra medarbetare. Vi har även ett kontor i Umeå samt en fysisk butik i Stockholm Kungens Kurva. Vår personalstyrka växer löpande och utgör i dagsläget 500 fantastiska medarbetare, 300 medarbetare arbetar på heltid och resterande på behovsbasis. Möjligheten till expansion och framgång har aldrig varit större. Efter att ha vunnit nr. 1 positionen på den Nordiska marknaden har vi nu påbörjat expansionen in i Europa. På sikt skall Jollyroom bli den ledande aktören inom barn- och baby på nätet i Europa. Vi skall ge europeiska konsumenter den bästa upplevelsen. Vi är med i matchen för att vinna.\r\n\r\nFotograf extra \nVi söker en initiativtagande och ambitiös kollega med passion för fotografering som vill arbeta i vår fotostudio . Som fotograf är ditt primära fokus att fotografera produktbilder men det förekommer även uppdrag som innebär fotografering av inredning, modell och videoinspelning. Då tjänsten är en visstidsanställning som baseras på behov ser vi gärna att du har någon annan typ av sysselsättning så som extrajobb, studier eller föräldraledighet på deltid. \n\nExempel på arbetsuppgifter\n- Packshot fotografering av produkter\n- Modellfotografering i studio och locations\n- Retusch och annan postproduktion av bildmaterial\n- Produktion av rörligt material i form av video och animation\n- Förberedning av produkter (exempelvis montering av möbler, strykning av kläder)\n- Administrativa uppgifter\n- Underhåll av studio och utrustning\n\nDu är en kreativ, noggrann och flexibel person med ett öga för detaljer och känsla för färg, form och trender.\n\nVi söker dig som har: \n- Erfarenhet av fotografering med CaptureOne \n- Erfarenhet av produktfotografering, gärna från e-handel\n- Goda kunskaper i Adobe-paketet\n- Erfarenhet av retusch i Photoshop/Lightroom\n- Erfarenhet av videoredigering med Premiere Pro\n- Ett kommersiellt tänk med försäljningsfokus\n- Erfarenhet inom ljussättning \n\nVi söker dig som är strukturerad, effektiv och hungrig efter nya utmaningar. Vi som arbetar på Jollyroom kännetecknas som doers med hög arbetskapacitet - vi verkställer våra planer och når våra mål. Vi söker efter dig som känner igen dig i den beskrivningen.\n\nVi erbjuder: \n- En entreprenörsdriven verksamhet\n- Hög utvecklingstakt och en spännande bransch med stor potential\n- Karriärmöjligheter\n- Helt nybyggda lokaler samt tillgång till Jollyrooms eget fullt utrustade gym\n- En ungdomlig och pulserande miljö\n- Kollektivavtal\n- Placering nära Göteborg; 15 minuter med bil till city\n\nUpplägg, ansökan och kontakt: \n- Start: Omgående\n- Omfattning: Visstidsanställning baserat på behov, just nu 2-3 dagar/vecka\n- Placering: Sörredsvägen 113, Göteborg\n- Bifogas i ansökan: CV, personligt brev samt portfolio\n- Kontakt: Amanda Vitalis, amanda.vitalis@jollyroom.se \n\nBlev du ännu mer nyfiken på Jollyroom? Glöm inte att följa oss på LinkedIn! Nedan finner du ett axplock av våra senaste nyheter:\n\nVi kom upp i två miljarder i omsättning -> https://www.market.se/affarsnyheter/forsaljning/vd-ns-besked-efter-att-jollyroom-betat-av-ytterligare-en-miljard-vill-expandera-till-fler-lander/\n\nVi har byggt ett nytt JollyCampus i Göteborg -> https://www.helahisingen.se/jollyrooms-vd-bygger-campus-och-ar-inte-radd-for-amazon-vi-kan-ge-dem-en-match/ \n\nVi vann svenska SEO-priset i kategorin Barn & Leksaker för tredje året i rad! -> https://svenskaseopriset.se/#winners \n\nSom ett led i att säkerställa hög kvalitet på våra rekryteringsprocesser genomför vi tester, referenstagning och bakgrundskontroll.\n\nVi arbetar löpande med rekryteringen och kan komma att tillsätta tjänsten innan sista ansökningsdag, så var gärna snabb med din ansökan.\n\nVi undanber oss för närvarande samtal från rekryterings- och annonsleverantörer",
        "conditions" : "-\r\n-",
        "text" : "Jollyroom etablerades år 2010 och är Nordens ledande barn- och babybutik på nätet. Vi befinner oss i stark tillväxt och är ett av de snabbaste växande bolagen inom e-handeln i Europa. Vi servar idag fler än 2 000 000 kunder och har allt för barnen mellan 0 till 12 år samt ett heltäckande sortiment för gravida. I vårt 75 000 kvm stora lager, med över 35 000 artiklar finner barnfamiljen både välkända och nya varumärken. Ett brett sortiment, en tillgänglig webbutik, snabba leveranser och kunnig kundservice är våra grundpelare som gör Jollyroom till det självklara valet i barnfamiljens vardag. I Göteborg ligger Campus Jollyroom, här finns ett stort nybyggt kontor, flera moderna lager, showroom för våra kunder samt gym och restaurang för våra medarbetare. Vi har även ett kontor i Umeå samt en fysisk butik i Stockholm Kungens Kurva. Vår personalstyrka växer löpande och utgör i dagsläget 500 fantastiska medarbetare, 300 medarbetare arbetar på heltid och resterande på behovsbasis. Möjligheten till expansion och framgång har aldrig varit större. Efter att ha vunnit nr. 1 positionen på den Nordiska marknaden har vi nu påbörjat expansionen in i Europa. På sikt skall Jollyroom bli den ledande aktören inom barn- och baby på nätet i Europa. Vi skall ge europeiska konsumenter den bästa upplevelsen. Vi är med i matchen för att vinna.\r\n\r\nFotograf extra \nVi söker en initiativtagande och ambitiös kollega med passion för fotografering som vill arbeta i vår fotostudio . Som fotograf är ditt primära fokus att fotografera produktbilder men det förekommer även uppdrag som innebär fotografering av inredning, modell och videoinspelning. Då tjänsten är en visstidsanställning som baseras på behov ser vi gärna att du har någon annan typ av sysselsättning så som extrajobb, studier eller föräldraledighet på deltid. \n\nExempel på arbetsuppgifter\n- Packshot fotografering av produkter\n- Modellfotografering i studio och locations\n- Retusch och annan postproduktion av bildmaterial\n- Produktion av rörligt material i form av video och animation\n- Förberedning av produkter (exempelvis montering av möbler, strykning av kläder)\n- Administrativa uppgifter\n- Underhåll av studio och utrustning\n\nDu är en kreativ, noggrann och flexibel person med ett öga för detaljer och känsla för färg, form och trender.\n\nVi söker dig som har: \n- Erfarenhet av fotografering med CaptureOne \n- Erfarenhet av produktfotografering, gärna från e-handel\n- Goda kunskaper i Adobe-paketet\n- Erfarenhet av retusch i Photoshop/Lightroom\n- Erfarenhet av videoredigering med Premiere Pro\n- Ett kommersiellt tänk med försäljningsfokus\n- Erfarenhet inom ljussättning \n\nVi söker dig som är strukturerad, effektiv och hungrig efter nya utmaningar. Vi som arbetar på Jollyroom kännetecknas som doers med hög arbetskapacitet - vi verkställer våra planer och når våra mål. Vi söker efter dig som känner igen dig i den beskrivningen.\n\nVi erbjuder: \n- En entreprenörsdriven verksamhet\n- Hög utvecklingstakt och en spännande bransch med stor potential\n- Karriärmöjligheter\n- Helt nybyggda lokaler samt tillgång till Jollyrooms eget fullt utrustade gym\n- En ungdomlig och pulserande miljö\n- Kollektivavtal\n- Placering nära Göteborg; 15 minuter med bil till city\n\nUpplägg, ansökan och kontakt: \n- Start: Omgående\n- Omfattning: Visstidsanställning baserat på behov, just nu 2-3 dagar/vecka\n- Placering: Sörredsvägen 113, Göteborg\n- Bifogas i ansökan: CV, personligt brev samt portfolio\n- Kontakt: Amanda Vitalis, amanda.vitalis@jollyroom.se \n\nBlev du ännu mer nyfiken på Jollyroom? Glöm inte att följa oss på LinkedIn! Nedan finner du ett axplock av våra senaste nyheter:\n\nVi kom upp i två miljarder i omsättning -> https://www.market.se/affarsnyheter/forsaljning/vd-ns-besked-efter-att-jollyroom-betat-av-ytterligare-en-miljard-vill-expandera-till-fler-lander/\n\nVi har byggt ett nytt JollyCampus i Göteborg -> https://www.helahisingen.se/jollyrooms-vd-bygger-campus-och-ar-inte-radd-for-amazon-vi-kan-ge-dem-en-match/ \n\nVi vann svenska SEO-priset i kategorin Barn & Leksaker för tredje året i rad! -> https://svenskaseopriset.se/#winners \n\nSom ett led i att säkerställa hög kvalitet på våra rekryteringsprocesser genomför vi tester, referenstagning och bakgrundskontroll.\n\nVi arbetar löpande med rekryteringen och kan komma att tillsätta tjänsten innan sista ansökningsdag, så var gärna snabb med din ansökan.\n\nVi undanber oss för närvarande samtal från rekryterings- och annonsleverantörer"
      },
      "headline" : "Fotograf extra till Jollyroom i Göteborg!",
      "driving_license" : null,
      "employer" : {
        "email" : null,
        "phone_number" : null,
        "organization_number" : "5568157159",
        "name" : "Jollyroom AB",
        "url" : null,
        "workplace" : "Jollyroom"
      },
      "removed_date" : null,
      "logo_url" : "https://www.arbetsformedlingen.se/rest/arbetsgivare/rest/af/v3/organisation/5568157159/logotyper/logo.png",
      "last_publication_date" : "2022-08-15T23:59:59",
      "number_of_vacancies" : 1,
      "occupation" : {
        "concept_id" : "1N2U_6xW_Tdx",
        "label" : "Fotograf",
        "legacy_ams_taxonomy_id" : "4790"
      },
      "occupation_group" : {
        "concept_id" : "3J38_DNz_YKK",
        "label" : "Fotografer",
        "legacy_ams_taxonomy_id" : "3431"
      },
      "employment_type" : {
        "concept_id" : "PFZr_Syz_cUq",
        "label" : "Vanlig anställning",
        "legacy_ams_taxonomy_id" : "1"
      },
      "webpage_url" : "https://arbetsformedlingen.se/platsbanken/annonser/26335411",
      "driving_license_required" : false,
      "application_contacts" : [ ],
      "duration" : {
        "concept_id" : "qQUd_4qe_NDT",
        "label" : "6 månader eller längre",
        "legacy_ams_taxonomy_id" : "2"
      },
      "nice_to_have" : {
        "education_level" : [ ],
        "work_experiences" : [ ],
        "skills" : [ ],
        "education" : [ ],
        "languages" : [ ]
      },
      "application_details" : {
        "via_af" : false,
        "email" : null,
        "other" : null,
        "reference" : null,
        "url" : "https://career.jollyroom.se/jobs/210063-fotograf-extra-till-jollyroom-i-goteborg?ref=platsbanken",
        "information" : null
      },
      "source_type" : "VIA_PLATSBANKEN_DXA",
      "application_deadline" : "2022-08-15T23:59:59",
      "external_id" : "46-556815-7159-wb-210063",
      "workplace_address" : {
        "coordinates" : [ 11.97456, 57.70887 ],
        "city" : null,
        "postcode" : null,
        "municipality" : "Göteborg",
        "region_concept_id" : "zdoY_6u5_Krt",
        "region" : "Västra Götalands län",
        "country_code" : "199",
        "region_code" : "14",
        "municipality_concept_id" : "PVZL_BQT_XtL",
        "country_concept_id" : "i46j_HmG_v64",
        "municipality_code" : "1480",
        "street_address" : null,
        "country" : "Sverige"
      },
      "id" : "26335411",
      "experience_required" : true,
      "working_hours_type" : {
        "concept_id" : "947z_JGS_Uk2",
        "label" : "Deltid",
        "legacy_ams_taxonomy_id" : "2"
      },
      "access" : null,
      "timestamp" : 1658136235586,
      "must_have" : {
        "education_level" : [ ],
        "work_experiences" : [ {
          "concept_id" : "1N2U_6xW_Tdx",
          "weight" : 10,
          "label" : "Fotograf",
          "legacy_ams_taxonomy_id" : "4790"
        } ],
        "skills" : [ ],
        "education" : [ ],
        "languages" : [ ]
      },
      "occupation_field" : {
        "concept_id" : "9puE_nYg_crq",
        "label" : "Kultur, media, design",
        "legacy_ams_taxonomy_id" : "11"
      },
      "scope_of_work" : {
        "min" : 0,
        "max" : 100
      },
      "salary_type" : {
        "concept_id" : "oG8G_9cW_nRf",
        "label" : "Fast månads- vecko- eller timlön",
        "legacy_ams_taxonomy_id" : "1"
      },
      "removed" : false,
      "salary_description" : "Enligt överenskommelse",
      "access_to_own_car" : false,
      "publication_date" : "2022-07-18T11:23:55"
    },
    "name" : "Fotograf extra till Jollyroom i Göteborg!",
    "user" : "hannes"
  },
  "sha1" : "294d8208ceb7562c5cff85c19614c58b8ee8dee0",
  "annotations" : [ {
    "preferred-label" : "fotograf",
    "sentiment" : "MUST_HAVE",
    "type" : "esco-occupation",
    "start-position" : 0,
    "end-position" : 8,
    "concept-id" : "X1AG_Jya_y93",
    "matched-string" : "fotograf",
    "annotation-id" : 0
  }, {
    "preferred-label" : "Göteborg",
    "type" : "municipality",
    "start-position" : 32,
    "end-position" : 40,
    "concept-id" : "PVZL_BQT_XtL",
    "matched-string" : "Göteborg",
    "annotation-id" : 29
  }, {
    "preferred-label" : "Specialiserad butikshandel med barnkläder",
    "type" : "sni-level-5",
    "start-position" : 95,
    "end-position" : 114,
    "concept-id" : "hXkH_y17_rUb",
    "matched-string" : "barn- och babybutik",
    "annotation-id" : 30
  }, {
    "preferred-label" : "Lager",
    "sentiment" : "MUST_HAVE",
    "type" : "keyword",
    "start-position" : 378,
    "end-position" : 383,
    "concept-id" : "J5gJ_6vV_egQ",
    "matched-string" : "lager",
    "annotation-id" : 1
  }, {
    "preferred-label" : "kundservice",
    "sentiment" : "MUST_HAVE",
    "type" : "esco-skill",
    "start-position" : 539,
    "end-position" : 550,
    "concept-id" : "WykS_79d_Fz7",
    "matched-string" : "kundservice",
    "annotation-id" : 2
  }, {
    "preferred-label" : "Göteborg",
    "type" : "municipality",
    "start-position" : 641,
    "end-position" : 649,
    "concept-id" : "PVZL_BQT_XtL",
    "matched-string" : "Göteborg",
    "annotation-id" : 31
  }, {
    "preferred-label" : "Kontor",
    "sentiment" : "MUST_HAVE",
    "type" : "keyword",
    "start-position" : 703,
    "end-position" : 709,
    "concept-id" : "Hyz1_7HF_AkP",
    "matched-string" : "kontor",
    "annotation-id" : 3
  }, {
    "preferred-label" : "Lager",
    "sentiment" : "MUST_HAVE",
    "type" : "keyword",
    "start-position" : 725,
    "end-position" : 730,
    "concept-id" : "J5gJ_6vV_egQ",
    "matched-string" : "lager",
    "annotation-id" : 4
  }, {
    "preferred-label" : "Restaurang",
    "sentiment" : "MUST_HAVE",
    "type" : "keyword",
    "start-position" : 770,
    "end-position" : 780,
    "concept-id" : "o2Cg_3Ap_qvK",
    "matched-string" : "restaurang",
    "annotation-id" : 5
  }, {
    "preferred-label" : "Kontor",
    "sentiment" : "MUST_HAVE",
    "type" : "keyword",
    "start-position" : 819,
    "end-position" : 825,
    "concept-id" : "Hyz1_7HF_AkP",
    "matched-string" : "kontor",
    "annotation-id" : 6
  }, {
    "preferred-label" : "Umeå",
    "type" : "municipality",
    "start-position" : 828,
    "end-position" : 832,
    "concept-id" : "QiGt_BLu_amP",
    "matched-string" : "Umeå",
    "annotation-id" : 32
  }, {
    "preferred-label" : "Butik",
    "sentiment" : "MUST_HAVE",
    "type" : "keyword",
    "start-position" : 848,
    "end-position" : 853,
    "concept-id" : "xLsd_zjY_5wr",
    "matched-string" : "butik",
    "annotation-id" : 7
  }, {
    "preferred-label" : "Stockholm",
    "type" : "municipality",
    "start-position" : 856,
    "end-position" : 865,
    "concept-id" : "AvNB_uwa_6n6",
    "matched-string" : "Stockholm",
    "annotation-id" : 33
  }, {
    "preferred-label" : "Heltid",
    "type" : "worktime-extent",
    "start-position" : 992,
    "end-position" : 998,
    "concept-id" : "6YE1_gAC_R2G",
    "matched-string" : "heltid",
    "annotation-id" : 34
  }, {
    "preferred-label" : "fotograf",
    "sentiment" : "MUST_HAVE",
    "type" : "esco-occupation",
    "start-position" : 1385,
    "end-position" : 1393,
    "concept-id" : "X1AG_Jya_y93",
    "matched-string" : "fotograf",
    "annotation-id" : 8
  }, {
    "preferred-label" : "Fotografering",
    "sentiment" : "MUST_HAVE",
    "type" : "skill",
    "start-position" : 1467,
    "end-position" : 1480,
    "concept-id" : "zpaf_mDu_foK",
    "matched-string" : "fotografering",
    "annotation-id" : 9
  }, {
    "preferred-label" : "fotograf",
    "sentiment" : "MUST_HAVE",
    "type" : "esco-occupation",
    "start-position" : 1520,
    "end-position" : 1528,
    "concept-id" : "X1AG_Jya_y93",
    "matched-string" : "fotograf",
    "annotation-id" : 10
  }, {
    "preferred-label" : "Fotografering",
    "sentiment" : "MUST_HAVE",
    "type" : "skill",
    "start-position" : 1625,
    "end-position" : 1638,
    "concept-id" : "zpaf_mDu_foK",
    "matched-string" : "fotografering",
    "annotation-id" : 11
  }, {
    "preferred-label" : "Inredning",
    "sentiment" : "MUST_HAVE",
    "type" : "keyword",
    "start-position" : 1642,
    "end-position" : 1651,
    "concept-id" : "uAtM_95o_kaj",
    "matched-string" : "inredning",
    "annotation-id" : 12
  }, {
    "preferred-label" : "Modell",
    "type" : "occupation-name",
    "start-position" : 1653,
    "end-position" : 1659,
    "concept-id" : "o7SJ_LKE_wrS",
    "matched-string" : "modell",
    "annotation-id" : 35
  }, {
    "preferred-label" : "Allmän visstidsanställning",
    "type" : "keyword",
    "start-position" : 1699,
    "end-position" : 1718,
    "concept-id" : "hxfz_ayC_9Vd",
    "matched-string" : "visstidsanställning",
    "annotation-id" : 36
  }, {
    "preferred-label" : "Deltid",
    "type" : "worktime-extent",
    "start-position" : 1850,
    "end-position" : 1856,
    "concept-id" : "947z_JGS_Uk2",
    "matched-string" : "deltid",
    "annotation-id" : 37
  }, {
    "preferred-label" : "Fotografering",
    "sentiment" : "MUST_HAVE",
    "type" : "skill",
    "start-position" : 1898,
    "end-position" : 1911,
    "concept-id" : "zpaf_mDu_foK",
    "matched-string" : "fotografering",
    "annotation-id" : 13
  }, {
    "preferred-label" : "Modell",
    "type" : "occupation-name",
    "start-position" : 1927,
    "end-position" : 1933,
    "concept-id" : "o7SJ_LKE_wrS",
    "matched-string" : "Modell",
    "annotation-id" : 38
  }, {
    "preferred-label" : "Fotografering",
    "type" : "skill",
    "start-position" : 1933,
    "end-position" : 1946,
    "concept-id" : "zpaf_mDu_foK",
    "matched-string" : "fotografering",
    "annotation-id" : 39
  }, {
    "preferred-label" : "Retuschering",
    "type" : "skill",
    "start-position" : 1972,
    "end-position" : 1979,
    "concept-id" : "SdBw_3e9_1ph",
    "matched-string" : "Retusch",
    "annotation-id" : 40
  }, {
    "preferred-label" : "Postproduktion",
    "sentiment" : "MUST_HAVE",
    "type" : "skill",
    "start-position" : 1990,
    "end-position" : 2004,
    "concept-id" : "E8cy_W2c_Y5M",
    "matched-string" : "postproduktion",
    "annotation-id" : 14
  }, {
    "preferred-label" : "Möbelmontering",
    "type" : "skill",
    "start-position" : 2124,
    "end-position" : 2143,
    "concept-id" : "yZdF_d27_Gow",
    "matched-string" : "montering av möbler",
    "annotation-id" : 41
  }, {
    "preferred-label" : "Kläder/Mode",
    "sentiment" : "MUST_HAVE",
    "type" : "skill",
    "start-position" : 2158,
    "end-position" : 2164,
    "concept-id" : "agGK_Zte_X2y",
    "matched-string" : "kläder",
    "annotation-id" : 16
  }, {
    "preferred-label" : "noggrannhet",
    "type" : "esco-skill",
    "start-position" : 2249,
    "end-position" : 2257,
    "concept-id" : "mrsW_EkL_KRD",
    "matched-string" : "noggrann",
    "annotation-id" : 42
  }, {
    "preferred-label" : "Färg/Kemikalieprodukter/Tapeter",
    "sentiment" : "MUST_HAVE",
    "type" : "skill",
    "start-position" : 2318,
    "end-position" : 2322,
    "concept-id" : "fyJi_1k3_CdV",
    "matched-string" : "färg",
    "annotation-id" : 17
  }, {
    "preferred-label" : "Fotografering",
    "sentiment" : "MUST_HAVE",
    "type" : "skill",
    "start-position" : 2382,
    "end-position" : 2395,
    "concept-id" : "zpaf_mDu_foK",
    "matched-string" : "fotografering",
    "annotation-id" : 18
  }, {
    "preferred-label" : "E-handel",
    "sentiment" : "MUST_HAVE",
    "type" : "keyword",
    "start-position" : 2461,
    "end-position" : 2469,
    "concept-id" : "yxpW_N32_YMK",
    "matched-string" : "e-handel",
    "annotation-id" : 19
  }, {
    "preferred-label" : "Retuschering",
    "type" : "skill",
    "start-position" : 2519,
    "end-position" : 2526,
    "concept-id" : "SdBw_3e9_1ph",
    "matched-string" : "retusch",
    "annotation-id" : 43
  }, {
    "preferred-label" : "Adobe Photoshop",
    "type" : "esco-skill",
    "start-position" : 2529,
    "end-position" : 2538,
    "concept-id" : "87jf_fNQ_UrH",
    "matched-string" : "Photoshop",
    "annotation-id" : 44
  }, {
    "preferred-label" : "Adobe Lightroom",
    "type" : "skill",
    "start-position" : 2539,
    "end-position" : 2548,
    "concept-id" : "puiy_Nb9_yUF",
    "matched-string" : "Lightroom",
    "annotation-id" : 45
  }, {
    "preferred-label" : "Videoredigering",
    "sentiment" : "MUST_HAVE",
    "type" : "skill",
    "start-position" : 2565,
    "end-position" : 2580,
    "concept-id" : "QBAx_kfV_k7Q",
    "matched-string" : "videoredigering",
    "annotation-id" : 20
  }, {
    "preferred-label" : "Film/redigering-Adobe Premiere",
    "type" : "skill",
    "start-position" : 2585,
    "end-position" : 2597,
    "concept-id" : "GCMj_xLD_mj6",
    "matched-string" : "Premiere Pro",
    "annotation-id" : 46
  }, {
    "preferred-label" : "Ljussättning, multimedia",
    "type" : "skill",
    "start-position" : 2662,
    "end-position" : 2674,
    "concept-id" : "Mg1Y_oVm_Awu",
    "matched-string" : "ljussättning",
    "annotation-id" : 47
  }, {
    "preferred-label" : "Kollektivavtal",
    "sentiment" : "MUST_HAVE",
    "type" : "skill",
    "start-position" : 3190,
    "end-position" : 3204,
    "concept-id" : "z7wE_9xb_3jX",
    "matched-string" : "kollektivavtal",
    "annotation-id" : 21
  }, {
    "preferred-label" : "Göteborg",
    "type" : "municipality",
    "start-position" : 3222,
    "end-position" : 3230,
    "concept-id" : "PVZL_BQT_XtL",
    "matched-string" : "Göteborg",
    "annotation-id" : 48
  }, {
    "preferred-label" : "Allmän visstidsanställning",
    "type" : "keyword",
    "start-position" : 3325,
    "end-position" : 3344,
    "concept-id" : "hxfz_ayC_9Vd",
    "matched-string" : "Visstidsanställning",
    "annotation-id" : 49
  }, {
    "preferred-label" : "Göteborg",
    "type" : "municipality",
    "start-position" : 3418,
    "end-position" : 3426,
    "concept-id" : "PVZL_BQT_XtL",
    "matched-string" : "Göteborg",
    "annotation-id" : 50
  }, {
    "preferred-label" : "Sökordsoptimering/SEO",
    "sentiment" : "MUST_HAVE",
    "type" : "skill",
    "start-position" : 4034,
    "end-position" : 4037,
    "concept-id" : "zYHW_Mtu_jqq",
    "matched-string" : "seo",
    "annotation-id" : 26
  }, {
    "preferred-label" : "Leksaker",
    "sentiment" : "MUST_HAVE",
    "type" : "skill",
    "start-position" : 4064,
    "end-position" : 4072,
    "concept-id" : "soG2_nq2_bii",
    "matched-string" : "leksaker",
    "annotation-id" : 27
  } ],
  "text" : "Fotograf extra till Jollyroom i Göteborg!\nJollyroom etablerades år 2010 och är Nordens ledande barn- och babybutik på nätet. Vi befinner oss i stark tillväxt och är ett av de snabbaste växande bolagen inom e-handeln i Europa. Vi servar idag fler än 2 000 000 kunder och har allt för barnen mellan 0 till 12 år samt ett heltäckande sortiment för gravida. I vårt 75 000 kvm stora lager, med över 35 000 artiklar finner barnfamiljen både välkända och nya varumärken. Ett brett sortiment, en tillgänglig webbutik, snabba leveranser och kunnig kundservice är våra grundpelare som gör Jollyroom till det självklara valet i barnfamiljens vardag. I Göteborg ligger Campus Jollyroom, här finns ett stort nybyggt kontor, flera moderna lager, showroom för våra kunder samt gym och restaurang för våra medarbetare. Vi har även ett kontor i Umeå samt en fysisk butik i Stockholm Kungens Kurva. Vår personalstyrka växer löpande och utgör i dagsläget 500 fantastiska medarbetare, 300 medarbetare arbetar på heltid och resterande på behovsbasis. Möjligheten till expansion och framgång har aldrig varit större. Efter att ha vunnit nr. 1 positionen på den Nordiska marknaden har vi nu påbörjat expansionen in i Europa. På sikt skall Jollyroom bli den ledande aktören inom barn- och baby på nätet i Europa. Vi skall ge europeiska konsumenter den bästa upplevelsen. Vi är med i matchen för att vinna.\r\n\r\nFotograf extra \nVi söker en initiativtagande och ambitiös kollega med passion för fotografering som vill arbeta i vår fotostudio . Som fotograf är ditt primära fokus att fotografera produktbilder men det förekommer även uppdrag som innebär fotografering av inredning, modell och videoinspelning. Då tjänsten är en visstidsanställning som baseras på behov ser vi gärna att du har någon annan typ av sysselsättning så som extrajobb, studier eller föräldraledighet på deltid. \n\nExempel på arbetsuppgifter\n- Packshot fotografering av produkter\n- Modellfotografering i studio och locations\n- Retusch och annan postproduktion av bildmaterial\n- Produktion av rörligt material i form av video och animation\n- Förberedning av produkter (exempelvis montering av möbler, strykning av kläder)\n- Administrativa uppgifter\n- Underhåll av studio och utrustning\n\nDu är en kreativ, noggrann och flexibel person med ett öga för detaljer och känsla för färg, form och trender.\n\nVi söker dig som har: \n- Erfarenhet av fotografering med CaptureOne \n- Erfarenhet av produktfotografering, gärna från e-handel\n- Goda kunskaper i Adobe-paketet\n- Erfarenhet av retusch i Photoshop/Lightroom\n- Erfarenhet av videoredigering med Premiere Pro\n- Ett kommersiellt tänk med försäljningsfokus\n- Erfarenhet inom ljussättning \n\nVi söker dig som är strukturerad, effektiv och hungrig efter nya utmaningar. Vi som arbetar på Jollyroom kännetecknas som doers med hög arbetskapacitet - vi verkställer våra planer och når våra mål. Vi söker efter dig som känner igen dig i den beskrivningen.\n\nVi erbjuder: \n- En entreprenörsdriven verksamhet\n- Hög utvecklingstakt och en spännande bransch med stor potential\n- Karriärmöjligheter\n- Helt nybyggda lokaler samt tillgång till Jollyrooms eget fullt utrustade gym\n- En ungdomlig och pulserande miljö\n- Kollektivavtal\n- Placering nära Göteborg; 15 minuter med bil till city\n\nUpplägg, ansökan och kontakt: \n- Start: Omgående\n- Omfattning: Visstidsanställning baserat på behov, just nu 2-3 dagar/vecka\n- Placering: Sörredsvägen 113, Göteborg\n- Bifogas i ansökan: CV, personligt brev samt portfolio\n- Kontakt: Amanda Vitalis, amanda.vitalis@jollyroom.se \n\nBlev du ännu mer nyfiken på Jollyroom? Glöm inte att följa oss på LinkedIn! Nedan finner du ett axplock av våra senaste nyheter:\n\nVi kom upp i två miljarder i omsättning -> https://www.market.se/affarsnyheter/forsaljning/vd-ns-besked-efter-att-jollyroom-betat-av-ytterligare-en-miljard-vill-expandera-till-fler-lander/\n\nVi har byggt ett nytt JollyCampus i Göteborg -> https://www.helahisingen.se/jollyrooms-vd-bygger-campus-och-ar-inte-radd-for-amazon-vi-kan-ge-dem-en-match/ \n\nVi vann svenska SEO-priset i kategorin Barn & Leksaker för tredje året i rad! -> https://svenskaseopriset.se/#winners \n\nSom ett led i att säkerställa hög kvalitet på våra rekryteringsprocesser genomför vi tester, referenstagning och bakgrundskontroll.\n\nVi arbetar löpande med rekryteringen och kan komma att tillsätta tjänsten innan sista ansökningsdag, så var gärna snabb med din ansökan.\n\nVi undanber oss för närvarande samtal från rekryterings- och annonsleverantörer"
}