{
  "meta" : {
    "jobad" : {
      "description" : {
        "requirements" : null,
        "needs" : null,
        "company_information" : null,
        "text_formatted" : "Vill du som optiker arbeta med något som främjar en mer hållbar framtid?\n\nÄr du en dedikerad Leg Optiker som brinner för ögonhälsa och vill utvecklas i ett innovativt bolag som tar ansvar med kunden i fokus? \n Synsam Recycling Outlet är ett unikt koncept med fokus på miljö och hållbarhet, där vi erbjuder ett sortiment med bågar skapade av återvunnen plast, second hand och outletkollektioner. Framgången är ett faktum och vi fortsätter nu växa i hela Norden. Näst på tur är nu vår nya butik på Storgatan i Halmstad!\n Läs mer om vårt framgångsrika och nytänkande koncept här: https://www.synsam.se/outlet\n\nOm rollen\n Hos Synsam Recycling Outlet är Leg Optikern i centrum och en nyckelfaktor för vår framgång. I butiken jobbar du i ett kunnigt team tillsammans med butikschef och säljare som engagerat erbjuder våra kunder de bästa lösningarna för att se bra, och se bra ut! \n Huvuduppgiften i din roll som Leg Optiker är att noggrant genomföra synundersökningar samt ordinera och rekommendera synhjälpmedel till våra kunder på högsta kliniska nivå. \n Vi strävar efter att vara det mest hållbara och innovativa företaget i branschen och har höga ambitioner inom ögonhälsa, torra ögon, sport och myopikontroll.\n\nDu erbjuds\n • En chans att vara med på vår snabba tillväxtresa, där du kommer få vara med och göra skillnad och utmana branschen\n • Klimatet inom Synsam Recycling Outlet präglas av engagemang, driv och positivitet och du kommer arbeta i team tillsammans med andra motiverade kollegor\n • Du har stora chanser till vidare karriär inom företaget\n\nVill du jobba med oss?\nVår kedja expanderar nu i hela Norden och vi söker nu dig som vill vara med på resan!\n Är du en Legitimerad Optiker som värdesätter kundmötet, är lyhörd för kundens behov och har ett stort fokus på kvalitet? Vill arbeta i ett företag med fokus på hållbarhet där du har möjlighet att göra skillnad genom att erbjuda produkter som skapats av cirkulära flöden? Kul, då vill vi träffa dig!\n\nVi hanterar ansökningar på löpande basis och tjänsten kan komma att tillsättas innan sista ansökningsdag, så vänta inte med att söka. Tjänsten kan anpassas till hel eller deltid beroende på vad som passar dig som sökande bäst.\n\nHar du frågor om tjänsten är du välkommen att kontakta Nina Sellberg, Rekryteringsansvarig på:\nnina.sellberg@synsam.com\n\nVarmt välkommen med din ansökan! ",
        "conditions" : "Heltid/\r\nEj specificerat",
        "text" : "Vill du som optiker arbeta med något som främjar en mer hållbar framtid?\n\nÄr du en dedikerad Leg Optiker som brinner för ögonhälsa och vill utvecklas i ett innovativt bolag som tar ansvar med kunden i fokus? \n Synsam Recycling Outlet är ett unikt koncept med fokus på miljö och hållbarhet, där vi erbjuder ett sortiment med bågar skapade av återvunnen plast, second hand och outletkollektioner. Framgången är ett faktum och vi fortsätter nu växa i hela Norden. Näst på tur är nu vår nya butik på Storgatan i Halmstad!\n Läs mer om vårt framgångsrika och nytänkande koncept här: https://www.synsam.se/outlet\n\nOm rollen\n Hos Synsam Recycling Outlet är Leg Optikern i centrum och en nyckelfaktor för vår framgång. I butiken jobbar du i ett kunnigt team tillsammans med butikschef och säljare som engagerat erbjuder våra kunder de bästa lösningarna för att se bra, och se bra ut! \n Huvuduppgiften i din roll som Leg Optiker är att noggrant genomföra synundersökningar samt ordinera och rekommendera synhjälpmedel till våra kunder på högsta kliniska nivå. \n Vi strävar efter att vara det mest hållbara och innovativa företaget i branschen och har höga ambitioner inom ögonhälsa, torra ögon, sport och myopikontroll.\n\nDu erbjuds\n • En chans att vara med på vår snabba tillväxtresa, där du kommer få vara med och göra skillnad och utmana branschen\n • Klimatet inom Synsam Recycling Outlet präglas av engagemang, driv och positivitet och du kommer arbeta i team tillsammans med andra motiverade kollegor\n • Du har stora chanser till vidare karriär inom företaget\n\nVill du jobba med oss?\nVår kedja expanderar nu i hela Norden och vi söker nu dig som vill vara med på resan!\n Är du en Legitimerad Optiker som värdesätter kundmötet, är lyhörd för kundens behov och har ett stort fokus på kvalitet? Vill arbeta i ett företag med fokus på hållbarhet där du har möjlighet att göra skillnad genom att erbjuda produkter som skapats av cirkulära flöden? Kul, då vill vi träffa dig!\n\nVi hanterar ansökningar på löpande basis och tjänsten kan komma att tillsättas innan sista ansökningsdag, så vänta inte med att söka. Tjänsten kan anpassas till hel eller deltid beroende på vad som passar dig som sökande bäst.\n\nHar du frågor om tjänsten är du välkommen att kontakta Nina Sellberg, Rekryteringsansvarig på:\nnina.sellberg@synsam.com\n\nVarmt välkommen med din ansökan!"
      },
      "headline" : "Optiker inom hållbarhet & miljö -Synsam Recycling Outlet- Nyöppning",
      "driving_license" : null,
      "employer" : {
        "email" : null,
        "phone_number" : null,
        "organization_number" : "5567687248",
        "name" : "Synsam Group Sweden AB",
        "url" : "http://www.synsam.se",
        "workplace" : "Synsam Group Sverige AB"
      },
      "removed_date" : null,
      "logo_url" : "https://www.arbetsformedlingen.se/rest/arbetsgivare/rest/af/v3/organisation/5567687248/logotyper/logo.png",
      "last_publication_date" : "2022-09-30T23:59:59",
      "number_of_vacancies" : 1,
      "occupation" : {
        "concept_id" : "HWPy_9jT_TX2",
        "label" : "Optiker",
        "legacy_ams_taxonomy_id" : "5704"
      },
      "occupation_group" : {
        "concept_id" : "PUhV_DVQ_MM6",
        "label" : "Optiker",
        "legacy_ams_taxonomy_id" : "2284"
      },
      "employment_type" : {
        "concept_id" : "PFZr_Syz_cUq",
        "label" : "Vanlig anställning",
        "legacy_ams_taxonomy_id" : "1"
      },
      "webpage_url" : "https://arbetsformedlingen.se/platsbanken/annonser/26393737",
      "driving_license_required" : false,
      "application_contacts" : [ ],
      "duration" : {
        "concept_id" : "a7uU_j21_mkL",
        "label" : "Tills vidare",
        "legacy_ams_taxonomy_id" : "1"
      },
      "nice_to_have" : {
        "education_level" : [ ],
        "work_experiences" : [ ],
        "skills" : [ ],
        "education" : [ ],
        "languages" : [ ]
      },
      "application_details" : {
        "via_af" : false,
        "email" : null,
        "other" : null,
        "reference" : null,
        "url" : "https://jobb.synsam.se/jobs/rm?rmpage=job&rmjob=1366&ref=https%3A%2F%2Farbetsformedlingen.se%2Fplatsbanken%2F",
        "information" : null
      },
      "source_type" : "VIA_PLATSBANKEN_DXA",
      "application_deadline" : "2022-09-30T23:59:59",
      "external_id" : "46-556768-7248-1366",
      "workplace_address" : {
        "coordinates" : [ 13.003822, 55.60498 ],
        "city" : null,
        "postcode" : null,
        "municipality" : "Malmö",
        "region_concept_id" : "CaRE_1nn_cSU",
        "region" : "Skåne län",
        "country_code" : "199",
        "region_code" : "12",
        "municipality_concept_id" : "oYPt_yRA_Smm",
        "country_concept_id" : "i46j_HmG_v64",
        "municipality_code" : "1280",
        "street_address" : null,
        "country" : "Sverige"
      },
      "id" : "26393737",
      "experience_required" : true,
      "working_hours_type" : {
        "concept_id" : "6YE1_gAC_R2G",
        "label" : "Heltid",
        "legacy_ams_taxonomy_id" : "1"
      },
      "access" : null,
      "timestamp" : 1660111293954,
      "must_have" : {
        "education_level" : [ ],
        "work_experiences" : [ {
          "concept_id" : "HWPy_9jT_TX2",
          "weight" : 10,
          "label" : "Optiker/Optometrist",
          "legacy_ams_taxonomy_id" : "5704"
        } ],
        "skills" : [ ],
        "education" : [ ],
        "languages" : [ ]
      },
      "occupation_field" : {
        "concept_id" : "NYW6_mP6_vwf",
        "label" : "Hälso- och sjukvård",
        "legacy_ams_taxonomy_id" : "8"
      },
      "scope_of_work" : {
        "min" : 100,
        "max" : 100
      },
      "salary_type" : {
        "concept_id" : "oG8G_9cW_nRf",
        "label" : "Fast månads- vecko- eller timlön",
        "legacy_ams_taxonomy_id" : "1"
      },
      "removed" : false,
      "salary_description" : "Fast och rörlig lön enligt kollektivavtal",
      "access_to_own_car" : false,
      "publication_date" : "2022-08-10T08:01:33"
    },
    "name" : "Optiker inom hållbarhet & miljö -Synsam Recycling Outlet- Nyöppning",
    "user" : "hannes"
  },
  "sha1" : "ccbcf5525862fb9ad2fa9defef480d4837cbe3d5",
  "annotations" : [ {
    "preferred-label" : "Optiker",
    "sentiment" : "MUST_HAVE",
    "type" : "isco-level-4",
    "start-position" : 0,
    "end-position" : 7,
    "concept-id" : "vFoK_u5s_7sT",
    "matched-string" : "optiker",
    "annotation-id" : 0
  }, {
    "preferred-label" : "Optiker",
    "sentiment" : "MUST_HAVE",
    "type" : "isco-level-4",
    "start-position" : 80,
    "end-position" : 87,
    "concept-id" : "vFoK_u5s_7sT",
    "matched-string" : "optiker",
    "annotation-id" : 1
  }, {
    "preferred-label" : "Optiker",
    "sentiment" : "MUST_HAVE",
    "type" : "isco-level-4",
    "start-position" : 165,
    "end-position" : 172,
    "concept-id" : "vFoK_u5s_7sT",
    "matched-string" : "optiker",
    "annotation-id" : 2
  }, {
    "preferred-label" : "Butik",
    "sentiment" : "MUST_HAVE",
    "type" : "keyword",
    "start-position" : 555,
    "end-position" : 560,
    "concept-id" : "xLsd_zjY_5wr",
    "matched-string" : "butik",
    "annotation-id" : 3
  }, {
    "preferred-label" : "butikschef",
    "sentiment" : "MUST_HAVE",
    "type" : "esco-occupation",
    "start-position" : 833,
    "end-position" : 843,
    "concept-id" : "bRZF_sdj_cdk",
    "matched-string" : "butikschef",
    "annotation-id" : 4
  }, {
    "preferred-label" : "Säljare",
    "sentiment" : "MUST_HAVE",
    "type" : "keyword",
    "start-position" : 848,
    "end-position" : 855,
    "concept-id" : "rDcj_Tao_TJJ",
    "matched-string" : "säljare",
    "annotation-id" : 5
  }, {
    "preferred-label" : "Optiker",
    "sentiment" : "MUST_HAVE",
    "type" : "isco-level-4",
    "start-position" : 979,
    "end-position" : 986,
    "concept-id" : "vFoK_u5s_7sT",
    "matched-string" : "optiker",
    "annotation-id" : 6
  }, {
    "preferred-label" : "främja ögonhälsa",
    "type" : "esco-skill",
    "start-position" : 1230,
    "end-position" : 1239,
    "concept-id" : "TiUA_Arm_EPY",
    "matched-string" : "ögonhälsa",
    "annotation-id" : 10
  }, {
    "preferred-label" : "Sport",
    "sentiment" : "MUST_HAVE",
    "type" : "keyword",
    "start-position" : 1253,
    "end-position" : 1258,
    "concept-id" : "oiV9_drz_NYC",
    "matched-string" : "sport",
    "annotation-id" : 7
  }, {
    "preferred-label" : "Optiker",
    "sentiment" : "MUST_HAVE",
    "type" : "isco-level-4",
    "start-position" : 1754,
    "end-position" : 1761,
    "concept-id" : "vFoK_u5s_7sT",
    "matched-string" : "optiker",
    "annotation-id" : 8
  }, {
    "preferred-label" : "Heltid/Deltid",
    "type" : "worktime-extent",
    "start-position" : 2194,
    "end-position" : 2210,
    "concept-id" : "hGCt_6Ni_XPz",
    "matched-string" : "hel eller deltid",
    "annotation-id" : 11
  } ],
  "text" : "Optiker inom hållbarhet & miljö -Synsam Recycling Outlet- Nyöppning\nVill du som optiker arbeta med något som främjar en mer hållbar framtid?\n\nÄr du en dedikerad Leg Optiker som brinner för ögonhälsa och vill utvecklas i ett innovativt bolag som tar ansvar med kunden i fokus? \n Synsam Recycling Outlet är ett unikt koncept med fokus på miljö och hållbarhet, där vi erbjuder ett sortiment med bågar skapade av återvunnen plast, second hand och outletkollektioner. Framgången är ett faktum och vi fortsätter nu växa i hela Norden. Näst på tur är nu vår nya butik på Storgatan i Halmstad!\n Läs mer om vårt framgångsrika och nytänkande koncept här: https://www.synsam.se/outlet\n\nOm rollen\n Hos Synsam Recycling Outlet är Leg Optikern i centrum och en nyckelfaktor för vår framgång. I butiken jobbar du i ett kunnigt team tillsammans med butikschef och säljare som engagerat erbjuder våra kunder de bästa lösningarna för att se bra, och se bra ut! \n Huvuduppgiften i din roll som Leg Optiker är att noggrant genomföra synundersökningar samt ordinera och rekommendera synhjälpmedel till våra kunder på högsta kliniska nivå. \n Vi strävar efter att vara det mest hållbara och innovativa företaget i branschen och har höga ambitioner inom ögonhälsa, torra ögon, sport och myopikontroll.\n\nDu erbjuds\n • En chans att vara med på vår snabba tillväxtresa, där du kommer få vara med och göra skillnad och utmana branschen\n • Klimatet inom Synsam Recycling Outlet präglas av engagemang, driv och positivitet och du kommer arbeta i team tillsammans med andra motiverade kollegor\n • Du har stora chanser till vidare karriär inom företaget\n\nVill du jobba med oss?\nVår kedja expanderar nu i hela Norden och vi söker nu dig som vill vara med på resan!\n Är du en Legitimerad Optiker som värdesätter kundmötet, är lyhörd för kundens behov och har ett stort fokus på kvalitet? Vill arbeta i ett företag med fokus på hållbarhet där du har möjlighet att göra skillnad genom att erbjuda produkter som skapats av cirkulära flöden? Kul, då vill vi träffa dig!\n\nVi hanterar ansökningar på löpande basis och tjänsten kan komma att tillsättas innan sista ansökningsdag, så vänta inte med att söka. Tjänsten kan anpassas till hel eller deltid beroende på vad som passar dig som sökande bäst.\n\nHar du frågor om tjänsten är du välkommen att kontakta Nina Sellberg, Rekryteringsansvarig på:\nnina.sellberg@synsam.com\n\nVarmt välkommen med din ansökan!"
}