{
  "meta" : {
    "jobad" : {
      "description" : {
        "requirements" : null,
        "needs" : null,
        "company_information" : null,
        "text_formatted" : "I Mölndals stad är vi stolta över att ha Sveriges viktigaste jobb där vi tillsammans skapar bästa möjliga vardag för våra medborgare. Med mod och kreativitet utvecklar vi våra verksamheter och bidrar till att Mölndal blir en ännu bättre plats att leva och jobba i. Välkommen att göra skillnad i människors vardag varje dag!\n\nServiceförvaltningen har ett viktigt och spännande uppdrag. Vi levererar, samordnar och utvecklar service till Mölndals stads förvaltningar. Till invånarna ger vi service i form av Kontaktcenter Mölndal. Förvaltningen har drygt 300 medarbetare. Vi är organiserade i fem verksamhetsområden; måltid, lokalvård, fastighetsservice, transport, post och bud samt stadsservice.\n\r\n\r\nARBETSUPPGIFTER\nVi söker nu en serviceinriktad kock som har ett stort engagemang för måltiden och ett genuint intresse för att leverera god och näringsriktig mat.\n\nI köket på Brattåsgårdens äldreboende arbetar 5 personer. Tillagningsköket är nybyggt och maskinparken ger oss alla förutsättningar för att kunna producera mat i högsta klass.\nVi har utskick till två andra äldreboenden i kommunen. Vi har en matsal på boendet och intern catering är en del av det dagliga arbetet. Totalt tillagar vi 140 portioner till lunch och 140 portioner till kvällsmål. Vi satsar på att laga mat ifrån grunden. Tillagningen av maten är främst inriktad mot svensk husmanskost. Ett viktigt och prioriterat mål för oss är att arbeta med att höja andelen ekologiska råvaruinköp.\n\nUtöver traditionell matlagning ingår det bland annat i arbetsuppgifterna: \n- inköp via Proceedo som är stadens beställningsprogram. \n- ha en bra struktur och logistik i ditt dagliga arbete.\n- följa HACCP program som säkerställer kvalitén på vår produktion. \n- delaktig i framtagande av nya menyer\n\r\n\r\nKVALIFIKATIONER\nDu ska ha 3-årig kockutbildning, eller annan av arbetsgivaren bedömd likvärdig utbildning. Meriterande är om du har erfarenhet av arbete i storkök. Du ska ha stor kunskap avseende \nspecial-och allergikoster. God datavana är ett krav. \n\nVi tror att du som söker har ett brinnande intresse för att laga god mat och vill utvecklas inom yrket. Du är glad, social och trivs med att arbeta i en grupp. Du ska vara engagerad, kreativ, serviceinriktad och ser möjligheter, inte hinder. Att du har god samarbetsförmåga med såväl kunder, gäster och kollegor är en förutsättning för verksamheten. \n\nStor vikt läggs vid personlig lämplighet. \r\n\nÖVRIGT\nVi ser mångfald som en styrka och välkomnar därför sökande med olika bakgrund.\n\nBehöver du hjälp med att söka tjänsten? Kontakta kundservice på 0771-693 693.\n\nVi vill upplysa om att din ansökan är en offentlig handling enligt offentlighetsprincipen.\n\nInför rekryteringsarbetet har vi tagit ställning till rekryteringskanaler och marknadsföring. Vi undanber oss därför bestämt kontakt med mediesäljare, rekryteringssajter och liknande.",
        "conditions" : "Heltid. \r\nTillsvidareanställning, tillträde: Efter överenskommelse.",
        "text" : "I Mölndals stad är vi stolta över att ha Sveriges viktigaste jobb där vi tillsammans skapar bästa möjliga vardag för våra medborgare. Med mod och kreativitet utvecklar vi våra verksamheter och bidrar till att Mölndal blir en ännu bättre plats att leva och jobba i. Välkommen att göra skillnad i människors vardag varje dag!\n\nServiceförvaltningen har ett viktigt och spännande uppdrag. Vi levererar, samordnar och utvecklar service till Mölndals stads förvaltningar. Till invånarna ger vi service i form av Kontaktcenter Mölndal. Förvaltningen har drygt 300 medarbetare. Vi är organiserade i fem verksamhetsområden; måltid, lokalvård, fastighetsservice, transport, post och bud samt stadsservice.\n\r\n\r\nARBETSUPPGIFTER\nVi söker nu en serviceinriktad kock som har ett stort engagemang för måltiden och ett genuint intresse för att leverera god och näringsriktig mat.\n\nI köket på Brattåsgårdens äldreboende arbetar 5 personer. Tillagningsköket är nybyggt och maskinparken ger oss alla förutsättningar för att kunna producera mat i högsta klass.\nVi har utskick till två andra äldreboenden i kommunen. Vi har en matsal på boendet och intern catering är en del av det dagliga arbetet. Totalt tillagar vi 140 portioner till lunch och 140 portioner till kvällsmål. Vi satsar på att laga mat ifrån grunden. Tillagningen av maten är främst inriktad mot svensk husmanskost. Ett viktigt och prioriterat mål för oss är att arbeta med att höja andelen ekologiska råvaruinköp.\n\nUtöver traditionell matlagning ingår det bland annat i arbetsuppgifterna: \n- inköp via Proceedo som är stadens beställningsprogram. \n- ha en bra struktur och logistik i ditt dagliga arbete.\n- följa HACCP program som säkerställer kvalitén på vår produktion. \n- delaktig i framtagande av nya menyer\n\r\n\r\nKVALIFIKATIONER\nDu ska ha 3-årig kockutbildning, eller annan av arbetsgivaren bedömd likvärdig utbildning. Meriterande är om du har erfarenhet av arbete i storkök. Du ska ha stor kunskap avseende \nspecial-och allergikoster. God datavana är ett krav. \n\nVi tror att du som söker har ett brinnande intresse för att laga god mat och vill utvecklas inom yrket. Du är glad, social och trivs med att arbeta i en grupp. Du ska vara engagerad, kreativ, serviceinriktad och ser möjligheter, inte hinder. Att du har god samarbetsförmåga med såväl kunder, gäster och kollegor är en förutsättning för verksamheten. \n\nStor vikt läggs vid personlig lämplighet. \r\n\nÖVRIGT\nVi ser mångfald som en styrka och välkomnar därför sökande med olika bakgrund.\n\nBehöver du hjälp med att söka tjänsten? Kontakta kundservice på 0771-693 693.\n\nVi vill upplysa om att din ansökan är en offentlig handling enligt offentlighetsprincipen.\n\nInför rekryteringsarbetet har vi tagit ställning till rekryteringskanaler och marknadsföring. Vi undanber oss därför bestämt kontakt med mediesäljare, rekryteringssajter och liknande."
      },
      "headline" : "Kock till Brattåsgården",
      "driving_license" : null,
      "employer" : {
        "email" : null,
        "phone_number" : null,
        "organization_number" : "2120001363",
        "name" : "Mölndals kommun",
        "url" : null,
        "workplace" : "Mölndals stad, Serviceförvaltningen"
      },
      "removed_date" : null,
      "logo_url" : "https://www.arbetsformedlingen.se/rest/arbetsgivare/rest/af/v3/organisation/2120001363/logotyper/logo.png",
      "last_publication_date" : "2022-08-28T23:59:59",
      "number_of_vacancies" : 2,
      "occupation" : {
        "concept_id" : "Vg3d_Azf_p5Y",
        "label" : "Kock, storhushåll",
        "legacy_ams_taxonomy_id" : "7664"
      },
      "occupation_group" : {
        "concept_id" : "BStc_SJh_DKG",
        "label" : "Kockar och kallskänkor",
        "legacy_ams_taxonomy_id" : "5120"
      },
      "employment_type" : {
        "concept_id" : "PFZr_Syz_cUq",
        "label" : "Vanlig anställning",
        "legacy_ams_taxonomy_id" : "1"
      },
      "webpage_url" : "https://arbetsformedlingen.se/platsbanken/annonser/26403873",
      "driving_license_required" : false,
      "application_contacts" : [ {
        "description" : "David Franson Sundelin",
        "email" : null,
        "telephone" : "031- 315 13 33",
        "name" : null,
        "contact_type" : "Enhetschef"
      } ],
      "duration" : {
        "concept_id" : "a7uU_j21_mkL",
        "label" : "Tills vidare",
        "legacy_ams_taxonomy_id" : "1"
      },
      "nice_to_have" : {
        "education_level" : [ ],
        "work_experiences" : [ ],
        "skills" : [ ],
        "education" : [ ],
        "languages" : [ ]
      },
      "application_details" : {
        "via_af" : false,
        "email" : null,
        "other" : null,
        "reference" : "C97249",
        "url" : "https://recruit.visma.com/Public/Apply.aspx?guidAssignment=7bc8b127-36cf-4af3-bc3a-d4cb55a73d83&publishCode=AMS&TK=5302a921-814f-44ef-8d86-2db3dd1c5768",
        "information" : null
      },
      "source_type" : "VIA_PLATSBANKEN_DXA",
      "application_deadline" : "2022-08-28T23:59:59",
      "external_id" : "46-212000-1363-7BC8B12736CF4AF3BC3AD4CB55A73D83",
      "workplace_address" : {
        "coordinates" : [ 12.016667, 57.65 ],
        "city" : null,
        "postcode" : null,
        "municipality" : "Mölndal",
        "region_concept_id" : "zdoY_6u5_Krt",
        "region" : "Västra Götalands län",
        "country_code" : "199",
        "region_code" : "14",
        "municipality_concept_id" : "mc45_ki9_Bv3",
        "country_concept_id" : "i46j_HmG_v64",
        "municipality_code" : "1481",
        "street_address" : null,
        "country" : "Sverige"
      },
      "id" : "26403873",
      "experience_required" : true,
      "working_hours_type" : {
        "concept_id" : "6YE1_gAC_R2G",
        "label" : "Heltid",
        "legacy_ams_taxonomy_id" : "1"
      },
      "access" : null,
      "timestamp" : 1660296614837,
      "must_have" : {
        "education_level" : [ ],
        "work_experiences" : [ {
          "concept_id" : "Vg3d_Azf_p5Y",
          "weight" : 10,
          "label" : "Kock, storhushåll",
          "legacy_ams_taxonomy_id" : "7664"
        } ],
        "skills" : [ ],
        "education" : [ ],
        "languages" : [ ]
      },
      "occupation_field" : {
        "concept_id" : "ScKy_FHB_7wT",
        "label" : "Hotell, restaurang, storhushåll",
        "legacy_ams_taxonomy_id" : "7"
      },
      "scope_of_work" : {
        "min" : 100,
        "max" : 100
      },
      "salary_type" : {
        "concept_id" : "oG8G_9cW_nRf",
        "label" : "Fast månads- vecko- eller timlön",
        "legacy_ams_taxonomy_id" : "1"
      },
      "removed" : false,
      "salary_description" : "Enligt avtal.",
      "access_to_own_car" : false,
      "publication_date" : "2022-08-15T00:00:00"
    },
    "name" : "Kock till Brattåsgården",
    "user" : "hannes"
  },
  "sha1" : "b46b291a42c35d7361099bdccb119f9866510c3a",
  "annotations" : [ {
    "preferred-label" : "kock",
    "sentiment" : "MUST_HAVE",
    "type" : "esco-occupation",
    "start-position" : 0,
    "end-position" : 4,
    "concept-id" : "Ti2H_QoQ_EMX",
    "matched-string" : "kock",
    "annotation-id" : 0
  }, {
    "preferred-label" : "Mölndal",
    "type" : "municipality",
    "start-position" : 26,
    "end-position" : 39,
    "concept-id" : "mc45_ki9_Bv3",
    "matched-string" : "Mölndals stad",
    "annotation-id" : 9
  }, {
    "preferred-label" : "Mölndal",
    "type" : "municipality",
    "start-position" : 233,
    "end-position" : 240,
    "concept-id" : "mc45_ki9_Bv3",
    "matched-string" : "Mölndal",
    "annotation-id" : 11
  }, {
    "preferred-label" : "Mölndal",
    "type" : "municipality",
    "start-position" : 460,
    "end-position" : 474,
    "concept-id" : "mc45_ki9_Bv3",
    "matched-string" : "Mölndals stads",
    "annotation-id" : 10
  }, {
    "preferred-label" : "Mölndal",
    "type" : "municipality",
    "start-position" : 544,
    "end-position" : 551,
    "concept-id" : "mc45_ki9_Bv3",
    "matched-string" : "Mölndal",
    "annotation-id" : 12
  }, {
    "preferred-label" : "Lokalvård",
    "sentiment" : "NOT_RELEVANT",
    "type" : "keyword",
    "start-position" : 647,
    "end-position" : 656,
    "concept-id" : "dpoa_kdf_VRa",
    "matched-string" : "lokalvård",
    "annotation-id" : 1
  }, {
    "preferred-label" : "kock",
    "sentiment" : "MUST_HAVE",
    "type" : "esco-occupation",
    "start-position" : 771,
    "end-position" : 775,
    "concept-id" : "Ti2H_QoQ_EMX",
    "matched-string" : "kock",
    "annotation-id" : 2
  }, {
    "preferred-label" : "Äldreboende",
    "sentiment" : "NOT_RELEVANT",
    "type" : "skill",
    "start-position" : 914,
    "end-position" : 925,
    "concept-id" : "tykJ_BZQ_Wer",
    "matched-string" : "äldreboende",
    "annotation-id" : 13
  }, {
    "preferred-label" : "Äldreboende",
    "sentiment" : "NOT_RELEVANT",
    "type" : "skill",
    "start-position" : 1094,
    "end-position" : 1106,
    "concept-id" : "tykJ_BZQ_Wer",
    "matched-string" : "äldreboenden",
    "annotation-id" : 14
  }, {
    "preferred-label" : "Mölndal",
    "type" : "municipality",
    "start-position" : 1109,
    "end-position" : 1117,
    "concept-id" : "mc45_ki9_Bv3",
    "matched-string" : "kommunen",
    "annotation-id" : 15
  }, {
    "preferred-label" : "Husmanskost",
    "sentiment" : "NOT_RELEVANT",
    "type" : "skill",
    "start-position" : 1372,
    "end-position" : 1383,
    "concept-id" : "HfAs_ZWA_Jvv",
    "matched-string" : "husmanskost",
    "annotation-id" : 3
  }, {
    "preferred-label" : "Inköpare",
    "sentiment" : "MUST_HAVE",
    "type" : "occupation-name",
    "start-position" : 1562,
    "end-position" : 1567,
    "concept-id" : "KVVN_sqH_Wpz",
    "matched-string" : "inköp",
    "annotation-id" : 16
  }, {
    "preferred-label" : "Logistik",
    "sentiment" : "MUST_HAVE",
    "type" : "skill",
    "start-position" : 1643,
    "end-position" : 1651,
    "concept-id" : "yXmf_iKi_7ci",
    "matched-string" : "logistik",
    "annotation-id" : 4
  }, {
    "preferred-label" : "tillämpa HACCP-systemet",
    "sentiment" : "MUST_HAVE",
    "type" : "esco-skill",
    "start-position" : 1677,
    "end-position" : 1696,
    "concept-id" : "4Xnw_Na4_bzi",
    "matched-string" : "följa HACCP program",
    "annotation-id" : 17
  }, {
    "preferred-label" : "komponera menyer",
    "sentiment" : "MUST_HAVE",
    "type" : "esco-skill",
    "start-position" : 1756,
    "end-position" : 1781,
    "concept-id" : "XyXa_Cd6_6AU",
    "matched-string" : "framtagande av nya menyer",
    "annotation-id" : 18
  }, {
    "preferred-label" : "Gymnasial utbildning, 3 år",
    "sentiment" : "MUST_HAVE",
    "type" : "sun-education-level-2",
    "start-position" : 1812,
    "end-position" : 1818,
    "concept-id" : "7wEe_uui_q7S",
    "matched-string" : "3-årig",
    "annotation-id" : 19
  }, {
    "preferred-label" : "Kockutbildning",
    "sentiment" : "MUST_HAVE",
    "type" : "keyword",
    "start-position" : 1819,
    "end-position" : 1833,
    "concept-id" : "62ja_BdV_Xdo",
    "matched-string" : "kockutbildning",
    "annotation-id" : 5
  }, {
    "preferred-label" : "Storkök",
    "sentiment" : "NICE_TO_HAVE",
    "type" : "skill",
    "start-position" : 1941,
    "end-position" : 1948,
    "concept-id" : "GQ9R_2Za_Awt",
    "matched-string" : "storkök",
    "annotation-id" : 6
  }, {
    "preferred-label" : "Specialkost",
    "type" : "skill",
    "start-position" : 1983,
    "end-position" : 2008,
    "concept-id" : "JYKn_PRX_tif",
    "matched-string" : "special-och allergikoster",
    "annotation-id" : 20
  }, {
    "preferred-label" : "kundservice",
    "sentiment" : "NOT_RELEVANT",
    "type" : "esco-skill",
    "start-position" : 2571,
    "end-position" : 2582,
    "concept-id" : "WykS_79d_Fz7",
    "matched-string" : "kundservice",
    "annotation-id" : 7
  }, {
    "preferred-label" : "Marknadsföring",
    "sentiment" : "NOT_RELEVANT",
    "type" : "sun-education-field-4",
    "start-position" : 2771,
    "end-position" : 2785,
    "concept-id" : "zTc5_e4U_Qsf",
    "matched-string" : "marknadsföring",
    "annotation-id" : 8
  } ],
  "text" : "Kock till Brattåsgården\nI Mölndals stad är vi stolta över att ha Sveriges viktigaste jobb där vi tillsammans skapar bästa möjliga vardag för våra medborgare. Med mod och kreativitet utvecklar vi våra verksamheter och bidrar till att Mölndal blir en ännu bättre plats att leva och jobba i. Välkommen att göra skillnad i människors vardag varje dag!\n\nServiceförvaltningen har ett viktigt och spännande uppdrag. Vi levererar, samordnar och utvecklar service till Mölndals stads förvaltningar. Till invånarna ger vi service i form av Kontaktcenter Mölndal. Förvaltningen har drygt 300 medarbetare. Vi är organiserade i fem verksamhetsområden; måltid, lokalvård, fastighetsservice, transport, post och bud samt stadsservice.\n\r\n\r\nARBETSUPPGIFTER\nVi söker nu en serviceinriktad kock som har ett stort engagemang för måltiden och ett genuint intresse för att leverera god och näringsriktig mat.\n\nI köket på Brattåsgårdens äldreboende arbetar 5 personer. Tillagningsköket är nybyggt och maskinparken ger oss alla förutsättningar för att kunna producera mat i högsta klass.\nVi har utskick till två andra äldreboenden i kommunen. Vi har en matsal på boendet och intern catering är en del av det dagliga arbetet. Totalt tillagar vi 140 portioner till lunch och 140 portioner till kvällsmål. Vi satsar på att laga mat ifrån grunden. Tillagningen av maten är främst inriktad mot svensk husmanskost. Ett viktigt och prioriterat mål för oss är att arbeta med att höja andelen ekologiska råvaruinköp.\n\nUtöver traditionell matlagning ingår det bland annat i arbetsuppgifterna: \n- inköp via Proceedo som är stadens beställningsprogram. \n- ha en bra struktur och logistik i ditt dagliga arbete.\n- följa HACCP program som säkerställer kvalitén på vår produktion. \n- delaktig i framtagande av nya menyer\n\r\n\r\nKVALIFIKATIONER\nDu ska ha 3-årig kockutbildning, eller annan av arbetsgivaren bedömd likvärdig utbildning. Meriterande är om du har erfarenhet av arbete i storkök. Du ska ha stor kunskap avseende \nspecial-och allergikoster. God datavana är ett krav. \n\nVi tror att du som söker har ett brinnande intresse för att laga god mat och vill utvecklas inom yrket. Du är glad, social och trivs med att arbeta i en grupp. Du ska vara engagerad, kreativ, serviceinriktad och ser möjligheter, inte hinder. Att du har god samarbetsförmåga med såväl kunder, gäster och kollegor är en förutsättning för verksamheten. \n\nStor vikt läggs vid personlig lämplighet. \r\n\nÖVRIGT\nVi ser mångfald som en styrka och välkomnar därför sökande med olika bakgrund.\n\nBehöver du hjälp med att söka tjänsten? Kontakta kundservice på 0771-693 693.\n\nVi vill upplysa om att din ansökan är en offentlig handling enligt offentlighetsprincipen.\n\nInför rekryteringsarbetet har vi tagit ställning till rekryteringskanaler och marknadsföring. Vi undanber oss därför bestämt kontakt med mediesäljare, rekryteringssajter och liknande."
}