{
  "meta" : {
    "name" : "101 Förbränning och introduktion till det svenska energisystemet",
    "modulens id" : "26499",
    "type" : "AUB",
    "utbildningsid" : "124955",
    "utbildningsnamn" : ""
  },
  "sha1" : "a24aab4981a450fd5067587e403e872d356ff699",
  "annotations" : [ {
    "preferred-label" : "Energiteknik",
    "type" : "skill",
    "start-position" : 51,
    "end-position" : 65,
    "concept-id" : "tNHP_38u_Pjt",
    "matched-string" : "energisystemet",
    "annotation-id" : 3
  }, {
    "preferred-label" : "Energiproduktion, förnyelsebar",
    "type" : "skill",
    "start-position" : 116,
    "end-position" : 134,
    "concept-id" : "BkCz_fjg_Am7",
    "matched-string" : "produktionsmetoder",
    "annotation-id" : 6
  }, {
    "preferred-label" : "Värmeteknik",
    "type" : "skill",
    "start-position" : 204,
    "end-position" : 294,
    "concept-id" : "NbJ2_swE_yJ1",
    "matched-string" : "Olika typer av pannor studeras, dess konstruktion och tillämpningar för \n        värme och",
    "annotation-id" : 5
  }, {
    "preferred-label" : "Kraftvärmeteknik",
    "type" : "skill",
    "start-position" : 295,
    "end-position" : 315,
    "concept-id" : "467D_aM6_q3G",
    "matched-string" : "kraftvärmeproduktion",
    "annotation-id" : 4
  }, {
    "preferred-label" : "Förbränningsteknik",
    "type" : "skill",
    "start-position" : 319,
    "end-position" : 341,
    "concept-id" : "SHLk_qhb_wEx",
    "matched-string" : "Förbränningsreaktioner",
    "annotation-id" : 7
  }, {
    "preferred-label" : "Förbränningsteknik",
    "type" : "skill",
    "start-position" : 343,
    "end-position" : 354,
    "concept-id" : "SHLk_qhb_wEx",
    "matched-string" : "Stökiometri",
    "annotation-id" : 8
  }, {
    "preferred-label" : "termodynamik",
    "type" : "esco-skill",
    "start-position" : 356,
    "end-position" : 365,
    "concept-id" : "pxHr_kU1_GdT",
    "matched-string" : "Termokemi",
    "annotation-id" : 9
  }, {
    "preferred-label" : "Svenska",
    "sentiment" : "OFFERED",
    "type" : "language",
    "start-position" : 572,
    "end-position" : 579,
    "concept-id" : "zSLA_vw2_FXN",
    "matched-string" : "svenska",
    "annotation-id" : 1
  }, {
    "preferred-label" : "Energiteknik",
    "sentiment" : "OFFERED",
    "type" : "skill",
    "start-position" : 601,
    "end-position" : 613,
    "concept-id" : "tNHP_38u_Pjt",
    "matched-string" : "energiteknik",
    "annotation-id" : 2
  } ],
  "text" : "Modulens beskrivning:\n\"•\tIntroduktion till svenska energisystemet\n\n•\tNationella bränslens egenskaper, hantering och produktionsmetoder\n\n•\tFörbränningstekniker för fasta, flytande och gasformiga bränslen. Olika typer av pannor studeras, dess konstruktion och tillämpningar för \n        värme och kraftvärmeproduktion\n\n•\tFörbränningsreaktioner. Stökiometri. Termokemi.\n\n•\tBildning av föroreningar och möjligheten att begränsa dessa genom att förändra förhållandena vid förbränning.\n\"\n\nModulens mål:\nSyftet med samtliga kurser  är att deltagarna skall bli attraktiva för den svenska arbetsmarknaden inom energiteknik\n\n"
}