{
  "meta" : {
    "jobad" : {
      "description" : {
        "requirements" : null,
        "needs" : null,
        "company_information" : null,
        "text_formatted" : "<p>Vi söker dig som har ett brinnande intresse för IT och viljan att bidra med kunskaper/erfarenheter för en effektiv arbetsplats, och samtidigt utveckla dig själv inom IT. Vi tror att du har en servicenivå i världsklass och förstår varje kunds behov. Har du tidigare arbetat med kundsupport och/eller inom servicebranscher som restaurang, butik eller liknande så är det ett stort plus. Du tycker om att driva processer framåt och att hela tiden sträva efter att göra kunder och kollegor nöjda. Vi värdesätter omtänksamhet och god laganda för att tillsammans med övriga kollegor i teamet skapa en positiv och stimulerande arbetsmiljö.</p><p>I rollen som IT-Supporttekniker kommer du arbeta arbeta med Intern IT-support i kvalificerad Service Desk på ett modernt och stort företag. Alla frågor som är IT-relaterade hanteras av teamet och det är både högt och lågt i svårighetsgrad på ärendena. I huvudsak är ansvaret att agera support mot företagets interna användare som hanteras via telefon, mail och ärendehanteringssystem. Det finns goda utvecklingsmöjligheter och du kommer få möjligheter att arbeta med moderna tekniska tjänster, miljöer och verktyg.</p><p><br></p><p><strong>Om oss</strong></p><p>Vårt motto är att behandla våra kunder, anställda och varandra på samma sätt vi själva vill bli behandlade på. Det är inte så svårt när man tänker på det. Det gäller bara att varje dag vara beredd att göra \"det lilla extra\" eller i vårt fall \"Bryta ryggen\" för varandra.</p><p>Vi anser att om vi ska kunna leverera tjänster av högsta kvalité så måste vi ha engagerade medarbetare som brinner för och känner stolthet för sitt arbete. Vi vet att det vi investerar i våra medarbetare investerar de i våra kunder. Samarbetet ska bygga på förtroende och vår målsättning är att ConsultingIT skall vara det självklara valet i form av Partner och Arbetsgivare.</p><p>Vi kommer aldrig vända ryggen åt något för att det är jobbigt. Vi kommer aldrig skylla på att kunden inte förstår. Vi kommer aldrig acceptera annat än 100% av varandra.</p><p>Vi kommer ALLTID finnas här för våra kunder, partners och medarbetare.</p><p>Välkommen till ConsultingIT</p>",
        "conditions" : null,
        "text" : "Vi söker dig som har ett brinnande intresse för IT och viljan att bidra med kunskaper/erfarenheter för en effektiv arbetsplats, och samtidigt utveckla dig själv inom IT. Vi tror att du har en servicenivå i världsklass och förstår varje kunds behov. Har du tidigare arbetat med kundsupport och/eller inom servicebranscher som restaurang, butik eller liknande så är det ett stort plus. Du tycker om att driva processer framåt och att hela tiden sträva efter att göra kunder och kollegor nöjda. Vi värdesätter omtänksamhet och god laganda för att tillsammans med övriga kollegor i teamet skapa en positiv och stimulerande arbetsmiljö.\nI rollen som IT-Supporttekniker kommer du arbeta arbeta med Intern IT-support i kvalificerad Service Desk på ett modernt och stort företag. Alla frågor som är IT-relaterade hanteras av teamet och det är både högt och lågt i svårighetsgrad på ärendena. I huvudsak är ansvaret att agera support mot företagets interna användare som hanteras via telefon, mail och ärendehanteringssystem. Det finns goda utvecklingsmöjligheter och du kommer få möjligheter att arbeta med moderna tekniska tjänster, miljöer och verktyg.\n\n\nOm oss\nVårt motto är att behandla våra kunder, anställda och varandra på samma sätt vi själva vill bli behandlade på. Det är inte så svårt när man tänker på det. Det gäller bara att varje dag vara beredd att göra \"det lilla extra\" eller i vårt fall \"Bryta ryggen\" för varandra.\nVi anser att om vi ska kunna leverera tjänster av högsta kvalité så måste vi ha engagerade medarbetare som brinner för och känner stolthet för sitt arbete. Vi vet att det vi investerar i våra medarbetare investerar de i våra kunder. Samarbetet ska bygga på förtroende och vår målsättning är att ConsultingIT skall vara det självklara valet i form av Partner och Arbetsgivare.\nVi kommer aldrig vända ryggen åt något för att det är jobbigt. Vi kommer aldrig skylla på att kunden inte förstår. Vi kommer aldrig acceptera annat än 100% av varandra.\nVi kommer ALLTID finnas här för våra kunder, partners och medarbetare.\nVälkommen till ConsultingIT"
      },
      "headline" : "IT-Supporttekniker med start i augusti",
      "driving_license" : null,
      "employer" : {
        "email" : null,
        "phone_number" : null,
        "organization_number" : "5590810932",
        "name" : "ConsultingIT Stockholm AB",
        "url" : "www.consultingit.se",
        "workplace" : "Consultingit Stockholm AB"
      },
      "removed_date" : null,
      "logo_url" : "https://www.arbetsformedlingen.se/rest/arbetsgivare/rest/af/v3/arbetsplatser/86208843/logotyper/logo.png",
      "last_publication_date" : "2022-08-22T23:59:59",
      "number_of_vacancies" : 2,
      "occupation" : {
        "concept_id" : "KQty_E1u_cia",
        "label" : "Helpdesktekniker/Supporttekniker",
        "legacy_ams_taxonomy_id" : "7020"
      },
      "occupation_group" : {
        "concept_id" : "hmaC_cfi_UKg",
        "label" : "Supporttekniker, IT",
        "legacy_ams_taxonomy_id" : "3512"
      },
      "employment_type" : {
        "concept_id" : "PFZr_Syz_cUq",
        "label" : "Vanlig anställning",
        "legacy_ams_taxonomy_id" : "1"
      },
      "webpage_url" : "https://arbetsformedlingen.se/platsbanken/annonser/26235489",
      "driving_license_required" : false,
      "application_contacts" : [ {
        "description" : null,
        "email" : "robin.mohlander@consultingit.se",
        "telephone" : "0733863992",
        "name" : "Robin Mohlander",
        "contact_type" : null
      } ],
      "duration" : {
        "concept_id" : "a7uU_j21_mkL",
        "label" : "Tills vidare",
        "legacy_ams_taxonomy_id" : "1"
      },
      "nice_to_have" : {
        "education_level" : [ ],
        "work_experiences" : [ {
          "concept_id" : "KQty_E1u_cia",
          "weight" : 5,
          "label" : "Helpdesktekniker/Supporttekniker",
          "legacy_ams_taxonomy_id" : "7020"
        } ],
        "skills" : [ {
          "concept_id" : "xGPG_PpL_zWN",
          "weight" : 5,
          "label" : "Active Directory, programmeringsverktyg",
          "legacy_ams_taxonomy_id" : "607910"
        }, {
          "concept_id" : "w8bU_wHe_omF",
          "weight" : 5,
          "label" : "MS Office",
          "legacy_ams_taxonomy_id" : "608767"
        }, {
          "concept_id" : "urLT_mLe_FHv",
          "weight" : 5,
          "label" : "PC-datorer, installation och underhåll",
          "legacy_ams_taxonomy_id" : "605743"
        } ],
        "education" : [ ],
        "languages" : [ {
          "concept_id" : "NVxJ_hLg_TYS",
          "weight" : 5,
          "label" : "Engelska",
          "legacy_ams_taxonomy_id" : "283"
        } ]
      },
      "application_details" : {
        "via_af" : false,
        "email" : "cv@consultingit.se",
        "other" : null,
        "reference" : "IT-supporttekniker",
        "url" : null,
        "information" : null
      },
      "source_type" : "VIA_ANNONSERA",
      "application_deadline" : "2022-08-22T23:59:59",
      "external_id" : null,
      "workplace_address" : {
        "coordinates" : [ 18.00688429874636, 59.33852806953268 ],
        "city" : "STOCKHOLM",
        "postcode" : "11274",
        "municipality" : "Stockholm",
        "region_concept_id" : "CifL_Rzy_Mku",
        "region" : "Stockholms län",
        "country_code" : "199",
        "region_code" : "01",
        "municipality_concept_id" : "AvNB_uwa_6n6",
        "country_concept_id" : "i46j_HmG_v64",
        "municipality_code" : "0180",
        "street_address" : null,
        "country" : "Sverige"
      },
      "id" : "26235489",
      "experience_required" : true,
      "working_hours_type" : {
        "concept_id" : "6YE1_gAC_R2G",
        "label" : "Heltid",
        "legacy_ams_taxonomy_id" : "1"
      },
      "access" : null,
      "timestamp" : 1658476725286,
      "must_have" : {
        "education_level" : [ ],
        "work_experiences" : [ ],
        "skills" : [ ],
        "education" : [ ],
        "languages" : [ {
          "concept_id" : "zSLA_vw2_FXN",
          "weight" : 10,
          "label" : "Svenska",
          "legacy_ams_taxonomy_id" : "502"
        } ]
      },
      "occupation_field" : {
        "concept_id" : "apaJ_2ja_LuF",
        "label" : "Data/IT",
        "legacy_ams_taxonomy_id" : "3"
      },
      "scope_of_work" : {
        "min" : 0,
        "max" : 100
      },
      "salary_type" : {
        "concept_id" : "oG8G_9cW_nRf",
        "label" : "Fast månads- vecko- eller timlön",
        "legacy_ams_taxonomy_id" : "1"
      },
      "removed" : false,
      "salary_description" : null,
      "access_to_own_car" : false,
      "publication_date" : "2022-07-22T09:58:45"
    },
    "name" : "IT-Supporttekniker med start i augusti",
    "user" : "hannes"
  },
  "sha1" : "184befe72afccdcc00a5071c174b6ef8c4576c12",
  "annotations" : [ {
    "preferred-label" : "IT-supporttekniker",
    "sentiment" : "MUST_HAVE",
    "type" : "keyword",
    "start-position" : 0,
    "end-position" : 18,
    "concept-id" : "ZBUk_h8D_KZA",
    "matched-string" : "it-supporttekniker",
    "annotation-id" : 0
  }, {
    "preferred-label" : "Data/IT",
    "sentiment" : "MUST_HAVE",
    "type" : "occupation-field",
    "start-position" : 87,
    "end-position" : 89,
    "concept-id" : "apaJ_2ja_LuF",
    "matched-string" : "it",
    "annotation-id" : 1
  }, {
    "preferred-label" : "Data/IT",
    "sentiment" : "MUST_HAVE",
    "type" : "occupation-field",
    "start-position" : 205,
    "end-position" : 207,
    "concept-id" : "apaJ_2ja_LuF",
    "matched-string" : "it",
    "annotation-id" : 2
  }, {
    "preferred-label" : "Restaurang",
    "sentiment" : "MUST_HAVE",
    "type" : "keyword",
    "start-position" : 364,
    "end-position" : 374,
    "concept-id" : "o2Cg_3Ap_qvK",
    "matched-string" : "restaurang",
    "annotation-id" : 3
  }, {
    "preferred-label" : "Butik",
    "sentiment" : "MUST_HAVE",
    "type" : "keyword",
    "start-position" : 376,
    "end-position" : 381,
    "concept-id" : "xLsd_zjY_5wr",
    "matched-string" : "butik",
    "annotation-id" : 4
  }, {
    "preferred-label" : "arbetsmiljö",
    "sentiment" : "MUST_HAVE",
    "type" : "esco-skill",
    "start-position" : 658,
    "end-position" : 669,
    "concept-id" : "zdQY_QJh_nUH",
    "matched-string" : "arbetsmiljö",
    "annotation-id" : 5
  }, {
    "preferred-label" : "IT-supporttekniker",
    "sentiment" : "MUST_HAVE",
    "type" : "keyword",
    "start-position" : 684,
    "end-position" : 702,
    "concept-id" : "ZBUk_h8D_KZA",
    "matched-string" : "it-supporttekniker",
    "annotation-id" : 6
  }, {
    "preferred-label" : "IT-support",
    "sentiment" : "MUST_HAVE",
    "type" : "keyword",
    "start-position" : 738,
    "end-position" : 748,
    "concept-id" : "1Nz1_z46_39V",
    "matched-string" : "it-support",
    "annotation-id" : 7
  }, {
    "preferred-label" : "Data/IT",
    "sentiment" : "MUST_HAVE",
    "type" : "occupation-field",
    "start-position" : 830,
    "end-position" : 832,
    "concept-id" : "apaJ_2ja_LuF",
    "matched-string" : "it",
    "annotation-id" : 8
  }, {
    "preferred-label" : "Verktyg",
    "sentiment" : "MUST_HAVE",
    "type" : "skill",
    "start-position" : 1177,
    "end-position" : 1184,
    "concept-id" : "KG9j_WxP_ym2",
    "matched-string" : "verktyg",
    "annotation-id" : 9
  } ],
  "text" : "IT-Supporttekniker med start i augusti\nVi söker dig som har ett brinnande intresse för IT och viljan att bidra med kunskaper/erfarenheter för en effektiv arbetsplats, och samtidigt utveckla dig själv inom IT. Vi tror att du har en servicenivå i världsklass och förstår varje kunds behov. Har du tidigare arbetat med kundsupport och/eller inom servicebranscher som restaurang, butik eller liknande så är det ett stort plus. Du tycker om att driva processer framåt och att hela tiden sträva efter att göra kunder och kollegor nöjda. Vi värdesätter omtänksamhet och god laganda för att tillsammans med övriga kollegor i teamet skapa en positiv och stimulerande arbetsmiljö.\nI rollen som IT-Supporttekniker kommer du arbeta arbeta med Intern IT-support i kvalificerad Service Desk på ett modernt och stort företag. Alla frågor som är IT-relaterade hanteras av teamet och det är både högt och lågt i svårighetsgrad på ärendena. I huvudsak är ansvaret att agera support mot företagets interna användare som hanteras via telefon, mail och ärendehanteringssystem. Det finns goda utvecklingsmöjligheter och du kommer få möjligheter att arbeta med moderna tekniska tjänster, miljöer och verktyg.\n\n\nOm oss\nVårt motto är att behandla våra kunder, anställda och varandra på samma sätt vi själva vill bli behandlade på. Det är inte så svårt när man tänker på det. Det gäller bara att varje dag vara beredd att göra \"det lilla extra\" eller i vårt fall \"Bryta ryggen\" för varandra.\nVi anser att om vi ska kunna leverera tjänster av högsta kvalité så måste vi ha engagerade medarbetare som brinner för och känner stolthet för sitt arbete. Vi vet att det vi investerar i våra medarbetare investerar de i våra kunder. Samarbetet ska bygga på förtroende och vår målsättning är att ConsultingIT skall vara det självklara valet i form av Partner och Arbetsgivare.\nVi kommer aldrig vända ryggen åt något för att det är jobbigt. Vi kommer aldrig skylla på att kunden inte förstår. Vi kommer aldrig acceptera annat än 100% av varandra.\nVi kommer ALLTID finnas här för våra kunder, partners och medarbetare.\nVälkommen till ConsultingIT"
}