{
  "meta" : {
    "jobad" : {
      "description" : {
        "requirements" : null,
        "needs" : null,
        "company_information" : null,
        "text_formatted" : "<p>Snickare/Köksmontör sökes omgående.</p><p>Nu behöver vi utöka styrkan igen. De flesta jobben är i Norrtälje kommun, därför ska du bo i närområdet. </p><p>Du ska ha körkort, prata och skriva på svenska, god kännedom om rot-jobb, kunna arbeta 40 timmar/vecka, kunna arbeta självständigt, läsa och förstå ritningar och instruktioner. Vi bygger kök, badrum, övrig inredning, utbyggnader, attefallshus, altaner, målning mm. Känner du att dessa jobb inte är några konstigheter, skicka då ett mejl till: maila@me-2sweden.nu </p><p>Bara ni som mejlar oss får svar.</p><p>Mvh Micke</p>",
        "conditions" : null,
        "text" : "Snickare/Köksmontör sökes omgående.\nNu behöver vi utöka styrkan igen. De flesta jobben är i Norrtälje kommun, därför ska du bo i närområdet. \nDu ska ha körkort, prata och skriva på svenska, god kännedom om rot-jobb, kunna arbeta 40 timmar/vecka, kunna arbeta självständigt, läsa och förstå ritningar och instruktioner. Vi bygger kök, badrum, övrig inredning, utbyggnader, attefallshus, altaner, målning mm. Känner du att dessa jobb inte är några konstigheter, skicka då ett mejl till: maila@me-2sweden.nu \nBara ni som mejlar oss får svar.\nMvh Micke"
      },
      "headline" : "Snickare med fler kunskaper ",
      "driving_license" : [ {
        "concept_id" : "VTK8_WRx_GcM",
        "label" : "B",
        "legacy_ams_taxonomy_id" : "3"
      } ],
      "employer" : {
        "email" : null,
        "phone_number" : null,
        "organization_number" : "5567352397",
        "name" : "Inredningsboden i Roslagen AB",
        "url" : "me-2sweden.nu",
        "workplace" : "KÖKSBODEN/INREDNINGSBODEN I ROSLAGEN AB"
      },
      "removed_date" : null,
      "logo_url" : null,
      "last_publication_date" : "2022-08-27T23:59:59",
      "number_of_vacancies" : 2,
      "occupation" : {
        "concept_id" : "4Z7F_oBG_vMG",
        "label" : "Träarbetare/Snickare",
        "legacy_ams_taxonomy_id" : "6581"
      },
      "occupation_group" : {
        "concept_id" : "9mJN_VwW_Xjg",
        "label" : "Träarbetare, snickare m.fl.",
        "legacy_ams_taxonomy_id" : "7111"
      },
      "employment_type" : {
        "concept_id" : "PFZr_Syz_cUq",
        "label" : "Vanlig anställning",
        "legacy_ams_taxonomy_id" : "1"
      },
      "webpage_url" : "https://arbetsformedlingen.se/platsbanken/annonser/26361413",
      "driving_license_required" : true,
      "application_contacts" : [ ],
      "duration" : {
        "concept_id" : "a7uU_j21_mkL",
        "label" : "Tills vidare",
        "legacy_ams_taxonomy_id" : "1"
      },
      "nice_to_have" : {
        "education_level" : [ ],
        "work_experiences" : [ {
          "concept_id" : "4Z7F_oBG_vMG",
          "weight" : 5,
          "label" : "Träarbetare/Snickare",
          "legacy_ams_taxonomy_id" : "6581"
        } ],
        "skills" : [ ],
        "education" : [ ],
        "languages" : [ ]
      },
      "application_details" : {
        "via_af" : false,
        "email" : "Ledigt_jobb@me-2sweden.nu",
        "other" : null,
        "reference" : null,
        "url" : null,
        "information" : null
      },
      "source_type" : "VIA_ANNONSERA",
      "application_deadline" : "2022-08-27T23:59:59",
      "external_id" : null,
      "workplace_address" : {
        "coordinates" : [ 18.687242353462363, 59.86106733465328 ],
        "city" : "NORRTÄLJE",
        "postcode" : "76174",
        "municipality" : "Norrtälje",
        "region_concept_id" : "CifL_Rzy_Mku",
        "region" : "Stockholms län",
        "country_code" : "199",
        "region_code" : "01",
        "municipality_concept_id" : "btgf_fS7_sKG",
        "country_concept_id" : "i46j_HmG_v64",
        "municipality_code" : "0188",
        "street_address" : "Norrtäljevägen 470",
        "country" : "Sverige"
      },
      "id" : "26361413",
      "experience_required" : true,
      "working_hours_type" : {
        "concept_id" : "6YE1_gAC_R2G",
        "label" : "Heltid",
        "legacy_ams_taxonomy_id" : "1"
      },
      "access" : null,
      "timestamp" : 1659038855336,
      "must_have" : {
        "education_level" : [ ],
        "work_experiences" : [ ],
        "skills" : [ ],
        "education" : [ ],
        "languages" : [ ]
      },
      "occupation_field" : {
        "concept_id" : "j7Cq_ZJe_GkT",
        "label" : "Bygg och anläggning",
        "legacy_ams_taxonomy_id" : "2"
      },
      "scope_of_work" : {
        "min" : 0,
        "max" : 100
      },
      "salary_type" : {
        "concept_id" : "oG8G_9cW_nRf",
        "label" : "Fast månads- vecko- eller timlön",
        "legacy_ams_taxonomy_id" : "1"
      },
      "removed" : false,
      "salary_description" : null,
      "access_to_own_car" : false,
      "publication_date" : "2022-07-28T22:07:35"
    },
    "name" : "Snickare med fler kunskaper ",
    "user" : "hannes"
  },
  "sha1" : "9abf8b14e9901ed678ff7ff78f5b52669e76d9cb",
  "annotations" : [ {
    "preferred-label" : "snickare",
    "sentiment" : "MUST_HAVE",
    "type" : "esco-occupation",
    "start-position" : 0,
    "end-position" : 8,
    "concept-id" : "qhAJ_Euo_tNx",
    "matched-string" : "snickare",
    "annotation-id" : 0
  }, {
    "preferred-label" : "snickare",
    "sentiment" : "MUST_HAVE",
    "type" : "esco-occupation",
    "start-position" : 29,
    "end-position" : 37,
    "concept-id" : "qhAJ_Euo_tNx",
    "matched-string" : "snickare",
    "annotation-id" : 1
  }, {
    "preferred-label" : "köksmontör",
    "type" : "esco-occupation",
    "start-position" : 38,
    "end-position" : 48,
    "concept-id" : "XXSb_4XF_q7S",
    "matched-string" : "Köksmontör",
    "annotation-id" : 5
  }, {
    "preferred-label" : "Norrtälje",
    "type" : "municipality",
    "start-position" : 121,
    "end-position" : 137,
    "concept-id" : "btgf_fS7_sKG",
    "matched-string" : "Norrtälje kommun",
    "annotation-id" : 6
  }, {
    "preferred-label" : "körkort",
    "type" : "esco-skill",
    "start-position" : 181,
    "end-position" : 188,
    "concept-id" : "UvDr_eNo_HSQ",
    "matched-string" : "körkort",
    "annotation-id" : 7
  }, {
    "preferred-label" : "Svenska",
    "sentiment" : "MUST_HAVE",
    "type" : "language",
    "start-position" : 210,
    "end-position" : 217,
    "concept-id" : "zSLA_vw2_FXN",
    "matched-string" : "svenska",
    "annotation-id" : 2
  }, {
    "preferred-label" : "ROT-jobb",
    "sentiment" : "MUST_HAVE",
    "type" : "skill",
    "start-position" : 235,
    "end-position" : 243,
    "concept-id" : "U1ud_XV7_Z8o",
    "matched-string" : "rot-jobb",
    "annotation-id" : 3
  }, {
    "preferred-label" : "Heltid",
    "type" : "worktime-extent",
    "start-position" : 258,
    "end-position" : 273,
    "concept-id" : "6YE1_gAC_R2G",
    "matched-string" : "40 timmar/vecka",
    "annotation-id" : 8
  }, {
    "preferred-label" : "arbeta självständigt",
    "type" : "esco-skill",
    "start-position" : 281,
    "end-position" : 301,
    "concept-id" : "NyFu_HHd_zhz",
    "matched-string" : "arbeta självständigt",
    "annotation-id" : 9
  }, {
    "preferred-label" : "ritningar",
    "type" : "esco-skill",
    "start-position" : 319,
    "end-position" : 328,
    "concept-id" : "RcYZ_omY_is7",
    "matched-string" : "ritningar",
    "annotation-id" : 10
  }, {
    "preferred-label" : "Inredning",
    "sentiment" : "MUST_HAVE",
    "type" : "keyword",
    "start-position" : 377,
    "end-position" : 386,
    "concept-id" : "uAtM_95o_kaj",
    "matched-string" : "inredning",
    "annotation-id" : 4
  } ],
  "text" : "Snickare med fler kunskaper \nSnickare/Köksmontör sökes omgående.\nNu behöver vi utöka styrkan igen. De flesta jobben är i Norrtälje kommun, därför ska du bo i närområdet. \nDu ska ha körkort, prata och skriva på svenska, god kännedom om rot-jobb, kunna arbeta 40 timmar/vecka, kunna arbeta självständigt, läsa och förstå ritningar och instruktioner. Vi bygger kök, badrum, övrig inredning, utbyggnader, attefallshus, altaner, målning mm. Känner du att dessa jobb inte är några konstigheter, skicka då ett mejl till: maila@me-2sweden.nu \nBara ni som mejlar oss får svar.\nMvh Micke"
}