{
  "meta" : {
    "jobad" : {
      "description" : {
        "requirements" : null,
        "needs" : null,
        "company_information" : null,
        "text_formatted" : "Är du intresserad av systemutveckling och letar efter ett spännande och varierande arbete med mycket kundkontakt? Retail Only i Sverige söker just nu en fullstack utvecklare för kommande uppdrag. Här får du chansen komma in i ett härligt och kompetent team som kännetecknas av en bra sammanhållning och stort kunskapsutbyte. Ett flexibelt arbete där även möjlighet finns att arbeta på distans.\n\nOM TJÄNSTEN \n\nDu erbjuds\n\n\n* Möjligheten att komma in i ett spännande företag där du tillsammans med dina kollegor skapar nya innovativa lösningar i en växande bransch.\n* En härlig företagskultur som känneteckans av en familjär och prestigelös känsla där alla är med och bidrar till bolagets framgång.\n\n\nSom konsult för Academic Work erbjuder vi stora möjligheter för dig att växa professionellt, bygga ditt nätverk och skapa värdefulla kontakter för framtiden. Läs mer om vårt konsulterbjudande.\n\nARBETSUPPGIFTER \nDina främsta arbetsuppgifter kommer bestå utav systemutveckling främst inom språken .NET och React eller View. Du kommer antingen att arbeta backend med att bygga back-office för ICA eller frontend med att utveckla självscanningssystem för Ahlsell, beroende på vad som passar din profil bäst. Utöver detta kommer du att få delta i utvecklingen som Retail Only i Sverige är i, i form av idéer och utvecklingsområden.\n\nVI SÖKER DIG SOM \n- Har eftergymnasial utbildning inom systemutveckling från högskola/universitet eller yrkeshögskoleutbildning som vi bedömer likvärdig\n- Har kunskap inom .NET och React eller View\n- Är van med att hantera kunder\n- Kan uttrycka dig väl i svenska i både tal och skrift\n\nMeriterande:\n\n\n* Xamarin, MySQL och Scrum\n\n\nSom person är du:\n\n\n* Kommunikativ\n* Har god samarbetsförmåga\n* Problemlösande\n\n\n \n\nÖvrig information\n\n\n* Start: September\n* Omfattning: Heltid\n* Placering: Enköping, med möjlighet att arbeta flexibelt\n\n\nRekryteringsprocessen hanteras av Academic Work och kundens önskemål är att alla frågor rörande tjänsten hanteras av Academic Work.\n\nVi går igenom urvalet löpande och annonsen kan stängas ner innan tjänsten är tillsatt om vi gått över till urvals- och intervjufasen.\n\nINFORMATION OM FÖRETAGET \nLäs mer om Retail Only| Thinking Retail and Technology",
        "conditions" : "Heltid\r\n08:00-17:00",
        "text" : "Är du intresserad av systemutveckling och letar efter ett spännande och varierande arbete med mycket kundkontakt? Retail Only i Sverige söker just nu en fullstack utvecklare för kommande uppdrag. Här får du chansen komma in i ett härligt och kompetent team som kännetecknas av en bra sammanhållning och stort kunskapsutbyte. Ett flexibelt arbete där även möjlighet finns att arbeta på distans.\n\nOM TJÄNSTEN \n\nDu erbjuds\n\n\n* Möjligheten att komma in i ett spännande företag där du tillsammans med dina kollegor skapar nya innovativa lösningar i en växande bransch.\n* En härlig företagskultur som känneteckans av en familjär och prestigelös känsla där alla är med och bidrar till bolagets framgång.\n\n\nSom konsult för Academic Work erbjuder vi stora möjligheter för dig att växa professionellt, bygga ditt nätverk och skapa värdefulla kontakter för framtiden. Läs mer om vårt konsulterbjudande.\n\nARBETSUPPGIFTER \nDina främsta arbetsuppgifter kommer bestå utav systemutveckling främst inom språken .NET och React eller View. Du kommer antingen att arbeta backend med att bygga back-office för ICA eller frontend med att utveckla självscanningssystem för Ahlsell, beroende på vad som passar din profil bäst. Utöver detta kommer du att få delta i utvecklingen som Retail Only i Sverige är i, i form av idéer och utvecklingsområden.\n\nVI SÖKER DIG SOM \n- Har eftergymnasial utbildning inom systemutveckling från högskola/universitet eller yrkeshögskoleutbildning som vi bedömer likvärdig\n- Har kunskap inom .NET och React eller View\n- Är van med att hantera kunder\n- Kan uttrycka dig väl i svenska i både tal och skrift\n\nMeriterande:\n\n\n* Xamarin, MySQL och Scrum\n\n\nSom person är du:\n\n\n* Kommunikativ\n* Har god samarbetsförmåga\n* Problemlösande\n\n\n \n\nÖvrig information\n\n\n* Start: September\n* Omfattning: Heltid\n* Placering: Enköping, med möjlighet att arbeta flexibelt\n\n\nRekryteringsprocessen hanteras av Academic Work och kundens önskemål är att alla frågor rörande tjänsten hanteras av Academic Work.\n\nVi går igenom urvalet löpande och annonsen kan stängas ner innan tjänsten är tillsatt om vi gått över till urvals- och intervjufasen.\n\nINFORMATION OM FÖRETAGET \nLäs mer om Retail Only| Thinking Retail and Technology"
      },
      "headline" : "Fullstack utvecklare till Retail Only i Sverige",
      "driving_license" : null,
      "employer" : {
        "email" : null,
        "phone_number" : null,
        "organization_number" : "5565595450",
        "name" : "Academic Work Sweden AB",
        "url" : "http://www.academicwork.se",
        "workplace" : "Academic Work"
      },
      "removed_date" : null,
      "logo_url" : "https://www.arbetsformedlingen.se/rest/arbetsgivare/rest/af/v3/organisation/5565595450/logotyper/logo.png",
      "last_publication_date" : "2022-08-22T23:59:59",
      "number_of_vacancies" : 1,
      "occupation" : {
        "concept_id" : "fg7B_yov_smw",
        "label" : "Systemutvecklare/Programmerare",
        "legacy_ams_taxonomy_id" : "2419"
      },
      "occupation_group" : {
        "concept_id" : "DJh5_yyF_hEM",
        "label" : "Mjukvaru- och systemutvecklare m.fl.",
        "legacy_ams_taxonomy_id" : "2512"
      },
      "employment_type" : {
        "concept_id" : "PFZr_Syz_cUq",
        "label" : "Vanlig anställning",
        "legacy_ams_taxonomy_id" : "1"
      },
      "webpage_url" : "https://arbetsformedlingen.se/platsbanken/annonser/26345798",
      "driving_license_required" : false,
      "application_contacts" : [ {
        "description" : "Sorin Feili",
        "email" : null,
        "telephone" : null,
        "name" : null,
        "contact_type" : null
      } ],
      "duration" : {
        "concept_id" : "qQUd_4qe_NDT",
        "label" : "6 månader eller längre",
        "legacy_ams_taxonomy_id" : "2"
      },
      "nice_to_have" : {
        "education_level" : [ ],
        "work_experiences" : [ ],
        "skills" : [ ],
        "education" : [ ],
        "languages" : [ ]
      },
      "application_details" : {
        "via_af" : false,
        "email" : null,
        "other" : null,
        "reference" : "15079008",
        "url" : "http://www.academicwork.se/jobad/fullstack-utvecklare-till-retail-only-i-sverige/15079008?apply=1",
        "information" : null
      },
      "source_type" : "VIA_PLATSBANKEN_DXA",
      "application_deadline" : "2022-08-22T23:59:59",
      "external_id" : "46-556559-5450-15079008",
      "workplace_address" : {
        "coordinates" : [ 16.54481, 59.6099 ],
        "city" : null,
        "postcode" : null,
        "municipality" : "Västerås",
        "region_concept_id" : "G6DV_fKE_Viz",
        "region" : "Västmanlands län",
        "country_code" : "199",
        "region_code" : "19",
        "municipality_concept_id" : "8deT_FRF_2SP",
        "country_concept_id" : "i46j_HmG_v64",
        "municipality_code" : "1980",
        "street_address" : null,
        "country" : "Sverige"
      },
      "id" : "26345798",
      "experience_required" : true,
      "working_hours_type" : {
        "concept_id" : "6YE1_gAC_R2G",
        "label" : "Heltid",
        "legacy_ams_taxonomy_id" : "1"
      },
      "access" : null,
      "timestamp" : 1658440918676,
      "must_have" : {
        "education_level" : [ ],
        "work_experiences" : [ {
          "concept_id" : "fg7B_yov_smw",
          "weight" : 10,
          "label" : "Systemutvecklare/Programmerare",
          "legacy_ams_taxonomy_id" : "2419"
        } ],
        "skills" : [ ],
        "education" : [ ],
        "languages" : [ ]
      },
      "occupation_field" : {
        "concept_id" : "apaJ_2ja_LuF",
        "label" : "Data/IT",
        "legacy_ams_taxonomy_id" : "3"
      },
      "scope_of_work" : {
        "min" : 100,
        "max" : 100
      },
      "salary_type" : {
        "concept_id" : "oG8G_9cW_nRf",
        "label" : "Fast månads- vecko- eller timlön",
        "legacy_ams_taxonomy_id" : "1"
      },
      "removed" : false,
      "salary_description" : "Enligt avtal",
      "access_to_own_car" : false,
      "publication_date" : "2022-07-22T00:01:58"
    },
    "name" : "Fullstack utvecklare till Retail Only i Sverige",
    "user" : "hannes"
  },
  "sha1" : "46ac1c01eca5c3412080a365fb8dae4c990afb55",
  "annotations" : [ {
    "preferred-label" : "Fullstack-utvecklare",
    "type" : "occupation-name",
    "start-position" : 0,
    "end-position" : 20,
    "concept-id" : "71Ji_irM_rSJ",
    "matched-string" : "Fullstack utvecklare",
    "annotation-id" : 7
  }, {
    "preferred-label" : "Sverige",
    "type" : "country",
    "start-position" : 40,
    "end-position" : 47,
    "concept-id" : "i46j_HmG_v64",
    "matched-string" : "Sverige",
    "annotation-id" : 8
  }, {
    "preferred-label" : "systemutveckling",
    "sentiment" : "MUST_HAVE",
    "type" : "esco-skill",
    "start-position" : 69,
    "end-position" : 85,
    "concept-id" : "cm71_uwW_5zU",
    "matched-string" : "systemutveckling",
    "annotation-id" : 0
  }, {
    "preferred-label" : "Sverige",
    "type" : "country",
    "start-position" : 176,
    "end-position" : 183,
    "concept-id" : "i46j_HmG_v64",
    "matched-string" : "Sverige",
    "annotation-id" : 9
  }, {
    "preferred-label" : "Fullstack-utvecklare",
    "type" : "occupation-name",
    "start-position" : 201,
    "end-position" : 221,
    "concept-id" : "71Ji_irM_rSJ",
    "matched-string" : "fullstack utvecklare",
    "annotation-id" : 10
  }, {
    "preferred-label" : "systemutveckling",
    "sentiment" : "MUST_HAVE",
    "type" : "esco-skill",
    "start-position" : 1005,
    "end-position" : 1021,
    "concept-id" : "cm71_uwW_5zU",
    "matched-string" : "systemutveckling",
    "annotation-id" : 1
  }, {
    "preferred-label" : "Backend-utvecklare",
    "type" : "occupation-name",
    "start-position" : 1092,
    "end-position" : 1106,
    "concept-id" : "7wdX_4rv_33z",
    "matched-string" : "arbeta backend",
    "annotation-id" : 11
  }, {
    "preferred-label" : "Sverige",
    "type" : "country",
    "start-position" : 1320,
    "end-position" : 1327,
    "concept-id" : "i46j_HmG_v64",
    "matched-string" : "Sverige",
    "annotation-id" : 12
  }, {
    "preferred-label" : "Eftergymnasial utbildning",
    "sentiment" : "MUST_HAVE",
    "type" : "sni-level-3",
    "start-position" : 1399,
    "end-position" : 1424,
    "concept-id" : "bg6r_KVf_KNN",
    "matched-string" : "eftergymnasial utbildning",
    "annotation-id" : 2
  }, {
    "preferred-label" : "Systemutveckling och programmering",
    "sentiment" : "MUST_HAVE",
    "type" : "sun-education-field-4",
    "start-position" : 1430,
    "end-position" : 1446,
    "concept-id" : "3Jc3_Ppa_YeJ",
    "matched-string" : "systemutveckling",
    "annotation-id" : 3
  }, {
    "preferred-label" : "Universitets- eller högskoleutbildning",
    "type" : "sni-level-5",
    "start-position" : 1452,
    "end-position" : 1472,
    "concept-id" : "4Hs1_pdH_C7k",
    "matched-string" : "högskola/universitet",
    "annotation-id" : 13
  }, {
    "preferred-label" : "Svenska",
    "sentiment" : "MUST_HAVE",
    "type" : "language",
    "start-position" : 1630,
    "end-position" : 1637,
    "concept-id" : "zSLA_vw2_FXN",
    "matched-string" : "svenska",
    "annotation-id" : 4
  }, {
    "preferred-label" : "Xamarin-utvecklare",
    "type" : "keyword",
    "start-position" : 1678,
    "end-position" : 1685,
    "concept-id" : "mdYC_WFr_pnm",
    "matched-string" : "Xamarin",
    "annotation-id" : 14
  }, {
    "preferred-label" : "MySQL",
    "sentiment" : "MUST_HAVE",
    "type" : "esco-skill",
    "start-position" : 1687,
    "end-position" : 1692,
    "concept-id" : "eF8Z_oLZ_mgy",
    "matched-string" : "mysql",
    "annotation-id" : 5
  }, {
    "preferred-label" : "Scrum, systemutvecklingsmetod",
    "sentiment" : "MUST_HAVE",
    "type" : "skill",
    "start-position" : 1697,
    "end-position" : 1702,
    "concept-id" : "Cnqu_REg_6jo",
    "matched-string" : "scrum",
    "annotation-id" : 6
  }, {
    "preferred-label" : "Heltid",
    "type" : "worktime-extent",
    "start-position" : 1842,
    "end-position" : 1848,
    "concept-id" : "6YE1_gAC_R2G",
    "matched-string" : "Heltid",
    "annotation-id" : 15
  }, {
    "preferred-label" : "Enköping",
    "type" : "municipality",
    "start-position" : 1862,
    "end-position" : 1870,
    "concept-id" : "HGwg_unG_TsG",
    "matched-string" : "Enköping",
    "annotation-id" : 16
  } ],
  "text" : "Fullstack utvecklare till Retail Only i Sverige\nÄr du intresserad av systemutveckling och letar efter ett spännande och varierande arbete med mycket kundkontakt? Retail Only i Sverige söker just nu en fullstack utvecklare för kommande uppdrag. Här får du chansen komma in i ett härligt och kompetent team som kännetecknas av en bra sammanhållning och stort kunskapsutbyte. Ett flexibelt arbete där även möjlighet finns att arbeta på distans.\n\nOM TJÄNSTEN \n\nDu erbjuds\n\n\n* Möjligheten att komma in i ett spännande företag där du tillsammans med dina kollegor skapar nya innovativa lösningar i en växande bransch.\n* En härlig företagskultur som känneteckans av en familjär och prestigelös känsla där alla är med och bidrar till bolagets framgång.\n\n\nSom konsult för Academic Work erbjuder vi stora möjligheter för dig att växa professionellt, bygga ditt nätverk och skapa värdefulla kontakter för framtiden. Läs mer om vårt konsulterbjudande.\n\nARBETSUPPGIFTER \nDina främsta arbetsuppgifter kommer bestå utav systemutveckling främst inom språken .NET och React eller View. Du kommer antingen att arbeta backend med att bygga back-office för ICA eller frontend med att utveckla självscanningssystem för Ahlsell, beroende på vad som passar din profil bäst. Utöver detta kommer du att få delta i utvecklingen som Retail Only i Sverige är i, i form av idéer och utvecklingsområden.\n\nVI SÖKER DIG SOM \n- Har eftergymnasial utbildning inom systemutveckling från högskola/universitet eller yrkeshögskoleutbildning som vi bedömer likvärdig\n- Har kunskap inom .NET och React eller View\n- Är van med att hantera kunder\n- Kan uttrycka dig väl i svenska i både tal och skrift\n\nMeriterande:\n\n\n* Xamarin, MySQL och Scrum\n\n\nSom person är du:\n\n\n* Kommunikativ\n* Har god samarbetsförmåga\n* Problemlösande\n\n\n \n\nÖvrig information\n\n\n* Start: September\n* Omfattning: Heltid\n* Placering: Enköping, med möjlighet att arbeta flexibelt\n\n\nRekryteringsprocessen hanteras av Academic Work och kundens önskemål är att alla frågor rörande tjänsten hanteras av Academic Work.\n\nVi går igenom urvalet löpande och annonsen kan stängas ner innan tjänsten är tillsatt om vi gått över till urvals- och intervjufasen.\n\nINFORMATION OM FÖRETAGET \nLäs mer om Retail Only| Thinking Retail and Technology"
}