{
  "meta" : {
    "jobad" : {
      "description" : {
        "requirements" : null,
        "needs" : null,
        "company_information" : null,
        "text_formatted" : "Är du intresserad av teknik och letar efter ett innovativ och hållbart företag att utvecklas inom? Då kan vi ha jobbet för dig!\n\nJust nu söker vi ansvarsfulla och ambitiösa serviceelektriker till vår filial i Kristianstad. Enheten har en lång erfarenhet och bred kompetens inom flera teknikdiscipliner såsom el, ventilation, VS, kyla och säkerhet. Vi går mot en spännande framtid och bygger ett team som består av en sammansvetsad grupp med nära samarbete med varandra.\n\nDina arbetsuppgifter \n\nSom serviceelektriker på Caverion arbetar du med tillsyn, skötsel, underhåll, installationsarbete och felsökning inom allmän fastighets och processteknisk utrustning. Du arbetar även med att säkra den dagliga driften av befintliga system. Du kommer också att medverka vid planeringen av förebyggande underhållsarbete. Viktigt att du är serviceinriktad och tycker om kundkontakter och är engagerad och kan jobba både självständigt och i team med dina kollegor.\n\nI rollen ingår även:\n\n• Planering av eget arbete \n• Utföra tekniska serviceuppdrag \n• Uppföljning och återrapportering \n• Merförsäljning genom att se möjligheter, föreslå förbättringar och uppdateringar av de tekniska systemen via uppföljningsrapporter \n\nDin bakgrund \n\n• Elteknisk utbildning \n• ECY-certifikat \n• Några års erfarenhet av arbete som elektriker \n• Kunskap om el-dokumentation \n• Erfarenhet av att räkna på jobb är en merit \n• Förmåga att kunna arbeta självständigt med dagliga kundkontakter \n• Som person är du ordningsam, social och serviceminded \n• B-körkort \n\nKort om Caverion - Building Performance\n\nNär du jobbar på Caverion växer du med oss. I takt att du skaffar dig nya kunskaper, får du också nya möjligheter. Vi uppmuntrar våra medarbetare att lära som en del av jobbet- att ställa frågor, be om hjälp och dela med sig av kunskaper. Du får också hos oss ett stort nätverk inom alla teknikområden. Vi finns i 10 länder, i Sverige är vi ungefär 3000 medarbetar och vi finns på 75 orter från Ystad till Kiruna. Läs mer på caverion.se\n\nBuilding Performance betyder att vi bygger våra omgivningar på ett smart och hållbart sätt så att företag lyckas, och att människor mår bra. Vill du veta hur? Ta en tur Caverion Smart City\n\nAnsökan & Kontakt\n\nOm du tycker att detta låter intressant och har någon fråga, kontakta ansvarig rekryterare Lisbeth Hulander (semester 11/7 - 7/8), tel. 073-081 74 04 eller mail lisbeth.m.hulander@caverion.com alt. servicechef Magnus Fridén (semester 1/8-29/8) tel. 070-384 58 07 mail magnus.friden@caverion.com \n\nAlla former för telefonsamtal som inte berör frågor om tjänsten, exempelvis rekryterings/bemanningsföretag/annonssäljare undanbedes.\n\nDin ansökan vill vi ha senaste den 31 augusti 2022. \nOBS: Urval kommer att påbörjas tidigast vecka 32.\n\nVälkommen med din ansökan!",
        "conditions" : "-\r\n-",
        "text" : "Är du intresserad av teknik och letar efter ett innovativ och hållbart företag att utvecklas inom? Då kan vi ha jobbet för dig!\n\nJust nu söker vi ansvarsfulla och ambitiösa serviceelektriker till vår filial i Kristianstad. Enheten har en lång erfarenhet och bred kompetens inom flera teknikdiscipliner såsom el, ventilation, VS, kyla och säkerhet. Vi går mot en spännande framtid och bygger ett team som består av en sammansvetsad grupp med nära samarbete med varandra.\n\nDina arbetsuppgifter \n\nSom serviceelektriker på Caverion arbetar du med tillsyn, skötsel, underhåll, installationsarbete och felsökning inom allmän fastighets och processteknisk utrustning. Du arbetar även med att säkra den dagliga driften av befintliga system. Du kommer också att medverka vid planeringen av förebyggande underhållsarbete. Viktigt att du är serviceinriktad och tycker om kundkontakter och är engagerad och kan jobba både självständigt och i team med dina kollegor.\n\nI rollen ingår även:\n\n• Planering av eget arbete \n• Utföra tekniska serviceuppdrag \n• Uppföljning och återrapportering \n• Merförsäljning genom att se möjligheter, föreslå förbättringar och uppdateringar av de tekniska systemen via uppföljningsrapporter \n\nDin bakgrund \n\n• Elteknisk utbildning \n• ECY-certifikat \n• Några års erfarenhet av arbete som elektriker \n• Kunskap om el-dokumentation \n• Erfarenhet av att räkna på jobb är en merit \n• Förmåga att kunna arbeta självständigt med dagliga kundkontakter \n• Som person är du ordningsam, social och serviceminded \n• B-körkort \n\nKort om Caverion - Building Performance\n\nNär du jobbar på Caverion växer du med oss. I takt att du skaffar dig nya kunskaper, får du också nya möjligheter. Vi uppmuntrar våra medarbetare att lära som en del av jobbet- att ställa frågor, be om hjälp och dela med sig av kunskaper. Du får också hos oss ett stort nätverk inom alla teknikområden. Vi finns i 10 länder, i Sverige är vi ungefär 3000 medarbetar och vi finns på 75 orter från Ystad till Kiruna. Läs mer på caverion.se\n\nBuilding Performance betyder att vi bygger våra omgivningar på ett smart och hållbart sätt så att företag lyckas, och att människor mår bra. Vill du veta hur? Ta en tur Caverion Smart City\n\nAnsökan & Kontakt\n\nOm du tycker att detta låter intressant och har någon fråga, kontakta ansvarig rekryterare Lisbeth Hulander (semester 11/7 - 7/8), tel. 073-081 74 04 eller mail lisbeth.m.hulander@caverion.com alt. servicechef Magnus Fridén (semester 1/8-29/8) tel. 070-384 58 07 mail magnus.friden@caverion.com \n\nAlla former för telefonsamtal som inte berör frågor om tjänsten, exempelvis rekryterings/bemanningsföretag/annonssäljare undanbedes.\n\nDin ansökan vill vi ha senaste den 31 augusti 2022. \nOBS: Urval kommer att påbörjas tidigast vecka 32.\n\nVälkommen med din ansökan!"
      },
      "headline" : "Serviceelektriker, Caverion - Kristianstad",
      "driving_license" : [ {
        "concept_id" : "VTK8_WRx_GcM",
        "label" : "B",
        "legacy_ams_taxonomy_id" : "3"
      } ],
      "employer" : {
        "email" : null,
        "phone_number" : null,
        "organization_number" : "5560528753",
        "name" : "Caverion Sverige AB",
        "url" : null,
        "workplace" : "Caverion Sverige AB"
      },
      "removed_date" : null,
      "logo_url" : "https://www.arbetsformedlingen.se/rest/arbetsgivare/rest/af/v3/organisation/5560528753/logotyper/logo.png",
      "last_publication_date" : "2022-08-31T23:59:59",
      "number_of_vacancies" : 1,
      "occupation" : {
        "concept_id" : "K3iK_iEb_41Y",
        "label" : "Serviceelektriker, installation",
        "legacy_ams_taxonomy_id" : "4781"
      },
      "occupation_group" : {
        "concept_id" : "yyF7_jsW_EeP",
        "label" : "Installations- och serviceelektriker",
        "legacy_ams_taxonomy_id" : "7411"
      },
      "employment_type" : {
        "concept_id" : "PFZr_Syz_cUq",
        "label" : "Vanlig anställning",
        "legacy_ams_taxonomy_id" : "1"
      },
      "webpage_url" : "https://arbetsformedlingen.se/platsbanken/annonser/26287131",
      "driving_license_required" : true,
      "application_contacts" : [ ],
      "duration" : {
        "concept_id" : "a7uU_j21_mkL",
        "label" : "Tills vidare",
        "legacy_ams_taxonomy_id" : "1"
      },
      "nice_to_have" : {
        "education_level" : [ ],
        "work_experiences" : [ ],
        "skills" : [ ],
        "education" : [ ],
        "languages" : [ ]
      },
      "application_details" : {
        "via_af" : false,
        "email" : null,
        "other" : null,
        "reference" : null,
        "url" : "https://karriar.caverion.se/lediga-platser/?jobid=208942&ref=platsbanken",
        "information" : null
      },
      "source_type" : "VIA_PLATSBANKEN_DXA",
      "application_deadline" : "2022-08-31T23:59:59",
      "external_id" : "46-556052-8753-wb-208942",
      "workplace_address" : {
        "coordinates" : [ 14.156678, 56.029392 ],
        "city" : null,
        "postcode" : null,
        "municipality" : "Kristianstad",
        "region_concept_id" : "CaRE_1nn_cSU",
        "region" : "Skåne län",
        "country_code" : "199",
        "region_code" : "12",
        "municipality_concept_id" : "vrvW_sr8_1en",
        "country_concept_id" : "i46j_HmG_v64",
        "municipality_code" : "1290",
        "street_address" : null,
        "country" : "Sverige"
      },
      "id" : "26287131",
      "experience_required" : true,
      "working_hours_type" : {
        "concept_id" : "6YE1_gAC_R2G",
        "label" : "Heltid",
        "legacy_ams_taxonomy_id" : "1"
      },
      "access" : null,
      "timestamp" : 1656913268378,
      "must_have" : {
        "education_level" : [ ],
        "work_experiences" : [ {
          "concept_id" : "K3iK_iEb_41Y",
          "weight" : 10,
          "label" : "Serviceelektriker, installation",
          "legacy_ams_taxonomy_id" : "4781"
        } ],
        "skills" : [ ],
        "education" : [ ],
        "languages" : [ ]
      },
      "occupation_field" : {
        "concept_id" : "yhCP_AqT_tns",
        "label" : "Installation, drift, underhåll",
        "legacy_ams_taxonomy_id" : "10"
      },
      "scope_of_work" : {
        "min" : 100,
        "max" : 100
      },
      "salary_type" : {
        "concept_id" : "oG8G_9cW_nRf",
        "label" : "Fast månads- vecko- eller timlön",
        "legacy_ams_taxonomy_id" : "1"
      },
      "removed" : false,
      "salary_description" : "Enligt överenskommelse",
      "access_to_own_car" : false,
      "publication_date" : "2022-07-04T07:41:08"
    },
    "name" : "Serviceelektriker, Caverion - Kristianstad",
    "user" : "kristof.fischer"
  },
  "sha1" : "8dac0c8d19985d4c415540af60034bcbac7805c7",
  "annotations" : [ {
    "preferred-label" : "Installations- och serviceelektriker",
    "sentiment" : "MUST_HAVE",
    "type" : "ssyk-level-4",
    "start-position" : 0,
    "end-position" : 17,
    "concept-id" : "yyF7_jsW_EeP",
    "matched-string" : "serviceelektriker",
    "annotation-id" : 0
  }, {
    "preferred-label" : "Kristianstad",
    "type" : "municipality",
    "start-position" : 30,
    "end-position" : 42,
    "concept-id" : "vrvW_sr8_1en",
    "matched-string" : "Kristianstad",
    "annotation-id" : 13
  }, {
    "preferred-label" : "visa ansvarstagande",
    "sentiment" : "MUST_HAVE",
    "type" : "esco-skill",
    "start-position" : 189,
    "end-position" : 201,
    "concept-id" : "bcRp_hxV_f5G",
    "matched-string" : "ansvarsfulla",
    "annotation-id" : 14
  }, {
    "preferred-label" : "Installations- och serviceelektriker",
    "sentiment" : "MUST_HAVE",
    "type" : "ssyk-level-4",
    "start-position" : 216,
    "end-position" : 233,
    "concept-id" : "yyF7_jsW_EeP",
    "matched-string" : "serviceelektriker",
    "annotation-id" : 1
  }, {
    "preferred-label" : "Kristianstad",
    "type" : "municipality",
    "start-position" : 252,
    "end-position" : 264,
    "concept-id" : "vrvW_sr8_1en",
    "matched-string" : "Kristianstad",
    "annotation-id" : 15
  }, {
    "preferred-label" : "Installations- och serviceelektriker",
    "sentiment" : "MUST_HAVE",
    "type" : "ssyk-level-4",
    "start-position" : 541,
    "end-position" : 558,
    "concept-id" : "yyF7_jsW_EeP",
    "matched-string" : "serviceelektriker",
    "annotation-id" : 2
  }, {
    "preferred-label" : "underhåll och reparation",
    "sentiment" : "MUST_HAVE",
    "type" : "esco-skill",
    "start-position" : 586,
    "end-position" : 613,
    "concept-id" : "i19U_G6R_t19",
    "matched-string" : "tillsyn, skötsel, underhåll",
    "annotation-id" : 16
  }, {
    "preferred-label" : "Installationsteknik",
    "sentiment" : "MUST_HAVE",
    "type" : "skill",
    "start-position" : 615,
    "end-position" : 634,
    "concept-id" : "1VVe_BBY_rpQ",
    "matched-string" : "installationsarbete",
    "annotation-id" : 17
  }, {
    "preferred-label" : "göra felsökning",
    "sentiment" : "MUST_HAVE",
    "type" : "esco-skill",
    "start-position" : 639,
    "end-position" : 649,
    "concept-id" : "HqC8_fVY_ACM",
    "matched-string" : "felsökning",
    "annotation-id" : 18
  }, {
    "preferred-label" : "Driftövervakning",
    "sentiment" : "MUST_HAVE",
    "type" : "skill",
    "start-position" : 728,
    "end-position" : 753,
    "concept-id" : "FhjY_7eH_rvd",
    "matched-string" : "säkra den dagliga driften",
    "annotation-id" : 19
  }, {
    "preferred-label" : "underhåll och reparation",
    "sentiment" : "MUST_HAVE",
    "type" : "esco-skill",
    "start-position" : 837,
    "end-position" : 853,
    "concept-id" : "i19U_G6R_t19",
    "matched-string" : "underhållsarbete",
    "annotation-id" : 20
  }, {
    "preferred-label" : "arbeta självständigt",
    "sentiment" : "MUST_HAVE",
    "type" : "esco-skill",
    "start-position" : 953,
    "end-position" : 966,
    "concept-id" : "NyFu_HHd_zhz",
    "matched-string" : "självständigt",
    "annotation-id" : 21
  }, {
    "preferred-label" : "samarbeta med kolleger",
    "sentiment" : "MUST_HAVE",
    "type" : "esco-skill",
    "start-position" : 971,
    "end-position" : 995,
    "concept-id" : "X15R_797_q62",
    "matched-string" : "i team med dina kollegor",
    "annotation-id" : 22
  }, {
    "preferred-label" : "Annan utbildning inom teknik och teknisk industri",
    "sentiment" : "MUST_HAVE",
    "type" : "sun-education-field-4",
    "start-position" : 1270,
    "end-position" : 1290,
    "concept-id" : "NKNc_sE8_2ok",
    "matched-string" : "Elteknisk utbildning",
    "annotation-id" : 23
  }, {
    "preferred-label" : "Certifikat, elektriker - elteknik",
    "sentiment" : "MUST_HAVE",
    "type" : "skill",
    "start-position" : 1294,
    "end-position" : 1308,
    "concept-id" : "EjB9_prP_VQZ",
    "matched-string" : "ECY-certifikat",
    "annotation-id" : 24
  }, {
    "preferred-label" : "Elektriker - industri",
    "sentiment" : "MUST_HAVE",
    "type" : "skill",
    "start-position" : 1347,
    "end-position" : 1357,
    "concept-id" : "wJuu_o2B_q7L",
    "matched-string" : "elektriker",
    "annotation-id" : 25
  }, {
    "preferred-label" : "Teknisk dokumentation",
    "sentiment" : "MUST_HAVE",
    "type" : "skill",
    "start-position" : 1375,
    "end-position" : 1388,
    "concept-id" : "AEgv_4gP_ndv",
    "matched-string" : "dokumentation",
    "annotation-id" : 26
  }, {
    "preferred-label" : null,
    "sentiment" : "NICE_TO_HAVE",
    "type" : "skill",
    "start-position" : 1410,
    "end-position" : 1415,
    "concept-id" : null,
    "matched-string" : "räkna",
    "annotation-id" : 27
  }, {
    "preferred-label" : "arbeta självständigt",
    "sentiment" : "MUST_HAVE",
    "type" : "esco-skill",
    "start-position" : 1457,
    "end-position" : 1477,
    "concept-id" : "NyFu_HHd_zhz",
    "matched-string" : "arbeta självständigt",
    "annotation-id" : 28
  }, {
    "preferred-label" : "B",
    "sentiment" : "MUST_HAVE",
    "type" : "driving-licence",
    "start-position" : 1564,
    "end-position" : 1573,
    "concept-id" : "VTK8_WRx_GcM",
    "matched-string" : "B-körkort",
    "annotation-id" : 29
  } ],
  "text" : "Serviceelektriker, Caverion - Kristianstad\nÄr du intresserad av teknik och letar efter ett innovativ och hållbart företag att utvecklas inom? Då kan vi ha jobbet för dig!\n\nJust nu söker vi ansvarsfulla och ambitiösa serviceelektriker till vår filial i Kristianstad. Enheten har en lång erfarenhet och bred kompetens inom flera teknikdiscipliner såsom el, ventilation, VS, kyla och säkerhet. Vi går mot en spännande framtid och bygger ett team som består av en sammansvetsad grupp med nära samarbete med varandra.\n\nDina arbetsuppgifter \n\nSom serviceelektriker på Caverion arbetar du med tillsyn, skötsel, underhåll, installationsarbete och felsökning inom allmän fastighets och processteknisk utrustning. Du arbetar även med att säkra den dagliga driften av befintliga system. Du kommer också att medverka vid planeringen av förebyggande underhållsarbete. Viktigt att du är serviceinriktad och tycker om kundkontakter och är engagerad och kan jobba både självständigt och i team med dina kollegor.\n\nI rollen ingår även:\n\n• Planering av eget arbete \n• Utföra tekniska serviceuppdrag \n• Uppföljning och återrapportering \n• Merförsäljning genom att se möjligheter, föreslå förbättringar och uppdateringar av de tekniska systemen via uppföljningsrapporter \n\nDin bakgrund \n\n• Elteknisk utbildning \n• ECY-certifikat \n• Några års erfarenhet av arbete som elektriker \n• Kunskap om el-dokumentation \n• Erfarenhet av att räkna på jobb är en merit \n• Förmåga att kunna arbeta självständigt med dagliga kundkontakter \n• Som person är du ordningsam, social och serviceminded \n• B-körkort \n\nKort om Caverion - Building Performance\n\nNär du jobbar på Caverion växer du med oss. I takt att du skaffar dig nya kunskaper, får du också nya möjligheter. Vi uppmuntrar våra medarbetare att lära som en del av jobbet- att ställa frågor, be om hjälp och dela med sig av kunskaper. Du får också hos oss ett stort nätverk inom alla teknikområden. Vi finns i 10 länder, i Sverige är vi ungefär 3000 medarbetar och vi finns på 75 orter från Ystad till Kiruna. Läs mer på caverion.se\n\nBuilding Performance betyder att vi bygger våra omgivningar på ett smart och hållbart sätt så att företag lyckas, och att människor mår bra. Vill du veta hur? Ta en tur Caverion Smart City\n\nAnsökan & Kontakt\n\nOm du tycker att detta låter intressant och har någon fråga, kontakta ansvarig rekryterare Lisbeth Hulander (semester 11/7 - 7/8), tel. 073-081 74 04 eller mail lisbeth.m.hulander@caverion.com alt. servicechef Magnus Fridén (semester 1/8-29/8) tel. 070-384 58 07 mail magnus.friden@caverion.com \n\nAlla former för telefonsamtal som inte berör frågor om tjänsten, exempelvis rekryterings/bemanningsföretag/annonssäljare undanbedes.\n\nDin ansökan vill vi ha senaste den 31 augusti 2022. \nOBS: Urval kommer att påbörjas tidigast vecka 32.\n\nVälkommen med din ansökan!"
}