{
  "meta" : {
    "jobad" : {
      "description" : {
        "requirements" : null,
        "needs" : null,
        "company_information" : null,
        "text_formatted" : "Som ett av Sveriges ledande byggföretag har vi ett stort ansvar, men också möjligheter att skapa förändringar i hur vi ska bygga våra hus mer klimatsmart för en mer hållbar framtid. För att nå våra hållbarhetsmål behöver vi förstärka enheten Hållbarhet med ytterligare en junior fuktspecialist.\n\nI enheten Hållbarhet är vi totalt i Sverige är vi drygt 40 hållbarhetsspecialister, varav ungefär hälften i Solna, som arbetar med frågor som rör miljö, klimat, energi, byggnadsfysik, social hållbarhet och landskapsarkitektur.\n\nVår verksamhet fokuserar på stöd i tidigt skede, projektering, produktionsfrågor och frågor i byggnadernas driftsfas. Vi har en bra gemenskap med en stark lärandekultur och detta är bidragande orsaker till att vi har många nöjda och stolta medarbetare.\n\nRollen som junior fuktspecialist\nDin uppgift blir att biträda våra seniora fuktspecialister och att samarbeta med andra specialister för att uppnå rätt resultat i projekten. Utöver att arbeta operativt i våra projekt kommer du fungera som expertstöd till våra avdelningar.\n\nPrimärt kommer du att fokusera på arbete som fuktsakkunnig och som fuktstöd till projektering, oftast för miljöcertifierade byggnader, men även som stöd under produktion. \n\nDu kommer att jobba i ett entreprenörföretag där närheten till våra beställare och till produktionen är i det närmaste unik i branschen. Tillsammans med våra kollegor får vi följa projekten vi arbetar med vilket ger oss en spännande arbetsmiljö och stora utvecklingsmöjligheter. \n\nDin profil\nDu har en akademisk utbildning som är relevant för rollen och goda kunskaper i byggnadsfysik med inriktning mot fuktområdet. Vi ser positivt på om du har tidigare erfarenhet som konsult.\n\nDet är mycket meriterande om du är diplomerad fuktsakkunnig eller har erfarenhet av att arbeta som fuktsakkunnig. Det är också meriterande ifall du har kunskaper om miljöcertifieringssystem såsom BREEAM och Miljöbyggnad. Har du dessutom erfarenhet av andra certifieringssystem, exempelvis Svanen, eller specialistkunskaper inom klimatfrågan är det extra meriterande.\n\nDu har god förmåga att planera och driva ditt eget arbete. För att lyckas i rollen är du självgående, utåtriktad och skicklig på att kommunicera.\n\nDu har goda kunskaper i svenska och engelska i såväl tal som skrift.\n\nYtterligare information\nTjänsten är en tillsvidareanställning med placering på NCC:s kontor i Solna. Resor i tjänsten förekommer, främst i Stockholm/Mälardalen. B-körkort krävs för tjänsten. Du har goda kunskaper i svenska i såväl tal som skrift. I enlighet med NCC:s säkerhetskultur genomför vi bakgrundskontroll på våra slutkandidater.\n\nKontakt och ansökan\nHar du frågor om tjänsten kontakta gärna Gruppchef Fredrik Gränne, 070-227 46 76 efter den 15/8 eller HR-specialist Rekrytering Karin Österman de Wall, 079-078 72 10 efter den 17/8. Skicka in ditt CV och brev senast den 2022-08-31. Urval och intervjuer sker tidigast vecka 35 efter ansökningstidens utgång.\n\nVälkommen med din ansökan!\n\nOm oss \nVarje dag tar våra över 13 000 medarbetare beslut som förbättrar människors vardag, både idag och i morgon. Här arbetar du i en stark gemenskap tillsammans med engagerade och professionella kollegor som drivs av att lära nytt, nå uppsatta mål, dela erfarenheter och göra verklig skillnad tillsammans. Vi utmanar oss själva för att driva utvecklingen och skapar hållbara lösningar som för samhället framåt med ny kunskap.  \n\nSom ett av Nordens ledande bygg- och fastighetsutvecklingsföretag utvecklar vi kommersiella fastigheter, bygger skolor, sjukhus, bostäder, vägar, broar och annan infrastruktur som formar vårt sätt att leva, arbeta och resa i samhället. Genom vår industriverksamhet erbjuder vi produkter och tjänster med inriktning på stenmaterial och asfaltsproduktion, beläggningsuppdrag. \n\nVi värnar ett hållbart arbetsliv med starkt fokus på säkerhet, personlig utveckling och balans mellan jobb och fritid.  \n\nNCC ska spegla våra kunder såväl som samhället i stort och är beroende av medarbetare med olika kompetenser. Vi strävar efter att anställa människor med olika bakgrund och värdesätter den kunskap och erfarenhet det medför. \n\nVi undanber oss vänligen kontakt med rekryterare samt säljare av annons- eller bemanningslösningar. \n\n \n\n \n\n ",
        "conditions" : "Heltid/\r\nEj specificerat",
        "text" : "Som ett av Sveriges ledande byggföretag har vi ett stort ansvar, men också möjligheter att skapa förändringar i hur vi ska bygga våra hus mer klimatsmart för en mer hållbar framtid. För att nå våra hållbarhetsmål behöver vi förstärka enheten Hållbarhet med ytterligare en junior fuktspecialist.\n\nI enheten Hållbarhet är vi totalt i Sverige är vi drygt 40 hållbarhetsspecialister, varav ungefär hälften i Solna, som arbetar med frågor som rör miljö, klimat, energi, byggnadsfysik, social hållbarhet och landskapsarkitektur.\n\nVår verksamhet fokuserar på stöd i tidigt skede, projektering, produktionsfrågor och frågor i byggnadernas driftsfas. Vi har en bra gemenskap med en stark lärandekultur och detta är bidragande orsaker till att vi har många nöjda och stolta medarbetare.\n\nRollen som junior fuktspecialist\nDin uppgift blir att biträda våra seniora fuktspecialister och att samarbeta med andra specialister för att uppnå rätt resultat i projekten. Utöver att arbeta operativt i våra projekt kommer du fungera som expertstöd till våra avdelningar.\n\nPrimärt kommer du att fokusera på arbete som fuktsakkunnig och som fuktstöd till projektering, oftast för miljöcertifierade byggnader, men även som stöd under produktion. \n\nDu kommer att jobba i ett entreprenörföretag där närheten till våra beställare och till produktionen är i det närmaste unik i branschen. Tillsammans med våra kollegor får vi följa projekten vi arbetar med vilket ger oss en spännande arbetsmiljö och stora utvecklingsmöjligheter. \n\nDin profil\nDu har en akademisk utbildning som är relevant för rollen och goda kunskaper i byggnadsfysik med inriktning mot fuktområdet. Vi ser positivt på om du har tidigare erfarenhet som konsult.\n\nDet är mycket meriterande om du är diplomerad fuktsakkunnig eller har erfarenhet av att arbeta som fuktsakkunnig. Det är också meriterande ifall du har kunskaper om miljöcertifieringssystem såsom BREEAM och Miljöbyggnad. Har du dessutom erfarenhet av andra certifieringssystem, exempelvis Svanen, eller specialistkunskaper inom klimatfrågan är det extra meriterande.\n\nDu har god förmåga att planera och driva ditt eget arbete. För att lyckas i rollen är du självgående, utåtriktad och skicklig på att kommunicera.\n\nDu har goda kunskaper i svenska och engelska i såväl tal som skrift.\n\nYtterligare information\nTjänsten är en tillsvidareanställning med placering på NCC:s kontor i Solna. Resor i tjänsten förekommer, främst i Stockholm/Mälardalen. B-körkort krävs för tjänsten. Du har goda kunskaper i svenska i såväl tal som skrift. I enlighet med NCC:s säkerhetskultur genomför vi bakgrundskontroll på våra slutkandidater.\n\nKontakt och ansökan\nHar du frågor om tjänsten kontakta gärna Gruppchef Fredrik Gränne, 070-227 46 76 efter den 15/8 eller HR-specialist Rekrytering Karin Österman de Wall, 079-078 72 10 efter den 17/8. Skicka in ditt CV och brev senast den 2022-08-31. Urval och intervjuer sker tidigast vecka 35 efter ansökningstidens utgång.\n\nVälkommen med din ansökan!\n\nOm oss \nVarje dag tar våra över 13 000 medarbetare beslut som förbättrar människors vardag, både idag och i morgon. Här arbetar du i en stark gemenskap tillsammans med engagerade och professionella kollegor som drivs av att lära nytt, nå uppsatta mål, dela erfarenheter och göra verklig skillnad tillsammans. Vi utmanar oss själva för att driva utvecklingen och skapar hållbara lösningar som för samhället framåt med ny kunskap.  \n\nSom ett av Nordens ledande bygg- och fastighetsutvecklingsföretag utvecklar vi kommersiella fastigheter, bygger skolor, sjukhus, bostäder, vägar, broar och annan infrastruktur som formar vårt sätt att leva, arbeta och resa i samhället. Genom vår industriverksamhet erbjuder vi produkter och tjänster med inriktning på stenmaterial och asfaltsproduktion, beläggningsuppdrag. \n\nVi värnar ett hållbart arbetsliv med starkt fokus på säkerhet, personlig utveckling och balans mellan jobb och fritid.  \n\nNCC ska spegla våra kunder såväl som samhället i stort och är beroende av medarbetare med olika kompetenser. Vi strävar efter att anställa människor med olika bakgrund och värdesätter den kunskap och erfarenhet det medför. \n\nVi undanber oss vänligen kontakt med rekryterare samt säljare av annons- eller bemanningslösningar."
      },
      "headline" : "Junior fuktspecialist",
      "driving_license" : [ {
        "concept_id" : "VTK8_WRx_GcM",
        "label" : "B",
        "legacy_ams_taxonomy_id" : "3"
      } ],
      "employer" : {
        "email" : null,
        "phone_number" : null,
        "organization_number" : "5560345174",
        "name" : "NCC AB",
        "url" : "www.ncc.se",
        "workplace" : "NCC"
      },
      "removed_date" : null,
      "logo_url" : "https://www.arbetsformedlingen.se/rest/arbetsgivare/rest/af/v3/organisation/5560345174/logotyper/logo.png",
      "last_publication_date" : "2022-08-31T23:59:59",
      "number_of_vacancies" : 1,
      "occupation" : {
        "concept_id" : "qxqj_zKy_PmC",
        "label" : "Fukttekniker",
        "legacy_ams_taxonomy_id" : "7629"
      },
      "occupation_group" : {
        "concept_id" : "wCx8_rY3_XUT",
        "label" : "Brandingenjörer och byggnadsinspektörer m.fl.",
        "legacy_ams_taxonomy_id" : "3355"
      },
      "employment_type" : {
        "concept_id" : "PFZr_Syz_cUq",
        "label" : "Vanlig anställning",
        "legacy_ams_taxonomy_id" : "1"
      },
      "webpage_url" : "https://arbetsformedlingen.se/platsbanken/annonser/26292644",
      "driving_license_required" : true,
      "application_contacts" : [ ],
      "duration" : {
        "concept_id" : "a7uU_j21_mkL",
        "label" : "Tills vidare",
        "legacy_ams_taxonomy_id" : "1"
      },
      "nice_to_have" : {
        "education_level" : [ ],
        "work_experiences" : [ ],
        "skills" : [ ],
        "education" : [ ],
        "languages" : [ ]
      },
      "application_details" : {
        "via_af" : false,
        "email" : null,
        "other" : null,
        "reference" : null,
        "url" : "https://www.ncc.se/jobba-pa-ncc/ansok/?rmpage=job&rmjob=16777",
        "information" : null
      },
      "source_type" : "VIA_PLATSBANKEN_DXA",
      "application_deadline" : "2022-08-31T23:59:59",
      "external_id" : "46-556034-5174-16777",
      "workplace_address" : {
        "coordinates" : [ 18.008434, 59.368877 ],
        "city" : null,
        "postcode" : null,
        "municipality" : "Solna",
        "region_concept_id" : "CifL_Rzy_Mku",
        "region" : "Stockholms län",
        "country_code" : "199",
        "region_code" : "01",
        "municipality_concept_id" : "zHxw_uJZ_NJ8",
        "country_concept_id" : "i46j_HmG_v64",
        "municipality_code" : "0184",
        "street_address" : null,
        "country" : "Sverige"
      },
      "id" : "26292644",
      "experience_required" : true,
      "working_hours_type" : {
        "concept_id" : "6YE1_gAC_R2G",
        "label" : "Heltid",
        "legacy_ams_taxonomy_id" : "1"
      },
      "access" : null,
      "timestamp" : 1656998728416,
      "must_have" : {
        "education_level" : [ ],
        "work_experiences" : [ {
          "concept_id" : "qxqj_zKy_PmC",
          "weight" : 10,
          "label" : "Fukttekniker",
          "legacy_ams_taxonomy_id" : "7629"
        } ],
        "skills" : [ ],
        "education" : [ ],
        "languages" : [ ]
      },
      "occupation_field" : {
        "concept_id" : "E7hm_BLq_fqZ",
        "label" : "Säkerhet och bevakning",
        "legacy_ams_taxonomy_id" : "17"
      },
      "scope_of_work" : {
        "min" : 100,
        "max" : 100
      },
      "salary_type" : {
        "concept_id" : "oG8G_9cW_nRf",
        "label" : "Fast månads- vecko- eller timlön",
        "legacy_ams_taxonomy_id" : "1"
      },
      "removed" : false,
      "salary_description" : ".",
      "access_to_own_car" : false,
      "publication_date" : "2022-07-05T07:25:28"
    },
    "name" : "Junior fuktspecialist",
    "user" : "hannes"
  },
  "sha1" : "34e19d1e7c98b86d3275baffe68ce94be38f9db6",
  "annotations" : [ {
    "preferred-label" : "Sverige",
    "type" : "country",
    "start-position" : 33,
    "end-position" : 41,
    "concept-id" : "i46j_HmG_v64",
    "matched-string" : "Sveriges",
    "annotation-id" : 15
  }, {
    "preferred-label" : "Hållbar utveckling",
    "type" : "keyword",
    "start-position" : 187,
    "end-position" : 202,
    "concept-id" : "RKw3_zWW_1pf",
    "matched-string" : "hållbar framtid",
    "annotation-id" : 16
  }, {
    "preferred-label" : "Hållbar utveckling",
    "type" : "keyword",
    "start-position" : 264,
    "end-position" : 274,
    "concept-id" : "RKw3_zWW_1pf",
    "matched-string" : "Hållbarhet",
    "annotation-id" : 17
  }, {
    "preferred-label" : "Hållbar utveckling",
    "type" : "keyword",
    "start-position" : 328,
    "end-position" : 338,
    "concept-id" : "RKw3_zWW_1pf",
    "matched-string" : "Hållbarhet",
    "annotation-id" : 18
  }, {
    "preferred-label" : "Sverige",
    "type" : "country",
    "start-position" : 354,
    "end-position" : 361,
    "concept-id" : "i46j_HmG_v64",
    "matched-string" : "Sverige",
    "annotation-id" : 19
  }, {
    "preferred-label" : "Hållbar utveckling",
    "type" : "keyword",
    "start-position" : 377,
    "end-position" : 400,
    "concept-id" : "RKw3_zWW_1pf",
    "matched-string" : "hållbarhetsspecialister",
    "annotation-id" : 20
  }, {
    "preferred-label" : "Solna",
    "type" : "municipality",
    "start-position" : 426,
    "end-position" : 431,
    "concept-id" : "zHxw_uJZ_NJ8",
    "matched-string" : "Solna",
    "annotation-id" : 21
  }, {
    "preferred-label" : "Miljöfrågor",
    "type" : "skill",
    "start-position" : 464,
    "end-position" : 469,
    "concept-id" : "wLYv_Pyd_uSZ",
    "matched-string" : "miljö",
    "annotation-id" : 22
  }, {
    "preferred-label" : "Social hållbarhet",
    "sentiment" : "MUST_HAVE",
    "type" : "skill",
    "start-position" : 502,
    "end-position" : 519,
    "concept-id" : "9MoM_m8y_Em5",
    "matched-string" : "social hållbarhet",
    "annotation-id" : 0
  }, {
    "preferred-label" : "landskapsarkitektur",
    "type" : "esco-skill",
    "start-position" : 524,
    "end-position" : 543,
    "concept-id" : "VryZ_dNm_o4a",
    "matched-string" : "landskapsarkitektur",
    "annotation-id" : 23
  }, {
    "preferred-label" : "Projektering",
    "sentiment" : "MUST_HAVE",
    "type" : "skill",
    "start-position" : 595,
    "end-position" : 607,
    "concept-id" : "zRtu_fYj_XC4",
    "matched-string" : "projektering",
    "annotation-id" : 1
  }, {
    "preferred-label" : "Projektering",
    "sentiment" : "MUST_HAVE",
    "type" : "skill",
    "start-position" : 1155,
    "end-position" : 1167,
    "concept-id" : "zRtu_fYj_XC4",
    "matched-string" : "projektering",
    "annotation-id" : 2
  }, {
    "preferred-label" : "arbetsmiljö",
    "sentiment" : "MUST_HAVE",
    "type" : "esco-skill",
    "start-position" : 1480,
    "end-position" : 1491,
    "concept-id" : "zdQY_QJh_nUH",
    "matched-string" : "arbetsmiljö",
    "annotation-id" : 3
  }, {
    "preferred-label" : "Svenska",
    "sentiment" : "MUST_HAVE",
    "type" : "language",
    "start-position" : 2266,
    "end-position" : 2273,
    "concept-id" : "zSLA_vw2_FXN",
    "matched-string" : "svenska",
    "annotation-id" : 4
  }, {
    "preferred-label" : "Engelska",
    "sentiment" : "MUST_HAVE",
    "type" : "language",
    "start-position" : 2278,
    "end-position" : 2286,
    "concept-id" : "NVxJ_hLg_TYS",
    "matched-string" : "engelska",
    "annotation-id" : 5
  }, {
    "preferred-label" : "Tillsvidareanställning (inkl. eventuell provanställning)",
    "type" : "employment-type",
    "start-position" : 2351,
    "end-position" : 2373,
    "concept-id" : "kpPX_CNN_gDU",
    "matched-string" : "tillsvidareanställning",
    "annotation-id" : 24
  }, {
    "preferred-label" : "Kontor",
    "sentiment" : "MUST_HAVE",
    "type" : "keyword",
    "start-position" : 2397,
    "end-position" : 2403,
    "concept-id" : "Hyz1_7HF_AkP",
    "matched-string" : "kontor",
    "annotation-id" : 6
  }, {
    "preferred-label" : "Solna",
    "type" : "municipality",
    "start-position" : 2406,
    "end-position" : 2411,
    "concept-id" : "zHxw_uJZ_NJ8",
    "matched-string" : "Solna",
    "annotation-id" : 25
  }, {
    "preferred-label" : "Resor i arbetet förekommer",
    "type" : "work-place-environment",
    "start-position" : 2413,
    "end-position" : 2440,
    "concept-id" : "oaM2_JTK_muh",
    "matched-string" : "Resor i tjänsten förekommer",
    "annotation-id" : 26
  }, {
    "preferred-label" : "Stockholm",
    "type" : "municipality",
    "start-position" : 2451,
    "end-position" : 2460,
    "concept-id" : "AvNB_uwa_6n6",
    "matched-string" : "Stockholm",
    "annotation-id" : 27
  }, {
    "preferred-label" : "B",
    "type" : "driving-licence",
    "start-position" : 2473,
    "end-position" : 2482,
    "concept-id" : "VTK8_WRx_GcM",
    "matched-string" : "B-körkort",
    "annotation-id" : 28
  }, {
    "preferred-label" : "Svenska",
    "sentiment" : "MUST_HAVE",
    "type" : "language",
    "start-position" : 2527,
    "end-position" : 2534,
    "concept-id" : "zSLA_vw2_FXN",
    "matched-string" : "svenska",
    "annotation-id" : 8
  }, {
    "preferred-label" : "HR-specialist/HR-advisor",
    "sentiment" : "MUST_HAVE",
    "type" : "occupation-name",
    "start-position" : 2773,
    "end-position" : 2786,
    "concept-id" : "s28Q_sya_S2b",
    "matched-string" : "hr-specialist",
    "annotation-id" : 9
  }, {
    "preferred-label" : "Arbetsliv",
    "sentiment" : "MUST_HAVE",
    "type" : "keyword",
    "start-position" : 3838,
    "end-position" : 3847,
    "concept-id" : "UceZ_JCp_23T",
    "matched-string" : "arbetsliv",
    "annotation-id" : 10
  }, {
    "preferred-label" : "personlig utveckling",
    "sentiment" : "MUST_HAVE",
    "type" : "esco-skill",
    "start-position" : 3878,
    "end-position" : 3898,
    "concept-id" : "wkQj_Dah_2GD",
    "matched-string" : "personlig utveckling",
    "annotation-id" : 11
  }, {
    "preferred-label" : "Rekryterare/Rekryteringskonsult",
    "sentiment" : "MUST_HAVE",
    "type" : "occupation-name",
    "start-position" : 4199,
    "end-position" : 4210,
    "concept-id" : "QaQC_ozP_Bme",
    "matched-string" : "rekryterare",
    "annotation-id" : 13
  }, {
    "preferred-label" : "Säljare",
    "sentiment" : "MUST_HAVE",
    "type" : "keyword",
    "start-position" : 4216,
    "end-position" : 4223,
    "concept-id" : "rDcj_Tao_TJJ",
    "matched-string" : "säljare",
    "annotation-id" : 14
  } ],
  "text" : "Junior fuktspecialist\nSom ett av Sveriges ledande byggföretag har vi ett stort ansvar, men också möjligheter att skapa förändringar i hur vi ska bygga våra hus mer klimatsmart för en mer hållbar framtid. För att nå våra hållbarhetsmål behöver vi förstärka enheten Hållbarhet med ytterligare en junior fuktspecialist.\n\nI enheten Hållbarhet är vi totalt i Sverige är vi drygt 40 hållbarhetsspecialister, varav ungefär hälften i Solna, som arbetar med frågor som rör miljö, klimat, energi, byggnadsfysik, social hållbarhet och landskapsarkitektur.\n\nVår verksamhet fokuserar på stöd i tidigt skede, projektering, produktionsfrågor och frågor i byggnadernas driftsfas. Vi har en bra gemenskap med en stark lärandekultur och detta är bidragande orsaker till att vi har många nöjda och stolta medarbetare.\n\nRollen som junior fuktspecialist\nDin uppgift blir att biträda våra seniora fuktspecialister och att samarbeta med andra specialister för att uppnå rätt resultat i projekten. Utöver att arbeta operativt i våra projekt kommer du fungera som expertstöd till våra avdelningar.\n\nPrimärt kommer du att fokusera på arbete som fuktsakkunnig och som fuktstöd till projektering, oftast för miljöcertifierade byggnader, men även som stöd under produktion. \n\nDu kommer att jobba i ett entreprenörföretag där närheten till våra beställare och till produktionen är i det närmaste unik i branschen. Tillsammans med våra kollegor får vi följa projekten vi arbetar med vilket ger oss en spännande arbetsmiljö och stora utvecklingsmöjligheter. \n\nDin profil\nDu har en akademisk utbildning som är relevant för rollen och goda kunskaper i byggnadsfysik med inriktning mot fuktområdet. Vi ser positivt på om du har tidigare erfarenhet som konsult.\n\nDet är mycket meriterande om du är diplomerad fuktsakkunnig eller har erfarenhet av att arbeta som fuktsakkunnig. Det är också meriterande ifall du har kunskaper om miljöcertifieringssystem såsom BREEAM och Miljöbyggnad. Har du dessutom erfarenhet av andra certifieringssystem, exempelvis Svanen, eller specialistkunskaper inom klimatfrågan är det extra meriterande.\n\nDu har god förmåga att planera och driva ditt eget arbete. För att lyckas i rollen är du självgående, utåtriktad och skicklig på att kommunicera.\n\nDu har goda kunskaper i svenska och engelska i såväl tal som skrift.\n\nYtterligare information\nTjänsten är en tillsvidareanställning med placering på NCC:s kontor i Solna. Resor i tjänsten förekommer, främst i Stockholm/Mälardalen. B-körkort krävs för tjänsten. Du har goda kunskaper i svenska i såväl tal som skrift. I enlighet med NCC:s säkerhetskultur genomför vi bakgrundskontroll på våra slutkandidater.\n\nKontakt och ansökan\nHar du frågor om tjänsten kontakta gärna Gruppchef Fredrik Gränne, 070-227 46 76 efter den 15/8 eller HR-specialist Rekrytering Karin Österman de Wall, 079-078 72 10 efter den 17/8. Skicka in ditt CV och brev senast den 2022-08-31. Urval och intervjuer sker tidigast vecka 35 efter ansökningstidens utgång.\n\nVälkommen med din ansökan!\n\nOm oss \nVarje dag tar våra över 13 000 medarbetare beslut som förbättrar människors vardag, både idag och i morgon. Här arbetar du i en stark gemenskap tillsammans med engagerade och professionella kollegor som drivs av att lära nytt, nå uppsatta mål, dela erfarenheter och göra verklig skillnad tillsammans. Vi utmanar oss själva för att driva utvecklingen och skapar hållbara lösningar som för samhället framåt med ny kunskap.  \n\nSom ett av Nordens ledande bygg- och fastighetsutvecklingsföretag utvecklar vi kommersiella fastigheter, bygger skolor, sjukhus, bostäder, vägar, broar och annan infrastruktur som formar vårt sätt att leva, arbeta och resa i samhället. Genom vår industriverksamhet erbjuder vi produkter och tjänster med inriktning på stenmaterial och asfaltsproduktion, beläggningsuppdrag. \n\nVi värnar ett hållbart arbetsliv med starkt fokus på säkerhet, personlig utveckling och balans mellan jobb och fritid.  \n\nNCC ska spegla våra kunder såväl som samhället i stort och är beroende av medarbetare med olika kompetenser. Vi strävar efter att anställa människor med olika bakgrund och värdesätter den kunskap och erfarenhet det medför. \n\nVi undanber oss vänligen kontakt med rekryterare samt säljare av annons- eller bemanningslösningar."
}