{
  "meta" : {
    "jobad" : {
      "description" : {
        "requirements" : null,
        "needs" : null,
        "company_information" : null,
        "text_formatted" : "Huddinge är en växande Stockholmskommun med närhet till både stad och natur. Som medarbetare hos oss är du en viktig samhällsbyggare. Tillsammans skapar vi ett hållbart samhälle för alla som bor, besöker och arbetar i Huddinge.\r\n\r\nOm arbetsplatsen\nÄr du miljöinspektör och trivs med både självständigt arbete och samarbete? Vill du skapa samhällsnytta tillsammans med kunniga kollegor? Som miljöinspektör har du ett omväxlande och lärorikt arbete. Du bidrar till en god och säker miljö, likväl som en säker och trygg livsmiljö för invånarna. \n\nDenna tjänst ingår i miljöskyddsenheten på miljötillsynsavdelningen. Arbetet på både enheten och avdelningen präglas av driv och engagemang. Här ges alla chansen att utvecklas i sina yrkesroller och det finns stora möjligheter för dig att vara med och påverka verksamhetens arbete. Detta möjliggörs genom ett nära ledarskap och kontinuerlig kompetensutveckling för våra medarbetare. \n\n\nMiljötillsynsavdelningen arbetar med tillsyn och prövning inom bland annat miljöskydd, hälsoskydd, livsmedel, alkoholservering och tobaksförsäljning.\nMiljötillsynsavdelningen deltar aktivt i samhällsbyggnadsprocessen genom att yttra oss i detaljplaner och bedriva tillsyn av de stora infrastrukturprojekten som kommunen står inför. Vi arbetar löpande med att utveckla våra digitala arbetssätt och verktyg samtidigt som vi håller en hög service gentemot företag och medborgare.\n\nArbetsplatsen ligger i Flemingsberg. Till Flemingsberg åker du enkelt och snabbt med både kollektivtrafik och regionaltåg. \n\r\n\r\n-\r\n\r\nArbetsuppgifter\n\nDu arbetar med handläggning och utredning av ärenden som varierar i omfattning och komplexitet. Det innebär att du självständigt inspekterar verksamheter och analyserar och bedömer om deras verksamhet behöver förbättras med hänsyn till skyddet för människors hälsa eller miljön. Du begär in kompletteringar via telefon och brev i kontakt med privatpersoner och företag. Med stöd av lagar och regler gör du en bedömning av underlaget och fattar beslut. Vissa ärenden är enkla och snabba medan andra tar mer tid. Du jobbar med både händelsestyrd och planerad tillsyn samt löpande med verksamhetsutveckling. \n\nDina arbetsuppgifter skiftar över året eller löper på parallellt. Tillsammans med dina kollegor lägger du upp arbetet inför året.\n\nDu planerar din egen arbetsdag och driver dina ärenden både självständigt och i samverkan med andra. Du arbetar nära dina kollegor och ni ger och får stöd av varandra. Arbetet är kvalificerat och du lär dig och får nya kunskaper både på bredden och på djupet. Du deltar i olika förbättrings- och utvecklingsuppdrag parallellt med dina vanliga arbetsuppgifter. Arbetet innebär många kontakter, exempelvis med kunder och andra myndigheter. Du har flexibel arbetstid med årsarbetstidsavtal och det är en självklarhet för oss att du ska ha balans mellan arbete och fritid. Vi erbjuder även möjligheten att arbeta hemifrån i stor utsträckning.\n\r\n\r\nDin profil\n\nFör att göra ett bra jobb och trivas hos oss på miljötillsynsavdelningen behöver du vara lyhörd, tänka nytt och ta ansvar. \n\nI det här jobbet ska du:\n.\tsjälvständigt planera och driva ditt arbete framåt för att nå resultat\n.\tvara hjälpsam och bemöta andra med vänlighet och respekt\n.\tvara serviceinriktad\n.\tvara flexibel, då du jobbar med olika arbetsuppgifter olika delar av året\n.\ttala och skriva enkelt och tydligt\n.\tvara bra på att samarbeta och stötta andra för att nå gemensamma mål\n\nDu ska även ha:\n.\tutbildning till miljö- och hälsoskyddsinspektör eller ha en annan utbildning som arbetsgivaren bedömer som likvärdig. \n.\tVi ser positivt på om du har tidigare erfarenhet som miljöinspektör och specifikt om du tidigare arbetat med områdesskydd.\n.\tGiltigt B-körkort är ett krav. \n\nVi lägger stor vikt vid dina personliga egenskaper och samarbetsförmåga. \n\nBifoga ditt CV när du ansöker. Vi använder inte personligt brev i denna rekrytering så du ska därför inte bifoga det i din ansökan. Vi undanbeder oss även fotografi i ansökan.\n\nVi utför intervjuerna i personligt möte, men kan erbjuda intervju digitalt via Teams om någon av deltagarna inte har möjlighet eller det blir svårt att arrangera en tid som passar för alla.\n\nVälkommen med din ansökan!\n\nFörmåner\nFör att vi ska kunna utföra vårt uppdrag är du som medarbetare i Huddinge kommun det viktigaste vi har. Därför erbjuder vi en rad förmåner för ett hållbart arbetsliv och för att underlätta din vardag. http://www.huddinge.se/formaner\n\n\n\r\nFacklig kontaktperson\nFör facklig kontaktperson för tjänsten se http://www.huddinge.se/kontaktpersonerfack\n\nVi undanber oss alla erbjudanden om annonsering och rekryteringshjälp i samband med denna annons.",
        "conditions" : "Vikariat fram till 230901\r\nHeltid",
        "text" : "Huddinge är en växande Stockholmskommun med närhet till både stad och natur. Som medarbetare hos oss är du en viktig samhällsbyggare. Tillsammans skapar vi ett hållbart samhälle för alla som bor, besöker och arbetar i Huddinge.\r\n\r\nOm arbetsplatsen\nÄr du miljöinspektör och trivs med både självständigt arbete och samarbete? Vill du skapa samhällsnytta tillsammans med kunniga kollegor? Som miljöinspektör har du ett omväxlande och lärorikt arbete. Du bidrar till en god och säker miljö, likväl som en säker och trygg livsmiljö för invånarna. \n\nDenna tjänst ingår i miljöskyddsenheten på miljötillsynsavdelningen. Arbetet på både enheten och avdelningen präglas av driv och engagemang. Här ges alla chansen att utvecklas i sina yrkesroller och det finns stora möjligheter för dig att vara med och påverka verksamhetens arbete. Detta möjliggörs genom ett nära ledarskap och kontinuerlig kompetensutveckling för våra medarbetare. \n\n\nMiljötillsynsavdelningen arbetar med tillsyn och prövning inom bland annat miljöskydd, hälsoskydd, livsmedel, alkoholservering och tobaksförsäljning.\nMiljötillsynsavdelningen deltar aktivt i samhällsbyggnadsprocessen genom att yttra oss i detaljplaner och bedriva tillsyn av de stora infrastrukturprojekten som kommunen står inför. Vi arbetar löpande med att utveckla våra digitala arbetssätt och verktyg samtidigt som vi håller en hög service gentemot företag och medborgare.\n\nArbetsplatsen ligger i Flemingsberg. Till Flemingsberg åker du enkelt och snabbt med både kollektivtrafik och regionaltåg. \n\r\n\r\n-\r\n\r\nArbetsuppgifter\n\nDu arbetar med handläggning och utredning av ärenden som varierar i omfattning och komplexitet. Det innebär att du självständigt inspekterar verksamheter och analyserar och bedömer om deras verksamhet behöver förbättras med hänsyn till skyddet för människors hälsa eller miljön. Du begär in kompletteringar via telefon och brev i kontakt med privatpersoner och företag. Med stöd av lagar och regler gör du en bedömning av underlaget och fattar beslut. Vissa ärenden är enkla och snabba medan andra tar mer tid. Du jobbar med både händelsestyrd och planerad tillsyn samt löpande med verksamhetsutveckling. \n\nDina arbetsuppgifter skiftar över året eller löper på parallellt. Tillsammans med dina kollegor lägger du upp arbetet inför året.\n\nDu planerar din egen arbetsdag och driver dina ärenden både självständigt och i samverkan med andra. Du arbetar nära dina kollegor och ni ger och får stöd av varandra. Arbetet är kvalificerat och du lär dig och får nya kunskaper både på bredden och på djupet. Du deltar i olika förbättrings- och utvecklingsuppdrag parallellt med dina vanliga arbetsuppgifter. Arbetet innebär många kontakter, exempelvis med kunder och andra myndigheter. Du har flexibel arbetstid med årsarbetstidsavtal och det är en självklarhet för oss att du ska ha balans mellan arbete och fritid. Vi erbjuder även möjligheten att arbeta hemifrån i stor utsträckning.\n\r\n\r\nDin profil\n\nFör att göra ett bra jobb och trivas hos oss på miljötillsynsavdelningen behöver du vara lyhörd, tänka nytt och ta ansvar. \n\nI det här jobbet ska du:\n.\tsjälvständigt planera och driva ditt arbete framåt för att nå resultat\n.\tvara hjälpsam och bemöta andra med vänlighet och respekt\n.\tvara serviceinriktad\n.\tvara flexibel, då du jobbar med olika arbetsuppgifter olika delar av året\n.\ttala och skriva enkelt och tydligt\n.\tvara bra på att samarbeta och stötta andra för att nå gemensamma mål\n\nDu ska även ha:\n.\tutbildning till miljö- och hälsoskyddsinspektör eller ha en annan utbildning som arbetsgivaren bedömer som likvärdig. \n.\tVi ser positivt på om du har tidigare erfarenhet som miljöinspektör och specifikt om du tidigare arbetat med områdesskydd.\n.\tGiltigt B-körkort är ett krav. \n\nVi lägger stor vikt vid dina personliga egenskaper och samarbetsförmåga. \n\nBifoga ditt CV när du ansöker. Vi använder inte personligt brev i denna rekrytering så du ska därför inte bifoga det i din ansökan. Vi undanbeder oss även fotografi i ansökan.\n\nVi utför intervjuerna i personligt möte, men kan erbjuda intervju digitalt via Teams om någon av deltagarna inte har möjlighet eller det blir svårt att arrangera en tid som passar för alla.\n\nVälkommen med din ansökan!\n\nFörmåner\nFör att vi ska kunna utföra vårt uppdrag är du som medarbetare i Huddinge kommun det viktigaste vi har. Därför erbjuder vi en rad förmåner för ett hållbart arbetsliv och för att underlätta din vardag. http://www.huddinge.se/formaner\n\n\n\r\nFacklig kontaktperson\nFör facklig kontaktperson för tjänsten se http://www.huddinge.se/kontaktpersonerfack\n\nVi undanber oss alla erbjudanden om annonsering och rekryteringshjälp i samband med denna annons."
      },
      "headline" : "Miljöinspektör inriktning miljöskydd",
      "driving_license" : null,
      "employer" : {
        "email" : null,
        "phone_number" : null,
        "organization_number" : "2120000068",
        "name" : "Huddinge kommun",
        "url" : "www.huddinge.se",
        "workplace" : "Huddinge kommun"
      },
      "removed_date" : null,
      "logo_url" : "https://www.arbetsformedlingen.se/rest/arbetsgivare/rest/af/v3/organisation/2120000068/logotyper/logo.png",
      "last_publication_date" : "2022-08-09T23:59:59",
      "number_of_vacancies" : 1,
      "occupation" : {
        "concept_id" : "2gtP_DKV_nfQ",
        "label" : "Miljöinspektör",
        "legacy_ams_taxonomy_id" : "1921"
      },
      "occupation_group" : {
        "concept_id" : "rE1E_m3d_cx1",
        "label" : "Specialister inom miljöskydd och miljöteknik",
        "legacy_ams_taxonomy_id" : "2183"
      },
      "employment_type" : {
        "concept_id" : "PFZr_Syz_cUq",
        "label" : "Vanlig anställning",
        "legacy_ams_taxonomy_id" : "1"
      },
      "webpage_url" : "https://arbetsformedlingen.se/platsbanken/annonser/26350990",
      "driving_license_required" : false,
      "application_contacts" : [ {
        "description" : "Viveca Pernby",
        "email" : null,
        "telephone" : "08-535 360 48",
        "name" : null,
        "contact_type" : "enhetschef"
      } ],
      "duration" : {
        "concept_id" : "qQUd_4qe_NDT",
        "label" : "6 månader eller längre",
        "legacy_ams_taxonomy_id" : "2"
      },
      "nice_to_have" : {
        "education_level" : [ ],
        "work_experiences" : [ ],
        "skills" : [ ],
        "education" : [ ],
        "languages" : [ ]
      },
      "application_details" : {
        "via_af" : false,
        "email" : null,
        "other" : null,
        "reference" : "MBF:2022:26",
        "url" : "https://jobb.huddinge.se/ExternwebbV2/Ansokan/EW2OnePageAnsokan.aspx?arenderef=7120083035152596544",
        "information" : null
      },
      "source_type" : "VIA_PLATSBANKEN_DXA",
      "application_deadline" : "2022-08-09T23:59:59",
      "external_id" : "46-212000-0068-7120083035153347138",
      "workplace_address" : {
        "coordinates" : [ 17.982157, 59.23633 ],
        "city" : null,
        "postcode" : null,
        "municipality" : "Huddinge",
        "region_concept_id" : "CifL_Rzy_Mku",
        "region" : "Stockholms län",
        "country_code" : "199",
        "region_code" : "01",
        "municipality_concept_id" : "g1Gc_aXK_EKu",
        "country_concept_id" : "i46j_HmG_v64",
        "municipality_code" : "0126",
        "street_address" : null,
        "country" : "Sverige"
      },
      "id" : "26350990",
      "experience_required" : true,
      "working_hours_type" : {
        "concept_id" : "6YE1_gAC_R2G",
        "label" : "Heltid",
        "legacy_ams_taxonomy_id" : "1"
      },
      "access" : null,
      "timestamp" : 1658742743726,
      "must_have" : {
        "education_level" : [ ],
        "work_experiences" : [ {
          "concept_id" : "2gtP_DKV_nfQ",
          "weight" : 10,
          "label" : "Miljöinspektör",
          "legacy_ams_taxonomy_id" : "1921"
        } ],
        "skills" : [ ],
        "education" : [ ],
        "languages" : [ ]
      },
      "occupation_field" : {
        "concept_id" : "kJeN_wmw_9wX",
        "label" : "Naturvetenskap",
        "legacy_ams_taxonomy_id" : "14"
      },
      "scope_of_work" : {
        "min" : 100,
        "max" : 100
      },
      "salary_type" : {
        "concept_id" : "oG8G_9cW_nRf",
        "label" : "Fast månads- vecko- eller timlön",
        "legacy_ams_taxonomy_id" : "1"
      },
      "removed" : false,
      "salary_description" : "Månadslön",
      "access_to_own_car" : false,
      "publication_date" : "2022-07-25T11:52:23"
    },
    "name" : "Miljöinspektör inriktning miljöskydd",
    "user" : "hannes"
  },
  "sha1" : "a2060f16d061187949f14315f9671731837eb1af",
  "annotations" : [ {
    "preferred-label" : "miljöinspektör",
    "sentiment" : "MUST_HAVE",
    "type" : "esco-occupation",
    "start-position" : 0,
    "end-position" : 14,
    "concept-id" : "xYHb_aKs_Cky",
    "matched-string" : "miljöinspektör",
    "annotation-id" : 0
  }, {
    "preferred-label" : "Miljöskydd",
    "sentiment" : "MUST_HAVE",
    "type" : "skill",
    "start-position" : 26,
    "end-position" : 36,
    "concept-id" : "UXhY_wj1_QSW",
    "matched-string" : "miljöskydd",
    "annotation-id" : 1
  }, {
    "preferred-label" : "Huddinge",
    "type" : "municipality",
    "start-position" : 37,
    "end-position" : 45,
    "concept-id" : "g1Gc_aXK_EKu",
    "matched-string" : "Huddinge",
    "annotation-id" : 14
  }, {
    "preferred-label" : "Huddinge",
    "type" : "municipality",
    "start-position" : 255,
    "end-position" : 263,
    "concept-id" : "g1Gc_aXK_EKu",
    "matched-string" : "Huddinge",
    "annotation-id" : 15
  }, {
    "preferred-label" : "miljöinspektör",
    "sentiment" : "MUST_HAVE",
    "type" : "esco-occupation",
    "start-position" : 291,
    "end-position" : 305,
    "concept-id" : "xYHb_aKs_Cky",
    "matched-string" : "miljöinspektör",
    "annotation-id" : 2
  }, {
    "preferred-label" : "arbeta självständigt",
    "type" : "esco-skill",
    "start-position" : 325,
    "end-position" : 345,
    "concept-id" : "NyFu_HHd_zhz",
    "matched-string" : "självständigt arbete",
    "annotation-id" : 16
  }, {
    "preferred-label" : "miljöinspektör",
    "sentiment" : "MUST_HAVE",
    "type" : "esco-occupation",
    "start-position" : 427,
    "end-position" : 441,
    "concept-id" : "xYHb_aKs_Cky",
    "matched-string" : "miljöinspektör",
    "annotation-id" : 3
  }, {
    "preferred-label" : "Miljö- och hälsoskydd",
    "type" : "keyword",
    "start-position" : 1042,
    "end-position" : 1064,
    "concept-id" : "Jqei_k5E_u48",
    "matched-string" : "miljöskydd, hälsoskydd",
    "annotation-id" : 17
  }, {
    "preferred-label" : "Livsmedel",
    "sentiment" : "MUST_HAVE",
    "type" : "skill",
    "start-position" : 1066,
    "end-position" : 1075,
    "concept-id" : "tdbu_fUL_MnC",
    "matched-string" : "livsmedel",
    "annotation-id" : 5
  }, {
    "preferred-label" : "Kollektivtrafik",
    "sentiment" : "MUST_HAVE",
    "type" : "sni-level-4",
    "start-position" : 1535,
    "end-position" : 1550,
    "concept-id" : "XVG5_tVe_RFd",
    "matched-string" : "kollektivtrafik",
    "annotation-id" : 7
  }, {
    "preferred-label" : "Hälsa",
    "sentiment" : "MUST_HAVE",
    "type" : "keyword",
    "start-position" : 1854,
    "end-position" : 1859,
    "concept-id" : "Abys_5p1_Cnq",
    "matched-string" : "hälsa",
    "annotation-id" : 8
  }, {
    "preferred-label" : "arbeta självständigt",
    "type" : "esco-skill",
    "start-position" : 3140,
    "end-position" : 3153,
    "concept-id" : "NyFu_HHd_zhz",
    "matched-string" : "självständigt",
    "annotation-id" : 18
  }, {
    "preferred-label" : "Miljö- och hälsoskyddsinspektör",
    "sentiment" : "MUST_HAVE",
    "type" : "occupation-name",
    "start-position" : 3512,
    "end-position" : 3543,
    "concept-id" : "RGgm_n1E_LBx",
    "matched-string" : "miljö- och hälsoskyddsinspektör",
    "annotation-id" : 10
  }, {
    "preferred-label" : "miljöinspektör",
    "sentiment" : "MUST_HAVE",
    "type" : "esco-occupation",
    "start-position" : 3670,
    "end-position" : 3684,
    "concept-id" : "xYHb_aKs_Cky",
    "matched-string" : "miljöinspektör",
    "annotation-id" : 11
  }, {
    "preferred-label" : "B",
    "type" : "driving-licence",
    "start-position" : 3750,
    "end-position" : 3759,
    "concept-id" : "VTK8_WRx_GcM",
    "matched-string" : "B-körkort",
    "annotation-id" : 19
  }, {
    "preferred-label" : "Huddinge",
    "type" : "municipality",
    "start-position" : 4320,
    "end-position" : 4335,
    "concept-id" : "g1Gc_aXK_EKu",
    "matched-string" : "Huddinge kommun",
    "annotation-id" : 20
  }, {
    "preferred-label" : "Arbetsliv",
    "sentiment" : "MUST_HAVE",
    "type" : "keyword",
    "start-position" : 4411,
    "end-position" : 4420,
    "concept-id" : "UceZ_JCp_23T",
    "matched-string" : "arbetsliv",
    "annotation-id" : 13
  } ],
  "text" : "Miljöinspektör inriktning miljöskydd\nHuddinge är en växande Stockholmskommun med närhet till både stad och natur. Som medarbetare hos oss är du en viktig samhällsbyggare. Tillsammans skapar vi ett hållbart samhälle för alla som bor, besöker och arbetar i Huddinge.\r\n\r\nOm arbetsplatsen\nÄr du miljöinspektör och trivs med både självständigt arbete och samarbete? Vill du skapa samhällsnytta tillsammans med kunniga kollegor? Som miljöinspektör har du ett omväxlande och lärorikt arbete. Du bidrar till en god och säker miljö, likväl som en säker och trygg livsmiljö för invånarna. \n\nDenna tjänst ingår i miljöskyddsenheten på miljötillsynsavdelningen. Arbetet på både enheten och avdelningen präglas av driv och engagemang. Här ges alla chansen att utvecklas i sina yrkesroller och det finns stora möjligheter för dig att vara med och påverka verksamhetens arbete. Detta möjliggörs genom ett nära ledarskap och kontinuerlig kompetensutveckling för våra medarbetare. \n\n\nMiljötillsynsavdelningen arbetar med tillsyn och prövning inom bland annat miljöskydd, hälsoskydd, livsmedel, alkoholservering och tobaksförsäljning.\nMiljötillsynsavdelningen deltar aktivt i samhällsbyggnadsprocessen genom att yttra oss i detaljplaner och bedriva tillsyn av de stora infrastrukturprojekten som kommunen står inför. Vi arbetar löpande med att utveckla våra digitala arbetssätt och verktyg samtidigt som vi håller en hög service gentemot företag och medborgare.\n\nArbetsplatsen ligger i Flemingsberg. Till Flemingsberg åker du enkelt och snabbt med både kollektivtrafik och regionaltåg. \n\r\n\r\n-\r\n\r\nArbetsuppgifter\n\nDu arbetar med handläggning och utredning av ärenden som varierar i omfattning och komplexitet. Det innebär att du självständigt inspekterar verksamheter och analyserar och bedömer om deras verksamhet behöver förbättras med hänsyn till skyddet för människors hälsa eller miljön. Du begär in kompletteringar via telefon och brev i kontakt med privatpersoner och företag. Med stöd av lagar och regler gör du en bedömning av underlaget och fattar beslut. Vissa ärenden är enkla och snabba medan andra tar mer tid. Du jobbar med både händelsestyrd och planerad tillsyn samt löpande med verksamhetsutveckling. \n\nDina arbetsuppgifter skiftar över året eller löper på parallellt. Tillsammans med dina kollegor lägger du upp arbetet inför året.\n\nDu planerar din egen arbetsdag och driver dina ärenden både självständigt och i samverkan med andra. Du arbetar nära dina kollegor och ni ger och får stöd av varandra. Arbetet är kvalificerat och du lär dig och får nya kunskaper både på bredden och på djupet. Du deltar i olika förbättrings- och utvecklingsuppdrag parallellt med dina vanliga arbetsuppgifter. Arbetet innebär många kontakter, exempelvis med kunder och andra myndigheter. Du har flexibel arbetstid med årsarbetstidsavtal och det är en självklarhet för oss att du ska ha balans mellan arbete och fritid. Vi erbjuder även möjligheten att arbeta hemifrån i stor utsträckning.\n\r\n\r\nDin profil\n\nFör att göra ett bra jobb och trivas hos oss på miljötillsynsavdelningen behöver du vara lyhörd, tänka nytt och ta ansvar. \n\nI det här jobbet ska du:\n.\tsjälvständigt planera och driva ditt arbete framåt för att nå resultat\n.\tvara hjälpsam och bemöta andra med vänlighet och respekt\n.\tvara serviceinriktad\n.\tvara flexibel, då du jobbar med olika arbetsuppgifter olika delar av året\n.\ttala och skriva enkelt och tydligt\n.\tvara bra på att samarbeta och stötta andra för att nå gemensamma mål\n\nDu ska även ha:\n.\tutbildning till miljö- och hälsoskyddsinspektör eller ha en annan utbildning som arbetsgivaren bedömer som likvärdig. \n.\tVi ser positivt på om du har tidigare erfarenhet som miljöinspektör och specifikt om du tidigare arbetat med områdesskydd.\n.\tGiltigt B-körkort är ett krav. \n\nVi lägger stor vikt vid dina personliga egenskaper och samarbetsförmåga. \n\nBifoga ditt CV när du ansöker. Vi använder inte personligt brev i denna rekrytering så du ska därför inte bifoga det i din ansökan. Vi undanbeder oss även fotografi i ansökan.\n\nVi utför intervjuerna i personligt möte, men kan erbjuda intervju digitalt via Teams om någon av deltagarna inte har möjlighet eller det blir svårt att arrangera en tid som passar för alla.\n\nVälkommen med din ansökan!\n\nFörmåner\nFör att vi ska kunna utföra vårt uppdrag är du som medarbetare i Huddinge kommun det viktigaste vi har. Därför erbjuder vi en rad förmåner för ett hållbart arbetsliv och för att underlätta din vardag. http://www.huddinge.se/formaner\n\n\n\r\nFacklig kontaktperson\nFör facklig kontaktperson för tjänsten se http://www.huddinge.se/kontaktpersonerfack\n\nVi undanber oss alla erbjudanden om annonsering och rekryteringshjälp i samband med denna annons."
}