{
  "meta" : {
    "jobad" : {
      "description" : {
        "requirements" : null,
        "needs" : null,
        "company_information" : null,
        "text_formatted" : "<p>Denna annons gäller en familj som bor på Södermalm och har ett barn på 4 år. De behöver hjälp ca 1-3 ggr/vecka mellan 06:30-08:30 och en eftermiddag i månaden mellan 12:00-15:00. Körkort krävs ej.  </p><p>NannyDirekt är ett företag som matchar trevliga och glada nannies till privatfamiljer runtom i Sverige. Vårt kontor hittar du i Malmö. Är du en social person som tycker om att arbeta med barn? För att passa som nanny ska du självklart älska att jobba med barn, vara pigg och glad med viljan att hjälpa dina familjer och deras barn. Dessutom ska du även tycka om att att utföra olika hushållssysslor. Du är en ansvarsfull person som kan kommunicera med både din familj och med oss på NannyDirekt. Du ska ha erfarenhet av barnpassning eller annat jobb med barn sen tidigare, vara ostraffad och kunna prata svenska eller engelska flytande. Har du körkort och/eller bil är det en fördel, men inget krav.</p><p>Som barnvakt på NannyDirekt jobbar du hemma hos familjerna och skapar en trygg och rolig stund för barnen. Detta jobb är ett extrajobb som med fördel kombineras med en annan huvudsaklig sysselsättning som t.ex. studier.</p><p>Du behöver inte ansöka för varje tjänst. Har du blivit anställd kommer du kunna välja mellan flera lediga uppdrag.</p>",
        "conditions" : null,
        "text" : "Denna annons gäller en familj som bor på Södermalm och har ett barn på 4 år. De behöver hjälp ca 1-3 ggr/vecka mellan 06:30-08:30 och en eftermiddag i månaden mellan 12:00-15:00. Körkort krävs ej.  \nNannyDirekt är ett företag som matchar trevliga och glada nannies till privatfamiljer runtom i Sverige. Vårt kontor hittar du i Malmö. Är du en social person som tycker om att arbeta med barn? För att passa som nanny ska du självklart älska att jobba med barn, vara pigg och glad med viljan att hjälpa dina familjer och deras barn. Dessutom ska du även tycka om att att utföra olika hushållssysslor. Du är en ansvarsfull person som kan kommunicera med både din familj och med oss på NannyDirekt. Du ska ha erfarenhet av barnpassning eller annat jobb med barn sen tidigare, vara ostraffad och kunna prata svenska eller engelska flytande. Har du körkort och/eller bil är det en fördel, men inget krav.\nSom barnvakt på NannyDirekt jobbar du hemma hos familjerna och skapar en trygg och rolig stund för barnen. Detta jobb är ett extrajobb som med fördel kombineras med en annan huvudsaklig sysselsättning som t.ex. studier.\nDu behöver inte ansöka för varje tjänst. Har du blivit anställd kommer du kunna välja mellan flera lediga uppdrag."
      },
      "headline" : "Familj söker nanny till Södermalm EXTRAJOBB",
      "driving_license" : null,
      "employer" : {
        "email" : null,
        "phone_number" : null,
        "organization_number" : "5591744254",
        "name" : "Give me a hand AB",
        "url" : "http://www.nannydirekt.se",
        "workplace" : "Give me a hand AB"
      },
      "removed_date" : null,
      "logo_url" : "https://www.arbetsformedlingen.se/rest/arbetsgivare/rest/af/v3/arbetsplatser/86946521/logotyper/logo.png",
      "last_publication_date" : "2022-07-27T23:59:59",
      "number_of_vacancies" : 1,
      "occupation" : {
        "concept_id" : "zVkQ_wLL_78i",
        "label" : "Barnflicka/Barnvakt",
        "legacy_ams_taxonomy_id" : "438"
      },
      "occupation_group" : {
        "concept_id" : "o1gn_FoS_fB7",
        "label" : "Övrig hemservicepersonal m.fl.",
        "legacy_ams_taxonomy_id" : "9119"
      },
      "employment_type" : {
        "concept_id" : "1paU_aCR_nGn",
        "label" : "Behovsanställning",
        "legacy_ams_taxonomy_id" : "4"
      },
      "webpage_url" : "https://arbetsformedlingen.se/platsbanken/annonser/26321952",
      "driving_license_required" : false,
      "application_contacts" : [ ],
      "duration" : {
        "concept_id" : null,
        "label" : null,
        "legacy_ams_taxonomy_id" : null
      },
      "nice_to_have" : {
        "education_level" : [ ],
        "work_experiences" : [ {
          "concept_id" : "zVkQ_wLL_78i",
          "weight" : 5,
          "label" : "Barnflicka/Barnvakt",
          "legacy_ams_taxonomy_id" : "438"
        } ],
        "skills" : [ ],
        "education" : [ ],
        "languages" : [ ]
      },
      "application_details" : {
        "via_af" : false,
        "email" : null,
        "other" : null,
        "reference" : "SödermalmJUL13S",
        "url" : "https://www.nannydirekt.se/ansokan/",
        "information" : null
      },
      "source_type" : "VIA_ANNONSERA",
      "application_deadline" : "2022-07-27T23:59:59",
      "external_id" : null,
      "workplace_address" : {
        "coordinates" : [ 18.07361343676404, 59.30529494551947 ],
        "city" : "STOCKHOLM",
        "postcode" : "11860",
        "municipality" : "Stockholm",
        "region_concept_id" : "CifL_Rzy_Mku",
        "region" : "Stockholms län",
        "country_code" : "199",
        "region_code" : "01",
        "municipality_concept_id" : "AvNB_uwa_6n6",
        "country_concept_id" : "i46j_HmG_v64",
        "municipality_code" : "0180",
        "street_address" : null,
        "country" : "Sverige"
      },
      "id" : "26321952",
      "experience_required" : true,
      "working_hours_type" : {
        "concept_id" : null,
        "label" : null,
        "legacy_ams_taxonomy_id" : null
      },
      "access" : null,
      "timestamp" : 1657695470274,
      "must_have" : {
        "education_level" : [ ],
        "work_experiences" : [ ],
        "skills" : [ ],
        "education" : [ ],
        "languages" : [ ]
      },
      "occupation_field" : {
        "concept_id" : "whao_Q6A_ScE",
        "label" : "Sanering och renhållning",
        "legacy_ams_taxonomy_id" : "12"
      },
      "scope_of_work" : {
        "min" : 0,
        "max" : null
      },
      "salary_type" : {
        "concept_id" : "oG8G_9cW_nRf",
        "label" : "Fast månads- vecko- eller timlön",
        "legacy_ams_taxonomy_id" : "1"
      },
      "removed" : false,
      "salary_description" : null,
      "access_to_own_car" : false,
      "publication_date" : "2022-07-13T08:57:50"
    },
    "name" : "Familj söker nanny till Södermalm EXTRAJOBB",
    "user" : "kristof.fischer"
  },
  "sha1" : "a2208a591ddd910e419eaf5dc75369e61dd2667f",
  "annotations" : [ {
    "preferred-label" : "Barnvakt",
    "sentiment" : "MUST_HAVE",
    "type" : "occupation-name",
    "start-position" : 13,
    "end-position" : 18,
    "concept-id" : "zVkQ_wLL_78i",
    "matched-string" : "nanny",
    "annotation-id" : 0
  }, {
    "preferred-label" : "Barnvakt",
    "type" : "occupation-name",
    "start-position" : 301,
    "end-position" : 308,
    "concept-id" : "zVkQ_wLL_78i",
    "matched-string" : "nannies",
    "annotation-id" : 6
  }, {
    "preferred-label" : "Sverige",
    "type" : "country",
    "start-position" : 338,
    "end-position" : 345,
    "concept-id" : "i46j_HmG_v64",
    "matched-string" : "Sverige",
    "annotation-id" : 7
  }, {
    "preferred-label" : "Malmö",
    "type" : "municipality",
    "start-position" : 371,
    "end-position" : 376,
    "concept-id" : "oYPt_yRA_Smm",
    "matched-string" : "Malmö",
    "annotation-id" : 8
  }, {
    "preferred-label" : "Barnvakt",
    "sentiment" : "MUST_HAVE",
    "type" : "occupation-name",
    "start-position" : 454,
    "end-position" : 459,
    "concept-id" : "zVkQ_wLL_78i",
    "matched-string" : "nanny",
    "annotation-id" : 2
  }, {
    "preferred-label" : "visa ansvarstagande",
    "sentiment" : "MUST_HAVE",
    "type" : "esco-skill",
    "start-position" : 652,
    "end-position" : 663,
    "concept-id" : "bcRp_hxV_f5G",
    "matched-string" : "ansvarsfull",
    "annotation-id" : 9
  }, {
    "preferred-label" : "kommunikation",
    "sentiment" : "MUST_HAVE",
    "type" : "esco-skill",
    "start-position" : 679,
    "end-position" : 690,
    "concept-id" : "ahPU_HgE_Jeb",
    "matched-string" : "kommunicera",
    "annotation-id" : 10
  }, {
    "preferred-label" : "barnpassning",
    "sentiment" : "MUST_HAVE",
    "type" : "esco-skill",
    "start-position" : 763,
    "end-position" : 775,
    "concept-id" : "m5G2_tuy_2uZ",
    "matched-string" : "barnpassning",
    "annotation-id" : 11
  }, {
    "preferred-label" : "Svenska",
    "sentiment" : "MUST_HAVE",
    "type" : "language",
    "start-position" : 847,
    "end-position" : 854,
    "concept-id" : "zSLA_vw2_FXN",
    "matched-string" : "svenska",
    "annotation-id" : 3
  }, {
    "preferred-label" : "Engelska",
    "sentiment" : "MUST_HAVE",
    "type" : "language",
    "start-position" : 861,
    "end-position" : 869,
    "concept-id" : "NVxJ_hLg_TYS",
    "matched-string" : "engelska",
    "annotation-id" : 4
  }, {
    "preferred-label" : "B",
    "sentiment" : "NICE_TO_HAVE",
    "type" : "driving-licence",
    "start-position" : 887,
    "end-position" : 894,
    "concept-id" : "VTK8_WRx_GcM",
    "matched-string" : "körkort",
    "annotation-id" : 12
  }, {
    "preferred-label" : "Barnvakt",
    "sentiment" : "MUST_HAVE",
    "type" : "occupation-name",
    "start-position" : 947,
    "end-position" : 955,
    "concept-id" : "zVkQ_wLL_78i",
    "matched-string" : "barnvakt",
    "annotation-id" : 5
  } ],
  "text" : "Familj söker nanny till Södermalm EXTRAJOBB\nDenna annons gäller en familj som bor på Södermalm och har ett barn på 4 år. De behöver hjälp ca 1-3 ggr/vecka mellan 06:30-08:30 och en eftermiddag i månaden mellan 12:00-15:00. Körkort krävs ej.  \nNannyDirekt är ett företag som matchar trevliga och glada nannies till privatfamiljer runtom i Sverige. Vårt kontor hittar du i Malmö. Är du en social person som tycker om att arbeta med barn? För att passa som nanny ska du självklart älska att jobba med barn, vara pigg och glad med viljan att hjälpa dina familjer och deras barn. Dessutom ska du även tycka om att att utföra olika hushållssysslor. Du är en ansvarsfull person som kan kommunicera med både din familj och med oss på NannyDirekt. Du ska ha erfarenhet av barnpassning eller annat jobb med barn sen tidigare, vara ostraffad och kunna prata svenska eller engelska flytande. Har du körkort och/eller bil är det en fördel, men inget krav.\nSom barnvakt på NannyDirekt jobbar du hemma hos familjerna och skapar en trygg och rolig stund för barnen. Detta jobb är ett extrajobb som med fördel kombineras med en annan huvudsaklig sysselsättning som t.ex. studier.\nDu behöver inte ansöka för varje tjänst. Har du blivit anställd kommer du kunna välja mellan flera lediga uppdrag."
}