{
  "meta" : {
    "jobad" : {
      "description" : {
        "requirements" : null,
        "needs" : null,
        "company_information" : null,
        "text_formatted" : "Dina arbetsuppgifter\nTill vår kund i Vislanda söker vi just nu både montörer, lackerare samt truckförare. Du kommer arbeta i fräscha lokaler med många härliga kollegor. \n\nGemensamt för dessa tjänster är att du jobbar fysiskt och förväntas leverera utifrån kundens önskemål. Du jobbar efter instruktioner och anvisningar. På företaget tillverkar man kyl och frysdiskar och det ställs höga krav på mycket god kvalitet.\n\nDin profil\nDu som söker ska ha kunskap eller erfarenhet av något av följande: montering (eller likvärdigt arbete), lackering, eller truckkörning. Du behöver inte kunna eller ha jobbat med allt. Då det finns flera lediga tjänster söker vi mer än en person.\n\nUtöver någon av ovanstående kunskaper bör du vara en noggrann, praktisk och händig person. Du ska gilla fysiskt arbete och levererar alltid på topp. Du behärskar svenska obehindrat.Du som är intresserad av trucktjänsten ska ha truckkort A1-4 och B1-4. \n\nArbetstiderna är förlagda dagtid eller kvällstid, en stor fördel är därför om du kan tänka dig att jobba vilket som.\nInledningsvis blir du erbjuden en visstidsanställning hos oss på Inpeople. Om behovet kvarstår och du gör ett bra jobb finns eventuellt möjlighet till anställning direkt hos kunden framöver. Uppstart sker efter överenskommelse men med fördel så snart som möjligt.\n\nSom medarbetare på Inpeople har du en passion för att ge service. Du förstår att stort engagemang är avgörande för att ha nöjda kunder. Du tycker om att ta ansvar och kan fullt ut stå bakom vår laganda som vi kallar Inspirit.\n\nPå Inpeople värdesätter vi de kvalitéer som en jämn ålders-och könsfördelning samt etnisk och kulturell mångfald tillför vår och våra kunders verksamheter.\n\nVi tillämpar alltid löpande urval i våra rekryteringsprocesser.\n\nVarmt välkommen med din ansökan!\n\nOm oss\nSedan 2010 är vi specialister på skräddarsydda lösningar inom personaluthyrning och rekrytering. Vår mission, vårt uppdrag som vi jobbat med sedan start, är att hjälpa människor leva livet så som de själva vill leva det. Missionen leder oss på vägen mot att alltid hitta rätt person till rätt plats. Med en kultur som präglas av omtanke och snällhet driver vi Inpeople med passion och ansvar för att bidra till våra kunders framgång. \n\nInpeople är ett auktoriserat rekryterings – och bemanningsföretag med ambitionen att bidra till en bättre och mer hållbar värld. Vi är en del av Ingroup och har ett nära samarbete med vårt systerbolag Head Consulting Group. Vårt huvudkontor finns i Växjö och vi har cirka 300 hel- och deltidsanställda. \n\nVälkommen till ett annorlunda HR-företag!",
        "conditions" : "Heltid\r\nTillsvidare",
        "text" : "Dina arbetsuppgifter\nTill vår kund i Vislanda söker vi just nu både montörer, lackerare samt truckförare. Du kommer arbeta i fräscha lokaler med många härliga kollegor. \n\nGemensamt för dessa tjänster är att du jobbar fysiskt och förväntas leverera utifrån kundens önskemål. Du jobbar efter instruktioner och anvisningar. På företaget tillverkar man kyl och frysdiskar och det ställs höga krav på mycket god kvalitet.\n\nDin profil\nDu som söker ska ha kunskap eller erfarenhet av något av följande: montering (eller likvärdigt arbete), lackering, eller truckkörning. Du behöver inte kunna eller ha jobbat med allt. Då det finns flera lediga tjänster söker vi mer än en person.\n\nUtöver någon av ovanstående kunskaper bör du vara en noggrann, praktisk och händig person. Du ska gilla fysiskt arbete och levererar alltid på topp. Du behärskar svenska obehindrat.Du som är intresserad av trucktjänsten ska ha truckkort A1-4 och B1-4. \n\nArbetstiderna är förlagda dagtid eller kvällstid, en stor fördel är därför om du kan tänka dig att jobba vilket som.\nInledningsvis blir du erbjuden en visstidsanställning hos oss på Inpeople. Om behovet kvarstår och du gör ett bra jobb finns eventuellt möjlighet till anställning direkt hos kunden framöver. Uppstart sker efter överenskommelse men med fördel så snart som möjligt.\n\nSom medarbetare på Inpeople har du en passion för att ge service. Du förstår att stort engagemang är avgörande för att ha nöjda kunder. Du tycker om att ta ansvar och kan fullt ut stå bakom vår laganda som vi kallar Inspirit.\n\nPå Inpeople värdesätter vi de kvalitéer som en jämn ålders-och könsfördelning samt etnisk och kulturell mångfald tillför vår och våra kunders verksamheter.\n\nVi tillämpar alltid löpande urval i våra rekryteringsprocesser.\n\nVarmt välkommen med din ansökan!\n\nOm oss\nSedan 2010 är vi specialister på skräddarsydda lösningar inom personaluthyrning och rekrytering. Vår mission, vårt uppdrag som vi jobbat med sedan start, är att hjälpa människor leva livet så som de själva vill leva det. Missionen leder oss på vägen mot att alltid hitta rätt person till rätt plats. Med en kultur som präglas av omtanke och snällhet driver vi Inpeople med passion och ansvar för att bidra till våra kunders framgång. \n\nInpeople är ett auktoriserat rekryterings – och bemanningsföretag med ambitionen att bidra till en bättre och mer hållbar värld. Vi är en del av Ingroup och har ett nära samarbete med vårt systerbolag Head Consulting Group. Vårt huvudkontor finns i Växjö och vi har cirka 300 hel- och deltidsanställda. \n\nVälkommen till ett annorlunda HR-företag!"
      },
      "headline" : "Montörer, lackerare och truckförare sökes omgående",
      "driving_license" : null,
      "employer" : {
        "email" : null,
        "phone_number" : null,
        "organization_number" : "5567938849",
        "name" : "Inpeople Sverige AB",
        "url" : "http://www.inpeople.se",
        "workplace" : "Inpeople Sverige AB"
      },
      "removed_date" : null,
      "logo_url" : "https://www.arbetsformedlingen.se/rest/arbetsgivare/rest/af/v3/organisation/5567938849/logotyper/logo.png",
      "last_publication_date" : "2022-08-12T23:59:59",
      "number_of_vacancies" : 1,
      "occupation" : {
        "concept_id" : "rAjz_1xP_f1a",
        "label" : "Montör, metallprodukter",
        "legacy_ams_taxonomy_id" : "297"
      },
      "occupation_group" : {
        "concept_id" : "Kxm9_N3V_shF",
        "label" : "Montörer, metall-, gummi- och plastprodukter",
        "legacy_ams_taxonomy_id" : "8213"
      },
      "employment_type" : {
        "concept_id" : "PFZr_Syz_cUq",
        "label" : "Vanlig anställning",
        "legacy_ams_taxonomy_id" : "1"
      },
      "webpage_url" : "https://arbetsformedlingen.se/platsbanken/annonser/26372429",
      "driving_license_required" : false,
      "application_contacts" : [ {
        "description" : "Ida Petersson",
        "email" : null,
        "telephone" : "+46 470 70 10 62",
        "name" : null,
        "contact_type" : null
      } ],
      "duration" : {
        "concept_id" : "a7uU_j21_mkL",
        "label" : "Tills vidare",
        "legacy_ams_taxonomy_id" : "1"
      },
      "nice_to_have" : {
        "education_level" : [ ],
        "work_experiences" : [ ],
        "skills" : [ ],
        "education" : [ ],
        "languages" : [ ]
      },
      "application_details" : {
        "via_af" : false,
        "email" : null,
        "other" : null,
        "reference" : "3197",
        "url" : "https://jobb.inpeople.se/jobb/3197/ansok/",
        "information" : null
      },
      "source_type" : "VIA_PLATSBANKEN_DXA",
      "application_deadline" : "2022-08-12T23:59:59",
      "external_id" : "46-556793-8849-3197",
      "workplace_address" : {
        "coordinates" : [ 14.556001, 56.89921 ],
        "city" : null,
        "postcode" : null,
        "municipality" : "Alvesta",
        "region_concept_id" : "tF3y_MF9_h5G",
        "region" : "Kronobergs län",
        "country_code" : "199",
        "region_code" : "07",
        "municipality_concept_id" : "MMph_wmN_esc",
        "country_concept_id" : "i46j_HmG_v64",
        "municipality_code" : "0764",
        "street_address" : null,
        "country" : "Sverige"
      },
      "id" : "26372429",
      "experience_required" : false,
      "working_hours_type" : {
        "concept_id" : "6YE1_gAC_R2G",
        "label" : "Heltid",
        "legacy_ams_taxonomy_id" : "1"
      },
      "access" : null,
      "timestamp" : 1659448993865,
      "must_have" : {
        "education_level" : [ ],
        "work_experiences" : [ ],
        "skills" : [ ],
        "education" : [ ],
        "languages" : [ ]
      },
      "occupation_field" : {
        "concept_id" : "wTEr_CBC_bqh",
        "label" : "Industriell tillverkning",
        "legacy_ams_taxonomy_id" : "9"
      },
      "scope_of_work" : {
        "min" : 100,
        "max" : 100
      },
      "salary_type" : {
        "concept_id" : "oG8G_9cW_nRf",
        "label" : "Fast månads- vecko- eller timlön",
        "legacy_ams_taxonomy_id" : "1"
      },
      "removed" : false,
      "salary_description" : "Fast lön",
      "access_to_own_car" : false,
      "publication_date" : "2022-08-02T16:03:13"
    },
    "name" : "Montörer, lackerare och truckförare sökes omgående",
    "user" : "hannes"
  },
  "sha1" : "859b384f527ab8633cc57b9179e4f2c8662f69ba",
  "annotations" : [ {
    "preferred-label" : "Montörer",
    "sentiment" : "MUST_HAVE",
    "type" : "ssyk-level-3",
    "start-position" : 0,
    "end-position" : 8,
    "concept-id" : "Wz8B_WeK_vUB",
    "matched-string" : "montörer",
    "annotation-id" : 0
  }, {
    "preferred-label" : "Lackerare",
    "sentiment" : "MUST_HAVE",
    "type" : "occupation-name",
    "start-position" : 10,
    "end-position" : 19,
    "concept-id" : "v2HV_VNh_D7s",
    "matched-string" : "lackerare",
    "annotation-id" : 1
  }, {
    "preferred-label" : "truckförare",
    "sentiment" : "MUST_HAVE",
    "type" : "esco-occupation",
    "start-position" : 24,
    "end-position" : 35,
    "concept-id" : "RFLP_VeX_uCR",
    "matched-string" : "truckförare",
    "annotation-id" : 2
  }, {
    "preferred-label" : "Montörer",
    "sentiment" : "MUST_HAVE",
    "type" : "ssyk-level-3",
    "start-position" : 119,
    "end-position" : 127,
    "concept-id" : "Wz8B_WeK_vUB",
    "matched-string" : "montörer",
    "annotation-id" : 3
  }, {
    "preferred-label" : "Lackerare",
    "sentiment" : "MUST_HAVE",
    "type" : "occupation-name",
    "start-position" : 129,
    "end-position" : 138,
    "concept-id" : "v2HV_VNh_D7s",
    "matched-string" : "lackerare",
    "annotation-id" : 4
  }, {
    "preferred-label" : "truckförare",
    "sentiment" : "MUST_HAVE",
    "type" : "esco-occupation",
    "start-position" : 144,
    "end-position" : 155,
    "concept-id" : "RFLP_VeX_uCR",
    "matched-string" : "truckförare",
    "annotation-id" : 5
  }, {
    "preferred-label" : "tillämpa monteringstekniker",
    "type" : "esco-skill",
    "start-position" : 547,
    "end-position" : 556,
    "concept-id" : "sBmb_J5T_2YK",
    "matched-string" : "montering",
    "annotation-id" : 9
  }, {
    "preferred-label" : "Truckförare",
    "type" : "ssyk-level-4",
    "start-position" : 601,
    "end-position" : 613,
    "concept-id" : "MrcX_RDn_N53",
    "matched-string" : "truckkörning",
    "annotation-id" : 10
  }, {
    "preferred-label" : "noggrannhet",
    "type" : "esco-skill",
    "start-position" : 779,
    "end-position" : 787,
    "concept-id" : "mrsW_EkL_KRD",
    "matched-string" : "noggrann",
    "annotation-id" : 11
  }, {
    "preferred-label" : "Svenska",
    "sentiment" : "MUST_HAVE",
    "type" : "language",
    "start-position" : 888,
    "end-position" : 895,
    "concept-id" : "zSLA_vw2_FXN",
    "matched-string" : "svenska",
    "annotation-id" : 6
  }, {
    "preferred-label" : "A-truckar",
    "type" : "skill",
    "start-position" : 963,
    "end-position" : 967,
    "concept-id" : "Zk4h_jP4_e85",
    "matched-string" : "A1-4",
    "annotation-id" : 12
  }, {
    "preferred-label" : "B-truckar",
    "type" : "skill",
    "start-position" : 972,
    "end-position" : 976,
    "concept-id" : "HeXq_amc_ABd",
    "matched-string" : "B1-4",
    "annotation-id" : 13
  }, {
    "preferred-label" : "Allmän visstidsanställning",
    "type" : "keyword",
    "start-position" : 1131,
    "end-position" : 1150,
    "concept-id" : "hxfz_ayC_9Vd",
    "matched-string" : "visstidsanställning",
    "annotation-id" : 14
  }, {
    "preferred-label" : "Personaluthyrning",
    "sentiment" : "MUST_HAVE",
    "type" : "sni-level-3",
    "start-position" : 1914,
    "end-position" : 1931,
    "concept-id" : "eUC5_9NM_qNC",
    "matched-string" : "personaluthyrning",
    "annotation-id" : 7
  } ],
  "text" : "Montörer, lackerare och truckförare sökes omgående\nDina arbetsuppgifter\nTill vår kund i Vislanda söker vi just nu både montörer, lackerare samt truckförare. Du kommer arbeta i fräscha lokaler med många härliga kollegor. \n\nGemensamt för dessa tjänster är att du jobbar fysiskt och förväntas leverera utifrån kundens önskemål. Du jobbar efter instruktioner och anvisningar. På företaget tillverkar man kyl och frysdiskar och det ställs höga krav på mycket god kvalitet.\n\nDin profil\nDu som söker ska ha kunskap eller erfarenhet av något av följande: montering (eller likvärdigt arbete), lackering, eller truckkörning. Du behöver inte kunna eller ha jobbat med allt. Då det finns flera lediga tjänster söker vi mer än en person.\n\nUtöver någon av ovanstående kunskaper bör du vara en noggrann, praktisk och händig person. Du ska gilla fysiskt arbete och levererar alltid på topp. Du behärskar svenska obehindrat.Du som är intresserad av trucktjänsten ska ha truckkort A1-4 och B1-4. \n\nArbetstiderna är förlagda dagtid eller kvällstid, en stor fördel är därför om du kan tänka dig att jobba vilket som.\nInledningsvis blir du erbjuden en visstidsanställning hos oss på Inpeople. Om behovet kvarstår och du gör ett bra jobb finns eventuellt möjlighet till anställning direkt hos kunden framöver. Uppstart sker efter överenskommelse men med fördel så snart som möjligt.\n\nSom medarbetare på Inpeople har du en passion för att ge service. Du förstår att stort engagemang är avgörande för att ha nöjda kunder. Du tycker om att ta ansvar och kan fullt ut stå bakom vår laganda som vi kallar Inspirit.\n\nPå Inpeople värdesätter vi de kvalitéer som en jämn ålders-och könsfördelning samt etnisk och kulturell mångfald tillför vår och våra kunders verksamheter.\n\nVi tillämpar alltid löpande urval i våra rekryteringsprocesser.\n\nVarmt välkommen med din ansökan!\n\nOm oss\nSedan 2010 är vi specialister på skräddarsydda lösningar inom personaluthyrning och rekrytering. Vår mission, vårt uppdrag som vi jobbat med sedan start, är att hjälpa människor leva livet så som de själva vill leva det. Missionen leder oss på vägen mot att alltid hitta rätt person till rätt plats. Med en kultur som präglas av omtanke och snällhet driver vi Inpeople med passion och ansvar för att bidra till våra kunders framgång. \n\nInpeople är ett auktoriserat rekryterings – och bemanningsföretag med ambitionen att bidra till en bättre och mer hållbar värld. Vi är en del av Ingroup och har ett nära samarbete med vårt systerbolag Head Consulting Group. Vårt huvudkontor finns i Växjö och vi har cirka 300 hel- och deltidsanställda. \n\nVälkommen till ett annorlunda HR-företag!"
}