{
  "meta" : {
    "jobad" : {
      "description" : {
        "requirements" : null,
        "needs" : null,
        "company_information" : null,
        "text_formatted" : "<p>Är du snickare med minst fem års erfarenhet, självgående och kan arbeta med teleskoplastare?</p><p>Då är du välkommen att skicka in din ansökan till: jobb@expanderamera.se</p><p>Har du några frågor så tveka inte kontakta oss på 08-53034378                   <strong>                                           </strong></p><p><br></p>",
        "conditions" : null,
        "text" : "Är du snickare med minst fem års erfarenhet, självgående och kan arbeta med teleskoplastare?\nDå är du välkommen att skicka in din ansökan till: jobb@expanderamera.se\nHar du några frågor så tveka inte kontakta oss på 08-53034378"
      },
      "headline" : "Snickare!",
      "driving_license" : null,
      "employer" : {
        "email" : null,
        "phone_number" : null,
        "organization_number" : "5565479630",
        "name" : "Expanderamera Byggbemanning och Rekrytering AB",
        "url" : "https://expanderamera.se/",
        "workplace" : "ExpanderaMera Byggbemanning & Rekrytering AB"
      },
      "removed_date" : null,
      "logo_url" : "https://www.arbetsformedlingen.se/rest/arbetsgivare/rest/af/v3/arbetsplatser/87595137/logotyper/logo.png",
      "last_publication_date" : "2022-07-28T23:59:59",
      "number_of_vacancies" : 12,
      "occupation" : {
        "concept_id" : "4Z7F_oBG_vMG",
        "label" : "Träarbetare/Snickare",
        "legacy_ams_taxonomy_id" : "6581"
      },
      "occupation_group" : {
        "concept_id" : "9mJN_VwW_Xjg",
        "label" : "Träarbetare, snickare m.fl.",
        "legacy_ams_taxonomy_id" : "7111"
      },
      "employment_type" : {
        "concept_id" : "PFZr_Syz_cUq",
        "label" : "Vanlig anställning",
        "legacy_ams_taxonomy_id" : "1"
      },
      "webpage_url" : "https://arbetsformedlingen.se/platsbanken/annonser/26343236",
      "driving_license_required" : false,
      "application_contacts" : [ {
        "description" : null,
        "email" : "jobb@expanderamera.se",
        "telephone" : "0707703272",
        "name" : "Saya Khan",
        "contact_type" : "Rekryterare"
      } ],
      "duration" : {
        "concept_id" : "qQUd_4qe_NDT",
        "label" : "6 månader eller längre",
        "legacy_ams_taxonomy_id" : "2"
      },
      "nice_to_have" : {
        "education_level" : [ ],
        "work_experiences" : [ ],
        "skills" : [ ],
        "education" : [ ],
        "languages" : [ ]
      },
      "application_details" : {
        "via_af" : false,
        "email" : "jobb@expanderamera.se",
        "other" : null,
        "reference" : null,
        "url" : null,
        "information" : null
      },
      "source_type" : "VIA_ANNONSERA",
      "application_deadline" : "2022-07-28T23:59:59",
      "external_id" : null,
      "workplace_address" : {
        "coordinates" : [ 18.059731326884002, 59.34134909617004 ],
        "city" : "STOCKHOLM",
        "postcode" : "11351",
        "municipality" : "Stockholm",
        "region_concept_id" : "CifL_Rzy_Mku",
        "region" : "Stockholms län",
        "country_code" : "199",
        "region_code" : "01",
        "municipality_concept_id" : "AvNB_uwa_6n6",
        "country_concept_id" : "i46j_HmG_v64",
        "municipality_code" : "0180",
        "street_address" : "Luntmakargatan 66",
        "country" : "Sverige"
      },
      "id" : "26343236",
      "experience_required" : true,
      "working_hours_type" : {
        "concept_id" : "6YE1_gAC_R2G",
        "label" : "Heltid",
        "legacy_ams_taxonomy_id" : "1"
      },
      "access" : null,
      "timestamp" : 1658382490276,
      "must_have" : {
        "education_level" : [ ],
        "work_experiences" : [ {
          "concept_id" : "4Z7F_oBG_vMG",
          "weight" : 10,
          "label" : "Träarbetare/Snickare",
          "legacy_ams_taxonomy_id" : "6581"
        } ],
        "skills" : [ ],
        "education" : [ ],
        "languages" : [ ]
      },
      "occupation_field" : {
        "concept_id" : "j7Cq_ZJe_GkT",
        "label" : "Bygg och anläggning",
        "legacy_ams_taxonomy_id" : "2"
      },
      "scope_of_work" : {
        "min" : 0,
        "max" : 100
      },
      "salary_type" : {
        "concept_id" : "asrX_9Df_ukn",
        "label" : "Fast och rörlig lön",
        "legacy_ams_taxonomy_id" : "7"
      },
      "removed" : false,
      "salary_description" : null,
      "access_to_own_car" : false,
      "publication_date" : "2022-07-21T07:48:10"
    },
    "name" : "Snickare!",
    "user" : "hannes"
  },
  "sha1" : "1f4ab39b0912cf75367fe75c2895fb5d676094ba",
  "annotations" : [ {
    "preferred-label" : "snickare",
    "sentiment" : "MUST_HAVE",
    "type" : "esco-occupation",
    "start-position" : 0,
    "end-position" : 8,
    "concept-id" : "qhAJ_Euo_tNx",
    "matched-string" : "snickare",
    "annotation-id" : 0
  }, {
    "preferred-label" : "snickare",
    "sentiment" : "MUST_HAVE",
    "type" : "esco-occupation",
    "start-position" : 16,
    "end-position" : 24,
    "concept-id" : "qhAJ_Euo_tNx",
    "matched-string" : "snickare",
    "annotation-id" : 1
  }, {
    "preferred-label" : "5 års erfarenhet eller mer",
    "type" : "occupation-experience-year",
    "start-position" : 29,
    "end-position" : 53,
    "concept-id" : "8CVf_zRX_aZj",
    "matched-string" : "minst fem års erfarenhet",
    "annotation-id" : 2
  }, {
    "preferred-label" : "använda teleskoplastare",
    "type" : "esco-skill",
    "start-position" : 86,
    "end-position" : 101,
    "concept-id" : "YSQ5_hX1_Dnp",
    "matched-string" : "teleskoplastare",
    "annotation-id" : 3
  } ],
  "text" : "Snickare!\nÄr du snickare med minst fem års erfarenhet, självgående och kan arbeta med teleskoplastare?\nDå är du välkommen att skicka in din ansökan till: jobb@expanderamera.se\nHar du några frågor så tveka inte kontakta oss på 08-53034378"
}