{
  "meta" : {
    "jobad" : {
      "description" : {
        "requirements" : null,
        "needs" : null,
        "company_information" : null,
        "text_formatted" : "I Äldre samt vård- och omsorgsförvaltningen gör vi insatser som leder till goda möten med dem vi är till för och med varandra. Med en kultur, förhållningssätt och styrning- och ledning i ständig utveckling skapar vi de bästa förutsättningarna.\n\nVi är ca 9 000 medarbetare som jobbar i hela staden och som gemensamt driver verksamheten varje dag. Vi har över 50 vård- och omsorgsboenden, 200 korttidsplatser, 30 öppna träffpunkter, hemtjänst till över 8 000 personer och hälso- och sjukvård till 15 000 personer varje år.\n\nVill du också jobba för en mer meningsfull vardag och service av högsta kvalitet för invånarna i Göteborg? Välkommen till en arbetsplats där vi bryr oss om varandra, arbetar tillsammans och tänker nytt. Vi är Göteborg.\r\n\r\nARBETSUPPGIFTER\nNu söker vi en arkivarie med utvecklingsuppdrag med placering på kanslienheten under avdelning Stab och kommunikation på äldre samt vård- och omsorgsförvaltningen. Medarbetarna på enheten arbetar som ett team med kompetens inom områdena ärendehantering, nämnd- och utskottsadministration, arkiv, registratur och juridik. Arbetsplatsen finns på Opaltorget i ett nybyggt kontor, där vi arbetar aktivitetsbaserat.\n\nSom arkivarie med utvecklingsuppdrag ska du på ett handlingskraftigt sätt driva, utveckla och samordna komplexa processer och projekt. Du kommer att utarbeta såväl långsiktiga som kortsiktiga strategier för digital och analog informationshantering. I uppdraget ingår att göra analyser och arbeta med utredningar och du kommer att samarbeta med olika professioner och kompetenser inom och utom förvaltningen. \n\nFör att nå goda resultat behöver du vara bra på att fånga upp verksamheternas behov och synpunkter. I rollen ingår därför ett stort eget mandat att driva frågor och ta de kontakter som krävs. En del av ditt uppdrag är att tillsammans med förvaltningens övriga dataskyddskontakter driva och samordna arbetet med dataskyddsfrågor. \n\nFörvaltningen är i startgroparna med att bygga en ny arkivlokal med placering i förvaltningens huvudkontor på Zirkongatan. Du kommer att vara en viktig del i att planera hur det nya arkivet ska utformas och säkerställa rutiner för inleveranser av handlingar från förvaltningens olika närarkiv runtom i staden. \n\nSom arkivarie med utvecklingsuppdrag säkerställer du tillsammans med förvaltningens övriga arkivarier förvaltningens efterlevnad av de lagar och bestämmelser som finns inom arkivområdet. Du har en serviceinriktad roll och är ett stöd till förvaltningens verksamheter i frågor som rör arkiv och informationshantering. \r\n\r\nKVALIFIKATIONER\nVi söker dig som har högskoleutbildning inom arkiv- och informationsvetenskap med minst 60 hp. Du har kunskaper inom relevant lagstiftning så som arkivlagen, offentlighets- och sekretesslagen och dataskyddsförordningen. Du har erfarenhet av arbete med digital informationshantering samt informationssäkerhet och dataskyddsfrågor, samt flera års erfarenhet som arkivarie vid offentlig förvaltning i en samordnande och strategisk roll. \n\nUppdraget kräver att du har erfarenhet av att utreda juridiska frågor kopplade till hantering, bevarande och gallring av allmänna handlingar i förhållande till relevant lagstiftning, bland annat HSL, PdL, SoL, OSL och DSF.  Du ska ha erfarenhet av att ha arbetat med verksamheter inom hälso- och sjukvård samt äldreomsorg och ha god kunskap om informationshanteringsprocesserna inom områdena. Meriterande är om du har erfarenhet av projektledning. \n\nUppdraget kräver att du har förmåga att kunna identifiera och analysera kärnan i ett problem, se samband och dra logiska slutsatser utifrån begränsad och/eller komplex information samt föreslå möjliga lösningar. Du behöver kunna arbeta strukturerat och upprätta tydliga mål och planera aktiviteter och projekt i god tid, samt metodiskt följa upp ditt arbete och säkerställa att det håller en hög kvalitet.   \n\nDu får energi av att bidra till andras lärande och du skapar förutsättningar för att lärande ska kunna ske. Du har förmåga att förklara problem och information för olika mottagare och ur olika perspektiv och du uppmuntrar till dialog, delaktighet och engagemang.  \r\n\nÖVRIGT\nGöteborgs Stad är en av Sveriges största arbetsgivare. Vi arbetar aktivt för att främja lika rättigheter och möjligheter samt att motverka diskriminering. Som medarbetare i äldre samt vård- och omsorgsförvaltningen erbjuder vi dig:\n• Trygg anställning med goda anställningsvillkor\n• Karriärmöjligheter \n• Internutbildningar\n• Spännande och meningsfulla arbetsuppgifter\n• Introduktion vid nyanställning\n• Heltid med möjlighet till deltid\n• Friskvårdsbidrag, cykelbidrag samt andra rabatter och erbjudanden\n\nNär du söker jobb hos oss tar vi endast emot ansökningar via vårt rekryteringssystem i enlighet med GDPR.\n\nTill dig som företräder bemannings- och rekryteringsföretag: \nInför denna rekrytering har vi tagit ställning till rekryteringskanaler och därför undanber vi oss ytterligare erbjudanden om kompetensförmedling, annonserings- och rekryteringshjälp.",
        "conditions" : "Heltid.  Dagtid.\r\nTillsvidareanställning, tillträde: Tillträde efter överenskommelse.",
        "text" : "I Äldre samt vård- och omsorgsförvaltningen gör vi insatser som leder till goda möten med dem vi är till för och med varandra. Med en kultur, förhållningssätt och styrning- och ledning i ständig utveckling skapar vi de bästa förutsättningarna.\n\nVi är ca 9 000 medarbetare som jobbar i hela staden och som gemensamt driver verksamheten varje dag. Vi har över 50 vård- och omsorgsboenden, 200 korttidsplatser, 30 öppna träffpunkter, hemtjänst till över 8 000 personer och hälso- och sjukvård till 15 000 personer varje år.\n\nVill du också jobba för en mer meningsfull vardag och service av högsta kvalitet för invånarna i Göteborg? Välkommen till en arbetsplats där vi bryr oss om varandra, arbetar tillsammans och tänker nytt. Vi är Göteborg.\r\n\r\nARBETSUPPGIFTER\nNu söker vi en arkivarie med utvecklingsuppdrag med placering på kanslienheten under avdelning Stab och kommunikation på äldre samt vård- och omsorgsförvaltningen. Medarbetarna på enheten arbetar som ett team med kompetens inom områdena ärendehantering, nämnd- och utskottsadministration, arkiv, registratur och juridik. Arbetsplatsen finns på Opaltorget i ett nybyggt kontor, där vi arbetar aktivitetsbaserat.\n\nSom arkivarie med utvecklingsuppdrag ska du på ett handlingskraftigt sätt driva, utveckla och samordna komplexa processer och projekt. Du kommer att utarbeta såväl långsiktiga som kortsiktiga strategier för digital och analog informationshantering. I uppdraget ingår att göra analyser och arbeta med utredningar och du kommer att samarbeta med olika professioner och kompetenser inom och utom förvaltningen. \n\nFör att nå goda resultat behöver du vara bra på att fånga upp verksamheternas behov och synpunkter. I rollen ingår därför ett stort eget mandat att driva frågor och ta de kontakter som krävs. En del av ditt uppdrag är att tillsammans med förvaltningens övriga dataskyddskontakter driva och samordna arbetet med dataskyddsfrågor. \n\nFörvaltningen är i startgroparna med att bygga en ny arkivlokal med placering i förvaltningens huvudkontor på Zirkongatan. Du kommer att vara en viktig del i att planera hur det nya arkivet ska utformas och säkerställa rutiner för inleveranser av handlingar från förvaltningens olika närarkiv runtom i staden. \n\nSom arkivarie med utvecklingsuppdrag säkerställer du tillsammans med förvaltningens övriga arkivarier förvaltningens efterlevnad av de lagar och bestämmelser som finns inom arkivområdet. Du har en serviceinriktad roll och är ett stöd till förvaltningens verksamheter i frågor som rör arkiv och informationshantering. \r\n\r\nKVALIFIKATIONER\nVi söker dig som har högskoleutbildning inom arkiv- och informationsvetenskap med minst 60 hp. Du har kunskaper inom relevant lagstiftning så som arkivlagen, offentlighets- och sekretesslagen och dataskyddsförordningen. Du har erfarenhet av arbete med digital informationshantering samt informationssäkerhet och dataskyddsfrågor, samt flera års erfarenhet som arkivarie vid offentlig förvaltning i en samordnande och strategisk roll. \n\nUppdraget kräver att du har erfarenhet av att utreda juridiska frågor kopplade till hantering, bevarande och gallring av allmänna handlingar i förhållande till relevant lagstiftning, bland annat HSL, PdL, SoL, OSL och DSF.  Du ska ha erfarenhet av att ha arbetat med verksamheter inom hälso- och sjukvård samt äldreomsorg och ha god kunskap om informationshanteringsprocesserna inom områdena. Meriterande är om du har erfarenhet av projektledning. \n\nUppdraget kräver att du har förmåga att kunna identifiera och analysera kärnan i ett problem, se samband och dra logiska slutsatser utifrån begränsad och/eller komplex information samt föreslå möjliga lösningar. Du behöver kunna arbeta strukturerat och upprätta tydliga mål och planera aktiviteter och projekt i god tid, samt metodiskt följa upp ditt arbete och säkerställa att det håller en hög kvalitet.   \n\nDu får energi av att bidra till andras lärande och du skapar förutsättningar för att lärande ska kunna ske. Du har förmåga att förklara problem och information för olika mottagare och ur olika perspektiv och du uppmuntrar till dialog, delaktighet och engagemang.  \r\n\nÖVRIGT\nGöteborgs Stad är en av Sveriges största arbetsgivare. Vi arbetar aktivt för att främja lika rättigheter och möjligheter samt att motverka diskriminering. Som medarbetare i äldre samt vård- och omsorgsförvaltningen erbjuder vi dig:\n• Trygg anställning med goda anställningsvillkor\n• Karriärmöjligheter \n• Internutbildningar\n• Spännande och meningsfulla arbetsuppgifter\n• Introduktion vid nyanställning\n• Heltid med möjlighet till deltid\n• Friskvårdsbidrag, cykelbidrag samt andra rabatter och erbjudanden\n\nNär du söker jobb hos oss tar vi endast emot ansökningar via vårt rekryteringssystem i enlighet med GDPR.\n\nTill dig som företräder bemannings- och rekryteringsföretag: \nInför denna rekrytering har vi tagit ställning till rekryteringskanaler och därför undanber vi oss ytterligare erbjudanden om kompetensförmedling, annonserings- och rekryteringshjälp."
      },
      "headline" : "Arkivarie med utvecklingsuppdrag ",
      "driving_license" : null,
      "employer" : {
        "email" : null,
        "phone_number" : null,
        "organization_number" : "2120001355",
        "name" : "GÖTEBORGS KOMMUN",
        "url" : null,
        "workplace" : "Göteborgs Stad , Äldre samt vård- och omsorgsförvaltningen"
      },
      "removed_date" : null,
      "logo_url" : "https://www.arbetsformedlingen.se/rest/arbetsgivare/rest/af/v3/organisation/2120001355/logotyper/logo.png",
      "last_publication_date" : "2022-08-14T23:59:59",
      "number_of_vacancies" : 1,
      "occupation" : {
        "concept_id" : "E7nX_ux2_hF9",
        "label" : "Arkivarie",
        "legacy_ams_taxonomy_id" : "5898"
      },
      "occupation_group" : {
        "concept_id" : "wVfo_Njx_1rB",
        "label" : "Bibliotekarier och arkivarier",
        "legacy_ams_taxonomy_id" : "2622"
      },
      "employment_type" : {
        "concept_id" : "PFZr_Syz_cUq",
        "label" : "Vanlig anställning",
        "legacy_ams_taxonomy_id" : "1"
      },
      "webpage_url" : "https://arbetsformedlingen.se/platsbanken/annonser/26299141",
      "driving_license_required" : false,
      "application_contacts" : [ {
        "description" : "Ulrika Stridvall Dahlén",
        "email" : "ulrika.stridvall.dahlen@aldrevardomsorg.goteborg.se",
        "telephone" : null,
        "name" : null,
        "contact_type" : "Avdelningschef Stab och Kommunikation"
      } ],
      "duration" : {
        "concept_id" : "a7uU_j21_mkL",
        "label" : "Tills vidare",
        "legacy_ams_taxonomy_id" : "1"
      },
      "nice_to_have" : {
        "education_level" : [ ],
        "work_experiences" : [ ],
        "skills" : [ ],
        "education" : [ ],
        "languages" : [ ]
      },
      "application_details" : {
        "via_af" : false,
        "email" : null,
        "other" : null,
        "reference" : "C95583",
        "url" : "https://recruit.visma.com/Public/Apply.aspx?guidAssignment=45681d0e-b219-4ecb-bc24-af5e5743e1a9&publishCode=AMS&TK=0c6bd3e6-d98c-437b-9216-51ca23128462",
        "information" : null
      },
      "source_type" : "VIA_PLATSBANKEN_DXA",
      "application_deadline" : "2022-08-14T23:59:59",
      "external_id" : "46-212000-1355-45681D0EB2194ECBBC24AF5E5743E1A9",
      "workplace_address" : {
        "coordinates" : [ 11.97456, 57.70887 ],
        "city" : null,
        "postcode" : null,
        "municipality" : "Göteborg",
        "region_concept_id" : "zdoY_6u5_Krt",
        "region" : "Västra Götalands län",
        "country_code" : "199",
        "region_code" : "14",
        "municipality_concept_id" : "PVZL_BQT_XtL",
        "country_concept_id" : "i46j_HmG_v64",
        "municipality_code" : "1480",
        "street_address" : null,
        "country" : "Sverige"
      },
      "id" : "26299141",
      "experience_required" : true,
      "working_hours_type" : {
        "concept_id" : "6YE1_gAC_R2G",
        "label" : "Heltid",
        "legacy_ams_taxonomy_id" : "1"
      },
      "access" : null,
      "timestamp" : 1657100428241,
      "must_have" : {
        "education_level" : [ ],
        "work_experiences" : [ {
          "concept_id" : "E7nX_ux2_hF9",
          "weight" : 10,
          "label" : "Arkivarie",
          "legacy_ams_taxonomy_id" : "5898"
        } ],
        "skills" : [ ],
        "education" : [ ],
        "languages" : [ ]
      },
      "occupation_field" : {
        "concept_id" : "9puE_nYg_crq",
        "label" : "Kultur, media, design",
        "legacy_ams_taxonomy_id" : "11"
      },
      "scope_of_work" : {
        "min" : 100,
        "max" : 100
      },
      "salary_type" : {
        "concept_id" : "oG8G_9cW_nRf",
        "label" : "Fast månads- vecko- eller timlön",
        "legacy_ams_taxonomy_id" : "1"
      },
      "removed" : false,
      "salary_description" : "Enligt avtal.",
      "access_to_own_car" : false,
      "publication_date" : "2022-07-06T11:40:28"
    },
    "name" : "Arkivarie med utvecklingsuppdrag ",
    "user" : "kristof.fischer"
  },
  "sha1" : "f22592d652bf5a4340e9e197fe22690afd04c5b6",
  "annotations" : [ {
    "preferred-label" : "Arkivarie",
    "sentiment" : "MUST_HAVE",
    "type" : "occupation-name",
    "start-position" : 0,
    "end-position" : 9,
    "concept-id" : "E7nX_ux2_hF9",
    "matched-string" : "arkivarie",
    "annotation-id" : 0
  }, {
    "preferred-label" : "Göteborg",
    "type" : "municipality",
    "start-position" : 653,
    "end-position" : 661,
    "concept-id" : "PVZL_BQT_XtL",
    "matched-string" : "Göteborg",
    "annotation-id" : 12
  }, {
    "preferred-label" : "Göteborg",
    "type" : "municipality",
    "start-position" : 765,
    "end-position" : 773,
    "concept-id" : "PVZL_BQT_XtL",
    "matched-string" : "Göteborg",
    "annotation-id" : 13
  }, {
    "preferred-label" : "Arkivarie",
    "sentiment" : "MUST_HAVE",
    "type" : "occupation-name",
    "start-position" : 809,
    "end-position" : 818,
    "concept-id" : "E7nX_ux2_hF9",
    "matched-string" : "arkivarie",
    "annotation-id" : 3
  }, {
    "preferred-label" : "Arkivarie",
    "sentiment" : "MUST_HAVE",
    "type" : "occupation-name",
    "start-position" : 1210,
    "end-position" : 1219,
    "concept-id" : "E7nX_ux2_hF9",
    "matched-string" : "arkivarie",
    "annotation-id" : 6
  }, {
    "preferred-label" : "dataskydd",
    "sentiment" : "MUST_HAVE",
    "type" : "esco-skill",
    "start-position" : 1927,
    "end-position" : 1943,
    "concept-id" : "J7Xa_3VE_VTe",
    "matched-string" : "dataskyddsfrågor",
    "annotation-id" : 14
  }, {
    "preferred-label" : "Arkivarie",
    "sentiment" : "MUST_HAVE",
    "type" : "occupation-name",
    "start-position" : 2263,
    "end-position" : 2272,
    "concept-id" : "E7nX_ux2_hF9",
    "matched-string" : "arkivarie",
    "annotation-id" : 7
  }, {
    "preferred-label" : "Universitets- eller högskoleutbildning",
    "sentiment" : "MUST_HAVE",
    "type" : "sni-level-4",
    "start-position" : 2617,
    "end-position" : 2635,
    "concept-id" : "m1vC_Ssq_5Y7",
    "matched-string" : "högskoleutbildning",
    "annotation-id" : 15
  }, {
    "preferred-label" : "Dokumentations- och informationsvetenskap",
    "sentiment" : "MUST_HAVE",
    "type" : "sun-education-field-4",
    "start-position" : 2641,
    "end-position" : 2673,
    "concept-id" : "eaWv_6EA_ZG2",
    "matched-string" : "arkiv- och informationsvetenskap",
    "annotation-id" : 16
  }, {
    "preferred-label" : "Arkivkunskap",
    "sentiment" : "MUST_HAVE",
    "type" : "skill",
    "start-position" : 2742,
    "end-position" : 2752,
    "concept-id" : "Em9g_vpP_fDo",
    "matched-string" : "arkivlagen",
    "annotation-id" : 17
  }, {
    "preferred-label" : "dataskydd",
    "sentiment" : "MUST_HAVE",
    "type" : "esco-skill",
    "start-position" : 2754,
    "end-position" : 2787,
    "concept-id" : "J7Xa_3VE_VTe",
    "matched-string" : "offentlighets- och sekretesslagen",
    "annotation-id" : 18
  }, {
    "preferred-label" : "dataskydd",
    "sentiment" : "MUST_HAVE",
    "type" : "esco-skill",
    "start-position" : 2792,
    "end-position" : 2814,
    "concept-id" : "J7Xa_3VE_VTe",
    "matched-string" : "dataskyddsförordningen",
    "annotation-id" : 19
  }, {
    "preferred-label" : "leda daglig informationsverksamhet",
    "sentiment" : "MUST_HAVE",
    "type" : "esco-skill",
    "start-position" : 2856,
    "end-position" : 2877,
    "concept-id" : "vnw6_9PF_ots",
    "matched-string" : "informationshantering",
    "annotation-id" : 20
  }, {
    "preferred-label" : "Informationssäkerhet",
    "sentiment" : "MUST_HAVE",
    "type" : "skill",
    "start-position" : 2883,
    "end-position" : 2903,
    "concept-id" : "LqRT_TVB_RPo",
    "matched-string" : "informationssäkerhet",
    "annotation-id" : 8
  }, {
    "preferred-label" : "dataskydd",
    "sentiment" : "MUST_HAVE",
    "type" : "esco-skill",
    "start-position" : 2908,
    "end-position" : 2924,
    "concept-id" : "J7Xa_3VE_VTe",
    "matched-string" : "dataskyddsfrågor",
    "annotation-id" : 21
  }, {
    "preferred-label" : "Arkivarie",
    "sentiment" : "MUST_HAVE",
    "type" : "occupation-name",
    "start-position" : 2956,
    "end-position" : 2965,
    "concept-id" : "E7nX_ux2_hF9",
    "matched-string" : "arkivarie",
    "annotation-id" : 9
  }, {
    "preferred-label" : "Offentlig förvaltning",
    "sentiment" : "MUST_HAVE",
    "type" : "keyword",
    "start-position" : 2970,
    "end-position" : 2991,
    "concept-id" : "dBcK_fLJ_PEj",
    "matched-string" : "offentlig förvaltning",
    "annotation-id" : 10
  }, {
    "preferred-label" : "juridik",
    "sentiment" : "MUST_HAVE",
    "type" : "esco-skill",
    "start-position" : 3078,
    "end-position" : 3101,
    "concept-id" : "DtTv_E8V_YhP",
    "matched-string" : "utreda juridiska frågor",
    "annotation-id" : 22
  }, {
    "preferred-label" : null,
    "sentiment" : "MUST_HAVE",
    "type" : "skill",
    "start-position" : 3227,
    "comment" : "hälso- och sjukvårdslag",
    "end-position" : 3230,
    "concept-id" : null,
    "matched-string" : "HSL",
    "annotation-id" : 23
  }, {
    "preferred-label" : null,
    "sentiment" : "MUST_HAVE",
    "type" : "skill",
    "start-position" : 3232,
    "comment" : "patientdatalag",
    "end-position" : 3235,
    "concept-id" : null,
    "matched-string" : "PdL",
    "annotation-id" : 24
  }, {
    "preferred-label" : null,
    "sentiment" : "MUST_HAVE",
    "type" : "skill",
    "start-position" : 3237,
    "comment" : "socialtjänstlag",
    "end-position" : 3240,
    "concept-id" : null,
    "matched-string" : "SoL",
    "annotation-id" : 25
  }, {
    "preferred-label" : null,
    "sentiment" : "MUST_HAVE",
    "type" : "skill",
    "start-position" : 3242,
    "comment" : "offentlighets- och sekretesslag",
    "end-position" : 3245,
    "concept-id" : null,
    "matched-string" : "OSL",
    "annotation-id" : 26
  }, {
    "preferred-label" : "dataskydd",
    "sentiment" : "MUST_HAVE",
    "type" : "esco-skill",
    "start-position" : 3250,
    "comment" : "datasykddsförordningen",
    "end-position" : 3253,
    "concept-id" : "J7Xa_3VE_VTe",
    "matched-string" : "DSF",
    "annotation-id" : 27
  }, {
    "preferred-label" : "Övriga inom hälsovård",
    "sentiment" : "MUST_HAVE",
    "type" : "isco-level-4",
    "start-position" : 3317,
    "end-position" : 3336,
    "concept-id" : "DUJ9_unK_Qw8",
    "matched-string" : "hälso- och sjukvård",
    "annotation-id" : 28
  }, {
    "preferred-label" : "Äldreomsorg",
    "sentiment" : "MUST_HAVE",
    "type" : "skill",
    "start-position" : 3342,
    "end-position" : 3353,
    "concept-id" : "Yt2Z_1pY_MNz",
    "matched-string" : "äldreomsorg",
    "annotation-id" : 29
  }, {
    "preferred-label" : "Informationssäkerhet",
    "sentiment" : "MUST_HAVE",
    "type" : "skill",
    "start-position" : 3376,
    "end-position" : 3409,
    "concept-id" : "LqRT_TVB_RPo",
    "matched-string" : "informationshanteringsprocesserna",
    "annotation-id" : 30
  }, {
    "preferred-label" : "Projektledning, erfarenhet",
    "sentiment" : "NICE_TO_HAVE",
    "type" : "skill",
    "start-position" : 3464,
    "end-position" : 3478,
    "concept-id" : "3TSx_fJE_Z26",
    "matched-string" : "projektledning",
    "annotation-id" : 31
  }, {
    "preferred-label" : "analysera problem och de möjligheter de innebär",
    "sentiment" : "MUST_HAVE",
    "type" : "esco-skill",
    "start-position" : 3522,
    "end-position" : 3574,
    "concept-id" : "qH7z_szs_4ob",
    "matched-string" : "kunna identifiera och analysera kärnan i ett problem",
    "annotation-id" : 32
  }, {
    "preferred-label" : null,
    "sentiment" : "MUST_HAVE",
    "type" : "skill",
    "start-position" : 3576,
    "end-position" : 3586,
    "concept-id" : null,
    "matched-string" : "se samband",
    "annotation-id" : 33
  }, {
    "preferred-label" : null,
    "sentiment" : "MUST_HAVE",
    "type" : "skill",
    "start-position" : 3591,
    "end-position" : 3613,
    "concept-id" : null,
    "matched-string" : "dra logiska slutsatser",
    "annotation-id" : 34
  }, {
    "preferred-label" : "hitta lösningar på problem",
    "sentiment" : "MUST_HAVE",
    "type" : "esco-skill",
    "start-position" : 3667,
    "end-position" : 3692,
    "concept-id" : "WFSY_Bwt_QWE",
    "matched-string" : "föreslå möjliga lösningar",
    "annotation-id" : 35
  }, {
    "preferred-label" : "kommunikation",
    "sentiment" : "MUST_HAVE",
    "type" : "esco-skill",
    "start-position" : 4007,
    "end-position" : 4035,
    "concept-id" : "ahPU_HgE_Jeb",
    "matched-string" : "förmåga att förklara problem",
    "annotation-id" : 36
  } ],
  "text" : "Arkivarie med utvecklingsuppdrag \nI Äldre samt vård- och omsorgsförvaltningen gör vi insatser som leder till goda möten med dem vi är till för och med varandra. Med en kultur, förhållningssätt och styrning- och ledning i ständig utveckling skapar vi de bästa förutsättningarna.\n\nVi är ca 9 000 medarbetare som jobbar i hela staden och som gemensamt driver verksamheten varje dag. Vi har över 50 vård- och omsorgsboenden, 200 korttidsplatser, 30 öppna träffpunkter, hemtjänst till över 8 000 personer och hälso- och sjukvård till 15 000 personer varje år.\n\nVill du också jobba för en mer meningsfull vardag och service av högsta kvalitet för invånarna i Göteborg? Välkommen till en arbetsplats där vi bryr oss om varandra, arbetar tillsammans och tänker nytt. Vi är Göteborg.\r\n\r\nARBETSUPPGIFTER\nNu söker vi en arkivarie med utvecklingsuppdrag med placering på kanslienheten under avdelning Stab och kommunikation på äldre samt vård- och omsorgsförvaltningen. Medarbetarna på enheten arbetar som ett team med kompetens inom områdena ärendehantering, nämnd- och utskottsadministration, arkiv, registratur och juridik. Arbetsplatsen finns på Opaltorget i ett nybyggt kontor, där vi arbetar aktivitetsbaserat.\n\nSom arkivarie med utvecklingsuppdrag ska du på ett handlingskraftigt sätt driva, utveckla och samordna komplexa processer och projekt. Du kommer att utarbeta såväl långsiktiga som kortsiktiga strategier för digital och analog informationshantering. I uppdraget ingår att göra analyser och arbeta med utredningar och du kommer att samarbeta med olika professioner och kompetenser inom och utom förvaltningen. \n\nFör att nå goda resultat behöver du vara bra på att fånga upp verksamheternas behov och synpunkter. I rollen ingår därför ett stort eget mandat att driva frågor och ta de kontakter som krävs. En del av ditt uppdrag är att tillsammans med förvaltningens övriga dataskyddskontakter driva och samordna arbetet med dataskyddsfrågor. \n\nFörvaltningen är i startgroparna med att bygga en ny arkivlokal med placering i förvaltningens huvudkontor på Zirkongatan. Du kommer att vara en viktig del i att planera hur det nya arkivet ska utformas och säkerställa rutiner för inleveranser av handlingar från förvaltningens olika närarkiv runtom i staden. \n\nSom arkivarie med utvecklingsuppdrag säkerställer du tillsammans med förvaltningens övriga arkivarier förvaltningens efterlevnad av de lagar och bestämmelser som finns inom arkivområdet. Du har en serviceinriktad roll och är ett stöd till förvaltningens verksamheter i frågor som rör arkiv och informationshantering. \r\n\r\nKVALIFIKATIONER\nVi söker dig som har högskoleutbildning inom arkiv- och informationsvetenskap med minst 60 hp. Du har kunskaper inom relevant lagstiftning så som arkivlagen, offentlighets- och sekretesslagen och dataskyddsförordningen. Du har erfarenhet av arbete med digital informationshantering samt informationssäkerhet och dataskyddsfrågor, samt flera års erfarenhet som arkivarie vid offentlig förvaltning i en samordnande och strategisk roll. \n\nUppdraget kräver att du har erfarenhet av att utreda juridiska frågor kopplade till hantering, bevarande och gallring av allmänna handlingar i förhållande till relevant lagstiftning, bland annat HSL, PdL, SoL, OSL och DSF.  Du ska ha erfarenhet av att ha arbetat med verksamheter inom hälso- och sjukvård samt äldreomsorg och ha god kunskap om informationshanteringsprocesserna inom områdena. Meriterande är om du har erfarenhet av projektledning. \n\nUppdraget kräver att du har förmåga att kunna identifiera och analysera kärnan i ett problem, se samband och dra logiska slutsatser utifrån begränsad och/eller komplex information samt föreslå möjliga lösningar. Du behöver kunna arbeta strukturerat och upprätta tydliga mål och planera aktiviteter och projekt i god tid, samt metodiskt följa upp ditt arbete och säkerställa att det håller en hög kvalitet.   \n\nDu får energi av att bidra till andras lärande och du skapar förutsättningar för att lärande ska kunna ske. Du har förmåga att förklara problem och information för olika mottagare och ur olika perspektiv och du uppmuntrar till dialog, delaktighet och engagemang.  \r\n\nÖVRIGT\nGöteborgs Stad är en av Sveriges största arbetsgivare. Vi arbetar aktivt för att främja lika rättigheter och möjligheter samt att motverka diskriminering. Som medarbetare i äldre samt vård- och omsorgsförvaltningen erbjuder vi dig:\n• Trygg anställning med goda anställningsvillkor\n• Karriärmöjligheter \n• Internutbildningar\n• Spännande och meningsfulla arbetsuppgifter\n• Introduktion vid nyanställning\n• Heltid med möjlighet till deltid\n• Friskvårdsbidrag, cykelbidrag samt andra rabatter och erbjudanden\n\nNär du söker jobb hos oss tar vi endast emot ansökningar via vårt rekryteringssystem i enlighet med GDPR.\n\nTill dig som företräder bemannings- och rekryteringsföretag: \nInför denna rekrytering har vi tagit ställning till rekryteringskanaler och därför undanber vi oss ytterligare erbjudanden om kompetensförmedling, annonserings- och rekryteringshjälp."
}