{
  "meta" : {
    "jobad" : {
      "description" : {
        "requirements" : null,
        "needs" : null,
        "company_information" : null,
        "text_formatted" : "<p>Zios Pasta är en restaurang som varit verksam under 5 års tid. Vi serverar pizza, pasta, sallader och husmanskost. Det är i huvudsak en lunchrestaurang.</p><p>I dagsläget söker vi en kock med erfarenhet inom italiensk matlagning samt som kan baka pizza. Det är meriterande om man har erfarenhet av husmanskost. Tjänsten är på deltid eller heltid och vi kan komma överens tillsammans. Tjänsten börjar med en provanställning på 6 månader med möjlighet för förlängning.</p><p>Arbetsuppgifterna är främst matlagning men även andra sysslor inom verksamheten. Det gäller bland annat att arbeta vid kassan, servera samt plocka disk. Det är fasta arbetstider och därmed skall man kunna arbeta under lunch tid måndag till fredag. </p><p>Vi söker någon som är stresstålig, samarbetsvillig, positiv och tar egna initiativ samt gillar utmaningar.</p><p>Låter denna tjänst intressant skicka gärna oss er personliga brev samt CV. Intervjuer sker löpande och därmed finns möjlighet att tjänsten tillsätts innan ansökningstiden löpt ut.</p>",
        "conditions" : null,
        "text" : "Zios Pasta är en restaurang som varit verksam under 5 års tid. Vi serverar pizza, pasta, sallader och husmanskost. Det är i huvudsak en lunchrestaurang.\nI dagsläget söker vi en kock med erfarenhet inom italiensk matlagning samt som kan baka pizza. Det är meriterande om man har erfarenhet av husmanskost. Tjänsten är på deltid eller heltid och vi kan komma överens tillsammans. Tjänsten börjar med en provanställning på 6 månader med möjlighet för förlängning.\nArbetsuppgifterna är främst matlagning men även andra sysslor inom verksamheten. Det gäller bland annat att arbeta vid kassan, servera samt plocka disk. Det är fasta arbetstider och därmed skall man kunna arbeta under lunch tid måndag till fredag. \nVi söker någon som är stresstålig, samarbetsvillig, positiv och tar egna initiativ samt gillar utmaningar.\nLåter denna tjänst intressant skicka gärna oss er personliga brev samt CV. Intervjuer sker löpande och därmed finns möjlighet att tjänsten tillsätts innan ansökningstiden löpt ut."
      },
      "headline" : "Pizzabagare/kock ",
      "driving_license" : null,
      "employer" : {
        "email" : null,
        "phone_number" : null,
        "organization_number" : null,
        "name" : "Akhtar, Mohammad Riaz",
        "url" : null,
        "workplace" : "Akhtar Mohammad Riaz"
      },
      "removed_date" : null,
      "logo_url" : null,
      "last_publication_date" : "2022-08-24T23:59:59",
      "number_of_vacancies" : 1,
      "occupation" : {
        "concept_id" : "yXRQ_Ad9_E8V",
        "label" : "Restaurangbiträde",
        "legacy_ams_taxonomy_id" : "5555"
      },
      "occupation_group" : {
        "concept_id" : "tPox_ie4_X9X",
        "label" : "Restaurang- och köksbiträden m.fl.",
        "legacy_ams_taxonomy_id" : "9412"
      },
      "employment_type" : {
        "concept_id" : "PFZr_Syz_cUq",
        "label" : "Vanlig anställning",
        "legacy_ams_taxonomy_id" : "1"
      },
      "webpage_url" : "https://arbetsformedlingen.se/platsbanken/annonser/26341483",
      "driving_license_required" : false,
      "application_contacts" : [ ],
      "duration" : {
        "concept_id" : "a7uU_j21_mkL",
        "label" : "Tills vidare",
        "legacy_ams_taxonomy_id" : "1"
      },
      "nice_to_have" : {
        "education_level" : [ ],
        "work_experiences" : [ {
          "concept_id" : "yXRQ_Ad9_E8V",
          "weight" : 5,
          "label" : "Restaurangbiträde",
          "legacy_ams_taxonomy_id" : "5555"
        } ],
        "skills" : [ ],
        "education" : [ ],
        "languages" : [ ]
      },
      "application_details" : {
        "via_af" : false,
        "email" : "ziospasta6@gmail.com",
        "other" : null,
        "reference" : "Ansökan Pizzabagare/kock",
        "url" : null,
        "information" : null
      },
      "source_type" : "VIA_ANNONSERA",
      "application_deadline" : "2022-08-24T23:59:59",
      "external_id" : null,
      "workplace_address" : {
        "coordinates" : [ 18.058135075628094, 59.344174314158614 ],
        "city" : "STOCKHOLM",
        "postcode" : "11352",
        "municipality" : "Stockholm",
        "region_concept_id" : "CifL_Rzy_Mku",
        "region" : "Stockholms län",
        "country_code" : "199",
        "region_code" : "01",
        "municipality_concept_id" : "AvNB_uwa_6n6",
        "country_concept_id" : "i46j_HmG_v64",
        "municipality_code" : "0180",
        "street_address" : "Döblensgatan 34 D",
        "country" : "Sverige"
      },
      "id" : "26341483",
      "experience_required" : true,
      "working_hours_type" : {
        "concept_id" : "947z_JGS_Uk2",
        "label" : "Deltid",
        "legacy_ams_taxonomy_id" : "2"
      },
      "access" : null,
      "timestamp" : 1658731695280,
      "must_have" : {
        "education_level" : [ ],
        "work_experiences" : [ ],
        "skills" : [ ],
        "education" : [ ],
        "languages" : [ {
          "concept_id" : "zSLA_vw2_FXN",
          "weight" : 10,
          "label" : "Svenska",
          "legacy_ams_taxonomy_id" : "502"
        }, {
          "concept_id" : "NVxJ_hLg_TYS",
          "weight" : 10,
          "label" : "Engelska",
          "legacy_ams_taxonomy_id" : "283"
        } ]
      },
      "occupation_field" : {
        "concept_id" : "ScKy_FHB_7wT",
        "label" : "Hotell, restaurang, storhushåll",
        "legacy_ams_taxonomy_id" : "7"
      },
      "scope_of_work" : {
        "min" : 0,
        "max" : 100
      },
      "salary_type" : {
        "concept_id" : "oG8G_9cW_nRf",
        "label" : "Fast månads- vecko- eller timlön",
        "legacy_ams_taxonomy_id" : "1"
      },
      "removed" : false,
      "salary_description" : null,
      "access_to_own_car" : false,
      "publication_date" : "2022-07-25T08:48:15"
    },
    "name" : "Pizzabagare/kock ",
    "user" : "hannes"
  },
  "sha1" : "fd758185637fc635e7db6765717857fc33a7ff35",
  "annotations" : [ {
    "preferred-label" : "Pizzabagare m.fl.",
    "sentiment" : "MUST_HAVE",
    "type" : "ssyk-level-4",
    "start-position" : 0,
    "end-position" : 11,
    "concept-id" : "a8gg_ktU_w8V",
    "matched-string" : "pizzabagare",
    "annotation-id" : 0
  }, {
    "preferred-label" : "Kockar och kallskänkor",
    "sentiment" : "MUST_HAVE",
    "type" : "ssyk-level-3",
    "start-position" : 12,
    "end-position" : 16,
    "concept-id" : "sN7W_rxm_nwA",
    "matched-string" : "kock",
    "annotation-id" : 1
  }, {
    "preferred-label" : "Restaurang",
    "sentiment" : "MUST_HAVE",
    "type" : "keyword",
    "start-position" : 35,
    "end-position" : 45,
    "concept-id" : "o2Cg_3Ap_qvK",
    "matched-string" : "restaurang",
    "annotation-id" : 2
  }, {
    "preferred-label" : "Pizza",
    "sentiment" : "MUST_HAVE",
    "type" : "keyword",
    "start-position" : 93,
    "end-position" : 98,
    "concept-id" : "aoCa_BaF_g6Z",
    "matched-string" : "pizza",
    "annotation-id" : 3
  }, {
    "preferred-label" : "Husmanskost",
    "sentiment" : "MUST_HAVE",
    "type" : "skill",
    "start-position" : 120,
    "end-position" : 131,
    "concept-id" : "HfAs_ZWA_Jvv",
    "matched-string" : "husmanskost",
    "annotation-id" : 4
  }, {
    "preferred-label" : "Kockar och kallskänkor",
    "sentiment" : "MUST_HAVE",
    "type" : "ssyk-level-4",
    "start-position" : 195,
    "end-position" : 199,
    "concept-id" : "BStc_SJh_DKG",
    "matched-string" : "kock",
    "annotation-id" : 5
  }, {
    "preferred-label" : "Pizza",
    "sentiment" : "MUST_HAVE",
    "type" : "keyword",
    "start-position" : 259,
    "end-position" : 264,
    "concept-id" : "aoCa_BaF_g6Z",
    "matched-string" : "pizza",
    "annotation-id" : 6
  }, {
    "preferred-label" : "Husmanskost",
    "sentiment" : "MUST_HAVE",
    "type" : "skill",
    "start-position" : 310,
    "end-position" : 321,
    "concept-id" : "HfAs_ZWA_Jvv",
    "matched-string" : "husmanskost",
    "annotation-id" : 7
  }, {
    "preferred-label" : "Heltid/Deltid",
    "type" : "worktime-extent",
    "start-position" : 338,
    "end-position" : 357,
    "concept-id" : "hGCt_6Ni_XPz",
    "matched-string" : "deltid eller heltid",
    "annotation-id" : 8
  } ],
  "text" : "Pizzabagare/kock \nZios Pasta är en restaurang som varit verksam under 5 års tid. Vi serverar pizza, pasta, sallader och husmanskost. Det är i huvudsak en lunchrestaurang.\nI dagsläget söker vi en kock med erfarenhet inom italiensk matlagning samt som kan baka pizza. Det är meriterande om man har erfarenhet av husmanskost. Tjänsten är på deltid eller heltid och vi kan komma överens tillsammans. Tjänsten börjar med en provanställning på 6 månader med möjlighet för förlängning.\nArbetsuppgifterna är främst matlagning men även andra sysslor inom verksamheten. Det gäller bland annat att arbeta vid kassan, servera samt plocka disk. Det är fasta arbetstider och därmed skall man kunna arbeta under lunch tid måndag till fredag. \nVi söker någon som är stresstålig, samarbetsvillig, positiv och tar egna initiativ samt gillar utmaningar.\nLåter denna tjänst intressant skicka gärna oss er personliga brev samt CV. Intervjuer sker löpande och därmed finns möjlighet att tjänsten tillsätts innan ansökningstiden löpt ut."
}