{
  "meta" : {
    "jobad" : {
      "description" : {
        "requirements" : null,
        "needs" : null,
        "company_information" : null,
        "text_formatted" : "<p>#jobbjustnu</p><p><br></p><p><br></p><p>#jobbjustnu</p><p>Vi utökar vår verksamhet och söker fler sociala, hundälskande medarbetare till vårt glada gäng.</p><p><br></p><p>OBSERVERA ATT DU MÅSTE UPPFYLLA VÅRA KRAV PÅ ERFARENHET AV HUND FÖR ATT SÖKA TJÄNSTEN!</p><p><br></p><p>Läs gärna mer om oss på vår hemsida: vinstahundcenter.se</p><p><br></p><p>Vi söker dig som:</p><p>- Har dokumenterad erfarenhet av att hantera hundar i grupp via arbete, skola eller praktik.</p><p>- Har utbildning inom hundars beteende och/eller etologi</p><p>- Har god fysik och är van att röra mycket på dig</p><p>- Vet vad det innebär att arbeta i ett litet företag</p><p>- Är lojal mot dina kollegor och din arbetsgivare</p><p>- Är van att ta ansvar</p><p>- Är positiv och social</p><p>- Lämnar privata problem hemma och är proffessionell i din yrkesroll</p><p>Alla förekommande arbetsuppgifter på ett hunddagis såsom:</p><p>- Tillsammans med dagisansvarig planera den dagliga verksamheten med våra hunddagishundar</p><p>- Hundpromenader och aktivering av hundar i grupper</p><p>- Hundvård</p><p>- Städning</p><p>- Planering och genomförande av verksamhets-aktiviteter</p><p>- Informera och ha kontakt med våra kunder</p><p>- Utfodring</p><p><br></p><p>Företaget är i ett expansivt skede och möjlighet till utveckling inom företaget finns för rätt person.</p><p><br></p><p>Omgående anställning!</p>",
        "conditions" : null,
        "text" : "#jobbjustnu\n\n\n\n\n#jobbjustnu\nVi utökar vår verksamhet och söker fler sociala, hundälskande medarbetare till vårt glada gäng.\n\n\nOBSERVERA ATT DU MÅSTE UPPFYLLA VÅRA KRAV PÅ ERFARENHET AV HUND FÖR ATT SÖKA TJÄNSTEN!\n\n\nLäs gärna mer om oss på vår hemsida: vinstahundcenter.se\n\n\nVi söker dig som:\n- Har dokumenterad erfarenhet av att hantera hundar i grupp via arbete, skola eller praktik.\n- Har utbildning inom hundars beteende och/eller etologi\n- Har god fysik och är van att röra mycket på dig\n- Vet vad det innebär att arbeta i ett litet företag\n- Är lojal mot dina kollegor och din arbetsgivare\n- Är van att ta ansvar\n- Är positiv och social\n- Lämnar privata problem hemma och är proffessionell i din yrkesroll\nAlla förekommande arbetsuppgifter på ett hunddagis såsom:\n- Tillsammans med dagisansvarig planera den dagliga verksamheten med våra hunddagishundar\n- Hundpromenader och aktivering av hundar i grupper\n- Hundvård\n- Städning\n- Planering och genomförande av verksamhets-aktiviteter\n- Informera och ha kontakt med våra kunder\n- Utfodring\n\n\nFöretaget är i ett expansivt skede och möjlighet till utveckling inom företaget finns för rätt person.\n\n\nOmgående anställning!"
      },
      "headline" : "Hundskötare på hunddagis",
      "driving_license" : null,
      "employer" : {
        "email" : null,
        "phone_number" : null,
        "organization_number" : null,
        "name" : "Vinsta Hundcenter",
        "url" : "www.vinstahundcenter.se",
        "workplace" : "Vinsta Hundcenter"
      },
      "removed_date" : null,
      "logo_url" : "https://www.arbetsformedlingen.se/rest/arbetsgivare/rest/af/v3/arbetsplatser/81326579/logotyper/logo.png",
      "last_publication_date" : "2022-06-30T23:59:59",
      "number_of_vacancies" : 2,
      "occupation" : {
        "concept_id" : "qLCw_Azv_m1h",
        "label" : "Hundskötare/Hundvårdare",
        "legacy_ams_taxonomy_id" : "6286"
      },
      "occupation_group" : {
        "concept_id" : "MSzH_F2n_Emb",
        "label" : "Uppfödare och skötare av sällskapsdjur",
        "legacy_ams_taxonomy_id" : "6122"
      },
      "employment_type" : {
        "concept_id" : "PFZr_Syz_cUq",
        "label" : "Vanlig anställning",
        "legacy_ams_taxonomy_id" : "1"
      },
      "webpage_url" : "https://arbetsformedlingen.se/platsbanken/annonser/26135971",
      "driving_license_required" : false,
      "application_contacts" : [ ],
      "duration" : {
        "concept_id" : "a7uU_j21_mkL",
        "label" : "Tills vidare",
        "legacy_ams_taxonomy_id" : "1"
      },
      "nice_to_have" : {
        "education_level" : [ ],
        "work_experiences" : [ {
          "concept_id" : "qLCw_Azv_m1h",
          "weight" : 5,
          "label" : "Hundskötare/Hundvårdare",
          "legacy_ams_taxonomy_id" : "6286"
        } ],
        "skills" : [ ],
        "education" : [ ],
        "languages" : [ ]
      },
      "application_details" : {
        "via_af" : false,
        "email" : "info@vinstahundcenter.com",
        "other" : null,
        "reference" : "Arbetsansökan",
        "url" : null,
        "information" : null
      },
      "source_type" : "VIA_ANNONSERA",
      "application_deadline" : "2022-06-30T23:59:59",
      "external_id" : null,
      "workplace_address" : {
        "coordinates" : [ null, null ],
        "city" : null,
        "postcode" : null,
        "municipality" : null,
        "region_concept_id" : null,
        "region" : null,
        "country_code" : "199",
        "region_code" : null,
        "municipality_concept_id" : null,
        "country_concept_id" : "i46j_HmG_v64",
        "municipality_code" : null,
        "street_address" : null,
        "country" : "Sverige"
      },
      "id" : "26135971",
      "experience_required" : true,
      "working_hours_type" : {
        "concept_id" : "6YE1_gAC_R2G",
        "label" : "Heltid",
        "legacy_ams_taxonomy_id" : "1"
      },
      "access" : null,
      "timestamp" : 1653485538317,
      "must_have" : {
        "education_level" : [ ],
        "work_experiences" : [ ],
        "skills" : [ ],
        "education" : [ ],
        "languages" : [ {
          "concept_id" : "zSLA_vw2_FXN",
          "weight" : 10,
          "label" : "Svenska",
          "legacy_ams_taxonomy_id" : "502"
        } ]
      },
      "occupation_field" : {
        "concept_id" : "VuuL_7CH_adj",
        "label" : "Naturbruk",
        "legacy_ams_taxonomy_id" : "13"
      },
      "scope_of_work" : {
        "min" : 0,
        "max" : 100
      },
      "salary_type" : {
        "concept_id" : "oG8G_9cW_nRf",
        "label" : "Fast månads- vecko- eller timlön",
        "legacy_ams_taxonomy_id" : "1"
      },
      "removed" : false,
      "salary_description" : null,
      "access_to_own_car" : false,
      "publication_date" : "2022-05-25T15:32:18"
    },
    "name" : ""
  },
  "sha1" : "0597a82800e359788ff244d0c0c34add4f2bfbad",
  "annotations" : [ {
    "preferred-label" : "Hunddagis",
    "sentiment" : "OFFERED",
    "type" : "skill",
    "start-position" : 185,
    "end-position" : 189,
    "concept-id" : "DYvh_2Z1_WNr",
    "matched-string" : "HUND",
    "annotation-id" : 6
  }, {
    "preferred-label" : "Hundpsykologi",
    "sentiment" : "MUST_HAVE",
    "type" : "skill",
    "start-position" : 407,
    "end-position" : 423,
    "concept-id" : "nFvV_6GB_Nne",
    "matched-string" : "hundars beteende",
    "annotation-id" : 7
  }, {
    "preferred-label" : "Etologi",
    "sentiment" : "MUST_HAVE",
    "type" : "skill",
    "start-position" : 434,
    "end-position" : 441,
    "concept-id" : "5KHd_EHE_Pe6",
    "matched-string" : "etologi",
    "annotation-id" : 1
  }, {
    "preferred-label" : "God fysik (tunga lyft)",
    "sentiment" : "MUST_HAVE",
    "type" : "skill",
    "start-position" : 448,
    "end-position" : 457,
    "concept-id" : "rwir_xvu_443",
    "matched-string" : "god fysik",
    "annotation-id" : 5
  }, {
    "preferred-label" : "utfodring",
    "sentiment" : "OFFERED",
    "type" : "esco-skill",
    "start-position" : 1034,
    "end-position" : 1043,
    "concept-id" : "Qp2G_bf5_CsK",
    "matched-string" : "Utfodring",
    "annotation-id" : 8
  } ],
  "text" : "#jobbjustnu\n\n\n\n\n#jobbjustnu\nVi utökar vår verksamhet och söker fler sociala, hundälskande medarbetare till vårt glada gäng.\n\n\nOBSERVERA ATT DU MÅSTE UPPFYLLA VÅRA KRAV PÅ ERFARENHET AV HUND FÖR ATT SÖKA TJÄNSTEN!\n\n\nLäs gärna mer om oss på vår hemsida: vinstahundcenter.se\n\n\nVi söker dig som:\n- Har dokumenterad erfarenhet av att hantera hundar i grupp via arbete, skola eller praktik.\n- Har utbildning inom hundars beteende och/eller etologi\n- Har god fysik och är van att röra mycket på dig\n- Vet vad det innebär att arbeta i ett litet företag\n- Är lojal mot dina kollegor och din arbetsgivare\n- Är van att ta ansvar\n- Är positiv och social\n- Lämnar privata problem hemma och är proffessionell i din yrkesroll\nAlla förekommande arbetsuppgifter på ett hunddagis såsom:\n- Tillsammans med dagisansvarig planera den dagliga verksamheten med våra hunddagishundar\n- Hundpromenader och aktivering av hundar i grupper\n- Hundvård\n- Städning\n- Planering och genomförande av verksamhets-aktiviteter\n- Informera och ha kontakt med våra kunder\n- Utfodring\n\n\nFöretaget är i ett expansivt skede och möjlighet till utveckling inom företaget finns för rätt person.\n\n\nOmgående anställning!"
}