{
  "meta" : {
    "description" : "",
    "name" : "Maskinoperatör - Helsingborg",
    "type" : "",
    "user" : "hannes"
  },
  "sha1" : "a4806276f7e9698daf79f25d130058a66e30cfbb",
  "annotations" : [ {
    "preferred-label" : "Halmstad",
    "type" : "municipality",
    "start-position" : 44,
    "end-position" : 52,
    "concept-id" : "kUQB_KdK_kAh",
    "matched-string" : "Halmstad",
    "annotation-id" : 8
  }, {
    "preferred-label" : "Göteborg",
    "type" : "municipality",
    "start-position" : 54,
    "end-position" : 62,
    "concept-id" : "PVZL_BQT_XtL",
    "matched-string" : "Göteborg",
    "annotation-id" : 9
  }, {
    "preferred-label" : "Stockholm",
    "type" : "municipality",
    "start-position" : 64,
    "end-position" : 73,
    "concept-id" : "AvNB_uwa_6n6",
    "matched-string" : "Stockholm",
    "annotation-id" : 10
  }, {
    "preferred-label" : "Helsingborg",
    "type" : "municipality",
    "start-position" : 75,
    "end-position" : 86,
    "concept-id" : "qj3q_oXH_MGR",
    "matched-string" : "Helsingborg",
    "annotation-id" : 11
  }, {
    "preferred-label" : "Malmö",
    "type" : "municipality",
    "start-position" : 88,
    "end-position" : 93,
    "concept-id" : "oYPt_yRA_Smm",
    "matched-string" : "Malmö",
    "annotation-id" : 12
  }, {
    "preferred-label" : "Malmö",
    "type" : "municipality",
    "start-position" : 98,
    "end-position" : 110,
    "concept-id" : "oYPt_yRA_Smm",
    "matched-string" : "Kristianstad",
    "annotation-id" : 13
  }, {
    "preferred-label" : "Logistik",
    "sentiment" : "OFFERED",
    "type" : "skill",
    "start-position" : 180,
    "end-position" : 188,
    "concept-id" : "yXmf_iKi_7ci",
    "matched-string" : "logistik",
    "annotation-id" : 0
  }, {
    "preferred-label" : "Personal",
    "sentiment" : "OFFERED",
    "type" : "keyword",
    "start-position" : 207,
    "end-position" : 215,
    "concept-id" : "HVxM_6MS_y1c",
    "matched-string" : "personal",
    "annotation-id" : 1
  }, {
    "preferred-label" : "Logistik",
    "sentiment" : "OFFERED",
    "type" : "skill",
    "start-position" : 221,
    "end-position" : 229,
    "concept-id" : "yXmf_iKi_7ci",
    "matched-string" : "logistik",
    "annotation-id" : 2
  }, {
    "preferred-label" : "Övriga process- och maskinoperatörer",
    "type" : "ssyk-level-4",
    "start-position" : 397,
    "end-position" : 413,
    "concept-id" : "hxm6_xkr_dHm",
    "matched-string" : "maskinoperatörer",
    "annotation-id" : 14
  }, {
    "preferred-label" : "Helsingborg",
    "type" : "municipality",
    "start-position" : 465,
    "end-position" : 476,
    "concept-id" : "qj3q_oXH_MGR",
    "matched-string" : "Helsingborg",
    "annotation-id" : 15
  }, {
    "preferred-label" : "arbetsmiljö",
    "sentiment" : "OFFERED",
    "type" : "esco-skill",
    "start-position" : 550,
    "end-position" : 561,
    "concept-id" : "zdQY_QJh_nUH",
    "matched-string" : "arbetsmiljö",
    "annotation-id" : 3
  }, {
    "preferred-label" : "Tillverkning",
    "sentiment" : "OFFERED",
    "type" : "sni-level-1",
    "start-position" : 664,
    "end-position" : 676,
    "concept-id" : "trPt_iHy_oFP",
    "matched-string" : "tillverkning",
    "annotation-id" : 4
  }, {
    "preferred-label" : "Avsyning",
    "sentiment" : "OFFERED",
    "type" : "skill",
    "start-position" : 820,
    "end-position" : 828,
    "concept-id" : "X4EU_ZC7_QmK",
    "matched-string" : "avsyning",
    "annotation-id" : 5
  }, {
    "preferred-label" : "noggrannhet",
    "type" : "esco-skill",
    "start-position" : 1036,
    "end-position" : 1044,
    "concept-id" : "mrsW_EkL_KRD",
    "matched-string" : "noggrann",
    "annotation-id" : 16
  }, {
    "preferred-label" : "Övriga process- och maskinoperatörer",
    "type" : "ssyk-level-4",
    "start-position" : 1312,
    "end-position" : 1326,
    "concept-id" : "hxm6_xkr_dHm",
    "matched-string" : "maskinoperatör",
    "annotation-id" : 17
  }, {
    "preferred-label" : "Övriga process- och maskinoperatörer",
    "type" : "ssyk-level-4",
    "start-position" : 1328,
    "end-position" : 1343,
    "concept-id" : "hxm6_xkr_dHm",
    "matched-string" : "processoperatör",
    "annotation-id" : 18
  }, {
    "preferred-label" : "Ställare",
    "sentiment" : "OFFERED",
    "type" : "keyword",
    "start-position" : 1358,
    "end-position" : 1366,
    "concept-id" : "TVwZ_Uum_EJp",
    "matched-string" : "ställare",
    "annotation-id" : 6
  }, {
    "preferred-label" : "Svenska",
    "sentiment" : "OFFERED",
    "type" : "language",
    "start-position" : 1482,
    "end-position" : 1489,
    "concept-id" : "zSLA_vw2_FXN",
    "matched-string" : "svenska",
    "annotation-id" : 7
  }, {
    "preferred-label" : "körkort",
    "type" : "esco-skill",
    "start-position" : 1509,
    "end-position" : 1516,
    "concept-id" : "UvDr_eNo_HSQ",
    "matched-string" : "Körkort",
    "annotation-id" : 19
  }, {
    "preferred-label" : "Truck",
    "type" : "keyword",
    "start-position" : 1582,
    "end-position" : 1591,
    "concept-id" : "Wz82_4Xv_ZFr",
    "matched-string" : "truckkort",
    "annotation-id" : 20
  } ],
  "text" : "Boxflow grundades 2018 och har verksamhet i Halmstad, Göteborg, Stockholm, Helsingborg, Malmö och Kristianstad. Boxflow erbjuder tjänster inom Tredjepartslogistik, Consulting inom logistik samt uthyrning av personal inom logistik och industri. Boxflow har haft en stadig tillväxt sedan start och i beräknas omsätta över 300 miljoner 2022 med fler än 1000 anställda.\n\nOm tjänsten\n\nVi söker just nu maskinoperatörer med ett stort tekniskt intresse till ett uppdrag i Helsingborg.\nVi tror att detta arbete passar väl för dig som trivs med en omväxlande arbetsmiljö och arbetsuppgifter produktioner och industrier.\nVi ser gärna att du har erfarenhet av produktion och tillverkning och kan snabbt komma in i arbetsuppgifterna.\n\nI rollen kommer du att ansvara för omställning av maskin vid produktbyte, övervakning av maskin, avsyning av ingående material samt färdig produkt samt att utföra kontrollmätning av tillverkad produkt.\n\nArbetstider är förlagda på dagtid men 2 skift kan förekomma.\n\nProfil & bakgrund\n\nSom person tror vi att du är noggrann då arbetet kräver att du ska upprätthålla en hög kvalité på produkterna. Vi ser även att du tycker om att arbeta i team, är öppen och lyhörd mot dina arbetskamrater samt flexibel då arbetsuppgifterna kan variera.\n\nVi ser gärna att du har erfarenhet av att arbeta som maskinoperatör, processoperatör, montör eller ställare inom tillverkningsindustrin.\n\nVi ser gärna att du uppfyller nedanstående krav:\n\n- Tekniskt intresserad\n- Behärskar svenska i tal och skrift\n- Körkort och tillgång till bil\n- Erfarenhet som operatör\n- Meriterande är truckkort\n\nUrval sker löpande, välkommen in med din ansökan redan idag!"
}