{
  "meta" : {
    "dataset-id" : "myh-spreadsheet-2021",
    "type" : "education-description",
    "dataset-document-id" : "YH00907",
    "user" : "kristof.fischer"
  },
  "sha1" : "246045fd93aa58243b3e55c3d21b45edb6f958c5",
  "annotations" : [ {
    "preferred-label" : "hitta lösningar på problem",
    "sentiment" : "OFFERED",
    "type" : "esco-skill",
    "start-position" : 163,
    "end-position" : 175,
    "concept-id" : "WFSY_Bwt_QWE",
    "matched-string" : "lösa problem",
    "annotation-id" : 10
  }, {
    "preferred-label" : "Data/IT",
    "sentiment" : "OFFERED",
    "type" : "occupation-field",
    "start-position" : 238,
    "end-position" : 240,
    "concept-id" : "apaJ_2ja_LuF",
    "matched-string" : "it",
    "annotation-id" : 2
  }, {
    "preferred-label" : "Research",
    "sentiment" : "OFFERED",
    "type" : "skill",
    "start-position" : 364,
    "end-position" : 372,
    "concept-id" : "FGhF_q98_YE8",
    "matched-string" : "research",
    "annotation-id" : 3
  }, {
    "preferred-label" : "studera en grupp som målgrupp",
    "sentiment" : "OFFERED",
    "type" : "esco-skill",
    "start-position" : 381,
    "end-position" : 404,
    "concept-id" : "7Gdh_QoT_Xef",
    "matched-string" : "lär dig om målgrupperna",
    "annotation-id" : 11
  }, {
    "preferred-label" : "UI-designer",
    "type" : "occupation-name",
    "start-position" : 712,
    "end-position" : 721,
    "concept-id" : "3GKG_7xX_AcT",
    "matched-string" : "designers",
    "annotation-id" : 12
  }, {
    "preferred-label" : "Kravanalytiker",
    "sentiment" : "OFFERED",
    "type" : "occupation-name",
    "start-position" : 726,
    "end-position" : 740,
    "concept-id" : "Gjz2_EJT_HGL",
    "matched-string" : "kravanalytiker",
    "annotation-id" : 5
  }, {
    "preferred-label" : "arbeta självständigt",
    "sentiment" : "OFFERED",
    "type" : "esco-skill",
    "start-position" : 774,
    "end-position" : 787,
    "concept-id" : "NyFu_HHd_zhz",
    "matched-string" : "självständigt",
    "annotation-id" : 13
  }, {
    "preferred-label" : "designa prototyper",
    "sentiment" : "OFFERED",
    "type" : "esco-skill",
    "start-position" : 797,
    "end-position" : 830,
    "concept-id" : "qX8a_Lyo_wbV",
    "matched-string" : "sätta ihop interaktiva prototyper",
    "annotation-id" : 14
  }, {
    "preferred-label" : "Programmering",
    "sentiment" : "OFFERED",
    "type" : "skill",
    "start-position" : 905,
    "end-position" : 935,
    "concept-id" : "iUew_moc_BRk",
    "matched-string" : "hur design implementeras i kod",
    "annotation-id" : 15
  }, {
    "preferred-label" : "Databaser",
    "sentiment" : "OFFERED",
    "type" : "skill-headline",
    "start-position" : 972,
    "end-position" : 981,
    "concept-id" : "Uj5W_dft_Ssg",
    "matched-string" : "databaser",
    "annotation-id" : 6
  }, {
    "preferred-label" : "HTML, programmeringsspråk",
    "sentiment" : "OFFERED",
    "type" : "skill",
    "start-position" : 1010,
    "end-position" : 1014,
    "concept-id" : "K8eq_sEz_eXV",
    "matched-string" : "html",
    "annotation-id" : 7
  }, {
    "preferred-label" : "CSS, programmeringsspråk",
    "sentiment" : "OFFERED",
    "type" : "skill",
    "start-position" : 1016,
    "end-position" : 1019,
    "concept-id" : "euH8_yAp_hiG",
    "matched-string" : "css",
    "annotation-id" : 8
  }, {
    "preferred-label" : "JavaScript, programmeringsspråk",
    "sentiment" : "OFFERED",
    "type" : "skill",
    "start-position" : 1024,
    "end-position" : 1034,
    "concept-id" : "DHhX_uVf_y6X",
    "matched-string" : "javascript",
    "annotation-id" : 9
  }, {
    "preferred-label" : null,
    "sentiment" : "OFFERED",
    "type" : "skill",
    "start-position" : 1285,
    "end-position" : 1307,
    "concept-id" : null,
    "matched-string" : "formulera behov i text",
    "annotation-id" : 16
  }, {
    "preferred-label" : null,
    "sentiment" : "OFFERED",
    "type" : "skill",
    "start-position" : 1317,
    "end-position" : 1333,
    "concept-id" : null,
    "matched-string" : "visualisera krav",
    "annotation-id" : 17
  } ],
  "text" : "Att arbeta med UX och krav är att arbeta som ambassadör för användarna av en digital tjänst, och att agera tolk mellan affärssidan och utvecklarna. Du lär dig att lösa problem med designmetodik och att visualisera och kommunicera krav på IT-lösningar.    Vi arbetar utifrån Design Thinking-processen som är beprövad både i branschen och i akademin. Den börjar med research, där du lär dig om målgrupperna, och mynnar ofta ut i en prototyp som testas med användare. På utbildningen får du lär dig olika kreativitets-tekniker genom att själv delta i och hålla workshops. De idéer som bäst möter verksamhetens och användarnas mål väljs ut och förfinas digitalt. Vi jobbar i moderna och ofta webbaserade verktyg för designers och kravanalytiker. Efter bara några månader kan du självständigt rita och sätta ihop interaktiva prototyper av webbplatser och appar.     Utöver detta får du också en förståelse för hur design implementeras i kod, och hur information struktureras i databaser m.m. Du lär dig grunderna i HTML, CSS och JavaScript.    Det som är unikt för utbildningen är att du lär dig hur kravställningen görs för att säkerställa bästa möjliga slutresultat till lägsta möjliga kostnad. Du går mer på djupet tekniskt jämfört med en traditionell UX-utbildning. Du får lära dig att formulera behov i text samt att visualisera krav på olika sätt för att kommunicera med människor, både på affärssidan/verksamheten och i utvecklingsteamet.     På skolan arbetar vi projektbaserat (PBL) med riktiga problem och case, vilket enligt forskning gynnar motivationen, och också förbereder dig för yrkeslivet på bästa sätt."
}