{
  "meta" : {
    "jobad" : {
      "description" : {
        "requirements" : null,
        "needs" : null,
        "company_information" : null,
        "text_formatted" : "Vi söker dig som är flexibel och kan jobba extra på beställning/uppdrag till oss för att ta fram bilder och filmer som är nyskapade och kreativa för att fylla vårt flöde och hålla vår bildbank up to date.\n\n\n\nVilka är Devi?\n\nDevi är ett ungt modernt säljbolag som jobbar med känsla och förnuft! Vi jobbar med försäljning via tre kanaler, Telemarketing, Fieldmarketing och Customer Sales & Service. Vi jobbar med en ung målgrupp som är aktiva inom sociala medier där vi måste synas och höras och skapa en dragningskraft med hjälp av filmer och bilder som du är med och skapar tillsammans med oss.\n\nVem är du?\n\nDu jobbar hemifrån remote men är flexibel att ställa upp och åka i väg till events, aktiviteter, konferenser, kontoret eller fält för att fånga ögonblick. Du är gärna en student inom något kreativt eller är någon som kan styra sitt eget schema hade varit att föredra. Du har jobbat med detta i något år eller två och har foto och film som en stor passion i livet. Du kan och har Photoshop, samt har egen kamerautrustning. Du kan och har tillgång till filmredigeringsprogram (t.ex. Final Cut Pro eller Adobe Premiere Pro.\n\nDu filmar och fotar ca 2st tillfällen i månaden och jobbar per timme. Ett stort plus om du även kan vara med och bidra med idéer och sätt att ta det framåt inom ditt område.\n\n\n\nLåter detta som något för dig? Skicka gärna din ansökning till: martin.cronler@devigroup.se - och skicka med lite referens-case eller arbetsprover som är färskt för att visa lite vad du går för. Om du inte har något så ta gärna fram något och skicka över i din ansökan.\n\n\n\nVi går igenom alla ansökningar löpande och om du är en av de kandidater som bäst matchar vår kravprofil kontaktar vi dig för en kortare telefonintervju.\n\n\n\nKolla gärna in vår Insta för mer info och inspo!\n\nVarmt lycka till med din ansökan!",
        "conditions" : "Deltid\r\nAnställningstid enligt överenskommelse",
        "text" : "Vi söker dig som är flexibel och kan jobba extra på beställning/uppdrag till oss för att ta fram bilder och filmer som är nyskapade och kreativa för att fylla vårt flöde och hålla vår bildbank up to date.\n\n\n\nVilka är Devi?\n\nDevi är ett ungt modernt säljbolag som jobbar med känsla och förnuft! Vi jobbar med försäljning via tre kanaler, Telemarketing, Fieldmarketing och Customer Sales & Service. Vi jobbar med en ung målgrupp som är aktiva inom sociala medier där vi måste synas och höras och skapa en dragningskraft med hjälp av filmer och bilder som du är med och skapar tillsammans med oss.\n\nVem är du?\n\nDu jobbar hemifrån remote men är flexibel att ställa upp och åka i väg till events, aktiviteter, konferenser, kontoret eller fält för att fånga ögonblick. Du är gärna en student inom något kreativt eller är någon som kan styra sitt eget schema hade varit att föredra. Du har jobbat med detta i något år eller två och har foto och film som en stor passion i livet. Du kan och har Photoshop, samt har egen kamerautrustning. Du kan och har tillgång till filmredigeringsprogram (t.ex. Final Cut Pro eller Adobe Premiere Pro.\n\nDu filmar och fotar ca 2st tillfällen i månaden och jobbar per timme. Ett stort plus om du även kan vara med och bidra med idéer och sätt att ta det framåt inom ditt område.\n\n\n\nLåter detta som något för dig? Skicka gärna din ansökning till: martin.cronler@devigroup.se - och skicka med lite referens-case eller arbetsprover som är färskt för att visa lite vad du går för. Om du inte har något så ta gärna fram något och skicka över i din ansökan.\n\n\n\nVi går igenom alla ansökningar löpande och om du är en av de kandidater som bäst matchar vår kravprofil kontaktar vi dig för en kortare telefonintervju.\n\n\n\nKolla gärna in vår Insta för mer info och inspo!\n\nVarmt lycka till med din ansökan!"
      },
      "headline" : "Devi söker en content creator vid behov!",
      "driving_license" : null,
      "employer" : {
        "email" : null,
        "phone_number" : null,
        "organization_number" : "5569166662",
        "name" : "Devi Recruit AB",
        "url" : "http://devigroup.se",
        "workplace" : "Devi"
      },
      "removed_date" : null,
      "logo_url" : "https://www.arbetsformedlingen.se/rest/arbetsgivare/rest/af/v3/organisation/5569166662/logotyper/logo.png",
      "last_publication_date" : "2022-09-02T23:59:59",
      "number_of_vacancies" : 1,
      "occupation" : {
        "concept_id" : "1N2U_6xW_Tdx",
        "label" : "Fotograf",
        "legacy_ams_taxonomy_id" : "4790"
      },
      "occupation_group" : {
        "concept_id" : "3J38_DNz_YKK",
        "label" : "Fotografer",
        "legacy_ams_taxonomy_id" : "3431"
      },
      "employment_type" : {
        "concept_id" : "PFZr_Syz_cUq",
        "label" : "Vanlig anställning",
        "legacy_ams_taxonomy_id" : "1"
      },
      "webpage_url" : "https://arbetsformedlingen.se/platsbanken/annonser/26374365",
      "driving_license_required" : false,
      "application_contacts" : [ {
        "description" : "Avin",
        "email" : "avin@devigroup.se",
        "telephone" : "0723371277",
        "name" : null,
        "contact_type" : null
      } ],
      "duration" : {
        "concept_id" : "qQUd_4qe_NDT",
        "label" : "6 månader eller längre",
        "legacy_ams_taxonomy_id" : "2"
      },
      "nice_to_have" : {
        "education_level" : [ ],
        "work_experiences" : [ ],
        "skills" : [ ],
        "education" : [ ],
        "languages" : [ ]
      },
      "application_details" : {
        "via_af" : false,
        "email" : null,
        "other" : null,
        "reference" : null,
        "url" : "https://jobb.devigroup.se/jobs/1949680-devi-soker-en-content-creator-vid-behov?promotion=457865-arbetsformedlingen",
        "information" : null
      },
      "source_type" : "VIA_PLATSBANKEN_DXA",
      "application_deadline" : "2022-09-02T23:59:59",
      "external_id" : "46-556916-6662-1949680-1",
      "workplace_address" : {
        "coordinates" : [ 18.06858, 59.329323 ],
        "city" : null,
        "postcode" : null,
        "municipality" : "Stockholm",
        "region_concept_id" : "CifL_Rzy_Mku",
        "region" : "Stockholms län",
        "country_code" : "199",
        "region_code" : "01",
        "municipality_concept_id" : "AvNB_uwa_6n6",
        "country_concept_id" : "i46j_HmG_v64",
        "municipality_code" : "0180",
        "street_address" : null,
        "country" : "Sverige"
      },
      "id" : "26374365",
      "experience_required" : true,
      "working_hours_type" : {
        "concept_id" : "947z_JGS_Uk2",
        "label" : "Deltid",
        "legacy_ams_taxonomy_id" : "2"
      },
      "access" : null,
      "timestamp" : 1659517975587,
      "must_have" : {
        "education_level" : [ ],
        "work_experiences" : [ {
          "concept_id" : "1N2U_6xW_Tdx",
          "weight" : 10,
          "label" : "Fotograf",
          "legacy_ams_taxonomy_id" : "4790"
        } ],
        "skills" : [ ],
        "education" : [ ],
        "languages" : [ ]
      },
      "occupation_field" : {
        "concept_id" : "9puE_nYg_crq",
        "label" : "Kultur, media, design",
        "legacy_ams_taxonomy_id" : "11"
      },
      "scope_of_work" : {
        "min" : 0,
        "max" : 100
      },
      "salary_type" : {
        "concept_id" : "oG8G_9cW_nRf",
        "label" : "Fast månads- vecko- eller timlön",
        "legacy_ams_taxonomy_id" : "1"
      },
      "removed" : false,
      "salary_description" : "Lön enligt överenskommelse",
      "access_to_own_car" : false,
      "publication_date" : "2022-08-03T11:12:55"
    },
    "name" : "Devi söker en content creator vid behov!",
    "user" : "hannes"
  },
  "sha1" : "50c96b3ad1d4d44c3d19db8415488468ac7441d6",
  "annotations" : [ {
    "preferred-label" : "Behovsanställning",
    "type" : "employment-type",
    "start-position" : 34,
    "end-position" : 39,
    "concept-id" : "1paU_aCR_nGn",
    "matched-string" : "behov",
    "annotation-id" : 1
  }, {
    "preferred-label" : "Sales",
    "sentiment" : "MUST_HAVE",
    "type" : "skill",
    "start-position" : 421,
    "end-position" : 426,
    "concept-id" : "YTUj_vai_cLw",
    "matched-string" : "sales",
    "annotation-id" : 0
  }, {
    "preferred-label" : "Distansarbete",
    "type" : "work-place-environment",
    "start-position" : 668,
    "end-position" : 674,
    "concept-id" : "uwzb_xcR_vxS",
    "matched-string" : "remote",
    "annotation-id" : 4
  }, {
    "preferred-label" : "Film/redigering-Apple Final Cut Pro",
    "type" : "skill",
    "start-position" : 1130,
    "end-position" : 1143,
    "concept-id" : "VVj2_4Uu_LL9",
    "matched-string" : "Final Cut Pro",
    "annotation-id" : 2
  }, {
    "preferred-label" : "Film/redigering-Adobe Premiere",
    "type" : "skill",
    "start-position" : 1150,
    "end-position" : 1168,
    "concept-id" : "GCMj_xLD_mj6",
    "matched-string" : "Adobe Premiere Pro",
    "annotation-id" : 3
  } ],
  "text" : "Devi söker en content creator vid behov!\nVi söker dig som är flexibel och kan jobba extra på beställning/uppdrag till oss för att ta fram bilder och filmer som är nyskapade och kreativa för att fylla vårt flöde och hålla vår bildbank up to date.\n\n\n\nVilka är Devi?\n\nDevi är ett ungt modernt säljbolag som jobbar med känsla och förnuft! Vi jobbar med försäljning via tre kanaler, Telemarketing, Fieldmarketing och Customer Sales & Service. Vi jobbar med en ung målgrupp som är aktiva inom sociala medier där vi måste synas och höras och skapa en dragningskraft med hjälp av filmer och bilder som du är med och skapar tillsammans med oss.\n\nVem är du?\n\nDu jobbar hemifrån remote men är flexibel att ställa upp och åka i väg till events, aktiviteter, konferenser, kontoret eller fält för att fånga ögonblick. Du är gärna en student inom något kreativt eller är någon som kan styra sitt eget schema hade varit att föredra. Du har jobbat med detta i något år eller två och har foto och film som en stor passion i livet. Du kan och har Photoshop, samt har egen kamerautrustning. Du kan och har tillgång till filmredigeringsprogram (t.ex. Final Cut Pro eller Adobe Premiere Pro.\n\nDu filmar och fotar ca 2st tillfällen i månaden och jobbar per timme. Ett stort plus om du även kan vara med och bidra med idéer och sätt att ta det framåt inom ditt område.\n\n\n\nLåter detta som något för dig? Skicka gärna din ansökning till: martin.cronler@devigroup.se - och skicka med lite referens-case eller arbetsprover som är färskt för att visa lite vad du går för. Om du inte har något så ta gärna fram något och skicka över i din ansökan.\n\n\n\nVi går igenom alla ansökningar löpande och om du är en av de kandidater som bäst matchar vår kravprofil kontaktar vi dig för en kortare telefonintervju.\n\n\n\nKolla gärna in vår Insta för mer info och inspo!\n\nVarmt lycka till med din ansökan!"
}