{
  "meta" : {
    "jobad" : {
      "description" : {
        "requirements" : null,
        "needs" : null,
        "company_information" : null,
        "text_formatted" : "För fjärde gången, och mer rysmysigt än någonsin, slår Furuvik upp portarna för en oförglömlig Halloween. Som aktör på Furuviksparken arbetar du tillsammans med andra aktörer för att bjuda på magiska upplevelser genom att underhålla våra gäster runt om i parken. Under några kvällar förvandlas även parken och bjuder de som vågar på fasansfull skräck i form av zombies, onda clowner och varelser från skogens mörkaste vrår.\n\nAtt jobba som aktör\n\nSom aktör på Halloween jobbar du i någon av våra skräckhus/områden som till exempel zombie eller spökpirat. Din uppgift blir att skrämma våra gäster för att maximera deras upplevelse. Rollerna varierar, men de flesta karaktärer jobbar huvudsakligen med att skrämmas. Det finns ett fåtal mer avancerade roller, både läskiga och mindre läskiga. \n\nVad som krävs\n\nTill de här rollerna söker vi dig som älskar teater, improvisation eller bara att skrämmas! Du kan arbeta 15-16 oktober, 22-23 oktober, 29-30 oktober samt 2 oktober - 5 november samt medverka på utbildningstillfällen inför. Arbetstiderna varierar och innefattar arbete både dagtid, kvällstid och helg. Du som söker behöver utöver detta också: \n\n\n• Klara av att jobba i mörka och trånga utrymmen med höga ljud\n• Kunna ta regi\n• Vara stresstålig\n• Kunna läsa av människor och anpassa ditt agerande därefter \n\nAndra krav för denna tjänst är att du är minst 18 år fyllda, kan kommunicera på svenska, och framförallt ser du fram emot en spöklik tillställning för våra gäster. Har du utbildning och/eller yrkesvana inom teater eller motsvarande är det meriterande men inget krav. Lön tillämpas enligt kollektivavtal. Vissa roller har ansvarstillägg beroende på rollens komplexitet. Oavsett vilken aktörsoll du har kommer du att arbeta efter angivna riktlinjer och förutsättningar som finns inom ramen för det skräckhus/område som du arbetar i. I samband med anställningens start får du en ordentlig utbildning inom det område du skall jobba på där du får lära dig hur du ska jobba med din karaktär på ett tryggt och säkert sätt utifrån rätt riktlinjer och förutsättningar.\n\nVåra roller\n\nVi delar upp våra aktörsroller i två olika kategorier, skrämsel-roller och avancerade roller: \n\nSkrämsel-roll\nInom denna kategori finns de flesta av våra roller och det finns roller både för dig som har teatererfarenhet och för dig som inte har det. Dessa roller innebär att man genom sitt agerande skapar rysmysiga samt skräckfyllda upplevelser för alla våra gäster. Enklare improvisation är varmt välkommet! Du behöver kunna anpassa ditt agerande utefter vilka gäster du har framför dig, små som stora.  Exempel på roller är zombie, spökpirat, och diverse andra onda väsen. Till dessa roller söker vi helt enkelt dig som verkligen gillar att agera och röra på dig! Kanske är du den fängslade gasten i kaptensgården eller en zombiepassagerare i zombieexpressen.\n\nAvancerad roll\nI den här kategorin finns både roller med färdiga monologer och roller med mer improvisation. Rollerna kräver mycket erfarenhet. Målet är såklart även här att underhålla och/eller skrämma våra gäster. I rollerna utgår du från en karaktärsbeskrivning med vissa riktlinjer, men förväntas också kunna agera och improvisera inom ramen för karaktären. Vissa av de avancerade rollerna är helt och hållet baserade på improvisation och kräver mer av dig som aktör. Du behöver kunna ta regi och inom ramarna kunna lägga din personliga touch på rollen. Våra avancerade roller är röstkrävande och passar dig som har erfarenhet av röstövningar. Ansvarstillägg tillkommer utöver grundlönen inom denna kategori av roller. Om du väljer att söka som onda väsen kommer första steget i rekryteringsprocessen vara en videoaudition.\n\nUrval sker löpande. Varmt välkommen med din ansökan! \n\n\n\nOm Furuviksparken\n\nFuruvik är en kombinationspark med djurpark, tivoli, vattenland och konsertarena, naturskönt belägen vid havet ca 1 mil söder om Gävle. Furuvik öppnade redan 1900. Varje år har parken ca 500 anställda under säsong och besöks av ca 340 000 gäster.\n\nFuruvik är sedan 2010 en del av Parks and Resorts, Nordens ledande aktör inom upplevelseindustrin. I gruppen ingår några av Sveriges mest populära resmål; Gröna Lund, Kolmården, Furuvik och Skara Sommarland. Parks and Resorts är ett familjeföretag som investerar allt överskott i verksamhetens fortsatta utveckling.",
        "conditions" : "Deltid/\r\nEj specificerat",
        "text" : "För fjärde gången, och mer rysmysigt än någonsin, slår Furuvik upp portarna för en oförglömlig Halloween. Som aktör på Furuviksparken arbetar du tillsammans med andra aktörer för att bjuda på magiska upplevelser genom att underhålla våra gäster runt om i parken. Under några kvällar förvandlas även parken och bjuder de som vågar på fasansfull skräck i form av zombies, onda clowner och varelser från skogens mörkaste vrår.\n\nAtt jobba som aktör\n\nSom aktör på Halloween jobbar du i någon av våra skräckhus/områden som till exempel zombie eller spökpirat. Din uppgift blir att skrämma våra gäster för att maximera deras upplevelse. Rollerna varierar, men de flesta karaktärer jobbar huvudsakligen med att skrämmas. Det finns ett fåtal mer avancerade roller, både läskiga och mindre läskiga. \n\nVad som krävs\n\nTill de här rollerna söker vi dig som älskar teater, improvisation eller bara att skrämmas! Du kan arbeta 15-16 oktober, 22-23 oktober, 29-30 oktober samt 2 oktober - 5 november samt medverka på utbildningstillfällen inför. Arbetstiderna varierar och innefattar arbete både dagtid, kvällstid och helg. Du som söker behöver utöver detta också: \n\n\n• Klara av att jobba i mörka och trånga utrymmen med höga ljud\n• Kunna ta regi\n• Vara stresstålig\n• Kunna läsa av människor och anpassa ditt agerande därefter \n\nAndra krav för denna tjänst är att du är minst 18 år fyllda, kan kommunicera på svenska, och framförallt ser du fram emot en spöklik tillställning för våra gäster. Har du utbildning och/eller yrkesvana inom teater eller motsvarande är det meriterande men inget krav. Lön tillämpas enligt kollektivavtal. Vissa roller har ansvarstillägg beroende på rollens komplexitet. Oavsett vilken aktörsoll du har kommer du att arbeta efter angivna riktlinjer och förutsättningar som finns inom ramen för det skräckhus/område som du arbetar i. I samband med anställningens start får du en ordentlig utbildning inom det område du skall jobba på där du får lära dig hur du ska jobba med din karaktär på ett tryggt och säkert sätt utifrån rätt riktlinjer och förutsättningar.\n\nVåra roller\n\nVi delar upp våra aktörsroller i två olika kategorier, skrämsel-roller och avancerade roller: \n\nSkrämsel-roll\nInom denna kategori finns de flesta av våra roller och det finns roller både för dig som har teatererfarenhet och för dig som inte har det. Dessa roller innebär att man genom sitt agerande skapar rysmysiga samt skräckfyllda upplevelser för alla våra gäster. Enklare improvisation är varmt välkommet! Du behöver kunna anpassa ditt agerande utefter vilka gäster du har framför dig, små som stora.  Exempel på roller är zombie, spökpirat, och diverse andra onda väsen. Till dessa roller söker vi helt enkelt dig som verkligen gillar att agera och röra på dig! Kanske är du den fängslade gasten i kaptensgården eller en zombiepassagerare i zombieexpressen.\n\nAvancerad roll\nI den här kategorin finns både roller med färdiga monologer och roller med mer improvisation. Rollerna kräver mycket erfarenhet. Målet är såklart även här att underhålla och/eller skrämma våra gäster. I rollerna utgår du från en karaktärsbeskrivning med vissa riktlinjer, men förväntas också kunna agera och improvisera inom ramen för karaktären. Vissa av de avancerade rollerna är helt och hållet baserade på improvisation och kräver mer av dig som aktör. Du behöver kunna ta regi och inom ramarna kunna lägga din personliga touch på rollen. Våra avancerade roller är röstkrävande och passar dig som har erfarenhet av röstövningar. Ansvarstillägg tillkommer utöver grundlönen inom denna kategori av roller. Om du väljer att söka som onda väsen kommer första steget i rekryteringsprocessen vara en videoaudition.\n\nUrval sker löpande. Varmt välkommen med din ansökan! \n\n\n\nOm Furuviksparken\n\nFuruvik är en kombinationspark med djurpark, tivoli, vattenland och konsertarena, naturskönt belägen vid havet ca 1 mil söder om Gävle. Furuvik öppnade redan 1900. Varje år har parken ca 500 anställda under säsong och besöks av ca 340 000 gäster.\n\nFuruvik är sedan 2010 en del av Parks and Resorts, Nordens ledande aktör inom upplevelseindustrin. I gruppen ingår några av Sveriges mest populära resmål; Gröna Lund, Kolmården, Furuvik och Skara Sommarland. Parks and Resorts är ett familjeföretag som investerar allt överskott i verksamhetens fortsatta utveckling."
      },
      "headline" : "Aktörer till Halloween på Furuvik",
      "driving_license" : null,
      "employer" : {
        "email" : null,
        "phone_number" : null,
        "organization_number" : "5560349192",
        "name" : "AB Furuviksparken",
        "url" : "http://www.furuvik.se/",
        "workplace" : "Furuviksparken"
      },
      "removed_date" : null,
      "logo_url" : "https://www.arbetsformedlingen.se/rest/arbetsgivare/rest/af/v3/organisation/5560349192/logotyper/logo.png",
      "last_publication_date" : "2022-09-03T23:59:59",
      "number_of_vacancies" : 25,
      "occupation" : {
        "concept_id" : "Xoz2_dQe_9KC",
        "label" : "Skådespelare",
        "legacy_ams_taxonomy_id" : "6051"
      },
      "occupation_group" : {
        "concept_id" : "iBUL_s38_izZ",
        "label" : "Skådespelare",
        "legacy_ams_taxonomy_id" : "2655"
      },
      "employment_type" : {
        "concept_id" : "PFZr_Syz_cUq",
        "label" : "Vanlig anställning",
        "legacy_ams_taxonomy_id" : "1"
      },
      "webpage_url" : "https://arbetsformedlingen.se/platsbanken/annonser/26375187",
      "driving_license_required" : false,
      "application_contacts" : [ ],
      "duration" : {
        "concept_id" : "Sy9J_aRd_ALx",
        "label" : "11 dagar - upp till 3 månader",
        "legacy_ams_taxonomy_id" : "7"
      },
      "nice_to_have" : {
        "education_level" : [ ],
        "work_experiences" : [ ],
        "skills" : [ ],
        "education" : [ ],
        "languages" : [ ]
      },
      "application_details" : {
        "via_af" : false,
        "email" : null,
        "other" : null,
        "reference" : null,
        "url" : "https://parksandresorts.com/jobba-hos-oss/ansokan?rmpage=job&rmjob=2084",
        "information" : null
      },
      "source_type" : "VIA_PLATSBANKEN_DXA",
      "application_deadline" : "2022-09-03T23:59:59",
      "external_id" : "46-556034-9192-2084",
      "workplace_address" : {
        "coordinates" : [ 17.141273, 60.67488 ],
        "city" : null,
        "postcode" : null,
        "municipality" : "Gävle",
        "region_concept_id" : "zupA_8Nt_xcD",
        "region" : "Gävleborgs län",
        "country_code" : "199",
        "region_code" : "21",
        "municipality_concept_id" : "qk8Y_2b6_82D",
        "country_concept_id" : "i46j_HmG_v64",
        "municipality_code" : "2180",
        "street_address" : null,
        "country" : "Sverige"
      },
      "id" : "26375187",
      "experience_required" : false,
      "working_hours_type" : {
        "concept_id" : "947z_JGS_Uk2",
        "label" : "Deltid",
        "legacy_ams_taxonomy_id" : "2"
      },
      "access" : null,
      "timestamp" : 1659527925835,
      "must_have" : {
        "education_level" : [ ],
        "work_experiences" : [ ],
        "skills" : [ ],
        "education" : [ ],
        "languages" : [ ]
      },
      "occupation_field" : {
        "concept_id" : "9puE_nYg_crq",
        "label" : "Kultur, media, design",
        "legacy_ams_taxonomy_id" : "11"
      },
      "scope_of_work" : {
        "min" : 0,
        "max" : 100
      },
      "salary_type" : {
        "concept_id" : "oG8G_9cW_nRf",
        "label" : "Fast månads- vecko- eller timlön",
        "legacy_ams_taxonomy_id" : "1"
      },
      "removed" : false,
      "salary_description" : "Enligt avtal",
      "access_to_own_car" : false,
      "publication_date" : "2022-08-03T13:58:45"
    },
    "name" : "Aktörer till Halloween på Furuvik",
    "user" : "hannes"
  },
  "sha1" : "0d7c756ae90d5f13146a3785073d644350c72cbe",
  "annotations" : [ {
    "preferred-label" : "Skådespelare",
    "type" : "ssyk-level-4",
    "start-position" : 0,
    "end-position" : 7,
    "concept-id" : "iBUL_s38_izZ",
    "matched-string" : "Aktörer",
    "annotation-id" : 10
  }, {
    "preferred-label" : "Skådespelare",
    "type" : "ssyk-level-4",
    "start-position" : 144,
    "end-position" : 149,
    "concept-id" : "iBUL_s38_izZ",
    "matched-string" : "aktör",
    "annotation-id" : 11
  }, {
    "preferred-label" : "Skådespelare",
    "type" : "ssyk-level-4",
    "start-position" : 473,
    "end-position" : 478,
    "concept-id" : "iBUL_s38_izZ",
    "matched-string" : "aktör",
    "annotation-id" : 12
  }, {
    "preferred-label" : "Skådespelare",
    "type" : "ssyk-level-4",
    "start-position" : 484,
    "end-position" : 489,
    "concept-id" : "iBUL_s38_izZ",
    "matched-string" : "aktör",
    "annotation-id" : 13
  }, {
    "preferred-label" : "Teater",
    "sentiment" : "MUST_HAVE",
    "type" : "keyword",
    "start-position" : 885,
    "end-position" : 891,
    "concept-id" : "u7zK_VKN_8Ht",
    "matched-string" : "teater",
    "annotation-id" : 0
  }, {
    "preferred-label" : "Improvisation",
    "sentiment" : "MUST_HAVE",
    "type" : "skill",
    "start-position" : 893,
    "end-position" : 906,
    "concept-id" : "qwHa_w4A_tTc",
    "matched-string" : "improvisation",
    "annotation-id" : 1
  }, {
    "preferred-label" : "Regi",
    "sentiment" : "MUST_HAVE",
    "type" : "keyword",
    "start-position" : 1260,
    "end-position" : 1264,
    "concept-id" : "Wqo3_zSi_eNj",
    "matched-string" : "regi",
    "annotation-id" : 2
  }, {
    "preferred-label" : "hantera stress",
    "type" : "esco-skill",
    "start-position" : 1272,
    "end-position" : 1283,
    "concept-id" : "z5Zo_DVb_VEK",
    "matched-string" : "stresstålig",
    "annotation-id" : 14
  }, {
    "preferred-label" : "Svenska",
    "sentiment" : "MUST_HAVE",
    "type" : "language",
    "start-position" : 1427,
    "end-position" : 1434,
    "concept-id" : "zSLA_vw2_FXN",
    "matched-string" : "svenska",
    "annotation-id" : 3
  }, {
    "preferred-label" : "Teater",
    "sentiment" : "MUST_HAVE",
    "type" : "keyword",
    "start-position" : 1554,
    "end-position" : 1560,
    "concept-id" : "u7zK_VKN_8Ht",
    "matched-string" : "teater",
    "annotation-id" : 4
  }, {
    "preferred-label" : "Kollektivavtal",
    "sentiment" : "MUST_HAVE",
    "type" : "skill",
    "start-position" : 1635,
    "end-position" : 1649,
    "concept-id" : "z7wE_9xb_3jX",
    "matched-string" : "kollektivavtal",
    "annotation-id" : 5
  }, {
    "preferred-label" : "Improvisation",
    "sentiment" : "MUST_HAVE",
    "type" : "skill",
    "start-position" : 2497,
    "end-position" : 2510,
    "concept-id" : "qwHa_w4A_tTc",
    "matched-string" : "improvisation",
    "annotation-id" : 6
  }, {
    "preferred-label" : "Improvisation",
    "sentiment" : "MUST_HAVE",
    "type" : "skill",
    "start-position" : 2979,
    "end-position" : 2992,
    "concept-id" : "qwHa_w4A_tTc",
    "matched-string" : "improvisation",
    "annotation-id" : 7
  }, {
    "preferred-label" : "Improvisation",
    "sentiment" : "MUST_HAVE",
    "type" : "skill",
    "start-position" : 3310,
    "end-position" : 3323,
    "concept-id" : "qwHa_w4A_tTc",
    "matched-string" : "improvisation",
    "annotation-id" : 8
  }, {
    "preferred-label" : "Regi",
    "sentiment" : "MUST_HAVE",
    "type" : "keyword",
    "start-position" : 3377,
    "end-position" : 3381,
    "concept-id" : "Wqo3_zSi_eNj",
    "matched-string" : "regi",
    "annotation-id" : 9
  }, {
    "preferred-label" : "Gävle",
    "type" : "municipality",
    "start-position" : 3919,
    "end-position" : 3924,
    "concept-id" : "qk8Y_2b6_82D",
    "matched-string" : "Gävle",
    "annotation-id" : 15
  }, {
    "preferred-label" : "Sverige",
    "type" : "country",
    "start-position" : 4162,
    "end-position" : 4170,
    "concept-id" : "i46j_HmG_v64",
    "matched-string" : "Sveriges",
    "annotation-id" : 16
  } ],
  "text" : "Aktörer till Halloween på Furuvik\nFör fjärde gången, och mer rysmysigt än någonsin, slår Furuvik upp portarna för en oförglömlig Halloween. Som aktör på Furuviksparken arbetar du tillsammans med andra aktörer för att bjuda på magiska upplevelser genom att underhålla våra gäster runt om i parken. Under några kvällar förvandlas även parken och bjuder de som vågar på fasansfull skräck i form av zombies, onda clowner och varelser från skogens mörkaste vrår.\n\nAtt jobba som aktör\n\nSom aktör på Halloween jobbar du i någon av våra skräckhus/områden som till exempel zombie eller spökpirat. Din uppgift blir att skrämma våra gäster för att maximera deras upplevelse. Rollerna varierar, men de flesta karaktärer jobbar huvudsakligen med att skrämmas. Det finns ett fåtal mer avancerade roller, både läskiga och mindre läskiga. \n\nVad som krävs\n\nTill de här rollerna söker vi dig som älskar teater, improvisation eller bara att skrämmas! Du kan arbeta 15-16 oktober, 22-23 oktober, 29-30 oktober samt 2 oktober - 5 november samt medverka på utbildningstillfällen inför. Arbetstiderna varierar och innefattar arbete både dagtid, kvällstid och helg. Du som söker behöver utöver detta också: \n\n\n• Klara av att jobba i mörka och trånga utrymmen med höga ljud\n• Kunna ta regi\n• Vara stresstålig\n• Kunna läsa av människor och anpassa ditt agerande därefter \n\nAndra krav för denna tjänst är att du är minst 18 år fyllda, kan kommunicera på svenska, och framförallt ser du fram emot en spöklik tillställning för våra gäster. Har du utbildning och/eller yrkesvana inom teater eller motsvarande är det meriterande men inget krav. Lön tillämpas enligt kollektivavtal. Vissa roller har ansvarstillägg beroende på rollens komplexitet. Oavsett vilken aktörsoll du har kommer du att arbeta efter angivna riktlinjer och förutsättningar som finns inom ramen för det skräckhus/område som du arbetar i. I samband med anställningens start får du en ordentlig utbildning inom det område du skall jobba på där du får lära dig hur du ska jobba med din karaktär på ett tryggt och säkert sätt utifrån rätt riktlinjer och förutsättningar.\n\nVåra roller\n\nVi delar upp våra aktörsroller i två olika kategorier, skrämsel-roller och avancerade roller: \n\nSkrämsel-roll\nInom denna kategori finns de flesta av våra roller och det finns roller både för dig som har teatererfarenhet och för dig som inte har det. Dessa roller innebär att man genom sitt agerande skapar rysmysiga samt skräckfyllda upplevelser för alla våra gäster. Enklare improvisation är varmt välkommet! Du behöver kunna anpassa ditt agerande utefter vilka gäster du har framför dig, små som stora.  Exempel på roller är zombie, spökpirat, och diverse andra onda väsen. Till dessa roller söker vi helt enkelt dig som verkligen gillar att agera och röra på dig! Kanske är du den fängslade gasten i kaptensgården eller en zombiepassagerare i zombieexpressen.\n\nAvancerad roll\nI den här kategorin finns både roller med färdiga monologer och roller med mer improvisation. Rollerna kräver mycket erfarenhet. Målet är såklart även här att underhålla och/eller skrämma våra gäster. I rollerna utgår du från en karaktärsbeskrivning med vissa riktlinjer, men förväntas också kunna agera och improvisera inom ramen för karaktären. Vissa av de avancerade rollerna är helt och hållet baserade på improvisation och kräver mer av dig som aktör. Du behöver kunna ta regi och inom ramarna kunna lägga din personliga touch på rollen. Våra avancerade roller är röstkrävande och passar dig som har erfarenhet av röstövningar. Ansvarstillägg tillkommer utöver grundlönen inom denna kategori av roller. Om du väljer att söka som onda väsen kommer första steget i rekryteringsprocessen vara en videoaudition.\n\nUrval sker löpande. Varmt välkommen med din ansökan! \n\n\n\nOm Furuviksparken\n\nFuruvik är en kombinationspark med djurpark, tivoli, vattenland och konsertarena, naturskönt belägen vid havet ca 1 mil söder om Gävle. Furuvik öppnade redan 1900. Varje år har parken ca 500 anställda under säsong och besöks av ca 340 000 gäster.\n\nFuruvik är sedan 2010 en del av Parks and Resorts, Nordens ledande aktör inom upplevelseindustrin. I gruppen ingår några av Sveriges mest populära resmål; Gröna Lund, Kolmården, Furuvik och Skara Sommarland. Parks and Resorts är ett familjeföretag som investerar allt överskott i verksamhetens fortsatta utveckling."
}