{
  "meta" : {
    "jobad" : {
      "description" : {
        "requirements" : null,
        "needs" : null,
        "company_information" : null,
        "text_formatted" : "<p>Vi söker nu dig som vill jobba som inbärare!</p><p>Vi söker nu en flexibel person som vill jobba som inbärare. Vi söker dig som har god fysik, är lösningsorienterad, och självständig. </p><p>Är du redo att ta an nya utmaningar, och vill få möjligheten att utvecklas och klättra i din karriär? Då har du kommit rätt! Med kunder från många olika branscher kommer du hos oss hitta många olika möjligheter, och hitta en arbetsplats där du trivs och får arbeta med det du brinner för. </p><p>Som arbetstagare hos oss får du alltid någon du kan bolla idéer med, utveckla din kompetens, och ta del av kortare utbildningar och kurser. </p><p>Vi på AuxiliRec brinner för att hitta personer med drivkraft och som tycker om att vara med i utvecklingen av verksamheten.</p><p> </p><p>Arbetsuppgifter: </p><p>Ni kommer att få detaljerade instruktioner inför varje arbetspass, men i huvudsak kommer ni att arbeta med följande:</p><ul><li>Bära in/ut från/till byggarbetsplatsen </li><li>Grovstädning kan förekomma</li></ul><p> </p><p>Kvalifikationer: </p><ul><li>God fysik är ett krav då du kommer att arbeta med tunga lyft</li><li>Svenska i tal</li><li>Flexibel</li><li>Engelska är meriterande</li></ul><p> </p><p>Om du går vidare i rekryteringsprocessen så kommer du att gå på en samtalsintervju hos oss, och efter ytterligare urval av kandidater så får du sedan gå på en anställningsintervju hos oss! Du blir sedan anställd hos oss om allt känns bra! </p><p>Låter tjänsten intressant? Sök jobbet idag, då vi går igenom ansökningarna löpande. Vi ser fram emot att höra ifrån dig! </p><p><br></p><p>Om oss på AuxiliRec AB</p><p>Vårt mål på AuxiliRec är att hitta drivna kandidater till bra arbetsgivare där du som arbetstagare får möjligheten att utvecklas och klättra i din karriär. </p><p>Vi jobbar mot alla branscher men har främst kunder inom lager och logistik, lokalvård, administration, och hälso- och sjukvård. </p><p>Vi söker dig som är motiverad, driven att jobba mot gemensamma mål, och som vill lära sig nya saker.</p>",
        "conditions" : null,
        "text" : "Vi söker nu dig som vill jobba som inbärare!\nVi söker nu en flexibel person som vill jobba som inbärare. Vi söker dig som har god fysik, är lösningsorienterad, och självständig. \nÄr du redo att ta an nya utmaningar, och vill få möjligheten att utvecklas och klättra i din karriär? Då har du kommit rätt! Med kunder från många olika branscher kommer du hos oss hitta många olika möjligheter, och hitta en arbetsplats där du trivs och får arbeta med det du brinner för. \nSom arbetstagare hos oss får du alltid någon du kan bolla idéer med, utveckla din kompetens, och ta del av kortare utbildningar och kurser. \nVi på AuxiliRec brinner för att hitta personer med drivkraft och som tycker om att vara med i utvecklingen av verksamheten.\n \nArbetsuppgifter: \nNi kommer att få detaljerade instruktioner inför varje arbetspass, men i huvudsak kommer ni att arbeta med följande:\nBära in/ut från/till byggarbetsplatsen \nGrovstädning kan förekomma\n\n \nKvalifikationer: \nGod fysik är ett krav då du kommer att arbeta med tunga lyft\nSvenska i tal\nFlexibel\nEngelska är meriterande\n\n \nOm du går vidare i rekryteringsprocessen så kommer du att gå på en samtalsintervju hos oss, och efter ytterligare urval av kandidater så får du sedan gå på en anställningsintervju hos oss! Du blir sedan anställd hos oss om allt känns bra! \nLåter tjänsten intressant? Sök jobbet idag, då vi går igenom ansökningarna löpande. Vi ser fram emot att höra ifrån dig! \n\n\nOm oss på AuxiliRec AB\nVårt mål på AuxiliRec är att hitta drivna kandidater till bra arbetsgivare där du som arbetstagare får möjligheten att utvecklas och klättra i din karriär. \nVi jobbar mot alla branscher men har främst kunder inom lager och logistik, lokalvård, administration, och hälso- och sjukvård. \nVi söker dig som är motiverad, driven att jobba mot gemensamma mål, och som vill lära sig nya saker."
      },
      "headline" : "Inbärare",
      "driving_license" : null,
      "employer" : {
        "email" : null,
        "phone_number" : null,
        "organization_number" : "5592084981",
        "name" : "Auxilirec AB",
        "url" : "https://karriar.auxilirec.se/jobs/1681184-inbarare",
        "workplace" : "Stockholm och Eskilstuna"
      },
      "removed_date" : null,
      "logo_url" : "https://www.arbetsformedlingen.se/rest/arbetsgivare/rest/af/v3/arbetsplatser/87554417/logotyper/logo.png",
      "last_publication_date" : "2022-09-30T00:00:00",
      "number_of_vacancies" : 20,
      "occupation" : {
        "concept_id" : "3uEE_35U_U6j",
        "label" : "Grovarbetare, bygg och anläggning",
        "legacy_ams_taxonomy_id" : "5874"
      },
      "occupation_group" : {
        "concept_id" : "iHrC_aRv_fVm",
        "label" : "Grovarbetare inom bygg och anläggning",
        "legacy_ams_taxonomy_id" : "9310"
      },
      "employment_type" : {
        "concept_id" : "PFZr_Syz_cUq",
        "label" : "Vanlig anställning",
        "legacy_ams_taxonomy_id" : "1"
      },
      "webpage_url" : "https://arbetsformedlingen.se/platsbanken/annonser/26360772",
      "driving_license_required" : false,
      "application_contacts" : [ ],
      "duration" : {
        "concept_id" : "qQUd_4qe_NDT",
        "label" : "6 månader eller längre",
        "legacy_ams_taxonomy_id" : "2"
      },
      "nice_to_have" : {
        "education_level" : [ ],
        "work_experiences" : [ {
          "concept_id" : "3uEE_35U_U6j",
          "weight" : 5,
          "label" : "Grovarbetare, bygg och anläggning",
          "legacy_ams_taxonomy_id" : "5874"
        } ],
        "skills" : [ ],
        "education" : [ ],
        "languages" : [ {
          "concept_id" : "NVxJ_hLg_TYS",
          "weight" : 5,
          "label" : "Engelska",
          "legacy_ams_taxonomy_id" : "283"
        } ]
      },
      "application_details" : {
        "via_af" : false,
        "email" : null,
        "other" : null,
        "reference" : null,
        "url" : "https://karriar.auxilirec.se/jobs/1681184-inbarare",
        "information" : null
      },
      "source_type" : "VIA_ANNONSERA",
      "application_deadline" : "2022-09-30T00:00:00",
      "external_id" : null,
      "workplace_address" : {
        "coordinates" : [ null, null ],
        "city" : null,
        "postcode" : null,
        "municipality" : null,
        "region_concept_id" : null,
        "region" : null,
        "country_code" : "199",
        "region_code" : null,
        "municipality_concept_id" : null,
        "country_concept_id" : "i46j_HmG_v64",
        "municipality_code" : null,
        "street_address" : null,
        "country" : "Sverige"
      },
      "id" : "26360772",
      "experience_required" : true,
      "working_hours_type" : {
        "concept_id" : "6YE1_gAC_R2G",
        "label" : "Heltid",
        "legacy_ams_taxonomy_id" : "1"
      },
      "access" : null,
      "timestamp" : 1659014325271,
      "must_have" : {
        "education_level" : [ ],
        "work_experiences" : [ ],
        "skills" : [ ],
        "education" : [ ],
        "languages" : [ {
          "concept_id" : "zSLA_vw2_FXN",
          "weight" : 10,
          "label" : "Svenska",
          "legacy_ams_taxonomy_id" : "502"
        } ]
      },
      "occupation_field" : {
        "concept_id" : "j7Cq_ZJe_GkT",
        "label" : "Bygg och anläggning",
        "legacy_ams_taxonomy_id" : "2"
      },
      "scope_of_work" : {
        "min" : 0,
        "max" : 100
      },
      "salary_type" : {
        "concept_id" : "oG8G_9cW_nRf",
        "label" : "Fast månads- vecko- eller timlön",
        "legacy_ams_taxonomy_id" : "1"
      },
      "removed" : false,
      "salary_description" : null,
      "access_to_own_car" : false,
      "publication_date" : "2022-07-28T15:18:45"
    },
    "name" : "Inbärare",
    "user" : "hannes"
  },
  "sha1" : "1e45cd9d0a734117870060e576befd5e208f4781",
  "annotations" : [ {
    "preferred-label" : "God fysik (tunga lyft)",
    "type" : "skill",
    "start-position" : 135,
    "end-position" : 144,
    "concept-id" : "rwir_xvu_443",
    "matched-string" : "god fysik",
    "annotation-id" : 8
  }, {
    "preferred-label" : "arbeta självständigt",
    "type" : "esco-skill",
    "start-position" : 173,
    "end-position" : 185,
    "concept-id" : "NyFu_HHd_zhz",
    "matched-string" : "självständig",
    "annotation-id" : 9
  }, {
    "preferred-label" : "bära föremål",
    "type" : "esco-skill",
    "start-position" : 880,
    "end-position" : 884,
    "concept-id" : "cLgz_36a_SHQ",
    "matched-string" : "Bära",
    "annotation-id" : 11
  }, {
    "preferred-label" : "Grovstädare",
    "type" : "keyword",
    "start-position" : 920,
    "end-position" : 932,
    "concept-id" : "RCMt_UaK_13u",
    "matched-string" : "Grovstädning",
    "annotation-id" : 10
  }, {
    "preferred-label" : "God fysik (tunga lyft)",
    "type" : "skill",
    "start-position" : 968,
    "end-position" : 977,
    "concept-id" : "rwir_xvu_443",
    "matched-string" : "God fysik",
    "annotation-id" : 12
  }, {
    "preferred-label" : "Svenska",
    "sentiment" : "MUST_HAVE",
    "type" : "language",
    "start-position" : 1029,
    "end-position" : 1036,
    "concept-id" : "zSLA_vw2_FXN",
    "matched-string" : "svenska",
    "annotation-id" : 2
  }, {
    "preferred-label" : "Engelska",
    "sentiment" : "MUST_HAVE",
    "type" : "language",
    "start-position" : 1052,
    "end-position" : 1060,
    "concept-id" : "NVxJ_hLg_TYS",
    "matched-string" : "engelska",
    "annotation-id" : 3
  }, {
    "preferred-label" : "Lager",
    "sentiment" : "MUST_HAVE",
    "type" : "keyword",
    "start-position" : 1679,
    "end-position" : 1684,
    "concept-id" : "J5gJ_6vV_egQ",
    "matched-string" : "lager",
    "annotation-id" : 4
  }, {
    "preferred-label" : "Logistik",
    "sentiment" : "MUST_HAVE",
    "type" : "skill",
    "start-position" : 1689,
    "end-position" : 1697,
    "concept-id" : "yXmf_iKi_7ci",
    "matched-string" : "logistik",
    "annotation-id" : 5
  }, {
    "preferred-label" : "Lokalvård",
    "sentiment" : "MUST_HAVE",
    "type" : "keyword",
    "start-position" : 1699,
    "end-position" : 1708,
    "concept-id" : "dpoa_kdf_VRa",
    "matched-string" : "lokalvård",
    "annotation-id" : 6
  }, {
    "preferred-label" : "Hälso",
    "sentiment" : "MUST_HAVE",
    "type" : "keyword",
    "start-position" : 1730,
    "end-position" : 1735,
    "concept-id" : "5TsD_dN8_Uco",
    "matched-string" : "hälso",
    "annotation-id" : 7
  } ],
  "text" : "Inbärare\nVi söker nu dig som vill jobba som inbärare!\nVi söker nu en flexibel person som vill jobba som inbärare. Vi söker dig som har god fysik, är lösningsorienterad, och självständig. \nÄr du redo att ta an nya utmaningar, och vill få möjligheten att utvecklas och klättra i din karriär? Då har du kommit rätt! Med kunder från många olika branscher kommer du hos oss hitta många olika möjligheter, och hitta en arbetsplats där du trivs och får arbeta med det du brinner för. \nSom arbetstagare hos oss får du alltid någon du kan bolla idéer med, utveckla din kompetens, och ta del av kortare utbildningar och kurser. \nVi på AuxiliRec brinner för att hitta personer med drivkraft och som tycker om att vara med i utvecklingen av verksamheten.\n \nArbetsuppgifter: \nNi kommer att få detaljerade instruktioner inför varje arbetspass, men i huvudsak kommer ni att arbeta med följande:\nBära in/ut från/till byggarbetsplatsen \nGrovstädning kan förekomma\n\n \nKvalifikationer: \nGod fysik är ett krav då du kommer att arbeta med tunga lyft\nSvenska i tal\nFlexibel\nEngelska är meriterande\n\n \nOm du går vidare i rekryteringsprocessen så kommer du att gå på en samtalsintervju hos oss, och efter ytterligare urval av kandidater så får du sedan gå på en anställningsintervju hos oss! Du blir sedan anställd hos oss om allt känns bra! \nLåter tjänsten intressant? Sök jobbet idag, då vi går igenom ansökningarna löpande. Vi ser fram emot att höra ifrån dig! \n\n\nOm oss på AuxiliRec AB\nVårt mål på AuxiliRec är att hitta drivna kandidater till bra arbetsgivare där du som arbetstagare får möjligheten att utvecklas och klättra i din karriär. \nVi jobbar mot alla branscher men har främst kunder inom lager och logistik, lokalvård, administration, och hälso- och sjukvård. \nVi söker dig som är motiverad, driven att jobba mot gemensamma mål, och som vill lära sig nya saker."
}