{
  "meta" : {
    "jobad" : {
      "description" : {
        "requirements" : null,
        "needs" : null,
        "company_information" : null,
        "text_formatted" : "Om Praktikertjänst AB\nFrån Karesuando i norr till Ystad i söder, och med verksamheter i fler än 200 kommuner, är Praktikertjänst hela Sveriges välfärd. En av fem vårdpatienter går till någon av våra mottagningar – och en av tre tandvårdspatienter väljer oss.\n\nVår affärsidé är att skapa förutsättningar för att vi som arbetar inom vården ska kunna göra ett så bra jobb som möjligt – och skapa högsta värde för patienten. Det är vi som utför vården som gemensamt äger Praktikertjänst.\n\nVår unika affärsmodell har funnits i 60 år, och innebär att företagets 1 300 aktieägare själva arbetar i verksamheterna som läkare, tandläkare, tandtekniker, tandhygienister, fysioterapeuter, dietister, psykologer, psykoanalytiker/terapeuter, sjuksköterskor, barnmorskor och logopeder. Det gör oss till Sveriges största företag inom privat tandvård och hälso- och sjukvård.\n\nPraktikertjänst omsätter cirka 8,5 miljarder kronor och har drygt 7 100 medarbetare.\r\n\r\nOm Tandläkare Michael  Nylander\nHaninge tandvårdscenter bedriver allmän och lasertandvård,\nsnark behandlingar,tandreglering,implantat i centrala Handen.\nVi har fyra behandlingsrum och mottagningen har digital rtg och OPG.\nVi har Frenda som journalsystem. Vårat team består av en tandläkare, en tandhygienist, två tandsköterskor (varav en är i receptionen.)\r\n\r\nArbetsuppgifter\nSedvanliga tandhygienistbehandlingar, kunna assistera och arbeta delegerat. Vara nyfiken och vilja utvecklas tillsammans med teamet.\n\nÖvrig information\nTjänsten är på 30-35 h/v tillsvidare med provanställning.\nca. två dag med hygienist behandlingar och två dagar delegerat/assistans. Tjänsten söks i första hand via mail.\r\n\r\nKvalifikationer\nExaminerad tandhygienist med flera års erfarenhet.\n\r\nPersonliga egenskaper\nVi söker dig som gillar ditt jobb och är positiv, noggrann, ödmjuk och servicemedveten.\nDu ska ha goda kunskaper i svenska i tal och skrift. Teamkänsla.",
        "conditions" : "30 timmar per vecka. Tillträde: Enligt överenskommelse.\r\nTillsvidare med provanställning. Varaktighet: Tillsvidare.",
        "text" : "Om Praktikertjänst AB\nFrån Karesuando i norr till Ystad i söder, och med verksamheter i fler än 200 kommuner, är Praktikertjänst hela Sveriges välfärd. En av fem vårdpatienter går till någon av våra mottagningar – och en av tre tandvårdspatienter väljer oss.\n\nVår affärsidé är att skapa förutsättningar för att vi som arbetar inom vården ska kunna göra ett så bra jobb som möjligt – och skapa högsta värde för patienten. Det är vi som utför vården som gemensamt äger Praktikertjänst.\n\nVår unika affärsmodell har funnits i 60 år, och innebär att företagets 1 300 aktieägare själva arbetar i verksamheterna som läkare, tandläkare, tandtekniker, tandhygienister, fysioterapeuter, dietister, psykologer, psykoanalytiker/terapeuter, sjuksköterskor, barnmorskor och logopeder. Det gör oss till Sveriges största företag inom privat tandvård och hälso- och sjukvård.\n\nPraktikertjänst omsätter cirka 8,5 miljarder kronor och har drygt 7 100 medarbetare.\r\n\r\nOm Tandläkare Michael  Nylander\nHaninge tandvårdscenter bedriver allmän och lasertandvård,\nsnark behandlingar,tandreglering,implantat i centrala Handen.\nVi har fyra behandlingsrum och mottagningen har digital rtg och OPG.\nVi har Frenda som journalsystem. Vårat team består av en tandläkare, en tandhygienist, två tandsköterskor (varav en är i receptionen.)\r\n\r\nArbetsuppgifter\nSedvanliga tandhygienistbehandlingar, kunna assistera och arbeta delegerat. Vara nyfiken och vilja utvecklas tillsammans med teamet.\n\nÖvrig information\nTjänsten är på 30-35 h/v tillsvidare med provanställning.\nca. två dag med hygienist behandlingar och två dagar delegerat/assistans. Tjänsten söks i första hand via mail.\r\n\r\nKvalifikationer\nExaminerad tandhygienist med flera års erfarenhet.\n\r\nPersonliga egenskaper\nVi söker dig som gillar ditt jobb och är positiv, noggrann, ödmjuk och servicemedveten.\nDu ska ha goda kunskaper i svenska i tal och skrift. Teamkänsla."
      },
      "headline" : "Tandhygienist",
      "driving_license" : null,
      "employer" : {
        "email" : null,
        "phone_number" : null,
        "organization_number" : "5560772419",
        "name" : "Praktikertjänst AB",
        "url" : "http://www.haningetandvardscenter.praktikertjanst.se",
        "workplace" : "Tandläkare Michael  Nylander"
      },
      "removed_date" : null,
      "logo_url" : "https://www.arbetsformedlingen.se/rest/arbetsgivare/rest/af/v3/organisation/5560772419/logotyper/logo.png",
      "last_publication_date" : "2023-02-28T23:59:59",
      "number_of_vacancies" : 1,
      "occupation" : {
        "concept_id" : "TPRY_Wze_q6x",
        "label" : "Tandhygienist",
        "legacy_ams_taxonomy_id" : "5723"
      },
      "occupation_group" : {
        "concept_id" : "4F9o_Jzv_Pwz",
        "label" : "Tandhygienister",
        "legacy_ams_taxonomy_id" : "3250"
      },
      "employment_type" : {
        "concept_id" : "PFZr_Syz_cUq",
        "label" : "Vanlig anställning",
        "legacy_ams_taxonomy_id" : "1"
      },
      "webpage_url" : "https://arbetsformedlingen.se/platsbanken/annonser/26887740",
      "driving_license_required" : false,
      "application_contacts" : [ {
        "description" : "Michael Nylander",
        "email" : "michael.nylander@ptj.se",
        "telephone" : "070-467 46 52",
        "name" : null,
        "contact_type" : null
      } ],
      "duration" : {
        "concept_id" : "a7uU_j21_mkL",
        "label" : "Tills vidare",
        "legacy_ams_taxonomy_id" : "1"
      },
      "nice_to_have" : {
        "education_level" : [ ],
        "work_experiences" : [ ],
        "skills" : [ ],
        "education" : [ ],
        "languages" : [ ]
      },
      "application_details" : {
        "via_af" : false,
        "email" : "michael.nylander@ptj.se",
        "other" : null,
        "reference" : "46-556077-2419-D670",
        "url" : null,
        "information" : null
      },
      "source_type" : "VIA_PLATSBANKEN_DXA",
      "application_deadline" : "2023-02-28T23:59:59",
      "external_id" : "46-556077-2419-D670",
      "workplace_address" : {
        "coordinates" : [ 18.15109, 59.182724 ],
        "city" : null,
        "postcode" : null,
        "municipality" : "Haninge",
        "region_concept_id" : "CifL_Rzy_Mku",
        "region" : "Stockholms län",
        "country_code" : "199",
        "region_code" : "01",
        "municipality_concept_id" : "Q7gp_9dT_k2F",
        "country_concept_id" : "i46j_HmG_v64",
        "municipality_code" : "0136",
        "street_address" : null,
        "country" : "Sverige"
      },
      "id" : "26887740",
      "experience_required" : true,
      "working_hours_type" : {
        "concept_id" : "947z_JGS_Uk2",
        "label" : "Deltid",
        "legacy_ams_taxonomy_id" : "2"
      },
      "access" : null,
      "timestamp" : 1670504123665,
      "must_have" : {
        "education_level" : [ ],
        "work_experiences" : [ {
          "concept_id" : "TPRY_Wze_q6x",
          "weight" : 10,
          "label" : "Tandhygienist",
          "legacy_ams_taxonomy_id" : "5723"
        } ],
        "skills" : [ ],
        "education" : [ ],
        "languages" : [ ]
      },
      "occupation_field" : {
        "concept_id" : "NYW6_mP6_vwf",
        "label" : "Hälso- och sjukvård",
        "legacy_ams_taxonomy_id" : "8"
      },
      "scope_of_work" : {
        "min" : 0,
        "max" : 100
      },
      "salary_type" : {
        "concept_id" : "oG8G_9cW_nRf",
        "label" : "Fast månads- vecko- eller timlön",
        "legacy_ams_taxonomy_id" : "1"
      },
      "removed" : false,
      "salary_description" : "Individuell lönesättning",
      "access_to_own_car" : false,
      "publication_date" : "2022-12-09T00:00:00"
    },
    "name" : "Tandhygienist"
  },
  "sha1" : "d4e72970d791e10d40dcfcfd5765377bae236ca8",
  "annotations" : [ {
    "preferred-label" : "Tandhygienist",
    "sentiment" : "MUST_HAVE",
    "type" : "occupation-name",
    "start-position" : 0,
    "end-position" : 13,
    "concept-id" : "TPRY_Wze_q6x",
    "matched-string" : "tandhygienist",
    "annotation-id" : 0
  }, {
    "preferred-label" : "Haninge",
    "sentiment" : "MUST_HAVE",
    "type" : "municipality",
    "start-position" : 994,
    "end-position" : 1001,
    "concept-id" : "Q7gp_9dT_k2F",
    "matched-string" : "haninge",
    "annotation-id" : 14
  }, {
    "preferred-label" : "Tandhygienist",
    "sentiment" : "MUST_HAVE",
    "type" : "occupation-name",
    "start-position" : 1256,
    "end-position" : 1269,
    "concept-id" : "TPRY_Wze_q6x",
    "matched-string" : "tandhygienist",
    "annotation-id" : 18
  }, {
    "preferred-label" : "Vara",
    "sentiment" : "MUST_HAVE",
    "type" : "municipality",
    "start-position" : 1414,
    "end-position" : 1418,
    "concept-id" : "fbHM_yhA_BqS",
    "matched-string" : "vara",
    "annotation-id" : 20
  }, {
    "preferred-label" : "Tills vidare",
    "type" : "employment-duration",
    "start-position" : 1515,
    "end-position" : 1526,
    "concept-id" : "a7uU_j21_mkL",
    "matched-string" : "tillsvidare",
    "annotation-id" : 24
  }, {
    "preferred-label" : "Tandhygienistexamen",
    "type" : "skill",
    "start-position" : 1679,
    "end-position" : 1703,
    "concept-id" : "dncA_DPY_5bh",
    "matched-string" : "Examinerad tandhygienist",
    "annotation-id" : 23
  }, {
    "preferred-label" : "Svenska",
    "sentiment" : "MUST_HAVE",
    "type" : "language",
    "start-position" : 1869,
    "end-position" : 1876,
    "concept-id" : "zSLA_vw2_FXN",
    "matched-string" : "svenska",
    "annotation-id" : 22
  } ],
  "text" : "Tandhygienist\nOm Praktikertjänst AB\nFrån Karesuando i norr till Ystad i söder, och med verksamheter i fler än 200 kommuner, är Praktikertjänst hela Sveriges välfärd. En av fem vårdpatienter går till någon av våra mottagningar – och en av tre tandvårdspatienter väljer oss.\n\nVår affärsidé är att skapa förutsättningar för att vi som arbetar inom vården ska kunna göra ett så bra jobb som möjligt – och skapa högsta värde för patienten. Det är vi som utför vården som gemensamt äger Praktikertjänst.\n\nVår unika affärsmodell har funnits i 60 år, och innebär att företagets 1 300 aktieägare själva arbetar i verksamheterna som läkare, tandläkare, tandtekniker, tandhygienister, fysioterapeuter, dietister, psykologer, psykoanalytiker/terapeuter, sjuksköterskor, barnmorskor och logopeder. Det gör oss till Sveriges största företag inom privat tandvård och hälso- och sjukvård.\n\nPraktikertjänst omsätter cirka 8,5 miljarder kronor och har drygt 7 100 medarbetare.\r\n\r\nOm Tandläkare Michael  Nylander\nHaninge tandvårdscenter bedriver allmän och lasertandvård,\nsnark behandlingar,tandreglering,implantat i centrala Handen.\nVi har fyra behandlingsrum och mottagningen har digital rtg och OPG.\nVi har Frenda som journalsystem. Vårat team består av en tandläkare, en tandhygienist, två tandsköterskor (varav en är i receptionen.)\r\n\r\nArbetsuppgifter\nSedvanliga tandhygienistbehandlingar, kunna assistera och arbeta delegerat. Vara nyfiken och vilja utvecklas tillsammans med teamet.\n\nÖvrig information\nTjänsten är på 30-35 h/v tillsvidare med provanställning.\nca. två dag med hygienist behandlingar och två dagar delegerat/assistans. Tjänsten söks i första hand via mail.\r\n\r\nKvalifikationer\nExaminerad tandhygienist med flera års erfarenhet.\n\r\nPersonliga egenskaper\nVi söker dig som gillar ditt jobb och är positiv, noggrann, ödmjuk och servicemedveten.\nDu ska ha goda kunskaper i svenska i tal och skrift. Teamkänsla."
}