{
  "meta" : {
    "jobad" : {
      "description" : {
        "requirements" : null,
        "needs" : null,
        "company_information" : null,
        "text_formatted" : "Välkommen till Flens kommun - Sörmlands hjärta!\n\nSom medarbetare i Flens kommun är du vårt ansikte utåt till kommunens invånare. Vi vill att du ska ha en bra arbetsplats där du trivs och känner dig motiverad till att göra ett fantastiskt jobb. Omvärlden förändras och vår organisation behöver dig som vill bidra med engagemang och en härlig energi. \n\nDet arbete vi gör tillsammans varje dag, dygnet runt, året runt har sin utgångspunkt i vår vision, vår värdegrund och våra mål. Vi tror att bilden av Sörmlands hjärta skapas i varje möte med invånare, företagare och besökare, genom professionellt och respektfullt bemötande.\n\nPlaceringen är för närvarande på Drejskivans äldreboende i Flen. \n\nArbetsuppgifter\n\nArbetet på särskilt boende innebär att stötta och hjälpa våra hyresgäster med vardagliga ting såsom hygien, kläder och måltider. Insatser i form av städ och tvätt förekommer också. Vi arbetar salutogent vilket innebär att vi tar vara på det friska hos varje individ, stöttar dem till att vara så självständiga som möjligt och hjälper när det behövs. Vårt mål är att skapa livsglädje och välbefinnande, att våra hyresgäster ska få leva sitt liv fullt ut även på ålderns höst. \n\nVarje dag sker olika aktiviteter där alla som vill kan delta, och en gång i månaden har varje hyresgäst en egen stund med sin kontaktpersonal då man kan genomföra lite mer individuella aktiviteter enligt hyresgästens önskemål. \n\nDet är viktigt att tänka på att vi på ett särskilt boende arbetar i hyresgästens eget hem, och att bevara integritet, delaktighet och självbestämmande. Delegering av läkemedel kan ske efter genomgången utbildning och kunskapsprov, i samråd med områdesansvarig sjuksköterska. Dokumentation sker i förvaltningens verksamhetssystem Pulsen Combine. \n\nVi söker dig\n\nSom är utbildad undersköterska med erfarenhet av äldrevård och demensvård, det är meriterande med vidareutbildning inom demensvård. Du som söker har en positiv attityd och bidrar till arbetsglädje och framåtanda. Du är självständig, ansvarstagande, flexibel, har god samarbetsförmåga och ser möjligheter istället för hinder. Vi uppskattar en god kommuniktiv förmåga både i tal och skrift, samt datavana och kunskap inom gällande lagstiftning för socialtjänst samt hälso- och sjukvård. Vi värdesätter också fantasi och initiativtagande.\n\nVaraktighet, arbetstid\n\nVi söker en undersköterska, tillsvidare. \n\nVi tillämpar heltid som norm, men möjlighet finns att ansöka om lägre tjänstgöringsgrad. \n\n \n\nArbete förekommer dag, kväll och helg med heltidsmåttet 37h/vecka. \n\nTjänsterna kan komma att tillsättas internt enligt företrädesrätten, och intervjuer kommer att ske löpande under ansökningstiden så tveka inte att skicka in din ansökan. \n\n \n\nLön\n\nFlens kommun tillämpar individuell lönesättning\n\nKontaktpersoner\n\nSusanne Fredberg Persson, enhetschef\n\n0157-430720\n\nsusanne.fredberg@flen.se\n\nFackliga kontaktpersoner nås via kommunens växel, 0157- 43 00 00\n\n \n\n \n\nVälkommen med din ansökan senast den 2022-07-03",
        "conditions" : "Heltid/\r\nEj specificerat",
        "text" : "Välkommen till Flens kommun - Sörmlands hjärta!\n\nSom medarbetare i Flens kommun är du vårt ansikte utåt till kommunens invånare. Vi vill att du ska ha en bra arbetsplats där du trivs och känner dig motiverad till att göra ett fantastiskt jobb. Omvärlden förändras och vår organisation behöver dig som vill bidra med engagemang och en härlig energi. \n\nDet arbete vi gör tillsammans varje dag, dygnet runt, året runt har sin utgångspunkt i vår vision, vår värdegrund och våra mål. Vi tror att bilden av Sörmlands hjärta skapas i varje möte med invånare, företagare och besökare, genom professionellt och respektfullt bemötande.\n\nPlaceringen är för närvarande på Drejskivans äldreboende i Flen. \n\nArbetsuppgifter\n\nArbetet på särskilt boende innebär att stötta och hjälpa våra hyresgäster med vardagliga ting såsom hygien, kläder och måltider. Insatser i form av städ och tvätt förekommer också. Vi arbetar salutogent vilket innebär att vi tar vara på det friska hos varje individ, stöttar dem till att vara så självständiga som möjligt och hjälper när det behövs. Vårt mål är att skapa livsglädje och välbefinnande, att våra hyresgäster ska få leva sitt liv fullt ut även på ålderns höst. \n\nVarje dag sker olika aktiviteter där alla som vill kan delta, och en gång i månaden har varje hyresgäst en egen stund med sin kontaktpersonal då man kan genomföra lite mer individuella aktiviteter enligt hyresgästens önskemål. \n\nDet är viktigt att tänka på att vi på ett särskilt boende arbetar i hyresgästens eget hem, och att bevara integritet, delaktighet och självbestämmande. Delegering av läkemedel kan ske efter genomgången utbildning och kunskapsprov, i samråd med områdesansvarig sjuksköterska. Dokumentation sker i förvaltningens verksamhetssystem Pulsen Combine. \n\nVi söker dig\n\nSom är utbildad undersköterska med erfarenhet av äldrevård och demensvård, det är meriterande med vidareutbildning inom demensvård. Du som söker har en positiv attityd och bidrar till arbetsglädje och framåtanda. Du är självständig, ansvarstagande, flexibel, har god samarbetsförmåga och ser möjligheter istället för hinder. Vi uppskattar en god kommuniktiv förmåga både i tal och skrift, samt datavana och kunskap inom gällande lagstiftning för socialtjänst samt hälso- och sjukvård. Vi värdesätter också fantasi och initiativtagande.\n\nVaraktighet, arbetstid\n\nVi söker en undersköterska, tillsvidare. \n\nVi tillämpar heltid som norm, men möjlighet finns att ansöka om lägre tjänstgöringsgrad. \n\n \n\nArbete förekommer dag, kväll och helg med heltidsmåttet 37h/vecka. \n\nTjänsterna kan komma att tillsättas internt enligt företrädesrätten, och intervjuer kommer att ske löpande under ansökningstiden så tveka inte att skicka in din ansökan. \n\n \n\nLön\n\nFlens kommun tillämpar individuell lönesättning\n\nKontaktpersoner\n\nSusanne Fredberg Persson, enhetschef\n\n0157-430720\n\nsusanne.fredberg@flen.se\n\nFackliga kontaktpersoner nås via kommunens växel, 0157- 43 00 00\n\n \n\n \n\nVälkommen med din ansökan senast den 2022-07-03"
      },
      "headline" : "Undersköterska till äldreomsorgen",
      "driving_license" : null,
      "employer" : {
        "email" : null,
        "phone_number" : null,
        "organization_number" : "2120000332",
        "name" : "Flens kommun",
        "url" : "https://www.flen.se/sv/Om-Flens-kommun/Jobba-hos-oss/Lediga-jobb1/",
        "workplace" : "Flens Kommun"
      },
      "removed_date" : null,
      "logo_url" : "https://www.arbetsformedlingen.se/rest/arbetsgivare/rest/af/v3/organisation/2120000332/logotyper/logo.png",
      "last_publication_date" : "2022-07-17T23:59:59",
      "number_of_vacancies" : 4,
      "occupation" : {
        "concept_id" : "Y3QA_5pk_uXd",
        "label" : "Undersköterska, hemtjänst och äldreboende",
        "legacy_ams_taxonomy_id" : "7586"
      },
      "occupation_group" : {
        "concept_id" : "jY19_knH_MJp",
        "label" : "Undersköterskor, hemtjänst, hemsjukvård, äldreboende och habilitering",
        "legacy_ams_taxonomy_id" : "5321"
      },
      "employment_type" : {
        "concept_id" : "PFZr_Syz_cUq",
        "label" : "Vanlig anställning",
        "legacy_ams_taxonomy_id" : "1"
      },
      "webpage_url" : "https://arbetsformedlingen.se/platsbanken/annonser/26280259",
      "driving_license_required" : false,
      "application_contacts" : [ ],
      "duration" : {
        "concept_id" : "a7uU_j21_mkL",
        "label" : "Tills vidare",
        "legacy_ams_taxonomy_id" : "1"
      },
      "nice_to_have" : {
        "education_level" : [ ],
        "work_experiences" : [ ],
        "skills" : [ ],
        "education" : [ ],
        "languages" : [ ]
      },
      "application_details" : {
        "via_af" : false,
        "email" : null,
        "other" : null,
        "reference" : null,
        "url" : "https://flen.se/om-flen/jobba-hos-oss/?rmpage=job&rmjob=1473",
        "information" : null
      },
      "source_type" : "VIA_PLATSBANKEN_DXA",
      "application_deadline" : "2022-07-17T23:59:59",
      "external_id" : "46-212000-0332-1473",
      "workplace_address" : {
        "coordinates" : [ 16.587912, 59.057938 ],
        "city" : null,
        "postcode" : null,
        "municipality" : "Flen",
        "region_concept_id" : "s93u_BEb_sx2",
        "region" : "Södermanlands län",
        "country_code" : "199",
        "region_code" : "04",
        "municipality_concept_id" : "P8yp_WT9_Bks",
        "country_concept_id" : "i46j_HmG_v64",
        "municipality_code" : "0482",
        "street_address" : null,
        "country" : "Sverige"
      },
      "id" : "26280259",
      "experience_required" : true,
      "working_hours_type" : {
        "concept_id" : "6YE1_gAC_R2G",
        "label" : "Heltid",
        "legacy_ams_taxonomy_id" : "1"
      },
      "access" : null,
      "timestamp" : 1656654708453,
      "must_have" : {
        "education_level" : [ ],
        "work_experiences" : [ {
          "concept_id" : "Y3QA_5pk_uXd",
          "weight" : 10,
          "label" : "Undersköterska, hemtjänst, äldreboende och habilitering",
          "legacy_ams_taxonomy_id" : "7586"
        } ],
        "skills" : [ ],
        "education" : [ ],
        "languages" : [ ]
      },
      "occupation_field" : {
        "concept_id" : "NYW6_mP6_vwf",
        "label" : "Hälso- och sjukvård",
        "legacy_ams_taxonomy_id" : "8"
      },
      "scope_of_work" : {
        "min" : 100,
        "max" : 100
      },
      "salary_type" : {
        "concept_id" : "oG8G_9cW_nRf",
        "label" : "Fast månads- vecko- eller timlön",
        "legacy_ams_taxonomy_id" : "1"
      },
      "removed" : false,
      "salary_description" : "Individuell lönesättning",
      "access_to_own_car" : false,
      "publication_date" : "2022-07-01T07:51:48"
    },
    "name" : "Undersköterska till äldreomsorgen",
    "user" : "hannes"
  },
  "sha1" : "59f9ce8d2ef24acfa0e753c54d6b0114e455216c",
  "annotations" : [ {
    "preferred-label" : "Undersköterska, hemtjänst, äldreboende och habilitering",
    "type" : "occupation-name",
    "start-position" : 0,
    "end-position" : 14,
    "concept-id" : "Y3QA_5pk_uXd",
    "matched-string" : "Undersköterska",
    "annotation-id" : 9
  }, {
    "preferred-label" : "Äldreomsorg",
    "type" : "skill",
    "start-position" : 20,
    "end-position" : 33,
    "concept-id" : "Yt2Z_1pY_MNz",
    "matched-string" : "äldreomsorgen",
    "annotation-id" : 10
  }, {
    "preferred-label" : "Flen",
    "type" : "municipality",
    "start-position" : 49,
    "end-position" : 61,
    "concept-id" : "P8yp_WT9_Bks",
    "matched-string" : "Flens kommun",
    "annotation-id" : 11
  }, {
    "preferred-label" : "Flen",
    "type" : "municipality",
    "start-position" : 101,
    "end-position" : 113,
    "concept-id" : "P8yp_WT9_Bks",
    "matched-string" : "Flens kommun",
    "annotation-id" : 12
  }, {
    "preferred-label" : "Flen",
    "type" : "municipality",
    "start-position" : 720,
    "end-position" : 724,
    "concept-id" : "P8yp_WT9_Bks",
    "matched-string" : "Flen",
    "annotation-id" : 13
  }, {
    "preferred-label" : "Sjukhem/Särskilt boende",
    "sentiment" : "MUST_HAVE",
    "type" : "skill",
    "start-position" : 756,
    "end-position" : 771,
    "concept-id" : "ZpXZ_PG5_B9s",
    "matched-string" : "särskilt boende",
    "annotation-id" : 0
  }, {
    "preferred-label" : "Kläder/Mode",
    "sentiment" : "MUST_HAVE",
    "type" : "skill",
    "start-position" : 853,
    "end-position" : 859,
    "concept-id" : "agGK_Zte_X2y",
    "matched-string" : "kläder",
    "annotation-id" : 1
  }, {
    "preferred-label" : "Sjukhem/Särskilt boende",
    "sentiment" : "MUST_HAVE",
    "type" : "skill",
    "start-position" : 1493,
    "end-position" : 1508,
    "concept-id" : "ZpXZ_PG5_B9s",
    "matched-string" : "särskilt boende",
    "annotation-id" : 2
  }, {
    "preferred-label" : "Läkemedel/Sjukvårdsprodukter",
    "sentiment" : "MUST_HAVE",
    "type" : "skill",
    "start-position" : 1617,
    "end-position" : 1626,
    "concept-id" : "vVXb_pYT_E1z",
    "matched-string" : "läkemedel",
    "annotation-id" : 3
  }, {
    "preferred-label" : "Sjuksköterska",
    "sentiment" : "MUST_HAVE",
    "type" : "keyword",
    "start-position" : 1711,
    "end-position" : 1724,
    "concept-id" : "jrjV_wcz_fxg",
    "matched-string" : "sjuksköterska",
    "annotation-id" : 4
  }, {
    "preferred-label" : "Dokumentation",
    "sentiment" : "MUST_HAVE",
    "type" : "keyword",
    "start-position" : 1726,
    "end-position" : 1739,
    "concept-id" : "jodz_kWf_iKx",
    "matched-string" : "dokumentation",
    "annotation-id" : 5
  }, {
    "preferred-label" : "Undersköterska, hemtjänst, äldreboende och habilitering",
    "type" : "occupation-name",
    "start-position" : 1828,
    "end-position" : 1842,
    "concept-id" : "Y3QA_5pk_uXd",
    "matched-string" : "undersköterska",
    "annotation-id" : 14
  }, {
    "preferred-label" : "Äldreomsorg",
    "type" : "skill",
    "start-position" : 1861,
    "end-position" : 1870,
    "concept-id" : "Yt2Z_1pY_MNz",
    "matched-string" : "äldrevård",
    "annotation-id" : 15
  }, {
    "preferred-label" : "Demensvård",
    "sentiment" : "MUST_HAVE",
    "type" : "skill",
    "start-position" : 1875,
    "end-position" : 1885,
    "concept-id" : "hqYJ_jyZ_Ks8",
    "matched-string" : "demensvård",
    "annotation-id" : 6
  }, {
    "preferred-label" : "Demensvård",
    "sentiment" : "MUST_HAVE",
    "type" : "skill",
    "start-position" : 1932,
    "end-position" : 1942,
    "concept-id" : "hqYJ_jyZ_Ks8",
    "matched-string" : "demensvård",
    "annotation-id" : 7
  }, {
    "preferred-label" : "arbeta självständigt",
    "type" : "esco-skill",
    "start-position" : 2031,
    "end-position" : 2043,
    "concept-id" : "NyFu_HHd_zhz",
    "matched-string" : "självständig",
    "annotation-id" : 17
  }, {
    "preferred-label" : "visa ansvarstagande",
    "type" : "esco-skill",
    "start-position" : 2045,
    "end-position" : 2059,
    "concept-id" : "bcRp_hxV_f5G",
    "matched-string" : "ansvarstagande",
    "annotation-id" : 16
  }, {
    "preferred-label" : "samarbeta med kolleger",
    "type" : "esco-skill",
    "start-position" : 2079,
    "end-position" : 2095,
    "concept-id" : "X15R_797_q62",
    "matched-string" : "samarbetsförmåga",
    "annotation-id" : 18
  }, {
    "preferred-label" : "Hälso",
    "sentiment" : "MUST_HAVE",
    "type" : "keyword",
    "start-position" : 2276,
    "end-position" : 2281,
    "concept-id" : "5TsD_dN8_Uco",
    "matched-string" : "hälso",
    "annotation-id" : 8
  }, {
    "preferred-label" : "Undersköterska, hemtjänst, äldreboende och habilitering",
    "type" : "occupation-name",
    "start-position" : 2385,
    "end-position" : 2399,
    "concept-id" : "Y3QA_5pk_uXd",
    "matched-string" : "undersköterska",
    "annotation-id" : 20
  }, {
    "preferred-label" : "Tillsvidareanställning (inkl. eventuell provanställning)",
    "type" : "employment-type",
    "start-position" : 2401,
    "end-position" : 2412,
    "concept-id" : "kpPX_CNN_gDU",
    "matched-string" : "tillsvidare",
    "annotation-id" : 19
  }, {
    "preferred-label" : "Heltid",
    "type" : "worktime-extent",
    "start-position" : 2429,
    "end-position" : 2435,
    "concept-id" : "6YE1_gAC_R2G",
    "matched-string" : "heltid",
    "annotation-id" : 21
  } ],
  "text" : "Undersköterska till äldreomsorgen\nVälkommen till Flens kommun - Sörmlands hjärta!\n\nSom medarbetare i Flens kommun är du vårt ansikte utåt till kommunens invånare. Vi vill att du ska ha en bra arbetsplats där du trivs och känner dig motiverad till att göra ett fantastiskt jobb. Omvärlden förändras och vår organisation behöver dig som vill bidra med engagemang och en härlig energi. \n\nDet arbete vi gör tillsammans varje dag, dygnet runt, året runt har sin utgångspunkt i vår vision, vår värdegrund och våra mål. Vi tror att bilden av Sörmlands hjärta skapas i varje möte med invånare, företagare och besökare, genom professionellt och respektfullt bemötande.\n\nPlaceringen är för närvarande på Drejskivans äldreboende i Flen. \n\nArbetsuppgifter\n\nArbetet på särskilt boende innebär att stötta och hjälpa våra hyresgäster med vardagliga ting såsom hygien, kläder och måltider. Insatser i form av städ och tvätt förekommer också. Vi arbetar salutogent vilket innebär att vi tar vara på det friska hos varje individ, stöttar dem till att vara så självständiga som möjligt och hjälper när det behövs. Vårt mål är att skapa livsglädje och välbefinnande, att våra hyresgäster ska få leva sitt liv fullt ut även på ålderns höst. \n\nVarje dag sker olika aktiviteter där alla som vill kan delta, och en gång i månaden har varje hyresgäst en egen stund med sin kontaktpersonal då man kan genomföra lite mer individuella aktiviteter enligt hyresgästens önskemål. \n\nDet är viktigt att tänka på att vi på ett särskilt boende arbetar i hyresgästens eget hem, och att bevara integritet, delaktighet och självbestämmande. Delegering av läkemedel kan ske efter genomgången utbildning och kunskapsprov, i samråd med områdesansvarig sjuksköterska. Dokumentation sker i förvaltningens verksamhetssystem Pulsen Combine. \n\nVi söker dig\n\nSom är utbildad undersköterska med erfarenhet av äldrevård och demensvård, det är meriterande med vidareutbildning inom demensvård. Du som söker har en positiv attityd och bidrar till arbetsglädje och framåtanda. Du är självständig, ansvarstagande, flexibel, har god samarbetsförmåga och ser möjligheter istället för hinder. Vi uppskattar en god kommuniktiv förmåga både i tal och skrift, samt datavana och kunskap inom gällande lagstiftning för socialtjänst samt hälso- och sjukvård. Vi värdesätter också fantasi och initiativtagande.\n\nVaraktighet, arbetstid\n\nVi söker en undersköterska, tillsvidare. \n\nVi tillämpar heltid som norm, men möjlighet finns att ansöka om lägre tjänstgöringsgrad. \n\n \n\nArbete förekommer dag, kväll och helg med heltidsmåttet 37h/vecka. \n\nTjänsterna kan komma att tillsättas internt enligt företrädesrätten, och intervjuer kommer att ske löpande under ansökningstiden så tveka inte att skicka in din ansökan. \n\n \n\nLön\n\nFlens kommun tillämpar individuell lönesättning\n\nKontaktpersoner\n\nSusanne Fredberg Persson, enhetschef\n\n0157-430720\n\nsusanne.fredberg@flen.se\n\nFackliga kontaktpersoner nås via kommunens växel, 0157- 43 00 00\n\n \n\n \n\nVälkommen med din ansökan senast den 2022-07-03"
}