{
  "meta" : {
    "jobad" : {
      "description" : {
        "requirements" : null,
        "needs" : null,
        "company_information" : null,
        "text_formatted" : "Nya Wermlands-Tidningen är den största morgontidningen i Värmland och den titel som har störst räckvidd utanför Stockholm, Göteborg och Skåne.\r\n\r\nSex dagar i veckan gör vi en papperstidning och vi håller våra läsare ständigt uppdaterade i digitala medier med allt som händer i utgivningsområdet.\n\nNyheter som engagerar\nVi söker en allmänreporter som drivs av att bli väl läst. På redaktionen får du cirka 40 duktiga och trevliga kollegor och tillsammans bevakar vi det viktigaste som händer i Värmland. NWT befinner sig i en offensiv fas. Flera journalister har anställts det senaste året och vi utvecklar steg för steg vår journalistik med målet att den ska engagera fler och yngre läsare.\n\nDu erbjuds här:\nI den här rollen får du stor frihet och stort eget ansvar för att hitta nyheter som berör från hela Värmland. Fokus ligger på rak och snabb nyhetsrapportering, även om det också ges möjlighet att granska och fördjupa. Du jobbar nära nyhetsdesken och övriga kollegor och hugger in där det bäst behövs för dagen. I schemat ingår helg- och viss kvällstjänstgöring.\n\nDu är:\nDu är självgående och vet var och hur du hittar nyheterna som engagerar och hur de presenteras på bästa sätt. Du är individualist och lagspelare i en och samma person.\n\nDu har:\nDriv och engagemang, journalistisk erfarenhet och hög digital kunskapsnivå. God social kompetens och förmåga att skapa förtroende och bygga stort kontaktnät.\n\nIntresserad?\nHar du frågor kan du kontakta redaktionschef Kasper Norling, kasper.norling@nwt.se.\n\nFacklig kontakt är Marie Blomgren, marie.blomgren@nwt.se eller Lisa Olaison, lisa.olaison@nwt.se.\n\nTjänsten är en tillsvidareanställning med placering på NWT´s huvudkontor i Karlstad.\n\nVi ser fram emot din ansökan senast 14 augusti 2022.\n\nLäs mer om oss på www.nwtmedia.se",
        "conditions" : "100 %. Tillträde: Enligt överenskommelse\r\nTillsvidareanställning",
        "text" : "Nya Wermlands-Tidningen är den största morgontidningen i Värmland och den titel som har störst räckvidd utanför Stockholm, Göteborg och Skåne.\r\n\r\nSex dagar i veckan gör vi en papperstidning och vi håller våra läsare ständigt uppdaterade i digitala medier med allt som händer i utgivningsområdet.\n\nNyheter som engagerar\nVi söker en allmänreporter som drivs av att bli väl läst. På redaktionen får du cirka 40 duktiga och trevliga kollegor och tillsammans bevakar vi det viktigaste som händer i Värmland. NWT befinner sig i en offensiv fas. Flera journalister har anställts det senaste året och vi utvecklar steg för steg vår journalistik med målet att den ska engagera fler och yngre läsare.\n\nDu erbjuds här:\nI den här rollen får du stor frihet och stort eget ansvar för att hitta nyheter som berör från hela Värmland. Fokus ligger på rak och snabb nyhetsrapportering, även om det också ges möjlighet att granska och fördjupa. Du jobbar nära nyhetsdesken och övriga kollegor och hugger in där det bäst behövs för dagen. I schemat ingår helg- och viss kvällstjänstgöring.\n\nDu är:\nDu är självgående och vet var och hur du hittar nyheterna som engagerar och hur de presenteras på bästa sätt. Du är individualist och lagspelare i en och samma person.\n\nDu har:\nDriv och engagemang, journalistisk erfarenhet och hög digital kunskapsnivå. God social kompetens och förmåga att skapa förtroende och bygga stort kontaktnät.\n\nIntresserad?\nHar du frågor kan du kontakta redaktionschef Kasper Norling, kasper.norling@nwt.se.\n\nFacklig kontakt är Marie Blomgren, marie.blomgren@nwt.se eller Lisa Olaison, lisa.olaison@nwt.se.\n\nTjänsten är en tillsvidareanställning med placering på NWT´s huvudkontor i Karlstad.\n\nVi ser fram emot din ansökan senast 14 augusti 2022.\n\nLäs mer om oss på www.nwtmedia.se"
      },
      "headline" : "Nyhetsreporter till Karlstad",
      "driving_license" : [ {
        "concept_id" : "VTK8_WRx_GcM",
        "label" : "B",
        "legacy_ams_taxonomy_id" : "3"
      } ],
      "employer" : {
        "email" : null,
        "phone_number" : null,
        "organization_number" : "5561944587",
        "name" : "NWT Media AB",
        "url" : null,
        "workplace" : "NWT Media , Nya Wermlands-Tidningen"
      },
      "removed_date" : null,
      "logo_url" : null,
      "last_publication_date" : "2022-08-14T23:59:59",
      "number_of_vacancies" : 1,
      "occupation" : {
        "concept_id" : "BduY_UUY_pvK",
        "label" : "Journalist/Reporter",
        "legacy_ams_taxonomy_id" : "6056"
      },
      "occupation_group" : {
        "concept_id" : "SgNH_hag_n9D",
        "label" : "Journalister m.fl.",
        "legacy_ams_taxonomy_id" : "2642"
      },
      "employment_type" : {
        "concept_id" : "PFZr_Syz_cUq",
        "label" : "Vanlig anställning",
        "legacy_ams_taxonomy_id" : "1"
      },
      "webpage_url" : "https://arbetsformedlingen.se/platsbanken/annonser/26323955",
      "driving_license_required" : true,
      "application_contacts" : [ ],
      "duration" : {
        "concept_id" : "a7uU_j21_mkL",
        "label" : "Tills vidare",
        "legacy_ams_taxonomy_id" : "1"
      },
      "nice_to_have" : {
        "education_level" : [ ],
        "work_experiences" : [ ],
        "skills" : [ ],
        "education" : [ ],
        "languages" : [ ]
      },
      "application_details" : {
        "via_af" : false,
        "email" : null,
        "other" : null,
        "reference" : "2022/47",
        "url" : "https://nwtgruppenab.varbi.com/what:job/jobID:529887/type:job/where:1/apply:1",
        "information" : null
      },
      "source_type" : "VIA_PLATSBANKEN_DXA",
      "application_deadline" : "2022-08-14T23:59:59",
      "external_id" : "46-556194-4587-529887",
      "workplace_address" : {
        "coordinates" : [ 13.500804, 59.379135 ],
        "city" : null,
        "postcode" : null,
        "municipality" : "Karlstad",
        "region_concept_id" : "EVVp_h6U_GSZ",
        "region" : "Värmlands län",
        "country_code" : "199",
        "region_code" : "17",
        "municipality_concept_id" : "hRDj_PoV_sFU",
        "country_concept_id" : "i46j_HmG_v64",
        "municipality_code" : "1780",
        "street_address" : null,
        "country" : "Sverige"
      },
      "id" : "26323955",
      "experience_required" : true,
      "working_hours_type" : {
        "concept_id" : "6YE1_gAC_R2G",
        "label" : "Heltid",
        "legacy_ams_taxonomy_id" : "1"
      },
      "access" : null,
      "timestamp" : 1657711808068,
      "must_have" : {
        "education_level" : [ ],
        "work_experiences" : [ {
          "concept_id" : "BduY_UUY_pvK",
          "weight" : 10,
          "label" : "Journalist/Reporter",
          "legacy_ams_taxonomy_id" : "6056"
        } ],
        "skills" : [ ],
        "education" : [ ],
        "languages" : [ ]
      },
      "occupation_field" : {
        "concept_id" : "9puE_nYg_crq",
        "label" : "Kultur, media, design",
        "legacy_ams_taxonomy_id" : "11"
      },
      "scope_of_work" : {
        "min" : 100,
        "max" : 100
      },
      "salary_type" : {
        "concept_id" : "oG8G_9cW_nRf",
        "label" : "Fast månads- vecko- eller timlön",
        "legacy_ams_taxonomy_id" : "1"
      },
      "removed" : false,
      "salary_description" : "Månadslön",
      "access_to_own_car" : false,
      "publication_date" : "2022-07-13T13:30:08"
    },
    "name" : "Nyhetsreporter till Karlstad",
    "user" : "kristof.fischer"
  },
  "sha1" : "27fd71b7274f001599ac0b162dda1ff6ad2ea8d7",
  "annotations" : [ {
    "preferred-label" : "Journalist/Reporter",
    "type" : "occupation-name",
    "start-position" : 0,
    "end-position" : 14,
    "concept-id" : "BduY_UUY_pvK",
    "matched-string" : "Nyhetsreporter",
    "annotation-id" : 3
  }, {
    "preferred-label" : "Karlstad",
    "type" : "municipality",
    "start-position" : 20,
    "end-position" : 28,
    "concept-id" : "hRDj_PoV_sFU",
    "matched-string" : "Karlstad",
    "annotation-id" : 4
  }, {
    "preferred-label" : "Värmlands län",
    "type" : "region",
    "start-position" : 86,
    "end-position" : 94,
    "concept-id" : "EVVp_h6U_GSZ",
    "matched-string" : "Värmland",
    "annotation-id" : 5
  }, {
    "preferred-label" : "Stockholm",
    "type" : "municipality",
    "start-position" : 141,
    "end-position" : 150,
    "concept-id" : "AvNB_uwa_6n6",
    "matched-string" : "Stockholm",
    "annotation-id" : 6
  }, {
    "preferred-label" : "Göteborg",
    "type" : "municipality",
    "start-position" : 152,
    "end-position" : 160,
    "concept-id" : "PVZL_BQT_XtL",
    "matched-string" : "Göteborg",
    "annotation-id" : 7
  }, {
    "preferred-label" : "Skåne län",
    "type" : "region",
    "start-position" : 165,
    "end-position" : 170,
    "concept-id" : "CaRE_1nn_cSU",
    "matched-string" : "Skåne",
    "annotation-id" : 8
  }, {
    "preferred-label" : "Journalist/Reporter",
    "sentiment" : "MUST_HAVE",
    "type" : "occupation-name",
    "start-position" : 360,
    "end-position" : 374,
    "concept-id" : "BduY_UUY_pvK",
    "matched-string" : "allmänreporter",
    "annotation-id" : 0
  }, {
    "preferred-label" : "Värmlands län",
    "type" : "region",
    "start-position" : 522,
    "end-position" : 530,
    "concept-id" : "EVVp_h6U_GSZ",
    "matched-string" : "Värmland",
    "annotation-id" : 9
  }, {
    "preferred-label" : "Journalist/Reporter",
    "type" : "occupation-name",
    "start-position" : 574,
    "end-position" : 586,
    "concept-id" : "BduY_UUY_pvK",
    "matched-string" : "journalister",
    "annotation-id" : 10
  }, {
    "preferred-label" : "Värmlands län",
    "type" : "region",
    "start-position" : 837,
    "end-position" : 845,
    "concept-id" : "EVVp_h6U_GSZ",
    "matched-string" : "Värmland",
    "annotation-id" : 11
  }, {
    "preferred-label" : "arbeta självständigt",
    "sentiment" : "MUST_HAVE",
    "type" : "esco-skill",
    "start-position" : 1113,
    "end-position" : 1124,
    "concept-id" : "NyFu_HHd_zhz",
    "matched-string" : "självgående",
    "annotation-id" : 12
  }, {
    "preferred-label" : "journalistik",
    "sentiment" : "MUST_HAVE",
    "type" : "esco-skill",
    "start-position" : 1305,
    "end-position" : 1329,
    "concept-id" : "LJcK_EFr_W8G",
    "matched-string" : "journalistisk erfarenhet",
    "annotation-id" : 13
  }, {
    "preferred-label" : null,
    "sentiment" : "MUST_HAVE",
    "type" : "skill",
    "start-position" : 1364,
    "end-position" : 1380,
    "concept-id" : null,
    "matched-string" : "social kompetens",
    "annotation-id" : 15
  }, {
    "preferred-label" : "upprätthålla arbetsmässiga relationer",
    "sentiment" : "MUST_HAVE",
    "type" : "esco-skill",
    "start-position" : 1418,
    "end-position" : 1440,
    "concept-id" : "FSSe_5dD_kXc",
    "matched-string" : "bygga stort kontaktnät",
    "annotation-id" : 14
  }, {
    "preferred-label" : "Tillsvidareanställning (inkl. eventuell provanställning)",
    "type" : "employment-type",
    "start-position" : 1655,
    "end-position" : 1677,
    "concept-id" : "kpPX_CNN_gDU",
    "matched-string" : "tillsvidareanställning",
    "annotation-id" : 16
  }, {
    "preferred-label" : "Karlstad",
    "type" : "municipality",
    "start-position" : 1715,
    "end-position" : 1723,
    "concept-id" : "hRDj_PoV_sFU",
    "matched-string" : "Karlstad",
    "annotation-id" : 17
  } ],
  "text" : "Nyhetsreporter till Karlstad\nNya Wermlands-Tidningen är den största morgontidningen i Värmland och den titel som har störst räckvidd utanför Stockholm, Göteborg och Skåne.\r\n\r\nSex dagar i veckan gör vi en papperstidning och vi håller våra läsare ständigt uppdaterade i digitala medier med allt som händer i utgivningsområdet.\n\nNyheter som engagerar\nVi söker en allmänreporter som drivs av att bli väl läst. På redaktionen får du cirka 40 duktiga och trevliga kollegor och tillsammans bevakar vi det viktigaste som händer i Värmland. NWT befinner sig i en offensiv fas. Flera journalister har anställts det senaste året och vi utvecklar steg för steg vår journalistik med målet att den ska engagera fler och yngre läsare.\n\nDu erbjuds här:\nI den här rollen får du stor frihet och stort eget ansvar för att hitta nyheter som berör från hela Värmland. Fokus ligger på rak och snabb nyhetsrapportering, även om det också ges möjlighet att granska och fördjupa. Du jobbar nära nyhetsdesken och övriga kollegor och hugger in där det bäst behövs för dagen. I schemat ingår helg- och viss kvällstjänstgöring.\n\nDu är:\nDu är självgående och vet var och hur du hittar nyheterna som engagerar och hur de presenteras på bästa sätt. Du är individualist och lagspelare i en och samma person.\n\nDu har:\nDriv och engagemang, journalistisk erfarenhet och hög digital kunskapsnivå. God social kompetens och förmåga att skapa förtroende och bygga stort kontaktnät.\n\nIntresserad?\nHar du frågor kan du kontakta redaktionschef Kasper Norling, kasper.norling@nwt.se.\n\nFacklig kontakt är Marie Blomgren, marie.blomgren@nwt.se eller Lisa Olaison, lisa.olaison@nwt.se.\n\nTjänsten är en tillsvidareanställning med placering på NWT´s huvudkontor i Karlstad.\n\nVi ser fram emot din ansökan senast 14 augusti 2022.\n\nLäs mer om oss på www.nwtmedia.se"
}