{
  "meta" : {
    "jobad" : {
      "description" : {
        "requirements" : null,
        "needs" : null,
        "company_information" : null,
        "text_formatted" : "Blique by Nobis är ett modernt hotellkoncept där arkitektur och design går sida vid sida med olika former av estetiska uttryck. På generösa sociala ytor har vi skapat ett levande community med hotell, två restauranger, stora och flexibla mötes- och eventlokaler samt en takterrass med fantastisk utsikt över Stockholms takåsar. \nMed ena foten i artistiska Vasastan och den andra i växande Hagastaden har vi ett oslagbart läge i en ny och spännande del av Stockholm.\nBlique by Nobis har totalt 249 rum varav 50 av dessa är Studios, där gästen bor i en välplanerad, unik lägenhet med fullt utrustat pentry, inkluderat köksutrustning.\n\n\n \n\nVem är vi?\n I april 2019 öppnade vi Blique by Nobis på Gävlegatan i nya stadsdelen Hagastaden, ett modernt hotellkoncept om 249 rum, generösa sociala ytor, flexibla event- och mötesmöjligheter, två restauranger, barer, samt en takterrass med utsikt över Stockholm. Här har vi skapat en levande och social mötesplats med starka inslag av arkitektur och design.\n\nVem är du?\n Ta chansen att söka Stockholms hetaste köksmästar-tjänst! Restaurang Arc är Blique by Nobis pärla, belägen på våning 11 med panoramautsikt över Stockholm. 45 sittplatser inomhus och en storslagen takterrass med lika många matplatser. Vi söker nu en köksmästare som tillsammans med vår Excecutive chef tar Arc vidare till nästa nivå. Ett plus om du har erfarenhet av det asiatiska köket, men inget krav. Du skall vara stresstålig och ha en genuin passion för matlagning och service.\n\n \n\nOm tjänsten:\n Som köksmästare på Arc rapporterar du till Excecutive chef, som du också har ett nära samarbete med. Arcs öppettider är idag måndag till lördag, 16.00-00.00. Tjänsten är främst förlagd kvällstid, med varierat arbete på helger, och Bliques alla restaurangverksamheter har öppet sju dagar i veckan.\n\nKanske är detta ditt första jobb som köksmästare, tveka inte, vi söker ”rätt person” mer än lång erfarenhet.\n\nBlique by Nobis ingår i en koncern av flera hotell med restaurangverksamhet, både nationellt och internationellt och vi erbjuder alla våra medarbetare möjligheten att växa och klättra!\n\n\n Tjänsten är på100% tillsvidare. \n Lön enl. ök.\n\n\n Intervjuer & urval kommer ske löpande varför vi ber dig söka så snart som möjligt. Tillträde så fort vi hittat den rätta!\n\nVi kommer endast svara ansökningar som möter vår kravprofil.\n\nVi ser fram emot din ansökan!\n\nAnna Björklund, VD\n Oskar Pettersson, Excecutive Chef\n\nanna.bjorklund@bliquebynobis.se\n oskar.pettersson@bliquebynobis.se",
        "conditions" : "Heltid/\r\nEj specificerat",
        "text" : "Blique by Nobis är ett modernt hotellkoncept där arkitektur och design går sida vid sida med olika former av estetiska uttryck. På generösa sociala ytor har vi skapat ett levande community med hotell, två restauranger, stora och flexibla mötes- och eventlokaler samt en takterrass med fantastisk utsikt över Stockholms takåsar. \nMed ena foten i artistiska Vasastan och den andra i växande Hagastaden har vi ett oslagbart läge i en ny och spännande del av Stockholm.\nBlique by Nobis har totalt 249 rum varav 50 av dessa är Studios, där gästen bor i en välplanerad, unik lägenhet med fullt utrustat pentry, inkluderat köksutrustning.\n\n\n \n\nVem är vi?\n I april 2019 öppnade vi Blique by Nobis på Gävlegatan i nya stadsdelen Hagastaden, ett modernt hotellkoncept om 249 rum, generösa sociala ytor, flexibla event- och mötesmöjligheter, två restauranger, barer, samt en takterrass med utsikt över Stockholm. Här har vi skapat en levande och social mötesplats med starka inslag av arkitektur och design.\n\nVem är du?\n Ta chansen att söka Stockholms hetaste köksmästar-tjänst! Restaurang Arc är Blique by Nobis pärla, belägen på våning 11 med panoramautsikt över Stockholm. 45 sittplatser inomhus och en storslagen takterrass med lika många matplatser. Vi söker nu en köksmästare som tillsammans med vår Excecutive chef tar Arc vidare till nästa nivå. Ett plus om du har erfarenhet av det asiatiska köket, men inget krav. Du skall vara stresstålig och ha en genuin passion för matlagning och service.\n\n \n\nOm tjänsten:\n Som köksmästare på Arc rapporterar du till Excecutive chef, som du också har ett nära samarbete med. Arcs öppettider är idag måndag till lördag, 16.00-00.00. Tjänsten är främst förlagd kvällstid, med varierat arbete på helger, och Bliques alla restaurangverksamheter har öppet sju dagar i veckan.\n\nKanske är detta ditt första jobb som köksmästare, tveka inte, vi söker ”rätt person” mer än lång erfarenhet.\n\nBlique by Nobis ingår i en koncern av flera hotell med restaurangverksamhet, både nationellt och internationellt och vi erbjuder alla våra medarbetare möjligheten att växa och klättra!\n\n\n Tjänsten är på100% tillsvidare. \n Lön enl. ök.\n\n\n Intervjuer & urval kommer ske löpande varför vi ber dig söka så snart som möjligt. Tillträde så fort vi hittat den rätta!\n\nVi kommer endast svara ansökningar som möter vår kravprofil.\n\nVi ser fram emot din ansökan!\n\nAnna Björklund, VD\n Oskar Pettersson, Excecutive Chef\n\nanna.bjorklund@bliquebynobis.se\n oskar.pettersson@bliquebynobis.se"
      },
      "headline" : "Köksmästare till ARC rooftop",
      "driving_license" : null,
      "employer" : {
        "email" : null,
        "phone_number" : null,
        "organization_number" : "5563082394",
        "name" : "Nobis AB",
        "url" : "https://nobis.se/",
        "workplace" : "Nobis AB"
      },
      "removed_date" : null,
      "logo_url" : null,
      "last_publication_date" : "2022-07-27T23:59:59",
      "number_of_vacancies" : 1,
      "occupation" : {
        "concept_id" : "73vz_UAk_B8d",
        "label" : "Köksmästare",
        "legacy_ams_taxonomy_id" : "222"
      },
      "occupation_group" : {
        "concept_id" : "XGyi_i4B_ME7",
        "label" : "Köksmästare och souschefer",
        "legacy_ams_taxonomy_id" : "3451"
      },
      "employment_type" : {
        "concept_id" : "PFZr_Syz_cUq",
        "label" : "Vanlig anställning",
        "legacy_ams_taxonomy_id" : "1"
      },
      "webpage_url" : "https://arbetsformedlingen.se/platsbanken/annonser/26264157",
      "driving_license_required" : false,
      "application_contacts" : [ {
        "description" : "Anna Björklund, VD",
        "email" : "anna.bjorklund@bliquebynobis.se",
        "telephone" : null,
        "name" : null,
        "contact_type" : null
      } ],
      "duration" : {
        "concept_id" : "a7uU_j21_mkL",
        "label" : "Tills vidare",
        "legacy_ams_taxonomy_id" : "1"
      },
      "nice_to_have" : {
        "education_level" : [ ],
        "work_experiences" : [ ],
        "skills" : [ ],
        "education" : [ ],
        "languages" : [ ]
      },
      "application_details" : {
        "via_af" : false,
        "email" : null,
        "other" : null,
        "reference" : null,
        "url" : "https://nobis.se/about/career?rmpage=job&rmjob=274",
        "information" : null
      },
      "source_type" : "VIA_PLATSBANKEN_DXA",
      "application_deadline" : "2022-07-27T23:59:59",
      "external_id" : "46-556308-2394-274",
      "workplace_address" : {
        "coordinates" : [ 18.06858, 59.329323 ],
        "city" : null,
        "postcode" : null,
        "municipality" : "Stockholm",
        "region_concept_id" : "CifL_Rzy_Mku",
        "region" : "Stockholms län",
        "country_code" : "199",
        "region_code" : "01",
        "municipality_concept_id" : "AvNB_uwa_6n6",
        "country_concept_id" : "i46j_HmG_v64",
        "municipality_code" : "0180",
        "street_address" : null,
        "country" : "Sverige"
      },
      "id" : "26264157",
      "experience_required" : true,
      "working_hours_type" : {
        "concept_id" : "6YE1_gAC_R2G",
        "label" : "Heltid",
        "legacy_ams_taxonomy_id" : "1"
      },
      "access" : null,
      "timestamp" : 1656356248571,
      "must_have" : {
        "education_level" : [ ],
        "work_experiences" : [ {
          "concept_id" : "73vz_UAk_B8d",
          "weight" : 10,
          "label" : "Köksmästare",
          "legacy_ams_taxonomy_id" : "222"
        } ],
        "skills" : [ ],
        "education" : [ ],
        "languages" : [ ]
      },
      "occupation_field" : {
        "concept_id" : "ScKy_FHB_7wT",
        "label" : "Hotell, restaurang, storhushåll",
        "legacy_ams_taxonomy_id" : "7"
      },
      "scope_of_work" : {
        "min" : 100,
        "max" : 100
      },
      "salary_type" : {
        "concept_id" : "oG8G_9cW_nRf",
        "label" : "Fast månads- vecko- eller timlön",
        "legacy_ams_taxonomy_id" : "1"
      },
      "removed" : false,
      "salary_description" : "enligt ö.k",
      "access_to_own_car" : false,
      "publication_date" : "2022-06-27T20:57:28"
    },
    "name" : "Köksmästare till ARC rooftop",
    "user" : "hannes"
  },
  "sha1" : "1240000df07025f9c7acfe15d36d7dcad8539f47",
  "annotations" : [ {
    "preferred-label" : "köksmästare",
    "sentiment" : "MUST_HAVE",
    "type" : "esco-occupation",
    "start-position" : 0,
    "end-position" : 11,
    "concept-id" : "tNA4_ywP_j5q",
    "matched-string" : "köksmästare",
    "annotation-id" : 0
  }, {
    "preferred-label" : "Hotell",
    "type" : "keyword",
    "start-position" : 60,
    "end-position" : 73,
    "concept-id" : "Jrrg_iiS_2yp",
    "matched-string" : "hotellkoncept",
    "annotation-id" : 11
  }, {
    "preferred-label" : "Hotell",
    "sentiment" : "MUST_HAVE",
    "type" : "keyword",
    "start-position" : 222,
    "end-position" : 228,
    "concept-id" : "Jrrg_iiS_2yp",
    "matched-string" : "hotell",
    "annotation-id" : 1
  }, {
    "preferred-label" : "Restaurang",
    "type" : "keyword",
    "start-position" : 234,
    "end-position" : 246,
    "concept-id" : "o2Cg_3Ap_qvK",
    "matched-string" : "restauranger",
    "annotation-id" : 8
  }, {
    "preferred-label" : "Stockholm",
    "type" : "municipality",
    "start-position" : 337,
    "end-position" : 347,
    "concept-id" : "AvNB_uwa_6n6",
    "matched-string" : "Stockholms",
    "annotation-id" : 9
  }, {
    "preferred-label" : "Stockholm",
    "type" : "municipality",
    "start-position" : 484,
    "end-position" : 493,
    "concept-id" : "AvNB_uwa_6n6",
    "matched-string" : "Stockholm",
    "annotation-id" : 10
  }, {
    "preferred-label" : "Restaurang",
    "type" : "keyword",
    "start-position" : 864,
    "end-position" : 876,
    "concept-id" : "o2Cg_3Ap_qvK",
    "matched-string" : "restauranger",
    "annotation-id" : 12
  }, {
    "preferred-label" : "Stockholm",
    "type" : "municipality",
    "start-position" : 920,
    "end-position" : 929,
    "concept-id" : "AvNB_uwa_6n6",
    "matched-string" : "Stockholm",
    "annotation-id" : 13
  }, {
    "preferred-label" : "Stockholm",
    "type" : "municipality",
    "start-position" : 1059,
    "end-position" : 1069,
    "concept-id" : "AvNB_uwa_6n6",
    "matched-string" : "Stockholms",
    "annotation-id" : 14
  }, {
    "preferred-label" : "Köksmästare",
    "type" : "occupation-name",
    "start-position" : 1078,
    "end-position" : 1088,
    "concept-id" : "73vz_UAk_B8d",
    "matched-string" : "köksmästar",
    "annotation-id" : 15
  }, {
    "preferred-label" : "Restaurang",
    "sentiment" : "MUST_HAVE",
    "type" : "keyword",
    "start-position" : 1097,
    "end-position" : 1107,
    "concept-id" : "o2Cg_3Ap_qvK",
    "matched-string" : "restaurang",
    "annotation-id" : 2
  }, {
    "preferred-label" : "Stockholm",
    "type" : "municipality",
    "start-position" : 1183,
    "end-position" : 1192,
    "concept-id" : "AvNB_uwa_6n6",
    "matched-string" : "Stockholm",
    "annotation-id" : 16
  }, {
    "preferred-label" : "köksmästare",
    "sentiment" : "MUST_HAVE",
    "type" : "esco-occupation",
    "start-position" : 1288,
    "end-position" : 1299,
    "concept-id" : "tNA4_ywP_j5q",
    "matched-string" : "köksmästare",
    "annotation-id" : 3
  }, {
    "preferred-label" : "reagera lugnt i stressande situationer",
    "type" : "esco-skill",
    "start-position" : 1456,
    "end-position" : 1467,
    "concept-id" : "WX8v_Fni_hwE",
    "matched-string" : "stresstålig",
    "annotation-id" : 17
  }, {
    "preferred-label" : "Matlagning, cirkelledning",
    "type" : "skill",
    "start-position" : 1497,
    "end-position" : 1507,
    "concept-id" : "Uyxo_Y4T_X4k",
    "matched-string" : "matlagning",
    "annotation-id" : 18
  }, {
    "preferred-label" : "köksmästare",
    "sentiment" : "MUST_HAVE",
    "type" : "esco-occupation",
    "start-position" : 1543,
    "end-position" : 1554,
    "concept-id" : "tNA4_ywP_j5q",
    "matched-string" : "köksmästare",
    "annotation-id" : 4
  }, {
    "preferred-label" : "Restaurangverksamhet",
    "type" : "sni-level-4",
    "start-position" : 1783,
    "end-position" : 1805,
    "concept-id" : "byvM_cVn_X7Q",
    "matched-string" : "restaurangverksamheter",
    "annotation-id" : 19
  }, {
    "preferred-label" : "köksmästare",
    "sentiment" : "MUST_HAVE",
    "type" : "esco-occupation",
    "start-position" : 1874,
    "end-position" : 1885,
    "concept-id" : "tNA4_ywP_j5q",
    "matched-string" : "köksmästare",
    "annotation-id" : 5
  }, {
    "preferred-label" : "Hotell",
    "sentiment" : "MUST_HAVE",
    "type" : "keyword",
    "start-position" : 1991,
    "end-position" : 1997,
    "concept-id" : "Jrrg_iiS_2yp",
    "matched-string" : "hotell",
    "annotation-id" : 6
  }, {
    "preferred-label" : "Restaurangverksamhet",
    "sentiment" : "MUST_HAVE",
    "type" : "sni-level-4",
    "start-position" : 2002,
    "end-position" : 2022,
    "concept-id" : "byvM_cVn_X7Q",
    "matched-string" : "restaurangverksamhet",
    "annotation-id" : 7
  }, {
    "preferred-label" : "Heltid",
    "type" : "worktime-extent",
    "start-position" : 2149,
    "end-position" : 2153,
    "concept-id" : "6YE1_gAC_R2G",
    "matched-string" : "100%",
    "annotation-id" : 20
  }, {
    "preferred-label" : "Tillsvidareanställning (inkl. eventuell provanställning)",
    "type" : "employment-type",
    "start-position" : 2154,
    "end-position" : 2165,
    "concept-id" : "kpPX_CNN_gDU",
    "matched-string" : "tillsvidare",
    "annotation-id" : 21
  } ],
  "text" : "Köksmästare till ARC rooftop\nBlique by Nobis är ett modernt hotellkoncept där arkitektur och design går sida vid sida med olika former av estetiska uttryck. På generösa sociala ytor har vi skapat ett levande community med hotell, två restauranger, stora och flexibla mötes- och eventlokaler samt en takterrass med fantastisk utsikt över Stockholms takåsar. \nMed ena foten i artistiska Vasastan och den andra i växande Hagastaden har vi ett oslagbart läge i en ny och spännande del av Stockholm.\nBlique by Nobis har totalt 249 rum varav 50 av dessa är Studios, där gästen bor i en välplanerad, unik lägenhet med fullt utrustat pentry, inkluderat köksutrustning.\n\n\n \n\nVem är vi?\n I april 2019 öppnade vi Blique by Nobis på Gävlegatan i nya stadsdelen Hagastaden, ett modernt hotellkoncept om 249 rum, generösa sociala ytor, flexibla event- och mötesmöjligheter, två restauranger, barer, samt en takterrass med utsikt över Stockholm. Här har vi skapat en levande och social mötesplats med starka inslag av arkitektur och design.\n\nVem är du?\n Ta chansen att söka Stockholms hetaste köksmästar-tjänst! Restaurang Arc är Blique by Nobis pärla, belägen på våning 11 med panoramautsikt över Stockholm. 45 sittplatser inomhus och en storslagen takterrass med lika många matplatser. Vi söker nu en köksmästare som tillsammans med vår Excecutive chef tar Arc vidare till nästa nivå. Ett plus om du har erfarenhet av det asiatiska köket, men inget krav. Du skall vara stresstålig och ha en genuin passion för matlagning och service.\n\n \n\nOm tjänsten:\n Som köksmästare på Arc rapporterar du till Excecutive chef, som du också har ett nära samarbete med. Arcs öppettider är idag måndag till lördag, 16.00-00.00. Tjänsten är främst förlagd kvällstid, med varierat arbete på helger, och Bliques alla restaurangverksamheter har öppet sju dagar i veckan.\n\nKanske är detta ditt första jobb som köksmästare, tveka inte, vi söker ”rätt person” mer än lång erfarenhet.\n\nBlique by Nobis ingår i en koncern av flera hotell med restaurangverksamhet, både nationellt och internationellt och vi erbjuder alla våra medarbetare möjligheten att växa och klättra!\n\n\n Tjänsten är på100% tillsvidare. \n Lön enl. ök.\n\n\n Intervjuer & urval kommer ske löpande varför vi ber dig söka så snart som möjligt. Tillträde så fort vi hittat den rätta!\n\nVi kommer endast svara ansökningar som möter vår kravprofil.\n\nVi ser fram emot din ansökan!\n\nAnna Björklund, VD\n Oskar Pettersson, Excecutive Chef\n\nanna.bjorklund@bliquebynobis.se\n oskar.pettersson@bliquebynobis.se"
}