{
  "meta" : {
    "jobad" : {
      "description" : {
        "requirements" : null,
        "needs" : null,
        "company_information" : null,
        "text_formatted" : "<p>Vi söker en positiv och driven person som brinner för arbetet som handlar om naglar.</p><p>Du gillar att ge service och att få kunden att känna sig välkommen och omhändertagen. Du vill bjuda på en upplevelse och ett snyggt resultat.</p><p>Du ska helst ha erfarenhet som nagelteknolog men inte ett måste då vi kan lära upp dig.</p><p id=\"oppenforalla\">Öppen för alla\nVi fokuserar på din kompetens, inte dina övriga förutsättningar. Vi är öppna för att anpassa rollen eller arbetsplatsen efter dina behov.</p>",
        "conditions" : null,
        "text" : "Vi söker en positiv och driven person som brinner för arbetet som handlar om naglar.\nDu gillar att ge service och att få kunden att känna sig välkommen och omhändertagen. Du vill bjuda på en upplevelse och ett snyggt resultat.\nDu ska helst ha erfarenhet som nagelteknolog men inte ett måste då vi kan lära upp dig.\nÖppen för alla\nVi fokuserar på din kompetens, inte dina övriga förutsättningar. Vi är öppna för att anpassa rollen eller arbetsplatsen efter dina behov."
      },
      "headline" : "Nagelspecialist",
      "driving_license" : null,
      "employer" : {
        "email" : null,
        "phone_number" : null,
        "organization_number" : "5569039125",
        "name" : "Kayla Professional Hair & Beauty i Malmö AB",
        "url" : null,
        "workplace" : "Kayla Professional Hair & Beauty i"
      },
      "removed_date" : null,
      "logo_url" : null,
      "last_publication_date" : "2022-08-20T23:59:59",
      "number_of_vacancies" : 2,
      "occupation" : {
        "concept_id" : "JjXV_QEg_EQ1",
        "label" : "Nagelterapeut/Nagelteknolog",
        "legacy_ams_taxonomy_id" : "5439"
      },
      "occupation_group" : {
        "concept_id" : "ezKk_kss_CiQ",
        "label" : "Övriga skönhets- och kroppsterapeuter",
        "legacy_ams_taxonomy_id" : "5149"
      },
      "employment_type" : {
        "concept_id" : "PFZr_Syz_cUq",
        "label" : "Vanlig anställning",
        "legacy_ams_taxonomy_id" : "1"
      },
      "webpage_url" : "https://arbetsformedlingen.se/platsbanken/annonser/26345704",
      "driving_license_required" : false,
      "application_contacts" : [ {
        "description" : null,
        "email" : "camillalien@hotmail.com",
        "telephone" : null,
        "name" : "camilla  lien",
        "contact_type" : null
      } ],
      "duration" : {
        "concept_id" : "a7uU_j21_mkL",
        "label" : "Tills vidare",
        "legacy_ams_taxonomy_id" : "1"
      },
      "nice_to_have" : {
        "education_level" : [ ],
        "work_experiences" : [ ],
        "skills" : [ ],
        "education" : [ ],
        "languages" : [ ]
      },
      "application_details" : {
        "via_af" : false,
        "email" : "camillalien@hotmail.com",
        "other" : null,
        "reference" : null,
        "url" : null,
        "information" : null
      },
      "source_type" : "VIA_ANNONSERA",
      "application_deadline" : "2022-08-20T23:59:59",
      "external_id" : null,
      "workplace_address" : {
        "coordinates" : [ 13.065799218499917, 55.59029488500165 ],
        "city" : "Malmö",
        "postcode" : "21231",
        "municipality" : "Malmö",
        "region_concept_id" : "CaRE_1nn_cSU",
        "region" : "Skåne län",
        "country_code" : "199",
        "region_code" : "12",
        "municipality_concept_id" : "oYPt_yRA_Smm",
        "country_concept_id" : "i46j_HmG_v64",
        "municipality_code" : "1280",
        "street_address" : "Hyllie Boulevard 19",
        "country" : "Sverige"
      },
      "id" : "26345704",
      "experience_required" : false,
      "working_hours_type" : {
        "concept_id" : "6YE1_gAC_R2G",
        "label" : "Heltid",
        "legacy_ams_taxonomy_id" : "1"
      },
      "access" : null,
      "timestamp" : 1658560430292,
      "must_have" : {
        "education_level" : [ ],
        "work_experiences" : [ ],
        "skills" : [ ],
        "education" : [ ],
        "languages" : [ ]
      },
      "occupation_field" : {
        "concept_id" : "Uuf1_GMh_Uvw",
        "label" : "Kropps- och skönhetsvård",
        "legacy_ams_taxonomy_id" : "4"
      },
      "scope_of_work" : {
        "min" : 0,
        "max" : 100
      },
      "salary_type" : {
        "concept_id" : "oG8G_9cW_nRf",
        "label" : "Fast månads- vecko- eller timlön",
        "legacy_ams_taxonomy_id" : "1"
      },
      "removed" : false,
      "salary_description" : null,
      "access_to_own_car" : false,
      "publication_date" : "2022-07-21T20:48:00"
    },
    "name" : "Nagelspecialist",
    "user" : "kristof.fischer"
  },
  "sha1" : "e1b96acc039b84f16c7e43d1344d82e3474639e5",
  "annotations" : [ {
    "preferred-label" : "Nagelterapeut/Nagelteknolog",
    "sentiment" : "MUST_HAVE",
    "type" : "occupation-name",
    "start-position" : 0,
    "end-position" : 15,
    "concept-id" : "JjXV_QEg_EQ1",
    "matched-string" : "nagelspecialist",
    "annotation-id" : 0
  }, {
    "preferred-label" : "Nagelterapeut/Nagelteknolog",
    "sentiment" : "NICE_TO_HAVE",
    "type" : "occupation-name",
    "start-position" : 274,
    "end-position" : 287,
    "concept-id" : "JjXV_QEg_EQ1",
    "matched-string" : "nagelteknolog",
    "annotation-id" : 1
  } ],
  "text" : "Nagelspecialist\nVi söker en positiv och driven person som brinner för arbetet som handlar om naglar.\nDu gillar att ge service och att få kunden att känna sig välkommen och omhändertagen. Du vill bjuda på en upplevelse och ett snyggt resultat.\nDu ska helst ha erfarenhet som nagelteknolog men inte ett måste då vi kan lära upp dig.\nÖppen för alla\nVi fokuserar på din kompetens, inte dina övriga förutsättningar. Vi är öppna för att anpassa rollen eller arbetsplatsen efter dina behov."
}