{
  "meta" : {
    "jobad" : {
      "description" : {
        "requirements" : null,
        "needs" : null,
        "company_information" : null,
        "text_formatted" : "Arbetsbeskrivning\nTriggas du av att anta tekniska utmaningar och lösa kunders problem? Nu söker DEFAs affärsområde e-mobility en medarbetare till sin tekniska support med arbetplats i Kista, Stockholm. Missa inte din chans att få arbeta på ett bolag som är i framkant med den tekniska utvecklingen av e-mobility produkter!\n\n\nRollen som teknisk support innefattar ett dynamiskt arbete som dagligen ger nya tekniska utmaningar. Som medarbetare i vår tekniska support kommer du med telefon och dator som främsta arbetsverktyg hjälpa både slutkunder och installatörer med tekniska frågor om våra produkter inom segmentet e-mobility, vilket i huvudsak innebär laddstolpar och olika betallösningar. Förutom kontakten med externa kunder kommer du även ha kontinuerlig kontakt med sidofunktioner internt i bolaget, såsom produktchefer, kvalitetschef och utvecklare. \n\n\nAtt arbeta hos oss innebär att delta i utvecklingen av framtidens produkter i bilbranschen och ger dig även möjligheten att växa inom ett globalt företag med ett väletablerat varumärke och utbud. Vi tror på arbete med frihet under ansvar och lägger stor vikt på din trivsel hos oss. \n\n\nSök tjänsten redan idag, urval sker löpande! \n\n\n\nDin Profil\nVi är övertygade om att rätt person med ett eget självdriv kan axla rollen som teknisk support men du behöver ha goda kunskaper inom el för att lyckas i arbetet. Vi söker dig som antingen har ett ECY-certifikat eller annan teoretisk kunskap inom ellära, till exempel kan du ha arbetat som elektriker eller suttit i en teknisk support inom områden såsom maskiner, hissar, automation eller industri. Som person är du en problemlösare och snarare uppmuntras av utmaningar än räds för de. Du är en lagspelare och hjälper gärna såväl kollegorna i supporten som kunderna som ringer in. Vi värdesätter egenskaper som samarbetsförmåga, hjälpsamhet och social kompetens. För att söka tjänsten måste du ha B-körkort samt tala och skriva flytande på svenska och engelska.\n\n\n\nOm företaget\nVårt mål är att göra människors liv enklare och mer miljövänligt genom att hjälpa dem använda energi så effektivt som möjligt. Våra produkter och tjänster förbättrar hur människor laddar och förvärmer sina fordon och ljussätter byggnader eller vägar. Vi fortsätter att förbättra vårt sortiment genom att fokusera på kontinuerlig förbättring och innovation.\n\n\nDEFA är ett privatägt norskt företag som grundades 1946. Vi har för närvarande mer än 400 anställda på tre kontinenter. Våra produkter och tjänster säljs i mer än 30 länder världen över.\n\n\n\nKontaktuppgifter\nI denna rekryteringsprocess samarbetar vi med Autorekrytering. Frågor kring processen besvaras av rekryterare Fredrica Eurén, via mejl fredrica.euren@autorekrytering.se eller telefon 070 622 65 30. Varmt välkommen med din ansökan!",
        "conditions" : "Heltid\r\nTillsvidare",
        "text" : "Arbetsbeskrivning\nTriggas du av att anta tekniska utmaningar och lösa kunders problem? Nu söker DEFAs affärsområde e-mobility en medarbetare till sin tekniska support med arbetplats i Kista, Stockholm. Missa inte din chans att få arbeta på ett bolag som är i framkant med den tekniska utvecklingen av e-mobility produkter!\n\n\nRollen som teknisk support innefattar ett dynamiskt arbete som dagligen ger nya tekniska utmaningar. Som medarbetare i vår tekniska support kommer du med telefon och dator som främsta arbetsverktyg hjälpa både slutkunder och installatörer med tekniska frågor om våra produkter inom segmentet e-mobility, vilket i huvudsak innebär laddstolpar och olika betallösningar. Förutom kontakten med externa kunder kommer du även ha kontinuerlig kontakt med sidofunktioner internt i bolaget, såsom produktchefer, kvalitetschef och utvecklare. \n\n\nAtt arbeta hos oss innebär att delta i utvecklingen av framtidens produkter i bilbranschen och ger dig även möjligheten att växa inom ett globalt företag med ett väletablerat varumärke och utbud. Vi tror på arbete med frihet under ansvar och lägger stor vikt på din trivsel hos oss. \n\n\nSök tjänsten redan idag, urval sker löpande! \n\n\n\nDin Profil\nVi är övertygade om att rätt person med ett eget självdriv kan axla rollen som teknisk support men du behöver ha goda kunskaper inom el för att lyckas i arbetet. Vi söker dig som antingen har ett ECY-certifikat eller annan teoretisk kunskap inom ellära, till exempel kan du ha arbetat som elektriker eller suttit i en teknisk support inom områden såsom maskiner, hissar, automation eller industri. Som person är du en problemlösare och snarare uppmuntras av utmaningar än räds för de. Du är en lagspelare och hjälper gärna såväl kollegorna i supporten som kunderna som ringer in. Vi värdesätter egenskaper som samarbetsförmåga, hjälpsamhet och social kompetens. För att söka tjänsten måste du ha B-körkort samt tala och skriva flytande på svenska och engelska.\n\n\n\nOm företaget\nVårt mål är att göra människors liv enklare och mer miljövänligt genom att hjälpa dem använda energi så effektivt som möjligt. Våra produkter och tjänster förbättrar hur människor laddar och förvärmer sina fordon och ljussätter byggnader eller vägar. Vi fortsätter att förbättra vårt sortiment genom att fokusera på kontinuerlig förbättring och innovation.\n\n\nDEFA är ett privatägt norskt företag som grundades 1946. Vi har för närvarande mer än 400 anställda på tre kontinenter. Våra produkter och tjänster säljs i mer än 30 länder världen över.\n\n\n\nKontaktuppgifter\nI denna rekryteringsprocess samarbetar vi med Autorekrytering. Frågor kring processen besvaras av rekryterare Fredrica Eurén, via mejl fredrica.euren@autorekrytering.se eller telefon 070 622 65 30. Varmt välkommen med din ansökan!"
      },
      "headline" : "DEFA söker tillskott till sin tekniska support",
      "driving_license" : [ {
        "concept_id" : "VTK8_WRx_GcM",
        "label" : "B",
        "legacy_ams_taxonomy_id" : "3"
      } ],
      "employer" : {
        "email" : null,
        "phone_number" : null,
        "organization_number" : "5566839568",
        "name" : "Svensk Autorekrytering AB",
        "url" : "http://www.autorekrytering.se",
        "workplace" : "Svensk Autorekrytering AB"
      },
      "removed_date" : null,
      "logo_url" : "https://www.arbetsformedlingen.se/rest/arbetsgivare/rest/af/v3/organisation/5566839568/logotyper/logo.png",
      "last_publication_date" : "2022-09-11T23:59:59",
      "number_of_vacancies" : 1,
      "occupation" : {
        "concept_id" : "AJDU_fpb_ADF",
        "label" : "Elmontör",
        "legacy_ams_taxonomy_id" : "6412"
      },
      "occupation_group" : {
        "concept_id" : "SgAJ_DW2_FN5",
        "label" : "Montörer, elektrisk och elektronisk utrustning",
        "legacy_ams_taxonomy_id" : "8212"
      },
      "employment_type" : {
        "concept_id" : "PFZr_Syz_cUq",
        "label" : "Vanlig anställning",
        "legacy_ams_taxonomy_id" : "1"
      },
      "webpage_url" : "https://arbetsformedlingen.se/platsbanken/annonser/26389240",
      "driving_license_required" : true,
      "application_contacts" : [ {
        "description" : "Fredrica  Euren",
        "email" : "fredrica.euren@autorekrytering.se",
        "telephone" : "070 622 65 30",
        "name" : null,
        "contact_type" : null
      } ],
      "duration" : {
        "concept_id" : "a7uU_j21_mkL",
        "label" : "Tills vidare",
        "legacy_ams_taxonomy_id" : "1"
      },
      "nice_to_have" : {
        "education_level" : [ ],
        "work_experiences" : [ ],
        "skills" : [ ],
        "education" : [ ],
        "languages" : [ ]
      },
      "application_details" : {
        "via_af" : false,
        "email" : null,
        "other" : null,
        "reference" : "6911",
        "url" : "http://cv-autorekrytering-se.app.intelliplan.eu/JobAd/Show?jaid=6911",
        "information" : null
      },
      "source_type" : "VIA_PLATSBANKEN_DXA",
      "application_deadline" : "2022-09-11T23:59:59",
      "external_id" : "46-556683-9568-6911",
      "workplace_address" : {
        "coordinates" : [ 18.06858, 59.329323 ],
        "city" : null,
        "postcode" : null,
        "municipality" : "Stockholm",
        "region_concept_id" : "CifL_Rzy_Mku",
        "region" : "Stockholms län",
        "country_code" : "199",
        "region_code" : "01",
        "municipality_concept_id" : "AvNB_uwa_6n6",
        "country_concept_id" : "i46j_HmG_v64",
        "municipality_code" : "0180",
        "street_address" : null,
        "country" : "Sverige"
      },
      "id" : "26389240",
      "experience_required" : true,
      "working_hours_type" : {
        "concept_id" : "6YE1_gAC_R2G",
        "label" : "Heltid",
        "legacy_ams_taxonomy_id" : "1"
      },
      "access" : null,
      "timestamp" : 1660026807735,
      "must_have" : {
        "education_level" : [ ],
        "work_experiences" : [ {
          "concept_id" : "AJDU_fpb_ADF",
          "weight" : 10,
          "label" : "Elmontör",
          "legacy_ams_taxonomy_id" : "6412"
        } ],
        "skills" : [ ],
        "education" : [ ],
        "languages" : [ ]
      },
      "occupation_field" : {
        "concept_id" : "wTEr_CBC_bqh",
        "label" : "Industriell tillverkning",
        "legacy_ams_taxonomy_id" : "9"
      },
      "scope_of_work" : {
        "min" : 100,
        "max" : 100
      },
      "salary_type" : {
        "concept_id" : "oG8G_9cW_nRf",
        "label" : "Fast månads- vecko- eller timlön",
        "legacy_ams_taxonomy_id" : "1"
      },
      "removed" : false,
      "salary_description" : "Fast lön",
      "access_to_own_car" : false,
      "publication_date" : "2022-08-09T08:33:27"
    },
    "name" : "DEFA söker tillskott till sin tekniska support",
    "user" : "hannes"
  },
  "sha1" : "d599927ddd44abd2c14899b9d51b81dd6c5b0a3c",
  "annotations" : [ {
    "preferred-label" : "Supporttekniker",
    "type" : "keyword",
    "start-position" : 176,
    "end-position" : 192,
    "concept-id" : "dQPE_awn_uXC",
    "matched-string" : "medarbetare till",
    "annotation-id" : 9
  }, {
    "preferred-label" : "Supporttekniker",
    "type" : "keyword",
    "start-position" : 197,
    "end-position" : 213,
    "concept-id" : "dQPE_awn_uXC",
    "matched-string" : "tekniska support",
    "annotation-id" : 8
  }, {
    "preferred-label" : "Stockholm",
    "type" : "municipality",
    "start-position" : 238,
    "end-position" : 247,
    "concept-id" : "AvNB_uwa_6n6",
    "matched-string" : "Stockholm",
    "annotation-id" : 7
  }, {
    "preferred-label" : "Supporttekniker",
    "type" : "keyword",
    "start-position" : 477,
    "end-position" : 488,
    "concept-id" : "dQPE_awn_uXC",
    "matched-string" : "medarbetare",
    "annotation-id" : 10
  }, {
    "preferred-label" : "Supporttekniker",
    "type" : "keyword",
    "start-position" : 495,
    "end-position" : 511,
    "concept-id" : "dQPE_awn_uXC",
    "matched-string" : "tekniska support",
    "annotation-id" : 11
  }, {
    "preferred-label" : "produktchef",
    "type" : "esco-occupation",
    "start-position" : 860,
    "end-position" : 873,
    "concept-id" : "TYqb_9cj_yLi",
    "matched-string" : "produktchefer",
    "annotation-id" : 12
  }, {
    "preferred-label" : "kvalitetschef",
    "sentiment" : "MUST_HAVE",
    "type" : "esco-occupation",
    "start-position" : 875,
    "end-position" : 888,
    "concept-id" : "p1oZ_RNC_HDA",
    "matched-string" : "kvalitetschef",
    "annotation-id" : 0
  }, {
    "preferred-label" : "Certifikat/licenser",
    "sentiment" : "MUST_HAVE",
    "type" : "skill-headline",
    "start-position" : 1454,
    "end-position" : 1464,
    "concept-id" : "s48H_Sft_DTn",
    "matched-string" : "certifikat",
    "annotation-id" : 1
  }, {
    "preferred-label" : "Elektriker - industri",
    "type" : "skill",
    "start-position" : 1543,
    "end-position" : 1553,
    "concept-id" : "wJuu_o2B_q7L",
    "matched-string" : "elektriker",
    "annotation-id" : 13
  }, {
    "preferred-label" : "B",
    "type" : "driving-licence",
    "start-position" : 1950,
    "end-position" : 1959,
    "concept-id" : "VTK8_WRx_GcM",
    "matched-string" : "B-körkort",
    "annotation-id" : 14
  }, {
    "preferred-label" : "Svenska",
    "sentiment" : "MUST_HAVE",
    "type" : "language",
    "start-position" : 1993,
    "end-position" : 2000,
    "concept-id" : "zSLA_vw2_FXN",
    "matched-string" : "svenska",
    "annotation-id" : 3
  }, {
    "preferred-label" : "Engelska",
    "sentiment" : "MUST_HAVE",
    "type" : "language",
    "start-position" : 2005,
    "end-position" : 2013,
    "concept-id" : "NVxJ_hLg_TYS",
    "matched-string" : "engelska",
    "annotation-id" : 4
  }, {
    "preferred-label" : "Rekryterare/Rekryteringskonsult",
    "sentiment" : "MUST_HAVE",
    "type" : "occupation-name",
    "start-position" : 2695,
    "end-position" : 2706,
    "concept-id" : "QaQC_ozP_Bme",
    "matched-string" : "rekryterare",
    "annotation-id" : 5
  } ],
  "text" : "DEFA söker tillskott till sin tekniska support\nArbetsbeskrivning\nTriggas du av att anta tekniska utmaningar och lösa kunders problem? Nu söker DEFAs affärsområde e-mobility en medarbetare till sin tekniska support med arbetplats i Kista, Stockholm. Missa inte din chans att få arbeta på ett bolag som är i framkant med den tekniska utvecklingen av e-mobility produkter!\n\n\nRollen som teknisk support innefattar ett dynamiskt arbete som dagligen ger nya tekniska utmaningar. Som medarbetare i vår tekniska support kommer du med telefon och dator som främsta arbetsverktyg hjälpa både slutkunder och installatörer med tekniska frågor om våra produkter inom segmentet e-mobility, vilket i huvudsak innebär laddstolpar och olika betallösningar. Förutom kontakten med externa kunder kommer du även ha kontinuerlig kontakt med sidofunktioner internt i bolaget, såsom produktchefer, kvalitetschef och utvecklare. \n\n\nAtt arbeta hos oss innebär att delta i utvecklingen av framtidens produkter i bilbranschen och ger dig även möjligheten att växa inom ett globalt företag med ett väletablerat varumärke och utbud. Vi tror på arbete med frihet under ansvar och lägger stor vikt på din trivsel hos oss. \n\n\nSök tjänsten redan idag, urval sker löpande! \n\n\n\nDin Profil\nVi är övertygade om att rätt person med ett eget självdriv kan axla rollen som teknisk support men du behöver ha goda kunskaper inom el för att lyckas i arbetet. Vi söker dig som antingen har ett ECY-certifikat eller annan teoretisk kunskap inom ellära, till exempel kan du ha arbetat som elektriker eller suttit i en teknisk support inom områden såsom maskiner, hissar, automation eller industri. Som person är du en problemlösare och snarare uppmuntras av utmaningar än räds för de. Du är en lagspelare och hjälper gärna såväl kollegorna i supporten som kunderna som ringer in. Vi värdesätter egenskaper som samarbetsförmåga, hjälpsamhet och social kompetens. För att söka tjänsten måste du ha B-körkort samt tala och skriva flytande på svenska och engelska.\n\n\n\nOm företaget\nVårt mål är att göra människors liv enklare och mer miljövänligt genom att hjälpa dem använda energi så effektivt som möjligt. Våra produkter och tjänster förbättrar hur människor laddar och förvärmer sina fordon och ljussätter byggnader eller vägar. Vi fortsätter att förbättra vårt sortiment genom att fokusera på kontinuerlig förbättring och innovation.\n\n\nDEFA är ett privatägt norskt företag som grundades 1946. Vi har för närvarande mer än 400 anställda på tre kontinenter. Våra produkter och tjänster säljs i mer än 30 länder världen över.\n\n\n\nKontaktuppgifter\nI denna rekryteringsprocess samarbetar vi med Autorekrytering. Frågor kring processen besvaras av rekryterare Fredrica Eurén, via mejl fredrica.euren@autorekrytering.se eller telefon 070 622 65 30. Varmt välkommen med din ansökan!"
}