{
  "meta" : {
    "jobad" : {
      "description" : {
        "requirements" : null,
        "needs" : null,
        "company_information" : null,
        "text_formatted" : "Vi söker nu flera duktiga montörer till en utav våra kunder med start v.33.\n\nDina arbetsuppgifter\nDina arbetsuppgifter kommer till största delen att bestå av montering av träprodukter. Även viss form av lagerarbete såsom plock och pack kommer förekomma.\n\nDin bakgrund/Dina egenskaper\nVi söker dig som gärna har arbetat med montering men viktigast av allt är att du har rätt inställning.\nVilja, driv och noggrannhet är ord som kännetecknar dig. \n\nDu behärskar svenska i tal och skrift.\n\nTruckkort är positivt om du har men inget krav.\n\nInformation och kontakt\nFör mer information om tjänsten kontakta Magnus Wallin 0383-410045.\nTillträde from v.33.\nAnsök gärna direkt, då ansökningarna behandlas löpande.\nTjänsten börjar som en visstidsanställning som förväntas övergå i tillsvidareanställning hos kundföretaget för dig som trivs bra och visar framfötterna.\n\nOm Wikan Personal\nWikan Personal är din personliga och lokala arbetsgivare i bemanningsbranschen. Vårt breda kontaktnät hjälper dig som har rätt inställning och kompetens, till arbete. Vi verkar i flera olika branscher, vilket öppnar många dörrar för dig i jakten på nästa jobb. Vi lägger fokus på vår personal, deras välmående och utveckling. Vi kan personal.\n\nWikan Personal är ett auktoriserat och etablerat bemannings- och rekryteringsföretag. Med lokal förankring vill vi hjälpa företag och organisationer med kompetent och välmotiverad personal. Wikan har kontor på 15 orter i Sverige, omsätter ca 450 Msek och har omkring 1000 anställda. Läs mer på www.wikan.se",
        "conditions" : "Heltid\r\nVisstid, mer än 6 månader",
        "text" : "Vi söker nu flera duktiga montörer till en utav våra kunder med start v.33.\n\nDina arbetsuppgifter\nDina arbetsuppgifter kommer till största delen att bestå av montering av träprodukter. Även viss form av lagerarbete såsom plock och pack kommer förekomma.\n\nDin bakgrund/Dina egenskaper\nVi söker dig som gärna har arbetat med montering men viktigast av allt är att du har rätt inställning.\nVilja, driv och noggrannhet är ord som kännetecknar dig. \n\nDu behärskar svenska i tal och skrift.\n\nTruckkort är positivt om du har men inget krav.\n\nInformation och kontakt\nFör mer information om tjänsten kontakta Magnus Wallin 0383-410045.\nTillträde from v.33.\nAnsök gärna direkt, då ansökningarna behandlas löpande.\nTjänsten börjar som en visstidsanställning som förväntas övergå i tillsvidareanställning hos kundföretaget för dig som trivs bra och visar framfötterna.\n\nOm Wikan Personal\nWikan Personal är din personliga och lokala arbetsgivare i bemanningsbranschen. Vårt breda kontaktnät hjälper dig som har rätt inställning och kompetens, till arbete. Vi verkar i flera olika branscher, vilket öppnar många dörrar för dig i jakten på nästa jobb. Vi lägger fokus på vår personal, deras välmående och utveckling. Vi kan personal.\n\nWikan Personal är ett auktoriserat och etablerat bemannings- och rekryteringsföretag. Med lokal förankring vill vi hjälpa företag och organisationer med kompetent och välmotiverad personal. Wikan har kontor på 15 orter i Sverige, omsätter ca 450 Msek och har omkring 1000 anställda. Läs mer på www.wikan.se"
      },
      "headline" : "Montörer",
      "driving_license" : [ {
        "concept_id" : "VTK8_WRx_GcM",
        "label" : "B",
        "legacy_ams_taxonomy_id" : "3"
      } ],
      "employer" : {
        "email" : null,
        "phone_number" : null,
        "organization_number" : "5568427818",
        "name" : "Wikan Personal AB",
        "url" : "http://www.wikan.se",
        "workplace" : "Wikan Personal Höglandet AB"
      },
      "removed_date" : null,
      "logo_url" : "https://www.arbetsformedlingen.se/rest/arbetsgivare/rest/af/v3/organisation/5568427818/logotyper/logo.png",
      "last_publication_date" : "2022-08-03T23:59:59",
      "number_of_vacancies" : 4,
      "occupation" : {
        "concept_id" : "dxsZ_fG8_hvR",
        "label" : "Montör, träprodukter",
        "legacy_ams_taxonomy_id" : "5511"
      },
      "occupation_group" : {
        "concept_id" : "8ddv_P8e_iYz",
        "label" : "Montörer, träprodukter",
        "legacy_ams_taxonomy_id" : "8214"
      },
      "employment_type" : {
        "concept_id" : "PFZr_Syz_cUq",
        "label" : "Vanlig anställning",
        "legacy_ams_taxonomy_id" : "1"
      },
      "webpage_url" : "https://arbetsformedlingen.se/platsbanken/annonser/26294304",
      "driving_license_required" : true,
      "application_contacts" : [ {
        "description" : "Magnus Wallin",
        "email" : null,
        "telephone" : null,
        "name" : null,
        "contact_type" : null
      } ],
      "duration" : {
        "concept_id" : "qQUd_4qe_NDT",
        "label" : "6 månader eller längre",
        "legacy_ams_taxonomy_id" : "2"
      },
      "nice_to_have" : {
        "education_level" : [ ],
        "work_experiences" : [ ],
        "skills" : [ ],
        "education" : [ ],
        "languages" : [ ]
      },
      "application_details" : {
        "via_af" : false,
        "email" : null,
        "other" : null,
        "reference" : "9789",
        "url" : "http://www.wikan.se/jobb/9789/",
        "information" : null
      },
      "source_type" : "VIA_PLATSBANKEN_DXA",
      "application_deadline" : "2022-08-03T23:59:59",
      "external_id" : "46-556842-7818-9789",
      "workplace_address" : {
        "coordinates" : [ 14.696725, 57.653034 ],
        "city" : null,
        "postcode" : null,
        "municipality" : "Nässjö",
        "region_concept_id" : "MtbE_xWT_eMi",
        "region" : "Jönköpings län",
        "country_code" : "199",
        "region_code" : "06",
        "municipality_concept_id" : "KfXT_ySA_do2",
        "country_concept_id" : "i46j_HmG_v64",
        "municipality_code" : "0682",
        "street_address" : null,
        "country" : "Sverige"
      },
      "id" : "26294304",
      "experience_required" : false,
      "working_hours_type" : {
        "concept_id" : "6YE1_gAC_R2G",
        "label" : "Heltid",
        "legacy_ams_taxonomy_id" : "1"
      },
      "access" : null,
      "timestamp" : 1657013309511,
      "must_have" : {
        "education_level" : [ ],
        "work_experiences" : [ ],
        "skills" : [ ],
        "education" : [ ],
        "languages" : [ ]
      },
      "occupation_field" : {
        "concept_id" : "wTEr_CBC_bqh",
        "label" : "Industriell tillverkning",
        "legacy_ams_taxonomy_id" : "9"
      },
      "scope_of_work" : {
        "min" : 100,
        "max" : 100
      },
      "salary_type" : {
        "concept_id" : "oG8G_9cW_nRf",
        "label" : "Fast månads- vecko- eller timlön",
        "legacy_ams_taxonomy_id" : "1"
      },
      "removed" : false,
      "salary_description" : "Fast lön",
      "access_to_own_car" : false,
      "publication_date" : "2022-07-05T11:28:29"
    },
    "name" : "Montörer",
    "user" : "hannes"
  },
  "sha1" : "edee3df64322528abef9c1d967ee648716973535",
  "annotations" : [ {
    "preferred-label" : "Montörer",
    "sentiment" : "MUST_HAVE",
    "type" : "ssyk-level-3",
    "start-position" : 0,
    "end-position" : 8,
    "concept-id" : "Wz8B_WeK_vUB",
    "matched-string" : "montörer",
    "annotation-id" : 0
  }, {
    "preferred-label" : "Montörer",
    "sentiment" : "MUST_HAVE",
    "type" : "ssyk-level-3",
    "start-position" : 35,
    "end-position" : 43,
    "concept-id" : "Wz8B_WeK_vUB",
    "matched-string" : "montörer",
    "annotation-id" : 1
  }, {
    "preferred-label" : "träprodukter",
    "type" : "esco-skill",
    "start-position" : 180,
    "end-position" : 192,
    "concept-id" : "QjPt_8x7_eD3",
    "matched-string" : "träprodukter",
    "annotation-id" : 10
  }, {
    "preferred-label" : "utföra lagerarbete",
    "type" : "esco-skill",
    "start-position" : 212,
    "end-position" : 223,
    "concept-id" : "F8hR_NqH_tFa",
    "matched-string" : "lagerarbete",
    "annotation-id" : 11
  }, {
    "preferred-label" : "noggrannhet",
    "type" : "esco-skill",
    "start-position" : 412,
    "end-position" : 423,
    "concept-id" : "mrsW_EkL_KRD",
    "matched-string" : "noggrannhet",
    "annotation-id" : 12
  }, {
    "preferred-label" : "Svenska",
    "sentiment" : "MUST_HAVE",
    "type" : "language",
    "start-position" : 468,
    "end-position" : 475,
    "concept-id" : "zSLA_vw2_FXN",
    "matched-string" : "svenska",
    "annotation-id" : 2
  }, {
    "preferred-label" : "Truck",
    "type" : "keyword",
    "start-position" : 495,
    "end-position" : 500,
    "concept-id" : "Wz82_4Xv_ZFr",
    "matched-string" : "Truck",
    "annotation-id" : 13
  }, {
    "preferred-label" : "Allmän visstidsanställning",
    "type" : "keyword",
    "start-position" : 736,
    "end-position" : 755,
    "concept-id" : "hxfz_ayC_9Vd",
    "matched-string" : "visstidsanställning",
    "annotation-id" : 14
  }, {
    "preferred-label" : "Tillsvidareanställning (inkl. eventuell provanställning)",
    "type" : "employment-type",
    "start-position" : 779,
    "end-position" : 801,
    "concept-id" : "kpPX_CNN_gDU",
    "matched-string" : "tillsvidareanställning",
    "annotation-id" : 15
  }, {
    "preferred-label" : "Personal",
    "sentiment" : "MUST_HAVE",
    "type" : "keyword",
    "start-position" : 876,
    "end-position" : 884,
    "concept-id" : "HVxM_6MS_y1c",
    "matched-string" : "personal",
    "annotation-id" : 3
  }, {
    "preferred-label" : "Personal",
    "sentiment" : "MUST_HAVE",
    "type" : "keyword",
    "start-position" : 891,
    "end-position" : 899,
    "concept-id" : "HVxM_6MS_y1c",
    "matched-string" : "personal",
    "annotation-id" : 4
  }, {
    "preferred-label" : "Personal",
    "sentiment" : "MUST_HAVE",
    "type" : "keyword",
    "start-position" : 1169,
    "end-position" : 1177,
    "concept-id" : "HVxM_6MS_y1c",
    "matched-string" : "personal",
    "annotation-id" : 5
  }, {
    "preferred-label" : "Personal",
    "sentiment" : "MUST_HAVE",
    "type" : "keyword",
    "start-position" : 1218,
    "end-position" : 1226,
    "concept-id" : "HVxM_6MS_y1c",
    "matched-string" : "personal",
    "annotation-id" : 6
  }, {
    "preferred-label" : "Personal",
    "sentiment" : "MUST_HAVE",
    "type" : "keyword",
    "start-position" : 1235,
    "end-position" : 1243,
    "concept-id" : "HVxM_6MS_y1c",
    "matched-string" : "personal",
    "annotation-id" : 7
  }, {
    "preferred-label" : "Personal",
    "sentiment" : "MUST_HAVE",
    "type" : "keyword",
    "start-position" : 1409,
    "end-position" : 1417,
    "concept-id" : "HVxM_6MS_y1c",
    "matched-string" : "personal",
    "annotation-id" : 8
  }, {
    "preferred-label" : "Kontor",
    "sentiment" : "MUST_HAVE",
    "type" : "keyword",
    "start-position" : 1429,
    "end-position" : 1435,
    "concept-id" : "Hyz1_7HF_AkP",
    "matched-string" : "kontor",
    "annotation-id" : 9
  } ],
  "text" : "Montörer\nVi söker nu flera duktiga montörer till en utav våra kunder med start v.33.\n\nDina arbetsuppgifter\nDina arbetsuppgifter kommer till största delen att bestå av montering av träprodukter. Även viss form av lagerarbete såsom plock och pack kommer förekomma.\n\nDin bakgrund/Dina egenskaper\nVi söker dig som gärna har arbetat med montering men viktigast av allt är att du har rätt inställning.\nVilja, driv och noggrannhet är ord som kännetecknar dig. \n\nDu behärskar svenska i tal och skrift.\n\nTruckkort är positivt om du har men inget krav.\n\nInformation och kontakt\nFör mer information om tjänsten kontakta Magnus Wallin 0383-410045.\nTillträde from v.33.\nAnsök gärna direkt, då ansökningarna behandlas löpande.\nTjänsten börjar som en visstidsanställning som förväntas övergå i tillsvidareanställning hos kundföretaget för dig som trivs bra och visar framfötterna.\n\nOm Wikan Personal\nWikan Personal är din personliga och lokala arbetsgivare i bemanningsbranschen. Vårt breda kontaktnät hjälper dig som har rätt inställning och kompetens, till arbete. Vi verkar i flera olika branscher, vilket öppnar många dörrar för dig i jakten på nästa jobb. Vi lägger fokus på vår personal, deras välmående och utveckling. Vi kan personal.\n\nWikan Personal är ett auktoriserat och etablerat bemannings- och rekryteringsföretag. Med lokal förankring vill vi hjälpa företag och organisationer med kompetent och välmotiverad personal. Wikan har kontor på 15 orter i Sverige, omsätter ca 450 Msek och har omkring 1000 anställda. Läs mer på www.wikan.se"
}