{
  "meta" : {
    "jobad" : {
      "description" : {
        "requirements" : null,
        "needs" : null,
        "company_information" : null,
        "text_formatted" : "Som bemanningskonsult hos Lernia är du anställd av oss, men jobbar hos någon av våra kunder. Hos oss har du samma rättigheter som hos en traditionell arbetsgivare, men fler tillfällen att prova på olika arbetsuppgifter och arbetsplatser.\n\nArbetsuppgifter:\n\nÄr du en flexibel, ansvarsfull och lösningsfokuserad person som drivs av möjligheten att utvecklas och att få lära dig nya saker? Vill du vara med och bidra till våra kunders framgångar samtidigt som du har roligt på jobbet? Då kan rollen som Industriarbetare hos Lernia vara helt rätt för dig. Välkommen med din ansökan! \n\nFormell kompetens:\n- Fyllda 18 år.\n- Körkort B och tillgång till bil.\n- Goda kunskaper i svenska språket, både i tal och skrift.\n- Godkända gymnasiebetyg i svenska, matematik och engelska eller för oss relevant arbetslivserfarenhet (minst 3 år).\n- Flera av våra positioner kräver truck- & traverskort.\n\nDin bakgrund:\nVi ser gärna att du har utbildning inom industri eller teknik, samt industrierfarenhet och ett stort intresse inom området.\nVi lägger stor vikt vid personliga egenskaper.\n\nErfarenhet inom avsyning, ritningsläsning och svets är meriterande.\n\nPersonliga egenskaper:\nVi söker dig som trivs med att arbeta inom industri och är engagerad och positivt inställd till utmaningar. Du ska även kunna arbeta både självständigt och i grupp, vilket ställer krav på att du är flexibel, självgående, driven och tar egna initiativ. Arbetet kan vara fysiskt krävande.\n\nVidare krävs det att du har god förmåga att ta till dig instruktioner på svenska muntligt och i skriftlig form.\n\nAnställningsform/omfattning/tjänstgöringsort:\nVisstidsanställning/Heltid/Eksjö\n\nTillträde:\nStart omgående, enligt överenskommelse\n\nInformation:\nAnsök med ditt CV och personliga brev. \n\nAnsökningarna behandlas löpande och tjänsten kan komma att tillsättas innan sista ansökningsdag. Vi kommer att kontakta dig om du är den vi söker. \n\nVid frågor kan ni kontakta vår rekryterare: linn.einarsson@lernia.se\n\nVälkommen med din ansökan redan idag på www.lernia.se\n\nForma framtiden med oss!\nLernia är ett av Sveriges ledande företag inom kompetensutveckling och kompetensförsörjning. Vi finns över hela landet och har tjänster inom vuxenutbildning, bemanning, rekrytering och omställning. Varje år får 9 000 bemanningskonsulter jobb på Lernia. Som konsult kan du prova på olika roller, dra nynna nytta av din befintliga kompetens eller kanske ta nästa steg i karriären, samtidigt som du har samma trygghet som hos andra företag. Välkommen till Lernia – tillsammans formar vi din framtid! Läs mer på lernia.se.",
        "conditions" : "-\r\n-",
        "text" : "Som bemanningskonsult hos Lernia är du anställd av oss, men jobbar hos någon av våra kunder. Hos oss har du samma rättigheter som hos en traditionell arbetsgivare, men fler tillfällen att prova på olika arbetsuppgifter och arbetsplatser.\n\nArbetsuppgifter:\n\nÄr du en flexibel, ansvarsfull och lösningsfokuserad person som drivs av möjligheten att utvecklas och att få lära dig nya saker? Vill du vara med och bidra till våra kunders framgångar samtidigt som du har roligt på jobbet? Då kan rollen som Industriarbetare hos Lernia vara helt rätt för dig. Välkommen med din ansökan! \n\nFormell kompetens:\n- Fyllda 18 år.\n- Körkort B och tillgång till bil.\n- Goda kunskaper i svenska språket, både i tal och skrift.\n- Godkända gymnasiebetyg i svenska, matematik och engelska eller för oss relevant arbetslivserfarenhet (minst 3 år).\n- Flera av våra positioner kräver truck- & traverskort.\n\nDin bakgrund:\nVi ser gärna att du har utbildning inom industri eller teknik, samt industrierfarenhet och ett stort intresse inom området.\nVi lägger stor vikt vid personliga egenskaper.\n\nErfarenhet inom avsyning, ritningsläsning och svets är meriterande.\n\nPersonliga egenskaper:\nVi söker dig som trivs med att arbeta inom industri och är engagerad och positivt inställd till utmaningar. Du ska även kunna arbeta både självständigt och i grupp, vilket ställer krav på att du är flexibel, självgående, driven och tar egna initiativ. Arbetet kan vara fysiskt krävande.\n\nVidare krävs det att du har god förmåga att ta till dig instruktioner på svenska muntligt och i skriftlig form.\n\nAnställningsform/omfattning/tjänstgöringsort:\nVisstidsanställning/Heltid/Eksjö\n\nTillträde:\nStart omgående, enligt överenskommelse\n\nInformation:\nAnsök med ditt CV och personliga brev. \n\nAnsökningarna behandlas löpande och tjänsten kan komma att tillsättas innan sista ansökningsdag. Vi kommer att kontakta dig om du är den vi söker. \n\nVid frågor kan ni kontakta vår rekryterare: linn.einarsson@lernia.se\n\nVälkommen med din ansökan redan idag på www.lernia.se\n\nForma framtiden med oss!\nLernia är ett av Sveriges ledande företag inom kompetensutveckling och kompetensförsörjning. Vi finns över hela landet och har tjänster inom vuxenutbildning, bemanning, rekrytering och omställning. Varje år får 9 000 bemanningskonsulter jobb på Lernia. Som konsult kan du prova på olika roller, dra nynna nytta av din befintliga kompetens eller kanske ta nästa steg i karriären, samtidigt som du har samma trygghet som hos andra företag. Välkommen till Lernia – tillsammans formar vi din framtid! Läs mer på lernia.se."
      },
      "headline" : "Industriarbetare sökes till kund i Eksjö",
      "driving_license" : [ {
        "concept_id" : "VTK8_WRx_GcM",
        "label" : "B",
        "legacy_ams_taxonomy_id" : "3"
      } ],
      "employer" : {
        "email" : null,
        "phone_number" : null,
        "organization_number" : "5564727013",
        "name" : "Lernia Bemanning AB",
        "url" : null,
        "workplace" : "Lernia"
      },
      "removed_date" : null,
      "logo_url" : "https://www.arbetsformedlingen.se/rest/arbetsgivare/rest/af/v3/organisation/5564727013/logotyper/logo.png",
      "last_publication_date" : "2022-08-28T23:59:59",
      "number_of_vacancies" : 1,
      "occupation" : {
        "concept_id" : "Z4Tt_Gwt_NGP",
        "label" : "Maskinoperatör, mekanisk verkstad",
        "legacy_ams_taxonomy_id" : "5305"
      },
      "occupation_group" : {
        "concept_id" : "vaEp_iBS_c5h",
        "label" : "Maskinställare och maskinoperatörer, metallarbete",
        "legacy_ams_taxonomy_id" : "7223"
      },
      "employment_type" : {
        "concept_id" : "PFZr_Syz_cUq",
        "label" : "Vanlig anställning",
        "legacy_ams_taxonomy_id" : "1"
      },
      "webpage_url" : "https://arbetsformedlingen.se/platsbanken/annonser/26389121",
      "driving_license_required" : true,
      "application_contacts" : [ ],
      "duration" : {
        "concept_id" : "qQUd_4qe_NDT",
        "label" : "6 månader eller längre",
        "legacy_ams_taxonomy_id" : "2"
      },
      "nice_to_have" : {
        "education_level" : [ ],
        "work_experiences" : [ ],
        "skills" : [ ],
        "education" : [ ],
        "languages" : [ ]
      },
      "application_details" : {
        "via_af" : false,
        "email" : null,
        "other" : null,
        "reference" : null,
        "url" : "https://www.lernia.se/?jobid=211920&ref=platsbanken",
        "information" : null
      },
      "source_type" : "VIA_PLATSBANKEN_DXA",
      "application_deadline" : "2022-08-28T23:59:59",
      "external_id" : "46-556472-7013-wb-211920",
      "workplace_address" : {
        "coordinates" : [ 14.973222, 57.665165 ],
        "city" : null,
        "postcode" : null,
        "municipality" : "Eksjö",
        "region_concept_id" : "MtbE_xWT_eMi",
        "region" : "Jönköpings län",
        "country_code" : "199",
        "region_code" : "06",
        "municipality_concept_id" : "VacK_WF6_XVg",
        "country_concept_id" : "i46j_HmG_v64",
        "municipality_code" : "0686",
        "street_address" : null,
        "country" : "Sverige"
      },
      "id" : "26389121",
      "experience_required" : false,
      "working_hours_type" : {
        "concept_id" : "6YE1_gAC_R2G",
        "label" : "Heltid",
        "legacy_ams_taxonomy_id" : "1"
      },
      "access" : null,
      "timestamp" : 1660025564139,
      "must_have" : {
        "education_level" : [ ],
        "work_experiences" : [ ],
        "skills" : [ ],
        "education" : [ ],
        "languages" : [ ]
      },
      "occupation_field" : {
        "concept_id" : "wTEr_CBC_bqh",
        "label" : "Industriell tillverkning",
        "legacy_ams_taxonomy_id" : "9"
      },
      "scope_of_work" : {
        "min" : 100,
        "max" : 100
      },
      "salary_type" : {
        "concept_id" : "oG8G_9cW_nRf",
        "label" : "Fast månads- vecko- eller timlön",
        "legacy_ams_taxonomy_id" : "1"
      },
      "removed" : false,
      "salary_description" : "Enligt överenskommelse",
      "access_to_own_car" : true,
      "publication_date" : "2022-08-09T08:12:44"
    },
    "name" : "Industriarbetare sökes till kund i Eksjö",
    "user" : "hannes"
  },
  "sha1" : "bcf358c7bff103dd7c8c2b45afd6d2fdbfa96347",
  "annotations" : [ {
    "preferred-label" : "Eksjö",
    "type" : "municipality",
    "start-position" : 35,
    "end-position" : 40,
    "concept-id" : "VacK_WF6_XVg",
    "matched-string" : "Eksjö",
    "annotation-id" : 11
  }, {
    "preferred-label" : "Bemanningskonsult",
    "sentiment" : "MUST_HAVE",
    "type" : "keyword",
    "start-position" : 45,
    "end-position" : 62,
    "concept-id" : "tmog_xxh_r5Q",
    "matched-string" : "bemanningskonsult",
    "annotation-id" : 0
  }, {
    "preferred-label" : "visa ansvarstagande",
    "type" : "esco-skill",
    "start-position" : 317,
    "end-position" : 328,
    "concept-id" : "bcRp_hxV_f5G",
    "matched-string" : "ansvarsfull",
    "annotation-id" : 12
  }, {
    "preferred-label" : "B",
    "type" : "driving-licence",
    "start-position" : 659,
    "end-position" : 668,
    "concept-id" : "VTK8_WRx_GcM",
    "matched-string" : "Körkort B",
    "annotation-id" : 13
  }, {
    "preferred-label" : "Svenska språket",
    "sentiment" : "MUST_HAVE",
    "type" : "keyword",
    "start-position" : 711,
    "end-position" : 726,
    "concept-id" : "BiGm_58D_SSn",
    "matched-string" : "svenska språket",
    "annotation-id" : 1
  }, {
    "preferred-label" : "Svenska",
    "sentiment" : "MUST_HAVE",
    "type" : "language",
    "start-position" : 778,
    "end-position" : 785,
    "concept-id" : "zSLA_vw2_FXN",
    "matched-string" : "svenska",
    "annotation-id" : 2
  }, {
    "preferred-label" : "matematik",
    "sentiment" : "MUST_HAVE",
    "type" : "esco-skill",
    "start-position" : 787,
    "end-position" : 796,
    "concept-id" : "qn4M_gYf_2K1",
    "matched-string" : "matematik",
    "annotation-id" : 3
  }, {
    "preferred-label" : "Engelska",
    "sentiment" : "MUST_HAVE",
    "type" : "language",
    "start-position" : 801,
    "end-position" : 809,
    "concept-id" : "NVxJ_hLg_TYS",
    "matched-string" : "engelska",
    "annotation-id" : 4
  }, {
    "preferred-label" : "2-4 års erfarenhet",
    "type" : "occupation-experience-year",
    "start-position" : 833,
    "end-position" : 866,
    "concept-id" : "RWA2_uu6_udD",
    "matched-string" : "arbetslivserfarenhet (minst 3 år)",
    "annotation-id" : 14
  }, {
    "preferred-label" : "Truck",
    "sentiment" : "MUST_HAVE",
    "type" : "keyword",
    "start-position" : 902,
    "end-position" : 907,
    "concept-id" : "Wz82_4Xv_ZFr",
    "matched-string" : "truck",
    "annotation-id" : 5
  }, {
    "preferred-label" : "Travers/Lyftanordningar",
    "type" : "skill",
    "start-position" : 911,
    "end-position" : 922,
    "concept-id" : "R6ZK_FGC_ovb",
    "matched-string" : "traverskort",
    "annotation-id" : 15
  }, {
    "preferred-label" : "Avsyning",
    "sentiment" : "MUST_HAVE",
    "type" : "skill",
    "start-position" : 1127,
    "end-position" : 1135,
    "concept-id" : "X4EU_ZC7_QmK",
    "matched-string" : "avsyning",
    "annotation-id" : 6
  }, {
    "preferred-label" : "Ritningsläsning",
    "sentiment" : "MUST_HAVE",
    "type" : "skill",
    "start-position" : 1137,
    "end-position" : 1152,
    "concept-id" : "aHCV_VsV_LiD",
    "matched-string" : "ritningsläsning",
    "annotation-id" : 7
  }, {
    "preferred-label" : "Svets",
    "sentiment" : "MUST_HAVE",
    "type" : "keyword",
    "start-position" : 1157,
    "end-position" : 1162,
    "concept-id" : "Emhe_ce6_MYC",
    "matched-string" : "svets",
    "annotation-id" : 8
  }, {
    "preferred-label" : "arbeta självständigt",
    "type" : "esco-skill",
    "start-position" : 1341,
    "end-position" : 1354,
    "concept-id" : "NyFu_HHd_zhz",
    "matched-string" : "självständigt",
    "annotation-id" : 16
  }, {
    "preferred-label" : "Svenska",
    "sentiment" : "MUST_HAVE",
    "type" : "language",
    "start-position" : 1564,
    "end-position" : 1571,
    "concept-id" : "zSLA_vw2_FXN",
    "matched-string" : "svenska",
    "annotation-id" : 9
  }, {
    "preferred-label" : "Allmän visstidsanställning",
    "type" : "keyword",
    "start-position" : 1650,
    "end-position" : 1669,
    "concept-id" : "hxfz_ayC_9Vd",
    "matched-string" : "Visstidsanställning",
    "annotation-id" : 17
  }, {
    "preferred-label" : "Heltid",
    "type" : "worktime-extent",
    "start-position" : 1670,
    "end-position" : 1676,
    "concept-id" : "6YE1_gAC_R2G",
    "matched-string" : "Heltid",
    "annotation-id" : 18
  }, {
    "preferred-label" : "Eksjö",
    "type" : "municipality",
    "start-position" : 1677,
    "end-position" : 1682,
    "concept-id" : "VacK_WF6_XVg",
    "matched-string" : "Eksjö",
    "annotation-id" : 19
  }, {
    "preferred-label" : "Rekryterare/Rekryteringskonsult",
    "sentiment" : "MUST_HAVE",
    "type" : "occupation-name",
    "start-position" : 1969,
    "end-position" : 1980,
    "concept-id" : "QaQC_ozP_Bme",
    "matched-string" : "rekryterare",
    "annotation-id" : 10
  } ],
  "text" : "Industriarbetare sökes till kund i Eksjö\nSom bemanningskonsult hos Lernia är du anställd av oss, men jobbar hos någon av våra kunder. Hos oss har du samma rättigheter som hos en traditionell arbetsgivare, men fler tillfällen att prova på olika arbetsuppgifter och arbetsplatser.\n\nArbetsuppgifter:\n\nÄr du en flexibel, ansvarsfull och lösningsfokuserad person som drivs av möjligheten att utvecklas och att få lära dig nya saker? Vill du vara med och bidra till våra kunders framgångar samtidigt som du har roligt på jobbet? Då kan rollen som Industriarbetare hos Lernia vara helt rätt för dig. Välkommen med din ansökan! \n\nFormell kompetens:\n- Fyllda 18 år.\n- Körkort B och tillgång till bil.\n- Goda kunskaper i svenska språket, både i tal och skrift.\n- Godkända gymnasiebetyg i svenska, matematik och engelska eller för oss relevant arbetslivserfarenhet (minst 3 år).\n- Flera av våra positioner kräver truck- & traverskort.\n\nDin bakgrund:\nVi ser gärna att du har utbildning inom industri eller teknik, samt industrierfarenhet och ett stort intresse inom området.\nVi lägger stor vikt vid personliga egenskaper.\n\nErfarenhet inom avsyning, ritningsläsning och svets är meriterande.\n\nPersonliga egenskaper:\nVi söker dig som trivs med att arbeta inom industri och är engagerad och positivt inställd till utmaningar. Du ska även kunna arbeta både självständigt och i grupp, vilket ställer krav på att du är flexibel, självgående, driven och tar egna initiativ. Arbetet kan vara fysiskt krävande.\n\nVidare krävs det att du har god förmåga att ta till dig instruktioner på svenska muntligt och i skriftlig form.\n\nAnställningsform/omfattning/tjänstgöringsort:\nVisstidsanställning/Heltid/Eksjö\n\nTillträde:\nStart omgående, enligt överenskommelse\n\nInformation:\nAnsök med ditt CV och personliga brev. \n\nAnsökningarna behandlas löpande och tjänsten kan komma att tillsättas innan sista ansökningsdag. Vi kommer att kontakta dig om du är den vi söker. \n\nVid frågor kan ni kontakta vår rekryterare: linn.einarsson@lernia.se\n\nVälkommen med din ansökan redan idag på www.lernia.se\n\nForma framtiden med oss!\nLernia är ett av Sveriges ledande företag inom kompetensutveckling och kompetensförsörjning. Vi finns över hela landet och har tjänster inom vuxenutbildning, bemanning, rekrytering och omställning. Varje år får 9 000 bemanningskonsulter jobb på Lernia. Som konsult kan du prova på olika roller, dra nynna nytta av din befintliga kompetens eller kanske ta nästa steg i karriären, samtidigt som du har samma trygghet som hos andra företag. Välkommen till Lernia – tillsammans formar vi din framtid! Läs mer på lernia.se."
}