{
  "meta" : {
    "jobad" : {
      "description" : {
        "requirements" : null,
        "needs" : null,
        "company_information" : null,
        "text_formatted" : "<p>Vill du arbeta på Sveriges största VA-bolag med spännande projekt och arbetsuppgifter i en lärande miljö? Då ska du söka tjänsten hos oss på enheten Geodata. Du kommer att få arbeta med inmätning och kartering av bolagets VA-nät med tillhörande anläggningar och sopsugar. </p><p><strong>Om rollen </strong></p><p>Arbetet som Mät- och Kartingenjör innebär att du arbetar både på kontor och ute i fält. Ditt arbete är självständigt, där du ansvarar för olika typer av mät- och kartjobb. Ditt arbetsområde täcker in både Stockholm och Huddinge kommun, där du utgår från vårt huvudkontor i Ulvsunda. </p><p>För att trivas i den här rollen söker vi dig som: </p><ul><li>Vill arbeta med inmätning och utsättning av vårt ledningsnät och anläggningar i fält</li><li>Vill arbeta med kartering av mätdata för att erhålla en uppdaterad ledningsnätsdatabas</li><li>Vill arbeta med inmätning och kartering av bolaget sopsugar</li><li>Vill jobba på en kreativ enhet med höga målsättningar och med fokus på utveckling- och förbättringsarbete</li><li>Gillar att jobba digitalt och via digitala tavlor för att visa hur arbetet fortgår</li><li>Kan sprida goda exempel till övriga delar av bolaget och fånga upp nya arbetssätt från omvärlden</li></ul><p><br></p><p>Vi använder Leicas mätinstrument i det dagliga arbetet. Vi karterar i en ArcGIS-baserad VA-produkt som heter GEOSECMA Ledning VA. </p><p>Rollen är en tillsvidareanställning med placering i Ulvsunda, med tillträde enligt överenskommelse. Provanställning kan ev. vara aktuellt. </p><p>I din tjänst kommer du arbeta med säkerhetsklassad information. Säkerhetsprövning och registerkontroll kommer därför att genomföras i samband med anställning.</p><p><strong>Om dig</strong></p><p>Vi söker dig som är utbildad Mät- och Kartingenjör eller motsvarande med några års erfarenhet av mätning i fält och kartering i en GIS-baserad miljö. Vi ser gärna att du har några års erfarenhet av utredningsarbete, team- eller projekteldning och är van av att arbeta i en ArcGIS-miljö. B-körkort är ett krav för tjänsten. </p><p>För att kunna bidra till enhetens utveckling ser vi gärna att du är kreativ, lyhörd samt positiv till förändringar och teknisk utveckling. Vi jobbar enligt LEAN-filosofin, så det är en merit om du har erfarenhet av detta sätt att arbeta. Det är viktigt att du har förmåga att arbeta både självständigt och i grupp! </p><p>I din roll kommer du få tillgång till olika utbildningar och fortlöpande få möjlighet att utvecklas internt. Hos oss finns mycket erfarenhet och kunskap - vi kommer hjälpa dig att lyckas med ditt uppdrag! </p><p><strong>Om oss</strong></p><p>Stockholm Vatten och Avfall utvecklar och levererar vatten- och avfallstjänster som får vår fantastiska stad att fungera, växa och vara en plats där både människor och natur trivs. Tillsammans med invånare, företag och andra intressenter arbetar vi för att Stockholm ska bli världens mest hållbara stad.</p><p>Hos oss får du ett roligt och omväxlande jobb med intressanta arbetsuppgifter, duktiga kollegor och ett gott arbetsklimat. Du får goda anställningsvillkor, får jobba med digitala och flexibla arbetssätt, tillgång till kontinuerlig kompetensutveckling tillsammans med en rad hälsofrämjande fördelar. Läs mer om oss och träffa några av våra medarbetare på svoa.se/jobb</p><p><strong>Ansökan</strong></p><p>Om du tycker att du känner igen dig i beskrivningen och att jobbet ser intressant ut så ser vi fram emot din ansökan senast den 14 augusti 2022! </p><p>För ytterligare information om tjänsten kontaktar du enhetschef Marianne Isoz Henriksson genom att mejla: marianne.isoz-henriksson@svoa.se</p><p>Vi på Stockholm Vatten och Avfall ser fram emot din ansökan! </p>",
        "conditions" : null,
        "text" : "Vill du arbeta på Sveriges största VA-bolag med spännande projekt och arbetsuppgifter i en lärande miljö? Då ska du söka tjänsten hos oss på enheten Geodata. Du kommer att få arbeta med inmätning och kartering av bolagets VA-nät med tillhörande anläggningar och sopsugar. \nOm rollen \nArbetet som Mät- och Kartingenjör innebär att du arbetar både på kontor och ute i fält. Ditt arbete är självständigt, där du ansvarar för olika typer av mät- och kartjobb. Ditt arbetsområde täcker in både Stockholm och Huddinge kommun, där du utgår från vårt huvudkontor i Ulvsunda. \nFör att trivas i den här rollen söker vi dig som: \nVill arbeta med inmätning och utsättning av vårt ledningsnät och anläggningar i fält\nVill arbeta med kartering av mätdata för att erhålla en uppdaterad ledningsnätsdatabas\nVill arbeta med inmätning och kartering av bolaget sopsugar\nVill jobba på en kreativ enhet med höga målsättningar och med fokus på utveckling- och förbättringsarbete\nGillar att jobba digitalt och via digitala tavlor för att visa hur arbetet fortgår\nKan sprida goda exempel till övriga delar av bolaget och fånga upp nya arbetssätt från omvärlden\n\n\n\nVi använder Leicas mätinstrument i det dagliga arbetet. Vi karterar i en ArcGIS-baserad VA-produkt som heter GEOSECMA Ledning VA. \nRollen är en tillsvidareanställning med placering i Ulvsunda, med tillträde enligt överenskommelse. Provanställning kan ev. vara aktuellt. \nI din tjänst kommer du arbeta med säkerhetsklassad information. Säkerhetsprövning och registerkontroll kommer därför att genomföras i samband med anställning.\nOm dig\nVi söker dig som är utbildad Mät- och Kartingenjör eller motsvarande med några års erfarenhet av mätning i fält och kartering i en GIS-baserad miljö. Vi ser gärna att du har några års erfarenhet av utredningsarbete, team- eller projekteldning och är van av att arbeta i en ArcGIS-miljö. B-körkort är ett krav för tjänsten. \nFör att kunna bidra till enhetens utveckling ser vi gärna att du är kreativ, lyhörd samt positiv till förändringar och teknisk utveckling. Vi jobbar enligt LEAN-filosofin, så det är en merit om du har erfarenhet av detta sätt att arbeta. Det är viktigt att du har förmåga att arbeta både självständigt och i grupp! \nI din roll kommer du få tillgång till olika utbildningar och fortlöpande få möjlighet att utvecklas internt. Hos oss finns mycket erfarenhet och kunskap - vi kommer hjälpa dig att lyckas med ditt uppdrag! \nOm oss\nStockholm Vatten och Avfall utvecklar och levererar vatten- och avfallstjänster som får vår fantastiska stad att fungera, växa och vara en plats där både människor och natur trivs. Tillsammans med invånare, företag och andra intressenter arbetar vi för att Stockholm ska bli världens mest hållbara stad.\nHos oss får du ett roligt och omväxlande jobb med intressanta arbetsuppgifter, duktiga kollegor och ett gott arbetsklimat. Du får goda anställningsvillkor, får jobba med digitala och flexibla arbetssätt, tillgång till kontinuerlig kompetensutveckling tillsammans med en rad hälsofrämjande fördelar. Läs mer om oss och träffa några av våra medarbetare på svoa.se/jobb\nAnsökan\nOm du tycker att du känner igen dig i beskrivningen och att jobbet ser intressant ut så ser vi fram emot din ansökan senast den 14 augusti 2022! \nFör ytterligare information om tjänsten kontaktar du enhetschef Marianne Isoz Henriksson genom att mejla: marianne.isoz-henriksson@svoa.se\nVi på Stockholm Vatten och Avfall ser fram emot din ansökan!"
      },
      "headline" : "Mät- och kartingenjör",
      "driving_license" : [ {
        "concept_id" : "VTK8_WRx_GcM",
        "label" : "B",
        "legacy_ams_taxonomy_id" : "3"
      } ],
      "employer" : {
        "email" : null,
        "phone_number" : null,
        "organization_number" : "5562106855",
        "name" : "Stockholm Vatten AB",
        "url" : "http://svoa.se/jobb",
        "workplace" : "Stockholm Vatten och Avfall"
      },
      "removed_date" : null,
      "logo_url" : "https://www.arbetsformedlingen.se/rest/arbetsgivare/rest/af/v3/arbetsplatser/85570469/logotyper/logo.png",
      "last_publication_date" : "2022-09-14T00:00:00",
      "number_of_vacancies" : 2,
      "occupation" : {
        "concept_id" : "R2hT_88E_wx6",
        "label" : "Kartingenjör",
        "legacy_ams_taxonomy_id" : "5518"
      },
      "occupation_group" : {
        "concept_id" : "ketV_G9W_GeR",
        "label" : "GIS- och kartingenjörer",
        "legacy_ams_taxonomy_id" : "3117"
      },
      "employment_type" : {
        "concept_id" : "PFZr_Syz_cUq",
        "label" : "Vanlig anställning",
        "legacy_ams_taxonomy_id" : "1"
      },
      "webpage_url" : "https://arbetsformedlingen.se/platsbanken/annonser/26379751",
      "driving_license_required" : true,
      "application_contacts" : [ ],
      "duration" : {
        "concept_id" : "a7uU_j21_mkL",
        "label" : "Tills vidare",
        "legacy_ams_taxonomy_id" : "1"
      },
      "nice_to_have" : {
        "education_level" : [ ],
        "work_experiences" : [ ],
        "skills" : [ ],
        "education" : [ ],
        "languages" : [ ]
      },
      "application_details" : {
        "via_af" : false,
        "email" : null,
        "other" : null,
        "reference" : null,
        "url" : "https://stockholmsstad.varbi.com/what:job/jobID:527704/?lang=se",
        "information" : null
      },
      "source_type" : "VIA_ANNONSERA",
      "application_deadline" : "2022-09-14T00:00:00",
      "external_id" : null,
      "workplace_address" : {
        "coordinates" : [ 18.060082512012375, 59.330322627617186 ],
        "city" : "Bromma",
        "postcode" : "10636",
        "municipality" : "Stockholm",
        "region_concept_id" : "CifL_Rzy_Mku",
        "region" : "Stockholms län",
        "country_code" : "199",
        "region_code" : "01",
        "municipality_concept_id" : "AvNB_uwa_6n6",
        "country_concept_id" : "i46j_HmG_v64",
        "municipality_code" : "0180",
        "street_address" : "Bryggerivägen 10",
        "country" : "Sverige"
      },
      "id" : "26379751",
      "experience_required" : true,
      "working_hours_type" : {
        "concept_id" : "6YE1_gAC_R2G",
        "label" : "Heltid",
        "legacy_ams_taxonomy_id" : "1"
      },
      "access" : null,
      "timestamp" : 1659684195280,
      "must_have" : {
        "education_level" : [ ],
        "work_experiences" : [ ],
        "skills" : [ ],
        "education" : [ ],
        "languages" : [ ]
      },
      "occupation_field" : {
        "concept_id" : "6Hq3_tKo_V57",
        "label" : "Yrken med teknisk inriktning",
        "legacy_ams_taxonomy_id" : "18"
      },
      "scope_of_work" : {
        "min" : 0,
        "max" : 100
      },
      "salary_type" : {
        "concept_id" : "oG8G_9cW_nRf",
        "label" : "Fast månads- vecko- eller timlön",
        "legacy_ams_taxonomy_id" : "1"
      },
      "removed" : false,
      "salary_description" : null,
      "access_to_own_car" : false,
      "publication_date" : "2022-08-05T09:23:15"
    },
    "name" : "Mät- och kartingenjör",
    "user" : "hannes"
  },
  "sha1" : "fdabb4ca65cac67a955d36e405b7597c02c20f68",
  "annotations" : [ {
    "preferred-label" : "Kartingenjör",
    "sentiment" : "MUST_HAVE",
    "type" : "occupation-name",
    "start-position" : 9,
    "end-position" : 21,
    "concept-id" : "R2hT_88E_wx6",
    "matched-string" : "kartingenjör",
    "annotation-id" : 0
  }, {
    "preferred-label" : "Sverige",
    "type" : "country",
    "start-position" : 40,
    "end-position" : 48,
    "concept-id" : "i46j_HmG_v64",
    "matched-string" : "Sveriges",
    "annotation-id" : 10
  }, {
    "preferred-label" : "Kartingenjör",
    "sentiment" : "MUST_HAVE",
    "type" : "occupation-name",
    "start-position" : 327,
    "end-position" : 339,
    "concept-id" : "R2hT_88E_wx6",
    "matched-string" : "kartingenjör",
    "annotation-id" : 1
  }, {
    "preferred-label" : "Kontor",
    "sentiment" : "MUST_HAVE",
    "type" : "keyword",
    "start-position" : 371,
    "end-position" : 377,
    "concept-id" : "Hyz1_7HF_AkP",
    "matched-string" : "kontor",
    "annotation-id" : 2
  }, {
    "preferred-label" : "arbeta självständigt",
    "type" : "esco-skill",
    "start-position" : 399,
    "end-position" : 405,
    "concept-id" : "NyFu_HHd_zhz",
    "matched-string" : "arbete",
    "annotation-id" : 12
  }, {
    "preferred-label" : "arbeta självständigt",
    "type" : "esco-skill",
    "start-position" : 409,
    "end-position" : 422,
    "concept-id" : "NyFu_HHd_zhz",
    "matched-string" : "självständigt",
    "annotation-id" : 11
  }, {
    "preferred-label" : "Stockholm",
    "type" : "municipality",
    "start-position" : 511,
    "end-position" : 520,
    "concept-id" : "AvNB_uwa_6n6",
    "matched-string" : "Stockholm",
    "annotation-id" : 13
  }, {
    "preferred-label" : "Huddinge",
    "type" : "municipality",
    "start-position" : 525,
    "end-position" : 540,
    "concept-id" : "g1Gc_aXK_EKu",
    "matched-string" : "Huddinge kommun",
    "annotation-id" : 14
  }, {
    "preferred-label" : "Utsättning",
    "sentiment" : "MUST_HAVE",
    "type" : "skill",
    "start-position" : 671,
    "end-position" : 681,
    "concept-id" : "gdTC_3Eh_PMv",
    "matched-string" : "utsättning",
    "annotation-id" : 3
  }, {
    "preferred-label" : "Tillsvidareanställning (inkl. eventuell provanställning)",
    "type" : "employment-type",
    "start-position" : 1306,
    "end-position" : 1328,
    "concept-id" : "kpPX_CNN_gDU",
    "matched-string" : "tillsvidareanställning",
    "annotation-id" : 15
  }, {
    "preferred-label" : "Kartingenjör",
    "sentiment" : "MUST_HAVE",
    "type" : "occupation-name",
    "start-position" : 1637,
    "end-position" : 1649,
    "concept-id" : "R2hT_88E_wx6",
    "matched-string" : "kartingenjör",
    "annotation-id" : 4
  }, {
    "preferred-label" : "Geografiskt informationssystem/GIS",
    "sentiment" : "MUST_HAVE",
    "type" : "skill",
    "start-position" : 1730,
    "end-position" : 1733,
    "concept-id" : "CWfM_RL9_V4t",
    "matched-string" : "gis",
    "annotation-id" : 5
  }, {
    "preferred-label" : "Ständiga förbättringar/Lean",
    "sentiment" : "MUST_HAVE",
    "type" : "skill",
    "start-position" : 2079,
    "end-position" : 2083,
    "concept-id" : "74Mw_JUN_VKx",
    "matched-string" : "lean",
    "annotation-id" : 6
  }, {
    "preferred-label" : "arbeta självständigt",
    "type" : "esco-skill",
    "start-position" : 2211,
    "end-position" : 2224,
    "concept-id" : "NyFu_HHd_zhz",
    "matched-string" : "självständigt",
    "annotation-id" : 16
  }, {
    "preferred-label" : "Avfall",
    "sentiment" : "MUST_HAVE",
    "type" : "keyword",
    "start-position" : 2473,
    "end-position" : 2479,
    "concept-id" : "Kx4Q_7TA_MuR",
    "matched-string" : "avfall",
    "annotation-id" : 7
  }, {
    "preferred-label" : "Avfall",
    "sentiment" : "MUST_HAVE",
    "type" : "keyword",
    "start-position" : 3443,
    "end-position" : 3449,
    "concept-id" : "Kx4Q_7TA_MuR",
    "matched-string" : "avfall",
    "annotation-id" : 9
  } ],
  "text" : "Mät- och kartingenjör\nVill du arbeta på Sveriges största VA-bolag med spännande projekt och arbetsuppgifter i en lärande miljö? Då ska du söka tjänsten hos oss på enheten Geodata. Du kommer att få arbeta med inmätning och kartering av bolagets VA-nät med tillhörande anläggningar och sopsugar. \nOm rollen \nArbetet som Mät- och Kartingenjör innebär att du arbetar både på kontor och ute i fält. Ditt arbete är självständigt, där du ansvarar för olika typer av mät- och kartjobb. Ditt arbetsområde täcker in både Stockholm och Huddinge kommun, där du utgår från vårt huvudkontor i Ulvsunda. \nFör att trivas i den här rollen söker vi dig som: \nVill arbeta med inmätning och utsättning av vårt ledningsnät och anläggningar i fält\nVill arbeta med kartering av mätdata för att erhålla en uppdaterad ledningsnätsdatabas\nVill arbeta med inmätning och kartering av bolaget sopsugar\nVill jobba på en kreativ enhet med höga målsättningar och med fokus på utveckling- och förbättringsarbete\nGillar att jobba digitalt och via digitala tavlor för att visa hur arbetet fortgår\nKan sprida goda exempel till övriga delar av bolaget och fånga upp nya arbetssätt från omvärlden\n\n\n\nVi använder Leicas mätinstrument i det dagliga arbetet. Vi karterar i en ArcGIS-baserad VA-produkt som heter GEOSECMA Ledning VA. \nRollen är en tillsvidareanställning med placering i Ulvsunda, med tillträde enligt överenskommelse. Provanställning kan ev. vara aktuellt. \nI din tjänst kommer du arbeta med säkerhetsklassad information. Säkerhetsprövning och registerkontroll kommer därför att genomföras i samband med anställning.\nOm dig\nVi söker dig som är utbildad Mät- och Kartingenjör eller motsvarande med några års erfarenhet av mätning i fält och kartering i en GIS-baserad miljö. Vi ser gärna att du har några års erfarenhet av utredningsarbete, team- eller projekteldning och är van av att arbeta i en ArcGIS-miljö. B-körkort är ett krav för tjänsten. \nFör att kunna bidra till enhetens utveckling ser vi gärna att du är kreativ, lyhörd samt positiv till förändringar och teknisk utveckling. Vi jobbar enligt LEAN-filosofin, så det är en merit om du har erfarenhet av detta sätt att arbeta. Det är viktigt att du har förmåga att arbeta både självständigt och i grupp! \nI din roll kommer du få tillgång till olika utbildningar och fortlöpande få möjlighet att utvecklas internt. Hos oss finns mycket erfarenhet och kunskap - vi kommer hjälpa dig att lyckas med ditt uppdrag! \nOm oss\nStockholm Vatten och Avfall utvecklar och levererar vatten- och avfallstjänster som får vår fantastiska stad att fungera, växa och vara en plats där både människor och natur trivs. Tillsammans med invånare, företag och andra intressenter arbetar vi för att Stockholm ska bli världens mest hållbara stad.\nHos oss får du ett roligt och omväxlande jobb med intressanta arbetsuppgifter, duktiga kollegor och ett gott arbetsklimat. Du får goda anställningsvillkor, får jobba med digitala och flexibla arbetssätt, tillgång till kontinuerlig kompetensutveckling tillsammans med en rad hälsofrämjande fördelar. Läs mer om oss och träffa några av våra medarbetare på svoa.se/jobb\nAnsökan\nOm du tycker att du känner igen dig i beskrivningen och att jobbet ser intressant ut så ser vi fram emot din ansökan senast den 14 augusti 2022! \nFör ytterligare information om tjänsten kontaktar du enhetschef Marianne Isoz Henriksson genom att mejla: marianne.isoz-henriksson@svoa.se\nVi på Stockholm Vatten och Avfall ser fram emot din ansökan!"
}