{
  "meta" : {
    "jobad" : {
      "description" : {
        "requirements" : null,
        "needs" : null,
        "company_information" : null,
        "text_formatted" : "Trädgårdssäsongen 2022 närmar sig och vi på Hemfrid söker ytterligare erfarna, drivna och engagerade Trädgårdsmästare till vårt affärsområde Trädgårdsservice.\n\nHar du god erfarenhet inom trädgårdsskötsel och trivs i en roll där du dagligen får arbeta med ett engagerat team som ger kunden service i världsklass? Då är det just dig vi söker till denna spännande resa inom trädgårdsservice!\n\n\n\nOm oss\n\nHemfrid är Sveriges största företag inom hushållsnäratjänster. Vi hjälper våra kunder med helhetslösningen i hemmet med tjänster som trädgårdsservice, städning, fönsterputs, barnpassning, flyttservice, enklare hantverk och mycket annat. Vi ser till att våra kunder kan få en enklare vardag.\n\n\n\nDina arbetsuppgifter\n\nSom Trädgårdsmästare har du spetskompetensen inom trädgårdsskötsel, och kommer utföra trädgårdsarbeten från start till slut i våra kunders privata hem och bostadsrättsföreningar. Det kan även innefatta kundbesök för att ta fram offerter, planera skötsel och förbättringar av deras utemiljöer samt att kvalitetssäkra arbetet. Att ge våra kunder hög kvalité och hålla en hög servicenivå är en självklarhet.\n\nI dina arbetsuppgifter ingår bland annat:\n\n- Gräsklippning\n- Beskäring av fruktträd och häck\n- Vår-, sommar- och höstunderhåll\n- Plantering\n- Ogräsrensning\n- Bortforsling\n\n\nDet kommer att förekomma både engångsuppdrag samt återkommande skötseluppdrag.\n\n\n\nDin profil\n\nVi söker dig som är självständig, initiativrik och ansvarstagande. Vi tror att du har ett sätt att engagera ett team och besitter en positiv attityd inför varje uppdrag hos kund. Vi tror även att du är noggrann och punktligt, besitter en god fysik samt har ett stort intresse för trädgård och skötsel av utemiljöer.\n\nUtöver detta ser vi att du har:\n\n- Minst 2-årig utbildning inom trädgård eller motsvarande arbetslivserfarenhet\n- God erfarenhet av fruktträdsbeskärning samt häckbeskärning\n- God växtkunskap\n- Har B-körkort\n- Behärskar både svenska och engelska i tal och skrift\n- Erfarenhet av offertskrivning samt kundbesök\n- Meriterande om du besitter trädgårdsrelaterade utbildningar inom bl.a. design och växtkännedom\n- Meriterande med motorsågskörkort A+B, röjsågskörkort samt grönt kort i beskäring\n\n\nEn självklarhet är att du trivs utomhus och att jobba i alla väder. Du är inte rädd för att hugga i och lägga gärna ner extra energi och tid där det behövs.\n\n\n\nVi erbjuder\n\n- Säsongsarbete 100 % från april till oktober, med möjlighet till förlängning till november\n- Kollektivavtal\n- Gratis mobilabonnemang\n- Ansvarsförsäkring, sjukförsäkring, pensionsförsäkring och friskvårdsbidrag\n\n\n\nLåter detta som en drömtjänst för dig?\n\nVälkommen med din ansökan redan idag! Intervjuer sker löpande och vi önskar tillsätta snarast. Har du några frågor angående tjänsten eller vår rekryteringsprocess är du varmt välkommen att kontakta oss på rekrytering@hemfrid.se (mailto:rekrytering@hemfrid.se)Vi ser fram emot din ansökan, välkommen till Hemfrid!",
        "conditions" : "Heltid\r\nAnställningstid enligt överenskommelse",
        "text" : "Trädgårdssäsongen 2022 närmar sig och vi på Hemfrid söker ytterligare erfarna, drivna och engagerade Trädgårdsmästare till vårt affärsområde Trädgårdsservice.\n\nHar du god erfarenhet inom trädgårdsskötsel och trivs i en roll där du dagligen får arbeta med ett engagerat team som ger kunden service i världsklass? Då är det just dig vi söker till denna spännande resa inom trädgårdsservice!\n\n\n\nOm oss\n\nHemfrid är Sveriges största företag inom hushållsnäratjänster. Vi hjälper våra kunder med helhetslösningen i hemmet med tjänster som trädgårdsservice, städning, fönsterputs, barnpassning, flyttservice, enklare hantverk och mycket annat. Vi ser till att våra kunder kan få en enklare vardag.\n\n\n\nDina arbetsuppgifter\n\nSom Trädgårdsmästare har du spetskompetensen inom trädgårdsskötsel, och kommer utföra trädgårdsarbeten från start till slut i våra kunders privata hem och bostadsrättsföreningar. Det kan även innefatta kundbesök för att ta fram offerter, planera skötsel och förbättringar av deras utemiljöer samt att kvalitetssäkra arbetet. Att ge våra kunder hög kvalité och hålla en hög servicenivå är en självklarhet.\n\nI dina arbetsuppgifter ingår bland annat:\n\n- Gräsklippning\n- Beskäring av fruktträd och häck\n- Vår-, sommar- och höstunderhåll\n- Plantering\n- Ogräsrensning\n- Bortforsling\n\n\nDet kommer att förekomma både engångsuppdrag samt återkommande skötseluppdrag.\n\n\n\nDin profil\n\nVi söker dig som är självständig, initiativrik och ansvarstagande. Vi tror att du har ett sätt att engagera ett team och besitter en positiv attityd inför varje uppdrag hos kund. Vi tror även att du är noggrann och punktligt, besitter en god fysik samt har ett stort intresse för trädgård och skötsel av utemiljöer.\n\nUtöver detta ser vi att du har:\n\n- Minst 2-årig utbildning inom trädgård eller motsvarande arbetslivserfarenhet\n- God erfarenhet av fruktträdsbeskärning samt häckbeskärning\n- God växtkunskap\n- Har B-körkort\n- Behärskar både svenska och engelska i tal och skrift\n- Erfarenhet av offertskrivning samt kundbesök\n- Meriterande om du besitter trädgårdsrelaterade utbildningar inom bl.a. design och växtkännedom\n- Meriterande med motorsågskörkort A+B, röjsågskörkort samt grönt kort i beskäring\n\n\nEn självklarhet är att du trivs utomhus och att jobba i alla väder. Du är inte rädd för att hugga i och lägga gärna ner extra energi och tid där det behövs.\n\n\n\nVi erbjuder\n\n- Säsongsarbete 100 % från april till oktober, med möjlighet till förlängning till november\n- Kollektivavtal\n- Gratis mobilabonnemang\n- Ansvarsförsäkring, sjukförsäkring, pensionsförsäkring och friskvårdsbidrag\n\n\n\nLåter detta som en drömtjänst för dig?\n\nVälkommen med din ansökan redan idag! Intervjuer sker löpande och vi önskar tillsätta snarast. Har du några frågor angående tjänsten eller vår rekryteringsprocess är du varmt välkommen att kontakta oss på rekrytering@hemfrid.se (mailto:rekrytering@hemfrid.se)Vi ser fram emot din ansökan, välkommen till Hemfrid!"
      },
      "headline" : "Trädgårdsmästare - Hemfrid Stockholm",
      "driving_license" : null,
      "employer" : {
        "email" : null,
        "phone_number" : null,
        "organization_number" : "5565298444",
        "name" : "Hemfrid i Sverige AB",
        "url" : null,
        "workplace" : "Hemfrid"
      },
      "removed_date" : null,
      "logo_url" : "https://www.arbetsformedlingen.se/rest/arbetsgivare/rest/af/v3/organisation/5565298444/logotyper/logo.png",
      "last_publication_date" : "2022-08-31T23:59:59",
      "number_of_vacancies" : 1,
      "occupation" : {
        "concept_id" : "JZur_dmf_EPY",
        "label" : "Trädgårdsmästare, anläggning",
        "legacy_ams_taxonomy_id" : "4568"
      },
      "occupation_group" : {
        "concept_id" : "XBh3_Xrm_C4R",
        "label" : "Trädgårdsanläggare m.fl.",
        "legacy_ams_taxonomy_id" : "6113"
      },
      "employment_type" : {
        "concept_id" : "PFZr_Syz_cUq",
        "label" : "Vanlig anställning",
        "legacy_ams_taxonomy_id" : "1"
      },
      "webpage_url" : "https://arbetsformedlingen.se/platsbanken/annonser/26366889",
      "driving_license_required" : false,
      "application_contacts" : [ {
        "description" : "Selma Bjelkerud",
        "email" : "selma.bjelkerud@hemfrid.se",
        "telephone" : null,
        "name" : null,
        "contact_type" : null
      } ],
      "duration" : {
        "concept_id" : "a7uU_j21_mkL",
        "label" : "Tills vidare",
        "legacy_ams_taxonomy_id" : "1"
      },
      "nice_to_have" : {
        "education_level" : [ ],
        "work_experiences" : [ ],
        "skills" : [ ],
        "education" : [ ],
        "languages" : [ ]
      },
      "application_details" : {
        "via_af" : false,
        "email" : null,
        "other" : null,
        "reference" : null,
        "url" : "https://karriar.hemfrid.se/jobs/1493515-tradgardsmastare-hemfrid-stockholm?promotion=325050-arbetsformedlingen",
        "information" : null
      },
      "source_type" : "VIA_PLATSBANKEN_DXA",
      "application_deadline" : "2022-08-31T23:59:59",
      "external_id" : "46-556529-8444-1493515-27",
      "workplace_address" : {
        "coordinates" : [ 18.06858, 59.329323 ],
        "city" : null,
        "postcode" : null,
        "municipality" : "Stockholm",
        "region_concept_id" : "CifL_Rzy_Mku",
        "region" : "Stockholms län",
        "country_code" : "199",
        "region_code" : "01",
        "municipality_concept_id" : "AvNB_uwa_6n6",
        "country_concept_id" : "i46j_HmG_v64",
        "municipality_code" : "0180",
        "street_address" : null,
        "country" : "Sverige"
      },
      "id" : "26366889",
      "experience_required" : true,
      "working_hours_type" : {
        "concept_id" : "6YE1_gAC_R2G",
        "label" : "Heltid",
        "legacy_ams_taxonomy_id" : "1"
      },
      "access" : null,
      "timestamp" : 1659344987047,
      "must_have" : {
        "education_level" : [ ],
        "work_experiences" : [ {
          "concept_id" : "JZur_dmf_EPY",
          "weight" : 10,
          "label" : "Trädgårdsmästare, anläggning",
          "legacy_ams_taxonomy_id" : "4568"
        } ],
        "skills" : [ ],
        "education" : [ ],
        "languages" : [ ]
      },
      "occupation_field" : {
        "concept_id" : "VuuL_7CH_adj",
        "label" : "Naturbruk",
        "legacy_ams_taxonomy_id" : "13"
      },
      "scope_of_work" : {
        "min" : 100,
        "max" : 100
      },
      "salary_type" : {
        "concept_id" : "oG8G_9cW_nRf",
        "label" : "Fast månads- vecko- eller timlön",
        "legacy_ams_taxonomy_id" : "1"
      },
      "removed" : false,
      "salary_description" : "Lön enligt överenskommelse",
      "access_to_own_car" : false,
      "publication_date" : "2022-08-01T11:09:47"
    },
    "name" : "Trädgårdsmästare - Hemfrid Stockholm",
    "user" : "kristof.fischer"
  },
  "sha1" : "c618f4b9551bf5709a04bd864388abed20a5528a",
  "annotations" : [ {
    "preferred-label" : "Stockholm",
    "type" : "municipality",
    "start-position" : 27,
    "end-position" : 36,
    "concept-id" : "AvNB_uwa_6n6",
    "matched-string" : "Stockholm",
    "annotation-id" : 9
  }, {
    "preferred-label" : "Trädgårdsskötsel",
    "sentiment" : "MUST_HAVE",
    "type" : "skill",
    "start-position" : 224,
    "end-position" : 240,
    "concept-id" : "AAaS_o41_sEg",
    "matched-string" : "trädgårdsskötsel",
    "annotation-id" : 0
  }, {
    "preferred-label" : "Sverige",
    "type" : "country",
    "start-position" : 448,
    "end-position" : 456,
    "concept-id" : "i46j_HmG_v64",
    "matched-string" : "Sveriges",
    "annotation-id" : 10
  }, {
    "preferred-label" : "Trädgårdsmästare, anläggning",
    "type" : "occupation-name",
    "start-position" : 757,
    "end-position" : 773,
    "concept-id" : "JZur_dmf_EPY",
    "matched-string" : "Trädgårdsmästare",
    "annotation-id" : 11
  }, {
    "preferred-label" : "Trädgårdsskötsel",
    "sentiment" : "MUST_HAVE",
    "type" : "skill",
    "start-position" : 803,
    "end-position" : 819,
    "concept-id" : "AAaS_o41_sEg",
    "matched-string" : "trädgårdsskötsel",
    "annotation-id" : 12
  }, {
    "preferred-label" : "arbeta självständigt",
    "sentiment" : "MUST_HAVE",
    "type" : "esco-skill",
    "start-position" : 1446,
    "end-position" : 1458,
    "concept-id" : "NyFu_HHd_zhz",
    "matched-string" : "självständig",
    "annotation-id" : 13
  }, {
    "preferred-label" : "visa ansvarstagande",
    "sentiment" : "MUST_HAVE",
    "type" : "esco-skill",
    "start-position" : 1477,
    "end-position" : 1491,
    "concept-id" : "bcRp_hxV_f5G",
    "matched-string" : "ansvarstagande",
    "annotation-id" : 14
  }, {
    "preferred-label" : "noggrannhet",
    "sentiment" : "MUST_HAVE",
    "type" : "esco-skill",
    "start-position" : 1628,
    "end-position" : 1636,
    "concept-id" : "mrsW_EkL_KRD",
    "matched-string" : "noggrann",
    "annotation-id" : 15
  }, {
    "preferred-label" : "God fysik (tunga lyft)",
    "sentiment" : "MUST_HAVE",
    "type" : "skill",
    "start-position" : 1664,
    "end-position" : 1673,
    "concept-id" : "rwir_xvu_443",
    "matched-string" : "god fysik",
    "annotation-id" : 16
  }, {
    "preferred-label" : "Trädgård",
    "sentiment" : "MUST_HAVE",
    "type" : "sun-education-field-3",
    "start-position" : 1807,
    "end-position" : 1815,
    "concept-id" : "Vr5b_b9P_3mS",
    "matched-string" : "trädgård",
    "annotation-id" : 5
  }, {
    "preferred-label" : "beskära häckar och träd",
    "sentiment" : "MUST_HAVE",
    "type" : "esco-skill",
    "start-position" : 1875,
    "end-position" : 1895,
    "concept-id" : "GShq_Sut_Wp9",
    "matched-string" : "fruktträdsbeskärning",
    "annotation-id" : 17
  }, {
    "preferred-label" : "beskära häckar och träd",
    "sentiment" : "MUST_HAVE",
    "type" : "esco-skill",
    "start-position" : 1901,
    "end-position" : 1915,
    "concept-id" : "GShq_Sut_Wp9",
    "matched-string" : "häckbeskärning",
    "annotation-id" : 18
  }, {
    "preferred-label" : "blommor och växter",
    "sentiment" : "MUST_HAVE",
    "type" : "esco-skill",
    "start-position" : 1922,
    "end-position" : 1933,
    "concept-id" : "LqkW_6MP_FQG",
    "matched-string" : "växtkunskap",
    "annotation-id" : 19
  }, {
    "preferred-label" : "B",
    "sentiment" : "MUST_HAVE",
    "type" : "driving-licence",
    "start-position" : 1940,
    "end-position" : 1949,
    "concept-id" : "VTK8_WRx_GcM",
    "matched-string" : "B-körkort",
    "annotation-id" : 20
  }, {
    "preferred-label" : "Svenska",
    "sentiment" : "MUST_HAVE",
    "type" : "language",
    "start-position" : 1967,
    "end-position" : 1974,
    "concept-id" : "zSLA_vw2_FXN",
    "matched-string" : "svenska",
    "annotation-id" : 6
  }, {
    "preferred-label" : "Engelska",
    "sentiment" : "MUST_HAVE",
    "type" : "language",
    "start-position" : 1979,
    "end-position" : 1987,
    "concept-id" : "NVxJ_hLg_TYS",
    "matched-string" : "engelska",
    "annotation-id" : 7
  }, {
    "preferred-label" : "Trädgård",
    "sentiment" : "NICE_TO_HAVE",
    "type" : "sun-education-field-3",
    "start-position" : 2081,
    "end-position" : 2113,
    "concept-id" : "Vr5b_b9P_3mS",
    "matched-string" : "trädgårdsrelaterade utbildningar",
    "annotation-id" : 21
  }, {
    "preferred-label" : "Utbildning på motorsåg",
    "sentiment" : "NICE_TO_HAVE",
    "type" : "skill",
    "start-position" : 2167,
    "end-position" : 2187,
    "concept-id" : "ba8g_LRR_Sj2",
    "matched-string" : "motorsågskörkort A+B",
    "annotation-id" : 22
  }, {
    "preferred-label" : "Utbildning på röjsåg",
    "sentiment" : "NICE_TO_HAVE",
    "type" : "skill",
    "start-position" : 2189,
    "end-position" : 2203,
    "concept-id" : "6Rxx_zRM_Dqc",
    "matched-string" : "röjsågskörkort",
    "annotation-id" : 23
  }, {
    "preferred-label" : "Yrkesbevis, beskärning, trädvård",
    "sentiment" : "NICE_TO_HAVE",
    "type" : "skill",
    "start-position" : 2209,
    "end-position" : 2231,
    "concept-id" : "X51E_Edf_cfG",
    "matched-string" : "grönt kort i beskäring",
    "annotation-id" : 24
  }, {
    "preferred-label" : "Säsongsanställning",
    "type" : "employment-type",
    "start-position" : 2409,
    "end-position" : 2422,
    "concept-id" : "EBhX_Qm2_8eX",
    "matched-string" : "Säsongsarbete",
    "annotation-id" : 25
  }, {
    "preferred-label" : "Heltid",
    "type" : "worktime-extent",
    "start-position" : 2423,
    "end-position" : 2428,
    "concept-id" : "6YE1_gAC_R2G",
    "matched-string" : "100 %",
    "annotation-id" : 26
  } ],
  "text" : "Trädgårdsmästare - Hemfrid Stockholm\nTrädgårdssäsongen 2022 närmar sig och vi på Hemfrid söker ytterligare erfarna, drivna och engagerade Trädgårdsmästare till vårt affärsområde Trädgårdsservice.\n\nHar du god erfarenhet inom trädgårdsskötsel och trivs i en roll där du dagligen får arbeta med ett engagerat team som ger kunden service i världsklass? Då är det just dig vi söker till denna spännande resa inom trädgårdsservice!\n\n\n\nOm oss\n\nHemfrid är Sveriges största företag inom hushållsnäratjänster. Vi hjälper våra kunder med helhetslösningen i hemmet med tjänster som trädgårdsservice, städning, fönsterputs, barnpassning, flyttservice, enklare hantverk och mycket annat. Vi ser till att våra kunder kan få en enklare vardag.\n\n\n\nDina arbetsuppgifter\n\nSom Trädgårdsmästare har du spetskompetensen inom trädgårdsskötsel, och kommer utföra trädgårdsarbeten från start till slut i våra kunders privata hem och bostadsrättsföreningar. Det kan även innefatta kundbesök för att ta fram offerter, planera skötsel och förbättringar av deras utemiljöer samt att kvalitetssäkra arbetet. Att ge våra kunder hög kvalité och hålla en hög servicenivå är en självklarhet.\n\nI dina arbetsuppgifter ingår bland annat:\n\n- Gräsklippning\n- Beskäring av fruktträd och häck\n- Vår-, sommar- och höstunderhåll\n- Plantering\n- Ogräsrensning\n- Bortforsling\n\n\nDet kommer att förekomma både engångsuppdrag samt återkommande skötseluppdrag.\n\n\n\nDin profil\n\nVi söker dig som är självständig, initiativrik och ansvarstagande. Vi tror att du har ett sätt att engagera ett team och besitter en positiv attityd inför varje uppdrag hos kund. Vi tror även att du är noggrann och punktligt, besitter en god fysik samt har ett stort intresse för trädgård och skötsel av utemiljöer.\n\nUtöver detta ser vi att du har:\n\n- Minst 2-årig utbildning inom trädgård eller motsvarande arbetslivserfarenhet\n- God erfarenhet av fruktträdsbeskärning samt häckbeskärning\n- God växtkunskap\n- Har B-körkort\n- Behärskar både svenska och engelska i tal och skrift\n- Erfarenhet av offertskrivning samt kundbesök\n- Meriterande om du besitter trädgårdsrelaterade utbildningar inom bl.a. design och växtkännedom\n- Meriterande med motorsågskörkort A+B, röjsågskörkort samt grönt kort i beskäring\n\n\nEn självklarhet är att du trivs utomhus och att jobba i alla väder. Du är inte rädd för att hugga i och lägga gärna ner extra energi och tid där det behövs.\n\n\n\nVi erbjuder\n\n- Säsongsarbete 100 % från april till oktober, med möjlighet till förlängning till november\n- Kollektivavtal\n- Gratis mobilabonnemang\n- Ansvarsförsäkring, sjukförsäkring, pensionsförsäkring och friskvårdsbidrag\n\n\n\nLåter detta som en drömtjänst för dig?\n\nVälkommen med din ansökan redan idag! Intervjuer sker löpande och vi önskar tillsätta snarast. Har du några frågor angående tjänsten eller vår rekryteringsprocess är du varmt välkommen att kontakta oss på rekrytering@hemfrid.se (mailto:rekrytering@hemfrid.se)Vi ser fram emot din ansökan, välkommen till Hemfrid!"
}