{
  "meta" : {
    "jobad" : {
      "description" : {
        "requirements" : null,
        "needs" : null,
        "company_information" : null,
        "text_formatted" : "Nu söker vi vikarierande köksbiträden till små och stora förskolor samt skolor i Stockholm. Du kommer att jobba enstaka pass på olika platser eller hoppa på längre vikariat på en och samma plats.\n\nVi söker dig som har fullgjord gymnasieutbildning eller motsvarande utbildning. Du har minst ett års dokumenterad erfarenhet av att ha jobbat i storkök eller skolrestaurang.\n\nDu är är social och trevlig, ansvarstagande och organiserad. Du trivs att arbeta hos olika kunder både i kortare perioder samt vid längre vikariat. Du gillar ditt arbete och du har lätt för att jobba med nya människor i olika miljöer.\n\nFör denna tjänst är det ett krav att du talar flytande svenska samt att du kan uppvisa diplom för genomförd utbildning inom HACCP eller livsmedelshygien.\n\nUrval och intervjuer sker löpande och tjänsten kan komma att tillsättas före sista ansökningsdag. Observera att tjänsten är en behovsanställning.\n\nRestaurangAssistans är Sveriges största bemanningsföretag inom Hotell och Restaurang med kontor i Stockholm, Malmö, Göteborg och Oslo. RestaurangAssistans är ett auktoriserat bemanningsföretag och vi har kollektivavtal med HRF/Visita. Våra kunder är allt från erkänt bra innerstadskrogar och guldkantade galor till rikstäckande hotell- och företagsrestauranger, konferensanläggningar, kursgårdar och cateringföretag.\n\nAnsök endast via länken nedan. Vi tar inte emot ansökningar via epost eller telefon.",
        "conditions" : "Deltid\r\nAnställning för enstaka dagar",
        "text" : "Nu söker vi vikarierande köksbiträden till små och stora förskolor samt skolor i Stockholm. Du kommer att jobba enstaka pass på olika platser eller hoppa på längre vikariat på en och samma plats.\n\nVi söker dig som har fullgjord gymnasieutbildning eller motsvarande utbildning. Du har minst ett års dokumenterad erfarenhet av att ha jobbat i storkök eller skolrestaurang.\n\nDu är är social och trevlig, ansvarstagande och organiserad. Du trivs att arbeta hos olika kunder både i kortare perioder samt vid längre vikariat. Du gillar ditt arbete och du har lätt för att jobba med nya människor i olika miljöer.\n\nFör denna tjänst är det ett krav att du talar flytande svenska samt att du kan uppvisa diplom för genomförd utbildning inom HACCP eller livsmedelshygien.\n\nUrval och intervjuer sker löpande och tjänsten kan komma att tillsättas före sista ansökningsdag. Observera att tjänsten är en behovsanställning.\n\nRestaurangAssistans är Sveriges största bemanningsföretag inom Hotell och Restaurang med kontor i Stockholm, Malmö, Göteborg och Oslo. RestaurangAssistans är ett auktoriserat bemanningsföretag och vi har kollektivavtal med HRF/Visita. Våra kunder är allt från erkänt bra innerstadskrogar och guldkantade galor till rikstäckande hotell- och företagsrestauranger, konferensanläggningar, kursgårdar och cateringföretag.\n\nAnsök endast via länken nedan. Vi tar inte emot ansökningar via epost eller telefon."
      },
      "headline" : "Köksbiträde till skola och förskola",
      "driving_license" : null,
      "employer" : {
        "email" : null,
        "phone_number" : null,
        "organization_number" : "5565545828",
        "name" : "Restaurang Assistans i Skandinavien AB",
        "url" : "https://www.restaurangassistans.se/",
        "workplace" : "RestaurangAssistans"
      },
      "removed_date" : null,
      "logo_url" : "https://www.arbetsformedlingen.se/rest/arbetsgivare/rest/af/v3/organisation/5565545828/logotyper/logo.png",
      "last_publication_date" : "2022-09-30T23:59:59",
      "number_of_vacancies" : 1,
      "occupation" : {
        "concept_id" : "oRB5_b7i_Qzv",
        "label" : "Köksbiträde",
        "legacy_ams_taxonomy_id" : "483"
      },
      "occupation_group" : {
        "concept_id" : "tPox_ie4_X9X",
        "label" : "Restaurang- och köksbiträden m.fl.",
        "legacy_ams_taxonomy_id" : "9412"
      },
      "employment_type" : {
        "concept_id" : "PFZr_Syz_cUq",
        "label" : "Vanlig anställning",
        "legacy_ams_taxonomy_id" : "1"
      },
      "webpage_url" : "https://arbetsformedlingen.se/platsbanken/annonser/26389274",
      "driving_license_required" : false,
      "application_contacts" : [ {
        "description" : "Charlie Ekman",
        "email" : "charlie.ekman@restaurangassistans.se",
        "telephone" : "08 22 40 66",
        "name" : null,
        "contact_type" : null
      } ],
      "duration" : {
        "concept_id" : "a7uU_j21_mkL",
        "label" : "Tills vidare",
        "legacy_ams_taxonomy_id" : "1"
      },
      "nice_to_have" : {
        "education_level" : [ ],
        "work_experiences" : [ ],
        "skills" : [ ],
        "education" : [ ],
        "languages" : [ ]
      },
      "application_details" : {
        "via_af" : false,
        "email" : null,
        "other" : null,
        "reference" : null,
        "url" : "https://jobb.restaurangassistans.se/jobs/1088219-koksbitrade-till-skola-och-forskola?promotion=211476-arbetsformedlingen",
        "information" : null
      },
      "source_type" : "VIA_PLATSBANKEN_DXA",
      "application_deadline" : "2022-09-30T23:59:59",
      "external_id" : "46-556554-5828-1088219-91",
      "workplace_address" : {
        "coordinates" : [ 18.06858, 59.329323 ],
        "city" : null,
        "postcode" : null,
        "municipality" : "Stockholm",
        "region_concept_id" : "CifL_Rzy_Mku",
        "region" : "Stockholms län",
        "country_code" : "199",
        "region_code" : "01",
        "municipality_concept_id" : "AvNB_uwa_6n6",
        "country_concept_id" : "i46j_HmG_v64",
        "municipality_code" : "0180",
        "street_address" : null,
        "country" : "Sverige"
      },
      "id" : "26389274",
      "experience_required" : true,
      "working_hours_type" : {
        "concept_id" : "947z_JGS_Uk2",
        "label" : "Deltid",
        "legacy_ams_taxonomy_id" : "2"
      },
      "access" : null,
      "timestamp" : 1660027094986,
      "must_have" : {
        "education_level" : [ ],
        "work_experiences" : [ {
          "concept_id" : "oRB5_b7i_Qzv",
          "weight" : 10,
          "label" : "Köksbiträde",
          "legacy_ams_taxonomy_id" : "483"
        } ],
        "skills" : [ ],
        "education" : [ ],
        "languages" : [ ]
      },
      "occupation_field" : {
        "concept_id" : "ScKy_FHB_7wT",
        "label" : "Hotell, restaurang, storhushåll",
        "legacy_ams_taxonomy_id" : "7"
      },
      "scope_of_work" : {
        "min" : 0,
        "max" : 100
      },
      "salary_type" : {
        "concept_id" : "oG8G_9cW_nRf",
        "label" : "Fast månads- vecko- eller timlön",
        "legacy_ams_taxonomy_id" : "1"
      },
      "removed" : false,
      "salary_description" : "Lön enligt överenskommelse",
      "access_to_own_car" : false,
      "publication_date" : "2022-08-09T08:38:14"
    },
    "name" : "Köksbiträde till skola och förskola",
    "user" : "hannes"
  },
  "sha1" : "c6371ad42bf1b0b4a68fa7121bc6f3cb3e0ff629",
  "annotations" : [ {
    "preferred-label" : "Köksbiträde",
    "sentiment" : "MUST_HAVE",
    "type" : "occupation-name",
    "start-position" : 0,
    "end-position" : 11,
    "concept-id" : "oRB5_b7i_Qzv",
    "matched-string" : "köksbiträde",
    "annotation-id" : 0
  }, {
    "preferred-label" : "Förskola",
    "sentiment" : "MUST_HAVE",
    "type" : "sun-education-level-3",
    "start-position" : 27,
    "end-position" : 35,
    "concept-id" : "p3Nu_zzc_L7T",
    "matched-string" : "förskola",
    "annotation-id" : 1
  }, {
    "preferred-label" : "Vikariat",
    "type" : "employment-type",
    "start-position" : 48,
    "end-position" : 60,
    "concept-id" : "gro4_cWF_6D7",
    "matched-string" : "vikarierande",
    "annotation-id" : 9
  }, {
    "preferred-label" : "Köksbiträde",
    "type" : "occupation-name",
    "start-position" : 61,
    "end-position" : 73,
    "concept-id" : "oRB5_b7i_Qzv",
    "matched-string" : "köksbiträden",
    "annotation-id" : 10
  }, {
    "preferred-label" : "Stockholm",
    "type" : "municipality",
    "start-position" : 117,
    "end-position" : 126,
    "concept-id" : "AvNB_uwa_6n6",
    "matched-string" : "Stockholm",
    "annotation-id" : 11
  }, {
    "preferred-label" : "Vikariat",
    "type" : "employment-type",
    "start-position" : 200,
    "end-position" : 208,
    "concept-id" : "gro4_cWF_6D7",
    "matched-string" : "vikariat",
    "annotation-id" : 14
  }, {
    "preferred-label" : "Gymnasial utbildning",
    "type" : "sun-education-level-1",
    "start-position" : 264,
    "end-position" : 282,
    "concept-id" : "wyLL_K3a_HRC",
    "matched-string" : "gymnasieutbildning",
    "annotation-id" : 12
  }, {
    "preferred-label" : "1-2 års erfarenhet",
    "type" : "occupation-experience-year",
    "start-position" : 326,
    "end-position" : 333,
    "concept-id" : "LLnd_5GJ_4ju",
    "matched-string" : "ett års",
    "annotation-id" : 16
  }, {
    "preferred-label" : "1-2 års erfarenhet",
    "type" : "occupation-experience-year",
    "start-position" : 347,
    "end-position" : 357,
    "concept-id" : "LLnd_5GJ_4ju",
    "matched-string" : "erfarenhet",
    "annotation-id" : 15
  }, {
    "preferred-label" : "Storkök",
    "sentiment" : "MUST_HAVE",
    "type" : "skill",
    "start-position" : 377,
    "end-position" : 384,
    "concept-id" : "GQ9R_2Za_Awt",
    "matched-string" : "storkök",
    "annotation-id" : 2
  }, {
    "preferred-label" : "visa ansvarstagande",
    "type" : "esco-skill",
    "start-position" : 437,
    "end-position" : 451,
    "concept-id" : "bcRp_hxV_f5G",
    "matched-string" : "ansvarstagande",
    "annotation-id" : 13
  }, {
    "preferred-label" : "Vikariat",
    "type" : "employment-type",
    "start-position" : 546,
    "end-position" : 554,
    "concept-id" : "gro4_cWF_6D7",
    "matched-string" : "vikariat",
    "annotation-id" : 17
  }, {
    "preferred-label" : "Svenska",
    "sentiment" : "MUST_HAVE",
    "type" : "language",
    "start-position" : 699,
    "end-position" : 706,
    "concept-id" : "zSLA_vw2_FXN",
    "matched-string" : "svenska",
    "annotation-id" : 3
  }, {
    "preferred-label" : "Livsmedelshygien",
    "sentiment" : "MUST_HAVE",
    "type" : "skill",
    "start-position" : 780,
    "end-position" : 796,
    "concept-id" : "kj4Q_nLh_u8Q",
    "matched-string" : "livsmedelshygien",
    "annotation-id" : 4
  }, {
    "preferred-label" : "Behovsanställning",
    "type" : "employment-type",
    "start-position" : 926,
    "end-position" : 943,
    "concept-id" : "1paU_aCR_nGn",
    "matched-string" : "behovsanställning",
    "annotation-id" : 18
  }, {
    "preferred-label" : "Hotell och restaurang",
    "sentiment" : "MUST_HAVE",
    "type" : "keyword",
    "start-position" : 1009,
    "end-position" : 1030,
    "concept-id" : "F5kB_F4h_yc5",
    "matched-string" : "hotell och restaurang",
    "annotation-id" : 5
  }, {
    "preferred-label" : "Kontor",
    "sentiment" : "MUST_HAVE",
    "type" : "keyword",
    "start-position" : 1035,
    "end-position" : 1041,
    "concept-id" : "Hyz1_7HF_AkP",
    "matched-string" : "kontor",
    "annotation-id" : 6
  }, {
    "preferred-label" : "Kollektivavtal",
    "sentiment" : "MUST_HAVE",
    "type" : "skill",
    "start-position" : 1150,
    "end-position" : 1164,
    "concept-id" : "z7wE_9xb_3jX",
    "matched-string" : "kollektivavtal",
    "annotation-id" : 7
  }, {
    "preferred-label" : "Hotell",
    "sentiment" : "MUST_HAVE",
    "type" : "keyword",
    "start-position" : 1274,
    "end-position" : 1280,
    "concept-id" : "Jrrg_iiS_2yp",
    "matched-string" : "hotell",
    "annotation-id" : 8
  } ],
  "text" : "Köksbiträde till skola och förskola\nNu söker vi vikarierande köksbiträden till små och stora förskolor samt skolor i Stockholm. Du kommer att jobba enstaka pass på olika platser eller hoppa på längre vikariat på en och samma plats.\n\nVi söker dig som har fullgjord gymnasieutbildning eller motsvarande utbildning. Du har minst ett års dokumenterad erfarenhet av att ha jobbat i storkök eller skolrestaurang.\n\nDu är är social och trevlig, ansvarstagande och organiserad. Du trivs att arbeta hos olika kunder både i kortare perioder samt vid längre vikariat. Du gillar ditt arbete och du har lätt för att jobba med nya människor i olika miljöer.\n\nFör denna tjänst är det ett krav att du talar flytande svenska samt att du kan uppvisa diplom för genomförd utbildning inom HACCP eller livsmedelshygien.\n\nUrval och intervjuer sker löpande och tjänsten kan komma att tillsättas före sista ansökningsdag. Observera att tjänsten är en behovsanställning.\n\nRestaurangAssistans är Sveriges största bemanningsföretag inom Hotell och Restaurang med kontor i Stockholm, Malmö, Göteborg och Oslo. RestaurangAssistans är ett auktoriserat bemanningsföretag och vi har kollektivavtal med HRF/Visita. Våra kunder är allt från erkänt bra innerstadskrogar och guldkantade galor till rikstäckande hotell- och företagsrestauranger, konferensanläggningar, kursgårdar och cateringföretag.\n\nAnsök endast via länken nedan. Vi tar inte emot ansökningar via epost eller telefon."
}