{
  "meta" : {
    "jobad" : {
      "description" : {
        "requirements" : null,
        "needs" : null,
        "company_information" : null,
        "text_formatted" : "Om tjänsten\nNu söker vi en noggrann slipare till vår kund i Laholm.\nHar du tidigare erfarenhet av arbete i verkstad är du kanske rätt person för tjänsten. Arbetet kommer vara vid en manuell slipmaskin där man utför slipning av verktyg. \n\nStart: Omgående \nArbetstid: Dagtid\n\nDin profil\nÖnskemål/ krav \n\n*Tidigare industri/verkstadsvana. \n* Grundläggande kunskaper i ritningsläsning.\n\nSom person vill vi att du är ansvarstagande, målinriktad, flexibel, positiv, ordningsam och har en god samarbetsförmåga eftersom arbetet sker ute hos våra kunder.\nVi arbetar löpande med inkomna ansökningar och kontaktar endast de som motsvarar ansökningskraven.\n\nVälkommen med din ansökan idag!\n\nOm Ikett Personalpartner AB\nIkett Personalpartner AB är ett auktoriserat bemanningsföretag som arbetar med uthyrning och rekrytering av kvalificerad kollektivpersonal och tjänstemän. Främst inom yrkesområdena industri, el, bygg och administration. \n\nSom konsult hos Ikett har du möjligheten att söka lokala arbeten och researbeten i Sverige samt Norge. Vi arbetar kontinuerligt för att du och kunden ska trivas så bra som möjligt med varandra och för att era önskemål ska tillgodoses. \n\nIkett är medlem i Almega Kompetensföretagen och har kollektivavtal med LO, Unionen och Akademikerförbunden. Ikett är certifierat enligt ISO 9001.\n\nMålet med vårt arbete är nöjda kunder och skickliga medarbetare som trivs. Detta vill vi uppnå genom kvalitet, kompetens och effektivitet.\n\nFör mer information och nyheter, följ oss gärna på: \nFacebook: www.facebook.com/ikettpersonalpartner \nLinkedIn: www.linkedin.com/company/ikett-personalpartner-ab-as",
        "conditions" : "Heltid\r\nTillsvidare",
        "text" : "Om tjänsten\nNu söker vi en noggrann slipare till vår kund i Laholm.\nHar du tidigare erfarenhet av arbete i verkstad är du kanske rätt person för tjänsten. Arbetet kommer vara vid en manuell slipmaskin där man utför slipning av verktyg. \n\nStart: Omgående \nArbetstid: Dagtid\n\nDin profil\nÖnskemål/ krav \n\n*Tidigare industri/verkstadsvana. \n* Grundläggande kunskaper i ritningsläsning.\n\nSom person vill vi att du är ansvarstagande, målinriktad, flexibel, positiv, ordningsam och har en god samarbetsförmåga eftersom arbetet sker ute hos våra kunder.\nVi arbetar löpande med inkomna ansökningar och kontaktar endast de som motsvarar ansökningskraven.\n\nVälkommen med din ansökan idag!\n\nOm Ikett Personalpartner AB\nIkett Personalpartner AB är ett auktoriserat bemanningsföretag som arbetar med uthyrning och rekrytering av kvalificerad kollektivpersonal och tjänstemän. Främst inom yrkesområdena industri, el, bygg och administration. \n\nSom konsult hos Ikett har du möjligheten att söka lokala arbeten och researbeten i Sverige samt Norge. Vi arbetar kontinuerligt för att du och kunden ska trivas så bra som möjligt med varandra och för att era önskemål ska tillgodoses. \n\nIkett är medlem i Almega Kompetensföretagen och har kollektivavtal med LO, Unionen och Akademikerförbunden. Ikett är certifierat enligt ISO 9001.\n\nMålet med vårt arbete är nöjda kunder och skickliga medarbetare som trivs. Detta vill vi uppnå genom kvalitet, kompetens och effektivitet.\n\nFör mer information och nyheter, följ oss gärna på: \nFacebook: www.facebook.com/ikettpersonalpartner \nLinkedIn: www.linkedin.com/company/ikett-personalpartner-ab-as"
      },
      "headline" : "Slipare ",
      "driving_license" : [ {
        "concept_id" : "VTK8_WRx_GcM",
        "label" : "B",
        "legacy_ams_taxonomy_id" : "3"
      } ],
      "employer" : {
        "email" : null,
        "phone_number" : null,
        "organization_number" : "5562711134",
        "name" : "Ikett Personalpartner AB",
        "url" : "http://www.ikett.com/",
        "workplace" : "Ikett Personalpartner AB"
      },
      "removed_date" : null,
      "logo_url" : "https://www.arbetsformedlingen.se/rest/arbetsgivare/rest/af/v3/organisation/5562711134/logotyper/logo.png",
      "last_publication_date" : "2022-08-07T23:59:59",
      "number_of_vacancies" : 1,
      "occupation" : {
        "concept_id" : "XzvX_AHE_ECV",
        "label" : "Slipare, metall",
        "legacy_ams_taxonomy_id" : "5933"
      },
      "occupation_group" : {
        "concept_id" : "4bxV_58E_P9N",
        "label" : "Slipare m.fl.",
        "legacy_ams_taxonomy_id" : "7224"
      },
      "employment_type" : {
        "concept_id" : "PFZr_Syz_cUq",
        "label" : "Vanlig anställning",
        "legacy_ams_taxonomy_id" : "1"
      },
      "webpage_url" : "https://arbetsformedlingen.se/platsbanken/annonser/26313131",
      "driving_license_required" : true,
      "application_contacts" : [ {
        "description" : "Elin  Voss",
        "email" : "elin.voss@ikett.com",
        "telephone" : null,
        "name" : null,
        "contact_type" : null
      } ],
      "duration" : {
        "concept_id" : "a7uU_j21_mkL",
        "label" : "Tills vidare",
        "legacy_ams_taxonomy_id" : "1"
      },
      "nice_to_have" : {
        "education_level" : [ ],
        "work_experiences" : [ ],
        "skills" : [ ],
        "education" : [ ],
        "languages" : [ ]
      },
      "application_details" : {
        "via_af" : false,
        "email" : null,
        "other" : null,
        "reference" : "14727",
        "url" : "https://www.ikett.com/lediga-jobb?jaid=14727",
        "information" : null
      },
      "source_type" : "VIA_PLATSBANKEN_DXA",
      "application_deadline" : "2022-08-07T23:59:59",
      "external_id" : "46-556271-1134-14727",
      "workplace_address" : {
        "coordinates" : [ 13.045605, 56.505756 ],
        "city" : null,
        "postcode" : null,
        "municipality" : "Laholm",
        "region_concept_id" : "wjee_qH2_yb6",
        "region" : "Hallands län",
        "country_code" : "199",
        "region_code" : "13",
        "municipality_concept_id" : "c1iL_rqh_Zja",
        "country_concept_id" : "i46j_HmG_v64",
        "municipality_code" : "1381",
        "street_address" : null,
        "country" : "Sverige"
      },
      "id" : "26313131",
      "experience_required" : true,
      "working_hours_type" : {
        "concept_id" : "6YE1_gAC_R2G",
        "label" : "Heltid",
        "legacy_ams_taxonomy_id" : "1"
      },
      "access" : null,
      "timestamp" : 1657519298094,
      "must_have" : {
        "education_level" : [ ],
        "work_experiences" : [ {
          "concept_id" : "XzvX_AHE_ECV",
          "weight" : 10,
          "label" : "Slipare, metall",
          "legacy_ams_taxonomy_id" : "5933"
        } ],
        "skills" : [ ],
        "education" : [ ],
        "languages" : [ ]
      },
      "occupation_field" : {
        "concept_id" : "wTEr_CBC_bqh",
        "label" : "Industriell tillverkning",
        "legacy_ams_taxonomy_id" : "9"
      },
      "scope_of_work" : {
        "min" : 100,
        "max" : 100
      },
      "salary_type" : {
        "concept_id" : "oG8G_9cW_nRf",
        "label" : "Fast månads- vecko- eller timlön",
        "legacy_ams_taxonomy_id" : "1"
      },
      "removed" : false,
      "salary_description" : "Fast lön",
      "access_to_own_car" : false,
      "publication_date" : "2022-07-11T08:01:38"
    },
    "name" : "Slipare ",
    "user" : "hannes"
  },
  "sha1" : "2b6f726f67ded62f3ff79540608978a1ef12e955",
  "annotations" : [ {
    "preferred-label" : "Slipare m.fl.",
    "type" : "ssyk-level-4",
    "start-position" : 0,
    "end-position" : 7,
    "concept-id" : "4bxV_58E_P9N",
    "matched-string" : "Slipare",
    "annotation-id" : 5
  }, {
    "preferred-label" : "noggrannhet",
    "type" : "esco-skill",
    "start-position" : 36,
    "end-position" : 44,
    "concept-id" : "mrsW_EkL_KRD",
    "matched-string" : "noggrann",
    "annotation-id" : 6
  }, {
    "preferred-label" : "Slipare m.fl.",
    "type" : "ssyk-level-4",
    "start-position" : 45,
    "end-position" : 52,
    "concept-id" : "4bxV_58E_P9N",
    "matched-string" : "slipare",
    "annotation-id" : 7
  }, {
    "preferred-label" : "Laholm",
    "type" : "municipality",
    "start-position" : 69,
    "end-position" : 75,
    "concept-id" : "c1iL_rqh_Zja",
    "matched-string" : "Laholm",
    "annotation-id" : 8
  }, {
    "preferred-label" : "Verktyg",
    "sentiment" : "MUST_HAVE",
    "type" : "skill",
    "start-position" : 236,
    "end-position" : 243,
    "concept-id" : "KG9j_WxP_ym2",
    "matched-string" : "verktyg",
    "annotation-id" : 0
  }, {
    "preferred-label" : "Ritningsläsning",
    "sentiment" : "MUST_HAVE",
    "type" : "skill",
    "start-position" : 374,
    "end-position" : 389,
    "concept-id" : "aHCV_VsV_LiD",
    "matched-string" : "ritningsläsning",
    "annotation-id" : 1
  }, {
    "preferred-label" : "visa ansvarstagande",
    "type" : "esco-skill",
    "start-position" : 421,
    "end-position" : 435,
    "concept-id" : "bcRp_hxV_f5G",
    "matched-string" : "ansvarstagande",
    "annotation-id" : 9
  }, {
    "preferred-label" : "Kollektivavtal",
    "sentiment" : "MUST_HAVE",
    "type" : "skill",
    "start-position" : 1227,
    "end-position" : 1241,
    "concept-id" : "z7wE_9xb_3jX",
    "matched-string" : "kollektivavtal",
    "annotation-id" : 2
  } ],
  "text" : "Slipare \nOm tjänsten\nNu söker vi en noggrann slipare till vår kund i Laholm.\nHar du tidigare erfarenhet av arbete i verkstad är du kanske rätt person för tjänsten. Arbetet kommer vara vid en manuell slipmaskin där man utför slipning av verktyg. \n\nStart: Omgående \nArbetstid: Dagtid\n\nDin profil\nÖnskemål/ krav \n\n*Tidigare industri/verkstadsvana. \n* Grundläggande kunskaper i ritningsläsning.\n\nSom person vill vi att du är ansvarstagande, målinriktad, flexibel, positiv, ordningsam och har en god samarbetsförmåga eftersom arbetet sker ute hos våra kunder.\nVi arbetar löpande med inkomna ansökningar och kontaktar endast de som motsvarar ansökningskraven.\n\nVälkommen med din ansökan idag!\n\nOm Ikett Personalpartner AB\nIkett Personalpartner AB är ett auktoriserat bemanningsföretag som arbetar med uthyrning och rekrytering av kvalificerad kollektivpersonal och tjänstemän. Främst inom yrkesområdena industri, el, bygg och administration. \n\nSom konsult hos Ikett har du möjligheten att söka lokala arbeten och researbeten i Sverige samt Norge. Vi arbetar kontinuerligt för att du och kunden ska trivas så bra som möjligt med varandra och för att era önskemål ska tillgodoses. \n\nIkett är medlem i Almega Kompetensföretagen och har kollektivavtal med LO, Unionen och Akademikerförbunden. Ikett är certifierat enligt ISO 9001.\n\nMålet med vårt arbete är nöjda kunder och skickliga medarbetare som trivs. Detta vill vi uppnå genom kvalitet, kompetens och effektivitet.\n\nFör mer information och nyheter, följ oss gärna på: \nFacebook: www.facebook.com/ikettpersonalpartner \nLinkedIn: www.linkedin.com/company/ikett-personalpartner-ab-as"
}