{
  "meta" : {
    "jobad" : {
      "description" : {
        "requirements" : null,
        "needs" : null,
        "company_information" : null,
        "text_formatted" : "<p><strong>Veterangig söker Trädgårdsveteraner till vårt populära affärsområde Träd &amp; Trädgård. </strong></p><p><strong>Veterangig </strong>söker just nu ett flertal Arborister/Trädvårdare till vår uthyrningsverksamhet<strong>. </strong></p><p>Vi levererar<strong> </strong>våra tjänster i Botkyrka, Salem, Huddinge, Haninge, Tyresö, samt <strong>Stockholmskommuns</strong> södra<strong> </strong>förorter som Älvsjö, Farsta, Hägersten, Skärholmen och Enskede.</p><p><strong>Vill du vara med?</strong></p><p>För att bli en i gänget behöver du vara 55år eller äldre och det gör absolut ingenting om du är pensionär.</p><p><br></p><p><strong>Uppdraget:</strong></p><p>Vi jobba nästan alltid i team om 2 veteraner och tar oss an uppdrag inom det mesta när det gäller trädgårdsarbete. Från enklare vårstädningar till större planterings uppdrag. Beskärning av häckar och fruktträd. Vi klipper allt från små syrenbuskar till oändligt långa amerikanska hagtornshäckar.</p><p><br></p><p><strong>Utbildningar: </strong></p><p>Vi har och köper in kurser löpande.   </p><p><br></p><p><strong>Villkor: </strong></p><p>Hos oss jobbar du helt på dina egna villkor. Du tar precis så stora eller små uppdrag du orkar med samt när du vill att det ska utföras. Möjlighet att lära nya angränsande trädgårdsområden finns då våra Trädgårdsmästare gärna har med sig en lärling/elev på sina uppdrag.</p><p>Kollektivavtals enliga löner och arbetsvillkor ligger till grund hur vi jobbar.</p><p><br></p>",
        "conditions" : null,
        "text" : "Veterangig söker Trädgårdsveteraner till vårt populära affärsområde Träd & Trädgård. \nVeterangig söker just nu ett flertal Arborister/Trädvårdare till vår uthyrningsverksamhet. \nVi levererar våra tjänster i Botkyrka, Salem, Huddinge, Haninge, Tyresö, samt Stockholmskommuns södra förorter som Älvsjö, Farsta, Hägersten, Skärholmen och Enskede.\nVill du vara med?\nFör att bli en i gänget behöver du vara 55år eller äldre och det gör absolut ingenting om du är pensionär.\n\n\nUppdraget:\nVi jobba nästan alltid i team om 2 veteraner och tar oss an uppdrag inom det mesta när det gäller trädgårdsarbete. Från enklare vårstädningar till större planterings uppdrag. Beskärning av häckar och fruktträd. Vi klipper allt från små syrenbuskar till oändligt långa amerikanska hagtornshäckar.\n\n\nUtbildningar: \nVi har och köper in kurser löpande.   \n\n\nVillkor: \nHos oss jobbar du helt på dina egna villkor. Du tar precis så stora eller små uppdrag du orkar med samt när du vill att det ska utföras. Möjlighet att lära nya angränsande trädgårdsområden finns då våra Trädgårdsmästare gärna har med sig en lärling/elev på sina uppdrag.\nKollektivavtals enliga löner och arbetsvillkor ligger till grund hur vi jobbar."
      },
      "headline" : "Trädgårds Veteraner ",
      "driving_license" : [ {
        "concept_id" : "VTK8_WRx_GcM",
        "label" : "B",
        "legacy_ams_taxonomy_id" : "3"
      } ],
      "employer" : {
        "email" : null,
        "phone_number" : null,
        "organization_number" : "5593657553",
        "name" : "Veterangig AB",
        "url" : "www.veterangig.nu",
        "workplace" : "Veterangig AB"
      },
      "removed_date" : null,
      "logo_url" : "https://www.arbetsformedlingen.se/rest/arbetsgivare/rest/af/v3/arbetsplatser/88135238/logotyper/logo.png",
      "last_publication_date" : "2022-08-25T23:59:59",
      "number_of_vacancies" : 6,
      "occupation" : {
        "concept_id" : "QBXT_ESH_eoP",
        "label" : "Arborist/Trädvårdare",
        "legacy_ams_taxonomy_id" : "6769"
      },
      "occupation_group" : {
        "concept_id" : "XBh3_Xrm_C4R",
        "label" : "Trädgårdsanläggare m.fl.",
        "legacy_ams_taxonomy_id" : "6113"
      },
      "employment_type" : {
        "concept_id" : "1paU_aCR_nGn",
        "label" : "Behovsanställning",
        "legacy_ams_taxonomy_id" : "4"
      },
      "webpage_url" : "https://arbetsformedlingen.se/platsbanken/annonser/26354472",
      "driving_license_required" : true,
      "application_contacts" : [ ],
      "duration" : {
        "concept_id" : null,
        "label" : null,
        "legacy_ams_taxonomy_id" : null
      },
      "nice_to_have" : {
        "education_level" : [ ],
        "work_experiences" : [ ],
        "skills" : [ ],
        "education" : [ ],
        "languages" : [ ]
      },
      "application_details" : {
        "via_af" : false,
        "email" : "jobb@veterangig.nu",
        "other" : null,
        "reference" : null,
        "url" : null,
        "information" : null
      },
      "source_type" : "VIA_ANNONSERA",
      "application_deadline" : "2022-08-25T23:59:59",
      "external_id" : null,
      "workplace_address" : {
        "coordinates" : [ 17.897427297992735, 59.211602620296134 ],
        "city" : "Tullinge",
        "postcode" : "14645",
        "municipality" : "Botkyrka",
        "region_concept_id" : "CifL_Rzy_Mku",
        "region" : "Stockholms län",
        "country_code" : "199",
        "region_code" : "01",
        "municipality_concept_id" : "CCVZ_JA7_d3y",
        "country_concept_id" : "i46j_HmG_v64",
        "municipality_code" : "0127",
        "street_address" : "Tullingebergsvägen 1 C",
        "country" : "Sverige"
      },
      "id" : "26354472",
      "experience_required" : true,
      "working_hours_type" : {
        "concept_id" : null,
        "label" : null,
        "legacy_ams_taxonomy_id" : null
      },
      "access" : null,
      "timestamp" : 1658829185272,
      "must_have" : {
        "education_level" : [ ],
        "work_experiences" : [ {
          "concept_id" : "QBXT_ESH_eoP",
          "weight" : 10,
          "label" : "Arborist/Trädvårdare",
          "legacy_ams_taxonomy_id" : "6769"
        } ],
        "skills" : [ ],
        "education" : [ ],
        "languages" : [ {
          "concept_id" : "zSLA_vw2_FXN",
          "weight" : 10,
          "label" : "Svenska",
          "legacy_ams_taxonomy_id" : "502"
        } ]
      },
      "occupation_field" : {
        "concept_id" : "VuuL_7CH_adj",
        "label" : "Naturbruk",
        "legacy_ams_taxonomy_id" : "13"
      },
      "scope_of_work" : {
        "min" : 0,
        "max" : null
      },
      "salary_type" : {
        "concept_id" : "oG8G_9cW_nRf",
        "label" : "Fast månads- vecko- eller timlön",
        "legacy_ams_taxonomy_id" : "1"
      },
      "removed" : false,
      "salary_description" : null,
      "access_to_own_car" : true,
      "publication_date" : "2022-07-26T11:53:05"
    },
    "name" : "Trädgårds Veteraner ",
    "user" : "kristof.fischer"
  },
  "sha1" : "4f034eda1474a494f5cc559aa609c3225c58ee1c",
  "annotations" : [ {
    "preferred-label" : "Trädgårdsarbetare/Plantskolearbetare, trädgård",
    "type" : "occupation-name",
    "start-position" : 38,
    "end-position" : 56,
    "concept-id" : "geNh_Yah_F3J",
    "matched-string" : "Trädgårdsveteraner",
    "annotation-id" : 2
  }, {
    "preferred-label" : "Arborist/Trädvårdare",
    "type" : "occupation-name",
    "start-position" : 144,
    "end-position" : 166,
    "concept-id" : "QBXT_ESH_eoP",
    "matched-string" : "Arborister/Trädvårdare",
    "annotation-id" : 3
  }, {
    "preferred-label" : "Botkyrka",
    "type" : "municipality",
    "start-position" : 228,
    "end-position" : 236,
    "concept-id" : "CCVZ_JA7_d3y",
    "matched-string" : "Botkyrka",
    "annotation-id" : 4
  }, {
    "preferred-label" : "Salem",
    "type" : "municipality",
    "start-position" : 238,
    "end-position" : 243,
    "concept-id" : "4KBw_CPU_VQv",
    "matched-string" : "Salem",
    "annotation-id" : 5
  }, {
    "preferred-label" : "Huddinge",
    "type" : "municipality",
    "start-position" : 245,
    "end-position" : 253,
    "concept-id" : "g1Gc_aXK_EKu",
    "matched-string" : "Huddinge",
    "annotation-id" : 6
  }, {
    "preferred-label" : "Haninge",
    "type" : "municipality",
    "start-position" : 255,
    "end-position" : 262,
    "concept-id" : "Q7gp_9dT_k2F",
    "matched-string" : "Haninge",
    "annotation-id" : 7
  }, {
    "preferred-label" : "Tyresö",
    "type" : "municipality",
    "start-position" : 264,
    "end-position" : 270,
    "concept-id" : "sTPc_k2B_SqV",
    "matched-string" : "Tyresö",
    "annotation-id" : 8
  }, {
    "preferred-label" : "Stockholm",
    "type" : "municipality",
    "start-position" : 277,
    "end-position" : 294,
    "concept-id" : "AvNB_uwa_6n6",
    "matched-string" : "Stockholmskommuns",
    "annotation-id" : 9
  } ],
  "text" : "Trädgårds Veteraner \nVeterangig söker Trädgårdsveteraner till vårt populära affärsområde Träd & Trädgård. \nVeterangig söker just nu ett flertal Arborister/Trädvårdare till vår uthyrningsverksamhet. \nVi levererar våra tjänster i Botkyrka, Salem, Huddinge, Haninge, Tyresö, samt Stockholmskommuns södra förorter som Älvsjö, Farsta, Hägersten, Skärholmen och Enskede.\nVill du vara med?\nFör att bli en i gänget behöver du vara 55år eller äldre och det gör absolut ingenting om du är pensionär.\n\n\nUppdraget:\nVi jobba nästan alltid i team om 2 veteraner och tar oss an uppdrag inom det mesta när det gäller trädgårdsarbete. Från enklare vårstädningar till större planterings uppdrag. Beskärning av häckar och fruktträd. Vi klipper allt från små syrenbuskar till oändligt långa amerikanska hagtornshäckar.\n\n\nUtbildningar: \nVi har och köper in kurser löpande.   \n\n\nVillkor: \nHos oss jobbar du helt på dina egna villkor. Du tar precis så stora eller små uppdrag du orkar med samt när du vill att det ska utföras. Möjlighet att lära nya angränsande trädgårdsområden finns då våra Trädgårdsmästare gärna har med sig en lärling/elev på sina uppdrag.\nKollektivavtals enliga löner och arbetsvillkor ligger till grund hur vi jobbar."
}