{
  "meta" : {
    "jobad" : {
      "description" : {
        "requirements" : null,
        "needs" : null,
        "company_information" : null,
        "text_formatted" : "<p><strong><u>Måste kunna prata thai.</u></strong></p><p>En liten Thai-Take-Away kiosk på 20kvm på Enskedevägen söker nu <strong>1</strong> <strong>kock </strong>samt<strong> 1 kassör</strong> som även kan hjälpa till att preparera i köket. Vi är i större behov av en kassapersonal för tillfället så något bra svenska bör den som söker till kassapersonal ha. Ett plus för kocken om den <strong>kan lite svenska</strong> då det behövs lite hjälp att stå i kassan eller någon vana med wok-kök. Hos oss hjälper alla till med arbetsuppgifterna! Annars behövs det ingen erfarenhet alls.</p><ul><li><strong>Ingen utbildning eller erfarenhet krävs</strong> då vi lär upp på vårat sätt.</li><li>Enda kravet är att ni <strong><u>kan</u></strong><u> </u><strong><u>thailändska</u></strong><u>.</u></li></ul><p><strong><u>Ring Wanida för intresse: 0739805845 mellan kl. 09:00 - 11:00, 13:30 - 16:30 eller efter kl. 20:00.</u></strong></p><p><strong><em><u>Bästa vore om ni vill titta förbi våran thaikiosk för att se arbetsplatsen och om ni har frågor gällande jobbet. Mellan kl. 14:00 - 16:30</u></em></strong></p><p>Thai-kiosken ligger på Enskedevägen 113, 12263 Enskede. Tunnelbanans gröna linje 19 mot Hagsätra, station: <strong>Sockenplan</strong>, ta höger och gå mot Coop. ta höger igen och gå förbi fotbollsplanen.</p><p><strong>Dela gärna inlägget om ni tror att någon skulle vara intresserade!</strong></p>",
        "conditions" : null,
        "text" : "Måste kunna prata thai.\nEn liten Thai-Take-Away kiosk på 20kvm på Enskedevägen söker nu 1 kock samt 1 kassör som även kan hjälpa till att preparera i köket. Vi är i större behov av en kassapersonal för tillfället så något bra svenska bör den som söker till kassapersonal ha. Ett plus för kocken om den kan lite svenska då det behövs lite hjälp att stå i kassan eller någon vana med wok-kök. Hos oss hjälper alla till med arbetsuppgifterna! Annars behövs det ingen erfarenhet alls.\nIngen utbildning eller erfarenhet krävs då vi lär upp på vårat sätt.\nEnda kravet är att ni kan thailändska.\n\nRing Wanida för intresse: 0739805845 mellan kl. 09:00 - 11:00, 13:30 - 16:30 eller efter kl. 20:00.\nBästa vore om ni vill titta förbi våran thaikiosk för att se arbetsplatsen och om ni har frågor gällande jobbet. Mellan kl. 14:00 - 16:30\nThai-kiosken ligger på Enskedevägen 113, 12263 Enskede. Tunnelbanans gröna linje 19 mot Hagsätra, station: Sockenplan, ta höger och gå mot Coop. ta höger igen och gå förbi fotbollsplanen.\nDela gärna inlägget om ni tror att någon skulle vara intresserade!"
      },
      "headline" : "1 Kock / 1 kassör",
      "driving_license" : null,
      "employer" : {
        "email" : null,
        "phone_number" : null,
        "organization_number" : "5568704166",
        "name" : "Mae Nam Khong AB",
        "url" : null,
        "workplace" : "Mae Nam Khong AB"
      },
      "removed_date" : null,
      "logo_url" : "https://www.arbetsformedlingen.se/rest/arbetsgivare/rest/af/v3/arbetsplatser/87212078/logotyper/logo.png",
      "last_publication_date" : "2022-08-26T23:59:59",
      "number_of_vacancies" : 2,
      "occupation" : {
        "concept_id" : "oRB5_b7i_Qzv",
        "label" : "Köksbiträde",
        "legacy_ams_taxonomy_id" : "483"
      },
      "occupation_group" : {
        "concept_id" : "tPox_ie4_X9X",
        "label" : "Restaurang- och köksbiträden m.fl.",
        "legacy_ams_taxonomy_id" : "9412"
      },
      "employment_type" : {
        "concept_id" : "1paU_aCR_nGn",
        "label" : "Behovsanställning",
        "legacy_ams_taxonomy_id" : "4"
      },
      "webpage_url" : "https://arbetsformedlingen.se/platsbanken/annonser/26356319",
      "driving_license_required" : false,
      "application_contacts" : [ {
        "description" : null,
        "email" : "maenamkhongab@gmail.com",
        "telephone" : "0739805845",
        "name" : "Wanida Promtho",
        "contact_type" : "Ägaren"
      } ],
      "duration" : {
        "concept_id" : null,
        "label" : null,
        "legacy_ams_taxonomy_id" : null
      },
      "nice_to_have" : {
        "education_level" : [ ],
        "work_experiences" : [ ],
        "skills" : [ ],
        "education" : [ ],
        "languages" : [ {
          "concept_id" : "ECih_Cev_hwd",
          "weight" : 5,
          "label" : "Thailändska",
          "legacy_ams_taxonomy_id" : "469"
        }, {
          "concept_id" : "rt8T_8UB_wTq",
          "weight" : 5,
          "label" : "Thaispråk, andra",
          "legacy_ams_taxonomy_id" : "10480"
        } ]
      },
      "application_details" : {
        "via_af" : false,
        "email" : null,
        "other" : "0739805845",
        "reference" : null,
        "url" : null,
        "information" : null
      },
      "source_type" : "VIA_ANNONSERA",
      "application_deadline" : "2022-08-26T23:59:59",
      "external_id" : null,
      "workplace_address" : {
        "coordinates" : [ 18.07944417198336, 59.27976249418079 ],
        "city" : "ENSKEDE",
        "postcode" : "12263",
        "municipality" : "Stockholm",
        "region_concept_id" : "CifL_Rzy_Mku",
        "region" : "Stockholms län",
        "country_code" : "199",
        "region_code" : "01",
        "municipality_concept_id" : "AvNB_uwa_6n6",
        "country_concept_id" : "i46j_HmG_v64",
        "municipality_code" : "0180",
        "street_address" : "Enskedevägen 103",
        "country" : "Sverige"
      },
      "id" : "26356319",
      "experience_required" : false,
      "working_hours_type" : {
        "concept_id" : null,
        "label" : null,
        "legacy_ams_taxonomy_id" : null
      },
      "access" : null,
      "timestamp" : 1658905630276,
      "must_have" : {
        "education_level" : [ ],
        "work_experiences" : [ ],
        "skills" : [ ],
        "education" : [ ],
        "languages" : [ ]
      },
      "occupation_field" : {
        "concept_id" : "ScKy_FHB_7wT",
        "label" : "Hotell, restaurang, storhushåll",
        "legacy_ams_taxonomy_id" : "7"
      },
      "scope_of_work" : {
        "min" : 0,
        "max" : null
      },
      "salary_type" : {
        "concept_id" : "oG8G_9cW_nRf",
        "label" : "Fast månads- vecko- eller timlön",
        "legacy_ams_taxonomy_id" : "1"
      },
      "removed" : false,
      "salary_description" : null,
      "access_to_own_car" : false,
      "publication_date" : "2022-07-27T09:07:10"
    },
    "name" : "1 Kock / 1 kassör",
    "user" : "hannes"
  },
  "sha1" : "3a5375202946e57ef7f7bea9ff71e363b278bd33",
  "annotations" : [ {
    "preferred-label" : "kock",
    "sentiment" : "MUST_HAVE",
    "type" : "esco-occupation",
    "start-position" : 2,
    "end-position" : 6,
    "concept-id" : "Ti2H_QoQ_EMX",
    "matched-string" : "kock",
    "annotation-id" : 0
  }, {
    "preferred-label" : "Kassapersonal m.fl.",
    "type" : "ssyk-level-3",
    "start-position" : 11,
    "end-position" : 17,
    "concept-id" : "WQZc_NFY_EXB",
    "matched-string" : "kassör",
    "annotation-id" : 11
  }, {
    "preferred-label" : "Thailändska",
    "sentiment" : "MUST_HAVE",
    "type" : "language",
    "start-position" : 36,
    "end-position" : 40,
    "concept-id" : "ECih_Cev_hwd",
    "matched-string" : "thai",
    "annotation-id" : 1
  }, {
    "preferred-label" : "Thailändska",
    "sentiment" : "MUST_HAVE",
    "type" : "language",
    "start-position" : 51,
    "end-position" : 55,
    "concept-id" : "ECih_Cev_hwd",
    "matched-string" : "thai",
    "annotation-id" : 2
  }, {
    "preferred-label" : "kock",
    "sentiment" : "MUST_HAVE",
    "type" : "esco-occupation",
    "start-position" : 108,
    "end-position" : 112,
    "concept-id" : "Ti2H_QoQ_EMX",
    "matched-string" : "kock",
    "annotation-id" : 3
  }, {
    "preferred-label" : "Kassapersonal m.fl.",
    "type" : "ssyk-level-3",
    "start-position" : 120,
    "end-position" : 126,
    "concept-id" : "WQZc_NFY_EXB",
    "matched-string" : "kassör",
    "annotation-id" : 12
  }, {
    "preferred-label" : "Kassapersonal m.fl.",
    "sentiment" : "MUST_HAVE",
    "type" : "ssyk-level-3",
    "start-position" : 202,
    "end-position" : 215,
    "concept-id" : "WQZc_NFY_EXB",
    "matched-string" : "kassapersonal",
    "annotation-id" : 4
  }, {
    "preferred-label" : "Svenska",
    "sentiment" : "MUST_HAVE",
    "type" : "language",
    "start-position" : 244,
    "end-position" : 251,
    "concept-id" : "zSLA_vw2_FXN",
    "matched-string" : "svenska",
    "annotation-id" : 5
  }, {
    "preferred-label" : "Kassapersonal m.fl.",
    "sentiment" : "MUST_HAVE",
    "type" : "ssyk-level-3",
    "start-position" : 275,
    "end-position" : 288,
    "concept-id" : "WQZc_NFY_EXB",
    "matched-string" : "kassapersonal",
    "annotation-id" : 6
  }, {
    "preferred-label" : "Kock",
    "type" : "keyword",
    "start-position" : 306,
    "end-position" : 312,
    "concept-id" : "RTQf_1Qm_YhD",
    "matched-string" : "kocken",
    "annotation-id" : 13
  }, {
    "preferred-label" : "Svenska",
    "sentiment" : "MUST_HAVE",
    "type" : "language",
    "start-position" : 329,
    "end-position" : 336,
    "concept-id" : "zSLA_vw2_FXN",
    "matched-string" : "svenska",
    "annotation-id" : 7
  }, {
    "preferred-label" : "Thailändska",
    "sentiment" : "MUST_HAVE",
    "type" : "language",
    "start-position" : 594,
    "end-position" : 605,
    "concept-id" : "ECih_Cev_hwd",
    "matched-string" : "thailändska",
    "annotation-id" : 8
  } ],
  "text" : "1 Kock / 1 kassör\nMåste kunna prata thai.\nEn liten Thai-Take-Away kiosk på 20kvm på Enskedevägen söker nu 1 kock samt 1 kassör som även kan hjälpa till att preparera i köket. Vi är i större behov av en kassapersonal för tillfället så något bra svenska bör den som söker till kassapersonal ha. Ett plus för kocken om den kan lite svenska då det behövs lite hjälp att stå i kassan eller någon vana med wok-kök. Hos oss hjälper alla till med arbetsuppgifterna! Annars behövs det ingen erfarenhet alls.\nIngen utbildning eller erfarenhet krävs då vi lär upp på vårat sätt.\nEnda kravet är att ni kan thailändska.\n\nRing Wanida för intresse: 0739805845 mellan kl. 09:00 - 11:00, 13:30 - 16:30 eller efter kl. 20:00.\nBästa vore om ni vill titta förbi våran thaikiosk för att se arbetsplatsen och om ni har frågor gällande jobbet. Mellan kl. 14:00 - 16:30\nThai-kiosken ligger på Enskedevägen 113, 12263 Enskede. Tunnelbanans gröna linje 19 mot Hagsätra, station: Sockenplan, ta höger och gå mot Coop. ta höger igen och gå förbi fotbollsplanen.\nDela gärna inlägget om ni tror att någon skulle vara intresserade!"
}