{
  "meta" : {
    "jobad" : {
      "description" : {
        "requirements" : null,
        "needs" : null,
        "company_information" : null,
        "text_formatted" : "<p>HRB Service är Trygg-Hansas och Gjensidige försäkrings största entreprenör i Sverige. Verksamheten ingår i HRB Gruppen och Metrolit koncernen med decentraliserade bolag under egna varumärken. Tillsammans bildar HRB gruppen och Metrolit en stark plattform inom försäkringsskador, service och ROT. Organisationen har en beprövad, lönsam affärsmodell och koncernen omsätter över 1,500 MSEK och består av mer än 250 medarbetare. Vi erbjuder kunder och medarbetare stabilitet, kunskap, utvecklingsmöjligheter och engagemang!</p><p><strong>Om tjänsten:</strong></p><p>Nu söker HRB en till snickare till sitt kompetenta team! Som snickare hos HRB får du arbeta med försäkringsskador i Stockholmsområdet hos privatpersoner och företag. Det kan exempelvis handla om återuppbyggnad efter en vattenskada. I arbetet ingår mycket kundkontakt och bokning, planering samt samverkan med partners är centralt. Du utgår hemifrån med servicebil. På HRB strävar vi alltid efter att leverera goda resultat genom effektivt arbete med hög kvalitet. </p><p><strong>Din profil:</strong></p><p>Vi ser gärna att du är:</p><ul><li>Utbildad snickare med yrkesbevis</li><li>Innehar B-körkort</li><li>Kan svenska i både tal och skrift</li></ul><p>Som person är du ansvarstagande, driven och kommunikativ, socialt kompetent och duktig på att samarbeta med olika parter. Problemlösning är något du tycker är roligt. För oss är det viktigt att du är mycket serviceinriktad och att du alltid arbetar professionellt med målet hållbara och snygga resultat.</p><p><strong>Vi erbjuder:</strong></p><ul><li>Nyrenoverade lokaler i Solna Strand</li><li>Goda karriärmöjligheter inom koncernen</li><li>Bra löner och förmåner </li></ul><p><br></p><p>Är du redo att ta första steget till en spännande resa tillsammans med oss? Då är du välkommen med din ansökan!</p>",
        "conditions" : null,
        "text" : "HRB Service är Trygg-Hansas och Gjensidige försäkrings största entreprenör i Sverige. Verksamheten ingår i HRB Gruppen och Metrolit koncernen med decentraliserade bolag under egna varumärken. Tillsammans bildar HRB gruppen och Metrolit en stark plattform inom försäkringsskador, service och ROT. Organisationen har en beprövad, lönsam affärsmodell och koncernen omsätter över 1,500 MSEK och består av mer än 250 medarbetare. Vi erbjuder kunder och medarbetare stabilitet, kunskap, utvecklingsmöjligheter och engagemang!\nOm tjänsten:\nNu söker HRB en till snickare till sitt kompetenta team! Som snickare hos HRB får du arbeta med försäkringsskador i Stockholmsområdet hos privatpersoner och företag. Det kan exempelvis handla om återuppbyggnad efter en vattenskada. I arbetet ingår mycket kundkontakt och bokning, planering samt samverkan med partners är centralt. Du utgår hemifrån med servicebil. På HRB strävar vi alltid efter att leverera goda resultat genom effektivt arbete med hög kvalitet. \nDin profil:\nVi ser gärna att du är:\nUtbildad snickare med yrkesbevis\nInnehar B-körkort\nKan svenska i både tal och skrift\n\nSom person är du ansvarstagande, driven och kommunikativ, socialt kompetent och duktig på att samarbeta med olika parter. Problemlösning är något du tycker är roligt. För oss är det viktigt att du är mycket serviceinriktad och att du alltid arbetar professionellt med målet hållbara och snygga resultat.\nVi erbjuder:\nNyrenoverade lokaler i Solna Strand\nGoda karriärmöjligheter inom koncernen\nBra löner och förmåner \n\n\n\nÄr du redo att ta första steget till en spännande resa tillsammans med oss? Då är du välkommen med din ansökan!"
      },
      "headline" : "Servicesnickare | HRB Service",
      "driving_license" : [ {
        "concept_id" : "VTK8_WRx_GcM",
        "label" : "B",
        "legacy_ams_taxonomy_id" : "3"
      } ],
      "employer" : {
        "email" : null,
        "phone_number" : null,
        "organization_number" : "5591632780",
        "name" : "Jobbs On Sweden AB",
        "url" : "https://jobb.jobbson.se/jobs/1910025-snickare-hrb-service/dc810f47-364a-46eb-bb15-da69419b4769",
        "workplace" : "Jobbs On Sweden AB"
      },
      "removed_date" : null,
      "logo_url" : "https://www.arbetsformedlingen.se/rest/arbetsgivare/rest/af/v3/arbetsplatser/87689267/logotyper/logo.png",
      "last_publication_date" : "2022-08-27T23:59:59",
      "number_of_vacancies" : 2,
      "occupation" : {
        "concept_id" : "4Z7F_oBG_vMG",
        "label" : "Träarbetare/Snickare",
        "legacy_ams_taxonomy_id" : "6581"
      },
      "occupation_group" : {
        "concept_id" : "9mJN_VwW_Xjg",
        "label" : "Träarbetare, snickare m.fl.",
        "legacy_ams_taxonomy_id" : "7111"
      },
      "employment_type" : {
        "concept_id" : "PFZr_Syz_cUq",
        "label" : "Vanlig anställning",
        "legacy_ams_taxonomy_id" : "1"
      },
      "webpage_url" : "https://arbetsformedlingen.se/platsbanken/annonser/26359792",
      "driving_license_required" : true,
      "application_contacts" : [ ],
      "duration" : {
        "concept_id" : "a7uU_j21_mkL",
        "label" : "Tills vidare",
        "legacy_ams_taxonomy_id" : "1"
      },
      "nice_to_have" : {
        "education_level" : [ ],
        "work_experiences" : [ ],
        "skills" : [ ],
        "education" : [ ],
        "languages" : [ ]
      },
      "application_details" : {
        "via_af" : false,
        "email" : "jobs@jobbson.se",
        "other" : null,
        "reference" : "Snickare HRB",
        "url" : null,
        "information" : null
      },
      "source_type" : "VIA_ANNONSERA",
      "application_deadline" : "2022-08-27T23:59:59",
      "external_id" : null,
      "workplace_address" : {
        "coordinates" : [ 18.011921107910453, 59.366905157468636 ],
        "city" : "Solna",
        "postcode" : "16970",
        "municipality" : "Solna",
        "region_concept_id" : "CifL_Rzy_Mku",
        "region" : "Stockholms län",
        "country_code" : "199",
        "region_code" : "01",
        "municipality_concept_id" : "zHxw_uJZ_NJ8",
        "country_concept_id" : "i46j_HmG_v64",
        "municipality_code" : "0184",
        "street_address" : "Gårdsvägen 8",
        "country" : "Sverige"
      },
      "id" : "26359792",
      "experience_required" : true,
      "working_hours_type" : {
        "concept_id" : "6YE1_gAC_R2G",
        "label" : "Heltid",
        "legacy_ams_taxonomy_id" : "1"
      },
      "access" : null,
      "timestamp" : 1658998775407,
      "must_have" : {
        "education_level" : [ ],
        "work_experiences" : [ ],
        "skills" : [ ],
        "education" : [ ],
        "languages" : [ {
          "concept_id" : "zSLA_vw2_FXN",
          "weight" : 10,
          "label" : "Svenska",
          "legacy_ams_taxonomy_id" : "502"
        } ]
      },
      "occupation_field" : {
        "concept_id" : "j7Cq_ZJe_GkT",
        "label" : "Bygg och anläggning",
        "legacy_ams_taxonomy_id" : "2"
      },
      "scope_of_work" : {
        "min" : 0,
        "max" : 100
      },
      "salary_type" : {
        "concept_id" : "oG8G_9cW_nRf",
        "label" : "Fast månads- vecko- eller timlön",
        "legacy_ams_taxonomy_id" : "1"
      },
      "removed" : false,
      "salary_description" : null,
      "access_to_own_car" : false,
      "publication_date" : "2022-07-28T10:59:35"
    },
    "name" : "Servicesnickare | HRB Service",
    "user" : "hannes"
  },
  "sha1" : "bdb47c04e87eb2f29c627e45bc3191005a698011",
  "annotations" : [ {
    "preferred-label" : "Servicesnickare",
    "sentiment" : "MUST_HAVE",
    "type" : "keyword",
    "start-position" : 0,
    "end-position" : 15,
    "concept-id" : "ZHfo_Q4d_A5r",
    "matched-string" : "servicesnickare",
    "annotation-id" : 0
  }, {
    "preferred-label" : "Sverige",
    "type" : "country",
    "start-position" : 107,
    "end-position" : 114,
    "concept-id" : "i46j_HmG_v64",
    "matched-string" : "Sverige",
    "annotation-id" : 6
  }, {
    "preferred-label" : "ROT-jobb",
    "type" : "skill",
    "start-position" : 321,
    "end-position" : 324,
    "concept-id" : "U1ud_XV7_Z8o",
    "matched-string" : "ROT",
    "annotation-id" : 7
  }, {
    "preferred-label" : "snickare",
    "sentiment" : "MUST_HAVE",
    "type" : "esco-occupation",
    "start-position" : 584,
    "end-position" : 592,
    "concept-id" : "qhAJ_Euo_tNx",
    "matched-string" : "snickare",
    "annotation-id" : 1
  }, {
    "preferred-label" : "snickare",
    "sentiment" : "MUST_HAVE",
    "type" : "esco-occupation",
    "start-position" : 624,
    "end-position" : 632,
    "concept-id" : "qhAJ_Euo_tNx",
    "matched-string" : "snickare",
    "annotation-id" : 2
  }, {
    "preferred-label" : "Stockholm",
    "type" : "municipality",
    "start-position" : 679,
    "end-position" : 696,
    "concept-id" : "AvNB_uwa_6n6",
    "matched-string" : "Stockholmsområdet",
    "annotation-id" : 8
  }, {
    "preferred-label" : "snickare",
    "sentiment" : "MUST_HAVE",
    "type" : "esco-occupation",
    "start-position" : 1073,
    "end-position" : 1081,
    "concept-id" : "qhAJ_Euo_tNx",
    "matched-string" : "snickare",
    "annotation-id" : 3
  }, {
    "preferred-label" : "Yrkesbevis/examen",
    "sentiment" : "MUST_HAVE",
    "type" : "skill-headline",
    "start-position" : 1086,
    "end-position" : 1096,
    "concept-id" : "HjPN_99i_cFD",
    "matched-string" : "yrkesbevis",
    "annotation-id" : 4
  }, {
    "preferred-label" : "B",
    "type" : "driving-licence",
    "start-position" : 1105,
    "end-position" : 1114,
    "concept-id" : "VTK8_WRx_GcM",
    "matched-string" : "B-körkort",
    "annotation-id" : 9
  }, {
    "preferred-label" : "Svenska",
    "sentiment" : "MUST_HAVE",
    "type" : "language",
    "start-position" : 1119,
    "end-position" : 1126,
    "concept-id" : "zSLA_vw2_FXN",
    "matched-string" : "svenska",
    "annotation-id" : 5
  } ],
  "text" : "Servicesnickare | HRB Service\nHRB Service är Trygg-Hansas och Gjensidige försäkrings största entreprenör i Sverige. Verksamheten ingår i HRB Gruppen och Metrolit koncernen med decentraliserade bolag under egna varumärken. Tillsammans bildar HRB gruppen och Metrolit en stark plattform inom försäkringsskador, service och ROT. Organisationen har en beprövad, lönsam affärsmodell och koncernen omsätter över 1,500 MSEK och består av mer än 250 medarbetare. Vi erbjuder kunder och medarbetare stabilitet, kunskap, utvecklingsmöjligheter och engagemang!\nOm tjänsten:\nNu söker HRB en till snickare till sitt kompetenta team! Som snickare hos HRB får du arbeta med försäkringsskador i Stockholmsområdet hos privatpersoner och företag. Det kan exempelvis handla om återuppbyggnad efter en vattenskada. I arbetet ingår mycket kundkontakt och bokning, planering samt samverkan med partners är centralt. Du utgår hemifrån med servicebil. På HRB strävar vi alltid efter att leverera goda resultat genom effektivt arbete med hög kvalitet. \nDin profil:\nVi ser gärna att du är:\nUtbildad snickare med yrkesbevis\nInnehar B-körkort\nKan svenska i både tal och skrift\n\nSom person är du ansvarstagande, driven och kommunikativ, socialt kompetent och duktig på att samarbeta med olika parter. Problemlösning är något du tycker är roligt. För oss är det viktigt att du är mycket serviceinriktad och att du alltid arbetar professionellt med målet hållbara och snygga resultat.\nVi erbjuder:\nNyrenoverade lokaler i Solna Strand\nGoda karriärmöjligheter inom koncernen\nBra löner och förmåner \n\n\n\nÄr du redo att ta första steget till en spännande resa tillsammans med oss? Då är du välkommen med din ansökan!"
}