{
  "meta" : {
    "jobad" : {
      "description" : {
        "requirements" : null,
        "needs" : null,
        "company_information" : null,
        "text_formatted" : "<p>Vi söker dig som vill växa med oss! Vi söker dig med tidigare erfarenhet av servering. </p><p>Vad erbjuder du oss? </p><p>Du är en glad och positiv person.</p><p>Du är tävlingsinriktad och drivs av försäljning </p><p>Du är ansvarsfull och initiativrik och säkerställer att butiken är i toppskick </p><p>Du är en effektiv person som trivs bäst i ett högt tempo </p><p>Du älskar att ha kul på jobbet </p><p><br></p><p>Vi befinner oss i en expansionsfas där du får möjlighet att bidra till att ett redan starkt varumärke blir ännu starkare. Vi satsar på våra medarbetare och det finns stora möjligheter att växa med oss. </p>",
        "conditions" : null,
        "text" : "Vi söker dig som vill växa med oss! Vi söker dig med tidigare erfarenhet av servering. \nVad erbjuder du oss? \nDu är en glad och positiv person.\nDu är tävlingsinriktad och drivs av försäljning \nDu är ansvarsfull och initiativrik och säkerställer att butiken är i toppskick \nDu är en effektiv person som trivs bäst i ett högt tempo \nDu älskar att ha kul på jobbet \n\n\nVi befinner oss i en expansionsfas där du får möjlighet att bidra till att ett redan starkt varumärke blir ännu starkare. Vi satsar på våra medarbetare och det finns stora möjligheter att växa med oss."
      },
      "headline" : "Servitör/servitris Grand Café",
      "driving_license" : null,
      "employer" : {
        "email" : null,
        "phone_number" : null,
        "organization_number" : "5566574777",
        "name" : "D & E Konditori AB",
        "url" : null,
        "workplace" : "D & E Konditori AB / Thelins Konditori"
      },
      "removed_date" : null,
      "logo_url" : "https://www.arbetsformedlingen.se/rest/arbetsgivare/rest/af/v3/arbetsplatser/81033724/logotyper/logo.png",
      "last_publication_date" : "2022-08-23T23:59:59",
      "number_of_vacancies" : 3,
      "occupation" : {
        "concept_id" : "rGGf_KLs_To7",
        "label" : "Servitör/Servitris",
        "legacy_ams_taxonomy_id" : "5487"
      },
      "occupation_group" : {
        "concept_id" : "UjoW_meY_Zwt",
        "label" : "Hovmästare och servitörer",
        "legacy_ams_taxonomy_id" : "5131"
      },
      "employment_type" : {
        "concept_id" : "PFZr_Syz_cUq",
        "label" : "Vanlig anställning",
        "legacy_ams_taxonomy_id" : "1"
      },
      "webpage_url" : "https://arbetsformedlingen.se/platsbanken/annonser/26349401",
      "driving_license_required" : false,
      "application_contacts" : [ ],
      "duration" : {
        "concept_id" : "a7uU_j21_mkL",
        "label" : "Tills vidare",
        "legacy_ams_taxonomy_id" : "1"
      },
      "nice_to_have" : {
        "education_level" : [ ],
        "work_experiences" : [ ],
        "skills" : [ ],
        "education" : [ ],
        "languages" : [ ]
      },
      "application_details" : {
        "via_af" : false,
        "email" : "jobb@thelinskonditori.se",
        "other" : null,
        "reference" : null,
        "url" : null,
        "information" : null
      },
      "source_type" : "VIA_ANNONSERA",
      "application_deadline" : "2022-08-23T23:59:59",
      "external_id" : null,
      "workplace_address" : {
        "coordinates" : [ 18.02704451604158, 59.33099011443293 ],
        "city" : "Stockholm",
        "postcode" : "10420",
        "municipality" : "Stockholm",
        "region_concept_id" : "CifL_Rzy_Mku",
        "region" : "Stockholms län",
        "country_code" : "199",
        "region_code" : "01",
        "municipality_concept_id" : "AvNB_uwa_6n6",
        "country_concept_id" : "i46j_HmG_v64",
        "municipality_code" : "0180",
        "street_address" : "Sankt Eriksgatan 43",
        "country" : "Sverige"
      },
      "id" : "26349401",
      "experience_required" : true,
      "working_hours_type" : {
        "concept_id" : "947z_JGS_Uk2",
        "label" : "Deltid",
        "legacy_ams_taxonomy_id" : "2"
      },
      "access" : null,
      "timestamp" : 1658686950278,
      "must_have" : {
        "education_level" : [ ],
        "work_experiences" : [ ],
        "skills" : [ ],
        "education" : [ ],
        "languages" : [ ]
      },
      "occupation_field" : {
        "concept_id" : "ScKy_FHB_7wT",
        "label" : "Hotell, restaurang, storhushåll",
        "legacy_ams_taxonomy_id" : "7"
      },
      "scope_of_work" : {
        "min" : 75,
        "max" : 100
      },
      "salary_type" : {
        "concept_id" : "asrX_9Df_ukn",
        "label" : "Fast och rörlig lön",
        "legacy_ams_taxonomy_id" : "7"
      },
      "removed" : false,
      "salary_description" : null,
      "access_to_own_car" : false,
      "publication_date" : "2022-07-24T20:22:30"
    },
    "name" : "Servitör/servitris Grand Café",
    "user" : "hannes"
  },
  "sha1" : "4ef04d9ae0a5b25525510ffa429521aa4ebdc99a",
  "annotations" : [ {
    "preferred-label" : "Servitör/Servitris",
    "sentiment" : "MUST_HAVE",
    "type" : "occupation-name",
    "start-position" : 0,
    "end-position" : 18,
    "concept-id" : "rGGf_KLs_To7",
    "matched-string" : "servitör/servitris",
    "annotation-id" : 0
  }, {
    "preferred-label" : "Café",
    "sentiment" : "MUST_HAVE",
    "type" : "skill",
    "start-position" : 25,
    "end-position" : 29,
    "concept-id" : "f2Nt_4bK_HNX",
    "matched-string" : "café",
    "annotation-id" : 1
  }, {
    "preferred-label" : "Restaurang, servering",
    "type" : "keyword",
    "start-position" : 106,
    "end-position" : 115,
    "concept-id" : "GqXD_ArB_Mmg",
    "matched-string" : "servering",
    "annotation-id" : 2
  }, {
    "preferred-label" : "visa ansvarstagande",
    "type" : "esco-skill",
    "start-position" : 229,
    "end-position" : 240,
    "concept-id" : "bcRp_hxV_f5G",
    "matched-string" : "ansvarsfull",
    "annotation-id" : 3
  } ],
  "text" : "Servitör/servitris Grand Café\nVi söker dig som vill växa med oss! Vi söker dig med tidigare erfarenhet av servering. \nVad erbjuder du oss? \nDu är en glad och positiv person.\nDu är tävlingsinriktad och drivs av försäljning \nDu är ansvarsfull och initiativrik och säkerställer att butiken är i toppskick \nDu är en effektiv person som trivs bäst i ett högt tempo \nDu älskar att ha kul på jobbet \n\n\nVi befinner oss i en expansionsfas där du får möjlighet att bidra till att ett redan starkt varumärke blir ännu starkare. Vi satsar på våra medarbetare och det finns stora möjligheter att växa med oss."
}