{
  "meta" : {
    "jobad" : {
      "description" : {
        "requirements" : null,
        "needs" : null,
        "company_information" : null,
        "text_formatted" : "Om tjänsten\nOrange Cyberdefense är ett globalt företag specialiserade på cybersäkerhet. Som SOC- engineer till Orange Cyberdefense får du arbeta med likasinnade kollegor med ett gemensamt mål- en strävan att bygga ett säkrare digitalt samhälle!  Du kommer bli en del av ett team på 8 personer specialiserade inom IT-säkerhet. Tillsammans med dina kollegor kommer ni supportera både mindre företag och bland de största i Sverige.\n\nOrange Cyberdefense satsar hårt på sin personal och dina inledande månader kommer du att genomgå ett introduktionsprogram för att få de specifika utbildningar och certifieringar som krävs för att prestera på bästa sätt. Det kommer läggas stor vikt vid din personliga utveckling och du får ta stort eget ansvar.\n\nDetta är en direktrekrytering till Orange Cyberdefense där all kontakt gällande processen sker via Wrknest.\n\nDina framtida arbetsuppgifter\nSom Network Security Engineer på Orange Cyberdefense kommer du tillsammans med dina kollegor vara ansvarig för support och drift av företagets kunders nätverk och säkerhet. Det kan exempelvis innebära:\n\n- Felsökning och problemlösning av nätverksenheter och mjukvara\n- Ge leverantörs-/produktspecifik support\n- Övervaka kundmiljöer och utföra förändringar i kundernas enheter och miljöer\n- Leda tekniska dialoger med kunder kring utmaningar i deras IT-säkerhetsmiljöer\n- Att arbeta med Incident Management, Change Management och Problem Management\n\n\nVi söker dig som har\n\n- Tidigare arbetslivserfarenhet av IT-säkerhet och nätverk\n- Grundläggande/goda kunskaper inom TCP/IP, nätverksrouting,switching, brandväggar och Linux.\n- Mycket goda kunskaper i Svenska och Engelska\n\n\n\nVi ser det som meriterande\n\n- Eftergymnasial utbildning inom IT, med inriktning nätverk, säkerhet eller liknande\n- Kunskaper inom scripting eller programmering\n- Kunskaper i ITIL\n\n\nVid denna rekrytering lägger vi stor vikt vid dina personliga egenskaper, då de är avgörande för hur du kommer att lyckas i rollen och företaget. Vi förstår att man inte kan allting från början - men du ska ha en vilja att lära dig! Därför söker vi dig som är initativtagande, driven och prestigelös. Som person är du även noggrann i ditt arbete och serviceinriktad i din kontakt med kunder och kollegor.\n\nÖvrig information\n\nStart: Enligt överenskommelse\n\nPlats: Malmö\n\nOmfattning: Heltid, 40h/v\n\nAnställningsform: Tillsvidareanställning med inledande provanställning\n\nSök gärna så snart som möjligt då vi jobbar med löpande urval.\n\nOm företaget\n\nOrange Cyberdefense tillhandahåller managerad säkerhet, Managerade detect- och response-tjänster till organisationer runt om i världen. Som en aktör med global förankring och lokal närvaro, strävar vi efter att bygga ett säkrare digitalt samhälle.\n\nVi är en leverantör som drivs av insamling av Threat Intelligence och forskning kring säkerhetshot, och erbjuder därför enastående tillgång till information kring aktuella och nya hot.\n\nOrange Cyberdefense har en mer än 25 års erfarenhet inom informationssäkerhet, 250+ forskare och analytiker 16 SOC, 10 CyberSOC och 4 CERT distribuerade över hela världen och levererar försäljning, support och andra tjänster i 160 länder. Vi är stolta över att kunna erbjuda globalt skydd med lokal expertis och stödja våra kunder under hela säkerhetshotets livscykel.",
        "conditions" : "Heltid\r\nAnställningstid enligt överenskommelse",
        "text" : "Om tjänsten\nOrange Cyberdefense är ett globalt företag specialiserade på cybersäkerhet. Som SOC- engineer till Orange Cyberdefense får du arbeta med likasinnade kollegor med ett gemensamt mål- en strävan att bygga ett säkrare digitalt samhälle!  Du kommer bli en del av ett team på 8 personer specialiserade inom IT-säkerhet. Tillsammans med dina kollegor kommer ni supportera både mindre företag och bland de största i Sverige.\n\nOrange Cyberdefense satsar hårt på sin personal och dina inledande månader kommer du att genomgå ett introduktionsprogram för att få de specifika utbildningar och certifieringar som krävs för att prestera på bästa sätt. Det kommer läggas stor vikt vid din personliga utveckling och du får ta stort eget ansvar.\n\nDetta är en direktrekrytering till Orange Cyberdefense där all kontakt gällande processen sker via Wrknest.\n\nDina framtida arbetsuppgifter\nSom Network Security Engineer på Orange Cyberdefense kommer du tillsammans med dina kollegor vara ansvarig för support och drift av företagets kunders nätverk och säkerhet. Det kan exempelvis innebära:\n\n- Felsökning och problemlösning av nätverksenheter och mjukvara\n- Ge leverantörs-/produktspecifik support\n- Övervaka kundmiljöer och utföra förändringar i kundernas enheter och miljöer\n- Leda tekniska dialoger med kunder kring utmaningar i deras IT-säkerhetsmiljöer\n- Att arbeta med Incident Management, Change Management och Problem Management\n\n\nVi söker dig som har\n\n- Tidigare arbetslivserfarenhet av IT-säkerhet och nätverk\n- Grundläggande/goda kunskaper inom TCP/IP, nätverksrouting,switching, brandväggar och Linux.\n- Mycket goda kunskaper i Svenska och Engelska\n\n\n\nVi ser det som meriterande\n\n- Eftergymnasial utbildning inom IT, med inriktning nätverk, säkerhet eller liknande\n- Kunskaper inom scripting eller programmering\n- Kunskaper i ITIL\n\n\nVid denna rekrytering lägger vi stor vikt vid dina personliga egenskaper, då de är avgörande för hur du kommer att lyckas i rollen och företaget. Vi förstår att man inte kan allting från början - men du ska ha en vilja att lära dig! Därför söker vi dig som är initativtagande, driven och prestigelös. Som person är du även noggrann i ditt arbete och serviceinriktad i din kontakt med kunder och kollegor.\n\nÖvrig information\n\nStart: Enligt överenskommelse\n\nPlats: Malmö\n\nOmfattning: Heltid, 40h/v\n\nAnställningsform: Tillsvidareanställning med inledande provanställning\n\nSök gärna så snart som möjligt då vi jobbar med löpande urval.\n\nOm företaget\n\nOrange Cyberdefense tillhandahåller managerad säkerhet, Managerade detect- och response-tjänster till organisationer runt om i världen. Som en aktör med global förankring och lokal närvaro, strävar vi efter att bygga ett säkrare digitalt samhälle.\n\nVi är en leverantör som drivs av insamling av Threat Intelligence och forskning kring säkerhetshot, och erbjuder därför enastående tillgång till information kring aktuella och nya hot.\n\nOrange Cyberdefense har en mer än 25 års erfarenhet inom informationssäkerhet, 250+ forskare och analytiker 16 SOC, 10 CyberSOC och 4 CERT distribuerade över hela världen och levererar försäljning, support och andra tjänster i 160 länder. Vi är stolta över att kunna erbjuda globalt skydd med lokal expertis och stödja våra kunder under hela säkerhetshotets livscykel."
      },
      "headline" : "Network Security Engineer till Orange Cyberdefense",
      "driving_license" : null,
      "employer" : {
        "email" : null,
        "phone_number" : null,
        "organization_number" : "5592932213",
        "name" : "Wrknest AB",
        "url" : "http://www.wrknest.se",
        "workplace" : "Wrknest"
      },
      "removed_date" : null,
      "logo_url" : null,
      "last_publication_date" : "2022-12-15T23:59:59",
      "number_of_vacancies" : 1,
      "occupation" : {
        "concept_id" : "Nkbd_wa9_TZF",
        "label" : "Nätverkstekniker",
        "legacy_ams_taxonomy_id" : "5912"
      },
      "occupation_group" : {
        "concept_id" : "VCpu_5EN_bBt",
        "label" : "Nätverks- och systemtekniker m.fl.",
        "legacy_ams_taxonomy_id" : "3514"
      },
      "employment_type" : {
        "concept_id" : "PFZr_Syz_cUq",
        "label" : "Vanlig anställning",
        "legacy_ams_taxonomy_id" : "1"
      },
      "webpage_url" : "https://arbetsformedlingen.se/platsbanken/annonser/26269390",
      "driving_license_required" : false,
      "application_contacts" : [ {
        "description" : "Linnea Neldemo",
        "email" : null,
        "telephone" : null,
        "name" : null,
        "contact_type" : null
      } ],
      "duration" : {
        "concept_id" : "a7uU_j21_mkL",
        "label" : "Tills vidare",
        "legacy_ams_taxonomy_id" : "1"
      },
      "nice_to_have" : {
        "education_level" : [ ],
        "work_experiences" : [ ],
        "skills" : [ ],
        "education" : [ ],
        "languages" : [ ]
      },
      "application_details" : {
        "via_af" : false,
        "email" : null,
        "other" : null,
        "reference" : null,
        "url" : "https://careers.wrknest.se/jobs/1882554-network-security-engineer-till-orange-cyberdefense?promotion=439121-arbetsformedlingen",
        "information" : null
      },
      "source_type" : "VIA_PLATSBANKEN_DXA",
      "application_deadline" : "2022-12-15T23:59:59",
      "external_id" : "46-559293-2213-1882554-1",
      "workplace_address" : {
        "coordinates" : [ 13.003822, 55.60498 ],
        "city" : null,
        "postcode" : null,
        "municipality" : "Malmö",
        "region_concept_id" : "CaRE_1nn_cSU",
        "region" : "Skåne län",
        "country_code" : "199",
        "region_code" : "12",
        "municipality_concept_id" : "oYPt_yRA_Smm",
        "country_concept_id" : "i46j_HmG_v64",
        "municipality_code" : "1280",
        "street_address" : null,
        "country" : "Sverige"
      },
      "id" : "26269390",
      "experience_required" : true,
      "working_hours_type" : {
        "concept_id" : "6YE1_gAC_R2G",
        "label" : "Heltid",
        "legacy_ams_taxonomy_id" : "1"
      },
      "access" : null,
      "timestamp" : 1656437528509,
      "must_have" : {
        "education_level" : [ ],
        "work_experiences" : [ {
          "concept_id" : "Nkbd_wa9_TZF",
          "weight" : 10,
          "label" : "Nätverkstekniker",
          "legacy_ams_taxonomy_id" : "5912"
        } ],
        "skills" : [ ],
        "education" : [ ],
        "languages" : [ ]
      },
      "occupation_field" : {
        "concept_id" : "apaJ_2ja_LuF",
        "label" : "Data/IT",
        "legacy_ams_taxonomy_id" : "3"
      },
      "scope_of_work" : {
        "min" : 100,
        "max" : 100
      },
      "salary_type" : {
        "concept_id" : "oG8G_9cW_nRf",
        "label" : "Fast månads- vecko- eller timlön",
        "legacy_ams_taxonomy_id" : "1"
      },
      "removed" : false,
      "salary_description" : "Lön enligt överenskommelse",
      "access_to_own_car" : false,
      "publication_date" : "2022-06-28T19:32:08"
    },
    "name" : "Network Security Engineer till Orange Cyberdefense",
    "user" : "hannes"
  },
  "sha1" : "8fc8335117fae38006992d87a1c12dc022463c58",
  "annotations" : [ {
    "preferred-label" : "Network security",
    "sentiment" : "MUST_HAVE",
    "type" : "skill",
    "start-position" : 0,
    "end-position" : 16,
    "concept-id" : "56NM_uHB_3am",
    "matched-string" : "network security",
    "annotation-id" : 0
  }, {
    "preferred-label" : "Ingenjörer och tekniker",
    "type" : "ssyk-level-3",
    "start-position" : 17,
    "end-position" : 25,
    "concept-id" : "DhEP_m8M_qoi",
    "matched-string" : "Engineer",
    "annotation-id" : 15
  }, {
    "preferred-label" : "cybersäkerhet",
    "type" : "esco-skill",
    "start-position" : 124,
    "end-position" : 137,
    "concept-id" : "cUku_oZH_AtX",
    "matched-string" : "cybersäkerhet",
    "annotation-id" : 17
  }, {
    "preferred-label" : "Ingenjörer och tekniker",
    "type" : "ssyk-level-3",
    "start-position" : 148,
    "end-position" : 156,
    "concept-id" : "DhEP_m8M_qoi",
    "matched-string" : "engineer",
    "annotation-id" : 16
  }, {
    "preferred-label" : "IT-säkerhet",
    "sentiment" : "MUST_HAVE",
    "type" : "keyword",
    "start-position" : 364,
    "end-position" : 375,
    "concept-id" : "KF7V_H1U_vHv",
    "matched-string" : "it-säkerhet",
    "annotation-id" : 1
  }, {
    "preferred-label" : "Sverige",
    "type" : "country",
    "start-position" : 471,
    "end-position" : 478,
    "concept-id" : "i46j_HmG_v64",
    "matched-string" : "Sverige",
    "annotation-id" : 18
  }, {
    "preferred-label" : "Personal",
    "sentiment" : "MUST_HAVE",
    "type" : "keyword",
    "start-position" : 520,
    "end-position" : 528,
    "concept-id" : "HVxM_6MS_y1c",
    "matched-string" : "personal",
    "annotation-id" : 2
  }, {
    "preferred-label" : "Network security",
    "sentiment" : "MUST_HAVE",
    "type" : "skill",
    "start-position" : 936,
    "end-position" : 952,
    "concept-id" : "56NM_uHB_3am",
    "matched-string" : "network security",
    "annotation-id" : 3
  }, {
    "preferred-label" : "Ingenjörer och tekniker",
    "type" : "ssyk-level-3",
    "start-position" : 953,
    "end-position" : 961,
    "concept-id" : "DhEP_m8M_qoi",
    "matched-string" : "Engineer",
    "annotation-id" : 19
  }, {
    "preferred-label" : "göra felsökning",
    "type" : "esco-skill",
    "start-position" : 1137,
    "end-position" : 1147,
    "concept-id" : "HqC8_fVY_ACM",
    "matched-string" : "Felsökning",
    "annotation-id" : 20
  }, {
    "preferred-label" : "IT-säkerhet",
    "type" : "keyword",
    "start-position" : 1381,
    "end-position" : 1392,
    "concept-id" : "KF7V_H1U_vHv",
    "matched-string" : "IT-säkerhet",
    "annotation-id" : 21
  }, {
    "preferred-label" : "Incident manager",
    "type" : "keyword",
    "start-position" : 1418,
    "end-position" : 1437,
    "concept-id" : "uyFj_yMV_PMS",
    "matched-string" : "Incident Management",
    "annotation-id" : 22
  }, {
    "preferred-label" : "Change manager",
    "type" : "keyword",
    "start-position" : 1439,
    "end-position" : 1456,
    "concept-id" : "c4k5_Un2_kAJ",
    "matched-string" : "Change Management",
    "annotation-id" : 23
  }, {
    "preferred-label" : "IT-säkerhet",
    "sentiment" : "MUST_HAVE",
    "type" : "keyword",
    "start-position" : 1539,
    "end-position" : 1550,
    "concept-id" : "KF7V_H1U_vHv",
    "matched-string" : "it-säkerhet",
    "annotation-id" : 5
  }, {
    "preferred-label" : "TCP/IP, kommunikationsprotokoll",
    "sentiment" : "MUST_HAVE",
    "type" : "skill",
    "start-position" : 1599,
    "end-position" : 1605,
    "concept-id" : "HQJ2_68A_AiZ",
    "matched-string" : "tcp/ip",
    "annotation-id" : 6
  }, {
    "preferred-label" : "nätverksroutning",
    "type" : "esco-skill",
    "start-position" : 1607,
    "end-position" : 1622,
    "concept-id" : "Czxv_mso_WJj",
    "matched-string" : "nätverksrouting",
    "annotation-id" : 24
  }, {
    "preferred-label" : "Brandväggar",
    "sentiment" : "MUST_HAVE",
    "type" : "skill",
    "start-position" : 1634,
    "end-position" : 1645,
    "concept-id" : "iXzD_6DF_sL4",
    "matched-string" : "brandväggar",
    "annotation-id" : 7
  }, {
    "preferred-label" : "Linux, operativsystem",
    "sentiment" : "MUST_HAVE",
    "type" : "skill",
    "start-position" : 1650,
    "end-position" : 1655,
    "concept-id" : "z52H_f4y_4ZA",
    "matched-string" : "linux",
    "annotation-id" : 8
  }, {
    "preferred-label" : "Svenska",
    "sentiment" : "MUST_HAVE",
    "type" : "language",
    "start-position" : 1683,
    "end-position" : 1690,
    "concept-id" : "zSLA_vw2_FXN",
    "matched-string" : "svenska",
    "annotation-id" : 9
  }, {
    "preferred-label" : "Engelska",
    "sentiment" : "MUST_HAVE",
    "type" : "language",
    "start-position" : 1695,
    "end-position" : 1703,
    "concept-id" : "NVxJ_hLg_TYS",
    "matched-string" : "engelska",
    "annotation-id" : 10
  }, {
    "preferred-label" : "Eftergymnasial utbildning",
    "sentiment" : "MUST_HAVE",
    "type" : "sni-level-3",
    "start-position" : 1737,
    "end-position" : 1762,
    "concept-id" : "bg6r_KVf_KNN",
    "matched-string" : "eftergymnasial utbildning",
    "annotation-id" : 11
  }, {
    "preferred-label" : "Data/IT",
    "sentiment" : "MUST_HAVE",
    "type" : "occupation-field",
    "start-position" : 1768,
    "end-position" : 1770,
    "concept-id" : "apaJ_2ja_LuF",
    "matched-string" : "it",
    "annotation-id" : 12
  }, {
    "preferred-label" : "Programmering",
    "sentiment" : "MUST_HAVE",
    "type" : "skill",
    "start-position" : 1853,
    "end-position" : 1866,
    "concept-id" : "iUew_moc_BRk",
    "matched-string" : "programmering",
    "annotation-id" : 13
  }, {
    "preferred-label" : "arbeta i en ITIL-baserad miljö",
    "type" : "esco-skill",
    "start-position" : 1881,
    "end-position" : 1885,
    "concept-id" : "ZJS4_Han_D8x",
    "matched-string" : "ITIL",
    "annotation-id" : 25
  }, {
    "preferred-label" : "noggrannhet",
    "type" : "esco-skill",
    "start-position" : 2211,
    "end-position" : 2219,
    "concept-id" : "mrsW_EkL_KRD",
    "matched-string" : "noggrann",
    "annotation-id" : 26
  }, {
    "preferred-label" : "Malmö",
    "type" : "municipality",
    "start-position" : 2351,
    "end-position" : 2356,
    "concept-id" : "oYPt_yRA_Smm",
    "matched-string" : "Malmö",
    "annotation-id" : 27
  }, {
    "preferred-label" : "Heltid",
    "type" : "worktime-extent",
    "start-position" : 2370,
    "end-position" : 2376,
    "concept-id" : "6YE1_gAC_R2G",
    "matched-string" : "Heltid",
    "annotation-id" : 28
  }, {
    "preferred-label" : "Tillsvidareanställning (inkl. eventuell provanställning)",
    "type" : "employment-type",
    "start-position" : 2403,
    "end-position" : 2455,
    "concept-id" : "kpPX_CNN_gDU",
    "matched-string" : "Tillsvidareanställning med inledande provanställning",
    "annotation-id" : 29
  }, {
    "preferred-label" : "Informationssäkerhet",
    "sentiment" : "MUST_HAVE",
    "type" : "skill",
    "start-position" : 3027,
    "end-position" : 3047,
    "concept-id" : "LqRT_TVB_RPo",
    "matched-string" : "informationssäkerhet",
    "annotation-id" : 14
  } ],
  "text" : "Network Security Engineer till Orange Cyberdefense\nOm tjänsten\nOrange Cyberdefense är ett globalt företag specialiserade på cybersäkerhet. Som SOC- engineer till Orange Cyberdefense får du arbeta med likasinnade kollegor med ett gemensamt mål- en strävan att bygga ett säkrare digitalt samhälle!  Du kommer bli en del av ett team på 8 personer specialiserade inom IT-säkerhet. Tillsammans med dina kollegor kommer ni supportera både mindre företag och bland de största i Sverige.\n\nOrange Cyberdefense satsar hårt på sin personal och dina inledande månader kommer du att genomgå ett introduktionsprogram för att få de specifika utbildningar och certifieringar som krävs för att prestera på bästa sätt. Det kommer läggas stor vikt vid din personliga utveckling och du får ta stort eget ansvar.\n\nDetta är en direktrekrytering till Orange Cyberdefense där all kontakt gällande processen sker via Wrknest.\n\nDina framtida arbetsuppgifter\nSom Network Security Engineer på Orange Cyberdefense kommer du tillsammans med dina kollegor vara ansvarig för support och drift av företagets kunders nätverk och säkerhet. Det kan exempelvis innebära:\n\n- Felsökning och problemlösning av nätverksenheter och mjukvara\n- Ge leverantörs-/produktspecifik support\n- Övervaka kundmiljöer och utföra förändringar i kundernas enheter och miljöer\n- Leda tekniska dialoger med kunder kring utmaningar i deras IT-säkerhetsmiljöer\n- Att arbeta med Incident Management, Change Management och Problem Management\n\n\nVi söker dig som har\n\n- Tidigare arbetslivserfarenhet av IT-säkerhet och nätverk\n- Grundläggande/goda kunskaper inom TCP/IP, nätverksrouting,switching, brandväggar och Linux.\n- Mycket goda kunskaper i Svenska och Engelska\n\n\n\nVi ser det som meriterande\n\n- Eftergymnasial utbildning inom IT, med inriktning nätverk, säkerhet eller liknande\n- Kunskaper inom scripting eller programmering\n- Kunskaper i ITIL\n\n\nVid denna rekrytering lägger vi stor vikt vid dina personliga egenskaper, då de är avgörande för hur du kommer att lyckas i rollen och företaget. Vi förstår att man inte kan allting från början - men du ska ha en vilja att lära dig! Därför söker vi dig som är initativtagande, driven och prestigelös. Som person är du även noggrann i ditt arbete och serviceinriktad i din kontakt med kunder och kollegor.\n\nÖvrig information\n\nStart: Enligt överenskommelse\n\nPlats: Malmö\n\nOmfattning: Heltid, 40h/v\n\nAnställningsform: Tillsvidareanställning med inledande provanställning\n\nSök gärna så snart som möjligt då vi jobbar med löpande urval.\n\nOm företaget\n\nOrange Cyberdefense tillhandahåller managerad säkerhet, Managerade detect- och response-tjänster till organisationer runt om i världen. Som en aktör med global förankring och lokal närvaro, strävar vi efter att bygga ett säkrare digitalt samhälle.\n\nVi är en leverantör som drivs av insamling av Threat Intelligence och forskning kring säkerhetshot, och erbjuder därför enastående tillgång till information kring aktuella och nya hot.\n\nOrange Cyberdefense har en mer än 25 års erfarenhet inom informationssäkerhet, 250+ forskare och analytiker 16 SOC, 10 CyberSOC och 4 CERT distribuerade över hela världen och levererar försäljning, support och andra tjänster i 160 länder. Vi är stolta över att kunna erbjuda globalt skydd med lokal expertis och stödja våra kunder under hela säkerhetshotets livscykel."
}