{
  "meta" : {
    "jobad" : {
      "description" : {
        "requirements" : null,
        "needs" : null,
        "company_information" : null,
        "text_formatted" : "<p>SunRoof är ett av de snabbast växande techbolagen i hela Europa. Vi erbjuder en intressant och spännande arbetsplats inom en framtidsbransch. Vi sätter anställda först och har stora ambitioner gällande förnybar energi.</p><ul><li>Bli en viktig del i vårt snabbt växande företag inom förnybar energi</li><li>En spännande arbetsplats. Du har en möjlighet att påverka din egen vardag och framtid</li><li>En arbetsplats där vi tror på ett ömsesidigt förtroende, respekt och stöd. Våra anställda står i centrum.</li><li>En inspirerande och föränderlig miljö</li><li>Flexibel arbetsplats – hemmakontor eller på våra kontorshotell eller framtida kontor, med undantag för hembesök.</li><li>Marknadsmässig lön</li><li>Start: omgående</li></ul><p><br></p><p>Vi på SunRoof söker nu en erfaren kalkylator som har erfarenhet inom solcells- eller byggbranschen.</p><p>Du kommer i nära samarbete med våra kollegor att kvalitetssäkra kalkylerna. Projekten kan variera i inriktning och storlek och målet är att skapa god lönsamhet. Vi tror att den rätta kandidaten kontinuerligt vill utvecklas i sin roll på företaget och gärna tar ansvar. Till en början så kommer jobbet vara remote/hemifrån, när kontoret sedan skapas i Stockholm så finns det möjlighet att vara på plats.</p><p><strong>Arbetsuppgifter:</strong></p><p>Beräkna, kvalitetssäkra och göra riskbedömningar för våra jobb</p><p>Hitta och optimera lösningar som bidrar till god lönsamhet.</p><p>Granska anbud, projektbudgetar och analyser.</p><p>Jobba i nära samarbete med kollegor för enhetlig utveckling.</p><p><br></p><p><strong>För att lyckas i rollen tror vi att du har:</strong></p><p>Några års erfarenhet av att jobba med kalkyl- och anbudsarbete helst inom solcells- eller byggbranschen.</p><p>Har ett sinne för siffror, beräkningar och är kostnadsmedveten</p><p>Erfarenhet av att jobba i olika relaterade system</p><p>Kan kommunicera väl med kollegor i både tal och skrift</p><p>Förmågan att komma in på en ny tjänst och vara med att sätta processer</p><p><br></p><p>Låter detta som en beskrivning som passar in på dig? Då får du gärna söka då vi kommer tillsätta tjänsten så fort vi har hittat rätt kandidat.</p>",
        "conditions" : null,
        "text" : "SunRoof är ett av de snabbast växande techbolagen i hela Europa. Vi erbjuder en intressant och spännande arbetsplats inom en framtidsbransch. Vi sätter anställda först och har stora ambitioner gällande förnybar energi.\nBli en viktig del i vårt snabbt växande företag inom förnybar energi\nEn spännande arbetsplats. Du har en möjlighet att påverka din egen vardag och framtid\nEn arbetsplats där vi tror på ett ömsesidigt förtroende, respekt och stöd. Våra anställda står i centrum.\nEn inspirerande och föränderlig miljö\nFlexibel arbetsplats – hemmakontor eller på våra kontorshotell eller framtida kontor, med undantag för hembesök.\nMarknadsmässig lön\nStart: omgående\n\n\n\nVi på SunRoof söker nu en erfaren kalkylator som har erfarenhet inom solcells- eller byggbranschen.\nDu kommer i nära samarbete med våra kollegor att kvalitetssäkra kalkylerna. Projekten kan variera i inriktning och storlek och målet är att skapa god lönsamhet. Vi tror att den rätta kandidaten kontinuerligt vill utvecklas i sin roll på företaget och gärna tar ansvar. Till en början så kommer jobbet vara remote/hemifrån, när kontoret sedan skapas i Stockholm så finns det möjlighet att vara på plats.\nArbetsuppgifter:\nBeräkna, kvalitetssäkra och göra riskbedömningar för våra jobb\nHitta och optimera lösningar som bidrar till god lönsamhet.\nGranska anbud, projektbudgetar och analyser.\nJobba i nära samarbete med kollegor för enhetlig utveckling.\n\n\nFör att lyckas i rollen tror vi att du har:\nNågra års erfarenhet av att jobba med kalkyl- och anbudsarbete helst inom solcells- eller byggbranschen.\nHar ett sinne för siffror, beräkningar och är kostnadsmedveten\nErfarenhet av att jobba i olika relaterade system\nKan kommunicera väl med kollegor i både tal och skrift\nFörmågan att komma in på en ny tjänst och vara med att sätta processer\n\n\nLåter detta som en beskrivning som passar in på dig? Då får du gärna söka då vi kommer tillsätta tjänsten så fort vi har hittat rätt kandidat."
      },
      "headline" : "Byggnadskalkylator",
      "driving_license" : [ {
        "concept_id" : "VTK8_WRx_GcM",
        "label" : "B",
        "legacy_ams_taxonomy_id" : "3"
      } ],
      "employer" : {
        "email" : null,
        "phone_number" : null,
        "organization_number" : "5568768716",
        "name" : "Sunroof Sverige AB",
        "url" : "https://sunroof.se/",
        "workplace" : "Sunroof Sverige AB"
      },
      "removed_date" : null,
      "logo_url" : "https://www.arbetsformedlingen.se/rest/arbetsgivare/rest/af/v3/arbetsplatser/87387976/logotyper/logo.png",
      "last_publication_date" : "2022-08-18T23:59:59",
      "number_of_vacancies" : 1,
      "occupation" : {
        "concept_id" : "wV1P_Ms5_HB2",
        "label" : "Byggnadskalkylator/Anbudsingenjör",
        "legacy_ams_taxonomy_id" : "2983"
      },
      "occupation_group" : {
        "concept_id" : "thZP_oR7_WrY",
        "label" : "Ingenjörer och tekniker inom bygg och anläggning",
        "legacy_ams_taxonomy_id" : "3112"
      },
      "employment_type" : {
        "concept_id" : "PFZr_Syz_cUq",
        "label" : "Vanlig anställning",
        "legacy_ams_taxonomy_id" : "1"
      },
      "webpage_url" : "https://arbetsformedlingen.se/platsbanken/annonser/26340210",
      "driving_license_required" : true,
      "application_contacts" : [ ],
      "duration" : {
        "concept_id" : "a7uU_j21_mkL",
        "label" : "Tills vidare",
        "legacy_ams_taxonomy_id" : "1"
      },
      "nice_to_have" : {
        "education_level" : [ ],
        "work_experiences" : [ {
          "concept_id" : "wV1P_Ms5_HB2",
          "weight" : 5,
          "label" : "Byggnadskalkylator/Anbudsingenjör",
          "legacy_ams_taxonomy_id" : "2983"
        } ],
        "skills" : [ ],
        "education" : [ ],
        "languages" : [ ]
      },
      "application_details" : {
        "via_af" : false,
        "email" : null,
        "other" : null,
        "reference" : null,
        "url" : "https://system.erecruiter.pl/FormTemplates/RecruitmentForm.aspx?WebID=0eab3b06b2f54e2bb14f8f0c66a40f6a",
        "information" : null
      },
      "source_type" : "VIA_ANNONSERA",
      "application_deadline" : "2022-08-18T23:59:59",
      "external_id" : null,
      "workplace_address" : {
        "coordinates" : [ 18.008125798994023, 59.33651918986788 ],
        "city" : "STOCKHOLM",
        "postcode" : "11251",
        "municipality" : "Stockholm",
        "region_concept_id" : "CifL_Rzy_Mku",
        "region" : "Stockholms län",
        "country_code" : "199",
        "region_code" : "01",
        "municipality_concept_id" : "AvNB_uwa_6n6",
        "country_concept_id" : "i46j_HmG_v64",
        "municipality_code" : "0180",
        "street_address" : "Stockholm",
        "country" : "Sverige"
      },
      "id" : "26340210",
      "experience_required" : true,
      "working_hours_type" : {
        "concept_id" : "6YE1_gAC_R2G",
        "label" : "Heltid",
        "legacy_ams_taxonomy_id" : "1"
      },
      "access" : null,
      "timestamp" : 1658245495283,
      "must_have" : {
        "education_level" : [ ],
        "work_experiences" : [ ],
        "skills" : [ ],
        "education" : [ ],
        "languages" : [ ]
      },
      "occupation_field" : {
        "concept_id" : "j7Cq_ZJe_GkT",
        "label" : "Bygg och anläggning",
        "legacy_ams_taxonomy_id" : "2"
      },
      "scope_of_work" : {
        "min" : 0,
        "max" : 100
      },
      "salary_type" : {
        "concept_id" : "oG8G_9cW_nRf",
        "label" : "Fast månads- vecko- eller timlön",
        "legacy_ams_taxonomy_id" : "1"
      },
      "removed" : false,
      "salary_description" : null,
      "access_to_own_car" : false,
      "publication_date" : "2022-07-19T17:44:55"
    },
    "name" : "Byggnadskalkylator",
    "user" : "hannes"
  },
  "sha1" : "28488a70fe13d070981a370a4530f1bf14353280",
  "annotations" : [ {
    "preferred-label" : "Byggnadskalkylator/Anbudsingenjör",
    "sentiment" : "MUST_HAVE",
    "type" : "occupation-name",
    "start-position" : 0,
    "end-position" : 18,
    "concept-id" : "wV1P_Ms5_HB2",
    "matched-string" : "byggnadskalkylator",
    "annotation-id" : 0
  }, {
    "preferred-label" : "Kontor",
    "sentiment" : "MUST_HAVE",
    "type" : "keyword",
    "start-position" : 615,
    "end-position" : 621,
    "concept-id" : "Hyz1_7HF_AkP",
    "matched-string" : "kontor",
    "annotation-id" : 1
  }, {
    "preferred-label" : "Kalkylator",
    "sentiment" : "MUST_HAVE",
    "type" : "keyword",
    "start-position" : 722,
    "end-position" : 732,
    "concept-id" : "u54g_52i_nyE",
    "matched-string" : "kalkylator",
    "annotation-id" : 2
  }, {
    "preferred-label" : "byggbranschen",
    "type" : "esco-skill",
    "start-position" : 773,
    "end-position" : 786,
    "concept-id" : "Dq3z_72P_8Zy",
    "matched-string" : "byggbranschen",
    "annotation-id" : 3
  }, {
    "preferred-label" : "Stockholm",
    "type" : "municipality",
    "start-position" : 1139,
    "end-position" : 1148,
    "concept-id" : "AvNB_uwa_6n6",
    "matched-string" : "Stockholm",
    "annotation-id" : 4
  }, {
    "preferred-label" : "Kalkylering",
    "type" : "skill",
    "start-position" : 1521,
    "end-position" : 1527,
    "concept-id" : "hb3b_fH2_bvK",
    "matched-string" : "kalkyl",
    "annotation-id" : 5
  }, {
    "preferred-label" : "byggbranschen",
    "type" : "esco-skill",
    "start-position" : 1573,
    "end-position" : 1586,
    "concept-id" : "Dq3z_72P_8Zy",
    "matched-string" : "byggbranschen",
    "annotation-id" : 6
  } ],
  "text" : "Byggnadskalkylator\nSunRoof är ett av de snabbast växande techbolagen i hela Europa. Vi erbjuder en intressant och spännande arbetsplats inom en framtidsbransch. Vi sätter anställda först och har stora ambitioner gällande förnybar energi.\nBli en viktig del i vårt snabbt växande företag inom förnybar energi\nEn spännande arbetsplats. Du har en möjlighet att påverka din egen vardag och framtid\nEn arbetsplats där vi tror på ett ömsesidigt förtroende, respekt och stöd. Våra anställda står i centrum.\nEn inspirerande och föränderlig miljö\nFlexibel arbetsplats – hemmakontor eller på våra kontorshotell eller framtida kontor, med undantag för hembesök.\nMarknadsmässig lön\nStart: omgående\n\n\n\nVi på SunRoof söker nu en erfaren kalkylator som har erfarenhet inom solcells- eller byggbranschen.\nDu kommer i nära samarbete med våra kollegor att kvalitetssäkra kalkylerna. Projekten kan variera i inriktning och storlek och målet är att skapa god lönsamhet. Vi tror att den rätta kandidaten kontinuerligt vill utvecklas i sin roll på företaget och gärna tar ansvar. Till en början så kommer jobbet vara remote/hemifrån, när kontoret sedan skapas i Stockholm så finns det möjlighet att vara på plats.\nArbetsuppgifter:\nBeräkna, kvalitetssäkra och göra riskbedömningar för våra jobb\nHitta och optimera lösningar som bidrar till god lönsamhet.\nGranska anbud, projektbudgetar och analyser.\nJobba i nära samarbete med kollegor för enhetlig utveckling.\n\n\nFör att lyckas i rollen tror vi att du har:\nNågra års erfarenhet av att jobba med kalkyl- och anbudsarbete helst inom solcells- eller byggbranschen.\nHar ett sinne för siffror, beräkningar och är kostnadsmedveten\nErfarenhet av att jobba i olika relaterade system\nKan kommunicera väl med kollegor i både tal och skrift\nFörmågan att komma in på en ny tjänst och vara med att sätta processer\n\n\nLåter detta som en beskrivning som passar in på dig? Då får du gärna söka då vi kommer tillsätta tjänsten så fort vi har hittat rätt kandidat."
}