{
  "meta" : {
    "jobad" : {
      "description" : {
        "requirements" : null,
        "needs" : null,
        "company_information" : null,
        "text_formatted" : "<p>På Kale &amp; Crave jobbar vi med mat från grunden och använder inte gluten, laktos eller raffinerat socker i matlagningen. Vi lägger ner mycket jobb i vår prepp för att sedan kunna servera maten i snabbt utförande med eleganta upplägg. Vi är ett kreativt och energirikt team i köket och strävar ständigt efter förbättring både arbetsmässigt, produktmässigt och för att skapa en så rolig arbetsplats som möjligt.</p><p>Om tjänsten</p><p>Ingen erfarenhet krävs för denna tjänst men vi ser helst att du är självgående, stresstålig, snabb och noggrann.</p>",
        "conditions" : null,
        "text" : "På Kale & Crave jobbar vi med mat från grunden och använder inte gluten, laktos eller raffinerat socker i matlagningen. Vi lägger ner mycket jobb i vår prepp för att sedan kunna servera maten i snabbt utförande med eleganta upplägg. Vi är ett kreativt och energirikt team i köket och strävar ständigt efter förbättring både arbetsmässigt, produktmässigt och för att skapa en så rolig arbetsplats som möjligt.\nOm tjänsten\nIngen erfarenhet krävs för denna tjänst men vi ser helst att du är självgående, stresstålig, snabb och noggrann."
      },
      "headline" : "Kökspersonal",
      "driving_license" : null,
      "employer" : {
        "email" : null,
        "phone_number" : null,
        "organization_number" : "5591258891",
        "name" : "FIGFY AB",
        "url" : "http://www.kaleandcrave.se",
        "workplace" : "FIGFY AB"
      },
      "removed_date" : null,
      "logo_url" : "https://www.arbetsformedlingen.se/rest/arbetsgivare/rest/af/v3/arbetsplatser/86773300/logotyper/logo.png",
      "last_publication_date" : "2022-07-27T23:59:59",
      "number_of_vacancies" : 2,
      "occupation" : {
        "concept_id" : "oRB5_b7i_Qzv",
        "label" : "Köksbiträde",
        "legacy_ams_taxonomy_id" : "483"
      },
      "occupation_group" : {
        "concept_id" : "tPox_ie4_X9X",
        "label" : "Restaurang- och köksbiträden m.fl.",
        "legacy_ams_taxonomy_id" : "9412"
      },
      "employment_type" : {
        "concept_id" : "PFZr_Syz_cUq",
        "label" : "Vanlig anställning",
        "legacy_ams_taxonomy_id" : "1"
      },
      "webpage_url" : "https://arbetsformedlingen.se/platsbanken/annonser/26263233",
      "driving_license_required" : false,
      "application_contacts" : [ {
        "description" : null,
        "email" : "kalecjobb@gmail.com",
        "telephone" : null,
        "name" : "Viktor H",
        "contact_type" : null
      } ],
      "duration" : {
        "concept_id" : "a7uU_j21_mkL",
        "label" : "Tills vidare",
        "legacy_ams_taxonomy_id" : "1"
      },
      "nice_to_have" : {
        "education_level" : [ ],
        "work_experiences" : [ ],
        "skills" : [ ],
        "education" : [ ],
        "languages" : [ ]
      },
      "application_details" : {
        "via_af" : false,
        "email" : "kalecjobb@gmail.com",
        "other" : null,
        "reference" : null,
        "url" : null,
        "information" : null
      },
      "source_type" : "VIA_ANNONSERA",
      "application_deadline" : "2022-07-27T23:59:59",
      "external_id" : null,
      "workplace_address" : {
        "coordinates" : [ 18.06192923150658, 59.34451492742577 ],
        "city" : "Stockholm",
        "postcode" : "11355",
        "municipality" : "Stockholm",
        "region_concept_id" : "CifL_Rzy_Mku",
        "region" : "Stockholms län",
        "country_code" : "199",
        "region_code" : "01",
        "municipality_concept_id" : "AvNB_uwa_6n6",
        "country_concept_id" : "i46j_HmG_v64",
        "municipality_code" : "0180",
        "street_address" : "Roslagsgatan 2",
        "country" : "Sverige"
      },
      "id" : "26263233",
      "experience_required" : false,
      "working_hours_type" : {
        "concept_id" : "6YE1_gAC_R2G",
        "label" : "Heltid",
        "legacy_ams_taxonomy_id" : "1"
      },
      "access" : null,
      "timestamp" : 1656337430794,
      "must_have" : {
        "education_level" : [ ],
        "work_experiences" : [ ],
        "skills" : [ ],
        "education" : [ ],
        "languages" : [ ]
      },
      "occupation_field" : {
        "concept_id" : "ScKy_FHB_7wT",
        "label" : "Hotell, restaurang, storhushåll",
        "legacy_ams_taxonomy_id" : "7"
      },
      "scope_of_work" : {
        "min" : 0,
        "max" : 100
      },
      "salary_type" : {
        "concept_id" : "oG8G_9cW_nRf",
        "label" : "Fast månads- vecko- eller timlön",
        "legacy_ams_taxonomy_id" : "1"
      },
      "removed" : false,
      "salary_description" : null,
      "access_to_own_car" : false,
      "publication_date" : "2022-06-27T15:43:50"
    },
    "name" : "Kökspersonal",
    "user" : "hannes"
  },
  "sha1" : "71ceb12bcea55fb1fd87fc8b33b338012aa22c23",
  "annotations" : [ {
    "preferred-label" : "Kökspersonal",
    "sentiment" : "MUST_HAVE",
    "type" : "keyword",
    "start-position" : 0,
    "end-position" : 12,
    "concept-id" : "PDGg_WLr_WEw",
    "matched-string" : "kökspersonal",
    "annotation-id" : 0
  }, {
    "preferred-label" : "Stresshantering",
    "type" : "skill",
    "start-position" : 514,
    "end-position" : 525,
    "concept-id" : "XZbe_Z7P_jiL",
    "matched-string" : "stresstålig",
    "annotation-id" : 1
  }, {
    "preferred-label" : "noggrannhet",
    "type" : "esco-skill",
    "start-position" : 537,
    "end-position" : 545,
    "concept-id" : "mrsW_EkL_KRD",
    "matched-string" : "noggrann",
    "annotation-id" : 2
  } ],
  "text" : "Kökspersonal\nPå Kale & Crave jobbar vi med mat från grunden och använder inte gluten, laktos eller raffinerat socker i matlagningen. Vi lägger ner mycket jobb i vår prepp för att sedan kunna servera maten i snabbt utförande med eleganta upplägg. Vi är ett kreativt och energirikt team i köket och strävar ständigt efter förbättring både arbetsmässigt, produktmässigt och för att skapa en så rolig arbetsplats som möjligt.\nOm tjänsten\nIngen erfarenhet krävs för denna tjänst men vi ser helst att du är självgående, stresstålig, snabb och noggrann."
}