{
  "meta" : {
    "jobad" : {
      "description" : {
        "requirements" : null,
        "needs" : null,
        "company_information" : null,
        "text_formatted" : "Om arbetsplatsen\nI Lerums kommun arbetar vi tillsammans med ett starkt fokus på invånarna för att skapa en framgångsrik kommun där det är gott att leva, nu och i framtiden.\r\n\r\nDet innebär att vi är flexibla, vågar prova, vågar förändra i en omvärld med snabba växlingar. Vi som arbetar i Lerums kommun är alla viktiga pusselbitar för att det ska fungera och för att vi ska nå resultat.\n\nDå nuvarande Stab och utveckling kommer ombildas till en sektor söker vi nu en sektorchef som tillsammans med oss vill driva och bidra till vår påbörjade förändringsresa. Denna resa gör vi för att vi även i framtiden ska kunna nå våra mål, leverera med hög kvalitet till kommunens invånare och möta de utmaningar vi står inför.\n\nSektor kommunledning och verksamhetsstöd kommer ha totalt cirka 180 medarbetare, och vara en av fyra sektorer i Lerums kommun tillsammans med Sektor lärande, Sektor samhällsbyggnad och Sektor stöd och omsorg.\n\n\n\nArbetsuppgifter\nHuvuduppdraget som chef för Sektor kommunledning och verksamhetsstöd är att styra, stödja och samordna kommungemensamma processer utifrån ett helhets­perspektiv. En viktig del är också att effektivisera samordningen och samarbetet mellan de olika funktionerna inom sektorn. Syftet är att göra det möjligt för alla verksamheter att fokusera på sina huvuduppdrag och utvecklas och uppnå satta mål.\n\nI rollen har du personal-, budget- och övergripande ansvar för verksamhetsområdena ekonomi, HR samt Utveckling och hållbarhet som bland annat innefattar kommunikation, säkerhet och digitalisering. Även Kultur och fritid kommer vara en del av sektorn. Förutom det övergripande ansvaret för sektorn kommer du också att vara en viktig del i förvaltningsledningen.\n\nI din roll har du ett nära samarbete med kommundirektören men också med förtroendevalda, kollegor i förvaltningsledningen samt med chefer och specialister inom din sektorledningsgrupp. Som sektorchef ersätter du, liksom övriga sektorchefer, kommundirektören vid dennes frånvaro.\n\n \n\nKvalifikationer\nVi söker dig som har mångårig erfarenhet av ledarskap på strategisk nivå. Du har erfarenhet av strategiskt verksamhetsövergripande arbete i offentlig sektor och visar förståelse för den politiska organisationens beslutsfattande och de processer som ligger till grund för det. Du har en relevant högskole- eller universitets-utbildning och har erfarenhet av att genomföra övergripande förändrings- och utvecklingsarbete. Du har god kunskap inom styrning och ledning, och en bred förståelse för den kommunala verksamhetens komplexitet, dess olika förutsättningar och samspelet dem emellan. Du har god förmåga att arbeta med såväl konsekvensanalys som uppföljning och du är skicklig i att identifierar hur beslut kan påverka såväl helheten som delarna av vår organisation.\n\nDu är trygg och kommunikativ i din ledarroll. Du leder genom ett utvecklande ledarskap där medarbetare ges möjlighet att växa och utvecklas i sin profession. Du kan ta ut riktningen för helhetens bästa och ser värdet av att samspela och samarbeta med hela organisationen. Du bygger förtroendefulla relationer och är prestigelös.\n\nBefattningen kan komma att bli föremål för säkerhetsprövning.\n\n\n\nOm oss\nKommunens arbete ska kännetecknas av hållbarhet, kreativitet och inflytande. Vi arbetar för att hitta de bästa lösningarna för helheten, för invånarna, för företagarna, för besökarna. \n\nInom kommunens verksamheter arbetar cirka 3 000 medarbetare som tillsammans jobbar för att erbjuda god service och skapa välfärd för kommunens drygt 43 000 invånare. \n\nVi tror att våra olikheter berikar och utvecklar individen, verksamheten och samhället positivt. Som arbetsgivare arbetar Lerums kommun aktivt för jämställdhet och mångfald och mot all form av diskriminering och kränkande särbehandling. \n\nKommunens medarbetare ska ha en god arbetsmiljö som främjar möjligheter att kombinera arbete, föräldraskap och fritid. Vi erbjuder förmåner som friskvård och personalstöd.\n\n\nVälkommen med din ansökan senast söndag 14 augusti 2022.\n\n \n\nAnsök\nI den här rekryteringen har Lerums kommun valt att samarbeta med Solum Search. \nFör mer information om rekryteringsprocessen är du välkommen att kontakta chefsrekryterare Ylva Dahl, Solum Search, via ylva.dahl@solumsearch.se alt 0730–263834.\n\n ",
        "conditions" : "100%. Tillträde: Enligt överenskommelse\r\nTillsvidareanställning",
        "text" : "Om arbetsplatsen\nI Lerums kommun arbetar vi tillsammans med ett starkt fokus på invånarna för att skapa en framgångsrik kommun där det är gott att leva, nu och i framtiden.\r\n\r\nDet innebär att vi är flexibla, vågar prova, vågar förändra i en omvärld med snabba växlingar. Vi som arbetar i Lerums kommun är alla viktiga pusselbitar för att det ska fungera och för att vi ska nå resultat.\n\nDå nuvarande Stab och utveckling kommer ombildas till en sektor söker vi nu en sektorchef som tillsammans med oss vill driva och bidra till vår påbörjade förändringsresa. Denna resa gör vi för att vi även i framtiden ska kunna nå våra mål, leverera med hög kvalitet till kommunens invånare och möta de utmaningar vi står inför.\n\nSektor kommunledning och verksamhetsstöd kommer ha totalt cirka 180 medarbetare, och vara en av fyra sektorer i Lerums kommun tillsammans med Sektor lärande, Sektor samhällsbyggnad och Sektor stöd och omsorg.\n\n\n\nArbetsuppgifter\nHuvuduppdraget som chef för Sektor kommunledning och verksamhetsstöd är att styra, stödja och samordna kommungemensamma processer utifrån ett helhets­perspektiv. En viktig del är också att effektivisera samordningen och samarbetet mellan de olika funktionerna inom sektorn. Syftet är att göra det möjligt för alla verksamheter att fokusera på sina huvuduppdrag och utvecklas och uppnå satta mål.\n\nI rollen har du personal-, budget- och övergripande ansvar för verksamhetsområdena ekonomi, HR samt Utveckling och hållbarhet som bland annat innefattar kommunikation, säkerhet och digitalisering. Även Kultur och fritid kommer vara en del av sektorn. Förutom det övergripande ansvaret för sektorn kommer du också att vara en viktig del i förvaltningsledningen.\n\nI din roll har du ett nära samarbete med kommundirektören men också med förtroendevalda, kollegor i förvaltningsledningen samt med chefer och specialister inom din sektorledningsgrupp. Som sektorchef ersätter du, liksom övriga sektorchefer, kommundirektören vid dennes frånvaro.\n\n \n\nKvalifikationer\nVi söker dig som har mångårig erfarenhet av ledarskap på strategisk nivå. Du har erfarenhet av strategiskt verksamhetsövergripande arbete i offentlig sektor och visar förståelse för den politiska organisationens beslutsfattande och de processer som ligger till grund för det. Du har en relevant högskole- eller universitets-utbildning och har erfarenhet av att genomföra övergripande förändrings- och utvecklingsarbete. Du har god kunskap inom styrning och ledning, och en bred förståelse för den kommunala verksamhetens komplexitet, dess olika förutsättningar och samspelet dem emellan. Du har god förmåga att arbeta med såväl konsekvensanalys som uppföljning och du är skicklig i att identifierar hur beslut kan påverka såväl helheten som delarna av vår organisation.\n\nDu är trygg och kommunikativ i din ledarroll. Du leder genom ett utvecklande ledarskap där medarbetare ges möjlighet att växa och utvecklas i sin profession. Du kan ta ut riktningen för helhetens bästa och ser värdet av att samspela och samarbeta med hela organisationen. Du bygger förtroendefulla relationer och är prestigelös.\n\nBefattningen kan komma att bli föremål för säkerhetsprövning.\n\n\n\nOm oss\nKommunens arbete ska kännetecknas av hållbarhet, kreativitet och inflytande. Vi arbetar för att hitta de bästa lösningarna för helheten, för invånarna, för företagarna, för besökarna. \n\nInom kommunens verksamheter arbetar cirka 3 000 medarbetare som tillsammans jobbar för att erbjuda god service och skapa välfärd för kommunens drygt 43 000 invånare. \n\nVi tror att våra olikheter berikar och utvecklar individen, verksamheten och samhället positivt. Som arbetsgivare arbetar Lerums kommun aktivt för jämställdhet och mångfald och mot all form av diskriminering och kränkande särbehandling. \n\nKommunens medarbetare ska ha en god arbetsmiljö som främjar möjligheter att kombinera arbete, föräldraskap och fritid. Vi erbjuder förmåner som friskvård och personalstöd.\n\n\nVälkommen med din ansökan senast söndag 14 augusti 2022.\n\n \n\nAnsök\nI den här rekryteringen har Lerums kommun valt att samarbeta med Solum Search. \nFör mer information om rekryteringsprocessen är du välkommen att kontakta chefsrekryterare Ylva Dahl, Solum Search, via ylva.dahl@solumsearch.se alt 0730–263834."
      },
      "headline" : "Sektorchef kommunledning och verksamhetsstöd till Lerums kommun",
      "driving_license" : null,
      "employer" : {
        "email" : null,
        "phone_number" : null,
        "organization_number" : "5593116089",
        "name" : "Solum Search AB",
        "url" : null,
        "workplace" : "Solum Search AB"
      },
      "removed_date" : null,
      "logo_url" : null,
      "last_publication_date" : "2022-08-14T23:59:59",
      "number_of_vacancies" : 1,
      "occupation" : {
        "concept_id" : "qbYy_xKX_aip",
        "label" : "Organisationschef, kommun",
        "legacy_ams_taxonomy_id" : "6597"
      },
      "occupation_group" : {
        "concept_id" : "X1Ac_Y9P_PJo",
        "label" : "Förvaltnings- och planeringschefer",
        "legacy_ams_taxonomy_id" : "1230"
      },
      "employment_type" : {
        "concept_id" : "PFZr_Syz_cUq",
        "label" : "Vanlig anställning",
        "legacy_ams_taxonomy_id" : "1"
      },
      "webpage_url" : "https://arbetsformedlingen.se/platsbanken/annonser/26274836",
      "driving_license_required" : false,
      "application_contacts" : [ {
        "description" : "Ylva Dahl",
        "email" : null,
        "telephone" : "073-0263834",
        "name" : null,
        "contact_type" : null
      } ],
      "duration" : {
        "concept_id" : "a7uU_j21_mkL",
        "label" : "Tills vidare",
        "legacy_ams_taxonomy_id" : "1"
      },
      "nice_to_have" : {
        "education_level" : [ ],
        "work_experiences" : [ ],
        "skills" : [ ],
        "education" : [ ],
        "languages" : [ ]
      },
      "application_details" : {
        "via_af" : false,
        "email" : null,
        "other" : null,
        "reference" : "2022/19",
        "url" : "https://solumsearch.varbi.com/what:job/jobID:523163/type:job/where:1/apply:1",
        "information" : null
      },
      "source_type" : "VIA_PLATSBANKEN_DXA",
      "application_deadline" : "2022-08-14T23:59:59",
      "external_id" : "46-559311-6089-523163",
      "workplace_address" : {
        "coordinates" : [ 12.26882, 57.769485 ],
        "city" : null,
        "postcode" : null,
        "municipality" : "Lerum",
        "region_concept_id" : "zdoY_6u5_Krt",
        "region" : "Västra Götalands län",
        "country_code" : "199",
        "region_code" : "14",
        "municipality_concept_id" : "yHV7_2Y6_zQx",
        "country_concept_id" : "i46j_HmG_v64",
        "municipality_code" : "1441",
        "street_address" : null,
        "country" : "Sverige"
      },
      "id" : "26274836",
      "experience_required" : true,
      "working_hours_type" : {
        "concept_id" : "6YE1_gAC_R2G",
        "label" : "Heltid",
        "legacy_ams_taxonomy_id" : "1"
      },
      "access" : null,
      "timestamp" : 1656567769201,
      "must_have" : {
        "education_level" : [ ],
        "work_experiences" : [ {
          "concept_id" : "qbYy_xKX_aip",
          "weight" : 10,
          "label" : "Organisationschef, kommun",
          "legacy_ams_taxonomy_id" : "6597"
        } ],
        "skills" : [ ],
        "education" : [ ],
        "languages" : [ ]
      },
      "occupation_field" : {
        "concept_id" : "bh3H_Y3h_5eD",
        "label" : "Chefer och verksamhetsledare",
        "legacy_ams_taxonomy_id" : "20"
      },
      "scope_of_work" : {
        "min" : 100,
        "max" : 100
      },
      "salary_type" : {
        "concept_id" : "oG8G_9cW_nRf",
        "label" : "Fast månads- vecko- eller timlön",
        "legacy_ams_taxonomy_id" : "1"
      },
      "removed" : false,
      "salary_description" : "Fast",
      "access_to_own_car" : false,
      "publication_date" : "2022-06-30T07:42:49"
    },
    "name" : "Sektorchef kommunledning och verksamhetsstöd till Lerums kommun",
    "user" : "hannes"
  },
  "sha1" : "4f4c66900012010f638509d9f6fb100516232b3b",
  "annotations" : [ {
    "preferred-label" : "Lerum",
    "type" : "municipality",
    "start-position" : 50,
    "end-position" : 63,
    "concept-id" : "yHV7_2Y6_zQx",
    "matched-string" : "Lerums kommun",
    "annotation-id" : 8
  }, {
    "preferred-label" : "Lerum",
    "type" : "municipality",
    "start-position" : 83,
    "end-position" : 96,
    "concept-id" : "yHV7_2Y6_zQx",
    "matched-string" : "Lerums kommun",
    "annotation-id" : 9
  }, {
    "preferred-label" : "Lerum",
    "type" : "municipality",
    "start-position" : 352,
    "end-position" : 365,
    "concept-id" : "yHV7_2Y6_zQx",
    "matched-string" : "Lerums kommun",
    "annotation-id" : 10
  }, {
    "preferred-label" : "Stats- och kommunledning, lagstiftning och övergripande planering",
    "type" : "sni-level-5",
    "start-position" : 787,
    "end-position" : 800,
    "concept-id" : "hpfE_B9M_HKr",
    "matched-string" : "kommunledning",
    "annotation-id" : 11
  }, {
    "preferred-label" : "Lerum",
    "type" : "municipality",
    "start-position" : 892,
    "end-position" : 905,
    "concept-id" : "yHV7_2Y6_zQx",
    "matched-string" : "Lerums kommun",
    "annotation-id" : 12
  }, {
    "preferred-label" : "Samhällsbyggnad",
    "sentiment" : "MUST_HAVE",
    "type" : "skill",
    "start-position" : 945,
    "end-position" : 960,
    "concept-id" : "KEPE_tsb_fB8",
    "matched-string" : "samhällsbyggnad",
    "annotation-id" : 0
  }, {
    "preferred-label" : "Personalansvar",
    "sentiment" : "MUST_HAVE",
    "type" : "skill",
    "start-position" : 1421,
    "end-position" : 1429,
    "concept-id" : "ZzN5_m7B_5CY",
    "matched-string" : "personal",
    "annotation-id" : 1
  }, {
    "preferred-label" : "Budgetansvar",
    "type" : "skill",
    "start-position" : 1432,
    "end-position" : 1438,
    "concept-id" : "Gt5f_wdi_FSJ",
    "matched-string" : "budget",
    "annotation-id" : 13
  }, {
    "preferred-label" : "Ekonomiansvarig",
    "sentiment" : "MUST_HAVE",
    "type" : "keyword",
    "start-position" : 1488,
    "end-position" : 1495,
    "concept-id" : "eBQs_p5w_Jkj",
    "matched-string" : "ekonomi",
    "annotation-id" : 2
  }, {
    "preferred-label" : "Hr-ansvarig",
    "type" : "keyword",
    "start-position" : 1497,
    "end-position" : 1499,
    "concept-id" : "LS3z_52J_YJW",
    "matched-string" : "HR",
    "annotation-id" : 14
  }, {
    "preferred-label" : "Digitaliseringsansvarig",
    "type" : "keyword",
    "start-position" : 1586,
    "end-position" : 1600,
    "concept-id" : "dWYe_wPf_ceT",
    "matched-string" : "digitalisering",
    "annotation-id" : 15
  }, {
    "preferred-label" : "Utvecklingsarbete",
    "sentiment" : "MUST_HAVE",
    "type" : "skill",
    "start-position" : 2467,
    "end-position" : 2484,
    "concept-id" : "LsGo_Kh2_3kH",
    "matched-string" : "utvecklingsarbete",
    "annotation-id" : 3
  }, {
    "preferred-label" : "Lerum",
    "type" : "municipality",
    "start-position" : 3715,
    "end-position" : 3728,
    "concept-id" : "yHV7_2Y6_zQx",
    "matched-string" : "Lerums kommun",
    "annotation-id" : 16
  }, {
    "preferred-label" : "Jämställdhet",
    "sentiment" : "MUST_HAVE",
    "type" : "keyword",
    "start-position" : 3740,
    "end-position" : 3752,
    "concept-id" : "WgGj_zNt_Pzz",
    "matched-string" : "jämställdhet",
    "annotation-id" : 4
  }, {
    "preferred-label" : "stödja kulturell mångfald",
    "type" : "esco-skill",
    "start-position" : 3757,
    "end-position" : 3765,
    "concept-id" : "ARp9_7Lk_uhS",
    "matched-string" : "mångfald",
    "annotation-id" : 17
  }, {
    "preferred-label" : "arbetsmiljö",
    "sentiment" : "MUST_HAVE",
    "type" : "esco-skill",
    "start-position" : 3868,
    "end-position" : 3879,
    "concept-id" : "zdQY_QJh_nUH",
    "matched-string" : "arbetsmiljö",
    "annotation-id" : 5
  }, {
    "preferred-label" : "Friskvård",
    "sentiment" : "MUST_HAVE",
    "type" : "keyword",
    "start-position" : 3976,
    "end-position" : 3985,
    "concept-id" : "yoHe_xjK_qjH",
    "matched-string" : "friskvård",
    "annotation-id" : 6
  }, {
    "preferred-label" : "Chefsrekryterare",
    "sentiment" : "MUST_HAVE",
    "type" : "keyword",
    "start-position" : 4227,
    "end-position" : 4243,
    "concept-id" : "4z5j_zBu_if5",
    "matched-string" : "chefsrekryterare",
    "annotation-id" : 7
  } ],
  "text" : "Sektorchef kommunledning och verksamhetsstöd till Lerums kommun\nOm arbetsplatsen\nI Lerums kommun arbetar vi tillsammans med ett starkt fokus på invånarna för att skapa en framgångsrik kommun där det är gott att leva, nu och i framtiden.\r\n\r\nDet innebär att vi är flexibla, vågar prova, vågar förändra i en omvärld med snabba växlingar. Vi som arbetar i Lerums kommun är alla viktiga pusselbitar för att det ska fungera och för att vi ska nå resultat.\n\nDå nuvarande Stab och utveckling kommer ombildas till en sektor söker vi nu en sektorchef som tillsammans med oss vill driva och bidra till vår påbörjade förändringsresa. Denna resa gör vi för att vi även i framtiden ska kunna nå våra mål, leverera med hög kvalitet till kommunens invånare och möta de utmaningar vi står inför.\n\nSektor kommunledning och verksamhetsstöd kommer ha totalt cirka 180 medarbetare, och vara en av fyra sektorer i Lerums kommun tillsammans med Sektor lärande, Sektor samhällsbyggnad och Sektor stöd och omsorg.\n\n\n\nArbetsuppgifter\nHuvuduppdraget som chef för Sektor kommunledning och verksamhetsstöd är att styra, stödja och samordna kommungemensamma processer utifrån ett helhets­perspektiv. En viktig del är också att effektivisera samordningen och samarbetet mellan de olika funktionerna inom sektorn. Syftet är att göra det möjligt för alla verksamheter att fokusera på sina huvuduppdrag och utvecklas och uppnå satta mål.\n\nI rollen har du personal-, budget- och övergripande ansvar för verksamhetsområdena ekonomi, HR samt Utveckling och hållbarhet som bland annat innefattar kommunikation, säkerhet och digitalisering. Även Kultur och fritid kommer vara en del av sektorn. Förutom det övergripande ansvaret för sektorn kommer du också att vara en viktig del i förvaltningsledningen.\n\nI din roll har du ett nära samarbete med kommundirektören men också med förtroendevalda, kollegor i förvaltningsledningen samt med chefer och specialister inom din sektorledningsgrupp. Som sektorchef ersätter du, liksom övriga sektorchefer, kommundirektören vid dennes frånvaro.\n\n \n\nKvalifikationer\nVi söker dig som har mångårig erfarenhet av ledarskap på strategisk nivå. Du har erfarenhet av strategiskt verksamhetsövergripande arbete i offentlig sektor och visar förståelse för den politiska organisationens beslutsfattande och de processer som ligger till grund för det. Du har en relevant högskole- eller universitets-utbildning och har erfarenhet av att genomföra övergripande förändrings- och utvecklingsarbete. Du har god kunskap inom styrning och ledning, och en bred förståelse för den kommunala verksamhetens komplexitet, dess olika förutsättningar och samspelet dem emellan. Du har god förmåga att arbeta med såväl konsekvensanalys som uppföljning och du är skicklig i att identifierar hur beslut kan påverka såväl helheten som delarna av vår organisation.\n\nDu är trygg och kommunikativ i din ledarroll. Du leder genom ett utvecklande ledarskap där medarbetare ges möjlighet att växa och utvecklas i sin profession. Du kan ta ut riktningen för helhetens bästa och ser värdet av att samspela och samarbeta med hela organisationen. Du bygger förtroendefulla relationer och är prestigelös.\n\nBefattningen kan komma att bli föremål för säkerhetsprövning.\n\n\n\nOm oss\nKommunens arbete ska kännetecknas av hållbarhet, kreativitet och inflytande. Vi arbetar för att hitta de bästa lösningarna för helheten, för invånarna, för företagarna, för besökarna. \n\nInom kommunens verksamheter arbetar cirka 3 000 medarbetare som tillsammans jobbar för att erbjuda god service och skapa välfärd för kommunens drygt 43 000 invånare. \n\nVi tror att våra olikheter berikar och utvecklar individen, verksamheten och samhället positivt. Som arbetsgivare arbetar Lerums kommun aktivt för jämställdhet och mångfald och mot all form av diskriminering och kränkande särbehandling. \n\nKommunens medarbetare ska ha en god arbetsmiljö som främjar möjligheter att kombinera arbete, föräldraskap och fritid. Vi erbjuder förmåner som friskvård och personalstöd.\n\n\nVälkommen med din ansökan senast söndag 14 augusti 2022.\n\n \n\nAnsök\nI den här rekryteringen har Lerums kommun valt att samarbeta med Solum Search. \nFör mer information om rekryteringsprocessen är du välkommen att kontakta chefsrekryterare Ylva Dahl, Solum Search, via ylva.dahl@solumsearch.se alt 0730–263834."
}