{
  "meta" : {
    "jobad" : {
      "description" : {
        "requirements" : null,
        "needs" : null,
        "company_information" : null,
        "text_formatted" : "<p>Saya Sushi grundades 2012 och vi har två restauranger på Linnégatan 31 och Olofsgatan 6. Förutom bordservering erbjuder vi även take-away och catering. </p><p>Nu söker vi en sushikock på deltid/heltid (20-40 tim/vecka) enligt schema. Du ska ha minst 3 års erfarenhet av yrket, kunna hantera olika fiskar, knivar, dekoration, topping och såser. Vi vill vi att du har ett öga för mat och hur den serveras. </p><p>Anställningsform: 6 mån provanställning med möjlighet till tillsvidareanställning </p><p>Skicka in din ansökan (CV och personligt brev) redan nu till jobb@sayasushi.se, intervjuer sker löpande och tjänsten kan komma att tillsättas innan sista ansökningsdag.  </p>",
        "conditions" : null,
        "text" : "Saya Sushi grundades 2012 och vi har två restauranger på Linnégatan 31 och Olofsgatan 6. Förutom bordservering erbjuder vi även take-away och catering. \nNu söker vi en sushikock på deltid/heltid (20-40 tim/vecka) enligt schema. Du ska ha minst 3 års erfarenhet av yrket, kunna hantera olika fiskar, knivar, dekoration, topping och såser. Vi vill vi att du har ett öga för mat och hur den serveras. \nAnställningsform: 6 mån provanställning med möjlighet till tillsvidareanställning \nSkicka in din ansökan (CV och personligt brev) redan nu till jobb@sayasushi.se, intervjuer sker löpande och tjänsten kan komma att tillsättas innan sista ansökningsdag."
      },
      "headline" : "Sushikock på restaurang Saya Sushi",
      "driving_license" : null,
      "employer" : {
        "email" : null,
        "phone_number" : null,
        "organization_number" : "5592202104",
        "name" : "Blue fin AB",
        "url" : "http://www.sayasushi.se",
        "workplace" : "Blue fin AB"
      },
      "removed_date" : null,
      "logo_url" : null,
      "last_publication_date" : "2022-09-01T00:00:00",
      "number_of_vacancies" : 2,
      "occupation" : {
        "concept_id" : "YKhj_n5P_g4P",
        "label" : "Specialkock",
        "legacy_ams_taxonomy_id" : "5483"
      },
      "occupation_group" : {
        "concept_id" : "BStc_SJh_DKG",
        "label" : "Kockar och kallskänkor",
        "legacy_ams_taxonomy_id" : "5120"
      },
      "employment_type" : {
        "concept_id" : "PFZr_Syz_cUq",
        "label" : "Vanlig anställning",
        "legacy_ams_taxonomy_id" : "1"
      },
      "webpage_url" : "https://arbetsformedlingen.se/platsbanken/annonser/26427826",
      "driving_license_required" : false,
      "application_contacts" : [ {
        "description" : null,
        "email" : "jobb@sayasushi.se",
        "telephone" : null,
        "name" : "Tumenzaya Rydlund",
        "contact_type" : "Restaurangchef"
      } ],
      "duration" : {
        "concept_id" : "a7uU_j21_mkL",
        "label" : "Tills vidare",
        "legacy_ams_taxonomy_id" : "1"
      },
      "nice_to_have" : {
        "education_level" : [ ],
        "work_experiences" : [ ],
        "skills" : [ ],
        "education" : [ ],
        "languages" : [ ]
      },
      "application_details" : {
        "via_af" : false,
        "email" : "jobb@sayasushi.se",
        "other" : null,
        "reference" : null,
        "url" : null,
        "information" : null
      },
      "source_type" : "VIA_ANNONSERA",
      "application_deadline" : "2022-09-01T00:00:00",
      "external_id" : null,
      "workplace_address" : {
        "coordinates" : [ 18.06203100677164, 59.33608506246618 ],
        "city" : "Stockholm",
        "postcode" : "11136",
        "municipality" : "Stockholm",
        "region_concept_id" : "CifL_Rzy_Mku",
        "region" : "Stockholms län",
        "country_code" : "199",
        "region_code" : "01",
        "municipality_concept_id" : "AvNB_uwa_6n6",
        "country_concept_id" : "i46j_HmG_v64",
        "municipality_code" : "0180",
        "street_address" : "Olofsgatan 6",
        "country" : "Sverige"
      },
      "id" : "26427826",
      "experience_required" : true,
      "working_hours_type" : {
        "concept_id" : "6YE1_gAC_R2G",
        "label" : "Heltid",
        "legacy_ams_taxonomy_id" : "1"
      },
      "access" : null,
      "timestamp" : 1660835320269,
      "must_have" : {
        "education_level" : [ ],
        "work_experiences" : [ ],
        "skills" : [ ],
        "education" : [ ],
        "languages" : [ ]
      },
      "occupation_field" : {
        "concept_id" : "ScKy_FHB_7wT",
        "label" : "Hotell, restaurang, storhushåll",
        "legacy_ams_taxonomy_id" : "7"
      },
      "scope_of_work" : {
        "min" : 0,
        "max" : 100
      },
      "salary_type" : {
        "concept_id" : "oG8G_9cW_nRf",
        "label" : "Fast månads- vecko- eller timlön",
        "legacy_ams_taxonomy_id" : "1"
      },
      "removed" : false,
      "salary_description" : null,
      "access_to_own_car" : false,
      "publication_date" : "2022-08-18T17:08:40"
    },
    "name" : "Sushikock på restaurang Saya Sushi",
    "user" : "hannes"
  },
  "sha1" : "e347646e4f6f6b5a421d8cbfb09c05fb18304c46",
  "annotations" : [ {
    "preferred-label" : "Sushikock",
    "sentiment" : "MUST_HAVE",
    "type" : "keyword",
    "start-position" : 0,
    "end-position" : 9,
    "concept-id" : "YYSm_Pv3_znL",
    "matched-string" : "sushikock",
    "annotation-id" : 0
  }, {
    "preferred-label" : "Restaurang",
    "sentiment" : "NOT_RELEVANT",
    "type" : "keyword",
    "start-position" : 13,
    "end-position" : 23,
    "concept-id" : "o2Cg_3Ap_qvK",
    "matched-string" : "restaurang",
    "annotation-id" : 1
  }, {
    "preferred-label" : "Sushi",
    "sentiment" : "NOT_RELEVANT",
    "type" : "keyword",
    "start-position" : 29,
    "end-position" : 34,
    "concept-id" : "of6o_sJT_K7k",
    "matched-string" : "sushi",
    "annotation-id" : 2
  }, {
    "preferred-label" : "Sushi",
    "sentiment" : "NOT_RELEVANT",
    "type" : "keyword",
    "start-position" : 40,
    "end-position" : 45,
    "concept-id" : "of6o_sJT_K7k",
    "matched-string" : "sushi",
    "annotation-id" : 3
  }, {
    "preferred-label" : "Sushikock",
    "sentiment" : "MUST_HAVE",
    "type" : "keyword",
    "start-position" : 203,
    "end-position" : 212,
    "concept-id" : "YYSm_Pv3_znL",
    "matched-string" : "sushikock",
    "annotation-id" : 4
  }, {
    "preferred-label" : "Heltid/Deltid",
    "sentiment" : "OFFERED",
    "type" : "worktime-extent",
    "start-position" : 216,
    "end-position" : 247,
    "concept-id" : "hGCt_6Ni_XPz",
    "matched-string" : "deltid/heltid (20-40 tim/vecka)",
    "annotation-id" : 5
  }, {
    "preferred-label" : "2-4 års erfarenhet",
    "sentiment" : "MUST_HAVE",
    "type" : "occupation-experience-year",
    "start-position" : 273,
    "end-position" : 295,
    "concept-id" : "RWA2_uu6_udD",
    "matched-string" : "minst 3 års erfarenhet",
    "annotation-id" : 7
  }, {
    "preferred-label" : "Tillsvidareanställning (inkl. eventuell provanställning)",
    "sentiment" : "OFFERED",
    "type" : "employment-type",
    "start-position" : 493,
    "end-position" : 515,
    "concept-id" : "kpPX_CNN_gDU",
    "matched-string" : "tillsvidareanställning",
    "annotation-id" : 6
  } ],
  "text" : "Sushikock på restaurang Saya Sushi\nSaya Sushi grundades 2012 och vi har två restauranger på Linnégatan 31 och Olofsgatan 6. Förutom bordservering erbjuder vi även take-away och catering. \nNu söker vi en sushikock på deltid/heltid (20-40 tim/vecka) enligt schema. Du ska ha minst 3 års erfarenhet av yrket, kunna hantera olika fiskar, knivar, dekoration, topping och såser. Vi vill vi att du har ett öga för mat och hur den serveras. \nAnställningsform: 6 mån provanställning med möjlighet till tillsvidareanställning \nSkicka in din ansökan (CV och personligt brev) redan nu till jobb@sayasushi.se, intervjuer sker löpande och tjänsten kan komma att tillsättas innan sista ansökningsdag."
}