{
  "meta" : {
    "jobad" : {
      "description" : {
        "requirements" : null,
        "needs" : null,
        "company_information" : null,
        "text_formatted" : "Svenska kyrkan Malmö består av 6 församlingar och 21 kyrkor. Här finns även en kyrkogårdsförvaltning och stödfunktioner såsom HR, IT, ekonomi, kommunikation och fastighet. Sammanlagt är vi ca 500 anställda samt många ideella och förtroendevalda\n\nSvenska kyrkan Malmö befinner sig i ett spännande utvecklingsskede. Vi formar framtidens kyrka i en snabbt växande storstad med landets yngsta befolkning, där 50% av invånarna är mellan 0–35 år. Utmaningarna i Malmö är stora samtidigt som möjligheterna är många. Med Malmö universitet, Öresundsbron, innovationer inom arkitektur, kultur och företagande, är Malmö en stad i framkant. Här finns också segregation och utanförskap och behovet av livstolkning och växande i tro och tillit är stort. \n\n\nHusie församling har kyrkor och församlingshem som utgör levande mötesplatser. Det finns många ideella krafter som är en stor tillgång. Församlingen och hela Malmö pastorat befinner sig i ett utvecklingsskede där gamla strukturer och arbetssätt ses över och förändras. Här finns en av pastoratets diakonala noder med utveckling kring arbetsintegration och praktikmöjligheter, samt även lokalt diakonalt fokus på transitboende med besöksmöjligheter och stöd. Det bedrivs ett omfattande barn och ungdomsarbete med utveckling av metoder kring interreligiös och ekumenisk skolsamverkan. Församlingen består av stadsdelarna Husie, Kirseberg och också en del av Rosengård. På Rosengård kommer församlingens närvaro att breddas och utvecklas i samarbete med Fosie församling.\n\nKvalifikationer och vem vi söker\n\nVi söker dig som är prästvigd enligt Svenska Kyrkans ordning. För att trivas med dina arbetsuppgifter tror vi att du som person och präst bör ha en god social förmåga och lätt för att få kontakt med andra människor. Du ska uppskatta ekumeniska möten och samarbete med andra religionsutövare i en mångkulturell kontext. Du tycker om att arbeta med barn, familj och ungdomar och du trivs att arbeta i team och är flexibel i ditt arbetssätt. Att vara en medarbetare i Husie församling innebär arbete i ett öppet, kreativt arbetsklimat där vi berättar om evangeliet i både ord och handling. Särskilt fokus på tjänsten kommer att vara barn och familj samt utveckling av församlingens arbete på Rosengård. Sedvanliga prästuppgifter ingår också i tjänsten.\n\nÖvrig Information\n Sista ansökningsdag: Välkommen med din ansökan senast 16 augusti. \n Anställningsform: Tillsvidare\n Tjänstgöringsgrad: Heltid\n Tillträde: Enligt överenskommelse\n \n Information om tjänsten: För upplysningar om tjänsten kontakta församlingsherde Björn Jernström, bjorn.jernstrom@svenskakyrkan.se eller 040-27 92 39 eller arbetsledande präst Maria Eriksson, maria.eriksson3@svenskakyrkan.se, 040-27 91 41.\n \n Facklig representant:\n Kontakta växeln, 040-27 90 00\n\n\nVi erbjuder\nSvenska kyrkan i Malmö är en plats för inspiration och utveckling. Öppenhet, mångfald, och tillgänglighet är ledord som är viktiga för oss i vår verksamhet. Vi erbjuder goda möjligheter till kompetensutveckling och utbildning. Vi värnar om en god arbetsmiljö och att våra medarbetare ska känna delaktighet. Våra förmåner är bland annat friskvårdsbidrag, flextid och förmånligt erbjudande om lunchförmån\n\nVälkommen med din ansökan tillsammans med CV, personligt brev och referenser. Svenska Kyrkan i Malmö använder rekryteringsverktyget ReachMee. Därför ber vi dig att skicka in din ansökan via ReachMee genom att klicka på ansökningslänken längst ner i annonsen. \n\nVi tar ej emot ansökningar via mail eller brev.  Vi undanber oss direktkontakt med bemannings- och rekryteringsföretag samt försäljare av ytterligare jobbannonser.",
        "conditions" : "Heltid/\r\nEj specificerat",
        "text" : "Svenska kyrkan Malmö består av 6 församlingar och 21 kyrkor. Här finns även en kyrkogårdsförvaltning och stödfunktioner såsom HR, IT, ekonomi, kommunikation och fastighet. Sammanlagt är vi ca 500 anställda samt många ideella och förtroendevalda\n\nSvenska kyrkan Malmö befinner sig i ett spännande utvecklingsskede. Vi formar framtidens kyrka i en snabbt växande storstad med landets yngsta befolkning, där 50% av invånarna är mellan 0–35 år. Utmaningarna i Malmö är stora samtidigt som möjligheterna är många. Med Malmö universitet, Öresundsbron, innovationer inom arkitektur, kultur och företagande, är Malmö en stad i framkant. Här finns också segregation och utanförskap och behovet av livstolkning och växande i tro och tillit är stort. \n\n\nHusie församling har kyrkor och församlingshem som utgör levande mötesplatser. Det finns många ideella krafter som är en stor tillgång. Församlingen och hela Malmö pastorat befinner sig i ett utvecklingsskede där gamla strukturer och arbetssätt ses över och förändras. Här finns en av pastoratets diakonala noder med utveckling kring arbetsintegration och praktikmöjligheter, samt även lokalt diakonalt fokus på transitboende med besöksmöjligheter och stöd. Det bedrivs ett omfattande barn och ungdomsarbete med utveckling av metoder kring interreligiös och ekumenisk skolsamverkan. Församlingen består av stadsdelarna Husie, Kirseberg och också en del av Rosengård. På Rosengård kommer församlingens närvaro att breddas och utvecklas i samarbete med Fosie församling.\n\nKvalifikationer och vem vi söker\n\nVi söker dig som är prästvigd enligt Svenska Kyrkans ordning. För att trivas med dina arbetsuppgifter tror vi att du som person och präst bör ha en god social förmåga och lätt för att få kontakt med andra människor. Du ska uppskatta ekumeniska möten och samarbete med andra religionsutövare i en mångkulturell kontext. Du tycker om att arbeta med barn, familj och ungdomar och du trivs att arbeta i team och är flexibel i ditt arbetssätt. Att vara en medarbetare i Husie församling innebär arbete i ett öppet, kreativt arbetsklimat där vi berättar om evangeliet i både ord och handling. Särskilt fokus på tjänsten kommer att vara barn och familj samt utveckling av församlingens arbete på Rosengård. Sedvanliga prästuppgifter ingår också i tjänsten.\n\nÖvrig Information\n Sista ansökningsdag: Välkommen med din ansökan senast 16 augusti. \n Anställningsform: Tillsvidare\n Tjänstgöringsgrad: Heltid\n Tillträde: Enligt överenskommelse\n \n Information om tjänsten: För upplysningar om tjänsten kontakta församlingsherde Björn Jernström, bjorn.jernstrom@svenskakyrkan.se eller 040-27 92 39 eller arbetsledande präst Maria Eriksson, maria.eriksson3@svenskakyrkan.se, 040-27 91 41.\n \n Facklig representant:\n Kontakta växeln, 040-27 90 00\n\n\nVi erbjuder\nSvenska kyrkan i Malmö är en plats för inspiration och utveckling. Öppenhet, mångfald, och tillgänglighet är ledord som är viktiga för oss i vår verksamhet. Vi erbjuder goda möjligheter till kompetensutveckling och utbildning. Vi värnar om en god arbetsmiljö och att våra medarbetare ska känna delaktighet. Våra förmåner är bland annat friskvårdsbidrag, flextid och förmånligt erbjudande om lunchförmån\n\nVälkommen med din ansökan tillsammans med CV, personligt brev och referenser. Svenska Kyrkan i Malmö använder rekryteringsverktyget ReachMee. Därför ber vi dig att skicka in din ansökan via ReachMee genom att klicka på ansökningslänken längst ner i annonsen. \n\nVi tar ej emot ansökningar via mail eller brev.  Vi undanber oss direktkontakt med bemannings- och rekryteringsföretag samt försäljare av ytterligare jobbannonser."
      },
      "headline" : "Präst till Husie",
      "driving_license" : null,
      "employer" : {
        "email" : null,
        "phone_number" : null,
        "organization_number" : "2520031051",
        "name" : "Malmö Pastorat",
        "url" : "https://svenskakyrkanmalmo.se/lediga-tjanster/",
        "workplace" : "Svenska kyrkan Malmö"
      },
      "removed_date" : null,
      "logo_url" : "https://www.arbetsformedlingen.se/rest/arbetsgivare/rest/af/v3/organisation/2520031051/logotyper/logo.png",
      "last_publication_date" : "2022-08-16T23:59:59",
      "number_of_vacancies" : 1,
      "occupation" : {
        "concept_id" : "jQKk_Wzd_pvu",
        "label" : "Komminister",
        "legacy_ams_taxonomy_id" : "2113"
      },
      "occupation_group" : {
        "concept_id" : "2L2s_EU8_PzR",
        "label" : "Präster",
        "legacy_ams_taxonomy_id" : "2671"
      },
      "employment_type" : {
        "concept_id" : "PFZr_Syz_cUq",
        "label" : "Vanlig anställning",
        "legacy_ams_taxonomy_id" : "1"
      },
      "webpage_url" : "https://arbetsformedlingen.se/platsbanken/annonser/26308402",
      "driving_license_required" : false,
      "application_contacts" : [ ],
      "duration" : {
        "concept_id" : "a7uU_j21_mkL",
        "label" : "Tills vidare",
        "legacy_ams_taxonomy_id" : "1"
      },
      "nice_to_have" : {
        "education_level" : [ ],
        "work_experiences" : [ ],
        "skills" : [ ],
        "education" : [ ],
        "languages" : [ ]
      },
      "application_details" : {
        "via_af" : false,
        "email" : null,
        "other" : null,
        "reference" : null,
        "url" : "https://web103.reachmee.com/ext/I021/1794/main?site=7&validator=e03b476d43e97f97c284be667fe54040&lang=SE&rmpage=job&rmjob=101",
        "information" : null
      },
      "source_type" : "VIA_PLATSBANKEN_DXA",
      "application_deadline" : "2022-08-16T23:59:59",
      "external_id" : "46-252003-1051-101",
      "workplace_address" : {
        "coordinates" : [ 13.003822, 55.60498 ],
        "city" : null,
        "postcode" : null,
        "municipality" : "Malmö",
        "region_concept_id" : "CaRE_1nn_cSU",
        "region" : "Skåne län",
        "country_code" : "199",
        "region_code" : "12",
        "municipality_concept_id" : "oYPt_yRA_Smm",
        "country_concept_id" : "i46j_HmG_v64",
        "municipality_code" : "1280",
        "street_address" : null,
        "country" : "Sverige"
      },
      "id" : "26308402",
      "experience_required" : true,
      "working_hours_type" : {
        "concept_id" : "6YE1_gAC_R2G",
        "label" : "Heltid",
        "legacy_ams_taxonomy_id" : "1"
      },
      "access" : null,
      "timestamp" : 1657269439644,
      "must_have" : {
        "education_level" : [ ],
        "work_experiences" : [ {
          "concept_id" : "jQKk_Wzd_pvu",
          "weight" : 10,
          "label" : "Komminister",
          "legacy_ams_taxonomy_id" : "2113"
        } ],
        "skills" : [ ],
        "education" : [ ],
        "languages" : [ ]
      },
      "occupation_field" : {
        "concept_id" : "GazW_2TU_kJw",
        "label" : "Yrken med social inriktning",
        "legacy_ams_taxonomy_id" : "16"
      },
      "scope_of_work" : {
        "min" : 100,
        "max" : 100
      },
      "salary_type" : {
        "concept_id" : "oG8G_9cW_nRf",
        "label" : "Fast månads- vecko- eller timlön",
        "legacy_ams_taxonomy_id" : "1"
      },
      "removed" : false,
      "salary_description" : "Fast månadslön",
      "access_to_own_car" : false,
      "publication_date" : "2022-07-21T00:00:00"
    },
    "name" : "Präst till Husie",
    "user" : "hannes"
  },
  "sha1" : "e282e7f9f46a76b1a1b898b3e35484f57a301b76",
  "annotations" : [ {
    "preferred-label" : "Präster",
    "type" : "ssyk-level-4",
    "start-position" : 0,
    "end-position" : 5,
    "concept-id" : "2L2s_EU8_PzR",
    "matched-string" : "Präst",
    "annotation-id" : 17
  }, {
    "preferred-label" : "Kyrkan",
    "sentiment" : "MUST_HAVE",
    "type" : "keyword",
    "start-position" : 25,
    "end-position" : 31,
    "concept-id" : "h4LF_GE3_FGu",
    "matched-string" : "kyrkan",
    "annotation-id" : 1
  }, {
    "preferred-label" : "Malmö",
    "type" : "municipality",
    "start-position" : 32,
    "end-position" : 37,
    "concept-id" : "oYPt_yRA_Smm",
    "matched-string" : "Malmö",
    "annotation-id" : 18
  }, {
    "preferred-label" : "HR",
    "type" : "keyword",
    "start-position" : 143,
    "end-position" : 145,
    "concept-id" : "YxV3_BQC_eMP",
    "matched-string" : "HR",
    "annotation-id" : 20
  }, {
    "preferred-label" : "Data/IT",
    "sentiment" : "MUST_HAVE",
    "type" : "occupation-field",
    "start-position" : 147,
    "end-position" : 149,
    "concept-id" : "apaJ_2ja_LuF",
    "matched-string" : "it",
    "annotation-id" : 2
  }, {
    "preferred-label" : "Ekonomi",
    "sentiment" : "MUST_HAVE",
    "type" : "keyword",
    "start-position" : 151,
    "end-position" : 158,
    "concept-id" : "PW4f_bmT_new",
    "matched-string" : "ekonomi",
    "annotation-id" : 3
  }, {
    "preferred-label" : "kommunikation",
    "type" : "esco-skill",
    "start-position" : 160,
    "end-position" : 173,
    "concept-id" : "ahPU_HgE_Jeb",
    "matched-string" : "kommunikation",
    "annotation-id" : 21
  }, {
    "preferred-label" : "Fastighetsskötsel",
    "type" : "skill",
    "start-position" : 178,
    "end-position" : 187,
    "concept-id" : "J5Xc_doF_TUR",
    "matched-string" : "fastighet",
    "annotation-id" : 22
  }, {
    "preferred-label" : "Kyrkan",
    "sentiment" : "MUST_HAVE",
    "type" : "keyword",
    "start-position" : 271,
    "end-position" : 277,
    "concept-id" : "h4LF_GE3_FGu",
    "matched-string" : "kyrkan",
    "annotation-id" : 5
  }, {
    "preferred-label" : "Malmö",
    "type" : "municipality",
    "start-position" : 278,
    "end-position" : 283,
    "concept-id" : "oYPt_yRA_Smm",
    "matched-string" : "Malmö",
    "annotation-id" : 19
  }, {
    "preferred-label" : "Malmö",
    "type" : "municipality",
    "start-position" : 473,
    "end-position" : 478,
    "concept-id" : "oYPt_yRA_Smm",
    "matched-string" : "Malmö",
    "annotation-id" : 23
  }, {
    "preferred-label" : "Företagande",
    "sentiment" : "MUST_HAVE",
    "type" : "keyword",
    "start-position" : 604,
    "end-position" : 615,
    "concept-id" : "fxGP_Unf_RJZ",
    "matched-string" : "företagande",
    "annotation-id" : 6
  }, {
    "preferred-label" : "Malmö",
    "type" : "municipality",
    "start-position" : 620,
    "end-position" : 625,
    "concept-id" : "oYPt_yRA_Smm",
    "matched-string" : "Malmö",
    "annotation-id" : 24
  }, {
    "preferred-label" : "Församling",
    "sentiment" : "MUST_HAVE",
    "type" : "keyword",
    "start-position" : 766,
    "end-position" : 776,
    "concept-id" : "rfGv_wrD_n9x",
    "matched-string" : "församling",
    "annotation-id" : 7
  }, {
    "preferred-label" : "Församling",
    "sentiment" : "MUST_HAVE",
    "type" : "keyword",
    "start-position" : 1517,
    "end-position" : 1527,
    "concept-id" : "rfGv_wrD_n9x",
    "matched-string" : "församling",
    "annotation-id" : 8
  }, {
    "preferred-label" : "Prästvigd",
    "sentiment" : "MUST_HAVE",
    "type" : "skill",
    "start-position" : 1584,
    "end-position" : 1593,
    "concept-id" : "Qcej_yyR_HG3",
    "matched-string" : "prästvigd",
    "annotation-id" : 9
  }, {
    "preferred-label" : "Kyrkan",
    "type" : "keyword",
    "start-position" : 1609,
    "end-position" : 1616,
    "concept-id" : "h4LF_GE3_FGu",
    "matched-string" : "Kyrkans",
    "annotation-id" : 25
  }, {
    "preferred-label" : "Präster",
    "type" : "ssyk-level-4",
    "start-position" : 1696,
    "end-position" : 1701,
    "concept-id" : "2L2s_EU8_PzR",
    "matched-string" : "präst",
    "annotation-id" : 26
  }, {
    "preferred-label" : "Församling",
    "sentiment" : "MUST_HAVE",
    "type" : "keyword",
    "start-position" : 2035,
    "end-position" : 2045,
    "concept-id" : "rfGv_wrD_n9x",
    "matched-string" : "församling",
    "annotation-id" : 11
  }, {
    "preferred-label" : "Tillsvidareanställning (inkl. eventuell provanställning)",
    "type" : "employment-type",
    "start-position" : 2420,
    "end-position" : 2431,
    "concept-id" : "kpPX_CNN_gDU",
    "matched-string" : "Tillsvidare",
    "annotation-id" : 27
  }, {
    "preferred-label" : "Heltid",
    "type" : "worktime-extent",
    "start-position" : 2452,
    "end-position" : 2458,
    "concept-id" : "6YE1_gAC_R2G",
    "matched-string" : "Heltid",
    "annotation-id" : 28
  }, {
    "preferred-label" : "Kyrkan",
    "sentiment" : "MUST_HAVE",
    "type" : "keyword",
    "start-position" : 2814,
    "end-position" : 2820,
    "concept-id" : "h4LF_GE3_FGu",
    "matched-string" : "kyrkan",
    "annotation-id" : 13
  }, {
    "preferred-label" : "Malmö",
    "type" : "municipality",
    "start-position" : 2823,
    "end-position" : 2828,
    "concept-id" : "oYPt_yRA_Smm",
    "matched-string" : "Malmö",
    "annotation-id" : 30
  }, {
    "preferred-label" : "arbetsmiljö",
    "sentiment" : "MUST_HAVE",
    "type" : "esco-skill",
    "start-position" : 3053,
    "end-position" : 3064,
    "concept-id" : "zdQY_QJh_nUH",
    "matched-string" : "arbetsmiljö",
    "annotation-id" : 14
  }, {
    "preferred-label" : "Kyrkan",
    "sentiment" : "MUST_HAVE",
    "type" : "keyword",
    "start-position" : 3296,
    "end-position" : 3302,
    "concept-id" : "h4LF_GE3_FGu",
    "matched-string" : "kyrkan",
    "annotation-id" : 16
  }, {
    "preferred-label" : "Malmö",
    "type" : "municipality",
    "start-position" : 3305,
    "end-position" : 3310,
    "concept-id" : "oYPt_yRA_Smm",
    "matched-string" : "Malmö",
    "annotation-id" : 29
  } ],
  "text" : "Präst till Husie\nSvenska kyrkan Malmö består av 6 församlingar och 21 kyrkor. Här finns även en kyrkogårdsförvaltning och stödfunktioner såsom HR, IT, ekonomi, kommunikation och fastighet. Sammanlagt är vi ca 500 anställda samt många ideella och förtroendevalda\n\nSvenska kyrkan Malmö befinner sig i ett spännande utvecklingsskede. Vi formar framtidens kyrka i en snabbt växande storstad med landets yngsta befolkning, där 50% av invånarna är mellan 0–35 år. Utmaningarna i Malmö är stora samtidigt som möjligheterna är många. Med Malmö universitet, Öresundsbron, innovationer inom arkitektur, kultur och företagande, är Malmö en stad i framkant. Här finns också segregation och utanförskap och behovet av livstolkning och växande i tro och tillit är stort. \n\n\nHusie församling har kyrkor och församlingshem som utgör levande mötesplatser. Det finns många ideella krafter som är en stor tillgång. Församlingen och hela Malmö pastorat befinner sig i ett utvecklingsskede där gamla strukturer och arbetssätt ses över och förändras. Här finns en av pastoratets diakonala noder med utveckling kring arbetsintegration och praktikmöjligheter, samt även lokalt diakonalt fokus på transitboende med besöksmöjligheter och stöd. Det bedrivs ett omfattande barn och ungdomsarbete med utveckling av metoder kring interreligiös och ekumenisk skolsamverkan. Församlingen består av stadsdelarna Husie, Kirseberg och också en del av Rosengård. På Rosengård kommer församlingens närvaro att breddas och utvecklas i samarbete med Fosie församling.\n\nKvalifikationer och vem vi söker\n\nVi söker dig som är prästvigd enligt Svenska Kyrkans ordning. För att trivas med dina arbetsuppgifter tror vi att du som person och präst bör ha en god social förmåga och lätt för att få kontakt med andra människor. Du ska uppskatta ekumeniska möten och samarbete med andra religionsutövare i en mångkulturell kontext. Du tycker om att arbeta med barn, familj och ungdomar och du trivs att arbeta i team och är flexibel i ditt arbetssätt. Att vara en medarbetare i Husie församling innebär arbete i ett öppet, kreativt arbetsklimat där vi berättar om evangeliet i både ord och handling. Särskilt fokus på tjänsten kommer att vara barn och familj samt utveckling av församlingens arbete på Rosengård. Sedvanliga prästuppgifter ingår också i tjänsten.\n\nÖvrig Information\n Sista ansökningsdag: Välkommen med din ansökan senast 16 augusti. \n Anställningsform: Tillsvidare\n Tjänstgöringsgrad: Heltid\n Tillträde: Enligt överenskommelse\n \n Information om tjänsten: För upplysningar om tjänsten kontakta församlingsherde Björn Jernström, bjorn.jernstrom@svenskakyrkan.se eller 040-27 92 39 eller arbetsledande präst Maria Eriksson, maria.eriksson3@svenskakyrkan.se, 040-27 91 41.\n \n Facklig representant:\n Kontakta växeln, 040-27 90 00\n\n\nVi erbjuder\nSvenska kyrkan i Malmö är en plats för inspiration och utveckling. Öppenhet, mångfald, och tillgänglighet är ledord som är viktiga för oss i vår verksamhet. Vi erbjuder goda möjligheter till kompetensutveckling och utbildning. Vi värnar om en god arbetsmiljö och att våra medarbetare ska känna delaktighet. Våra förmåner är bland annat friskvårdsbidrag, flextid och förmånligt erbjudande om lunchförmån\n\nVälkommen med din ansökan tillsammans med CV, personligt brev och referenser. Svenska Kyrkan i Malmö använder rekryteringsverktyget ReachMee. Därför ber vi dig att skicka in din ansökan via ReachMee genom att klicka på ansökningslänken längst ner i annonsen. \n\nVi tar ej emot ansökningar via mail eller brev.  Vi undanber oss direktkontakt med bemannings- och rekryteringsföretag samt försäljare av ytterligare jobbannonser."
}