{
  "meta" : {
    "jobad" : {
      "description" : {
        "requirements" : null,
        "needs" : null,
        "company_information" : null,
        "text_formatted" : "Om oss\nBemanning med omsorg.\n\nOfelia vård månar om den svenska sjukvården, våra medborgare och om våra sjuksköterskor. Vi är Sveriges tryggaste bemanningsföretag för dig som är sjuksköterska. Vi har uppdragen som du söker och villkoren som du förtjänar.\nOfelia vård är ett auktoriserat bemanningsföretag med medlemskap i Kompetensföretagen. Detta är en garanti att vi följer arbetsmarknadens lagar och regler. Vi har kollektivavtal med Vårdförbundet, Läkarförbundet och Unionen. Detta är en självklarhet för oss!\nMed en VD med lång erfarenhet som narkossjuksköterska och erfarna konsultchefer med vårderfarenhet så vet vi vad som är viktigt för dig som konsult ute på uppdrag. Vi är upphandlade i hela Sverige och finns tillgängliga för dig dygnet runt.\nOfelia vård finns här för dig som sjuksköterska som vill arbeta för de villkor som du förtjänar, den arbetsmiljö som du vill ha och den flexibilitet som livet ibland kräver.\n\n\nVi har utöver detta en mängd förmånlig rabatter för alla våra anställda\n\nDina arbetsuppgifter\nSedvanligt arbete för sjuksköterska på allmänpsykiatrisk vårdavdelning\n\n\nKontakta oss gärn för mer information på info@ofelia.se 010-178 36 20\n\nVi hjälper självfallet till med resa och boende vid behov.\n\n\nDin profil\nVi söker dig som är legitimerad sjuksköterska med relevant erfarenhet.\n\nVarmt välkommen med dina och önskemål och ansökan.",
        "conditions" : "Heltid\r\nTillsvidare",
        "text" : "Om oss\nBemanning med omsorg.\n\nOfelia vård månar om den svenska sjukvården, våra medborgare och om våra sjuksköterskor. Vi är Sveriges tryggaste bemanningsföretag för dig som är sjuksköterska. Vi har uppdragen som du söker och villkoren som du förtjänar.\nOfelia vård är ett auktoriserat bemanningsföretag med medlemskap i Kompetensföretagen. Detta är en garanti att vi följer arbetsmarknadens lagar och regler. Vi har kollektivavtal med Vårdförbundet, Läkarförbundet och Unionen. Detta är en självklarhet för oss!\nMed en VD med lång erfarenhet som narkossjuksköterska och erfarna konsultchefer med vårderfarenhet så vet vi vad som är viktigt för dig som konsult ute på uppdrag. Vi är upphandlade i hela Sverige och finns tillgängliga för dig dygnet runt.\nOfelia vård finns här för dig som sjuksköterska som vill arbeta för de villkor som du förtjänar, den arbetsmiljö som du vill ha och den flexibilitet som livet ibland kräver.\n\n\nVi har utöver detta en mängd förmånlig rabatter för alla våra anställda\n\nDina arbetsuppgifter\nSedvanligt arbete för sjuksköterska på allmänpsykiatrisk vårdavdelning\n\n\nKontakta oss gärn för mer information på info@ofelia.se 010-178 36 20\n\nVi hjälper självfallet till med resa och boende vid behov.\n\n\nDin profil\nVi söker dig som är legitimerad sjuksköterska med relevant erfarenhet.\n\nVarmt välkommen med dina och önskemål och ansökan."
      },
      "headline" : "Sjuksköterskor till psykiatriska kliniken",
      "driving_license" : null,
      "employer" : {
        "email" : null,
        "phone_number" : null,
        "organization_number" : "5565792131",
        "name" : "Ofelia Vård AB",
        "url" : "http://www.ofelia.se",
        "workplace" : "Ofelia Vård AB"
      },
      "removed_date" : null,
      "logo_url" : null,
      "last_publication_date" : "2022-08-31T23:59:59",
      "number_of_vacancies" : 1,
      "occupation" : {
        "concept_id" : "bXNH_MNX_dUR",
        "label" : "Sjuksköterska, grundutbildad",
        "legacy_ams_taxonomy_id" : "7296"
      },
      "occupation_group" : {
        "concept_id" : "Z8ci_bBE_tmx",
        "label" : "Grundutbildade sjuksköterskor",
        "legacy_ams_taxonomy_id" : "2221"
      },
      "employment_type" : {
        "concept_id" : "PFZr_Syz_cUq",
        "label" : "Vanlig anställning",
        "legacy_ams_taxonomy_id" : "1"
      },
      "webpage_url" : "https://arbetsformedlingen.se/platsbanken/annonser/26426242",
      "driving_license_required" : false,
      "application_contacts" : [ {
        "description" : "Sara Hisved Spers",
        "email" : "info@ofelia.se",
        "telephone" : "010-178 36 20",
        "name" : null,
        "contact_type" : null
      } ],
      "duration" : {
        "concept_id" : "a7uU_j21_mkL",
        "label" : "Tills vidare",
        "legacy_ams_taxonomy_id" : "1"
      },
      "nice_to_have" : {
        "education_level" : [ ],
        "work_experiences" : [ ],
        "skills" : [ ],
        "education" : [ ],
        "languages" : [ ]
      },
      "application_details" : {
        "via_af" : false,
        "email" : null,
        "other" : null,
        "reference" : "6628",
        "url" : "https://cv-shvab.app.intelliplan.eu/JobAd/Show?jaid=6628",
        "information" : null
      },
      "source_type" : "VIA_PLATSBANKEN_DXA",
      "application_deadline" : "2022-08-31T23:59:59",
      "external_id" : "46-556579-2131-6628",
      "workplace_address" : {
        "coordinates" : [ 16.192421, 58.587746 ],
        "city" : null,
        "postcode" : null,
        "municipality" : "Norrköping",
        "region_concept_id" : "oLT3_Q9p_3nn",
        "region" : "Östergötlands län",
        "country_code" : "199",
        "region_code" : "05",
        "municipality_concept_id" : "SYty_Yho_JAF",
        "country_concept_id" : "i46j_HmG_v64",
        "municipality_code" : "0581",
        "street_address" : null,
        "country" : "Sverige"
      },
      "id" : "26426242",
      "experience_required" : false,
      "working_hours_type" : {
        "concept_id" : "6YE1_gAC_R2G",
        "label" : "Heltid",
        "legacy_ams_taxonomy_id" : "1"
      },
      "access" : null,
      "timestamp" : 1660823863754,
      "must_have" : {
        "education_level" : [ ],
        "work_experiences" : [ ],
        "skills" : [ ],
        "education" : [ ],
        "languages" : [ ]
      },
      "occupation_field" : {
        "concept_id" : "NYW6_mP6_vwf",
        "label" : "Hälso- och sjukvård",
        "legacy_ams_taxonomy_id" : "8"
      },
      "scope_of_work" : {
        "min" : 100,
        "max" : 100
      },
      "salary_type" : {
        "concept_id" : "oG8G_9cW_nRf",
        "label" : "Fast månads- vecko- eller timlön",
        "legacy_ams_taxonomy_id" : "1"
      },
      "removed" : false,
      "salary_description" : "Fast lön",
      "access_to_own_car" : false,
      "publication_date" : "2022-08-18T13:57:43"
    },
    "name" : "Sjuksköterskor till psykiatriska kliniken",
    "user" : "hannes"
  },
  "sha1" : "5078c868bb43d7c26f89ea291650e3f61a295211",
  "annotations" : [ {
    "preferred-label" : "Sjuksköterska, grundutbildad",
    "sentiment" : "MUST_HAVE",
    "type" : "occupation-name",
    "start-position" : 0,
    "end-position" : 14,
    "concept-id" : "bXNH_MNX_dUR",
    "matched-string" : "sjuksköterskor",
    "annotation-id" : 0
  }, {
    "preferred-label" : "Psykiatri",
    "sentiment" : "MUST_HAVE",
    "type" : "skill",
    "start-position" : 20,
    "end-position" : 41,
    "concept-id" : "sXoR_gGY_ycN",
    "matched-string" : "psykiatriska kliniken",
    "annotation-id" : 11
  }, {
    "preferred-label" : "Sjuksköterskor",
    "sentiment" : "NOT_RELEVANT",
    "type" : "ssyk-level-3",
    "start-position" : 145,
    "end-position" : 159,
    "concept-id" : "jzaN_Vqk_TP1",
    "matched-string" : "sjuksköterskor",
    "annotation-id" : 2
  }, {
    "preferred-label" : "Sjuksköterska",
    "sentiment" : "NOT_RELEVANT",
    "type" : "keyword",
    "start-position" : 219,
    "end-position" : 232,
    "concept-id" : "jrjV_wcz_fxg",
    "matched-string" : "sjuksköterska",
    "annotation-id" : 3
  }, {
    "preferred-label" : "Kollektivavtal",
    "sentiment" : "OFFERED",
    "type" : "skill",
    "start-position" : 459,
    "end-position" : 473,
    "concept-id" : "z7wE_9xb_3jX",
    "matched-string" : "kollektivavtal",
    "annotation-id" : 4
  }, {
    "preferred-label" : "Narkossjuksköterska",
    "sentiment" : "NOT_RELEVANT",
    "type" : "keyword",
    "start-position" : 589,
    "end-position" : 608,
    "concept-id" : "jCqK_dxK_w65",
    "matched-string" : "narkossjuksköterska",
    "annotation-id" : 5
  }, {
    "preferred-label" : "Sjuksköterska",
    "sentiment" : "NOT_RELEVANT",
    "type" : "keyword",
    "start-position" : 830,
    "end-position" : 843,
    "concept-id" : "jrjV_wcz_fxg",
    "matched-string" : "sjuksköterska",
    "annotation-id" : 6
  }, {
    "preferred-label" : "arbetsmiljö",
    "sentiment" : "OFFERED",
    "type" : "esco-skill",
    "start-position" : 897,
    "end-position" : 908,
    "concept-id" : "zdQY_QJh_nUH",
    "matched-string" : "arbetsmiljö",
    "annotation-id" : 7
  }, {
    "preferred-label" : "Sjuksköterska, grundutbildad",
    "sentiment" : "MUST_HAVE",
    "type" : "occupation-name",
    "start-position" : 1088,
    "end-position" : 1101,
    "concept-id" : "bXNH_MNX_dUR",
    "matched-string" : "sjuksköterska",
    "annotation-id" : 8
  }, {
    "preferred-label" : "Vårdavdelning/Mottagning",
    "sentiment" : "MUST_HAVE",
    "type" : "skill",
    "start-position" : 1123,
    "end-position" : 1136,
    "concept-id" : "TuUX_3Jo_wyq",
    "matched-string" : "vårdavdelning",
    "annotation-id" : 9
  }, {
    "preferred-label" : "Sjuksköterska, grundutbildad",
    "sentiment" : "MUST_HAVE",
    "type" : "occupation-name",
    "start-position" : 1314,
    "end-position" : 1327,
    "concept-id" : "bXNH_MNX_dUR",
    "matched-string" : "sjuksköterska",
    "annotation-id" : 10
  } ],
  "text" : "Sjuksköterskor till psykiatriska kliniken\nOm oss\nBemanning med omsorg.\n\nOfelia vård månar om den svenska sjukvården, våra medborgare och om våra sjuksköterskor. Vi är Sveriges tryggaste bemanningsföretag för dig som är sjuksköterska. Vi har uppdragen som du söker och villkoren som du förtjänar.\nOfelia vård är ett auktoriserat bemanningsföretag med medlemskap i Kompetensföretagen. Detta är en garanti att vi följer arbetsmarknadens lagar och regler. Vi har kollektivavtal med Vårdförbundet, Läkarförbundet och Unionen. Detta är en självklarhet för oss!\nMed en VD med lång erfarenhet som narkossjuksköterska och erfarna konsultchefer med vårderfarenhet så vet vi vad som är viktigt för dig som konsult ute på uppdrag. Vi är upphandlade i hela Sverige och finns tillgängliga för dig dygnet runt.\nOfelia vård finns här för dig som sjuksköterska som vill arbeta för de villkor som du förtjänar, den arbetsmiljö som du vill ha och den flexibilitet som livet ibland kräver.\n\n\nVi har utöver detta en mängd förmånlig rabatter för alla våra anställda\n\nDina arbetsuppgifter\nSedvanligt arbete för sjuksköterska på allmänpsykiatrisk vårdavdelning\n\n\nKontakta oss gärn för mer information på info@ofelia.se 010-178 36 20\n\nVi hjälper självfallet till med resa och boende vid behov.\n\n\nDin profil\nVi söker dig som är legitimerad sjuksköterska med relevant erfarenhet.\n\nVarmt välkommen med dina och önskemål och ansökan."
}