{
  "meta" : {
    "jobad" : {
      "description" : {
        "requirements" : null,
        "needs" : null,
        "company_information" : null,
        "text_formatted" : "<p>Vi behöver en servitris på deltid på ett café. Arbetsplatsen är i Vilbergen, Norrköping. Om du är intresserad av att arbeta hos oss, kontakta oss. </p><p><br></p>",
        "conditions" : null,
        "text" : "Vi behöver en servitris på deltid på ett café. Arbetsplatsen är i Vilbergen, Norrköping. Om du är intresserad av att arbeta hos oss, kontakta oss."
      },
      "headline" : "Servitris i Kafet",
      "driving_license" : null,
      "employer" : {
        "email" : null,
        "phone_number" : null,
        "organization_number" : "5568577653",
        "name" : "Saint ZEMA AB",
        "url" : null,
        "workplace" : "Saint ZEMA AB"
      },
      "removed_date" : null,
      "logo_url" : null,
      "last_publication_date" : "2022-09-01T00:00:00",
      "number_of_vacancies" : 1,
      "occupation" : {
        "concept_id" : "7K8b_4EE_w5e",
        "label" : "Konditoribiträde",
        "legacy_ams_taxonomy_id" : "2276"
      },
      "occupation_group" : {
        "concept_id" : "1wqU_Jhj_amb",
        "label" : "Kafé- och konditoribiträden",
        "legacy_ams_taxonomy_id" : "9413"
      },
      "employment_type" : {
        "concept_id" : "1paU_aCR_nGn",
        "label" : "Behovsanställning",
        "legacy_ams_taxonomy_id" : "4"
      },
      "webpage_url" : "https://arbetsformedlingen.se/platsbanken/annonser/26379060",
      "driving_license_required" : false,
      "application_contacts" : [ {
        "description" : null,
        "email" : "loretta719@sina.com",
        "telephone" : "011-137474, 0763285666",
        "name" : "Dunya Salim",
        "contact_type" : "Servitris"
      } ],
      "duration" : {
        "concept_id" : null,
        "label" : null,
        "legacy_ams_taxonomy_id" : null
      },
      "nice_to_have" : {
        "education_level" : [ ],
        "work_experiences" : [ ],
        "skills" : [ ],
        "education" : [ ],
        "languages" : [ {
          "concept_id" : "zSLA_vw2_FXN",
          "weight" : 5,
          "label" : "Svenska",
          "legacy_ams_taxonomy_id" : "502"
        } ]
      },
      "application_details" : {
        "via_af" : false,
        "email" : "loretta719@sina.com",
        "other" : null,
        "reference" : null,
        "url" : null,
        "information" : null
      },
      "source_type" : "VIA_ANNONSERA",
      "application_deadline" : "2022-09-01T00:00:00",
      "external_id" : null,
      "workplace_address" : {
        "coordinates" : [ 16.173312699176446, 58.569227481368955 ],
        "city" : "NORRKÖPING",
        "postcode" : "60356",
        "municipality" : "Norrköping",
        "region_concept_id" : "oLT3_Q9p_3nn",
        "region" : "Östergötlands län",
        "country_code" : "199",
        "region_code" : "05",
        "municipality_concept_id" : "SYty_Yho_JAF",
        "country_concept_id" : "i46j_HmG_v64",
        "municipality_code" : "0581",
        "street_address" : "Urbergsgatn 90",
        "country" : "Sverige"
      },
      "id" : "26379060",
      "experience_required" : false,
      "working_hours_type" : {
        "concept_id" : null,
        "label" : null,
        "legacy_ams_taxonomy_id" : null
      },
      "access" : null,
      "timestamp" : 1659627100274,
      "must_have" : {
        "education_level" : [ ],
        "work_experiences" : [ ],
        "skills" : [ ],
        "education" : [ ],
        "languages" : [ ]
      },
      "occupation_field" : {
        "concept_id" : "ScKy_FHB_7wT",
        "label" : "Hotell, restaurang, storhushåll",
        "legacy_ams_taxonomy_id" : "7"
      },
      "scope_of_work" : {
        "min" : 0,
        "max" : null
      },
      "salary_type" : {
        "concept_id" : "asrX_9Df_ukn",
        "label" : "Fast och rörlig lön",
        "legacy_ams_taxonomy_id" : "7"
      },
      "removed" : false,
      "salary_description" : null,
      "access_to_own_car" : false,
      "publication_date" : "2022-08-04T17:31:40"
    },
    "name" : "Servitris i Kafet",
    "user" : "hannes"
  },
  "sha1" : "5439e1707a33c8ee67c45dac690bdcbd5618f216",
  "annotations" : [ {
    "preferred-label" : "Servitör/Servitris",
    "sentiment" : "MUST_HAVE",
    "type" : "occupation-name",
    "start-position" : 0,
    "end-position" : 9,
    "concept-id" : "rGGf_KLs_To7",
    "matched-string" : "servitris",
    "annotation-id" : 0
  }, {
    "preferred-label" : "Servitör/Servitris",
    "sentiment" : "MUST_HAVE",
    "type" : "occupation-name",
    "start-position" : 32,
    "end-position" : 41,
    "concept-id" : "rGGf_KLs_To7",
    "matched-string" : "servitris",
    "annotation-id" : 1
  }, {
    "preferred-label" : "Café",
    "sentiment" : "MUST_HAVE",
    "type" : "skill",
    "start-position" : 59,
    "end-position" : 63,
    "concept-id" : "f2Nt_4bK_HNX",
    "matched-string" : "café",
    "annotation-id" : 2
  }, {
    "preferred-label" : "Norrköping",
    "type" : "municipality",
    "start-position" : 95,
    "end-position" : 105,
    "concept-id" : "SYty_Yho_JAF",
    "matched-string" : "Norrköping",
    "annotation-id" : 3
  } ],
  "text" : "Servitris i Kafet\nVi behöver en servitris på deltid på ett café. Arbetsplatsen är i Vilbergen, Norrköping. Om du är intresserad av att arbeta hos oss, kontakta oss."
}