{
  "meta" : {
    "jobad" : {
      "description" : {
        "requirements" : null,
        "needs" : null,
        "company_information" : null,
        "text_formatted" : "Trivs du med varierande uppgifter och vill ha ett rörligt jobb? Är du ihärdig, flexibel och noggrann som person? Då kan det här vara rätt jobb för dig! Nu söker KG List i Norrhult produktionsmedarbetare med start efter sommaren. \n\nKG List är Sveriges största limfogtillverkare i lövträ. Fabriken är belägen i Norrhult, mitt i Småland och levererar produkter till kunder i branscher som möbel, kök, bad, snickeri, dörrar, fönster och trappor. \n\nVad kommer du att göra?\nDu roterar på de olika stationerna inom produktionen. Packning, påfyllning, övervakning av maskiner, samt truckkörning med gods på pall kan förekomma. Det är en fördel om du är tekniskt intresserad och har industrierfarenhet sedan tidigare. \n\nDet handlar om dig\nFör att passa i rollen som produktionspersonal känner du som person ett stort ansvar och engagemang för ditt arbete och har god samarbetsförmåga. Du ska vara flexibel, ha en positiv inställning och van att hålla ett högt tempo. \n\nPassar du in i profilen?\n* Vi söker dig som trivs med varierade arbetsuppgifter.\n* Gärna erfarenhet av tillverkning/produktion\n* Har tidigare erfarenhet av truckkörning på pall.\n* Bil & Körkort är ett krav\n* Flytande i svenska både i tal och skrift\n\nVad vi erbjuder dig\n\nFörsta månaden får du en introduktion och den är förlagd på dagtid. Därefter ständig kväll , måndag-torsdag. Vi på Lernia erbjuder inledningsvis en heltidsanställning med visstidskontrakt.\n\nAnställningsform / omfattning / tjänstgöringsort\nVisstidsanställning med möjlighet att bli anställd av kund efter 6 mån / Heltid / Norrhult\n\nTillträdesdag\nStart efter sommaren\n\nInformation\nVi tillämpar löpande rekrytering och tjänstens kan tillsättas innan sista ansökningsdagen. \nVälkommen med din ansökan redan idag! \nAnsökan sker via www.lernia.se/jobb/\n\nForma framtiden med oss!\nLernia är ett av Sveriges ledande företag inom kompetensutveckling och kompetensförsörjning. Vi finns över hela landet och har tjänster inom vuxenutbildning, bemanning, rekrytering och omställning. Varje år får 9 000 bemanningskonsulter jobb på Lernia. Som konsult kan du prova på olika roller, dra nynna nytta av din befintliga kompetens eller kanske ta nästa steg i karriären, samtidigt som du har samma trygghet som hos andra företag. Välkommen till Lernia – tillsammans formar vi din framtid! \nLäs mer på lernia.se.",
        "conditions" : "-\r\n-",
        "text" : "Trivs du med varierande uppgifter och vill ha ett rörligt jobb? Är du ihärdig, flexibel och noggrann som person? Då kan det här vara rätt jobb för dig! Nu söker KG List i Norrhult produktionsmedarbetare med start efter sommaren. \n\nKG List är Sveriges största limfogtillverkare i lövträ. Fabriken är belägen i Norrhult, mitt i Småland och levererar produkter till kunder i branscher som möbel, kök, bad, snickeri, dörrar, fönster och trappor. \n\nVad kommer du att göra?\nDu roterar på de olika stationerna inom produktionen. Packning, påfyllning, övervakning av maskiner, samt truckkörning med gods på pall kan förekomma. Det är en fördel om du är tekniskt intresserad och har industrierfarenhet sedan tidigare. \n\nDet handlar om dig\nFör att passa i rollen som produktionspersonal känner du som person ett stort ansvar och engagemang för ditt arbete och har god samarbetsförmåga. Du ska vara flexibel, ha en positiv inställning och van att hålla ett högt tempo. \n\nPassar du in i profilen?\n* Vi söker dig som trivs med varierade arbetsuppgifter.\n* Gärna erfarenhet av tillverkning/produktion\n* Har tidigare erfarenhet av truckkörning på pall.\n* Bil & Körkort är ett krav\n* Flytande i svenska både i tal och skrift\n\nVad vi erbjuder dig\n\nFörsta månaden får du en introduktion och den är förlagd på dagtid. Därefter ständig kväll , måndag-torsdag. Vi på Lernia erbjuder inledningsvis en heltidsanställning med visstidskontrakt.\n\nAnställningsform / omfattning / tjänstgöringsort\nVisstidsanställning med möjlighet att bli anställd av kund efter 6 mån / Heltid / Norrhult\n\nTillträdesdag\nStart efter sommaren\n\nInformation\nVi tillämpar löpande rekrytering och tjänstens kan tillsättas innan sista ansökningsdagen. \nVälkommen med din ansökan redan idag! \nAnsökan sker via www.lernia.se/jobb/\n\nForma framtiden med oss!\nLernia är ett av Sveriges ledande företag inom kompetensutveckling och kompetensförsörjning. Vi finns över hela landet och har tjänster inom vuxenutbildning, bemanning, rekrytering och omställning. Varje år får 9 000 bemanningskonsulter jobb på Lernia. Som konsult kan du prova på olika roller, dra nynna nytta av din befintliga kompetens eller kanske ta nästa steg i karriären, samtidigt som du har samma trygghet som hos andra företag. Välkommen till Lernia – tillsammans formar vi din framtid! \nLäs mer på lernia.se."
      },
      "headline" : "Produktionsmedarbetare till KG-list i Norrhult med start efter sommaren",
      "driving_license" : [ {
        "concept_id" : "VTK8_WRx_GcM",
        "label" : "B",
        "legacy_ams_taxonomy_id" : "3"
      } ],
      "employer" : {
        "email" : null,
        "phone_number" : null,
        "organization_number" : "5564727013",
        "name" : "Lernia Bemanning AB",
        "url" : null,
        "workplace" : "Lernia"
      },
      "removed_date" : null,
      "logo_url" : "https://www.arbetsformedlingen.se/rest/arbetsgivare/rest/af/v3/organisation/5564727013/logotyper/logo.png",
      "last_publication_date" : "2022-07-22T23:59:59",
      "number_of_vacancies" : 5,
      "occupation" : {
        "concept_id" : "o8dP_hY4_p8p",
        "label" : "Maskinoperatör, ytbehandling, trä",
        "legacy_ams_taxonomy_id" : "4366"
      },
      "occupation_group" : {
        "concept_id" : "AUs8_M5f_dLt",
        "label" : "Maskinoperatörer inom ytbehandling, trä",
        "legacy_ams_taxonomy_id" : "8174"
      },
      "employment_type" : {
        "concept_id" : "PFZr_Syz_cUq",
        "label" : "Vanlig anställning",
        "legacy_ams_taxonomy_id" : "1"
      },
      "webpage_url" : "https://arbetsformedlingen.se/platsbanken/annonser/26293989",
      "driving_license_required" : true,
      "application_contacts" : [ ],
      "duration" : {
        "concept_id" : "Xj7x_7yZ_jEn",
        "label" : "3 månader – upp till 6 månader",
        "legacy_ams_taxonomy_id" : "3"
      },
      "nice_to_have" : {
        "education_level" : [ ],
        "work_experiences" : [ ],
        "skills" : [ ],
        "education" : [ ],
        "languages" : [ ]
      },
      "application_details" : {
        "via_af" : false,
        "email" : null,
        "other" : null,
        "reference" : null,
        "url" : "https://www.lernia.se/?jobid=209533&ref=platsbanken",
        "information" : null
      },
      "source_type" : "VIA_PLATSBANKEN_DXA",
      "application_deadline" : "2022-07-22T23:59:59",
      "external_id" : "46-556472-7013-wb-209533",
      "workplace_address" : {
        "coordinates" : [ 15.444602, 56.937344 ],
        "city" : null,
        "postcode" : null,
        "municipality" : "Uppvidinge",
        "region_concept_id" : "tF3y_MF9_h5G",
        "region" : "Kronobergs län",
        "country_code" : "199",
        "region_code" : "07",
        "municipality_concept_id" : "78cu_S5T_Pgp",
        "country_concept_id" : "i46j_HmG_v64",
        "municipality_code" : "0760",
        "street_address" : null,
        "country" : "Sverige"
      },
      "id" : "26293989",
      "experience_required" : true,
      "working_hours_type" : {
        "concept_id" : "6YE1_gAC_R2G",
        "label" : "Heltid",
        "legacy_ams_taxonomy_id" : "1"
      },
      "access" : null,
      "timestamp" : 1657011674841,
      "must_have" : {
        "education_level" : [ ],
        "work_experiences" : [ {
          "concept_id" : "o8dP_hY4_p8p",
          "weight" : 10,
          "label" : "Maskinoperatör, ytbehandling, trä",
          "legacy_ams_taxonomy_id" : "4366"
        } ],
        "skills" : [ ],
        "education" : [ ],
        "languages" : [ ]
      },
      "occupation_field" : {
        "concept_id" : "wTEr_CBC_bqh",
        "label" : "Industriell tillverkning",
        "legacy_ams_taxonomy_id" : "9"
      },
      "scope_of_work" : {
        "min" : 100,
        "max" : 100
      },
      "salary_type" : {
        "concept_id" : "oG8G_9cW_nRf",
        "label" : "Fast månads- vecko- eller timlön",
        "legacy_ams_taxonomy_id" : "1"
      },
      "removed" : false,
      "salary_description" : "Enligt överenskommelse",
      "access_to_own_car" : true,
      "publication_date" : "2022-07-05T11:01:14"
    },
    "name" : "Produktionsmedarbetare till KG-list i Norrhult med start efter sommaren",
    "user" : "hannes"
  },
  "sha1" : "2638b7573a9c438b473a932ea7e6ada6a72db937",
  "annotations" : [ {
    "preferred-label" : "noggrannhet",
    "type" : "esco-skill",
    "start-position" : 164,
    "end-position" : 172,
    "concept-id" : "mrsW_EkL_KRD",
    "matched-string" : "noggrann",
    "annotation-id" : 2
  }, {
    "preferred-label" : "Truckförare",
    "type" : "ssyk-level-4",
    "start-position" : 646,
    "end-position" : 658,
    "concept-id" : "MrcX_RDn_N53",
    "matched-string" : "truckkörning",
    "annotation-id" : 3
  }, {
    "preferred-label" : "Tillverkning",
    "sentiment" : "MUST_HAVE",
    "type" : "sni-level-1",
    "start-position" : 1135,
    "end-position" : 1147,
    "concept-id" : "trPt_iHy_oFP",
    "matched-string" : "tillverkning",
    "annotation-id" : 0
  }, {
    "preferred-label" : "Truck",
    "type" : "keyword",
    "start-position" : 1188,
    "end-position" : 1200,
    "concept-id" : "Wz82_4Xv_ZFr",
    "matched-string" : "truckkörning",
    "annotation-id" : 4
  }, {
    "preferred-label" : "B",
    "type" : "driving-licence",
    "start-position" : 1218,
    "end-position" : 1225,
    "concept-id" : "VTK8_WRx_GcM",
    "matched-string" : "Körkort",
    "annotation-id" : 5
  }, {
    "preferred-label" : "Svenska",
    "sentiment" : "MUST_HAVE",
    "type" : "language",
    "start-position" : 1251,
    "end-position" : 1258,
    "concept-id" : "zSLA_vw2_FXN",
    "matched-string" : "svenska",
    "annotation-id" : 1
  }, {
    "preferred-label" : "Heltid",
    "type" : "worktime-extent",
    "start-position" : 1451,
    "end-position" : 1469,
    "concept-id" : "6YE1_gAC_R2G",
    "matched-string" : "heltidsanställning",
    "annotation-id" : 7
  }, {
    "preferred-label" : "Allmän visstidsanställning",
    "type" : "keyword",
    "start-position" : 1474,
    "end-position" : 1490,
    "concept-id" : "hxfz_ayC_9Vd",
    "matched-string" : "visstidskontrakt",
    "annotation-id" : 6
  }, {
    "preferred-label" : "Allmän visstidsanställning",
    "type" : "keyword",
    "start-position" : 1542,
    "end-position" : 1561,
    "concept-id" : "hxfz_ayC_9Vd",
    "matched-string" : "Visstidsanställning",
    "annotation-id" : 8
  }, {
    "preferred-label" : "Heltid",
    "type" : "worktime-extent",
    "start-position" : 1615,
    "end-position" : 1621,
    "concept-id" : "6YE1_gAC_R2G",
    "matched-string" : "Heltid",
    "annotation-id" : 9
  } ],
  "text" : "Produktionsmedarbetare till KG-list i Norrhult med start efter sommaren\nTrivs du med varierande uppgifter och vill ha ett rörligt jobb? Är du ihärdig, flexibel och noggrann som person? Då kan det här vara rätt jobb för dig! Nu söker KG List i Norrhult produktionsmedarbetare med start efter sommaren. \n\nKG List är Sveriges största limfogtillverkare i lövträ. Fabriken är belägen i Norrhult, mitt i Småland och levererar produkter till kunder i branscher som möbel, kök, bad, snickeri, dörrar, fönster och trappor. \n\nVad kommer du att göra?\nDu roterar på de olika stationerna inom produktionen. Packning, påfyllning, övervakning av maskiner, samt truckkörning med gods på pall kan förekomma. Det är en fördel om du är tekniskt intresserad och har industrierfarenhet sedan tidigare. \n\nDet handlar om dig\nFör att passa i rollen som produktionspersonal känner du som person ett stort ansvar och engagemang för ditt arbete och har god samarbetsförmåga. Du ska vara flexibel, ha en positiv inställning och van att hålla ett högt tempo. \n\nPassar du in i profilen?\n* Vi söker dig som trivs med varierade arbetsuppgifter.\n* Gärna erfarenhet av tillverkning/produktion\n* Har tidigare erfarenhet av truckkörning på pall.\n* Bil & Körkort är ett krav\n* Flytande i svenska både i tal och skrift\n\nVad vi erbjuder dig\n\nFörsta månaden får du en introduktion och den är förlagd på dagtid. Därefter ständig kväll , måndag-torsdag. Vi på Lernia erbjuder inledningsvis en heltidsanställning med visstidskontrakt.\n\nAnställningsform / omfattning / tjänstgöringsort\nVisstidsanställning med möjlighet att bli anställd av kund efter 6 mån / Heltid / Norrhult\n\nTillträdesdag\nStart efter sommaren\n\nInformation\nVi tillämpar löpande rekrytering och tjänstens kan tillsättas innan sista ansökningsdagen. \nVälkommen med din ansökan redan idag! \nAnsökan sker via www.lernia.se/jobb/\n\nForma framtiden med oss!\nLernia är ett av Sveriges ledande företag inom kompetensutveckling och kompetensförsörjning. Vi finns över hela landet och har tjänster inom vuxenutbildning, bemanning, rekrytering och omställning. Varje år får 9 000 bemanningskonsulter jobb på Lernia. Som konsult kan du prova på olika roller, dra nynna nytta av din befintliga kompetens eller kanske ta nästa steg i karriären, samtidigt som du har samma trygghet som hos andra företag. Välkommen till Lernia – tillsammans formar vi din framtid! \nLäs mer på lernia.se."
}