{
  "meta" : {
    "jobad" : {
      "description" : {
        "requirements" : null,
        "needs" : null,
        "company_information" : null,
        "text_formatted" : "Vill du få möjligheten att arbeta tillsammans med ett härligt team där lagandan står i fokus? Är du även den som har förmågan att se när något behöver göras och strävar efter att ge en service i världsklass? \n\nOm du svarade ja på frågorna ovan och dessutom uppskattar en Big Mac nästan lika mycket som oss – då kanske vi är helt rätt för varandra! \n\nHos oss är det av största vikt att varje kund får en unik upplevelse och det är naturligtvis inte möjligt utan våra medarbetare. McDonald’s erbjuder ett omväxlande och fartfyllt arbete med varierande arbetsuppgifter, alla med fokuset att leverera en ultimat restaurangupplevelse för våra gäster. \n\nArbetsuppgifterna kan variera från att tillaga och servera vår goda mat till att säkerställa att matsal och kök är i toppskick. \n\nEn anställning på McDonald’s ger dig erfarenheter som du har nytta av resten av livet och för den som vill utvecklas finns en tydlig karriärtrappa med stora möjligheter.\r\nVåra förväntningar på dig: \n\n - Att du är en team player som sätter laget före jaget\n - Att du vill lära dig nya saker och utvecklas\n - Att du har rätt inställning och vill ha roligt på jobbet\n - Att du älskar burgare nästan lika mycket som vi\n\nTidigare arbetslivserfarenhet är inte ett krav, vi ser till att du får den utbildning du behöver för att kunna utföra ett arbete av högsta kvalitet.\n\nMed över 200 restauranger från norr till söder är McDonald’s Sveriges ledande restaurangkedja. De flesta av restaurangerna ägs och drivs lokalt av egna företagare. Med våra ca 12 000 medarbetare är vi Sveriges största privata ungdomsarbetsgivare. Vi vill göra det goda valet enkelt för våra gäster och har därför en bred meny med något för alla smaker, preferenser och plånböcker och serverar bara mat av högsta kvalitet med snabb och vänlig service i fräscha, moderna restauranger. Läs mer på www.mcdonalds.se eller följ oss på Facebook, Instagram och Twitter.",
        "conditions" : "Deltid\r\nVisstidsanställning 6 månader eller längre",
        "text" : "Vill du få möjligheten att arbeta tillsammans med ett härligt team där lagandan står i fokus? Är du även den som har förmågan att se när något behöver göras och strävar efter att ge en service i världsklass? \n\nOm du svarade ja på frågorna ovan och dessutom uppskattar en Big Mac nästan lika mycket som oss – då kanske vi är helt rätt för varandra! \n\nHos oss är det av största vikt att varje kund får en unik upplevelse och det är naturligtvis inte möjligt utan våra medarbetare. McDonald’s erbjuder ett omväxlande och fartfyllt arbete med varierande arbetsuppgifter, alla med fokuset att leverera en ultimat restaurangupplevelse för våra gäster. \n\nArbetsuppgifterna kan variera från att tillaga och servera vår goda mat till att säkerställa att matsal och kök är i toppskick. \n\nEn anställning på McDonald’s ger dig erfarenheter som du har nytta av resten av livet och för den som vill utvecklas finns en tydlig karriärtrappa med stora möjligheter.\r\nVåra förväntningar på dig: \n\n - Att du är en team player som sätter laget före jaget\n - Att du vill lära dig nya saker och utvecklas\n - Att du har rätt inställning och vill ha roligt på jobbet\n - Att du älskar burgare nästan lika mycket som vi\n\nTidigare arbetslivserfarenhet är inte ett krav, vi ser till att du får den utbildning du behöver för att kunna utföra ett arbete av högsta kvalitet.\n\nMed över 200 restauranger från norr till söder är McDonald’s Sveriges ledande restaurangkedja. De flesta av restaurangerna ägs och drivs lokalt av egna företagare. Med våra ca 12 000 medarbetare är vi Sveriges största privata ungdomsarbetsgivare. Vi vill göra det goda valet enkelt för våra gäster och har därför en bred meny med något för alla smaker, preferenser och plånböcker och serverar bara mat av högsta kvalitet med snabb och vänlig service i fräscha, moderna restauranger. Läs mer på www.mcdonalds.se eller följ oss på Facebook, Instagram och Twitter."
      },
      "headline" : "McDonald's Kalmar, Giraffen söker nya glada medarbetare",
      "driving_license" : null,
      "employer" : {
        "email" : null,
        "phone_number" : null,
        "organization_number" : "5561812297",
        "name" : "Food Folk Sverige AB",
        "url" : "https://www.mcdonalds.com/se/sv-se.html",
        "workplace" : "McDonald’s Sverige"
      },
      "removed_date" : null,
      "logo_url" : "https://www.arbetsformedlingen.se/rest/arbetsgivare/rest/af/v3/organisation/5561812297/logotyper/logo.png",
      "last_publication_date" : "2022-10-01T23:59:59",
      "number_of_vacancies" : 2,
      "occupation" : {
        "concept_id" : "yXRQ_Ad9_E8V",
        "label" : "Restaurangbiträde",
        "legacy_ams_taxonomy_id" : "5555"
      },
      "occupation_group" : {
        "concept_id" : "tPox_ie4_X9X",
        "label" : "Restaurang- och köksbiträden m.fl.",
        "legacy_ams_taxonomy_id" : "9412"
      },
      "employment_type" : {
        "concept_id" : "PFZr_Syz_cUq",
        "label" : "Vanlig anställning",
        "legacy_ams_taxonomy_id" : "1"
      },
      "webpage_url" : "https://arbetsformedlingen.se/platsbanken/annonser/26433403",
      "driving_license_required" : false,
      "application_contacts" : [ ],
      "duration" : {
        "concept_id" : "qQUd_4qe_NDT",
        "label" : "6 månader eller längre",
        "legacy_ams_taxonomy_id" : "2"
      },
      "nice_to_have" : {
        "education_level" : [ ],
        "work_experiences" : [ ],
        "skills" : [ ],
        "education" : [ ],
        "languages" : [ ]
      },
      "application_details" : {
        "via_af" : false,
        "email" : null,
        "other" : null,
        "reference" : null,
        "url" : "https://emp.jobylon.com/applications/jobs/145319/create/?utm_source=ams&utm_medium=promotionserializer",
        "information" : null
      },
      "source_type" : "VIA_PLATSBANKEN_DXA",
      "application_deadline" : "2022-10-01T23:59:59",
      "external_id" : "46-556181-2297-145319-75068",
      "workplace_address" : {
        "coordinates" : [ 16.35678, 56.663445 ],
        "city" : null,
        "postcode" : null,
        "municipality" : "Kalmar",
        "region_concept_id" : "9QUH_2bb_6Np",
        "region" : "Kalmar län",
        "country_code" : "199",
        "region_code" : "08",
        "municipality_concept_id" : "Pnmg_SgP_uHQ",
        "country_concept_id" : "i46j_HmG_v64",
        "municipality_code" : "0880",
        "street_address" : null,
        "country" : "Sverige"
      },
      "id" : "26433403",
      "experience_required" : false,
      "working_hours_type" : {
        "concept_id" : "947z_JGS_Uk2",
        "label" : "Deltid",
        "legacy_ams_taxonomy_id" : "2"
      },
      "access" : null,
      "timestamp" : 1660920413910,
      "must_have" : {
        "education_level" : [ ],
        "work_experiences" : [ ],
        "skills" : [ ],
        "education" : [ ],
        "languages" : [ ]
      },
      "occupation_field" : {
        "concept_id" : "ScKy_FHB_7wT",
        "label" : "Hotell, restaurang, storhushåll",
        "legacy_ams_taxonomy_id" : "7"
      },
      "scope_of_work" : {
        "min" : 0,
        "max" : 100
      },
      "salary_type" : {
        "concept_id" : "oG8G_9cW_nRf",
        "label" : "Fast månads- vecko- eller timlön",
        "legacy_ams_taxonomy_id" : "1"
      },
      "removed" : false,
      "salary_description" : "Fast månads- vecko- eller timlön",
      "access_to_own_car" : false,
      "publication_date" : "2022-08-19T16:46:53"
    },
    "name" : "McDonald's Kalmar, Giraffen söker nya glada medarbetare",
    "user" : "hannes"
  },
  "sha1" : "981695aa7e83f46464e2990dbf7c166a71a9aa4e",
  "annotations" : [ {
    "preferred-label" : "McDonald's",
    "sentiment" : "NOT_RELEVANT",
    "type" : "keyword",
    "start-position" : 0,
    "end-position" : 10,
    "concept-id" : "JqBx_uAB_4D4",
    "matched-string" : "mcdonald's",
    "annotation-id" : 0
  }, {
    "preferred-label" : "Kalmar",
    "sentiment" : "NOT_RELEVANT",
    "type" : "municipality",
    "start-position" : 11,
    "end-position" : 17,
    "concept-id" : "Pnmg_SgP_uHQ",
    "matched-string" : "Kalmar",
    "annotation-id" : 5
  }, {
    "preferred-label" : "Restaurangbiträde",
    "sentiment" : "MUST_HAVE",
    "type" : "occupation-name",
    "start-position" : 44,
    "end-position" : 55,
    "concept-id" : "yXRQ_Ad9_E8V",
    "matched-string" : "medarbetare",
    "annotation-id" : 6
  }, {
    "preferred-label" : "McDonald's",
    "sentiment" : "NOT_RELEVANT",
    "type" : "keyword",
    "start-position" : 535,
    "end-position" : 545,
    "concept-id" : "JqBx_uAB_4D4",
    "matched-string" : "McDonald’s",
    "annotation-id" : 4
  }, {
    "preferred-label" : "McDonald's",
    "sentiment" : "NOT_RELEVANT",
    "type" : "keyword",
    "start-position" : 852,
    "end-position" : 862,
    "concept-id" : "JqBx_uAB_4D4",
    "matched-string" : "McDonald’s",
    "annotation-id" : 2
  }, {
    "preferred-label" : "McDonald's",
    "sentiment" : "NOT_RELEVANT",
    "type" : "keyword",
    "start-position" : 1450,
    "end-position" : 1460,
    "concept-id" : "JqBx_uAB_4D4",
    "matched-string" : "McDonald’s",
    "annotation-id" : 3
  } ],
  "text" : "McDonald's Kalmar, Giraffen söker nya glada medarbetare\nVill du få möjligheten att arbeta tillsammans med ett härligt team där lagandan står i fokus? Är du även den som har förmågan att se när något behöver göras och strävar efter att ge en service i världsklass? \n\nOm du svarade ja på frågorna ovan och dessutom uppskattar en Big Mac nästan lika mycket som oss – då kanske vi är helt rätt för varandra! \n\nHos oss är det av största vikt att varje kund får en unik upplevelse och det är naturligtvis inte möjligt utan våra medarbetare. McDonald’s erbjuder ett omväxlande och fartfyllt arbete med varierande arbetsuppgifter, alla med fokuset att leverera en ultimat restaurangupplevelse för våra gäster. \n\nArbetsuppgifterna kan variera från att tillaga och servera vår goda mat till att säkerställa att matsal och kök är i toppskick. \n\nEn anställning på McDonald’s ger dig erfarenheter som du har nytta av resten av livet och för den som vill utvecklas finns en tydlig karriärtrappa med stora möjligheter.\r\nVåra förväntningar på dig: \n\n - Att du är en team player som sätter laget före jaget\n - Att du vill lära dig nya saker och utvecklas\n - Att du har rätt inställning och vill ha roligt på jobbet\n - Att du älskar burgare nästan lika mycket som vi\n\nTidigare arbetslivserfarenhet är inte ett krav, vi ser till att du får den utbildning du behöver för att kunna utföra ett arbete av högsta kvalitet.\n\nMed över 200 restauranger från norr till söder är McDonald’s Sveriges ledande restaurangkedja. De flesta av restaurangerna ägs och drivs lokalt av egna företagare. Med våra ca 12 000 medarbetare är vi Sveriges största privata ungdomsarbetsgivare. Vi vill göra det goda valet enkelt för våra gäster och har därför en bred meny med något för alla smaker, preferenser och plånböcker och serverar bara mat av högsta kvalitet med snabb och vänlig service i fräscha, moderna restauranger. Läs mer på www.mcdonalds.se eller följ oss på Facebook, Instagram och Twitter."
}