{
  "meta" : {
    "jobad" : {
      "description" : {
        "requirements" : null,
        "needs" : null,
        "company_information" : null,
        "text_formatted" : "DANA Åmål är företaget som ligger i framkant på tillverkning av elmotorer för tunga fordon. Vi bygger nu en helt ny elmotorfabrik där just du kan få möjlighet att vara med på denna resa in i framtiden. Är du redo?\n\nOm tjänsten\n\nI tjänsten som Assistant Controller kommer du bland annat att arbeta med förbättring och optimering av finansiella processer, förbereda detaljerade prognoser, realisera rapporteringsaktiviteter, tillhandahålla ad hoc-analyser och delta i bokföringsarbetet. Arbetsuppgifterna kommer att vara varierande och anpassas efter din kunskap. Du kommer att ingå i ett team om fem personer med gedigen erfarenhet inom området. Med denna tjänst kommer en flexibel arbetsplats, härlig teamkänsla och spännande karriärmöjligheter.\n\nOm dig\n\nVi tror att du är en prestigelös, rak och ärlig person med god kommunikativ förmåga och som trivs i en dynamisk arbetsmiljö. Du är resultat- och lönsamhetsorienterad, drivs av utveckling och har ett genuint engagemang för hållbarhet och miljö. Du kan arbeta mot korta deadlines, så väl självständigt som i team.\n\nFör att lyckas i rollen som Assistant Controller tror vi att du har en relevant utbildning inom företagsekonomi eller motsvarande. Erfarenhet av arbete inom en ekonomiavdelning är ett krav. Du har också erfarenhet av Excel och kan enkelt använda dig av mer avancerade funktioner.\n\nOm oss\n\nDANA är en ledande leverantör av komponenter till fordonsindustrin. Koncernen har drygt 40 000 anställda, 139 fabriker i 33 länder över 6 kontinenter och omsätter 89 miljarder SEK.\n\nDANA Sweden består av två fabriker i Åmål: Spicer Nordiska Kardan AB med 190 anställda tillverkar 180 000 kardanaxlar per år och Dana TM4 Sweden som är under uppbyggnad för tillverkning av elmotorer med start 2023.\n\nSom en spjutspets i DANAs satsning på elektrifiering av fordonsindustrin byggs nu Sveriges modernaste elmotorfabrik samtidigt som företagets produktion av kardanaxlar ökar till en all time high nivå.\n\nOm processen\n\nI den här rekryteringen samarbetar vi med Testhuset. Om du har frågor är du välkommen att kontakta Bengt Libäck på telefon 070 594 72 77 eller Josefine Appel på 076 017 40 25.\n\nDu är varmt välkommen med din ansökan senast den 14 augusti.",
        "conditions" : "Heltid\r\nAnställningstid enligt överenskommelse",
        "text" : "DANA Åmål är företaget som ligger i framkant på tillverkning av elmotorer för tunga fordon. Vi bygger nu en helt ny elmotorfabrik där just du kan få möjlighet att vara med på denna resa in i framtiden. Är du redo?\n\nOm tjänsten\n\nI tjänsten som Assistant Controller kommer du bland annat att arbeta med förbättring och optimering av finansiella processer, förbereda detaljerade prognoser, realisera rapporteringsaktiviteter, tillhandahålla ad hoc-analyser och delta i bokföringsarbetet. Arbetsuppgifterna kommer att vara varierande och anpassas efter din kunskap. Du kommer att ingå i ett team om fem personer med gedigen erfarenhet inom området. Med denna tjänst kommer en flexibel arbetsplats, härlig teamkänsla och spännande karriärmöjligheter.\n\nOm dig\n\nVi tror att du är en prestigelös, rak och ärlig person med god kommunikativ förmåga och som trivs i en dynamisk arbetsmiljö. Du är resultat- och lönsamhetsorienterad, drivs av utveckling och har ett genuint engagemang för hållbarhet och miljö. Du kan arbeta mot korta deadlines, så väl självständigt som i team.\n\nFör att lyckas i rollen som Assistant Controller tror vi att du har en relevant utbildning inom företagsekonomi eller motsvarande. Erfarenhet av arbete inom en ekonomiavdelning är ett krav. Du har också erfarenhet av Excel och kan enkelt använda dig av mer avancerade funktioner.\n\nOm oss\n\nDANA är en ledande leverantör av komponenter till fordonsindustrin. Koncernen har drygt 40 000 anställda, 139 fabriker i 33 länder över 6 kontinenter och omsätter 89 miljarder SEK.\n\nDANA Sweden består av två fabriker i Åmål: Spicer Nordiska Kardan AB med 190 anställda tillverkar 180 000 kardanaxlar per år och Dana TM4 Sweden som är under uppbyggnad för tillverkning av elmotorer med start 2023.\n\nSom en spjutspets i DANAs satsning på elektrifiering av fordonsindustrin byggs nu Sveriges modernaste elmotorfabrik samtidigt som företagets produktion av kardanaxlar ökar till en all time high nivå.\n\nOm processen\n\nI den här rekryteringen samarbetar vi med Testhuset. Om du har frågor är du välkommen att kontakta Bengt Libäck på telefon 070 594 72 77 eller Josefine Appel på 076 017 40 25.\n\nDu är varmt välkommen med din ansökan senast den 14 augusti."
      },
      "headline" : "Assistant Controller - DANA Sweden",
      "driving_license" : null,
      "employer" : {
        "email" : null,
        "phone_number" : null,
        "organization_number" : "5568740491",
        "name" : "Testhuset Urval & Utveckling AB",
        "url" : "https://testhuset.com/",
        "workplace" : "Testhuset"
      },
      "removed_date" : null,
      "logo_url" : "https://www.arbetsformedlingen.se/rest/arbetsgivare/rest/af/v3/organisation/5568740491/logotyper/logo.png",
      "last_publication_date" : "2022-08-14T23:59:59",
      "number_of_vacancies" : 1,
      "occupation" : {
        "concept_id" : "GrZU_ofe_QAx",
        "label" : "Controller",
        "legacy_ams_taxonomy_id" : "6318"
      },
      "occupation_group" : {
        "concept_id" : "Uw4n_UB2_RCW",
        "label" : "Controller",
        "legacy_ams_taxonomy_id" : "2412"
      },
      "employment_type" : {
        "concept_id" : "PFZr_Syz_cUq",
        "label" : "Vanlig anställning",
        "legacy_ams_taxonomy_id" : "1"
      },
      "webpage_url" : "https://arbetsformedlingen.se/platsbanken/annonser/26365481",
      "driving_license_required" : false,
      "application_contacts" : [ {
        "description" : "Bengt Libäck",
        "email" : "bengt.liback@testhuset.com",
        "telephone" : "070 594 72 77",
        "name" : null,
        "contact_type" : null
      } ],
      "duration" : {
        "concept_id" : "a7uU_j21_mkL",
        "label" : "Tills vidare",
        "legacy_ams_taxonomy_id" : "1"
      },
      "nice_to_have" : {
        "education_level" : [ ],
        "work_experiences" : [ ],
        "skills" : [ ],
        "education" : [ ],
        "languages" : [ ]
      },
      "application_details" : {
        "via_af" : false,
        "email" : null,
        "other" : null,
        "reference" : null,
        "url" : "https://testhuset.teamtailor.com/jobs/1920762-assistant-controller-dana-sweden?promotion=448851-arbetsformedlingen",
        "information" : null
      },
      "source_type" : "VIA_PLATSBANKEN_DXA",
      "application_deadline" : "2022-08-14T23:59:59",
      "external_id" : "46-556874-0491-1920762-2",
      "workplace_address" : {
        "coordinates" : [ 12.697732, 59.051117 ],
        "city" : null,
        "postcode" : null,
        "municipality" : "Åmål",
        "region_concept_id" : "zdoY_6u5_Krt",
        "region" : "Västra Götalands län",
        "country_code" : "199",
        "region_code" : "14",
        "municipality_concept_id" : "M1UC_Cnf_r7g",
        "country_concept_id" : "i46j_HmG_v64",
        "municipality_code" : "1492",
        "street_address" : null,
        "country" : "Sverige"
      },
      "id" : "26365481",
      "experience_required" : true,
      "working_hours_type" : {
        "concept_id" : "6YE1_gAC_R2G",
        "label" : "Heltid",
        "legacy_ams_taxonomy_id" : "1"
      },
      "access" : null,
      "timestamp" : 1659335881777,
      "must_have" : {
        "education_level" : [ ],
        "work_experiences" : [ {
          "concept_id" : "GrZU_ofe_QAx",
          "weight" : 10,
          "label" : "Controller",
          "legacy_ams_taxonomy_id" : "6318"
        } ],
        "skills" : [ ],
        "education" : [ ],
        "languages" : [ ]
      },
      "occupation_field" : {
        "concept_id" : "X82t_awd_Qyc",
        "label" : "Administration, ekonomi, juridik",
        "legacy_ams_taxonomy_id" : "1"
      },
      "scope_of_work" : {
        "min" : 100,
        "max" : 100
      },
      "salary_type" : {
        "concept_id" : "oG8G_9cW_nRf",
        "label" : "Fast månads- vecko- eller timlön",
        "legacy_ams_taxonomy_id" : "1"
      },
      "removed" : false,
      "salary_description" : "Lön enligt överenskommelse",
      "access_to_own_car" : false,
      "publication_date" : "2022-08-01T08:38:01"
    },
    "name" : "Assistant Controller - DANA Sweden",
    "user" : "hannes"
  },
  "sha1" : "393474fd1534b9185ae412619bb452db2ab5d6ba",
  "annotations" : [ {
    "preferred-label" : "Controller",
    "sentiment" : "MUST_HAVE",
    "type" : "ssyk-level-4",
    "start-position" : 10,
    "end-position" : 20,
    "concept-id" : "Uw4n_UB2_RCW",
    "matched-string" : "controller",
    "annotation-id" : 0
  }, {
    "preferred-label" : "Tillverkning",
    "sentiment" : "MUST_HAVE",
    "type" : "sni-level-1",
    "start-position" : 83,
    "end-position" : 95,
    "concept-id" : "trPt_iHy_oFP",
    "matched-string" : "tillverkning",
    "annotation-id" : 1
  }, {
    "preferred-label" : "Controller",
    "sentiment" : "MUST_HAVE",
    "type" : "ssyk-level-4",
    "start-position" : 288,
    "end-position" : 298,
    "concept-id" : "Uw4n_UB2_RCW",
    "matched-string" : "controller",
    "annotation-id" : 2
  }, {
    "preferred-label" : "arbetsmiljö",
    "sentiment" : "MUST_HAVE",
    "type" : "esco-skill",
    "start-position" : 902,
    "end-position" : 913,
    "concept-id" : "zdQY_QJh_nUH",
    "matched-string" : "arbetsmiljö",
    "annotation-id" : 4
  }, {
    "preferred-label" : "arbeta självständigt",
    "type" : "esco-skill",
    "start-position" : 1076,
    "end-position" : 1089,
    "concept-id" : "NyFu_HHd_zhz",
    "matched-string" : "självständigt",
    "annotation-id" : 8
  }, {
    "preferred-label" : "Controller",
    "sentiment" : "MUST_HAVE",
    "type" : "ssyk-level-4",
    "start-position" : 1141,
    "end-position" : 1151,
    "concept-id" : "Uw4n_UB2_RCW",
    "matched-string" : "controller",
    "annotation-id" : 5
  }, {
    "preferred-label" : "Företagsekonomi",
    "sentiment" : "MUST_HAVE",
    "type" : "skill",
    "start-position" : 1199,
    "end-position" : 1214,
    "concept-id" : "VfP9_2xd_g2h",
    "matched-string" : "företagsekonomi",
    "annotation-id" : 6
  }, {
    "preferred-label" : "MS Excel",
    "type" : "skill",
    "start-position" : 1320,
    "end-position" : 1325,
    "concept-id" : "5wab_aFK_gdL",
    "matched-string" : "Excel",
    "annotation-id" : 9
  }, {
    "preferred-label" : "Åmål",
    "type" : "municipality",
    "start-position" : 1611,
    "end-position" : 1615,
    "concept-id" : "M1UC_Cnf_r7g",
    "matched-string" : "Åmål",
    "annotation-id" : 10
  }, {
    "preferred-label" : "Tillverkning",
    "sentiment" : "MUST_HAVE",
    "type" : "sni-level-1",
    "start-position" : 1747,
    "end-position" : 1759,
    "concept-id" : "trPt_iHy_oFP",
    "matched-string" : "tillverkning",
    "annotation-id" : 7
  }, {
    "preferred-label" : "Sverige",
    "type" : "country",
    "start-position" : 1872,
    "end-position" : 1880,
    "concept-id" : "i46j_HmG_v64",
    "matched-string" : "Sveriges",
    "annotation-id" : 11
  } ],
  "text" : "Assistant Controller - DANA Sweden\nDANA Åmål är företaget som ligger i framkant på tillverkning av elmotorer för tunga fordon. Vi bygger nu en helt ny elmotorfabrik där just du kan få möjlighet att vara med på denna resa in i framtiden. Är du redo?\n\nOm tjänsten\n\nI tjänsten som Assistant Controller kommer du bland annat att arbeta med förbättring och optimering av finansiella processer, förbereda detaljerade prognoser, realisera rapporteringsaktiviteter, tillhandahålla ad hoc-analyser och delta i bokföringsarbetet. Arbetsuppgifterna kommer att vara varierande och anpassas efter din kunskap. Du kommer att ingå i ett team om fem personer med gedigen erfarenhet inom området. Med denna tjänst kommer en flexibel arbetsplats, härlig teamkänsla och spännande karriärmöjligheter.\n\nOm dig\n\nVi tror att du är en prestigelös, rak och ärlig person med god kommunikativ förmåga och som trivs i en dynamisk arbetsmiljö. Du är resultat- och lönsamhetsorienterad, drivs av utveckling och har ett genuint engagemang för hållbarhet och miljö. Du kan arbeta mot korta deadlines, så väl självständigt som i team.\n\nFör att lyckas i rollen som Assistant Controller tror vi att du har en relevant utbildning inom företagsekonomi eller motsvarande. Erfarenhet av arbete inom en ekonomiavdelning är ett krav. Du har också erfarenhet av Excel och kan enkelt använda dig av mer avancerade funktioner.\n\nOm oss\n\nDANA är en ledande leverantör av komponenter till fordonsindustrin. Koncernen har drygt 40 000 anställda, 139 fabriker i 33 länder över 6 kontinenter och omsätter 89 miljarder SEK.\n\nDANA Sweden består av två fabriker i Åmål: Spicer Nordiska Kardan AB med 190 anställda tillverkar 180 000 kardanaxlar per år och Dana TM4 Sweden som är under uppbyggnad för tillverkning av elmotorer med start 2023.\n\nSom en spjutspets i DANAs satsning på elektrifiering av fordonsindustrin byggs nu Sveriges modernaste elmotorfabrik samtidigt som företagets produktion av kardanaxlar ökar till en all time high nivå.\n\nOm processen\n\nI den här rekryteringen samarbetar vi med Testhuset. Om du har frågor är du välkommen att kontakta Bengt Libäck på telefon 070 594 72 77 eller Josefine Appel på 076 017 40 25.\n\nDu är varmt välkommen med din ansökan senast den 14 augusti."
}