{
  "meta" : {
    "jobad" : {
      "description" : {
        "requirements" : null,
        "needs" : null,
        "company_information" : null,
        "text_formatted" : "Brinner du för att arbeta med människor och att ge service? Drivs du av försäljning och att arbeta mot uppsatta mål? Då är det kanske dig vi söker.\n\nSom säljare på KICKS är din huvuduppgift att genom personlig och professionell service ge varje besökare en lustfylld köpupplevelse. Dagligen driver du försäljning inom samtliga delar av sortimentet och tillsammans med dina kollegor ansvarar du för att genomföra kampanjer och aktiviteter i enlighet med KICKS koncept.\r\nVi söker dig som:\n\n - Brinner för försäljning och trivs med att arbeta mot individuella mål\n - Har en genuin servicekänsla och älskar att arbeta med människor\n - Alltid har kunden i fokus och drivs av utmaningen att ge varje besökare personlig service\n - Har stort intresse för våra produkter och viljan att utvecklas till skönhetsexpert\n - Är engagerad, ansvarstagande, ser möjligheter och trivs med att arbeta i team\n - Är utbildad makeupartist\n\nHar du dessutom erfarenhet från liknande tjänst inom detaljhandeln ser vi det som meriterande.\n\nDu får möjligheten att arbeta i en organisation med hög energinivå, tillsammans med kollegor med positiv och öppen attityd.\n\nTjänsten är en tidsbegränsad anställning 31/12-22 på deltid 20h/v.\n\nTillträde: Enl. överenskommelse \n\nVälkommen in med din ansökan redan idag!\n\nÄr du nyfiken på allt spännande som händer hos oss, ta en titt på vår Linkedin-sida här. \n\nKICKS anställer inte minderåriga, skulle du vara under 18 och har intresse av KICKS är du välkommen att söka praktik direkt via Butikschef. KICKS genomför bakgrundskontroll på slutkandidater.\n\nPå KICKS tror vi på jämlikhet, inkludering och mångfald och vet att olika erfarenheter tar oss framåt. Därför ser vi positivt på sökande av alla kön och med olika födelsebakgrund och livserfarenheter.\n\n\nKICKS är Nordens ledande skönhetskedja och erbjuder ett helhetskoncept inom makeup, doft, hudvård och hårvård. Med välutbildade skönhetsexperter i 250 butiker i Sverige, Norge och Finland och en modern omnikanalslösning, där fysisk butik och e-handel är integrerat, erbjuder KICKS personliga och inspirerande skönhetstjänster och runt 25 000 produkter från 300 varumärken. KICKS har flaggskeppsbutiker i Göteborg, Oslo och Malmö och är en del av Axel Johnson-koncernen.",
        "conditions" : "Deltid\r\nVisstidsanställning 3-6 månader",
        "text" : "Brinner du för att arbeta med människor och att ge service? Drivs du av försäljning och att arbeta mot uppsatta mål? Då är det kanske dig vi söker.\n\nSom säljare på KICKS är din huvuduppgift att genom personlig och professionell service ge varje besökare en lustfylld köpupplevelse. Dagligen driver du försäljning inom samtliga delar av sortimentet och tillsammans med dina kollegor ansvarar du för att genomföra kampanjer och aktiviteter i enlighet med KICKS koncept.\r\nVi söker dig som:\n\n - Brinner för försäljning och trivs med att arbeta mot individuella mål\n - Har en genuin servicekänsla och älskar att arbeta med människor\n - Alltid har kunden i fokus och drivs av utmaningen att ge varje besökare personlig service\n - Har stort intresse för våra produkter och viljan att utvecklas till skönhetsexpert\n - Är engagerad, ansvarstagande, ser möjligheter och trivs med att arbeta i team\n - Är utbildad makeupartist\n\nHar du dessutom erfarenhet från liknande tjänst inom detaljhandeln ser vi det som meriterande.\n\nDu får möjligheten att arbeta i en organisation med hög energinivå, tillsammans med kollegor med positiv och öppen attityd.\n\nTjänsten är en tidsbegränsad anställning 31/12-22 på deltid 20h/v.\n\nTillträde: Enl. överenskommelse \n\nVälkommen in med din ansökan redan idag!\n\nÄr du nyfiken på allt spännande som händer hos oss, ta en titt på vår Linkedin-sida här. \n\nKICKS anställer inte minderåriga, skulle du vara under 18 och har intresse av KICKS är du välkommen att söka praktik direkt via Butikschef. KICKS genomför bakgrundskontroll på slutkandidater.\n\nPå KICKS tror vi på jämlikhet, inkludering och mångfald och vet att olika erfarenheter tar oss framåt. Därför ser vi positivt på sökande av alla kön och med olika födelsebakgrund och livserfarenheter.\n\n\nKICKS är Nordens ledande skönhetskedja och erbjuder ett helhetskoncept inom makeup, doft, hudvård och hårvård. Med välutbildade skönhetsexperter i 250 butiker i Sverige, Norge och Finland och en modern omnikanalslösning, där fysisk butik och e-handel är integrerat, erbjuder KICKS personliga och inspirerande skönhetstjänster och runt 25 000 produkter från 300 varumärken. KICKS har flaggskeppsbutiker i Göteborg, Oslo och Malmö och är en del av Axel Johnson-koncernen."
      },
      "headline" : "KICKS Tuna Park söker säljande makeupartist med engagemang",
      "driving_license" : null,
      "employer" : {
        "email" : null,
        "phone_number" : null,
        "organization_number" : "5564329281",
        "name" : "Kicks Kosmetikkedjan AB",
        "url" : "http://www.kicks.se/",
        "workplace" : "KICKS Sverige"
      },
      "removed_date" : null,
      "logo_url" : null,
      "last_publication_date" : "2022-07-31T23:59:59",
      "number_of_vacancies" : 1,
      "occupation" : {
        "concept_id" : "MiYT_1JK_fKe",
        "label" : "Make-up artist",
        "legacy_ams_taxonomy_id" : "7312"
      },
      "occupation_group" : {
        "concept_id" : "ezKk_kss_CiQ",
        "label" : "Övriga skönhets- och kroppsterapeuter",
        "legacy_ams_taxonomy_id" : "5149"
      },
      "employment_type" : {
        "concept_id" : "PFZr_Syz_cUq",
        "label" : "Vanlig anställning",
        "legacy_ams_taxonomy_id" : "1"
      },
      "webpage_url" : "https://arbetsformedlingen.se/platsbanken/annonser/26349848",
      "driving_license_required" : false,
      "application_contacts" : [ ],
      "duration" : {
        "concept_id" : "Xj7x_7yZ_jEn",
        "label" : "3 månader – upp till 6 månader",
        "legacy_ams_taxonomy_id" : "3"
      },
      "nice_to_have" : {
        "education_level" : [ ],
        "work_experiences" : [ ],
        "skills" : [ ],
        "education" : [ ],
        "languages" : [ ]
      },
      "application_details" : {
        "via_af" : false,
        "email" : null,
        "other" : null,
        "reference" : null,
        "url" : "https://emp.jobylon.com/applications/jobs/141964/create/?utm_source=ams&utm_medium=promotionserializer",
        "information" : null
      },
      "source_type" : "VIA_PLATSBANKEN_DXA",
      "application_deadline" : "2022-07-31T23:59:59",
      "external_id" : "46-556432-9281-141964-72647",
      "workplace_address" : {
        "coordinates" : [ 16.509804, 59.37125 ],
        "city" : null,
        "postcode" : null,
        "municipality" : "Eskilstuna",
        "region_concept_id" : "s93u_BEb_sx2",
        "region" : "Södermanlands län",
        "country_code" : "199",
        "region_code" : "04",
        "municipality_concept_id" : "kMxr_NiX_YrU",
        "country_concept_id" : "i46j_HmG_v64",
        "municipality_code" : "0484",
        "street_address" : null,
        "country" : "Sverige"
      },
      "id" : "26349848",
      "experience_required" : true,
      "working_hours_type" : {
        "concept_id" : "947z_JGS_Uk2",
        "label" : "Deltid",
        "legacy_ams_taxonomy_id" : "2"
      },
      "access" : null,
      "timestamp" : 1658732904105,
      "must_have" : {
        "education_level" : [ ],
        "work_experiences" : [ {
          "concept_id" : "MiYT_1JK_fKe",
          "weight" : 10,
          "label" : "Make-up artist/MUA",
          "legacy_ams_taxonomy_id" : "7312"
        } ],
        "skills" : [ ],
        "education" : [ ],
        "languages" : [ ]
      },
      "occupation_field" : {
        "concept_id" : "Uuf1_GMh_Uvw",
        "label" : "Kropps- och skönhetsvård",
        "legacy_ams_taxonomy_id" : "4"
      },
      "scope_of_work" : {
        "min" : 0,
        "max" : 100
      },
      "salary_type" : {
        "concept_id" : "oG8G_9cW_nRf",
        "label" : "Fast månads- vecko- eller timlön",
        "legacy_ams_taxonomy_id" : "1"
      },
      "removed" : false,
      "salary_description" : "Fast månads- vecko- eller timlön",
      "access_to_own_car" : false,
      "publication_date" : "2022-07-25T09:08:24"
    },
    "name" : "KICKS Tuna Park söker säljande makeupartist med engagemang",
    "user" : "kristof.fischer"
  },
  "sha1" : "fea618b178a30c986a367960de77e0300de910a8",
  "annotations" : [ {
    "preferred-label" : "Make-up artist/MUA",
    "sentiment" : "MUST_HAVE",
    "type" : "occupation-name",
    "start-position" : 31,
    "end-position" : 43,
    "concept-id" : "MiYT_1JK_fKe",
    "matched-string" : "makeupartist",
    "annotation-id" : 0
  }, {
    "preferred-label" : "specialiserad säljare",
    "sentiment" : "MUST_HAVE",
    "type" : "esco-occupation",
    "start-position" : 212,
    "end-position" : 219,
    "concept-id" : "r6yu_Jip_6tE",
    "matched-string" : "säljare",
    "annotation-id" : 1
  }, {
    "preferred-label" : "Make-up artist/MUA",
    "sentiment" : "MUST_HAVE",
    "type" : "occupation-name",
    "start-position" : 962,
    "end-position" : 974,
    "concept-id" : "MiYT_1JK_fKe",
    "matched-string" : "makeupartist",
    "annotation-id" : 3
  }, {
    "preferred-label" : null,
    "sentiment" : "NICE_TO_HAVE",
    "type" : "skill",
    "start-position" : 1029,
    "end-position" : 1042,
    "concept-id" : null,
    "matched-string" : "detaljhandeln",
    "annotation-id" : 10
  }, {
    "preferred-label" : "Tidsbegränsad anställning",
    "type" : "employment-type",
    "start-position" : 1212,
    "end-position" : 1237,
    "concept-id" : "sTu5_NBQ_udq",
    "matched-string" : "tidsbegränsad anställning",
    "annotation-id" : 11
  }, {
    "preferred-label" : "Deltid",
    "type" : "worktime-extent",
    "start-position" : 1250,
    "end-position" : 1256,
    "concept-id" : "947z_JGS_Uk2",
    "matched-string" : "deltid",
    "annotation-id" : 12
  } ],
  "text" : "KICKS Tuna Park söker säljande makeupartist med engagemang\nBrinner du för att arbeta med människor och att ge service? Drivs du av försäljning och att arbeta mot uppsatta mål? Då är det kanske dig vi söker.\n\nSom säljare på KICKS är din huvuduppgift att genom personlig och professionell service ge varje besökare en lustfylld köpupplevelse. Dagligen driver du försäljning inom samtliga delar av sortimentet och tillsammans med dina kollegor ansvarar du för att genomföra kampanjer och aktiviteter i enlighet med KICKS koncept.\r\nVi söker dig som:\n\n - Brinner för försäljning och trivs med att arbeta mot individuella mål\n - Har en genuin servicekänsla och älskar att arbeta med människor\n - Alltid har kunden i fokus och drivs av utmaningen att ge varje besökare personlig service\n - Har stort intresse för våra produkter och viljan att utvecklas till skönhetsexpert\n - Är engagerad, ansvarstagande, ser möjligheter och trivs med att arbeta i team\n - Är utbildad makeupartist\n\nHar du dessutom erfarenhet från liknande tjänst inom detaljhandeln ser vi det som meriterande.\n\nDu får möjligheten att arbeta i en organisation med hög energinivå, tillsammans med kollegor med positiv och öppen attityd.\n\nTjänsten är en tidsbegränsad anställning 31/12-22 på deltid 20h/v.\n\nTillträde: Enl. överenskommelse \n\nVälkommen in med din ansökan redan idag!\n\nÄr du nyfiken på allt spännande som händer hos oss, ta en titt på vår Linkedin-sida här. \n\nKICKS anställer inte minderåriga, skulle du vara under 18 och har intresse av KICKS är du välkommen att söka praktik direkt via Butikschef. KICKS genomför bakgrundskontroll på slutkandidater.\n\nPå KICKS tror vi på jämlikhet, inkludering och mångfald och vet att olika erfarenheter tar oss framåt. Därför ser vi positivt på sökande av alla kön och med olika födelsebakgrund och livserfarenheter.\n\n\nKICKS är Nordens ledande skönhetskedja och erbjuder ett helhetskoncept inom makeup, doft, hudvård och hårvård. Med välutbildade skönhetsexperter i 250 butiker i Sverige, Norge och Finland och en modern omnikanalslösning, där fysisk butik och e-handel är integrerat, erbjuder KICKS personliga och inspirerande skönhetstjänster och runt 25 000 produkter från 300 varumärken. KICKS har flaggskeppsbutiker i Göteborg, Oslo och Malmö och är en del av Axel Johnson-koncernen."
}