{
  "meta" : {
    "jobad" : {
      "description" : {
        "requirements" : null,
        "needs" : null,
        "company_information" : null,
        "text_formatted" : "\"Det bästa med min roll är den stora variationen av arbetsuppgifter och alla människor man möter, både kollegor, kunder och andra intressenter. Att leda ett stort komplext anläggningsprojekt betyder att man måste gilla att vara problemlösare, bollplank, ekonom och ibland psykolog, allt beroende på var projektet befinner sig. Det passar mig perfekt!” (Sofia Edoff, Projektdirektör)\n\nLarge Civil Projects utvecklar och leder komplexa infrastrukturprojekt i miljardklassen i Sverige. Inom divisionen samlas erfarna projektchefer, specialister och andra nyckelkompetenser för att möta de krav som ställs på den här typen av projekt – från anbud till färdigt projekt.\n\nRollen som Projektdirektör\nSom Projektdirektör är du ytterst ansvarig för projektet. Du leder och genomför erhållet projekt inom bestämda tids-, kvalitets- och kostnadsramar samt säkerställer rätt kvalitet och goda relationer med beställare och övriga intressenter.\n\nRollen innebär följande:\n\n\n• Huvudansvar för ekonomi, styrning och kontroll av projektet samt att säkerställa att arbetet under anbudsfasen förs över till projektet på bästa sätt\n• Säkerställa att projektet följer bestämda tids-, kvalitets- och kostnadsramar, samt att arbetet sker i enlighet med processerna i verksamhetssystemet och dokumenteras på erforderligt sätt\n• Ekonomi/Resultatansvar\n• Ansvar för kvalitet och leverans enligt kontrakt\n• Arbetsmiljö- och miljöansvar\n• Personalansvar för tilldelad personal och huvudansvar för den övergripande resursplaneringen (inkl externa resurser)\n• Ansvar för arbetet i projektets ledningsgrupp.\n\nDu rapporterar till en projektstyrelse och ansvarar för att skapa en god kultur och teamkänsla på projektet samt en god arbetsmiljö och effektiva arbetsprocesser. Det är ditt ansvar att driva ledningsgruppens arbete samt att information- och kommunikationsvägar fungerar på projektet.\n\nDin profil\nVi söker dig som har erfarenhet av att leda andra chefer och större organisationer med flera nivåer. Du har mångårig erfarenhet av produktion och produktionsledning, företrädesvis i stora och komplexa projekt över en halv miljard. Utöver det även erfarenhet av utförande- och totalentreprenader.\n\nRollen kräver en strategisk kompetens och förståelse för anläggningsprojekt samt vilka parametrar som påverkar ett lönsamt projekt. Du behöver mycket god förståelse för projektledning med förmåga att förstå samband mellan kalkyl, planering, ekonomistyrning, inköp, projektering och produktion.  Som person är du relationsskapande med god förmåga att förstå och kommunicera framgångsrikt med olika intressenter. Utöver det har du en mycket god förmåga att styra, leda och engagera medarbetare mot uppsatta mål. \n\nDin förmåga att uttrycka sig på svenska och engelska i tal och skrift är god.\n\nYtterligare information\nDivision Large Civil Projects är specialiserad på stora och komplexa infrastrukturprojekt i Sverige med huvudfokus på Stockholm, Göteborg och Malmö. Din placering blir på något av våra stora projekt i Stockholm eller som en del i ett team som arbetar i tidiga skeden. \n\nKontakt och ansökan\nVid frågor är du välkommen att höra av dig till Thomas Widehag, Avdelningschef Large Civil Projects, 070 315 79 86 eller Anna Nyberg, HR specialist Rekrytering, 076 521 58 59. Urval och tillsättning startar tidigast vecka 33. Ansök senast den 2022-08-17.\n\nVarmt välkommen med din ansökan!\n\nOm oss\nPå NCC blir du en del i en organisation med goda värderingar, hög miljömedvetenhet och en stark vilja att lyckas tillsammans.\n\nVarje dag tar våra över 13 000 medarbetare beslut som förbättrar människors vardag, både idag och i morgon. Här arbetar du i en stark gemenskap tillsammans med engagerade och professionella kollegor som drivs av att lära nytt, nå uppsatta mål, dela erfarenheter och göra verklig skillnad tillsammans. Vi utmanar oss själva för att driva utvecklingen och skapar hållbara lösningar som för samhället framåt med ny kunskap. \n\nSom ett av Nordens ledande bygg- och fastighetsutvecklingsföretag utvecklar vi kommersiella fastigheter, bygger skolor, sjukhus, bostäder, vägar, broar och annan infrastruktur som formar vårt sätt att leva, arbeta och resa i samhället. Genom vår industriverksamhet erbjuder vi produkter och tjänster med inriktning på stenmaterial och asfaltsproduktion, beläggningsuppdrag.\n\nVi värnar ett hållbart arbetsliv med starkt fokus på säkerhet, personlig utveckling och balans mellan jobb och fritid.\n\nNCC ska spegla våra kunder såväl som samhället i stort och är beroende av medarbetare med olika kompetenser. Vi strävar efter att anställa människor med olika bakgrund och värdesätter den kunskap och erfarenhet det medför.\n\n2021 omsatte NCC ca 53 miljarder SEK och NCC:s aktier är noterade på Nasdaq Stockholm.\n\nVi undanber oss vänligen men bestämt kontakt med rekryterare samt säljare av annons- eller bemanningslösningar.",
        "conditions" : "Heltid/\r\nEj specificerat",
        "text" : "\"Det bästa med min roll är den stora variationen av arbetsuppgifter och alla människor man möter, både kollegor, kunder och andra intressenter. Att leda ett stort komplext anläggningsprojekt betyder att man måste gilla att vara problemlösare, bollplank, ekonom och ibland psykolog, allt beroende på var projektet befinner sig. Det passar mig perfekt!” (Sofia Edoff, Projektdirektör)\n\nLarge Civil Projects utvecklar och leder komplexa infrastrukturprojekt i miljardklassen i Sverige. Inom divisionen samlas erfarna projektchefer, specialister och andra nyckelkompetenser för att möta de krav som ställs på den här typen av projekt – från anbud till färdigt projekt.\n\nRollen som Projektdirektör\nSom Projektdirektör är du ytterst ansvarig för projektet. Du leder och genomför erhållet projekt inom bestämda tids-, kvalitets- och kostnadsramar samt säkerställer rätt kvalitet och goda relationer med beställare och övriga intressenter.\n\nRollen innebär följande:\n\n\n• Huvudansvar för ekonomi, styrning och kontroll av projektet samt att säkerställa att arbetet under anbudsfasen förs över till projektet på bästa sätt\n• Säkerställa att projektet följer bestämda tids-, kvalitets- och kostnadsramar, samt att arbetet sker i enlighet med processerna i verksamhetssystemet och dokumenteras på erforderligt sätt\n• Ekonomi/Resultatansvar\n• Ansvar för kvalitet och leverans enligt kontrakt\n• Arbetsmiljö- och miljöansvar\n• Personalansvar för tilldelad personal och huvudansvar för den övergripande resursplaneringen (inkl externa resurser)\n• Ansvar för arbetet i projektets ledningsgrupp.\n\nDu rapporterar till en projektstyrelse och ansvarar för att skapa en god kultur och teamkänsla på projektet samt en god arbetsmiljö och effektiva arbetsprocesser. Det är ditt ansvar att driva ledningsgruppens arbete samt att information- och kommunikationsvägar fungerar på projektet.\n\nDin profil\nVi söker dig som har erfarenhet av att leda andra chefer och större organisationer med flera nivåer. Du har mångårig erfarenhet av produktion och produktionsledning, företrädesvis i stora och komplexa projekt över en halv miljard. Utöver det även erfarenhet av utförande- och totalentreprenader.\n\nRollen kräver en strategisk kompetens och förståelse för anläggningsprojekt samt vilka parametrar som påverkar ett lönsamt projekt. Du behöver mycket god förståelse för projektledning med förmåga att förstå samband mellan kalkyl, planering, ekonomistyrning, inköp, projektering och produktion.  Som person är du relationsskapande med god förmåga att förstå och kommunicera framgångsrikt med olika intressenter. Utöver det har du en mycket god förmåga att styra, leda och engagera medarbetare mot uppsatta mål. \n\nDin förmåga att uttrycka sig på svenska och engelska i tal och skrift är god.\n\nYtterligare information\nDivision Large Civil Projects är specialiserad på stora och komplexa infrastrukturprojekt i Sverige med huvudfokus på Stockholm, Göteborg och Malmö. Din placering blir på något av våra stora projekt i Stockholm eller som en del i ett team som arbetar i tidiga skeden. \n\nKontakt och ansökan\nVid frågor är du välkommen att höra av dig till Thomas Widehag, Avdelningschef Large Civil Projects, 070 315 79 86 eller Anna Nyberg, HR specialist Rekrytering, 076 521 58 59. Urval och tillsättning startar tidigast vecka 33. Ansök senast den 2022-08-17.\n\nVarmt välkommen med din ansökan!\n\nOm oss\nPå NCC blir du en del i en organisation med goda värderingar, hög miljömedvetenhet och en stark vilja att lyckas tillsammans.\n\nVarje dag tar våra över 13 000 medarbetare beslut som förbättrar människors vardag, både idag och i morgon. Här arbetar du i en stark gemenskap tillsammans med engagerade och professionella kollegor som drivs av att lära nytt, nå uppsatta mål, dela erfarenheter och göra verklig skillnad tillsammans. Vi utmanar oss själva för att driva utvecklingen och skapar hållbara lösningar som för samhället framåt med ny kunskap. \n\nSom ett av Nordens ledande bygg- och fastighetsutvecklingsföretag utvecklar vi kommersiella fastigheter, bygger skolor, sjukhus, bostäder, vägar, broar och annan infrastruktur som formar vårt sätt att leva, arbeta och resa i samhället. Genom vår industriverksamhet erbjuder vi produkter och tjänster med inriktning på stenmaterial och asfaltsproduktion, beläggningsuppdrag.\n\nVi värnar ett hållbart arbetsliv med starkt fokus på säkerhet, personlig utveckling och balans mellan jobb och fritid.\n\nNCC ska spegla våra kunder såväl som samhället i stort och är beroende av medarbetare med olika kompetenser. Vi strävar efter att anställa människor med olika bakgrund och värdesätter den kunskap och erfarenhet det medför.\n\n2021 omsatte NCC ca 53 miljarder SEK och NCC:s aktier är noterade på Nasdaq Stockholm.\n\nVi undanber oss vänligen men bestämt kontakt med rekryterare samt säljare av annons- eller bemanningslösningar."
      },
      "headline" : "Projektdirektör Large Civil projects NCC Infrastructure",
      "driving_license" : null,
      "employer" : {
        "email" : null,
        "phone_number" : null,
        "organization_number" : "5560345174",
        "name" : "NCC AB",
        "url" : "www.ncc.se",
        "workplace" : "NCC"
      },
      "removed_date" : null,
      "logo_url" : "https://www.arbetsformedlingen.se/rest/arbetsgivare/rest/af/v3/organisation/5560345174/logotyper/logo.png",
      "last_publication_date" : "2022-08-17T23:59:59",
      "number_of_vacancies" : 1,
      "occupation" : {
        "concept_id" : "n9AC_sTq_NAH",
        "label" : "Civilingenjör, väg- och vattenbyggnad",
        "legacy_ams_taxonomy_id" : "6484"
      },
      "occupation_group" : {
        "concept_id" : "XeBP_nMe_pXx",
        "label" : "Civilingenjörsyrken inom bygg och anläggning",
        "legacy_ams_taxonomy_id" : "2142"
      },
      "employment_type" : {
        "concept_id" : "PFZr_Syz_cUq",
        "label" : "Vanlig anställning",
        "legacy_ams_taxonomy_id" : "1"
      },
      "webpage_url" : "https://arbetsformedlingen.se/platsbanken/annonser/26274077",
      "driving_license_required" : false,
      "application_contacts" : [ ],
      "duration" : {
        "concept_id" : "a7uU_j21_mkL",
        "label" : "Tills vidare",
        "legacy_ams_taxonomy_id" : "1"
      },
      "nice_to_have" : {
        "education_level" : [ ],
        "work_experiences" : [ ],
        "skills" : [ ],
        "education" : [ ],
        "languages" : [ ]
      },
      "application_details" : {
        "via_af" : false,
        "email" : null,
        "other" : null,
        "reference" : null,
        "url" : "https://www.ncc.se/jobba-pa-ncc/ansok/?rmpage=job&rmjob=16561",
        "information" : null
      },
      "source_type" : "VIA_PLATSBANKEN_DXA",
      "application_deadline" : "2022-08-17T23:59:59",
      "external_id" : "46-556034-5174-16561",
      "workplace_address" : {
        "coordinates" : [ 18.008434, 59.368877 ],
        "city" : null,
        "postcode" : null,
        "municipality" : "Solna",
        "region_concept_id" : "CifL_Rzy_Mku",
        "region" : "Stockholms län",
        "country_code" : "199",
        "region_code" : "01",
        "municipality_concept_id" : "zHxw_uJZ_NJ8",
        "country_concept_id" : "i46j_HmG_v64",
        "municipality_code" : "0184",
        "street_address" : null,
        "country" : "Sverige"
      },
      "id" : "26274077",
      "experience_required" : true,
      "working_hours_type" : {
        "concept_id" : "6YE1_gAC_R2G",
        "label" : "Heltid",
        "legacy_ams_taxonomy_id" : "1"
      },
      "access" : null,
      "timestamp" : 1656513474470,
      "must_have" : {
        "education_level" : [ ],
        "work_experiences" : [ {
          "concept_id" : "n9AC_sTq_NAH",
          "weight" : 10,
          "label" : "Civilingenjör, väg- och vattenbyggnad",
          "legacy_ams_taxonomy_id" : "6484"
        } ],
        "skills" : [ ],
        "education" : [ ],
        "languages" : [ ]
      },
      "occupation_field" : {
        "concept_id" : "j7Cq_ZJe_GkT",
        "label" : "Bygg och anläggning",
        "legacy_ams_taxonomy_id" : "2"
      },
      "scope_of_work" : {
        "min" : 100,
        "max" : 100
      },
      "salary_type" : {
        "concept_id" : "oG8G_9cW_nRf",
        "label" : "Fast månads- vecko- eller timlön",
        "legacy_ams_taxonomy_id" : "1"
      },
      "removed" : false,
      "salary_description" : "Enligt överenskommelse",
      "access_to_own_car" : false,
      "publication_date" : "2022-07-20T00:00:00"
    },
    "name" : "Projektdirektör Large Civil projects NCC Infrastructure",
    "user" : "hannes"
  },
  "sha1" : "0d4623604a025f624bf4497576bee0c560e1c3ac",
  "annotations" : [ {
    "preferred-label" : "Ekonomi",
    "type" : "keyword",
    "start-position" : 310,
    "end-position" : 316,
    "concept-id" : "PW4f_bmT_new",
    "matched-string" : "ekonom",
    "annotation-id" : 16
  }, {
    "preferred-label" : "psykolog",
    "sentiment" : "MUST_HAVE",
    "type" : "esco-occupation",
    "start-position" : 328,
    "end-position" : 336,
    "concept-id" : "yLc4_ZtB_oiN",
    "matched-string" : "psykolog",
    "annotation-id" : 0
  }, {
    "preferred-label" : "Sverige",
    "type" : "country",
    "start-position" : 530,
    "end-position" : 537,
    "concept-id" : "i46j_HmG_v64",
    "matched-string" : "Sverige",
    "annotation-id" : 17
  }, {
    "preferred-label" : "Ekonomi",
    "sentiment" : "MUST_HAVE",
    "type" : "keyword",
    "start-position" : 1034,
    "end-position" : 1041,
    "concept-id" : "PW4f_bmT_new",
    "matched-string" : "ekonomi",
    "annotation-id" : 1
  }, {
    "preferred-label" : "Ekonomi",
    "sentiment" : "MUST_HAVE",
    "type" : "keyword",
    "start-position" : 1360,
    "end-position" : 1367,
    "concept-id" : "PW4f_bmT_new",
    "matched-string" : "ekonomi",
    "annotation-id" : 2
  }, {
    "preferred-label" : "arbetsmiljö",
    "sentiment" : "MUST_HAVE",
    "type" : "esco-skill",
    "start-position" : 1436,
    "end-position" : 1447,
    "concept-id" : "zdQY_QJh_nUH",
    "matched-string" : "arbetsmiljö",
    "annotation-id" : 3
  }, {
    "preferred-label" : "Personalansvar",
    "sentiment" : "MUST_HAVE",
    "type" : "skill",
    "start-position" : 1467,
    "end-position" : 1481,
    "concept-id" : "ZzN5_m7B_5CY",
    "matched-string" : "personalansvar",
    "annotation-id" : 4
  }, {
    "preferred-label" : "Personal",
    "sentiment" : "MUST_HAVE",
    "type" : "keyword",
    "start-position" : 1496,
    "end-position" : 1504,
    "concept-id" : "HVxM_6MS_y1c",
    "matched-string" : "personal",
    "annotation-id" : 5
  }, {
    "preferred-label" : "arbetsmiljö",
    "sentiment" : "MUST_HAVE",
    "type" : "esco-skill",
    "start-position" : 1754,
    "end-position" : 1765,
    "concept-id" : "zdQY_QJh_nUH",
    "matched-string" : "arbetsmiljö",
    "annotation-id" : 6
  }, {
    "preferred-label" : "projektledning",
    "type" : "esco-skill",
    "start-position" : 2397,
    "end-position" : 2411,
    "concept-id" : "PPNS_ZLX_YsQ",
    "matched-string" : "projektledning",
    "annotation-id" : 18
  }, {
    "preferred-label" : "Kalkylering",
    "type" : "skill",
    "start-position" : 2450,
    "end-position" : 2456,
    "concept-id" : "hb3b_fH2_bvK",
    "matched-string" : "kalkyl",
    "annotation-id" : 19
  }, {
    "preferred-label" : "Ekonomistyrning",
    "sentiment" : "MUST_HAVE",
    "type" : "skill",
    "start-position" : 2469,
    "end-position" : 2484,
    "concept-id" : "awjU_C3D_XEJ",
    "matched-string" : "ekonomistyrning",
    "annotation-id" : 7
  }, {
    "preferred-label" : "Projektering",
    "sentiment" : "MUST_HAVE",
    "type" : "skill",
    "start-position" : 2493,
    "end-position" : 2505,
    "concept-id" : "zRtu_fYj_XC4",
    "matched-string" : "projektering",
    "annotation-id" : 8
  }, {
    "preferred-label" : "Svenska",
    "sentiment" : "MUST_HAVE",
    "type" : "language",
    "start-position" : 2772,
    "end-position" : 2779,
    "concept-id" : "zSLA_vw2_FXN",
    "matched-string" : "svenska",
    "annotation-id" : 9
  }, {
    "preferred-label" : "Engelska",
    "sentiment" : "MUST_HAVE",
    "type" : "language",
    "start-position" : 2784,
    "end-position" : 2792,
    "concept-id" : "NVxJ_hLg_TYS",
    "matched-string" : "engelska",
    "annotation-id" : 10
  }, {
    "preferred-label" : "Sverige",
    "type" : "country",
    "start-position" : 2935,
    "end-position" : 2942,
    "concept-id" : "i46j_HmG_v64",
    "matched-string" : "Sverige",
    "annotation-id" : 20
  }, {
    "preferred-label" : "Stockholm",
    "type" : "municipality",
    "start-position" : 2961,
    "end-position" : 2970,
    "concept-id" : "AvNB_uwa_6n6",
    "matched-string" : "Stockholm",
    "annotation-id" : 21
  }, {
    "preferred-label" : "Göteborg",
    "type" : "municipality",
    "start-position" : 2972,
    "end-position" : 2980,
    "concept-id" : "PVZL_BQT_XtL",
    "matched-string" : "Göteborg",
    "annotation-id" : 22
  }, {
    "preferred-label" : "Malmö",
    "type" : "municipality",
    "start-position" : 2985,
    "end-position" : 2990,
    "concept-id" : "oYPt_yRA_Smm",
    "matched-string" : "Malmö",
    "annotation-id" : 23
  }, {
    "preferred-label" : "Stockholm",
    "type" : "municipality",
    "start-position" : 3044,
    "end-position" : 3053,
    "concept-id" : "AvNB_uwa_6n6",
    "matched-string" : "Stockholm",
    "annotation-id" : 24
  } ],
  "text" : "Projektdirektör Large Civil projects NCC Infrastructure\n\"Det bästa med min roll är den stora variationen av arbetsuppgifter och alla människor man möter, både kollegor, kunder och andra intressenter. Att leda ett stort komplext anläggningsprojekt betyder att man måste gilla att vara problemlösare, bollplank, ekonom och ibland psykolog, allt beroende på var projektet befinner sig. Det passar mig perfekt!” (Sofia Edoff, Projektdirektör)\n\nLarge Civil Projects utvecklar och leder komplexa infrastrukturprojekt i miljardklassen i Sverige. Inom divisionen samlas erfarna projektchefer, specialister och andra nyckelkompetenser för att möta de krav som ställs på den här typen av projekt – från anbud till färdigt projekt.\n\nRollen som Projektdirektör\nSom Projektdirektör är du ytterst ansvarig för projektet. Du leder och genomför erhållet projekt inom bestämda tids-, kvalitets- och kostnadsramar samt säkerställer rätt kvalitet och goda relationer med beställare och övriga intressenter.\n\nRollen innebär följande:\n\n\n• Huvudansvar för ekonomi, styrning och kontroll av projektet samt att säkerställa att arbetet under anbudsfasen förs över till projektet på bästa sätt\n• Säkerställa att projektet följer bestämda tids-, kvalitets- och kostnadsramar, samt att arbetet sker i enlighet med processerna i verksamhetssystemet och dokumenteras på erforderligt sätt\n• Ekonomi/Resultatansvar\n• Ansvar för kvalitet och leverans enligt kontrakt\n• Arbetsmiljö- och miljöansvar\n• Personalansvar för tilldelad personal och huvudansvar för den övergripande resursplaneringen (inkl externa resurser)\n• Ansvar för arbetet i projektets ledningsgrupp.\n\nDu rapporterar till en projektstyrelse och ansvarar för att skapa en god kultur och teamkänsla på projektet samt en god arbetsmiljö och effektiva arbetsprocesser. Det är ditt ansvar att driva ledningsgruppens arbete samt att information- och kommunikationsvägar fungerar på projektet.\n\nDin profil\nVi söker dig som har erfarenhet av att leda andra chefer och större organisationer med flera nivåer. Du har mångårig erfarenhet av produktion och produktionsledning, företrädesvis i stora och komplexa projekt över en halv miljard. Utöver det även erfarenhet av utförande- och totalentreprenader.\n\nRollen kräver en strategisk kompetens och förståelse för anläggningsprojekt samt vilka parametrar som påverkar ett lönsamt projekt. Du behöver mycket god förståelse för projektledning med förmåga att förstå samband mellan kalkyl, planering, ekonomistyrning, inköp, projektering och produktion.  Som person är du relationsskapande med god förmåga att förstå och kommunicera framgångsrikt med olika intressenter. Utöver det har du en mycket god förmåga att styra, leda och engagera medarbetare mot uppsatta mål. \n\nDin förmåga att uttrycka sig på svenska och engelska i tal och skrift är god.\n\nYtterligare information\nDivision Large Civil Projects är specialiserad på stora och komplexa infrastrukturprojekt i Sverige med huvudfokus på Stockholm, Göteborg och Malmö. Din placering blir på något av våra stora projekt i Stockholm eller som en del i ett team som arbetar i tidiga skeden. \n\nKontakt och ansökan\nVid frågor är du välkommen att höra av dig till Thomas Widehag, Avdelningschef Large Civil Projects, 070 315 79 86 eller Anna Nyberg, HR specialist Rekrytering, 076 521 58 59. Urval och tillsättning startar tidigast vecka 33. Ansök senast den 2022-08-17.\n\nVarmt välkommen med din ansökan!\n\nOm oss\nPå NCC blir du en del i en organisation med goda värderingar, hög miljömedvetenhet och en stark vilja att lyckas tillsammans.\n\nVarje dag tar våra över 13 000 medarbetare beslut som förbättrar människors vardag, både idag och i morgon. Här arbetar du i en stark gemenskap tillsammans med engagerade och professionella kollegor som drivs av att lära nytt, nå uppsatta mål, dela erfarenheter och göra verklig skillnad tillsammans. Vi utmanar oss själva för att driva utvecklingen och skapar hållbara lösningar som för samhället framåt med ny kunskap. \n\nSom ett av Nordens ledande bygg- och fastighetsutvecklingsföretag utvecklar vi kommersiella fastigheter, bygger skolor, sjukhus, bostäder, vägar, broar och annan infrastruktur som formar vårt sätt att leva, arbeta och resa i samhället. Genom vår industriverksamhet erbjuder vi produkter och tjänster med inriktning på stenmaterial och asfaltsproduktion, beläggningsuppdrag.\n\nVi värnar ett hållbart arbetsliv med starkt fokus på säkerhet, personlig utveckling och balans mellan jobb och fritid.\n\nNCC ska spegla våra kunder såväl som samhället i stort och är beroende av medarbetare med olika kompetenser. Vi strävar efter att anställa människor med olika bakgrund och värdesätter den kunskap och erfarenhet det medför.\n\n2021 omsatte NCC ca 53 miljarder SEK och NCC:s aktier är noterade på Nasdaq Stockholm.\n\nVi undanber oss vänligen men bestämt kontakt med rekryterare samt säljare av annons- eller bemanningslösningar."
}