{
  "meta" : {
    "dataset-id" : "myh-spreadsheet-2021",
    "type" : "education-description",
    "dataset-document-id" : "YH01061",
    "user" : "kristof.fischer"
  },
  "sha1" : "bedd931e0bfba3cef1e4b2b1544db9c3c7751bf5",
  "annotations" : [ {
    "preferred-label" : "Tandsköterska",
    "sentiment" : "OFFERED",
    "type" : "occupation-name",
    "start-position" : 4,
    "end-position" : 17,
    "concept-id" : "ckkD_JhH_Sc6",
    "matched-string" : "tandsköterska",
    "annotation-id" : 0
  }, {
    "preferred-label" : "Tandläkare",
    "sentiment" : "NOT_RELEVANT",
    "type" : "occupation-name",
    "start-position" : 93,
    "end-position" : 103,
    "concept-id" : "TdvW_S8R_CFH",
    "matched-string" : "tandläkare",
    "annotation-id" : 1
  }, {
    "preferred-label" : "Tandhygienist",
    "sentiment" : "NOT_RELEVANT",
    "type" : "occupation-name",
    "start-position" : 108,
    "end-position" : 123,
    "concept-id" : "TPRY_Wze_q6x",
    "matched-string" : "tandhygienister",
    "annotation-id" : 2
  }, {
    "preferred-label" : "Tandsköterska",
    "sentiment" : "OFFERED",
    "type" : "occupation-name",
    "start-position" : 194,
    "end-position" : 208,
    "concept-id" : "ckkD_JhH_Sc6",
    "matched-string" : "tandsköterskor",
    "annotation-id" : 3
  }, {
    "preferred-label" : "Tandsköterska",
    "sentiment" : "OFFERED",
    "type" : "occupation-name",
    "start-position" : 356,
    "end-position" : 369,
    "concept-id" : "ckkD_JhH_Sc6",
    "matched-string" : "tandsköterska",
    "annotation-id" : 4
  }, {
    "preferred-label" : "assistera tandläkaren vid tandvårdsbehandlingar",
    "sentiment" : "OFFERED",
    "type" : "esco-skill",
    "start-position" : 409,
    "end-position" : 468,
    "concept-id" : "5LfH_HF6_dBU",
    "matched-string" : "assisterar vid undersökningar och behandlingar av patienter",
    "annotation-id" : 13
  }, {
    "preferred-label" : "arbeta självständigt",
    "sentiment" : "OFFERED",
    "type" : "esco-skill",
    "start-position" : 473,
    "end-position" : 494,
    "concept-id" : "NyFu_HHd_zhz",
    "matched-string" : "arbetar självständigt",
    "annotation-id" : 10
  }, {
    "preferred-label" : "Tandsköterska",
    "sentiment" : "OFFERED",
    "type" : "occupation-name",
    "start-position" : 563,
    "end-position" : 579,
    "concept-id" : "ckkD_JhH_Sc6",
    "matched-string" : "Tandsköterskorna",
    "annotation-id" : 14
  }, {
    "preferred-label" : "boka",
    "sentiment" : "OFFERED",
    "type" : "esco-skill",
    "start-position" : 636,
    "end-position" : 663,
    "concept-id" : "BXay_uH7_Yz7",
    "matched-string" : "ta emot samt boka in kunder",
    "annotation-id" : 11
  }, {
    "preferred-label" : "använda dator",
    "sentiment" : "OFFERED",
    "type" : "esco-skill",
    "start-position" : 728,
    "end-position" : 735,
    "concept-id" : "HEbR_xrb_MpT",
    "matched-string" : "datorer",
    "annotation-id" : 12
  }, {
    "preferred-label" : "sterilisera medicinsk utrustning",
    "sentiment" : "OFFERED",
    "type" : "esco-skill",
    "start-position" : 737,
    "end-position" : 764,
    "concept-id" : "kbGb_Dfg_Z7A",
    "matched-string" : "sterilisering av instrument",
    "annotation-id" : 15
  }, {
    "preferred-label" : "arbeta med kvalitetsfrågor",
    "sentiment" : "OFFERED",
    "type" : "esco-skill",
    "start-position" : 782,
    "end-position" : 808,
    "concept-id" : "kugC_78F_9WU",
    "matched-string" : "miljö- och kvalitetsarbete",
    "annotation-id" : 16
  }, {
    "preferred-label" : "utföra administrativt arbete",
    "sentiment" : "OFFERED",
    "type" : "esco-skill",
    "start-position" : 831,
    "end-position" : 853,
    "concept-id" : "2x13_sLi_EzG",
    "matched-string" : "administrativt arbetet",
    "annotation-id" : 17
  }, {
    "preferred-label" : "föra journal",
    "sentiment" : "OFFERED",
    "type" : "esco-skill",
    "start-position" : 861,
    "end-position" : 874,
    "concept-id" : "wc5w_aw2_KBh",
    "matched-string" : "journalföring",
    "annotation-id" : 18
  }, {
    "preferred-label" : "Heltid",
    "sentiment" : "OFFERED",
    "type" : "worktime-extent",
    "start-position" : 898,
    "end-position" : 904,
    "concept-id" : "6YE1_gAC_R2G",
    "matched-string" : "heltid",
    "annotation-id" : 19
  }, {
    "preferred-label" : "Tandvård",
    "sentiment" : "OFFERED",
    "type" : "sun-education-field-3",
    "start-position" : 963,
    "end-position" : 973,
    "concept-id" : "LXNM_AzU_2G5",
    "matched-string" : "Oral hälsa",
    "annotation-id" : 20
  }, {
    "preferred-label" : "Tandvård",
    "sentiment" : "OFFERED",
    "type" : "sun-education-field-3",
    "start-position" : 975,
    "end-position" : 1006,
    "concept-id" : "LXNM_AzU_2G5",
    "matched-string" : "Munhålans och tändernas anatomi",
    "annotation-id" : 21
  }, {
    "preferred-label" : "Tandvård",
    "sentiment" : "OFFERED",
    "type" : "sun-education-field-3",
    "start-position" : 1008,
    "end-position" : 1020,
    "concept-id" : "LXNM_AzU_2G5",
    "matched-string" : "Teamtandvård",
    "annotation-id" : 22
  }, {
    "preferred-label" : null,
    "sentiment" : "OFFERED",
    "type" : "sun-education-field-4",
    "start-position" : 1025,
    "end-position" : 1050,
    "concept-id" : null,
    "matched-string" : "Vårdhygien och smittskydd",
    "annotation-id" : 23
  }, {
    "preferred-label" : "Linköping",
    "sentiment" : "NOT_RELEVANT",
    "type" : "municipality",
    "start-position" : 1280,
    "end-position" : 1289,
    "concept-id" : "bm2x_1mr_Qhx",
    "matched-string" : "Linköping",
    "annotation-id" : 24
  }, {
    "preferred-label" : "Gislaved",
    "sentiment" : "NOT_RELEVANT",
    "type" : "municipality",
    "start-position" : 1294,
    "end-position" : 1302,
    "concept-id" : "cNQx_Yqi_83Q",
    "matched-string" : "Gislaved",
    "annotation-id" : 25
  }, {
    "preferred-label" : "Linköping",
    "sentiment" : "NOT_RELEVANT",
    "type" : "municipality",
    "start-position" : 1360,
    "end-position" : 1369,
    "concept-id" : "bm2x_1mr_Qhx",
    "matched-string" : "Linköping",
    "annotation-id" : 26
  }, {
    "preferred-label" : "Gislaved",
    "sentiment" : "NOT_RELEVANT",
    "type" : "municipality",
    "start-position" : 1390,
    "end-position" : 1398,
    "concept-id" : "cNQx_Yqi_83Q",
    "matched-string" : "Gislaved",
    "annotation-id" : 27
  }, {
    "preferred-label" : "Distansarbete",
    "sentiment" : "OFFERED",
    "type" : "work-place-environment",
    "start-position" : 1461,
    "end-position" : 1468,
    "concept-id" : "uwzb_xcR_vxS",
    "matched-string" : "distans",
    "annotation-id" : 28
  }, {
    "preferred-label" : "Östergötlands län",
    "sentiment" : "OFFERED",
    "type" : "region",
    "start-position" : 1552,
    "end-position" : 1564,
    "concept-id" : "oLT3_Q9p_3nn",
    "matched-string" : "Östergötland",
    "annotation-id" : 29
  }, {
    "preferred-label" : "Jönköpings län",
    "sentiment" : "OFFERED",
    "type" : "region",
    "start-position" : 1573,
    "end-position" : 1587,
    "concept-id" : "MtbE_xWT_eMi",
    "matched-string" : "Jönköpings län",
    "annotation-id" : 30
  } ],
  "text" : "Som tandsköterska arbetar du i ett serviceyrke med mycket patientkontakt och tillsammans med tandläkare och tandhygienister ingår du i ett tandvårdsteam. I dagsläget utbildas det inte nog många tandsköterskor för att täcka det växande behovet av nyrekryteringar som finns över hela landet och utsikterna till jobb efter utbildningen är mycket goda.    Som tandsköterska har du flera olika arbetsuppgifter. Du assisterar vid undersökningar och behandlingar av patienter. Du arbetar självständigt med ett preventivt arbete kring munhygien och tandhälsoinformation. Tandsköterskorna ansvarar också för mycket av patientkontakten genom att ta emot samt boka in kunder. I det dagliga arbetet ingår användandet av teknisk utrustning, datorer, sterilisering av instrument och ett ständigt miljö- och kvalitetsarbete på arbetsplatsen samt administrativt arbetet så som journalföring.    Utbildningen är på heltid under tre terminer. Du läser en rad intressanta ämnen som Oral hälsa, Munhålans och tändernas anatomi, Teamtandvård och Vårdhygien och smittskydd. Under varje termin finns en LIA-period inplanerad då du befinner dig ute på en tandvårdsklinik för att träna dina teoretiska kunskaper i praktiken.      Stor regional efterfrågan  Utbildningen är en flerortsutbildning och går i Linköping och Gislaved parallellt. Detta innebär att en del av klassen sitter i Linköping och en del sitter i Gislaved. Föreläsningar som äger rum fysiskt på den ena orten följs på distans på den andra orten. Utbildningen sker i tätt samarbete med Folktandvården i Region Östergötland, Region Jönköpings län och privattandvården.  "
}