{
  "meta" : {
    "jobad" : {
      "description" : {
        "requirements" : null,
        "needs" : null,
        "company_information" : null,
        "text_formatted" : "<p><strong><u>Mister York söker stjärnor till ALINGSÅS!</u></strong></p><p>Det började som en food truck på Stortorget i Kalmar direkt efter studenten år 2020. Coronapandemin slog hårt och arbetslösheten steg. Två vänner bestämde sig då för att laga burgare i sin nyinköpta food truck för att sprida glädje till folket. Burgarna visade sig bli en fortsatt enorm succé. Verksamheten finns idag på flera olika orter och har en tydlig expansionsplan för framtiden.</p><p><br></p><p><strong>Tjänst</strong></p><p>Nu söker vi stjärnor till vårt team i Alingsås som vill jobba extra, exempelvis vid sidan av studier eller annan sysselsättning. Arbetstid kan variera alla dagar i veckan. </p><p><em>Tjänsten beräknas börja i slutet av augusti.</em></p><p><br></p><p><u>Rollen som Team Member</u></p><p>Vi söker dig som är ansvarstagande, utåtriktad, engagerad &amp; duktig på att samarbeta väl i grupp. Du kommer att jobba i ett sammansvetsat team för att leverera mat &amp; service i världsklass.</p><p>Dina arbetsuppgifter som Team Member kommer innefatta bland annat:</p><p>Förberedelser av tillbehör, tillagning av våra prisbelönta burgare, städning samt mottagande av kunder i kassan.</p><p> </p><p>Hög kvalitet är något som genomsyrar hela vår företagskultur. Alla som arbetar inom vår verksamhet ska veta varför de går till jobbet varje morgon och hur de är med och bidrar.</p><p> </p><p><strong>VÅRA FÖRVÄNTNINGAR PÅ DIG:</strong></p><p>- Du har rätt approach och vill ha roligt på jobbet.</p><p>- Du är en person som vill utvecklas och lära dig nya saker.</p><p>- Du är en lagspelare som samarbetar bra med andra.</p><p>- Du uppskattar att jobba i ett högt tempo.</p><p>- Du är noggrann och effektiv.</p><p> </p><p><em>På Mister York så rekryterar vi utifrån personlighet och potential och inte endast utifrån tidigare erfarenheter. Vi erbjuder er full utbildning på plats.</em></p><p><em>Mister York är anslutna till kollektivavtal.</em></p>",
        "conditions" : null,
        "text" : "Mister York söker stjärnor till ALINGSÅS!\nDet började som en food truck på Stortorget i Kalmar direkt efter studenten år 2020. Coronapandemin slog hårt och arbetslösheten steg. Två vänner bestämde sig då för att laga burgare i sin nyinköpta food truck för att sprida glädje till folket. Burgarna visade sig bli en fortsatt enorm succé. Verksamheten finns idag på flera olika orter och har en tydlig expansionsplan för framtiden.\n\n\nTjänst\nNu söker vi stjärnor till vårt team i Alingsås som vill jobba extra, exempelvis vid sidan av studier eller annan sysselsättning. Arbetstid kan variera alla dagar i veckan. \nTjänsten beräknas börja i slutet av augusti.\n\n\nRollen som Team Member\nVi söker dig som är ansvarstagande, utåtriktad, engagerad & duktig på att samarbeta väl i grupp. Du kommer att jobba i ett sammansvetsat team för att leverera mat & service i världsklass.\nDina arbetsuppgifter som Team Member kommer innefatta bland annat:\nFörberedelser av tillbehör, tillagning av våra prisbelönta burgare, städning samt mottagande av kunder i kassan.\n \nHög kvalitet är något som genomsyrar hela vår företagskultur. Alla som arbetar inom vår verksamhet ska veta varför de går till jobbet varje morgon och hur de är med och bidrar.\n \nVÅRA FÖRVÄNTNINGAR PÅ DIG:\n- Du har rätt approach och vill ha roligt på jobbet.\n- Du är en person som vill utvecklas och lära dig nya saker.\n- Du är en lagspelare som samarbetar bra med andra.\n- Du uppskattar att jobba i ett högt tempo.\n- Du är noggrann och effektiv.\n \nPå Mister York så rekryterar vi utifrån personlighet och potential och inte endast utifrån tidigare erfarenheter. Vi erbjuder er full utbildning på plats.\nMister York är anslutna till kollektivavtal."
      },
      "headline" : "Extratjänst Team Member - MISTER YORK Alingsås",
      "driving_license" : null,
      "employer" : {
        "email" : null,
        "phone_number" : null,
        "organization_number" : "5592584360",
        "name" : "Mister York AB",
        "url" : "https://www.misteryork.se/",
        "workplace" : "Mister York Alingsås"
      },
      "removed_date" : null,
      "logo_url" : "https://www.arbetsformedlingen.se/rest/arbetsgivare/rest/af/v3/arbetsplatser/88164236/logotyper/logo.png",
      "last_publication_date" : "2022-08-24T00:00:00",
      "number_of_vacancies" : 5,
      "occupation" : {
        "concept_id" : "yXRQ_Ad9_E8V",
        "label" : "Restaurangbiträde",
        "legacy_ams_taxonomy_id" : "5555"
      },
      "occupation_group" : {
        "concept_id" : "tPox_ie4_X9X",
        "label" : "Restaurang- och köksbiträden m.fl.",
        "legacy_ams_taxonomy_id" : "9412"
      },
      "employment_type" : {
        "concept_id" : "PFZr_Syz_cUq",
        "label" : "Vanlig anställning",
        "legacy_ams_taxonomy_id" : "1"
      },
      "webpage_url" : "https://arbetsformedlingen.se/platsbanken/annonser/26350382",
      "driving_license_required" : false,
      "application_contacts" : [ {
        "description" : null,
        "email" : "matilda.wikman@misteryork.se",
        "telephone" : null,
        "name" : "Matilda Wikman",
        "contact_type" : "Etablering & Rekryteringsansvarig"
      } ],
      "duration" : {
        "concept_id" : "a7uU_j21_mkL",
        "label" : "Tills vidare",
        "legacy_ams_taxonomy_id" : "1"
      },
      "nice_to_have" : {
        "education_level" : [ ],
        "work_experiences" : [ ],
        "skills" : [ ],
        "education" : [ ],
        "languages" : [ ]
      },
      "application_details" : {
        "via_af" : false,
        "email" : null,
        "other" : null,
        "reference" : null,
        "url" : "https://career.misteryork.se/jobs/1666240-team-member-extrajobb-alingsas",
        "information" : null
      },
      "source_type" : "VIA_ANNONSERA",
      "application_deadline" : "2022-08-24T00:00:00",
      "external_id" : null,
      "workplace_address" : {
        "coordinates" : [ 12.526930416549186, 57.940132270033736 ],
        "city" : "Alingsås",
        "postcode" : "44157",
        "municipality" : "Alingsås",
        "region_concept_id" : "zdoY_6u5_Krt",
        "region" : "Västra Götalands län",
        "country_code" : "199",
        "region_code" : "14",
        "municipality_concept_id" : "UQ75_1eU_jaC",
        "country_concept_id" : "i46j_HmG_v64",
        "municipality_code" : "1489",
        "street_address" : "Kungegårdsgatan 1",
        "country" : "Sverige"
      },
      "id" : "26350382",
      "experience_required" : true,
      "working_hours_type" : {
        "concept_id" : "947z_JGS_Uk2",
        "label" : "Deltid",
        "legacy_ams_taxonomy_id" : "2"
      },
      "access" : null,
      "timestamp" : 1658737425278,
      "must_have" : {
        "education_level" : [ ],
        "work_experiences" : [ ],
        "skills" : [ ],
        "education" : [ ],
        "languages" : [ ]
      },
      "occupation_field" : {
        "concept_id" : "ScKy_FHB_7wT",
        "label" : "Hotell, restaurang, storhushåll",
        "legacy_ams_taxonomy_id" : "7"
      },
      "scope_of_work" : {
        "min" : 0,
        "max" : 100
      },
      "salary_type" : {
        "concept_id" : "oG8G_9cW_nRf",
        "label" : "Fast månads- vecko- eller timlön",
        "legacy_ams_taxonomy_id" : "1"
      },
      "removed" : false,
      "salary_description" : null,
      "access_to_own_car" : false,
      "publication_date" : "2022-07-25T10:23:45"
    },
    "name" : "Extratjänst Team Member - MISTER YORK Alingsås",
    "user" : "hannes"
  },
  "sha1" : "8f443175d47f9ff134fc9cd31954e775a1660d70",
  "annotations" : [ {
    "preferred-label" : "Alingsås",
    "type" : "municipality",
    "start-position" : 38,
    "end-position" : 46,
    "concept-id" : "UQ75_1eU_jaC",
    "matched-string" : "Alingsås",
    "annotation-id" : 3
  }, {
    "preferred-label" : "Alingsås",
    "type" : "municipality",
    "start-position" : 79,
    "end-position" : 87,
    "concept-id" : "UQ75_1eU_jaC",
    "matched-string" : "ALINGSÅS",
    "annotation-id" : 4
  }, {
    "preferred-label" : "Food truck",
    "sentiment" : "MUST_HAVE",
    "type" : "keyword",
    "start-position" : 108,
    "end-position" : 118,
    "concept-id" : "b57b_Nce_ahb",
    "matched-string" : "food truck",
    "annotation-id" : 0
  }, {
    "preferred-label" : "Kalmar",
    "type" : "municipality",
    "start-position" : 135,
    "end-position" : 141,
    "concept-id" : "Pnmg_SgP_uHQ",
    "matched-string" : "Kalmar",
    "annotation-id" : 5
  }, {
    "preferred-label" : "Food truck",
    "sentiment" : "MUST_HAVE",
    "type" : "keyword",
    "start-position" : 288,
    "end-position" : 298,
    "concept-id" : "b57b_Nce_ahb",
    "matched-string" : "food truck",
    "annotation-id" : 1
  }, {
    "preferred-label" : "Alingsås",
    "type" : "municipality",
    "start-position" : 523,
    "end-position" : 531,
    "concept-id" : "UQ75_1eU_jaC",
    "matched-string" : "Alingsås",
    "annotation-id" : 6
  }, {
    "preferred-label" : "visa ansvarstagande",
    "type" : "esco-skill",
    "start-position" : 748,
    "end-position" : 762,
    "concept-id" : "bcRp_hxV_f5G",
    "matched-string" : "ansvarstagande",
    "annotation-id" : 7
  }, {
    "preferred-label" : "noggrannhet",
    "type" : "esco-skill",
    "start-position" : 1522,
    "end-position" : 1530,
    "concept-id" : "mrsW_EkL_KRD",
    "matched-string" : "noggrann",
    "annotation-id" : 8
  }, {
    "preferred-label" : "Kollektivavtal",
    "sentiment" : "MUST_HAVE",
    "type" : "skill",
    "start-position" : 1731,
    "end-position" : 1745,
    "concept-id" : "z7wE_9xb_3jX",
    "matched-string" : "kollektivavtal",
    "annotation-id" : 2
  } ],
  "text" : "Extratjänst Team Member - MISTER YORK Alingsås\nMister York söker stjärnor till ALINGSÅS!\nDet började som en food truck på Stortorget i Kalmar direkt efter studenten år 2020. Coronapandemin slog hårt och arbetslösheten steg. Två vänner bestämde sig då för att laga burgare i sin nyinköpta food truck för att sprida glädje till folket. Burgarna visade sig bli en fortsatt enorm succé. Verksamheten finns idag på flera olika orter och har en tydlig expansionsplan för framtiden.\n\n\nTjänst\nNu söker vi stjärnor till vårt team i Alingsås som vill jobba extra, exempelvis vid sidan av studier eller annan sysselsättning. Arbetstid kan variera alla dagar i veckan. \nTjänsten beräknas börja i slutet av augusti.\n\n\nRollen som Team Member\nVi söker dig som är ansvarstagande, utåtriktad, engagerad & duktig på att samarbeta väl i grupp. Du kommer att jobba i ett sammansvetsat team för att leverera mat & service i världsklass.\nDina arbetsuppgifter som Team Member kommer innefatta bland annat:\nFörberedelser av tillbehör, tillagning av våra prisbelönta burgare, städning samt mottagande av kunder i kassan.\n \nHög kvalitet är något som genomsyrar hela vår företagskultur. Alla som arbetar inom vår verksamhet ska veta varför de går till jobbet varje morgon och hur de är med och bidrar.\n \nVÅRA FÖRVÄNTNINGAR PÅ DIG:\n- Du har rätt approach och vill ha roligt på jobbet.\n- Du är en person som vill utvecklas och lära dig nya saker.\n- Du är en lagspelare som samarbetar bra med andra.\n- Du uppskattar att jobba i ett högt tempo.\n- Du är noggrann och effektiv.\n \nPå Mister York så rekryterar vi utifrån personlighet och potential och inte endast utifrån tidigare erfarenheter. Vi erbjuder er full utbildning på plats.\nMister York är anslutna till kollektivavtal."
}