{
  "meta" : {
    "jobad" : {
      "description" : {
        "requirements" : null,
        "needs" : null,
        "company_information" : null,
        "text_formatted" : "Finsnickare till Hallberg-Rassy\n\nAnrika och välrenommerade Hallberg-Rassy söker dig som vill arbeta med kvalitet.\n\nPå Hallberg-Rassy jobbar du i ett kunnigt team där leveransnivån är hög. Det är därför viktigt att du har lätt för att samarbeta och kan ta till dig av nya metoder samt kunna arbeta självständigt och vara öppen för lösningar.\n\nDu kommer att vara med och bygga träinredningen till Hallberg-Rassys hypermoderna segelbåtar utifrån framtagna beredningsunderlag.\n\nFör att lyckas i rollen behöver du kunna läsa ritningar eller förstå muntlig genomgång samt gärna ha erfarenhet från liknade arbetsuppgifter i båtar. Du är yrkesutbildad som båtbyggare eller finsnickare och har känsla för kvalité och har yrkesstolthet.\n\nDu kommer att ingå i ett team med skickliga båtbyggare som kommer att dela med sig av sina erfarenheter till dig och där samarbete och eget ansvar är nyckeln.\n\nHallberg-Rassy månar om sina kunder och det är därför viktigt att du har leveransförståelse och är serviceorienterad. De månar också om sina anställda och har förutom generöst friskvårdsbidrag även naprapat som kommer till varvet.\n\nMed lyhördhet och öppet sinne kommer du få en bra start med dina nya kollegor och Hallberg-Rassys verksamhet.\r\n\r\nFör att lyckas i denna tjänst har du cirka 5 års erfarenhet av liknande arbetsuppgifter och du bor med pendlingsavstånd eller är villig att flytta till, eller nära, Orust.\n\nVi söker dig som har träbakgrund och arbetat som inredningssnickare, möbelsnickare, båtbyggare eller jämförbart.\n\nDu har:\n\nHög kvalitetsnivå och yrkesmässig kompetens, en leveransförståelse samt är nyfiken och tycker om att arbeta på nya sätt utanför din bekvämlighetszon. Du har även lätt för att samarbeta med alla typer av människor.\n\nTalar svenska och gärna viss förståelse för engelska\n\n \n\nKvalifikationer:\n\n • Vana att arbeta med båtar\n • Vana att arbeta på varv\n • Talat flytande Svenska och Engelska\n\n \nDet sägs att det alltid går att känna igen en Hallberg-Rassy oavsett ålder på båten och det stämmer!\nVälkommen att söka tjänsten redan idag.\n \n \nDenna rekrytering sköts av Marinkraft - specialiserad på maritima proffs.\nSökord: fartyg, passagerarfartyg, Motormekaniker, drev, mekaniker, marinmekaniker, marintekniker, tekniker, marin, varvsarbetare, varvsmekaniker, tungmekaniker, hydraultekniker, marinhydraulik, marina projekt, båtar, fordonsmekaniker, vattenjet, slagvattenfilter, styrsystem, örlogsfartyg, kustbevakningen, internationella rederier, privata rederier.",
        "conditions" : "Heltid\r\nTjänsten omfattar heltidsarbete på dagtid, vid vårt varv beläget i Ellös på Orust.",
        "text" : "Finsnickare till Hallberg-Rassy\n\nAnrika och välrenommerade Hallberg-Rassy söker dig som vill arbeta med kvalitet.\n\nPå Hallberg-Rassy jobbar du i ett kunnigt team där leveransnivån är hög. Det är därför viktigt att du har lätt för att samarbeta och kan ta till dig av nya metoder samt kunna arbeta självständigt och vara öppen för lösningar.\n\nDu kommer att vara med och bygga träinredningen till Hallberg-Rassys hypermoderna segelbåtar utifrån framtagna beredningsunderlag.\n\nFör att lyckas i rollen behöver du kunna läsa ritningar eller förstå muntlig genomgång samt gärna ha erfarenhet från liknade arbetsuppgifter i båtar. Du är yrkesutbildad som båtbyggare eller finsnickare och har känsla för kvalité och har yrkesstolthet.\n\nDu kommer att ingå i ett team med skickliga båtbyggare som kommer att dela med sig av sina erfarenheter till dig och där samarbete och eget ansvar är nyckeln.\n\nHallberg-Rassy månar om sina kunder och det är därför viktigt att du har leveransförståelse och är serviceorienterad. De månar också om sina anställda och har förutom generöst friskvårdsbidrag även naprapat som kommer till varvet.\n\nMed lyhördhet och öppet sinne kommer du få en bra start med dina nya kollegor och Hallberg-Rassys verksamhet.\r\n\r\nFör att lyckas i denna tjänst har du cirka 5 års erfarenhet av liknande arbetsuppgifter och du bor med pendlingsavstånd eller är villig att flytta till, eller nära, Orust.\n\nVi söker dig som har träbakgrund och arbetat som inredningssnickare, möbelsnickare, båtbyggare eller jämförbart.\n\nDu har:\n\nHög kvalitetsnivå och yrkesmässig kompetens, en leveransförståelse samt är nyfiken och tycker om att arbeta på nya sätt utanför din bekvämlighetszon. Du har även lätt för att samarbeta med alla typer av människor.\n\nTalar svenska och gärna viss förståelse för engelska\n\n \n\nKvalifikationer:\n\n • Vana att arbeta med båtar\n • Vana att arbeta på varv\n • Talat flytande Svenska och Engelska\n\n \nDet sägs att det alltid går att känna igen en Hallberg-Rassy oavsett ålder på båten och det stämmer!\nVälkommen att söka tjänsten redan idag.\n \n \nDenna rekrytering sköts av Marinkraft - specialiserad på maritima proffs.\nSökord: fartyg, passagerarfartyg, Motormekaniker, drev, mekaniker, marinmekaniker, marintekniker, tekniker, marin, varvsarbetare, varvsmekaniker, tungmekaniker, hydraultekniker, marinhydraulik, marina projekt, båtar, fordonsmekaniker, vattenjet, slagvattenfilter, styrsystem, örlogsfartyg, kustbevakningen, internationella rederier, privata rederier."
      },
      "headline" : "Finsnickare till Hallberg-Rassy",
      "driving_license" : null,
      "employer" : {
        "email" : null,
        "phone_number" : null,
        "organization_number" : "5569759078",
        "name" : "Marinkraft Bemanning Sverige AB",
        "url" : "https://marinkraft.se/",
        "workplace" : "Marinkraft Bemanning Sverige AB"
      },
      "removed_date" : null,
      "logo_url" : null,
      "last_publication_date" : "2022-09-30T23:59:59",
      "number_of_vacancies" : 1,
      "occupation" : {
        "concept_id" : "cyCt_LLE_qDy",
        "label" : "Inredningssnickare/Specialsnickare",
        "legacy_ams_taxonomy_id" : "5812"
      },
      "occupation_group" : {
        "concept_id" : "1Nwn_GYH_wkH",
        "label" : "Fin-, inrednings- och möbelsnickare",
        "legacy_ams_taxonomy_id" : "7522"
      },
      "employment_type" : {
        "concept_id" : "PFZr_Syz_cUq",
        "label" : "Vanlig anställning",
        "legacy_ams_taxonomy_id" : "1"
      },
      "webpage_url" : "https://arbetsformedlingen.se/platsbanken/annonser/26370039",
      "driving_license_required" : false,
      "application_contacts" : [ {
        "description" : "Anna Harling",
        "email" : null,
        "telephone" : "0735192232",
        "name" : null,
        "contact_type" : "Rekryterare"
      } ],
      "duration" : {
        "concept_id" : "a7uU_j21_mkL",
        "label" : "Tills vidare",
        "legacy_ams_taxonomy_id" : "1"
      },
      "nice_to_have" : {
        "education_level" : [ ],
        "work_experiences" : [ ],
        "skills" : [ ],
        "education" : [ ],
        "languages" : [ ]
      },
      "application_details" : {
        "via_af" : false,
        "email" : null,
        "other" : null,
        "reference" : null,
        "url" : "https://marinkraft.zerolime.se/show.aspx?src=AMS&id=7B459541-4DC3-4BF7-8463-9E0DED76AFDB",
        "information" : null
      },
      "source_type" : "VIA_PLATSBANKEN_DXA",
      "application_deadline" : "2022-09-30T23:59:59",
      "external_id" : "46-556975-9078-0000000069E52FB763",
      "workplace_address" : {
        "coordinates" : [ 11.606919, 58.18664 ],
        "city" : null,
        "postcode" : null,
        "municipality" : "Orust",
        "region_concept_id" : "zdoY_6u5_Krt",
        "region" : "Västra Götalands län",
        "country_code" : "199",
        "region_code" : "14",
        "municipality_concept_id" : "tmAp_ykH_N6k",
        "country_concept_id" : "i46j_HmG_v64",
        "municipality_code" : "1421",
        "street_address" : null,
        "country" : "Sverige"
      },
      "id" : "26370039",
      "experience_required" : true,
      "working_hours_type" : {
        "concept_id" : "6YE1_gAC_R2G",
        "label" : "Heltid",
        "legacy_ams_taxonomy_id" : "1"
      },
      "access" : null,
      "timestamp" : 1659422343598,
      "must_have" : {
        "education_level" : [ ],
        "work_experiences" : [ {
          "concept_id" : "cyCt_LLE_qDy",
          "weight" : 10,
          "label" : "Inredningssnickare/Specialsnickare",
          "legacy_ams_taxonomy_id" : "5812"
        } ],
        "skills" : [ ],
        "education" : [ ],
        "languages" : [ ]
      },
      "occupation_field" : {
        "concept_id" : "PaxQ_o1G_wWH",
        "label" : "Hantverk",
        "legacy_ams_taxonomy_id" : "6"
      },
      "scope_of_work" : {
        "min" : 100,
        "max" : 100
      },
      "salary_type" : {
        "concept_id" : "oG8G_9cW_nRf",
        "label" : "Fast månads- vecko- eller timlön",
        "legacy_ams_taxonomy_id" : "1"
      },
      "removed" : false,
      "salary_description" : "Fast lön plus ackord 63timmar arbetstidsförkortning Flexibel arbetstid Friskvårdsbidrag Naprapat på arbetsplatsen Kollektivavtal Fackförbund: tms ",
      "access_to_own_car" : false,
      "publication_date" : "2022-08-02T08:39:03"
    },
    "name" : "Finsnickare till Hallberg-Rassy",
    "user" : "hannes"
  },
  "sha1" : "52bbbefa4601c31531a9157314c135fa6134eda9",
  "annotations" : [ {
    "preferred-label" : "Snickare",
    "type" : "keyword",
    "start-position" : 3,
    "end-position" : 11,
    "concept-id" : "ZoAs_CLH_cmJ",
    "matched-string" : "snickare",
    "annotation-id" : 14
  }, {
    "preferred-label" : "Snickare",
    "type" : "keyword",
    "start-position" : 35,
    "end-position" : 43,
    "concept-id" : "ZoAs_CLH_cmJ",
    "matched-string" : "snickare",
    "annotation-id" : 15
  }, {
    "preferred-label" : "arbeta självständigt",
    "type" : "esco-skill",
    "start-position" : 322,
    "end-position" : 342,
    "concept-id" : "NyFu_HHd_zhz",
    "matched-string" : "arbeta självständigt",
    "annotation-id" : 16
  }, {
    "preferred-label" : "Båtbyggare",
    "sentiment" : "MUST_HAVE",
    "type" : "occupation-name",
    "start-position" : 680,
    "end-position" : 690,
    "concept-id" : "kBdt_K9U_vgC",
    "matched-string" : "båtbyggare",
    "annotation-id" : 0
  }, {
    "preferred-label" : "Snickare",
    "type" : "keyword",
    "start-position" : 697,
    "end-position" : 708,
    "concept-id" : "ZoAs_CLH_cmJ",
    "matched-string" : "finsnickare",
    "annotation-id" : 17
  }, {
    "preferred-label" : "Båtbyggare",
    "sentiment" : "MUST_HAVE",
    "type" : "occupation-name",
    "start-position" : 804,
    "end-position" : 814,
    "concept-id" : "kBdt_K9U_vgC",
    "matched-string" : "båtbyggare",
    "annotation-id" : 1
  }, {
    "preferred-label" : "Naprapat",
    "sentiment" : "MUST_HAVE",
    "type" : "occupation-name",
    "start-position" : 1118,
    "end-position" : 1126,
    "concept-id" : "3EeV_kzS_zag",
    "matched-string" : "naprapat",
    "annotation-id" : 2
  }, {
    "preferred-label" : "5 års erfarenhet eller mer",
    "type" : "occupation-experience-year",
    "start-position" : 1308,
    "end-position" : 1324,
    "concept-id" : "8CVf_zRX_aZj",
    "matched-string" : "5 års erfarenhet",
    "annotation-id" : 18
  }, {
    "preferred-label" : "Inredningssnickare/Specialsnickare",
    "sentiment" : "MUST_HAVE",
    "type" : "occupation-name",
    "start-position" : 1487,
    "end-position" : 1505,
    "concept-id" : "cyCt_LLE_qDy",
    "matched-string" : "inredningssnickare",
    "annotation-id" : 3
  }, {
    "preferred-label" : "Möbelsnickare",
    "sentiment" : "MUST_HAVE",
    "type" : "occupation-name",
    "start-position" : 1507,
    "end-position" : 1520,
    "concept-id" : "EVMd_5ES_dRT",
    "matched-string" : "möbelsnickare",
    "annotation-id" : 4
  }, {
    "preferred-label" : "Båtbyggare",
    "sentiment" : "MUST_HAVE",
    "type" : "occupation-name",
    "start-position" : 1522,
    "end-position" : 1532,
    "concept-id" : "kBdt_K9U_vgC",
    "matched-string" : "båtbyggare",
    "annotation-id" : 5
  }, {
    "preferred-label" : "Svenska",
    "sentiment" : "MUST_HAVE",
    "type" : "language",
    "start-position" : 1782,
    "end-position" : 1789,
    "concept-id" : "zSLA_vw2_FXN",
    "matched-string" : "svenska",
    "annotation-id" : 6
  }, {
    "preferred-label" : "Engelska",
    "sentiment" : "MUST_HAVE",
    "type" : "language",
    "start-position" : 1820,
    "end-position" : 1828,
    "concept-id" : "NVxJ_hLg_TYS",
    "matched-string" : "engelska",
    "annotation-id" : 7
  }, {
    "preferred-label" : "Svenska",
    "sentiment" : "MUST_HAVE",
    "type" : "language",
    "start-position" : 1925,
    "end-position" : 1932,
    "concept-id" : "zSLA_vw2_FXN",
    "matched-string" : "svenska",
    "annotation-id" : 8
  }, {
    "preferred-label" : "Engelska",
    "sentiment" : "MUST_HAVE",
    "type" : "language",
    "start-position" : 1937,
    "end-position" : 1945,
    "concept-id" : "NVxJ_hLg_TYS",
    "matched-string" : "engelska",
    "annotation-id" : 9
  }, {
    "preferred-label" : "Fartyg",
    "sentiment" : "MUST_HAVE",
    "type" : "keyword",
    "start-position" : 2176,
    "end-position" : 2182,
    "concept-id" : "dRFw_Rcu_dX7",
    "matched-string" : "fartyg",
    "annotation-id" : 10
  }, {
    "preferred-label" : "Passagerarfartyg",
    "sentiment" : "MUST_HAVE",
    "type" : "skill",
    "start-position" : 2184,
    "end-position" : 2200,
    "concept-id" : "M4ei_Uvu_Ks7",
    "matched-string" : "passagerarfartyg",
    "annotation-id" : 11
  }, {
    "preferred-label" : "Marinmekaniker/Marintekniker",
    "type" : "occupation-name",
    "start-position" : 2235,
    "end-position" : 2249,
    "concept-id" : "M6Yt_ynM_FDQ",
    "matched-string" : "marinmekaniker",
    "annotation-id" : 19
  }, {
    "preferred-label" : "Marinmekaniker/Marintekniker",
    "sentiment" : "MUST_HAVE",
    "type" : "occupation-name",
    "start-position" : 2251,
    "end-position" : 2264,
    "concept-id" : "M6Yt_ynM_FDQ",
    "matched-string" : "marintekniker",
    "annotation-id" : 12
  }, {
    "preferred-label" : "Varvsarbetare",
    "sentiment" : "MUST_HAVE",
    "type" : "keyword",
    "start-position" : 2283,
    "end-position" : 2296,
    "concept-id" : "NvyA_mwS_eB3",
    "matched-string" : "varvsarbetare",
    "annotation-id" : 13
  }, {
    "preferred-label" : "hydraultekniker",
    "type" : "esco-occupation",
    "start-position" : 2329,
    "end-position" : 2344,
    "concept-id" : "n8vC_84F_4rN",
    "matched-string" : "hydraultekniker",
    "annotation-id" : 20
  } ],
  "text" : "Finsnickare till Hallberg-Rassy\nFinsnickare till Hallberg-Rassy\n\nAnrika och välrenommerade Hallberg-Rassy söker dig som vill arbeta med kvalitet.\n\nPå Hallberg-Rassy jobbar du i ett kunnigt team där leveransnivån är hög. Det är därför viktigt att du har lätt för att samarbeta och kan ta till dig av nya metoder samt kunna arbeta självständigt och vara öppen för lösningar.\n\nDu kommer att vara med och bygga träinredningen till Hallberg-Rassys hypermoderna segelbåtar utifrån framtagna beredningsunderlag.\n\nFör att lyckas i rollen behöver du kunna läsa ritningar eller förstå muntlig genomgång samt gärna ha erfarenhet från liknade arbetsuppgifter i båtar. Du är yrkesutbildad som båtbyggare eller finsnickare och har känsla för kvalité och har yrkesstolthet.\n\nDu kommer att ingå i ett team med skickliga båtbyggare som kommer att dela med sig av sina erfarenheter till dig och där samarbete och eget ansvar är nyckeln.\n\nHallberg-Rassy månar om sina kunder och det är därför viktigt att du har leveransförståelse och är serviceorienterad. De månar också om sina anställda och har förutom generöst friskvårdsbidrag även naprapat som kommer till varvet.\n\nMed lyhördhet och öppet sinne kommer du få en bra start med dina nya kollegor och Hallberg-Rassys verksamhet.\r\n\r\nFör att lyckas i denna tjänst har du cirka 5 års erfarenhet av liknande arbetsuppgifter och du bor med pendlingsavstånd eller är villig att flytta till, eller nära, Orust.\n\nVi söker dig som har träbakgrund och arbetat som inredningssnickare, möbelsnickare, båtbyggare eller jämförbart.\n\nDu har:\n\nHög kvalitetsnivå och yrkesmässig kompetens, en leveransförståelse samt är nyfiken och tycker om att arbeta på nya sätt utanför din bekvämlighetszon. Du har även lätt för att samarbeta med alla typer av människor.\n\nTalar svenska och gärna viss förståelse för engelska\n\n \n\nKvalifikationer:\n\n • Vana att arbeta med båtar\n • Vana att arbeta på varv\n • Talat flytande Svenska och Engelska\n\n \nDet sägs att det alltid går att känna igen en Hallberg-Rassy oavsett ålder på båten och det stämmer!\nVälkommen att söka tjänsten redan idag.\n \n \nDenna rekrytering sköts av Marinkraft - specialiserad på maritima proffs.\nSökord: fartyg, passagerarfartyg, Motormekaniker, drev, mekaniker, marinmekaniker, marintekniker, tekniker, marin, varvsarbetare, varvsmekaniker, tungmekaniker, hydraultekniker, marinhydraulik, marina projekt, båtar, fordonsmekaniker, vattenjet, slagvattenfilter, styrsystem, örlogsfartyg, kustbevakningen, internationella rederier, privata rederier."
}