{
  "meta" : {
    "dataset-id" : "myh-spreadsheet-2021",
    "type" : "education-description",
    "dataset-document-id" : "YH01575",
    "user" : "kristof.fischer"
  },
  "sha1" : "e71c08294f82e284e9570db4ec150910f22e93ae",
  "annotations" : [ {
    "preferred-label" : null,
    "sentiment" : "MUST_HAVE",
    "type" : "skill",
    "start-position" : 107,
    "end-position" : 146,
    "concept-id" : null,
    "matched-string" : "arbetslivserfarenhet från byggbranschen",
    "annotation-id" : 12
  }, {
    "preferred-label" : "Deltid",
    "sentiment" : "OFFERED",
    "type" : "worktime-extent",
    "start-position" : 333,
    "end-position" : 339,
    "concept-id" : "947z_JGS_Uk2",
    "matched-string" : "deltid",
    "annotation-id" : 13
  }, {
    "preferred-label" : "Arbetsmiljöingenjör",
    "sentiment" : "OFFERED",
    "type" : "occupation-name",
    "start-position" : 471,
    "end-position" : 490,
    "concept-id" : "tKCe_Qpx_Thx",
    "matched-string" : "arbetsmiljöingenjör",
    "annotation-id" : 1
  }, {
    "preferred-label" : "upprätthålla kundrelationer",
    "sentiment" : "OFFERED",
    "type" : "esco-skill",
    "start-position" : 673,
    "end-position" : 698,
    "concept-id" : "LBLP_5VX_s6T",
    "matched-string" : "bygga goda kundrelationer",
    "annotation-id" : 14
  }, {
    "preferred-label" : "Arbetsmiljöingenjör",
    "sentiment" : "OFFERED",
    "type" : "occupation-name",
    "start-position" : 737,
    "end-position" : 756,
    "concept-id" : "tKCe_Qpx_Thx",
    "matched-string" : "arbetsmiljöingenjör",
    "annotation-id" : 3
  }, {
    "preferred-label" : null,
    "sentiment" : "OFFERED",
    "type" : "occupation-name",
    "start-position" : 758,
    "comment" : "finns bara som keyword",
    "end-position" : 779,
    "concept-id" : null,
    "matched-string" : "arbetsmiljösamordnare",
    "annotation-id" : 4
  }, {
    "preferred-label" : null,
    "sentiment" : "OFFERED",
    "type" : "occupation-name",
    "start-position" : 781,
    "end-position" : 801,
    "concept-id" : null,
    "matched-string" : "arbetsmiljökonsulent",
    "annotation-id" : 5
  }, {
    "preferred-label" : "Arbetsmiljöingenjör",
    "sentiment" : "OFFERED",
    "type" : "occupation-name",
    "start-position" : 876,
    "end-position" : 895,
    "concept-id" : "tKCe_Qpx_Thx",
    "matched-string" : "arbetsmiljöingenjör",
    "annotation-id" : 7
  }, {
    "preferred-label" : "terminologi",
    "sentiment" : "OFFERED",
    "type" : "esco-skill",
    "start-position" : 1105,
    "end-position" : 1116,
    "concept-id" : "jddE_6Q2_8L7",
    "matched-string" : "terminologi",
    "annotation-id" : 15
  }, {
    "preferred-label" : null,
    "sentiment" : "OFFERED",
    "type" : "skill",
    "start-position" : 1172,
    "end-position" : 1211,
    "concept-id" : null,
    "matched-string" : "I-mplementera arbetsmiljöverkets regler",
    "annotation-id" : 16
  }, {
    "preferred-label" : null,
    "sentiment" : "OFFERED",
    "type" : "skill",
    "start-position" : 1281,
    "end-position" : 1311,
    "concept-id" : null,
    "matched-string" : "Analysera och tillämpa metoder",
    "annotation-id" : 17
  }, {
    "preferred-label" : "arbetsmiljö",
    "sentiment" : "OFFERED",
    "type" : "esco-skill",
    "start-position" : 1338,
    "end-position" : 1349,
    "concept-id" : "zdQY_QJh_nUH",
    "matched-string" : "arbetsmiljö",
    "annotation-id" : 18
  }, {
    "preferred-label" : "hälsa och säkerhet på arbetsplatsen",
    "sentiment" : "OFFERED",
    "type" : "esco-skill",
    "start-position" : 1419,
    "end-position" : 1461,
    "concept-id" : "rLHE_L5Z_ncP",
    "matched-string" : "skapa god säkerhetskultur i organisationen",
    "annotation-id" : 21
  }, {
    "preferred-label" : "hälsa och säkerhet på arbetsplatsen",
    "sentiment" : "OFFERED",
    "type" : "esco-skill",
    "start-position" : 1481,
    "end-position" : 1496,
    "concept-id" : "rLHE_L5Z_ncP",
    "matched-string" : "säkerhetsarbete",
    "annotation-id" : 20
  }, {
    "preferred-label" : "ansvara för arbetsmiljöfrågor",
    "sentiment" : "OFFERED",
    "type" : "esco-skill",
    "start-position" : 1546,
    "end-position" : 1563,
    "concept-id" : "fNhC_2ti_e4W",
    "matched-string" : "arbetsmiljöarbete",
    "annotation-id" : 22
  }, {
    "preferred-label" : null,
    "sentiment" : "OFFERED",
    "type" : "skill",
    "start-position" : 1615,
    "end-position" : 1667,
    "concept-id" : null,
    "matched-string" : "Analysera kemiska och fysikaliska faktorers påverkan",
    "annotation-id" : 23
  }, {
    "preferred-label" : "se till att företagsverksamhet följer föreskrifter",
    "sentiment" : "OFFERED",
    "type" : "esco-skill",
    "start-position" : 1695,
    "end-position" : 1726,
    "concept-id" : "itzP_HCm_2fJ",
    "matched-string" : "arbetsmiljöverkets föreskrifter",
    "annotation-id" : 24
  }, {
    "preferred-label" : "Risk- och säkerhetsanalyser, arbetsmiljö",
    "sentiment" : "OFFERED",
    "type" : "skill",
    "start-position" : 1781,
    "end-position" : 1818,
    "concept-id" : "L7X3_qqn_RBr",
    "matched-string" : "Analysera brister i arbetsmiljöarbete",
    "annotation-id" : 25
  }, {
    "preferred-label" : "följa hälso- och säkerhetsförfaranden för byggverksamhet",
    "sentiment" : "OFFERED",
    "type" : "esco-skill",
    "start-position" : 1872,
    "end-position" : 1939,
    "concept-id" : "RwQU_oXa_w9v",
    "matched-string" : "Leda systematiskt arbetsmiljö- och säkerhetsarbete inom byggsektorn",
    "annotation-id" : 26
  } ],
  "text" : "Denna yrkeshögskoleutbildning är särskilt anpassad för dig som är intresserad av arbetsmiljöfrågor och har arbetslivserfarenhet från byggbranschen. Under studietiden får du möjlighet att träffa och utbyta erfarenheter med branschfolk bl a vid studiebesök och gästföreläsningar samt förstås under LIA-perioderna.  Efter 4 terminer på deltid har den här utbildningen gett dig en bred kompetens. LIA-lärande i arbete- sker i samarbete med ledande företag inom branschen.    Arbetsmiljöingenjör inom byggsektorn är utbildningen för dig som tycker om problemlösning. Du har ett stort intresse för datorer och nätverk samt har förmåga att vara serviceminded och har lätt för att bygga goda kundrelationer. .    Yrkesbenämningen är exempelvis  arbetsmiljöingenjör, arbetsmiljösamordnare, arbetsmiljökonsulent.    Examen - Efter fullgjord utbildning får du en yrkeshögskoleexamen som Arbetsmiljöingenjör. Examensbeviset styrker din kompetens när det gäller de kunskaper och erfarenheter du förvärvat under utbildningen.    Efter avslutad utbildning ska du ha kompetenser för att     -Förmedla arbetsmiljöarbetets terminologi och förkortningar (HMS, BAS P/U etc) i organisationen  I-mplementera arbetsmiljöverkets regler och föreskrifter om byggnads- och anläggningsarbete i verksamheten  -Analysera och tillämpa metoder i syfte att bedöma fysisk arbetsmiljö och dess olika risker  -Kommunicera och engagera medarbetare för att skapa god säkerhetskultur i organisationen  -Påverka och leda säkerhetsarbete  -Bedriva ett förebyggande, effektivt och säkert arbetsmiljöarbete såväl ur ett fysiskt som psykosocialt perspektiv  -Analysera kemiska och fysikaliska faktorers påverkan på människan  -Se till att arbetsmiljöverkets föreskrifter om organisatorisk och social arbetsmiljö efterföljs  -Analysera brister i arbetsmiljöarbete och utifrån dessa avgöra vilka investeringar krävs  -Leda systematiskt arbetsmiljö- och säkerhetsarbete inom byggsektorn"
}