{
  "meta" : {
    "jobad" : {
      "description" : {
        "requirements" : null,
        "needs" : null,
        "company_information" : null,
        "text_formatted" : "<p>Nu söker vi en duktig medarbetare med bredd i sitt kunnande.</p><p>Vi söker en ny stjärna till vårt team. Är du kanske den vi söker? Du är positiv, social, serviceminded, nyfiken, vill utvecklas och tycker om att arbeta i ett högt tempo då vårt konditori är väldigt välbesökt. Du trivs i att vara en del av ett team, vars gemensamma mål är att skapa den bästa möjliga upplevelsen för våra gäster/kunder.</p><p>Vi är ett väletablerat, mysigt &amp; väldigt trivsamt café/konditori med fantastiska godsaker &amp; vällagad mat. Vi har öppet för frukost, fika, lunch veckans alla dagar.</p><p>Kompetenser och egenskaper som krävs:</p><p>- Stort intresse och passion för branschen. Brinner för att göra det lilla extra för gästen.</p><p>- Håller tider och har hög arbetsvilja &amp; moral</p><p>- Lagspelare och tycker om högt tempo</p><p>- Hantera stressiga situationer.</p><p>Erfarenhet som är meriterande:</p><p>- Tidigare erfarenhet från restaurang, café, fast food, storkök eller likande</p><p>Uppfyller du dessa kriterier &amp; det känns som en intressant arbetsplats för dig så bör vi kanske träffas... Skicka in din ansökan till oss. </p><p>Lön enligt kollektivavtal.</p><p>Tjänsten är på heltid. Varierade arbetstider samt helgarbete kan förekomma. 6 månaders provanställning tillämpas.</p><p>Ansökningarna handläggs löpande och tjänsten kan komma att tillsättas innan ansökningstiden har gått ut.</p><p><em>Mormors Bager startades 1995 i en liten lokal på Botulfsplatsen i centrala Lund. I över tjugofem år har Mormors Bageri arbetar med att baka goda och stora hembakade bröd, kakor och mycket annat gott. Surdegsbröden med de långa jästiderna, mellan 24 timmar och 72 timmar, är något de är mycket stolta och kända för. De varierande sortimentet av surdeg har minst jäst kallt i 24 timmar</em></p><p><em>Mormors Bageri har fyra butiker, som bakar sina egna bakverk, och ett företag/huvudkontor där små och stora beställningar och leveranser sker. En butik finns i Malmö på Spångatan samt tre butiker i Lund; en på Botulfsplatsen, en på Knutgården och en på Gastelyckan (där ligger även huvudkontoret och företaget).</em></p>",
        "conditions" : null,
        "text" : "Nu söker vi en duktig medarbetare med bredd i sitt kunnande.\nVi söker en ny stjärna till vårt team. Är du kanske den vi söker? Du är positiv, social, serviceminded, nyfiken, vill utvecklas och tycker om att arbeta i ett högt tempo då vårt konditori är väldigt välbesökt. Du trivs i att vara en del av ett team, vars gemensamma mål är att skapa den bästa möjliga upplevelsen för våra gäster/kunder.\nVi är ett väletablerat, mysigt & väldigt trivsamt café/konditori med fantastiska godsaker & vällagad mat. Vi har öppet för frukost, fika, lunch veckans alla dagar.\nKompetenser och egenskaper som krävs:\n- Stort intresse och passion för branschen. Brinner för att göra det lilla extra för gästen.\n- Håller tider och har hög arbetsvilja & moral\n- Lagspelare och tycker om högt tempo\n- Hantera stressiga situationer.\nErfarenhet som är meriterande:\n- Tidigare erfarenhet från restaurang, café, fast food, storkök eller likande\nUppfyller du dessa kriterier & det känns som en intressant arbetsplats för dig så bör vi kanske träffas... Skicka in din ansökan till oss. \nLön enligt kollektivavtal.\nTjänsten är på heltid. Varierade arbetstider samt helgarbete kan förekomma. 6 månaders provanställning tillämpas.\nAnsökningarna handläggs löpande och tjänsten kan komma att tillsättas innan ansökningstiden har gått ut.\nMormors Bager startades 1995 i en liten lokal på Botulfsplatsen i centrala Lund. I över tjugofem år har Mormors Bageri arbetar med att baka goda och stora hembakade bröd, kakor och mycket annat gott. Surdegsbröden med de långa jästiderna, mellan 24 timmar och 72 timmar, är något de är mycket stolta och kända för. De varierande sortimentet av surdeg har minst jäst kallt i 24 timmar\nMormors Bageri har fyra butiker, som bakar sina egna bakverk, och ett företag/huvudkontor där små och stora beställningar och leveranser sker. En butik finns i Malmö på Spångatan samt tre butiker i Lund; en på Botulfsplatsen, en på Knutgården och en på Gastelyckan (där ligger även huvudkontoret och företaget)."
      },
      "headline" : "Cafébiträde ",
      "driving_license" : null,
      "employer" : {
        "email" : null,
        "phone_number" : null,
        "organization_number" : "5565388393",
        "name" : "Mormors Bageri AB",
        "url" : "www.mormors.se",
        "workplace" : "Mormors Bageri AB"
      },
      "removed_date" : null,
      "logo_url" : "https://www.arbetsformedlingen.se/rest/arbetsgivare/rest/af/v3/arbetsplatser/81555929/logotyper/logo.png",
      "last_publication_date" : "2022-09-24T23:59:59",
      "number_of_vacancies" : 2,
      "occupation" : {
        "concept_id" : "7K8b_4EE_w5e",
        "label" : "Konditoribiträde",
        "legacy_ams_taxonomy_id" : "2276"
      },
      "occupation_group" : {
        "concept_id" : "1wqU_Jhj_amb",
        "label" : "Kafé- och konditoribiträden",
        "legacy_ams_taxonomy_id" : "9413"
      },
      "employment_type" : {
        "concept_id" : "PFZr_Syz_cUq",
        "label" : "Vanlig anställning",
        "legacy_ams_taxonomy_id" : "1"
      },
      "webpage_url" : "https://arbetsformedlingen.se/platsbanken/annonser/26349516",
      "driving_license_required" : false,
      "application_contacts" : [ {
        "description" : null,
        "email" : "ninni@mormors.se",
        "telephone" : null,
        "name" : "Ninni  Brodin",
        "contact_type" : null
      } ],
      "duration" : {
        "concept_id" : "qQUd_4qe_NDT",
        "label" : "6 månader eller längre",
        "legacy_ams_taxonomy_id" : "2"
      },
      "nice_to_have" : {
        "education_level" : [ ],
        "work_experiences" : [ {
          "concept_id" : "7K8b_4EE_w5e",
          "weight" : 5,
          "label" : "Konditoribiträde",
          "legacy_ams_taxonomy_id" : "2276"
        } ],
        "skills" : [ ],
        "education" : [ ],
        "languages" : [ ]
      },
      "application_details" : {
        "via_af" : false,
        "email" : "jobb@mormor.se",
        "other" : null,
        "reference" : null,
        "url" : null,
        "information" : null
      },
      "source_type" : "VIA_ANNONSERA",
      "application_deadline" : "2022-09-24T23:59:59",
      "external_id" : null,
      "workplace_address" : {
        "coordinates" : [ 13.221233705959461, 55.69503570160511 ],
        "city" : "LUND",
        "postcode" : "22478",
        "municipality" : "Lund",
        "region_concept_id" : "CaRE_1nn_cSU",
        "region" : "Skåne län",
        "country_code" : "199",
        "region_code" : "12",
        "municipality_concept_id" : "muSY_tsR_vDZ",
        "country_concept_id" : "i46j_HmG_v64",
        "municipality_code" : "1281",
        "street_address" : "FÄLTSPATVÄGEN 1 A",
        "country" : "Sverige"
      },
      "id" : "26349516",
      "experience_required" : true,
      "working_hours_type" : {
        "concept_id" : "6YE1_gAC_R2G",
        "label" : "Heltid",
        "legacy_ams_taxonomy_id" : "1"
      },
      "access" : null,
      "timestamp" : 1658705675333,
      "must_have" : {
        "education_level" : [ ],
        "work_experiences" : [ ],
        "skills" : [ ],
        "education" : [ ],
        "languages" : [ ]
      },
      "occupation_field" : {
        "concept_id" : "ScKy_FHB_7wT",
        "label" : "Hotell, restaurang, storhushåll",
        "legacy_ams_taxonomy_id" : "7"
      },
      "scope_of_work" : {
        "min" : 0,
        "max" : 100
      },
      "salary_type" : {
        "concept_id" : "oG8G_9cW_nRf",
        "label" : "Fast månads- vecko- eller timlön",
        "legacy_ams_taxonomy_id" : "1"
      },
      "removed" : false,
      "salary_description" : null,
      "access_to_own_car" : false,
      "publication_date" : "2022-07-25T01:34:35"
    },
    "name" : "Cafébiträde ",
    "user" : "hannes"
  },
  "sha1" : "3ef481ea97950373c4150922c584d656aa8dce8f",
  "annotations" : [ {
    "preferred-label" : "Cafébiträde",
    "sentiment" : "MUST_HAVE",
    "type" : "keyword",
    "start-position" : 0,
    "end-position" : 11,
    "concept-id" : "qZG4_pVE_ZYZ",
    "matched-string" : "cafébiträde",
    "annotation-id" : 0
  }, {
    "preferred-label" : "Café",
    "sentiment" : "MUST_HAVE",
    "type" : "skill",
    "start-position" : 461,
    "end-position" : 465,
    "concept-id" : "f2Nt_4bK_HNX",
    "matched-string" : "café",
    "annotation-id" : 1
  }, {
    "preferred-label" : "Bageri och konditori",
    "type" : "keyword",
    "start-position" : 466,
    "end-position" : 475,
    "concept-id" : "4t2m_4Dj_ksJ",
    "matched-string" : "konditori",
    "annotation-id" : 8
  }, {
    "preferred-label" : "Restaurang",
    "sentiment" : "MUST_HAVE",
    "type" : "keyword",
    "start-position" : 882,
    "end-position" : 892,
    "concept-id" : "o2Cg_3Ap_qvK",
    "matched-string" : "restaurang",
    "annotation-id" : 2
  }, {
    "preferred-label" : "Café",
    "sentiment" : "MUST_HAVE",
    "type" : "skill",
    "start-position" : 894,
    "end-position" : 898,
    "concept-id" : "f2Nt_4bK_HNX",
    "matched-string" : "café",
    "annotation-id" : 3
  }, {
    "preferred-label" : "Fast food",
    "sentiment" : "MUST_HAVE",
    "type" : "skill",
    "start-position" : 900,
    "end-position" : 909,
    "concept-id" : "1Zwa_X6Q_Dyk",
    "matched-string" : "fast food",
    "annotation-id" : 4
  }, {
    "preferred-label" : "Storkök",
    "sentiment" : "MUST_HAVE",
    "type" : "skill",
    "start-position" : 911,
    "end-position" : 918,
    "concept-id" : "GQ9R_2Za_Awt",
    "matched-string" : "storkök",
    "annotation-id" : 5
  }, {
    "preferred-label" : "Kollektivavtal",
    "sentiment" : "MUST_HAVE",
    "type" : "skill",
    "start-position" : 1084,
    "end-position" : 1098,
    "concept-id" : "z7wE_9xb_3jX",
    "matched-string" : "kollektivavtal",
    "annotation-id" : 6
  }, {
    "preferred-label" : "Heltid",
    "type" : "worktime-extent",
    "start-position" : 1115,
    "end-position" : 1121,
    "concept-id" : "6YE1_gAC_R2G",
    "matched-string" : "heltid",
    "annotation-id" : 9
  }, {
    "preferred-label" : "Butik",
    "sentiment" : "MUST_HAVE",
    "type" : "keyword",
    "start-position" : 1849,
    "end-position" : 1854,
    "concept-id" : "xLsd_zjY_5wr",
    "matched-string" : "butik",
    "annotation-id" : 7
  } ],
  "text" : "Cafébiträde \nNu söker vi en duktig medarbetare med bredd i sitt kunnande.\nVi söker en ny stjärna till vårt team. Är du kanske den vi söker? Du är positiv, social, serviceminded, nyfiken, vill utvecklas och tycker om att arbeta i ett högt tempo då vårt konditori är väldigt välbesökt. Du trivs i att vara en del av ett team, vars gemensamma mål är att skapa den bästa möjliga upplevelsen för våra gäster/kunder.\nVi är ett väletablerat, mysigt & väldigt trivsamt café/konditori med fantastiska godsaker & vällagad mat. Vi har öppet för frukost, fika, lunch veckans alla dagar.\nKompetenser och egenskaper som krävs:\n- Stort intresse och passion för branschen. Brinner för att göra det lilla extra för gästen.\n- Håller tider och har hög arbetsvilja & moral\n- Lagspelare och tycker om högt tempo\n- Hantera stressiga situationer.\nErfarenhet som är meriterande:\n- Tidigare erfarenhet från restaurang, café, fast food, storkök eller likande\nUppfyller du dessa kriterier & det känns som en intressant arbetsplats för dig så bör vi kanske träffas... Skicka in din ansökan till oss. \nLön enligt kollektivavtal.\nTjänsten är på heltid. Varierade arbetstider samt helgarbete kan förekomma. 6 månaders provanställning tillämpas.\nAnsökningarna handläggs löpande och tjänsten kan komma att tillsättas innan ansökningstiden har gått ut.\nMormors Bager startades 1995 i en liten lokal på Botulfsplatsen i centrala Lund. I över tjugofem år har Mormors Bageri arbetar med att baka goda och stora hembakade bröd, kakor och mycket annat gott. Surdegsbröden med de långa jästiderna, mellan 24 timmar och 72 timmar, är något de är mycket stolta och kända för. De varierande sortimentet av surdeg har minst jäst kallt i 24 timmar\nMormors Bageri har fyra butiker, som bakar sina egna bakverk, och ett företag/huvudkontor där små och stora beställningar och leveranser sker. En butik finns i Malmö på Spångatan samt tre butiker i Lund; en på Botulfsplatsen, en på Knutgården och en på Gastelyckan (där ligger även huvudkontoret och företaget)."
}