{
  "meta" : {
    "jobad" : {
      "description" : {
        "requirements" : null,
        "needs" : null,
        "company_information" : null,
        "text_formatted" : "<p>Vi söker en bagare 2 till 3 ggr i väckan som är pensionerad.</p><p>Det är bra om du förstår och talar svenska för att kunna kommunicera med gästerna.</p>",
        "conditions" : null,
        "text" : "Vi söker en bagare 2 till 3 ggr i väckan som är pensionerad.\nDet är bra om du förstår och talar svenska för att kunna kommunicera med gästerna."
      },
      "headline" : "Bagare",
      "driving_license" : null,
      "employer" : {
        "email" : null,
        "phone_number" : null,
        "organization_number" : null,
        "name" : "Restaurang Matbiten Josef Romagna",
        "url" : null,
        "workplace" : "Matbiten Josef Romagna, Restaurang"
      },
      "removed_date" : null,
      "logo_url" : null,
      "last_publication_date" : "2022-09-06T00:00:00",
      "number_of_vacancies" : 1,
      "occupation" : {
        "concept_id" : "XugJ_6hw_wVV",
        "label" : "Bagare/Konditor",
        "legacy_ams_taxonomy_id" : "5504"
      },
      "occupation_group" : {
        "concept_id" : "5qT8_z9d_8rw",
        "label" : "Bagare och konditorer",
        "legacy_ams_taxonomy_id" : "7612"
      },
      "employment_type" : {
        "concept_id" : "1paU_aCR_nGn",
        "label" : "Behovsanställning",
        "legacy_ams_taxonomy_id" : "4"
      },
      "webpage_url" : "https://arbetsformedlingen.se/platsbanken/annonser/26382886",
      "driving_license_required" : false,
      "application_contacts" : [ ],
      "duration" : {
        "concept_id" : null,
        "label" : null,
        "legacy_ams_taxonomy_id" : null
      },
      "nice_to_have" : {
        "education_level" : [ ],
        "work_experiences" : [ ],
        "skills" : [ ],
        "education" : [ ],
        "languages" : [ ]
      },
      "application_details" : {
        "via_af" : false,
        "email" : "josefromagna@hotmail.com",
        "other" : null,
        "reference" : null,
        "url" : null,
        "information" : null
      },
      "source_type" : "VIA_ANNONSERA",
      "application_deadline" : "2022-09-06T00:00:00",
      "external_id" : null,
      "workplace_address" : {
        "coordinates" : [ 18.125904520315554, 59.20184700893207 ],
        "city" : "SKOGÅS",
        "postcode" : "14250",
        "municipality" : "Huddinge",
        "region_concept_id" : "CifL_Rzy_Mku",
        "region" : "Stockholms län",
        "country_code" : "199",
        "region_code" : "01",
        "municipality_concept_id" : "g1Gc_aXK_EKu",
        "country_concept_id" : "i46j_HmG_v64",
        "municipality_code" : "0126",
        "street_address" : "SVARVARVÄGEN 6",
        "country" : "Sverige"
      },
      "id" : "26382886",
      "experience_required" : true,
      "working_hours_type" : {
        "concept_id" : null,
        "label" : null,
        "legacy_ams_taxonomy_id" : null
      },
      "access" : null,
      "timestamp" : 1659873690273,
      "must_have" : {
        "education_level" : [ ],
        "work_experiences" : [ {
          "concept_id" : "XugJ_6hw_wVV",
          "weight" : 10,
          "label" : "Bagare/Konditor",
          "legacy_ams_taxonomy_id" : "5504"
        } ],
        "skills" : [ ],
        "education" : [ ],
        "languages" : [ ]
      },
      "occupation_field" : {
        "concept_id" : "PaxQ_o1G_wWH",
        "label" : "Hantverk",
        "legacy_ams_taxonomy_id" : "6"
      },
      "scope_of_work" : {
        "min" : 0,
        "max" : null
      },
      "salary_type" : {
        "concept_id" : "oG8G_9cW_nRf",
        "label" : "Fast månads- vecko- eller timlön",
        "legacy_ams_taxonomy_id" : "1"
      },
      "removed" : false,
      "salary_description" : null,
      "access_to_own_car" : false,
      "publication_date" : "2022-08-07T14:01:30"
    },
    "name" : "Bagare",
    "user" : "hannes"
  },
  "sha1" : "6c3a39c62293a378fed6720e47a684701552fda3",
  "annotations" : [ {
    "preferred-label" : "bagare",
    "sentiment" : "MUST_HAVE",
    "type" : "esco-occupation",
    "start-position" : 0,
    "end-position" : 6,
    "concept-id" : "Zo8A_5ML_j3t",
    "matched-string" : "bagare",
    "annotation-id" : 0
  }, {
    "preferred-label" : "bagare",
    "sentiment" : "MUST_HAVE",
    "type" : "esco-occupation",
    "start-position" : 19,
    "end-position" : 25,
    "concept-id" : "Zo8A_5ML_j3t",
    "matched-string" : "bagare",
    "annotation-id" : 1
  }, {
    "preferred-label" : "Deltid",
    "type" : "worktime-extent",
    "start-position" : 26,
    "end-position" : 47,
    "concept-id" : "947z_JGS_Uk2",
    "matched-string" : "2 till 3 ggr i väckan",
    "annotation-id" : 3
  }, {
    "preferred-label" : "Svenska",
    "sentiment" : "MUST_HAVE",
    "type" : "language",
    "start-position" : 103,
    "end-position" : 110,
    "concept-id" : "zSLA_vw2_FXN",
    "matched-string" : "svenska",
    "annotation-id" : 2
  } ],
  "text" : "Bagare\nVi söker en bagare 2 till 3 ggr i väckan som är pensionerad.\nDet är bra om du förstår och talar svenska för att kunna kommunicera med gästerna."
}