{
  "meta" : {
    "jobad" : {
      "description" : {
        "requirements" : null,
        "needs" : null,
        "company_information" : null,
        "text_formatted" : "<p>Vi behöver förstärka med en duktig kock för kvällar och helger!</p><p>Restaurangen hos oss är öppen kvällstid när vi har gruppbokningar. Det varierar mycket vad som ska serveras, allt från en enkel varmrätt som inte bordsserveras, till två- eller trerättersmiddagar. Vi har inte à la carte, utan en fast meny för hela gruppen (men självklart med alternativ för eventuella allergier osv). Det kan också vara aktuellt med helger, dels luncher men också middagar. Antal kvällar varierar  mycket, men är du rätt person och vill jobba så kan vi i så fall komma överens om jobb även dagtid de veckor det är tunt med kvällar. Vi kan  förhandla om tiderna så kom gärna med din ansökan oavsett om du vill ha deltid eller heltid. Start omgående med avslut efter november, för rätt person finns stora möjligheter till förlängning.</p><p>Du behöver vara självgående och kunna hantera både storkök och finlir. Vi lägger stor vikt vid att du håller rent och snyggt i köket.</p><p>Du behöver ha körkort, då vi ligger några kilometer från närmaste pendeltågsstation.</p><p>Känner du igen dig? Maila oss omgående så vi kan träffas och diskutera mer :-)!</p>",
        "conditions" : null,
        "text" : "Vi behöver förstärka med en duktig kock för kvällar och helger!\nRestaurangen hos oss är öppen kvällstid när vi har gruppbokningar. Det varierar mycket vad som ska serveras, allt från en enkel varmrätt som inte bordsserveras, till två- eller trerättersmiddagar. Vi har inte à la carte, utan en fast meny för hela gruppen (men självklart med alternativ för eventuella allergier osv). Det kan också vara aktuellt med helger, dels luncher men också middagar. Antal kvällar varierar  mycket, men är du rätt person och vill jobba så kan vi i så fall komma överens om jobb även dagtid de veckor det är tunt med kvällar. Vi kan  förhandla om tiderna så kom gärna med din ansökan oavsett om du vill ha deltid eller heltid. Start omgående med avslut efter november, för rätt person finns stora möjligheter till förlängning.\nDu behöver vara självgående och kunna hantera både storkök och finlir. Vi lägger stor vikt vid att du håller rent och snyggt i köket.\nDu behöver ha körkort, då vi ligger några kilometer från närmaste pendeltågsstation.\nKänner du igen dig? Maila oss omgående så vi kan träffas och diskutera mer :-)!"
      },
      "headline" : "Kvällskock",
      "driving_license" : [ {
        "concept_id" : "VTK8_WRx_GcM",
        "label" : "B",
        "legacy_ams_taxonomy_id" : "3"
      } ],
      "employer" : {
        "email" : null,
        "phone_number" : null,
        "organization_number" : "5567654552",
        "name" : "Tre Rosor Pensionat & Konferens AB",
        "url" : null,
        "workplace" : "TRE ROSOR PENSIONAT & KONFERENS AB"
      },
      "removed_date" : null,
      "logo_url" : null,
      "last_publication_date" : "2022-09-05T23:59:59",
      "number_of_vacancies" : 1,
      "occupation" : {
        "concept_id" : "JbJw_as4_S93",
        "label" : "Kock, à la carte",
        "legacy_ams_taxonomy_id" : "7663"
      },
      "occupation_group" : {
        "concept_id" : "BStc_SJh_DKG",
        "label" : "Kockar och kallskänkor",
        "legacy_ams_taxonomy_id" : "5120"
      },
      "employment_type" : {
        "concept_id" : "PFZr_Syz_cUq",
        "label" : "Vanlig anställning",
        "legacy_ams_taxonomy_id" : "1"
      },
      "webpage_url" : "https://arbetsformedlingen.se/platsbanken/annonser/26430535",
      "driving_license_required" : true,
      "application_contacts" : [ {
        "description" : null,
        "email" : "info@trerosor.se",
        "telephone" : "0859035591",
        "name" : "Lasse Centervik",
        "contact_type" : null
      } ],
      "duration" : {
        "concept_id" : "Xj7x_7yZ_jEn",
        "label" : "3 månader – upp till 6 månader",
        "legacy_ams_taxonomy_id" : "3"
      },
      "nice_to_have" : {
        "education_level" : [ ],
        "work_experiences" : [ ],
        "skills" : [ ],
        "education" : [ ],
        "languages" : [ {
          "concept_id" : "NVxJ_hLg_TYS",
          "weight" : 5,
          "label" : "Engelska",
          "legacy_ams_taxonomy_id" : "283"
        } ]
      },
      "application_details" : {
        "via_af" : false,
        "email" : "info@trerosor.se",
        "other" : null,
        "reference" : null,
        "url" : null,
        "information" : null
      },
      "source_type" : "VIA_ANNONSERA",
      "application_deadline" : "2022-09-05T23:59:59",
      "external_id" : null,
      "workplace_address" : {
        "coordinates" : [ 17.852598130559624, 59.57459274814621 ],
        "city" : "ROSERSBERG",
        "postcode" : "19595",
        "municipality" : "Sigtuna",
        "region_concept_id" : "CifL_Rzy_Mku",
        "region" : "Stockholms län",
        "country_code" : "199",
        "region_code" : "01",
        "municipality_concept_id" : "8ryy_X54_xJj",
        "country_concept_id" : "i46j_HmG_v64",
        "municipality_code" : "0191",
        "street_address" : "TRE ROSORS VÄG 131",
        "country" : "Sverige"
      },
      "id" : "26430535",
      "experience_required" : true,
      "working_hours_type" : {
        "concept_id" : "947z_JGS_Uk2",
        "label" : "Deltid",
        "legacy_ams_taxonomy_id" : "2"
      },
      "access" : null,
      "timestamp" : 1660901560272,
      "must_have" : {
        "education_level" : [ ],
        "work_experiences" : [ {
          "concept_id" : "JbJw_as4_S93",
          "weight" : 10,
          "label" : "Kock, à la carte",
          "legacy_ams_taxonomy_id" : "7663"
        } ],
        "skills" : [ ],
        "education" : [ ],
        "languages" : [ {
          "concept_id" : "zSLA_vw2_FXN",
          "weight" : 10,
          "label" : "Svenska",
          "legacy_ams_taxonomy_id" : "502"
        } ]
      },
      "occupation_field" : {
        "concept_id" : "ScKy_FHB_7wT",
        "label" : "Hotell, restaurang, storhushåll",
        "legacy_ams_taxonomy_id" : "7"
      },
      "scope_of_work" : {
        "min" : 0,
        "max" : 100
      },
      "salary_type" : {
        "concept_id" : "oG8G_9cW_nRf",
        "label" : "Fast månads- vecko- eller timlön",
        "legacy_ams_taxonomy_id" : "1"
      },
      "removed" : false,
      "salary_description" : null,
      "access_to_own_car" : true,
      "publication_date" : "2022-08-19T11:32:40"
    },
    "name" : "Kvällskock",
    "user" : "hannes"
  },
  "sha1" : "2567fe37a9e9375831e1c958f8c4365d3efd8261",
  "annotations" : [ {
    "preferred-label" : "Kock, à la carte",
    "sentiment" : "MUST_HAVE",
    "type" : "occupation-name",
    "start-position" : 0,
    "end-position" : 10,
    "concept-id" : "JbJw_as4_S93",
    "matched-string" : "Kvällskock",
    "annotation-id" : 2
  }, {
    "preferred-label" : "Kock, à la carte",
    "sentiment" : "MUST_HAVE",
    "type" : "occupation-name",
    "start-position" : 46,
    "end-position" : 50,
    "concept-id" : "JbJw_as4_S93",
    "matched-string" : "kock",
    "annotation-id" : 0
  }, {
    "preferred-label" : "Storkök",
    "sentiment" : "NOT_RELEVANT",
    "type" : "skill",
    "start-position" : 876,
    "end-position" : 883,
    "concept-id" : "GQ9R_2Za_Awt",
    "matched-string" : "storkök",
    "annotation-id" : 1
  }, {
    "preferred-label" : "körkort",
    "sentiment" : "MUST_HAVE",
    "type" : "esco-skill",
    "start-position" : 973,
    "end-position" : 980,
    "concept-id" : "UvDr_eNo_HSQ",
    "matched-string" : "körkort",
    "annotation-id" : 3
  } ],
  "text" : "Kvällskock\nVi behöver förstärka med en duktig kock för kvällar och helger!\nRestaurangen hos oss är öppen kvällstid när vi har gruppbokningar. Det varierar mycket vad som ska serveras, allt från en enkel varmrätt som inte bordsserveras, till två- eller trerättersmiddagar. Vi har inte à la carte, utan en fast meny för hela gruppen (men självklart med alternativ för eventuella allergier osv). Det kan också vara aktuellt med helger, dels luncher men också middagar. Antal kvällar varierar  mycket, men är du rätt person och vill jobba så kan vi i så fall komma överens om jobb även dagtid de veckor det är tunt med kvällar. Vi kan  förhandla om tiderna så kom gärna med din ansökan oavsett om du vill ha deltid eller heltid. Start omgående med avslut efter november, för rätt person finns stora möjligheter till förlängning.\nDu behöver vara självgående och kunna hantera både storkök och finlir. Vi lägger stor vikt vid att du håller rent och snyggt i köket.\nDu behöver ha körkort, då vi ligger några kilometer från närmaste pendeltågsstation.\nKänner du igen dig? Maila oss omgående så vi kan träffas och diskutera mer :-)!"
}