{
  "meta" : {
    "jobad" : {
      "description" : {
        "requirements" : null,
        "needs" : null,
        "company_information" : null,
        "text_formatted" : "Färgelanda kommun\n\nFärgelanda kommun är en kommun i sydvästra Dalsland med en stor arbetsmarknad inpå knuten. I kommunen bor ca 6 600 invånare och erbjuder en rik mångfald av möjligheter, en vacker natur med glittrande sjöar och orörd vildmark, där du kan utöva ett aktivt friluftsliv.\n\n\nKommunen som organisation består av ca 500 medarbetare fördelat på tre sektorer; Omsorg, Barn &amp;amp; Utbildning, Samhällsutveckling samt en gemensam stab. Tillsammans arbetar vi för att uppnå vår vision om en trygg kommun med tillväxt och livskraft. Detta arbete utför vi med engagemang - företagsamhet - och ett gott bemötande, som är vår värdegrund!\n\n\n\r\n\r\nFärgelanda kommun\nFärgelanda kommun är en kommun i sydvästra Dalsland med en stor arbetsmarknad inpå knuten.\r\n\r\nI kommunen bor ca 6 600 invånare och erbjuder en rik mångfald av möjligheter, en vacker natur med glittrande sjöar och orörd vildmark, där du kan utöva ett aktivt friluftsliv.\n\nKommunen som organisation består av ca 500 medarbetare fördelat på två sektorer; Omsorg och Barn & Utbildning, en Samhällsutvecklingsavdelning samt en gemensam stab. Tillsammans arbetar vi för att uppnå vår vision om en trygg kommun med tillväxt och livskraft. Detta arbete utför vi med engagemang - företagsamhet - och ett gott bemötande, som är vår värdegrund!\n\nArbetsuppgifter\nSom kock kommer du att ansvara för att planera, förbereda och tillaga måltider (frukost, lunch och kvällsmål), samt specialkost till våra boende, ute på avdelningsköken. Samt andra förekommande arbetsuppgifter i ett kök som bl a varumottagning, egenkontrollsarbete, servering, disk- och städarbete. Vi strävar efter att tillaga så mycket som möjligt från grunden.\n\nKvalifikationer\nVi ser att du har dokumenterad kockutbildning eller storhushållningsutbildning som arbetsgivaren bedömer likvärdig. Tidigare erfarenheter inom kök och restaurang är meriterande likväl utbildning inom HACCP. Du har kunskaper inom specialkost och egenkontroll.\n\nDu drivs av ett genuint intresse för mat och hälsa och känner glädje av att leverera näringsriktig och vällagad mat till våra boende.\n\nSom person har du god kommunikativ förmåga, är noggrann, flexibel, engagerad och stresstålig. Du tar ansvar för din uppgift och är bra på att organisera och planera ditt arbete.\n\nDu har god förmåga att kunna uttrycka dig i det svenska språket, så väl muntligt som skriftligt.\n\nVi kommer att lägga stor vikt vid personlig lämplighet. \n\nÖvrigt\nVi undanber oss vänligt men bestämt direktkontakt med bemannings- och rekryteringsföretag samt försäljare av ytterligare jobbannonser.\n\nVi tillämpar löpande urval, så ansök redan idag.",
        "conditions" : "75 %. Tillträde: 2022-10-01 eller enligt överenskommelse\r\nTillsvidareanställning",
        "text" : "Färgelanda kommun\n\nFärgelanda kommun är en kommun i sydvästra Dalsland med en stor arbetsmarknad inpå knuten. I kommunen bor ca 6 600 invånare och erbjuder en rik mångfald av möjligheter, en vacker natur med glittrande sjöar och orörd vildmark, där du kan utöva ett aktivt friluftsliv.\n\n\nKommunen som organisation består av ca 500 medarbetare fördelat på tre sektorer; Omsorg, Barn &amp; Utbildning, Samhällsutveckling samt en gemensam stab. Tillsammans arbetar vi för att uppnå vår vision om en trygg kommun med tillväxt och livskraft. Detta arbete utför vi med engagemang - företagsamhet - och ett gott bemötande, som är vår värdegrund!\n\n\n\r\n\r\nFärgelanda kommun\nFärgelanda kommun är en kommun i sydvästra Dalsland med en stor arbetsmarknad inpå knuten.\r\n\r\nI kommunen bor ca 6 600 invånare och erbjuder en rik mångfald av möjligheter, en vacker natur med glittrande sjöar och orörd vildmark, där du kan utöva ett aktivt friluftsliv.\n\nKommunen som organisation består av ca 500 medarbetare fördelat på två sektorer; Omsorg och Barn & Utbildning, en Samhällsutvecklingsavdelning samt en gemensam stab. Tillsammans arbetar vi för att uppnå vår vision om en trygg kommun med tillväxt och livskraft. Detta arbete utför vi med engagemang - företagsamhet - och ett gott bemötande, som är vår värdegrund!\n\nArbetsuppgifter\nSom kock kommer du att ansvara för att planera, förbereda och tillaga måltider (frukost, lunch och kvällsmål), samt specialkost till våra boende, ute på avdelningsköken. Samt andra förekommande arbetsuppgifter i ett kök som bl a varumottagning, egenkontrollsarbete, servering, disk- och städarbete. Vi strävar efter att tillaga så mycket som möjligt från grunden.\n\nKvalifikationer\nVi ser att du har dokumenterad kockutbildning eller storhushållningsutbildning som arbetsgivaren bedömer likvärdig. Tidigare erfarenheter inom kök och restaurang är meriterande likväl utbildning inom HACCP. Du har kunskaper inom specialkost och egenkontroll.\n\nDu drivs av ett genuint intresse för mat och hälsa och känner glädje av att leverera näringsriktig och vällagad mat till våra boende.\n\nSom person har du god kommunikativ förmåga, är noggrann, flexibel, engagerad och stresstålig. Du tar ansvar för din uppgift och är bra på att organisera och planera ditt arbete.\n\nDu har god förmåga att kunna uttrycka dig i det svenska språket, så väl muntligt som skriftligt.\n\nVi kommer att lägga stor vikt vid personlig lämplighet. \n\nÖvrigt\nVi undanber oss vänligt men bestämt direktkontakt med bemannings- och rekryteringsföretag samt försäljare av ytterligare jobbannonser.\n\nVi tillämpar löpande urval, så ansök redan idag."
      },
      "headline" : "Kock 75 % Håvestensgården",
      "driving_license" : null,
      "employer" : {
        "email" : null,
        "phone_number" : null,
        "organization_number" : "2120001421",
        "name" : "Färgelanda kommun",
        "url" : null,
        "workplace" : "Färgelanda kommun"
      },
      "removed_date" : null,
      "logo_url" : "https://www.arbetsformedlingen.se/rest/arbetsgivare/rest/af/v3/organisation/2120001421/logotyper/logo.png",
      "last_publication_date" : "2022-09-18T23:59:59",
      "number_of_vacancies" : 1,
      "occupation" : {
        "concept_id" : "Vg3d_Azf_p5Y",
        "label" : "Kock, storhushåll",
        "legacy_ams_taxonomy_id" : "7664"
      },
      "occupation_group" : {
        "concept_id" : "BStc_SJh_DKG",
        "label" : "Kockar och kallskänkor",
        "legacy_ams_taxonomy_id" : "5120"
      },
      "employment_type" : {
        "concept_id" : "PFZr_Syz_cUq",
        "label" : "Vanlig anställning",
        "legacy_ams_taxonomy_id" : "1"
      },
      "webpage_url" : "https://arbetsformedlingen.se/platsbanken/annonser/26428733",
      "driving_license_required" : false,
      "application_contacts" : [ {
        "description" : "Malin Eriksson",
        "email" : null,
        "telephone" : "0528-567526",
        "name" : null,
        "contact_type" : null
      } ],
      "duration" : {
        "concept_id" : "a7uU_j21_mkL",
        "label" : "Tills vidare",
        "legacy_ams_taxonomy_id" : "1"
      },
      "nice_to_have" : {
        "education_level" : [ ],
        "work_experiences" : [ ],
        "skills" : [ ],
        "education" : [ ],
        "languages" : [ ]
      },
      "application_details" : {
        "via_af" : false,
        "email" : null,
        "other" : null,
        "reference" : "2022/89",
        "url" : "https://fargelanda.varbi.com/what:job/jobID:536579/type:job/where:1/apply:1",
        "information" : null
      },
      "source_type" : "VIA_PLATSBANKEN_DXA",
      "application_deadline" : "2022-09-18T23:59:59",
      "external_id" : "46-212000-1421-536579",
      "workplace_address" : {
        "coordinates" : [ 11.994926, 58.56756 ],
        "city" : null,
        "postcode" : null,
        "municipality" : "Färgelanda",
        "region_concept_id" : "zdoY_6u5_Krt",
        "region" : "Västra Götalands län",
        "country_code" : "199",
        "region_code" : "14",
        "municipality_concept_id" : "kCHb_icw_W5E",
        "country_concept_id" : "i46j_HmG_v64",
        "municipality_code" : "1439",
        "street_address" : null,
        "country" : "Sverige"
      },
      "id" : "26428733",
      "experience_required" : true,
      "working_hours_type" : {
        "concept_id" : "947z_JGS_Uk2",
        "label" : "Deltid",
        "legacy_ams_taxonomy_id" : "2"
      },
      "access" : null,
      "timestamp" : 1660889853756,
      "must_have" : {
        "education_level" : [ ],
        "work_experiences" : [ {
          "concept_id" : "Vg3d_Azf_p5Y",
          "weight" : 10,
          "label" : "Kock, storhushåll",
          "legacy_ams_taxonomy_id" : "7664"
        } ],
        "skills" : [ ],
        "education" : [ ],
        "languages" : [ ]
      },
      "occupation_field" : {
        "concept_id" : "ScKy_FHB_7wT",
        "label" : "Hotell, restaurang, storhushåll",
        "legacy_ams_taxonomy_id" : "7"
      },
      "scope_of_work" : {
        "min" : 75,
        "max" : 100
      },
      "salary_type" : {
        "concept_id" : "oG8G_9cW_nRf",
        "label" : "Fast månads- vecko- eller timlön",
        "legacy_ams_taxonomy_id" : "1"
      },
      "removed" : false,
      "salary_description" : "Månadslön",
      "access_to_own_car" : false,
      "publication_date" : "2022-08-19T08:17:33"
    },
    "name" : "Kock 75 % Håvestensgården",
    "user" : "hannes"
  },
  "sha1" : "73858633eb67c8aee932c1583b6cee675aa70482",
  "annotations" : [ {
    "preferred-label" : "Kock, storhushåll",
    "sentiment" : "MUST_HAVE",
    "type" : "occupation-name",
    "start-position" : 0,
    "end-position" : 4,
    "concept-id" : "Vg3d_Azf_p5Y",
    "matched-string" : "kock",
    "annotation-id" : 0
  }, {
    "preferred-label" : "Deltid",
    "sentiment" : "MUST_HAVE",
    "type" : "worktime-extent",
    "start-position" : 5,
    "end-position" : 9,
    "concept-id" : "947z_JGS_Uk2",
    "matched-string" : "75 %",
    "annotation-id" : 11
  }, {
    "preferred-label" : "Färgelanda",
    "sentiment" : "NOT_RELEVANT",
    "type" : "municipality",
    "start-position" : 26,
    "end-position" : 43,
    "concept-id" : "kCHb_icw_W5E",
    "matched-string" : "Färgelanda kommun",
    "annotation-id" : 12
  }, {
    "preferred-label" : "Färgelanda",
    "sentiment" : "NOT_RELEVANT",
    "type" : "municipality",
    "start-position" : 45,
    "end-position" : 62,
    "concept-id" : "kCHb_icw_W5E",
    "matched-string" : "Färgelanda kommun",
    "annotation-id" : 13
  }, {
    "preferred-label" : "Friluftsliv",
    "sentiment" : "OFFERED",
    "type" : "keyword",
    "start-position" : 299,
    "end-position" : 310,
    "concept-id" : "B7hB_AUU_7eC",
    "matched-string" : "friluftsliv",
    "annotation-id" : 1
  }, {
    "preferred-label" : "Färgelanda",
    "sentiment" : "NOT_RELEVANT",
    "type" : "municipality",
    "start-position" : 314,
    "end-position" : 322,
    "concept-id" : "kCHb_icw_W5E",
    "matched-string" : "Kommunen",
    "annotation-id" : 14
  }, {
    "preferred-label" : "Färgelanda",
    "sentiment" : "NOT_RELEVANT",
    "type" : "municipality",
    "start-position" : 671,
    "end-position" : 688,
    "concept-id" : "kCHb_icw_W5E",
    "matched-string" : "Färgelanda kommun",
    "annotation-id" : 15
  }, {
    "preferred-label" : "Färgelanda",
    "sentiment" : "NOT_RELEVANT",
    "type" : "municipality",
    "start-position" : 689,
    "end-position" : 706,
    "concept-id" : "kCHb_icw_W5E",
    "matched-string" : "Färgelanda kommun",
    "annotation-id" : 16
  }, {
    "preferred-label" : "Färgelanda",
    "type" : "municipality",
    "start-position" : 785,
    "end-position" : 793,
    "concept-id" : "kCHb_icw_W5E",
    "matched-string" : "kommunen",
    "annotation-id" : 17
  }, {
    "preferred-label" : "Friluftsliv",
    "sentiment" : "OFFERED",
    "type" : "keyword",
    "start-position" : 946,
    "end-position" : 957,
    "concept-id" : "B7hB_AUU_7eC",
    "matched-string" : "friluftsliv",
    "annotation-id" : 2
  }, {
    "preferred-label" : "Färgelanda",
    "type" : "municipality",
    "start-position" : 960,
    "end-position" : 968,
    "concept-id" : "kCHb_icw_W5E",
    "matched-string" : "Kommunen",
    "annotation-id" : 18
  }, {
    "preferred-label" : "Kock, storhushåll",
    "sentiment" : "MUST_HAVE",
    "type" : "occupation-name",
    "start-position" : 1344,
    "end-position" : 1348,
    "concept-id" : "Vg3d_Azf_p5Y",
    "matched-string" : "kock",
    "annotation-id" : 3
  }, {
    "preferred-label" : "Specialkost",
    "sentiment" : "MUST_HAVE",
    "type" : "skill",
    "start-position" : 1456,
    "end-position" : 1467,
    "concept-id" : "JYKn_PRX_tif",
    "matched-string" : "specialkost",
    "annotation-id" : 4
  }, {
    "preferred-label" : "Varumottagning",
    "sentiment" : "MUST_HAVE",
    "type" : "skill",
    "start-position" : 1569,
    "end-position" : 1583,
    "concept-id" : "rYxp_wbM_YSG",
    "matched-string" : "varumottagning",
    "annotation-id" : 5
  }, {
    "preferred-label" : "diska",
    "sentiment" : "MUST_HAVE",
    "type" : "esco-skill",
    "start-position" : 1617,
    "end-position" : 1621,
    "concept-id" : "Hkh7_SuX_4k1",
    "matched-string" : "disk",
    "annotation-id" : 19
  }, {
    "preferred-label" : "Städa",
    "sentiment" : "NOT_RELEVANT",
    "type" : "keyword",
    "start-position" : 1627,
    "end-position" : 1637,
    "concept-id" : "r35T_iyj_ueU",
    "matched-string" : "städarbete",
    "annotation-id" : 20
  }, {
    "preferred-label" : "Kockutbildning",
    "sentiment" : "MUST_HAVE",
    "type" : "keyword",
    "start-position" : 1752,
    "end-position" : 1766,
    "concept-id" : "62ja_BdV_Xdo",
    "matched-string" : "kockutbildning",
    "annotation-id" : 6
  }, {
    "preferred-label" : "Utbildning för storhushåll",
    "sentiment" : "MUST_HAVE",
    "type" : "sun-education-field-4",
    "start-position" : 1773,
    "end-position" : 1799,
    "concept-id" : "e4iM_ko7_Ymd",
    "matched-string" : "storhushållningsutbildning",
    "annotation-id" : 21
  }, {
    "preferred-label" : "Restaurang",
    "sentiment" : "NICE_TO_HAVE",
    "type" : "keyword",
    "start-position" : 1872,
    "end-position" : 1882,
    "concept-id" : "o2Cg_3Ap_qvK",
    "matched-string" : "restaurang",
    "annotation-id" : 7
  }, {
    "preferred-label" : "Specialkost",
    "sentiment" : "MUST_HAVE",
    "type" : "skill",
    "start-position" : 1950,
    "end-position" : 1961,
    "concept-id" : "JYKn_PRX_tif",
    "matched-string" : "specialkost",
    "annotation-id" : 8
  }, {
    "preferred-label" : "Hälsa",
    "sentiment" : "NOT_RELEVANT",
    "type" : "keyword",
    "start-position" : 2026,
    "end-position" : 2031,
    "concept-id" : "Abys_5p1_Cnq",
    "matched-string" : "hälsa",
    "annotation-id" : 9
  }, {
    "preferred-label" : "noggrannhet",
    "sentiment" : "MUST_HAVE",
    "type" : "esco-skill",
    "start-position" : 2163,
    "end-position" : 2171,
    "concept-id" : "mrsW_EkL_KRD",
    "matched-string" : "noggrann",
    "annotation-id" : 22
  }, {
    "preferred-label" : "Svenska",
    "sentiment" : "MUST_HAVE",
    "type" : "language",
    "start-position" : 2343,
    "end-position" : 2358,
    "concept-id" : "zSLA_vw2_FXN",
    "matched-string" : "svenska språket",
    "annotation-id" : 10
  } ],
  "text" : "Kock 75 % Håvestensgården\nFärgelanda kommun\n\nFärgelanda kommun är en kommun i sydvästra Dalsland med en stor arbetsmarknad inpå knuten. I kommunen bor ca 6 600 invånare och erbjuder en rik mångfald av möjligheter, en vacker natur med glittrande sjöar och orörd vildmark, där du kan utöva ett aktivt friluftsliv.\n\n\nKommunen som organisation består av ca 500 medarbetare fördelat på tre sektorer; Omsorg, Barn &amp; Utbildning, Samhällsutveckling samt en gemensam stab. Tillsammans arbetar vi för att uppnå vår vision om en trygg kommun med tillväxt och livskraft. Detta arbete utför vi med engagemang - företagsamhet - och ett gott bemötande, som är vår värdegrund!\n\n\n\r\n\r\nFärgelanda kommun\nFärgelanda kommun är en kommun i sydvästra Dalsland med en stor arbetsmarknad inpå knuten.\r\n\r\nI kommunen bor ca 6 600 invånare och erbjuder en rik mångfald av möjligheter, en vacker natur med glittrande sjöar och orörd vildmark, där du kan utöva ett aktivt friluftsliv.\n\nKommunen som organisation består av ca 500 medarbetare fördelat på två sektorer; Omsorg och Barn & Utbildning, en Samhällsutvecklingsavdelning samt en gemensam stab. Tillsammans arbetar vi för att uppnå vår vision om en trygg kommun med tillväxt och livskraft. Detta arbete utför vi med engagemang - företagsamhet - och ett gott bemötande, som är vår värdegrund!\n\nArbetsuppgifter\nSom kock kommer du att ansvara för att planera, förbereda och tillaga måltider (frukost, lunch och kvällsmål), samt specialkost till våra boende, ute på avdelningsköken. Samt andra förekommande arbetsuppgifter i ett kök som bl a varumottagning, egenkontrollsarbete, servering, disk- och städarbete. Vi strävar efter att tillaga så mycket som möjligt från grunden.\n\nKvalifikationer\nVi ser att du har dokumenterad kockutbildning eller storhushållningsutbildning som arbetsgivaren bedömer likvärdig. Tidigare erfarenheter inom kök och restaurang är meriterande likväl utbildning inom HACCP. Du har kunskaper inom specialkost och egenkontroll.\n\nDu drivs av ett genuint intresse för mat och hälsa och känner glädje av att leverera näringsriktig och vällagad mat till våra boende.\n\nSom person har du god kommunikativ förmåga, är noggrann, flexibel, engagerad och stresstålig. Du tar ansvar för din uppgift och är bra på att organisera och planera ditt arbete.\n\nDu har god förmåga att kunna uttrycka dig i det svenska språket, så väl muntligt som skriftligt.\n\nVi kommer att lägga stor vikt vid personlig lämplighet. \n\nÖvrigt\nVi undanber oss vänligt men bestämt direktkontakt med bemannings- och rekryteringsföretag samt försäljare av ytterligare jobbannonser.\n\nVi tillämpar löpande urval, så ansök redan idag."
}