{
  "meta" : {
    "jobad" : {
      "description" : {
        "requirements" : null,
        "needs" : null,
        "company_information" : null,
        "text_formatted" : "<p>Vi söker dig inom Bilrekonditionerare , kör bilar båda vanligt och Automat låda. Hjälpa kunder </p><p>Arbetstider som gäller är dagtid , Heltid och tillsvidare . Här kommer du till en trygg arbetsplats.</p><p>Ny start jobb bidrag krävs  </p><p>Så tveka inte att skicka in din ansökan redan idag. Vid frågor om tjänsten kontakta oss bara genom mail</p>",
        "conditions" : null,
        "text" : "Vi söker dig inom Bilrekonditionerare , kör bilar båda vanligt och Automat låda. Hjälpa kunder \nArbetstider som gäller är dagtid , Heltid och tillsvidare . Här kommer du till en trygg arbetsplats.\nNy start jobb bidrag krävs  \nSå tveka inte att skicka in din ansökan redan idag. Vid frågor om tjänsten kontakta oss bara genom mail"
      },
      "headline" : "Arbetare",
      "driving_license" : [ {
        "concept_id" : "VTK8_WRx_GcM",
        "label" : "B",
        "legacy_ams_taxonomy_id" : "3"
      } ],
      "employer" : {
        "email" : null,
        "phone_number" : null,
        "organization_number" : "5591362792",
        "name" : "Nordiska Bilhuset AB",
        "url" : null,
        "workplace" : "Nordiska Bilhuset AB"
      },
      "removed_date" : null,
      "logo_url" : null,
      "last_publication_date" : "2022-08-11T23:59:59",
      "number_of_vacancies" : 1,
      "occupation" : {
        "concept_id" : "gP3r_Q2H_ht9",
        "label" : "Bilrekonditionerare",
        "legacy_ams_taxonomy_id" : "396"
      },
      "occupation_group" : {
        "concept_id" : "FjdF_H2e_tAG",
        "label" : "Bilrekonditionerare, fönsterputsare m.fl.",
        "legacy_ams_taxonomy_id" : "9120"
      },
      "employment_type" : {
        "concept_id" : "PFZr_Syz_cUq",
        "label" : "Vanlig anställning",
        "legacy_ams_taxonomy_id" : "1"
      },
      "webpage_url" : "https://arbetsformedlingen.se/platsbanken/annonser/26321427",
      "driving_license_required" : true,
      "application_contacts" : [ ],
      "duration" : {
        "concept_id" : "qQUd_4qe_NDT",
        "label" : "6 månader eller längre",
        "legacy_ams_taxonomy_id" : "2"
      },
      "nice_to_have" : {
        "education_level" : [ ],
        "work_experiences" : [ {
          "concept_id" : "gP3r_Q2H_ht9",
          "weight" : 5,
          "label" : "Bilrekonditionerare",
          "legacy_ams_taxonomy_id" : "396"
        } ],
        "skills" : [ ],
        "education" : [ ],
        "languages" : [ ]
      },
      "application_details" : {
        "via_af" : false,
        "email" : "info@nordiskabilhuset.se",
        "other" : null,
        "reference" : null,
        "url" : null,
        "information" : null
      },
      "source_type" : "VIA_ANNONSERA",
      "application_deadline" : "2022-08-11T23:59:59",
      "external_id" : null,
      "workplace_address" : {
        "coordinates" : [ 18.07789472101205, 59.114972259199575 ],
        "city" : "VÄSTERHANINGE",
        "postcode" : "13737",
        "municipality" : "Haninge",
        "region_concept_id" : "CifL_Rzy_Mku",
        "region" : "Stockholms län",
        "country_code" : "199",
        "region_code" : "01",
        "municipality_concept_id" : "Q7gp_9dT_k2F",
        "country_concept_id" : "i46j_HmG_v64",
        "municipality_code" : "0136",
        "street_address" : "Industrivägen 6",
        "country" : "Sverige"
      },
      "id" : "26321427",
      "experience_required" : true,
      "working_hours_type" : {
        "concept_id" : "6YE1_gAC_R2G",
        "label" : "Heltid",
        "legacy_ams_taxonomy_id" : "1"
      },
      "access" : null,
      "timestamp" : 1657641825273,
      "must_have" : {
        "education_level" : [ ],
        "work_experiences" : [ ],
        "skills" : [ ],
        "education" : [ ],
        "languages" : [ ]
      },
      "occupation_field" : {
        "concept_id" : "whao_Q6A_ScE",
        "label" : "Sanering och renhållning",
        "legacy_ams_taxonomy_id" : "12"
      },
      "scope_of_work" : {
        "min" : 0,
        "max" : 100
      },
      "salary_type" : {
        "concept_id" : "oG8G_9cW_nRf",
        "label" : "Fast månads- vecko- eller timlön",
        "legacy_ams_taxonomy_id" : "1"
      },
      "removed" : false,
      "salary_description" : null,
      "access_to_own_car" : false,
      "publication_date" : "2022-07-12T18:03:45"
    },
    "name" : "Arbetare",
    "user" : "kristof.fischer"
  },
  "sha1" : "aac582c11f0a76742c390fafe29dc59ae210e303",
  "annotations" : [ {
    "preferred-label" : "Bilrekonditionerare",
    "sentiment" : "MUST_HAVE",
    "type" : "occupation-name",
    "start-position" : 27,
    "end-position" : 46,
    "concept-id" : "gP3r_Q2H_ht9",
    "matched-string" : "bilrekonditionerare",
    "annotation-id" : 0
  }, {
    "preferred-label" : "Heltid",
    "type" : "worktime-extent",
    "start-position" : 140,
    "end-position" : 146,
    "concept-id" : "6YE1_gAC_R2G",
    "matched-string" : "Heltid",
    "annotation-id" : 1
  }, {
    "preferred-label" : "Tillsvidareanställning (inkl. eventuell provanställning)",
    "type" : "employment-type",
    "start-position" : 151,
    "end-position" : 162,
    "concept-id" : "kpPX_CNN_gDU",
    "matched-string" : "tillsvidare",
    "annotation-id" : 2
  } ],
  "text" : "Arbetare\nVi söker dig inom Bilrekonditionerare , kör bilar båda vanligt och Automat låda. Hjälpa kunder \nArbetstider som gäller är dagtid , Heltid och tillsvidare . Här kommer du till en trygg arbetsplats.\nNy start jobb bidrag krävs  \nSå tveka inte att skicka in din ansökan redan idag. Vid frågor om tjänsten kontakta oss bara genom mail"
}