{
  "meta" : {
    "jobad" : {
      "description" : {
        "requirements" : null,
        "needs" : null,
        "company_information" : null,
        "text_formatted" : "Vi du skapa upplevelser? Vill du se dina kunder njuta av din service och vår goda mat?\n\nÄr du en utåtriktad och positiv ”people person” som gärna hugger i och gillar\natt ge bra service? Vill du göra karriär? Ha kul på jobbet! Nu har du chansen - sök jobbet idag!\n\nVi på Burger King söker just nu restaurangmedarbetare\n\nDu blir vårt ansikte utåt i vår restaurang och får ett mångsidigt jobb som innebär att du roterar mellan olika arbetsuppgifter. Du kommer att få arbeta både i köket, matsalen och med att servera gäster.\n\nVad vi erbjuder:\nBurger King är ett av världens största restaurangföretag. Och självklart är engagerade, motiverade och trevliga medarbetare nyckeln till vår framgång. För oss är det viktigt att våra medarbetare får chansen att\nutvecklas. Vi erbjuder därför en tydlig karriärstege och goda utvecklingsmöjligheter. Tanken med våra utbildningar är att du ska växa med ansvar och utvecklas i din yrkesroll under hela din tid hos oss.\n\nVem är du?\nFör att lyckas i jobbet tror vi att du har en utpräglad servicekänsla och tycker att det är roligt att arbeta med människor.\n\nLåter det som något för dig? Sök jobbet Nu!\n\nBurger King är ett av världens största restaurangföretag. För oss är självklart engagerade, motiverade och trevliga medarbetare nyckeln till vår framgång. Därför värderar vi vår personal högt och erbjuder en tydlig karriärstege med fortbildning och goda utvecklingsmöjligheter.",
        "conditions" : "Deltid\r\nTillsvidare",
        "text" : "Vi du skapa upplevelser? Vill du se dina kunder njuta av din service och vår goda mat?\n\nÄr du en utåtriktad och positiv ”people person” som gärna hugger i och gillar\natt ge bra service? Vill du göra karriär? Ha kul på jobbet! Nu har du chansen - sök jobbet idag!\n\nVi på Burger King söker just nu restaurangmedarbetare\n\nDu blir vårt ansikte utåt i vår restaurang och får ett mångsidigt jobb som innebär att du roterar mellan olika arbetsuppgifter. Du kommer att få arbeta både i köket, matsalen och med att servera gäster.\n\nVad vi erbjuder:\nBurger King är ett av världens största restaurangföretag. Och självklart är engagerade, motiverade och trevliga medarbetare nyckeln till vår framgång. För oss är det viktigt att våra medarbetare får chansen att\nutvecklas. Vi erbjuder därför en tydlig karriärstege och goda utvecklingsmöjligheter. Tanken med våra utbildningar är att du ska växa med ansvar och utvecklas i din yrkesroll under hela din tid hos oss.\n\nVem är du?\nFör att lyckas i jobbet tror vi att du har en utpräglad servicekänsla och tycker att det är roligt att arbeta med människor.\n\nLåter det som något för dig? Sök jobbet Nu!\n\nBurger King är ett av världens största restaurangföretag. För oss är självklart engagerade, motiverade och trevliga medarbetare nyckeln till vår framgång. Därför värderar vi vår personal högt och erbjuder en tydlig karriärstege med fortbildning och goda utvecklingsmöjligheter."
      },
      "headline" : "Servicefokuserade restaurangmedarbetare",
      "driving_license" : null,
      "employer" : {
        "email" : null,
        "phone_number" : null,
        "organization_number" : "5566539457",
        "name" : "Nordic Service Partners AB",
        "url" : "http://www.burgerking.se",
        "workplace" : "Burger King"
      },
      "removed_date" : null,
      "logo_url" : "https://www.arbetsformedlingen.se/rest/arbetsgivare/rest/af/v3/organisation/5566539457/logotyper/logo.png",
      "last_publication_date" : "2022-09-12T23:59:59",
      "number_of_vacancies" : 3,
      "occupation" : {
        "concept_id" : "yXRQ_Ad9_E8V",
        "label" : "Restaurangbiträde",
        "legacy_ams_taxonomy_id" : "5555"
      },
      "occupation_group" : {
        "concept_id" : "tPox_ie4_X9X",
        "label" : "Restaurang- och köksbiträden m.fl.",
        "legacy_ams_taxonomy_id" : "9412"
      },
      "employment_type" : {
        "concept_id" : "PFZr_Syz_cUq",
        "label" : "Vanlig anställning",
        "legacy_ams_taxonomy_id" : "1"
      },
      "webpage_url" : "https://arbetsformedlingen.se/platsbanken/annonser/26406464",
      "driving_license_required" : false,
      "application_contacts" : [ {
        "description" : "Burger King",
        "email" : null,
        "telephone" : null,
        "name" : null,
        "contact_type" : null
      } ],
      "duration" : {
        "concept_id" : "a7uU_j21_mkL",
        "label" : "Tills vidare",
        "legacy_ams_taxonomy_id" : "1"
      },
      "nice_to_have" : {
        "education_level" : [ ],
        "work_experiences" : [ ],
        "skills" : [ ],
        "education" : [ ],
        "languages" : [ ]
      },
      "application_details" : {
        "via_af" : false,
        "email" : null,
        "other" : null,
        "reference" : null,
        "url" : "https://fairrecruiting.se/burger-king/job/27000-servicefokuserade-restaurangmedarbetare_burger-king-vaxjo-i11?ref=arbetsformedlingen.se",
        "information" : null
      },
      "source_type" : "VIA_PLATSBANKEN_DXA",
      "application_deadline" : "2022-09-12T23:59:59",
      "external_id" : "46-556653-9457-27000",
      "workplace_address" : {
        "coordinates" : [ 14.805852, 56.879005 ],
        "city" : null,
        "postcode" : null,
        "municipality" : "Växjö",
        "region_concept_id" : "tF3y_MF9_h5G",
        "region" : "Kronobergs län",
        "country_code" : "199",
        "region_code" : "07",
        "municipality_concept_id" : "mmot_H3A_auW",
        "country_concept_id" : "i46j_HmG_v64",
        "municipality_code" : "0780",
        "street_address" : null,
        "country" : "Sverige"
      },
      "id" : "26406464",
      "experience_required" : true,
      "working_hours_type" : {
        "concept_id" : "947z_JGS_Uk2",
        "label" : "Deltid",
        "legacy_ams_taxonomy_id" : "2"
      },
      "access" : null,
      "timestamp" : 1660416924202,
      "must_have" : {
        "education_level" : [ ],
        "work_experiences" : [ {
          "concept_id" : "yXRQ_Ad9_E8V",
          "weight" : 10,
          "label" : "Restaurangbiträde",
          "legacy_ams_taxonomy_id" : "5555"
        } ],
        "skills" : [ ],
        "education" : [ ],
        "languages" : [ ]
      },
      "occupation_field" : {
        "concept_id" : "ScKy_FHB_7wT",
        "label" : "Hotell, restaurang, storhushåll",
        "legacy_ams_taxonomy_id" : "7"
      },
      "scope_of_work" : {
        "min" : 0,
        "max" : 100
      },
      "salary_type" : {
        "concept_id" : "oG8G_9cW_nRf",
        "label" : "Fast månads- vecko- eller timlön",
        "legacy_ams_taxonomy_id" : "1"
      },
      "removed" : false,
      "salary_description" : "Månadslön",
      "access_to_own_car" : false,
      "publication_date" : "2022-08-13T20:54:54"
    },
    "name" : "Servicefokuserade restaurangmedarbetare",
    "user" : "hannes"
  },
  "sha1" : "2572378814659b4b919f4015904ec46d4c03e830",
  "annotations" : [ {
    "preferred-label" : "Restaurangpersonal",
    "sentiment" : "MUST_HAVE",
    "type" : "keyword",
    "start-position" : 18,
    "end-position" : 39,
    "concept-id" : "ZYjR_db3_jN5",
    "matched-string" : "restaurangmedarbetare",
    "annotation-id" : 2
  }, {
    "preferred-label" : "Restaurangpersonal",
    "sentiment" : "MUST_HAVE",
    "type" : "keyword",
    "start-position" : 336,
    "end-position" : 357,
    "concept-id" : "ZYjR_db3_jN5",
    "matched-string" : "restaurangmedarbetare",
    "annotation-id" : 3
  }, {
    "preferred-label" : "Restaurang",
    "sentiment" : "NOT_RELEVANT",
    "type" : "keyword",
    "start-position" : 391,
    "end-position" : 401,
    "concept-id" : "o2Cg_3Ap_qvK",
    "matched-string" : "restaurang",
    "annotation-id" : 0
  }, {
    "preferred-label" : "Personal",
    "sentiment" : "NOT_RELEVANT",
    "type" : "keyword",
    "start-position" : 1355,
    "end-position" : 1363,
    "concept-id" : "HVxM_6MS_y1c",
    "matched-string" : "personal",
    "annotation-id" : 1
  } ],
  "text" : "Servicefokuserade restaurangmedarbetare\nVi du skapa upplevelser? Vill du se dina kunder njuta av din service och vår goda mat?\n\nÄr du en utåtriktad och positiv ”people person” som gärna hugger i och gillar\natt ge bra service? Vill du göra karriär? Ha kul på jobbet! Nu har du chansen - sök jobbet idag!\n\nVi på Burger King söker just nu restaurangmedarbetare\n\nDu blir vårt ansikte utåt i vår restaurang och får ett mångsidigt jobb som innebär att du roterar mellan olika arbetsuppgifter. Du kommer att få arbeta både i köket, matsalen och med att servera gäster.\n\nVad vi erbjuder:\nBurger King är ett av världens största restaurangföretag. Och självklart är engagerade, motiverade och trevliga medarbetare nyckeln till vår framgång. För oss är det viktigt att våra medarbetare får chansen att\nutvecklas. Vi erbjuder därför en tydlig karriärstege och goda utvecklingsmöjligheter. Tanken med våra utbildningar är att du ska växa med ansvar och utvecklas i din yrkesroll under hela din tid hos oss.\n\nVem är du?\nFör att lyckas i jobbet tror vi att du har en utpräglad servicekänsla och tycker att det är roligt att arbeta med människor.\n\nLåter det som något för dig? Sök jobbet Nu!\n\nBurger King är ett av världens största restaurangföretag. För oss är självklart engagerade, motiverade och trevliga medarbetare nyckeln till vår framgång. Därför värderar vi vår personal högt och erbjuder en tydlig karriärstege med fortbildning och goda utvecklingsmöjligheter."
}