{
  "meta" : {
    "jobad" : {
      "description" : {
        "requirements" : null,
        "needs" : null,
        "company_information" : null,
        "text_formatted" : "<p>Vi på Kvarnbageriet i Väröbacka söker nu efter en ny kollega! Med start omgående.</p><p>Tjänsten är tillsvidare och önskvärt på 100%. Vi önskar tillsätta tjänsten så snart som möjligt.</p><p>Vi är ett mindre surdegsbageri som arbetar hantverksmässigt med ekologiska råvaror. Tjänsten är främst som bagare med bröd och bullar i fokus. Men även en del inom konditori samt betjäning och kundkontakt i kassa.</p><p>Vi är ett litet gäng med bra sammanhållning som har kul på jobbet. Det krävs att du gillar att jobba som ett lag, kan sammarbeta med andra, gillar att ha många bollar i luften och snabbt kan tänka om och hitta andra lösningar på eventuella problem. God fysik är ett måste, då jobbet delvis kan vara tungt.</p><p>Vi arbetar på ett rullande schema. Där man arbetar var tredje lördag, då är man ledig måndagen efter. </p><p>Arbetet innehåller stor möjlighet att själv testa fram produkter och vara kreativ. Vi testar hela tiden nya saker.</p><p>Utbildning eller liknande arbetserfarenhet krävs. Ett plus om du arbetat med surdeg tidigare.</p><p>Låter detta som något för dig?</p><p>Tveka inte att höra av dig till oss! Skicka iväg ett mejl med lite info och cv till info@kvarnbageriet.se.</p><p>Hälsningar Ellen, Kvarnbageriet</p>",
        "conditions" : null,
        "text" : "Vi på Kvarnbageriet i Väröbacka söker nu efter en ny kollega! Med start omgående.\nTjänsten är tillsvidare och önskvärt på 100%. Vi önskar tillsätta tjänsten så snart som möjligt.\nVi är ett mindre surdegsbageri som arbetar hantverksmässigt med ekologiska råvaror. Tjänsten är främst som bagare med bröd och bullar i fokus. Men även en del inom konditori samt betjäning och kundkontakt i kassa.\nVi är ett litet gäng med bra sammanhållning som har kul på jobbet. Det krävs att du gillar att jobba som ett lag, kan sammarbeta med andra, gillar att ha många bollar i luften och snabbt kan tänka om och hitta andra lösningar på eventuella problem. God fysik är ett måste, då jobbet delvis kan vara tungt.\nVi arbetar på ett rullande schema. Där man arbetar var tredje lördag, då är man ledig måndagen efter. \nArbetet innehåller stor möjlighet att själv testa fram produkter och vara kreativ. Vi testar hela tiden nya saker.\nUtbildning eller liknande arbetserfarenhet krävs. Ett plus om du arbetat med surdeg tidigare.\nLåter detta som något för dig?\nTveka inte att höra av dig till oss! Skicka iväg ett mejl med lite info och cv till info@kvarnbageriet.se.\nHälsningar Ellen, Kvarnbageriet"
      },
      "headline" : "Bagare på Kvarnbageriet ",
      "driving_license" : [ {
        "concept_id" : "VTK8_WRx_GcM",
        "label" : "B",
        "legacy_ams_taxonomy_id" : "3"
      } ],
      "employer" : {
        "email" : null,
        "phone_number" : null,
        "organization_number" : "5566782412",
        "name" : "Limabacka Kvarn AB",
        "url" : null,
        "workplace" : "Kvarnbageriet "
      },
      "removed_date" : null,
      "logo_url" : "https://www.arbetsformedlingen.se/rest/arbetsgivare/rest/af/v3/arbetsplatser/88172010/logotyper/logo.png",
      "last_publication_date" : "2022-06-30T23:59:59",
      "number_of_vacancies" : 1,
      "occupation" : {
        "concept_id" : "XugJ_6hw_wVV",
        "label" : "Bagare/Konditor",
        "legacy_ams_taxonomy_id" : "5504"
      },
      "occupation_group" : {
        "concept_id" : "5qT8_z9d_8rw",
        "label" : "Bagare och konditorer",
        "legacy_ams_taxonomy_id" : "7612"
      },
      "employment_type" : {
        "concept_id" : "PFZr_Syz_cUq",
        "label" : "Vanlig anställning",
        "legacy_ams_taxonomy_id" : "1"
      },
      "webpage_url" : "https://arbetsformedlingen.se/platsbanken/annonser/26237809",
      "driving_license_required" : true,
      "application_contacts" : [ ],
      "duration" : {
        "concept_id" : "a7uU_j21_mkL",
        "label" : "Tills vidare",
        "legacy_ams_taxonomy_id" : "1"
      },
      "nice_to_have" : {
        "education_level" : [ ],
        "work_experiences" : [ ],
        "skills" : [ ],
        "education" : [ ],
        "languages" : [ {
          "concept_id" : "NVxJ_hLg_TYS",
          "weight" : 5,
          "label" : "Engelska",
          "legacy_ams_taxonomy_id" : "283"
        } ]
      },
      "application_details" : {
        "via_af" : false,
        "email" : "info@kvarnbageriet.se",
        "other" : null,
        "reference" : null,
        "url" : null,
        "information" : null
      },
      "source_type" : "VIA_ANNONSERA",
      "application_deadline" : "2022-06-30T23:59:59",
      "external_id" : null,
      "workplace_address" : {
        "coordinates" : [ 12.185559802506223, 57.245818431023956 ],
        "city" : "VÄRÖBACKA",
        "postcode" : "43265",
        "municipality" : "Varberg",
        "region_concept_id" : "wjee_qH2_yb6",
        "region" : "Hallands län",
        "country_code" : "199",
        "region_code" : "13",
        "municipality_concept_id" : "AkUx_yAq_kGr",
        "country_concept_id" : "i46j_HmG_v64",
        "municipality_code" : "1383",
        "street_address" : "Backa 121",
        "country" : "Sverige"
      },
      "id" : "26237809",
      "experience_required" : true,
      "working_hours_type" : {
        "concept_id" : "6YE1_gAC_R2G",
        "label" : "Heltid",
        "legacy_ams_taxonomy_id" : "1"
      },
      "access" : null,
      "timestamp" : 1655730015824,
      "must_have" : {
        "education_level" : [ ],
        "work_experiences" : [ ],
        "skills" : [ {
          "concept_id" : "btqh_hCy_bRi",
          "weight" : 10,
          "label" : "Bageriarbete",
          "legacy_ams_taxonomy_id" : "601216"
        } ],
        "education" : [ ],
        "languages" : [ {
          "concept_id" : "zSLA_vw2_FXN",
          "weight" : 10,
          "label" : "Svenska",
          "legacy_ams_taxonomy_id" : "502"
        } ]
      },
      "occupation_field" : {
        "concept_id" : "PaxQ_o1G_wWH",
        "label" : "Hantverk",
        "legacy_ams_taxonomy_id" : "6"
      },
      "scope_of_work" : {
        "min" : 0,
        "max" : 100
      },
      "salary_type" : {
        "concept_id" : "oG8G_9cW_nRf",
        "label" : "Fast månads- vecko- eller timlön",
        "legacy_ams_taxonomy_id" : "1"
      },
      "removed" : false,
      "salary_description" : null,
      "access_to_own_car" : false,
      "publication_date" : "2022-06-20T15:00:15"
    },
    "name" : "Bagare på Kvarnbageriet ",
    "user" : "hannes"
  },
  "sha1" : "24114e6764c82f7c06f46d16f060cf5567d7e70b",
  "annotations" : [ {
    "preferred-label" : "bagare",
    "sentiment" : "MUST_HAVE",
    "type" : "esco-occupation",
    "start-position" : 0,
    "end-position" : 6,
    "concept-id" : "Zo8A_5ML_j3t",
    "matched-string" : "bagare",
    "annotation-id" : 0
  }, {
    "preferred-label" : "Tillsvidareanställning (inkl. eventuell provanställning)",
    "type" : "employment-type",
    "start-position" : 119,
    "end-position" : 130,
    "concept-id" : "kpPX_CNN_gDU",
    "matched-string" : "tillsvidare",
    "annotation-id" : 3
  }, {
    "preferred-label" : "Heltid",
    "type" : "worktime-extent",
    "start-position" : 147,
    "end-position" : 151,
    "concept-id" : "6YE1_gAC_R2G",
    "matched-string" : "100%",
    "annotation-id" : 4
  }, {
    "preferred-label" : "Bageri och konditori",
    "type" : "keyword",
    "start-position" : 221,
    "end-position" : 234,
    "concept-id" : "4t2m_4Dj_ksJ",
    "matched-string" : "surdegsbageri",
    "annotation-id" : 5
  }, {
    "preferred-label" : "bagare",
    "sentiment" : "MUST_HAVE",
    "type" : "esco-occupation",
    "start-position" : 311,
    "end-position" : 317,
    "concept-id" : "Zo8A_5ML_j3t",
    "matched-string" : "bagare",
    "annotation-id" : 1
  }, {
    "preferred-label" : "bageriprodukter",
    "type" : "esco-skill",
    "start-position" : 322,
    "end-position" : 326,
    "concept-id" : "TryE_L4e_CzV",
    "matched-string" : "bröd",
    "annotation-id" : 7
  }, {
    "preferred-label" : "bageriprodukter",
    "type" : "esco-skill",
    "start-position" : 331,
    "end-position" : 337,
    "concept-id" : "TryE_L4e_CzV",
    "matched-string" : "bullar",
    "annotation-id" : 6
  }, {
    "preferred-label" : "Bageri och konditori",
    "type" : "keyword",
    "start-position" : 368,
    "end-position" : 377,
    "concept-id" : "4t2m_4Dj_ksJ",
    "matched-string" : "konditori",
    "annotation-id" : 8
  }, {
    "preferred-label" : "samarbeta med kolleger",
    "type" : "esco-skill",
    "start-position" : 536,
    "end-position" : 556,
    "concept-id" : "X15R_797_q62",
    "matched-string" : "sammarbeta med andra",
    "annotation-id" : 9
  }, {
    "preferred-label" : "God fysik (tunga lyft)",
    "type" : "skill",
    "start-position" : 667,
    "end-position" : 676,
    "concept-id" : "rwir_xvu_443",
    "matched-string" : "God fysik",
    "annotation-id" : 10
  }, {
    "preferred-label" : "tänka kreativt om mat och drycker",
    "type" : "esco-skill",
    "start-position" : 896,
    "end-position" : 908,
    "concept-id" : "1yHi_qo3_PsN",
    "matched-string" : "vara kreativ",
    "annotation-id" : 11
  }, {
    "preferred-label" : "Bageri och konditori",
    "type" : "sun-education-field-4",
    "start-position" : 942,
    "end-position" : 952,
    "concept-id" : "5drh_m2c_zQq",
    "matched-string" : "Utbildning",
    "annotation-id" : 12
  } ],
  "text" : "Bagare på Kvarnbageriet \nVi på Kvarnbageriet i Väröbacka söker nu efter en ny kollega! Med start omgående.\nTjänsten är tillsvidare och önskvärt på 100%. Vi önskar tillsätta tjänsten så snart som möjligt.\nVi är ett mindre surdegsbageri som arbetar hantverksmässigt med ekologiska råvaror. Tjänsten är främst som bagare med bröd och bullar i fokus. Men även en del inom konditori samt betjäning och kundkontakt i kassa.\nVi är ett litet gäng med bra sammanhållning som har kul på jobbet. Det krävs att du gillar att jobba som ett lag, kan sammarbeta med andra, gillar att ha många bollar i luften och snabbt kan tänka om och hitta andra lösningar på eventuella problem. God fysik är ett måste, då jobbet delvis kan vara tungt.\nVi arbetar på ett rullande schema. Där man arbetar var tredje lördag, då är man ledig måndagen efter. \nArbetet innehåller stor möjlighet att själv testa fram produkter och vara kreativ. Vi testar hela tiden nya saker.\nUtbildning eller liknande arbetserfarenhet krävs. Ett plus om du arbetat med surdeg tidigare.\nLåter detta som något för dig?\nTveka inte att höra av dig till oss! Skicka iväg ett mejl med lite info och cv till info@kvarnbageriet.se.\nHälsningar Ellen, Kvarnbageriet"
}