{
  "meta" : {
    "jobad" : {
      "description" : {
        "requirements" : null,
        "needs" : null,
        "company_information" : null,
        "text_formatted" : "<p>Hej är du vår nya kollega att hyra in dig på vår salong my Corner på väster i örebro. Ringgatan 20</p><p>vi söker dig som är noggran o känner stor glädje inför ditt jobb. Vi välkomnar alla kunder, unga som gamla, med glädje. </p><p>här jobbar vi som ett team o en familj där alla hjälps åt för att göra en så härlig miljö som möjlugt på salongen. </p><p>vi har 5 behandlingsrum som hyrs ut till egenföretagare som vill jobba i team men styra sig  själva.</p><p>vi som jobbar är utbildade i vår kategori och jobbar med noggranhet och god kundvård. </p><p>gå in på vår hemsida för att läsa mer om oss och hör av dog till mig så pratar vi mer o bestämmer vidare träff.</p><p>sofia  rylen 070-5551739 info@mycorner.nu</p><p id=\"oppenforalla\">Öppen för alla\nVi fokuserar på din kompetens, inte dina övriga förutsättningar. Vi är öppna för att anpassa rollen eller arbetsplatsen efter dina behov.</p>",
        "conditions" : null,
        "text" : "Hej är du vår nya kollega att hyra in dig på vår salong my Corner på väster i örebro. Ringgatan 20\nvi söker dig som är noggran o känner stor glädje inför ditt jobb. Vi välkomnar alla kunder, unga som gamla, med glädje. \nhär jobbar vi som ett team o en familj där alla hjälps åt för att göra en så härlig miljö som möjlugt på salongen. \nvi har 5 behandlingsrum som hyrs ut till egenföretagare som vill jobba i team men styra sig  själva.\nvi som jobbar är utbildade i vår kategori och jobbar med noggranhet och god kundvård. \ngå in på vår hemsida för att läsa mer om oss och hör av dog till mig så pratar vi mer o bestämmer vidare träff.\nsofia  rylen 070-5551739 info@mycorner.nu\nÖppen för alla\nVi fokuserar på din kompetens, inte dina övriga förutsättningar. Vi är öppna för att anpassa rollen eller arbetsplatsen efter dina behov."
      },
      "headline" : "Fotvårdsspecialist ",
      "driving_license" : null,
      "employer" : {
        "email" : null,
        "phone_number" : null,
        "organization_number" : null,
        "name" : "Rylén, Sofia",
        "url" : null,
        "workplace" : "Rylén Sofia"
      },
      "removed_date" : null,
      "logo_url" : null,
      "last_publication_date" : "2022-12-01T00:00:00",
      "number_of_vacancies" : 1,
      "occupation" : {
        "concept_id" : "ekn1_xkW_zPM",
        "label" : "Fotterapeut/Fotvårdsspecialist",
        "legacy_ams_taxonomy_id" : "253"
      },
      "occupation_group" : {
        "concept_id" : "HATH_AfN_RRz",
        "label" : "Fotterapeuter",
        "legacy_ams_taxonomy_id" : "5144"
      },
      "employment_type" : {
        "concept_id" : "PFZr_Syz_cUq",
        "label" : "Vanlig anställning",
        "legacy_ams_taxonomy_id" : "1"
      },
      "webpage_url" : "https://arbetsformedlingen.se/platsbanken/annonser/26324679",
      "driving_license_required" : false,
      "application_contacts" : [ ],
      "duration" : {
        "concept_id" : "a7uU_j21_mkL",
        "label" : "Tills vidare",
        "legacy_ams_taxonomy_id" : "1"
      },
      "nice_to_have" : {
        "education_level" : [ ],
        "work_experiences" : [ {
          "concept_id" : "ekn1_xkW_zPM",
          "weight" : 5,
          "label" : "Fotterapeut/Fotvårdsspecialist",
          "legacy_ams_taxonomy_id" : "253"
        } ],
        "skills" : [ ],
        "education" : [ ],
        "languages" : [ ]
      },
      "application_details" : {
        "via_af" : false,
        "email" : "Info@mycorner.nu",
        "other" : null,
        "reference" : null,
        "url" : null,
        "information" : null
      },
      "source_type" : "VIA_ANNONSERA",
      "application_deadline" : "2022-12-01T00:00:00",
      "external_id" : null,
      "workplace_address" : {
        "coordinates" : [ null, null ],
        "city" : null,
        "postcode" : null,
        "municipality" : "Örebro",
        "region_concept_id" : "xTCk_nT5_Zjm",
        "region" : "Örebro län",
        "country_code" : "199",
        "region_code" : "18",
        "municipality_concept_id" : "kuMn_feU_hXx",
        "country_concept_id" : "i46j_HmG_v64",
        "municipality_code" : "1880",
        "street_address" : null,
        "country" : "Sverige"
      },
      "id" : "26324679",
      "experience_required" : true,
      "working_hours_type" : {
        "concept_id" : "6YE1_gAC_R2G",
        "label" : "Heltid",
        "legacy_ams_taxonomy_id" : "1"
      },
      "access" : null,
      "timestamp" : 1657719860272,
      "must_have" : {
        "education_level" : [ ],
        "work_experiences" : [ ],
        "skills" : [ ],
        "education" : [ ],
        "languages" : [ ]
      },
      "occupation_field" : {
        "concept_id" : "Uuf1_GMh_Uvw",
        "label" : "Kropps- och skönhetsvård",
        "legacy_ams_taxonomy_id" : "4"
      },
      "scope_of_work" : {
        "min" : 0,
        "max" : 100
      },
      "salary_type" : {
        "concept_id" : "oG8G_9cW_nRf",
        "label" : "Fast månads- vecko- eller timlön",
        "legacy_ams_taxonomy_id" : "1"
      },
      "removed" : false,
      "salary_description" : null,
      "access_to_own_car" : false,
      "publication_date" : "2022-07-13T15:44:20"
    },
    "name" : "Fotvårdsspecialist ",
    "user" : "kristof.fischer"
  },
  "sha1" : "d2e9ceb01e91fe69fecc09c29bfacd48c1baab19",
  "annotations" : [ {
    "preferred-label" : "Fotterapeut/Fotvårdsspecialist",
    "sentiment" : "MUST_HAVE",
    "type" : "occupation-name",
    "start-position" : 0,
    "end-position" : 18,
    "concept-id" : "ekn1_xkW_zPM",
    "matched-string" : "fotvårdsspecialist",
    "annotation-id" : 0
  }, {
    "preferred-label" : "Örebro",
    "type" : "municipality",
    "start-position" : 98,
    "end-position" : 104,
    "concept-id" : "kuMn_feU_hXx",
    "matched-string" : "örebro",
    "annotation-id" : 1
  }, {
    "preferred-label" : "noggrannhet",
    "sentiment" : "MUST_HAVE",
    "type" : "esco-skill",
    "start-position" : 139,
    "end-position" : 146,
    "concept-id" : "mrsW_EkL_KRD",
    "matched-string" : "noggran",
    "annotation-id" : 2
  } ],
  "text" : "Fotvårdsspecialist \nHej är du vår nya kollega att hyra in dig på vår salong my Corner på väster i örebro. Ringgatan 20\nvi söker dig som är noggran o känner stor glädje inför ditt jobb. Vi välkomnar alla kunder, unga som gamla, med glädje. \nhär jobbar vi som ett team o en familj där alla hjälps åt för att göra en så härlig miljö som möjlugt på salongen. \nvi har 5 behandlingsrum som hyrs ut till egenföretagare som vill jobba i team men styra sig  själva.\nvi som jobbar är utbildade i vår kategori och jobbar med noggranhet och god kundvård. \ngå in på vår hemsida för att läsa mer om oss och hör av dog till mig så pratar vi mer o bestämmer vidare träff.\nsofia  rylen 070-5551739 info@mycorner.nu\nÖppen för alla\nVi fokuserar på din kompetens, inte dina övriga förutsättningar. Vi är öppna för att anpassa rollen eller arbetsplatsen efter dina behov."
}