{
  "meta" : {
    "jobad" : {
      "description" : {
        "requirements" : null,
        "needs" : null,
        "company_information" : null,
        "text_formatted" : "<p><strong>Meet a Student är en jobbplattform för studenter och juniora talanger. </strong></p><p><strong>För kunds räkning söker vi nu:</strong></p><p>Nu söker Sook i Mall of Scandinavia en person som kansör och jobb vid plock och servering på restaurangen. </p><p>Arbetsuppgifterna innebär att personen tar emot kunder vid kassan och vid olika tillfällen (när det behövs) plockar samt gör rent borden. </p><p>Som kassör och plock och serverare letar Sook efter någon som är självdriven, flexibel och utåtriktad. Personen skall samt kunna flytande svenska: det är samt meriterande om personen kan arabiska och engelska. </p><p>Personen ska ha erfarenhet inom tidigare kassajobb och det är meriterande om personen samt har jobbat inom restaurang förut</p><p>Jobbform: timanställning </p><p>Lön: Förhandlingsbar</p><p><br></p>",
        "conditions" : null,
        "text" : "Meet a Student är en jobbplattform för studenter och juniora talanger. \nFör kunds räkning söker vi nu:\nNu söker Sook i Mall of Scandinavia en person som kansör och jobb vid plock och servering på restaurangen. \nArbetsuppgifterna innebär att personen tar emot kunder vid kassan och vid olika tillfällen (när det behövs) plockar samt gör rent borden. \nSom kassör och plock och serverare letar Sook efter någon som är självdriven, flexibel och utåtriktad. Personen skall samt kunna flytande svenska: det är samt meriterande om personen kan arabiska och engelska. \nPersonen ska ha erfarenhet inom tidigare kassajobb och det är meriterande om personen samt har jobbat inom restaurang förut\nJobbform: timanställning \nLön: Förhandlingsbar"
      },
      "headline" : "Kassör/ Plock och servering",
      "driving_license" : null,
      "employer" : {
        "email" : null,
        "phone_number" : null,
        "organization_number" : "5591911747",
        "name" : "Meet a Group international AB",
        "url" : "https://meetastudent.com/sv/",
        "workplace" : "Meet a Group international AB"
      },
      "removed_date" : null,
      "logo_url" : "https://www.arbetsformedlingen.se/rest/arbetsgivare/rest/af/v3/arbetsplatser/87837001/logotyper/logo.png",
      "last_publication_date" : "2022-07-31T23:59:59",
      "number_of_vacancies" : 1,
      "occupation" : {
        "concept_id" : "yXRQ_Ad9_E8V",
        "label" : "Restaurangbiträde",
        "legacy_ams_taxonomy_id" : "5555"
      },
      "occupation_group" : {
        "concept_id" : "tPox_ie4_X9X",
        "label" : "Restaurang- och köksbiträden m.fl.",
        "legacy_ams_taxonomy_id" : "9412"
      },
      "employment_type" : {
        "concept_id" : "1paU_aCR_nGn",
        "label" : "Behovsanställning",
        "legacy_ams_taxonomy_id" : "4"
      },
      "webpage_url" : "https://arbetsformedlingen.se/platsbanken/annonser/26350744",
      "driving_license_required" : false,
      "application_contacts" : [ ],
      "duration" : {
        "concept_id" : null,
        "label" : null,
        "legacy_ams_taxonomy_id" : null
      },
      "nice_to_have" : {
        "education_level" : [ ],
        "work_experiences" : [ ],
        "skills" : [ ],
        "education" : [ ],
        "languages" : [ ]
      },
      "application_details" : {
        "via_af" : false,
        "email" : null,
        "other" : null,
        "reference" : null,
        "url" : "https://meetastudent.com/sv/ledigajobb/25113-kassor-plock-och-servering/",
        "information" : null
      },
      "source_type" : "VIA_ANNONSERA",
      "application_deadline" : "2022-07-31T23:59:59",
      "external_id" : null,
      "workplace_address" : {
        "coordinates" : [ null, null ],
        "city" : null,
        "postcode" : null,
        "municipality" : "Stockholm",
        "region_concept_id" : "CifL_Rzy_Mku",
        "region" : "Stockholms län",
        "country_code" : "199",
        "region_code" : "01",
        "municipality_concept_id" : "AvNB_uwa_6n6",
        "country_concept_id" : "i46j_HmG_v64",
        "municipality_code" : "0180",
        "street_address" : null,
        "country" : "Sverige"
      },
      "id" : "26350744",
      "experience_required" : false,
      "working_hours_type" : {
        "concept_id" : null,
        "label" : null,
        "legacy_ams_taxonomy_id" : null
      },
      "access" : null,
      "timestamp" : 1658740345280,
      "must_have" : {
        "education_level" : [ ],
        "work_experiences" : [ ],
        "skills" : [ ],
        "education" : [ ],
        "languages" : [ ]
      },
      "occupation_field" : {
        "concept_id" : "ScKy_FHB_7wT",
        "label" : "Hotell, restaurang, storhushåll",
        "legacy_ams_taxonomy_id" : "7"
      },
      "scope_of_work" : {
        "min" : 0,
        "max" : null
      },
      "salary_type" : {
        "concept_id" : "oG8G_9cW_nRf",
        "label" : "Fast månads- vecko- eller timlön",
        "legacy_ams_taxonomy_id" : "1"
      },
      "removed" : false,
      "salary_description" : null,
      "access_to_own_car" : false,
      "publication_date" : "2022-07-25T11:12:25"
    },
    "name" : "Kassör/ Plock och servering",
    "user" : "hannes"
  },
  "sha1" : "f319914c8ed10c48b727954fc702ca61cded7fce",
  "annotations" : [ {
    "preferred-label" : "Restaurang, servering",
    "type" : "keyword",
    "start-position" : 18,
    "end-position" : 27,
    "concept-id" : "GqXD_ArB_Mmg",
    "matched-string" : "servering",
    "annotation-id" : 5
  }, {
    "preferred-label" : "Restaurang, servering",
    "type" : "keyword",
    "start-position" : 211,
    "end-position" : 220,
    "concept-id" : "GqXD_ArB_Mmg",
    "matched-string" : "servering",
    "annotation-id" : 6
  }, {
    "preferred-label" : "Svenska",
    "sentiment" : "MUST_HAVE",
    "type" : "language",
    "start-position" : 516,
    "end-position" : 523,
    "concept-id" : "zSLA_vw2_FXN",
    "matched-string" : "svenska",
    "annotation-id" : 0
  }, {
    "preferred-label" : "Arabiska",
    "sentiment" : "MUST_HAVE",
    "type" : "keyword",
    "start-position" : 565,
    "end-position" : 573,
    "concept-id" : "kk6U_YGD_4wb",
    "matched-string" : "arabiska",
    "annotation-id" : 1
  }, {
    "preferred-label" : "Engelska",
    "sentiment" : "MUST_HAVE",
    "type" : "keyword",
    "start-position" : 578,
    "end-position" : 586,
    "concept-id" : "xiD7_snJ_D8x",
    "matched-string" : "engelska",
    "annotation-id" : 2
  }, {
    "preferred-label" : "Restaurang",
    "sentiment" : "MUST_HAVE",
    "type" : "keyword",
    "start-position" : 696,
    "end-position" : 706,
    "concept-id" : "o2Cg_3Ap_qvK",
    "matched-string" : "restaurang",
    "annotation-id" : 3
  }, {
    "preferred-label" : "Timanställning",
    "sentiment" : "MUST_HAVE",
    "type" : "keyword",
    "start-position" : 723,
    "end-position" : 737,
    "concept-id" : "kfXw_Vmt_Zzk",
    "matched-string" : "timanställning",
    "annotation-id" : 4
  } ],
  "text" : "Kassör/ Plock och servering\nMeet a Student är en jobbplattform för studenter och juniora talanger. \nFör kunds räkning söker vi nu:\nNu söker Sook i Mall of Scandinavia en person som kansör och jobb vid plock och servering på restaurangen. \nArbetsuppgifterna innebär att personen tar emot kunder vid kassan och vid olika tillfällen (när det behövs) plockar samt gör rent borden. \nSom kassör och plock och serverare letar Sook efter någon som är självdriven, flexibel och utåtriktad. Personen skall samt kunna flytande svenska: det är samt meriterande om personen kan arabiska och engelska. \nPersonen ska ha erfarenhet inom tidigare kassajobb och det är meriterande om personen samt har jobbat inom restaurang förut\nJobbform: timanställning \nLön: Förhandlingsbar"
}