{
  "meta" : {
    "jobad" : {
      "description" : {
        "requirements" : null,
        "needs" : null,
        "company_information" : null,
        "text_formatted" : "<p><strong>Skidorten Lofsdalen</strong> brukar kallas \"den lilla byn med den stora skidåkningen\". Lofsdalen ligger i Härjedalen, 50 mil ifrån Sthlm. Fjället erbjuder fantastisk skidåkning med Sveriges tredje högsta fallhöjd (492 m) ifrån toppen på 1125 m.ö.h</p><p>Lofsdalen har ett hjärta som logga. Ett hjärta som betyder äkthet, kärlek, passion, personligt och genuint engagemang. Vi är en skidort som berör och som skapar oförglömliga minnen och upplevelser.</p><p><br></p><p><strong>Lofsdalens Fjällanläggningar AB </strong>driver skidanläggningen med hjälp av 9 liftar (varav 2 moderna 6-stolsliftar) och 25 nedfarter. Förutom dessa har vi Sportshop, Skiduthyrning, Skidskola, Aktiviteter, Kommersiellt boende, Bikepark, Skybar, Padelhall m.m. Vi är totalt ca 65 anställda varav ca 15 på helår och övriga på säsong. Personalbostad finns att hyra.</p><p><strong>Säsongsanställning.</strong></p><p><strong>Som liftskötare</strong> ingår du i vår Servicegrupp med hela fjället som arbetsplats. Ni genomför b.l.a. daglig-, veck- och månadskontroller på liftarna.</p><p>Rep och underhåll samt service på alla anläggningens liftar. Åker på driftstopp, felsökning, snöläggning, service på skotrar och fordon, evakuering av stolsliftarna, allmänt underhåll av anläggningen mm.</p><p>Du ska vara engagerad, stresstålig, inte rädd för att ta i, älska att vara ute och vara mycket serviceinriktad. Du är noggrann, händig och teknisk kunnig och vara en duktig problemlösare. Du gillar ett varierat arbete med mycket eget ansvar.</p><p><strong>Meriterande är:</strong> arbete som Liftskötare, arbete som liftvärd, Liftskötarutbildning, arbete som snöläggare, evakueringsutbildning, mastutbildning mm</p><p>Så söker du ett mycket varierande arbete i vacker fjällmiljö, tveka inte att skicka in en ansökan!  </p><p><strong>Vi kallar på intervjuer, löpande. </strong>I enlighet med GDPR så förbehåller vi oss rätten att behålla din ansöka tills dess att tjänsterna är tillsatta.</p><p><br></p><p><strong>I din ansökan vill vi se, personligt brev, CV, referenser och bild.</strong></p>",
        "conditions" : null,
        "text" : "Skidorten Lofsdalen brukar kallas \"den lilla byn med den stora skidåkningen\". Lofsdalen ligger i Härjedalen, 50 mil ifrån Sthlm. Fjället erbjuder fantastisk skidåkning med Sveriges tredje högsta fallhöjd (492 m) ifrån toppen på 1125 m.ö.h\nLofsdalen har ett hjärta som logga. Ett hjärta som betyder äkthet, kärlek, passion, personligt och genuint engagemang. Vi är en skidort som berör och som skapar oförglömliga minnen och upplevelser.\n\n\nLofsdalens Fjällanläggningar AB driver skidanläggningen med hjälp av 9 liftar (varav 2 moderna 6-stolsliftar) och 25 nedfarter. Förutom dessa har vi Sportshop, Skiduthyrning, Skidskola, Aktiviteter, Kommersiellt boende, Bikepark, Skybar, Padelhall m.m. Vi är totalt ca 65 anställda varav ca 15 på helår och övriga på säsong. Personalbostad finns att hyra.\nSäsongsanställning.\nSom liftskötare ingår du i vår Servicegrupp med hela fjället som arbetsplats. Ni genomför b.l.a. daglig-, veck- och månadskontroller på liftarna.\nRep och underhåll samt service på alla anläggningens liftar. Åker på driftstopp, felsökning, snöläggning, service på skotrar och fordon, evakuering av stolsliftarna, allmänt underhåll av anläggningen mm.\nDu ska vara engagerad, stresstålig, inte rädd för att ta i, älska att vara ute och vara mycket serviceinriktad. Du är noggrann, händig och teknisk kunnig och vara en duktig problemlösare. Du gillar ett varierat arbete med mycket eget ansvar.\nMeriterande är: arbete som Liftskötare, arbete som liftvärd, Liftskötarutbildning, arbete som snöläggare, evakueringsutbildning, mastutbildning mm\nSå söker du ett mycket varierande arbete i vacker fjällmiljö, tveka inte att skicka in en ansökan!  \nVi kallar på intervjuer, löpande. I enlighet med GDPR så förbehåller vi oss rätten att behålla din ansöka tills dess att tjänsterna är tillsatta.\n\n\nI din ansökan vill vi se, personligt brev, CV, referenser och bild."
      },
      "headline" : "Liftskötare i Lofsdalen (säsongsanställning vinter) ",
      "driving_license" : null,
      "employer" : {
        "email" : null,
        "phone_number" : null,
        "organization_number" : "5560894924",
        "name" : "Lofsdalens Fjällanläggningar AB",
        "url" : "http://www.lofsdalen.com",
        "workplace" : "Lofsdalens Fjällanläggningar AB"
      },
      "removed_date" : null,
      "logo_url" : "https://www.arbetsformedlingen.se/rest/arbetsgivare/rest/af/v3/arbetsplatser/10186933/logotyper/logo.png",
      "last_publication_date" : "2022-09-11T23:59:59",
      "number_of_vacancies" : 1,
      "occupation" : {
        "concept_id" : "NSKr_t8j_Ns1",
        "label" : "Liftskötare",
        "legacy_ams_taxonomy_id" : "1333"
      },
      "occupation_group" : {
        "concept_id" : "XYzP_5Tn_7Ep",
        "label" : "Kranförare m.fl.",
        "legacy_ams_taxonomy_id" : "8343"
      },
      "employment_type" : {
        "concept_id" : "Jh8f_q9J_pbJ",
        "label" : "Sommarjobb / feriejobb",
        "legacy_ams_taxonomy_id" : "2"
      },
      "webpage_url" : "https://arbetsformedlingen.se/platsbanken/annonser/26302501",
      "driving_license_required" : false,
      "application_contacts" : [ {
        "description" : null,
        "email" : "jonny.larsson@lofsdalen.com",
        "telephone" : "068055303, 0768288700",
        "name" : "Jonny Larsson",
        "contact_type" : "Platschef"
      } ],
      "duration" : {
        "concept_id" : "Xj7x_7yZ_jEn",
        "label" : "3 månader – upp till 6 månader",
        "legacy_ams_taxonomy_id" : "3"
      },
      "nice_to_have" : {
        "education_level" : [ ],
        "work_experiences" : [ ],
        "skills" : [ {
          "concept_id" : "wzfZ_xQE_6Y1",
          "weight" : 5,
          "label" : "Skidliftskötsel",
          "legacy_ams_taxonomy_id" : "606953"
        } ],
        "education" : [ ],
        "languages" : [ {
          "concept_id" : "yGZ2_39H_oPN",
          "weight" : 5,
          "label" : "Danska",
          "legacy_ams_taxonomy_id" : "274"
        }, {
          "concept_id" : "S368_jFS_2hP",
          "weight" : 5,
          "label" : "Tyska",
          "legacy_ams_taxonomy_id" : "484"
        }, {
          "concept_id" : "b9cE_KXy_Yxv",
          "weight" : 5,
          "label" : "Italienska",
          "legacy_ams_taxonomy_id" : "322"
        } ]
      },
      "application_details" : {
        "via_af" : false,
        "email" : "jonny.larsson@lofsdalen.com",
        "other" : null,
        "reference" : "Liftskötare",
        "url" : null,
        "information" : null
      },
      "source_type" : "VIA_ANNONSERA",
      "application_deadline" : "2022-09-11T23:59:59",
      "external_id" : null,
      "workplace_address" : {
        "coordinates" : [ 13.295613792026442, 62.11372156822095 ],
        "city" : "Lofsdalen",
        "postcode" : "84296",
        "municipality" : "Härjedalen",
        "region_concept_id" : "65Ms_7r1_RTG",
        "region" : "Jämtlands län",
        "country_code" : "199",
        "region_code" : "23",
        "municipality_concept_id" : "j35Q_VKL_NiM",
        "country_concept_id" : "i46j_HmG_v64",
        "municipality_code" : "2361",
        "street_address" : "Högbäcksvägen 3",
        "country" : "Sverige"
      },
      "id" : "26302501",
      "experience_required" : true,
      "working_hours_type" : {
        "concept_id" : "6YE1_gAC_R2G",
        "label" : "Heltid",
        "legacy_ams_taxonomy_id" : "1"
      },
      "access" : null,
      "timestamp" : 1657177700289,
      "must_have" : {
        "education_level" : [ ],
        "work_experiences" : [ {
          "concept_id" : "NSKr_t8j_Ns1",
          "weight" : 10,
          "label" : "Liftskötare",
          "legacy_ams_taxonomy_id" : "1333"
        } ],
        "skills" : [ ],
        "education" : [ ],
        "languages" : [ {
          "concept_id" : "zSLA_vw2_FXN",
          "weight" : 10,
          "label" : "Svenska",
          "legacy_ams_taxonomy_id" : "502"
        } ]
      },
      "occupation_field" : {
        "concept_id" : "j7Cq_ZJe_GkT",
        "label" : "Bygg och anläggning",
        "legacy_ams_taxonomy_id" : "2"
      },
      "scope_of_work" : {
        "min" : 0,
        "max" : 100
      },
      "salary_type" : {
        "concept_id" : "oG8G_9cW_nRf",
        "label" : "Fast månads- vecko- eller timlön",
        "legacy_ams_taxonomy_id" : "1"
      },
      "removed" : false,
      "salary_description" : null,
      "access_to_own_car" : false,
      "publication_date" : "2022-07-07T09:08:20"
    },
    "name" : "Liftskötare i Lofsdalen (säsongsanställning vinter) ",
    "user" : "hannes"
  },
  "sha1" : "5639604978adcac6d96f4833ba4f21b4e3fad84a",
  "annotations" : [ {
    "preferred-label" : "Liftskötare/Lifttekniker",
    "sentiment" : "MUST_HAVE",
    "type" : "occupation-name",
    "start-position" : 0,
    "end-position" : 11,
    "concept-id" : "PNes_JEh_hiT",
    "matched-string" : "liftskötare",
    "annotation-id" : 0
  }, {
    "preferred-label" : "Säsongsanställning",
    "type" : "employment-type",
    "start-position" : 25,
    "end-position" : 43,
    "concept-id" : "EBhX_Qm2_8eX",
    "matched-string" : "säsongsanställning",
    "annotation-id" : 5
  }, {
    "preferred-label" : "Säsongsanställning",
    "type" : "employment-type",
    "start-position" : 848,
    "end-position" : 866,
    "concept-id" : "EBhX_Qm2_8eX",
    "matched-string" : "Säsongsanställning",
    "annotation-id" : 6
  }, {
    "preferred-label" : "Liftskötare/Lifttekniker",
    "sentiment" : "MUST_HAVE",
    "type" : "occupation-name",
    "start-position" : 872,
    "end-position" : 883,
    "concept-id" : "PNes_JEh_hiT",
    "matched-string" : "liftskötare",
    "annotation-id" : 1
  }, {
    "preferred-label" : "göra felsökning",
    "type" : "esco-skill",
    "start-position" : 1095,
    "end-position" : 1105,
    "concept-id" : "HqC8_fVY_ACM",
    "matched-string" : "felsökning",
    "annotation-id" : 7
  }, {
    "preferred-label" : "hantera stress",
    "type" : "esco-skill",
    "start-position" : 1241,
    "end-position" : 1252,
    "concept-id" : "z5Zo_DVb_VEK",
    "matched-string" : "stresstålig",
    "annotation-id" : 8
  }, {
    "preferred-label" : "noggrannhet",
    "type" : "esco-skill",
    "start-position" : 1336,
    "end-position" : 1344,
    "concept-id" : "mrsW_EkL_KRD",
    "matched-string" : "noggrann",
    "annotation-id" : 9
  }, {
    "preferred-label" : "Liftskötare/Lifttekniker",
    "sentiment" : "MUST_HAVE",
    "type" : "occupation-name",
    "start-position" : 1487,
    "end-position" : 1498,
    "concept-id" : "PNes_JEh_hiT",
    "matched-string" : "liftskötare",
    "annotation-id" : 2
  }, {
    "preferred-label" : "Liftvärd",
    "sentiment" : "MUST_HAVE",
    "type" : "keyword",
    "start-position" : 1511,
    "end-position" : 1519,
    "concept-id" : "xJgc_5LZ_iXt",
    "matched-string" : "liftvärd",
    "annotation-id" : 3
  }, {
    "preferred-label" : "Snöläggare",
    "sentiment" : "MUST_HAVE",
    "type" : "occupation-name",
    "start-position" : 1554,
    "end-position" : 1564,
    "concept-id" : "suGr_ne2_iCz",
    "matched-string" : "snöläggare",
    "annotation-id" : 4
  } ],
  "text" : "Liftskötare i Lofsdalen (säsongsanställning vinter) \nSkidorten Lofsdalen brukar kallas \"den lilla byn med den stora skidåkningen\". Lofsdalen ligger i Härjedalen, 50 mil ifrån Sthlm. Fjället erbjuder fantastisk skidåkning med Sveriges tredje högsta fallhöjd (492 m) ifrån toppen på 1125 m.ö.h\nLofsdalen har ett hjärta som logga. Ett hjärta som betyder äkthet, kärlek, passion, personligt och genuint engagemang. Vi är en skidort som berör och som skapar oförglömliga minnen och upplevelser.\n\n\nLofsdalens Fjällanläggningar AB driver skidanläggningen med hjälp av 9 liftar (varav 2 moderna 6-stolsliftar) och 25 nedfarter. Förutom dessa har vi Sportshop, Skiduthyrning, Skidskola, Aktiviteter, Kommersiellt boende, Bikepark, Skybar, Padelhall m.m. Vi är totalt ca 65 anställda varav ca 15 på helår och övriga på säsong. Personalbostad finns att hyra.\nSäsongsanställning.\nSom liftskötare ingår du i vår Servicegrupp med hela fjället som arbetsplats. Ni genomför b.l.a. daglig-, veck- och månadskontroller på liftarna.\nRep och underhåll samt service på alla anläggningens liftar. Åker på driftstopp, felsökning, snöläggning, service på skotrar och fordon, evakuering av stolsliftarna, allmänt underhåll av anläggningen mm.\nDu ska vara engagerad, stresstålig, inte rädd för att ta i, älska att vara ute och vara mycket serviceinriktad. Du är noggrann, händig och teknisk kunnig och vara en duktig problemlösare. Du gillar ett varierat arbete med mycket eget ansvar.\nMeriterande är: arbete som Liftskötare, arbete som liftvärd, Liftskötarutbildning, arbete som snöläggare, evakueringsutbildning, mastutbildning mm\nSå söker du ett mycket varierande arbete i vacker fjällmiljö, tveka inte att skicka in en ansökan!  \nVi kallar på intervjuer, löpande. I enlighet med GDPR så förbehåller vi oss rätten att behålla din ansöka tills dess att tjänsterna är tillsatta.\n\n\nI din ansökan vill vi se, personligt brev, CV, referenser och bild."
}