{
  "meta" : {
    "jobad" : {
      "description" : {
        "requirements" : null,
        "needs" : null,
        "company_information" : null,
        "text_formatted" : "<p>För kunds räkning söker vi en Barchef till en restaurang  i Stockholm</p><p>Vi erbjuder ett stabilt företag med friska utmaningar och långsiktigt utvecklande med sunda värderingar på att bli ett trivsam och trevligt ställe med stort sortiment av drycker.</p><p>Vi söker en person med FLERA ÅRS erfarenhet av yrket med både husman och exklusivare sortiment du är en lagspelare kan ekonomi har stort kundfokus och vill leverera en säljande bar med det lilla extra.</p><p>Du som känner dig träffad är välkommen med din cv till oss så berättar vi mer om tjänsten vid eventuell intervju</p><p><br></p>",
        "conditions" : null,
        "text" : "För kunds räkning söker vi en Barchef till en restaurang  i Stockholm\nVi erbjuder ett stabilt företag med friska utmaningar och långsiktigt utvecklande med sunda värderingar på att bli ett trivsam och trevligt ställe med stort sortiment av drycker.\nVi söker en person med FLERA ÅRS erfarenhet av yrket med både husman och exklusivare sortiment du är en lagspelare kan ekonomi har stort kundfokus och vill leverera en säljande bar med det lilla extra.\nDu som känner dig träffad är välkommen med din cv till oss så berättar vi mer om tjänsten vid eventuell intervju"
      },
      "headline" : "Barchef till  Stockholm med stor vinkunskap",
      "driving_license" : null,
      "employer" : {
        "email" : null,
        "phone_number" : null,
        "organization_number" : "5569100190",
        "name" : "Personalkompetens i Sverige AB",
        "url" : null,
        "workplace" : "Personalkompetens i Sverige AB"
      },
      "removed_date" : null,
      "logo_url" : null,
      "last_publication_date" : "2022-09-12T23:59:59",
      "number_of_vacancies" : 1,
      "occupation" : {
        "concept_id" : "4ZeS_9Z9_wmL",
        "label" : "Hovmästare",
        "legacy_ams_taxonomy_id" : "5486"
      },
      "occupation_group" : {
        "concept_id" : "UjoW_meY_Zwt",
        "label" : "Hovmästare och servitörer",
        "legacy_ams_taxonomy_id" : "5131"
      },
      "employment_type" : {
        "concept_id" : "PFZr_Syz_cUq",
        "label" : "Vanlig anställning",
        "legacy_ams_taxonomy_id" : "1"
      },
      "webpage_url" : "https://arbetsformedlingen.se/platsbanken/annonser/26381258",
      "driving_license_required" : false,
      "application_contacts" : [ ],
      "duration" : {
        "concept_id" : "a7uU_j21_mkL",
        "label" : "Tills vidare",
        "legacy_ams_taxonomy_id" : "1"
      },
      "nice_to_have" : {
        "education_level" : [ ],
        "work_experiences" : [ ],
        "skills" : [ ],
        "education" : [ ],
        "languages" : [ ]
      },
      "application_details" : {
        "via_af" : false,
        "email" : "ks@kompetentpersonal.se",
        "other" : null,
        "reference" : null,
        "url" : null,
        "information" : null
      },
      "source_type" : "VIA_ANNONSERA",
      "application_deadline" : "2022-09-12T23:59:59",
      "external_id" : null,
      "workplace_address" : {
        "coordinates" : [ null, null ],
        "city" : null,
        "postcode" : null,
        "municipality" : "Stockholm",
        "region_concept_id" : "CifL_Rzy_Mku",
        "region" : "Stockholms län",
        "country_code" : "199",
        "region_code" : "01",
        "municipality_concept_id" : "AvNB_uwa_6n6",
        "country_concept_id" : "i46j_HmG_v64",
        "municipality_code" : "0180",
        "street_address" : null,
        "country" : "Sverige"
      },
      "id" : "26381258",
      "experience_required" : true,
      "working_hours_type" : {
        "concept_id" : "6YE1_gAC_R2G",
        "label" : "Heltid",
        "legacy_ams_taxonomy_id" : "1"
      },
      "access" : null,
      "timestamp" : 1660378790275,
      "must_have" : {
        "education_level" : [ ],
        "work_experiences" : [ {
          "concept_id" : "4ZeS_9Z9_wmL",
          "weight" : 10,
          "label" : "Hovmästare",
          "legacy_ams_taxonomy_id" : "5486"
        } ],
        "skills" : [ ],
        "education" : [ ],
        "languages" : [ ]
      },
      "occupation_field" : {
        "concept_id" : "ScKy_FHB_7wT",
        "label" : "Hotell, restaurang, storhushåll",
        "legacy_ams_taxonomy_id" : "7"
      },
      "scope_of_work" : {
        "min" : 0,
        "max" : 100
      },
      "salary_type" : {
        "concept_id" : "oG8G_9cW_nRf",
        "label" : "Fast månads- vecko- eller timlön",
        "legacy_ams_taxonomy_id" : "1"
      },
      "removed" : false,
      "salary_description" : null,
      "access_to_own_car" : false,
      "publication_date" : "2022-08-13T10:19:50"
    },
    "name" : "Barchef till  Stockholm med stor vinkunskap",
    "user" : "hannes"
  },
  "sha1" : "4e67f3423373509a1fc90ee4ff7363504f8d9ee7",
  "annotations" : [ {
    "preferred-label" : "Barchef",
    "sentiment" : "MUST_HAVE",
    "type" : "occupation-name",
    "start-position" : 0,
    "end-position" : 7,
    "concept-id" : "Pppw_ySf_9m7",
    "matched-string" : "barchef",
    "annotation-id" : 0
  }, {
    "preferred-label" : "Stockholm",
    "sentiment" : "NOT_RELEVANT",
    "type" : "municipality",
    "start-position" : 14,
    "end-position" : 23,
    "concept-id" : "AvNB_uwa_6n6",
    "matched-string" : "Stockholm",
    "annotation-id" : 5
  }, {
    "preferred-label" : "Vinkunskap",
    "sentiment" : "MUST_HAVE",
    "type" : "skill",
    "start-position" : 33,
    "end-position" : 43,
    "concept-id" : "SogP_82Z_66E",
    "matched-string" : "vinkunskap",
    "annotation-id" : 1
  }, {
    "preferred-label" : "Barchef",
    "sentiment" : "MUST_HAVE",
    "type" : "occupation-name",
    "start-position" : 74,
    "end-position" : 81,
    "concept-id" : "Pppw_ySf_9m7",
    "matched-string" : "barchef",
    "annotation-id" : 2
  }, {
    "preferred-label" : "Restaurang",
    "sentiment" : "NOT_RELEVANT",
    "type" : "keyword",
    "start-position" : 90,
    "end-position" : 100,
    "concept-id" : "o2Cg_3Ap_qvK",
    "matched-string" : "restaurang",
    "annotation-id" : 3
  }, {
    "preferred-label" : "Stockholm",
    "sentiment" : "NOT_RELEVANT",
    "type" : "municipality",
    "start-position" : 104,
    "end-position" : 113,
    "concept-id" : "AvNB_uwa_6n6",
    "matched-string" : "Stockholm",
    "annotation-id" : 6
  }, {
    "preferred-label" : "5 års erfarenhet eller mer",
    "sentiment" : "MUST_HAVE",
    "type" : "occupation-experience-year",
    "start-position" : 316,
    "end-position" : 336,
    "concept-id" : "8CVf_zRX_aZj",
    "matched-string" : "FLERA ÅRS erfarenhet",
    "annotation-id" : 7
  }, {
    "preferred-label" : "Husmanskost",
    "sentiment" : "MUST_HAVE",
    "type" : "skill",
    "start-position" : 355,
    "end-position" : 361,
    "concept-id" : "HfAs_ZWA_Jvv",
    "matched-string" : "husman",
    "annotation-id" : 8
  }, {
    "preferred-label" : "Ekonomi",
    "sentiment" : "MUST_HAVE",
    "type" : "keyword",
    "start-position" : 412,
    "end-position" : 419,
    "concept-id" : "PW4f_bmT_new",
    "matched-string" : "ekonomi",
    "annotation-id" : 4
  } ],
  "text" : "Barchef till  Stockholm med stor vinkunskap\nFör kunds räkning söker vi en Barchef till en restaurang  i Stockholm\nVi erbjuder ett stabilt företag med friska utmaningar och långsiktigt utvecklande med sunda värderingar på att bli ett trivsam och trevligt ställe med stort sortiment av drycker.\nVi söker en person med FLERA ÅRS erfarenhet av yrket med både husman och exklusivare sortiment du är en lagspelare kan ekonomi har stort kundfokus och vill leverera en säljande bar med det lilla extra.\nDu som känner dig träffad är välkommen med din cv till oss så berättar vi mer om tjänsten vid eventuell intervju"
}