{
  "meta" : {
    "jobad" : {
      "description" : {
        "requirements" : null,
        "needs" : null,
        "company_information" : null,
        "text_formatted" : "Hos oss får du chansen att jobba med unika system som verkligen har betydelse för framtiden. Vill du bidra till samhällsnytta på en arbetsplats med engagerade och stöttande kollegor? Då är Transportstyrelsen arbetsplatsen för dig.\n\nVi står just nu inför ett av våra mest spännande utvecklingsuppdrag och det största i myndighetens historia. Vi ska börja bygga ett nytt, modernt och robust vägtrafikregister – ett samhällsviktigt system som måste vara tillgängligt dygnet runt och året om för att försörja myndigheter, branscher, företag och medborgare med information om fordon, dess ägare och körkortsinnehavare. Det här tillsammans med att vi håller på att etablera egen it-drift och utveckla vårt långsiktiga it-säkerhetsarbete, innebär att vi behöver bli fler!\n\nOm jobbet\nVi söker medarbetare med kompetens inom området Active Directory som vill vara med att vidareutveckla våra it-miljöer och att bygga upp myndighetens driftsorganisation för att framöver kunna hantera större åtaganden kring intern drift.\n\nI din roll kommer du att utveckla, konfigurera och förvalta lösningar kring Active Directory och vår behörighetshantering. Du kommer att ingå i ett team och får möjlighet att vara med och forma myndighetens framtida lösningar inom området.\n\nVi tror att du lockas att vara med på en spännande resa med en it-driftsmiljö och organisation under omfattande utveckling. Vi tror också att du sporras av utmaningar i vardagen och att leverera säkra, hållbara och effektiva lösningar inom ditt verksamhetsområde.\n\nVi är i ett uppbyggnadsskede med många spännande utmaningar och vi vill att du som söker, precis som vi, gillar förändring och ny teknik!\n\nHos oss är du viktig\nGillar du att jobba tillsammans med andra och vill du utvecklas i din yrkesroll? Hos oss kan du förvänta dig karriärsutveckling, ett förtroendefullt chefs- och medarbetarskap och ett hållbart arbetsliv. Vi är en trygg arbetsgivare som månar om din hälsa med tid för friskvård på arbetstid, flexibla arbetstider, väl tilltaget antal semesterdagar och lediga klämdagar.\n\nLäs mer om hur det är att jobba inom it på Transportstyrelsen\n\nDu kommer att\n\n• agera som teknisk specialist och delta i vidareutveckling och förvaltning inom ADDS tillsammans med teamet\n• ta fram kravspecifikationer, instruktioner och dokumentation\n• initiera, driva och delta i förbättrings- och förändringsarbeten\n• samarbeta med övriga organisationen för vidareutveckling, förvaltning samt införande av nya plattformar eller tjänster\n• omvärldsbevaka området ur ett tekniskt perspektiv och föreslå förbättringar.\n\nDu måste ha\n\n• en akademisk examen inom it-tekniskt område eller motsvarande kunskaper förvärvade på annat sätt\n• erfarenhet av arbete med ADDS, t ex kontohantering, DNS, GPO samt DFS\n• goda kunskaper i svenska i tal och skrift.\n\nDet är meriterande om du också har\n\n• kunskaper inom System Center (Configuration Manager, Operation Manager), Windows Server\n• kunskaper inom certifikathantering/PKI/ADCS, ”Active Directory Certificate Services”\n• erfarenhet av IAM-verktyg (Identity Access Management)\n• erfarenhet av flerfaktorsautentisering\n• erfarenhet av ADFS och federationer\n• arbetat i organisationer med högt ställda säkerhetskrav\n• erfarenhet av att arbeta med standarder och/eller policies gällande it-säkerhet eller informationssäkerhet.\n\nVi vill att du\n\n• har ett högt säkerhetsmedvetande\n• är prestigelös och gärna delar med dig av kunskaper och erfarenheter\n• är självgående med högt engagemang och tar stort ansvar för det du gör\n• är strukturerad och ordningsam\n• eftersträvar att ständigt bli bättre och är ansvarstagande för din och teamets vidareutveckling.\n\nStor vikt läggs vid personlig lämplighet.\n\nMer information\nAnställningen är tillsvidare med placering i Örebro. Tillträde enligt överenskommelse. Vi tillämpar normalt provanställning. Anställningen är placerad i säkerhetsklass och säkerhetsprövning enligt säkerhetsskyddslagen (2018:585) kommer att genomföras.\n\nVid frågor är du välkommen att kontakta sektionschef Mats Kvarnström, mats.kvarnstrom@transportstyrelsen.se. Han nås från 15 augusti.\n\nSaco, Peter Tang eller Anneli Hjalmarsson och ST, Axel Frick nås via vår växel på 0771-503 503.\n\n Vi vill inte att annonsörer och bemanningsföretag kontaktar oss.\n\nAnsök\nAnsök via vår webbplats och bifoga ditt CV samt ett personligt brev märkt med referensnummer TSG 2022-6506.  Vi behöver din ansökan senast den 4 september 2022. Vi gör första urvalet utifrån de frågor som du får svara på i vårt e-rekryteringssystem och kan komma att använda urvalstest.\n\nVälkommen att bli vår nya kollega!\nKort om Transportstyrelsen\n\nAntal anställda:\nCa 2000.\n\nVerksamhetsområden:\nTransportstyrelsen arbetar för att uppnå god tillgänglighet, hög kvalitet, säkra och miljöanpassade transporter inom järnväg, luftfart, sjöfart och väg. Vi tar fram regler, ger tillstånd och följer upp hur de efterlevs. Med hjälp av våra register arbetar vi bland annat med avgifter, tillstånd och ägarbyten.\n\nVerksamhetsorter:\nVi har medarbetare på 12 orter i landet. Den största delen av verksamheten finns i Borlänge, Norrköping och Örebro.\n\nHuvudkontoret ligger i Norrköping.\n\nLäs mer om Transportstyrelsen\n\n\nKort om avdelning It\n\nAvdelning It består av fem enheter med tillhörande sektioner. Vi är cirka 300 medarbetare och finns i Örebro, Borlänge och Norrköping.\n\nVi stöder samtliga avdelningar inom Transportstyrelsen både strategiskt och operativt i it-frågor. Vi arbetar med arkitektur, systemutveckling, förvaltning och drift av it-system samt infrastruktur.",
        "conditions" : "Heltid/\r\nEj specificerat",
        "text" : "Hos oss får du chansen att jobba med unika system som verkligen har betydelse för framtiden. Vill du bidra till samhällsnytta på en arbetsplats med engagerade och stöttande kollegor? Då är Transportstyrelsen arbetsplatsen för dig.\n\nVi står just nu inför ett av våra mest spännande utvecklingsuppdrag och det största i myndighetens historia. Vi ska börja bygga ett nytt, modernt och robust vägtrafikregister – ett samhällsviktigt system som måste vara tillgängligt dygnet runt och året om för att försörja myndigheter, branscher, företag och medborgare med information om fordon, dess ägare och körkortsinnehavare. Det här tillsammans med att vi håller på att etablera egen it-drift och utveckla vårt långsiktiga it-säkerhetsarbete, innebär att vi behöver bli fler!\n\nOm jobbet\nVi söker medarbetare med kompetens inom området Active Directory som vill vara med att vidareutveckla våra it-miljöer och att bygga upp myndighetens driftsorganisation för att framöver kunna hantera större åtaganden kring intern drift.\n\nI din roll kommer du att utveckla, konfigurera och förvalta lösningar kring Active Directory och vår behörighetshantering. Du kommer att ingå i ett team och får möjlighet att vara med och forma myndighetens framtida lösningar inom området.\n\nVi tror att du lockas att vara med på en spännande resa med en it-driftsmiljö och organisation under omfattande utveckling. Vi tror också att du sporras av utmaningar i vardagen och att leverera säkra, hållbara och effektiva lösningar inom ditt verksamhetsområde.\n\nVi är i ett uppbyggnadsskede med många spännande utmaningar och vi vill att du som söker, precis som vi, gillar förändring och ny teknik!\n\nHos oss är du viktig\nGillar du att jobba tillsammans med andra och vill du utvecklas i din yrkesroll? Hos oss kan du förvänta dig karriärsutveckling, ett förtroendefullt chefs- och medarbetarskap och ett hållbart arbetsliv. Vi är en trygg arbetsgivare som månar om din hälsa med tid för friskvård på arbetstid, flexibla arbetstider, väl tilltaget antal semesterdagar och lediga klämdagar.\n\nLäs mer om hur det är att jobba inom it på Transportstyrelsen\n\nDu kommer att\n\n• agera som teknisk specialist och delta i vidareutveckling och förvaltning inom ADDS tillsammans med teamet\n• ta fram kravspecifikationer, instruktioner och dokumentation\n• initiera, driva och delta i förbättrings- och förändringsarbeten\n• samarbeta med övriga organisationen för vidareutveckling, förvaltning samt införande av nya plattformar eller tjänster\n• omvärldsbevaka området ur ett tekniskt perspektiv och föreslå förbättringar.\n\nDu måste ha\n\n• en akademisk examen inom it-tekniskt område eller motsvarande kunskaper förvärvade på annat sätt\n• erfarenhet av arbete med ADDS, t ex kontohantering, DNS, GPO samt DFS\n• goda kunskaper i svenska i tal och skrift.\n\nDet är meriterande om du också har\n\n• kunskaper inom System Center (Configuration Manager, Operation Manager), Windows Server\n• kunskaper inom certifikathantering/PKI/ADCS, ”Active Directory Certificate Services”\n• erfarenhet av IAM-verktyg (Identity Access Management)\n• erfarenhet av flerfaktorsautentisering\n• erfarenhet av ADFS och federationer\n• arbetat i organisationer med högt ställda säkerhetskrav\n• erfarenhet av att arbeta med standarder och/eller policies gällande it-säkerhet eller informationssäkerhet.\n\nVi vill att du\n\n• har ett högt säkerhetsmedvetande\n• är prestigelös och gärna delar med dig av kunskaper och erfarenheter\n• är självgående med högt engagemang och tar stort ansvar för det du gör\n• är strukturerad och ordningsam\n• eftersträvar att ständigt bli bättre och är ansvarstagande för din och teamets vidareutveckling.\n\nStor vikt läggs vid personlig lämplighet.\n\nMer information\nAnställningen är tillsvidare med placering i Örebro. Tillträde enligt överenskommelse. Vi tillämpar normalt provanställning. Anställningen är placerad i säkerhetsklass och säkerhetsprövning enligt säkerhetsskyddslagen (2018:585) kommer att genomföras.\n\nVid frågor är du välkommen att kontakta sektionschef Mats Kvarnström, mats.kvarnstrom@transportstyrelsen.se. Han nås från 15 augusti.\n\nSaco, Peter Tang eller Anneli Hjalmarsson och ST, Axel Frick nås via vår växel på 0771-503 503.\n\n Vi vill inte att annonsörer och bemanningsföretag kontaktar oss.\n\nAnsök\nAnsök via vår webbplats och bifoga ditt CV samt ett personligt brev märkt med referensnummer TSG 2022-6506.  Vi behöver din ansökan senast den 4 september 2022. Vi gör första urvalet utifrån de frågor som du får svara på i vårt e-rekryteringssystem och kan komma att använda urvalstest.\n\nVälkommen att bli vår nya kollega!\nKort om Transportstyrelsen\n\nAntal anställda:\nCa 2000.\n\nVerksamhetsområden:\nTransportstyrelsen arbetar för att uppnå god tillgänglighet, hög kvalitet, säkra och miljöanpassade transporter inom järnväg, luftfart, sjöfart och väg. Vi tar fram regler, ger tillstånd och följer upp hur de efterlevs. Med hjälp av våra register arbetar vi bland annat med avgifter, tillstånd och ägarbyten.\n\nVerksamhetsorter:\nVi har medarbetare på 12 orter i landet. Den största delen av verksamheten finns i Borlänge, Norrköping och Örebro.\n\nHuvudkontoret ligger i Norrköping.\n\nLäs mer om Transportstyrelsen\n\n\nKort om avdelning It\n\nAvdelning It består av fem enheter med tillhörande sektioner. Vi är cirka 300 medarbetare och finns i Örebro, Borlänge och Norrköping.\n\nVi stöder samtliga avdelningar inom Transportstyrelsen både strategiskt och operativt i it-frågor. Vi arbetar med arkitektur, systemutveckling, förvaltning och drift av it-system samt infrastruktur."
      },
      "headline" : "Systemtekniker inom Active Directory",
      "driving_license" : null,
      "employer" : {
        "email" : null,
        "phone_number" : null,
        "organization_number" : "2021006099",
        "name" : "Transportstyrelsen",
        "url" : "http://www.transportstyrelsen.se/",
        "workplace" : "Transportstyrelsen"
      },
      "removed_date" : null,
      "logo_url" : "https://www.arbetsformedlingen.se/rest/arbetsgivare/rest/af/v3/organisation/2021006099/logotyper/logo.png",
      "last_publication_date" : "2022-09-04T23:59:59",
      "number_of_vacancies" : 1,
      "occupation" : {
        "concept_id" : "Nkbd_wa9_TZF",
        "label" : "Nätverkstekniker",
        "legacy_ams_taxonomy_id" : "5912"
      },
      "occupation_group" : {
        "concept_id" : "VCpu_5EN_bBt",
        "label" : "Nätverks- och systemtekniker m.fl.",
        "legacy_ams_taxonomy_id" : "3514"
      },
      "employment_type" : {
        "concept_id" : "PFZr_Syz_cUq",
        "label" : "Vanlig anställning",
        "legacy_ams_taxonomy_id" : "1"
      },
      "webpage_url" : "https://arbetsformedlingen.se/platsbanken/annonser/26255966",
      "driving_license_required" : false,
      "application_contacts" : [ ],
      "duration" : {
        "concept_id" : "a7uU_j21_mkL",
        "label" : "Tills vidare",
        "legacy_ams_taxonomy_id" : "1"
      },
      "nice_to_have" : {
        "education_level" : [ ],
        "work_experiences" : [ ],
        "skills" : [ ],
        "education" : [ ],
        "languages" : [ ]
      },
      "application_details" : {
        "via_af" : false,
        "email" : null,
        "other" : null,
        "reference" : null,
        "url" : "https://web103.reachmee.com/ext/I003/391/main?site=5&validator=67fe3dd1e82f5daa8127ee1beb347301&lang=SE&rmpage=apply&rmjob=4311&ref=https%3A%2F%2Farbetsformedlingen.se%2Fplatsbanken%2F",
        "information" : null
      },
      "source_type" : "VIA_PLATSBANKEN_DXA",
      "application_deadline" : "2022-09-04T23:59:59",
      "external_id" : "46-202100-6099-4311",
      "workplace_address" : {
        "coordinates" : [ 15.21341, 59.27526 ],
        "city" : null,
        "postcode" : null,
        "municipality" : "Örebro",
        "region_concept_id" : "xTCk_nT5_Zjm",
        "region" : "Örebro län",
        "country_code" : "199",
        "region_code" : "18",
        "municipality_concept_id" : "kuMn_feU_hXx",
        "country_concept_id" : "i46j_HmG_v64",
        "municipality_code" : "1880",
        "street_address" : null,
        "country" : "Sverige"
      },
      "id" : "26255966",
      "experience_required" : true,
      "working_hours_type" : {
        "concept_id" : "6YE1_gAC_R2G",
        "label" : "Heltid",
        "legacy_ams_taxonomy_id" : "1"
      },
      "access" : null,
      "timestamp" : 1655990519483,
      "must_have" : {
        "education_level" : [ ],
        "work_experiences" : [ {
          "concept_id" : "Nkbd_wa9_TZF",
          "weight" : 10,
          "label" : "Nätverkstekniker",
          "legacy_ams_taxonomy_id" : "5912"
        } ],
        "skills" : [ ],
        "education" : [ ],
        "languages" : [ ]
      },
      "occupation_field" : {
        "concept_id" : "apaJ_2ja_LuF",
        "label" : "Data/IT",
        "legacy_ams_taxonomy_id" : "3"
      },
      "scope_of_work" : {
        "min" : 100,
        "max" : 100
      },
      "salary_type" : {
        "concept_id" : "oG8G_9cW_nRf",
        "label" : "Fast månads- vecko- eller timlön",
        "legacy_ams_taxonomy_id" : "1"
      },
      "removed" : false,
      "salary_description" : "Individuell lönesättning.",
      "access_to_own_car" : false,
      "publication_date" : "2022-08-08T00:00:00"
    },
    "name" : "Systemtekniker inom Active Directory",
    "user" : "kristof.fischer"
  },
  "sha1" : "dce5a1477d639f38673c807a0c1ac52acbed5fd1",
  "annotations" : [ {
    "preferred-label" : "Nätverkstekniker",
    "type" : "occupation-name",
    "start-position" : 0,
    "end-position" : 14,
    "concept-id" : "Nkbd_wa9_TZF",
    "matched-string" : "Systemtekniker",
    "annotation-id" : 30
  }, {
    "preferred-label" : "Active Directory, programmeringsverktyg",
    "sentiment" : "MUST_HAVE",
    "type" : "skill",
    "start-position" : 20,
    "end-position" : 36,
    "concept-id" : "xGPG_PpL_zWN",
    "matched-string" : "active directory",
    "annotation-id" : 0
  }, {
    "preferred-label" : "Active Directory, programmeringsverktyg",
    "sentiment" : "MUST_HAVE",
    "type" : "skill",
    "start-position" : 861,
    "end-position" : 877,
    "concept-id" : "xGPG_PpL_zWN",
    "matched-string" : "active directory",
    "annotation-id" : 4
  }, {
    "preferred-label" : "Active Directory, programmeringsverktyg",
    "sentiment" : "MUST_HAVE",
    "type" : "skill",
    "start-position" : 1126,
    "end-position" : 1142,
    "concept-id" : "xGPG_PpL_zWN",
    "matched-string" : "active directory",
    "annotation-id" : 6
  }, {
    "preferred-label" : "Universitets- eller högskoleutbildning",
    "sentiment" : "MUST_HAVE",
    "type" : "sni-level-4",
    "start-position" : 2621,
    "end-position" : 2637,
    "concept-id" : "m1vC_Ssq_5Y7",
    "matched-string" : "akademisk examen",
    "annotation-id" : 31
  }, {
    "preferred-label" : null,
    "sentiment" : "MUST_HAVE",
    "type" : "skill",
    "start-position" : 2742,
    "end-position" : 2746,
    "concept-id" : null,
    "matched-string" : "ADDS",
    "annotation-id" : 32
  }, {
    "preferred-label" : null,
    "sentiment" : "MUST_HAVE",
    "type" : "skill",
    "start-position" : 2769,
    "end-position" : 2772,
    "concept-id" : null,
    "matched-string" : "DNS",
    "annotation-id" : 33
  }, {
    "preferred-label" : null,
    "sentiment" : "MUST_HAVE",
    "type" : "skill",
    "start-position" : 2774,
    "end-position" : 2777,
    "concept-id" : null,
    "matched-string" : "GPO",
    "annotation-id" : 34
  }, {
    "preferred-label" : null,
    "sentiment" : "MUST_HAVE",
    "type" : "skill",
    "start-position" : 2783,
    "end-position" : 2786,
    "concept-id" : null,
    "matched-string" : "DFS",
    "annotation-id" : 35
  }, {
    "preferred-label" : "Svenska",
    "sentiment" : "MUST_HAVE",
    "type" : "language",
    "start-position" : 2806,
    "end-position" : 2813,
    "concept-id" : "zSLA_vw2_FXN",
    "matched-string" : "svenska",
    "annotation-id" : 15
  }, {
    "preferred-label" : null,
    "sentiment" : "NICE_TO_HAVE",
    "type" : "skill",
    "start-position" : 2886,
    "end-position" : 2899,
    "concept-id" : null,
    "matched-string" : "System Center",
    "annotation-id" : 36
  }, {
    "preferred-label" : "Windows Server, operativsystem",
    "sentiment" : "NICE_TO_HAVE",
    "type" : "skill",
    "start-position" : 2944,
    "end-position" : 2958,
    "concept-id" : "pnX9_gFn_CLt",
    "matched-string" : "Windows Server",
    "annotation-id" : 37
  }, {
    "preferred-label" : null,
    "sentiment" : "NICE_TO_HAVE",
    "type" : "skill",
    "start-position" : 2976,
    "end-position" : 2995,
    "concept-id" : null,
    "matched-string" : "certifikathantering",
    "annotation-id" : 38
  }, {
    "preferred-label" : null,
    "sentiment" : "NICE_TO_HAVE",
    "type" : "skill",
    "start-position" : 2996,
    "end-position" : 2999,
    "concept-id" : null,
    "matched-string" : "PKI",
    "annotation-id" : 39
  }, {
    "preferred-label" : null,
    "sentiment" : "NICE_TO_HAVE",
    "type" : "skill",
    "start-position" : 3000,
    "end-position" : 3004,
    "concept-id" : null,
    "matched-string" : "ADCS",
    "annotation-id" : 40
  }, {
    "preferred-label" : null,
    "sentiment" : "NICE_TO_HAVE",
    "type" : "skill",
    "start-position" : 3062,
    "end-position" : 3065,
    "concept-id" : null,
    "matched-string" : "IAM",
    "annotation-id" : 41
  }, {
    "preferred-label" : null,
    "sentiment" : "NICE_TO_HAVE",
    "type" : "skill",
    "start-position" : 3119,
    "end-position" : 3143,
    "concept-id" : null,
    "matched-string" : "flerfaktorsautentisering",
    "annotation-id" : 42
  }, {
    "preferred-label" : null,
    "sentiment" : "NICE_TO_HAVE",
    "type" : "skill",
    "start-position" : 3160,
    "end-position" : 3164,
    "concept-id" : null,
    "matched-string" : "ADFS",
    "annotation-id" : 43
  }, {
    "preferred-label" : "Säkerhetsfrågor",
    "sentiment" : "NICE_TO_HAVE",
    "type" : "skill",
    "start-position" : 3226,
    "end-position" : 3239,
    "concept-id" : "nu52_VXq_5MD",
    "matched-string" : "säkerhetskrav",
    "annotation-id" : 44
  }, {
    "preferred-label" : "IKT-säkerhet",
    "sentiment" : "NICE_TO_HAVE",
    "type" : "esco-skill",
    "start-position" : 3271,
    "end-position" : 3321,
    "concept-id" : "VaPH_iFx_m13",
    "matched-string" : "standarder och/eller policies gällande it-säkerhet",
    "annotation-id" : 45
  }, {
    "preferred-label" : "Informationssäkerhet",
    "sentiment" : "NICE_TO_HAVE",
    "type" : "skill",
    "start-position" : 3328,
    "end-position" : 3348,
    "concept-id" : "LqRT_TVB_RPo",
    "matched-string" : "informationssäkerhet",
    "annotation-id" : 23
  }, {
    "preferred-label" : "arbeta självständigt",
    "sentiment" : "MUST_HAVE",
    "type" : "esco-skill",
    "start-position" : 3478,
    "end-position" : 3489,
    "concept-id" : "NyFu_HHd_zhz",
    "matched-string" : "självgående",
    "annotation-id" : 46
  }, {
    "preferred-label" : "visa ansvarstagande",
    "sentiment" : "MUST_HAVE",
    "type" : "esco-skill",
    "start-position" : 3524,
    "end-position" : 3530,
    "concept-id" : "bcRp_hxV_f5G",
    "matched-string" : "ansvar",
    "annotation-id" : 47
  }, {
    "preferred-label" : "visa ansvarstagande",
    "sentiment" : "MUST_HAVE",
    "type" : "esco-skill",
    "start-position" : 3625,
    "end-position" : 3639,
    "concept-id" : "bcRp_hxV_f5G",
    "matched-string" : "ansvarstagande",
    "annotation-id" : 48
  }, {
    "preferred-label" : "Tillsvidareanställning (inkl. eventuell provanställning)",
    "type" : "employment-type",
    "start-position" : 3755,
    "end-position" : 3766,
    "concept-id" : "kpPX_CNN_gDU",
    "matched-string" : "tillsvidare",
    "annotation-id" : 49
  }, {
    "preferred-label" : "Örebro",
    "type" : "municipality",
    "start-position" : 3783,
    "end-position" : 3789,
    "concept-id" : "kuMn_feU_hXx",
    "matched-string" : "Örebro",
    "annotation-id" : 50
  }, {
    "preferred-label" : "Borlänge",
    "type" : "municipality",
    "start-position" : 5105,
    "end-position" : 5113,
    "concept-id" : "cpya_jJg_pGp",
    "matched-string" : "Borlänge",
    "annotation-id" : 51
  }, {
    "preferred-label" : "Norrköping",
    "type" : "municipality",
    "start-position" : 5115,
    "end-position" : 5125,
    "concept-id" : "SYty_Yho_JAF",
    "matched-string" : "Norrköping",
    "annotation-id" : 52
  }, {
    "preferred-label" : "Örebro",
    "type" : "municipality",
    "start-position" : 5130,
    "end-position" : 5136,
    "concept-id" : "kuMn_feU_hXx",
    "matched-string" : "Örebro",
    "annotation-id" : 53
  }, {
    "preferred-label" : "Norrköping",
    "type" : "municipality",
    "start-position" : 5162,
    "end-position" : 5172,
    "concept-id" : "SYty_Yho_JAF",
    "matched-string" : "Norrköping",
    "annotation-id" : 54
  } ],
  "text" : "Systemtekniker inom Active Directory\nHos oss får du chansen att jobba med unika system som verkligen har betydelse för framtiden. Vill du bidra till samhällsnytta på en arbetsplats med engagerade och stöttande kollegor? Då är Transportstyrelsen arbetsplatsen för dig.\n\nVi står just nu inför ett av våra mest spännande utvecklingsuppdrag och det största i myndighetens historia. Vi ska börja bygga ett nytt, modernt och robust vägtrafikregister – ett samhällsviktigt system som måste vara tillgängligt dygnet runt och året om för att försörja myndigheter, branscher, företag och medborgare med information om fordon, dess ägare och körkortsinnehavare. Det här tillsammans med att vi håller på att etablera egen it-drift och utveckla vårt långsiktiga it-säkerhetsarbete, innebär att vi behöver bli fler!\n\nOm jobbet\nVi söker medarbetare med kompetens inom området Active Directory som vill vara med att vidareutveckla våra it-miljöer och att bygga upp myndighetens driftsorganisation för att framöver kunna hantera större åtaganden kring intern drift.\n\nI din roll kommer du att utveckla, konfigurera och förvalta lösningar kring Active Directory och vår behörighetshantering. Du kommer att ingå i ett team och får möjlighet att vara med och forma myndighetens framtida lösningar inom området.\n\nVi tror att du lockas att vara med på en spännande resa med en it-driftsmiljö och organisation under omfattande utveckling. Vi tror också att du sporras av utmaningar i vardagen och att leverera säkra, hållbara och effektiva lösningar inom ditt verksamhetsområde.\n\nVi är i ett uppbyggnadsskede med många spännande utmaningar och vi vill att du som söker, precis som vi, gillar förändring och ny teknik!\n\nHos oss är du viktig\nGillar du att jobba tillsammans med andra och vill du utvecklas i din yrkesroll? Hos oss kan du förvänta dig karriärsutveckling, ett förtroendefullt chefs- och medarbetarskap och ett hållbart arbetsliv. Vi är en trygg arbetsgivare som månar om din hälsa med tid för friskvård på arbetstid, flexibla arbetstider, väl tilltaget antal semesterdagar och lediga klämdagar.\n\nLäs mer om hur det är att jobba inom it på Transportstyrelsen\n\nDu kommer att\n\n• agera som teknisk specialist och delta i vidareutveckling och förvaltning inom ADDS tillsammans med teamet\n• ta fram kravspecifikationer, instruktioner och dokumentation\n• initiera, driva och delta i förbättrings- och förändringsarbeten\n• samarbeta med övriga organisationen för vidareutveckling, förvaltning samt införande av nya plattformar eller tjänster\n• omvärldsbevaka området ur ett tekniskt perspektiv och föreslå förbättringar.\n\nDu måste ha\n\n• en akademisk examen inom it-tekniskt område eller motsvarande kunskaper förvärvade på annat sätt\n• erfarenhet av arbete med ADDS, t ex kontohantering, DNS, GPO samt DFS\n• goda kunskaper i svenska i tal och skrift.\n\nDet är meriterande om du också har\n\n• kunskaper inom System Center (Configuration Manager, Operation Manager), Windows Server\n• kunskaper inom certifikathantering/PKI/ADCS, ”Active Directory Certificate Services”\n• erfarenhet av IAM-verktyg (Identity Access Management)\n• erfarenhet av flerfaktorsautentisering\n• erfarenhet av ADFS och federationer\n• arbetat i organisationer med högt ställda säkerhetskrav\n• erfarenhet av att arbeta med standarder och/eller policies gällande it-säkerhet eller informationssäkerhet.\n\nVi vill att du\n\n• har ett högt säkerhetsmedvetande\n• är prestigelös och gärna delar med dig av kunskaper och erfarenheter\n• är självgående med högt engagemang och tar stort ansvar för det du gör\n• är strukturerad och ordningsam\n• eftersträvar att ständigt bli bättre och är ansvarstagande för din och teamets vidareutveckling.\n\nStor vikt läggs vid personlig lämplighet.\n\nMer information\nAnställningen är tillsvidare med placering i Örebro. Tillträde enligt överenskommelse. Vi tillämpar normalt provanställning. Anställningen är placerad i säkerhetsklass och säkerhetsprövning enligt säkerhetsskyddslagen (2018:585) kommer att genomföras.\n\nVid frågor är du välkommen att kontakta sektionschef Mats Kvarnström, mats.kvarnstrom@transportstyrelsen.se. Han nås från 15 augusti.\n\nSaco, Peter Tang eller Anneli Hjalmarsson och ST, Axel Frick nås via vår växel på 0771-503 503.\n\n Vi vill inte att annonsörer och bemanningsföretag kontaktar oss.\n\nAnsök\nAnsök via vår webbplats och bifoga ditt CV samt ett personligt brev märkt med referensnummer TSG 2022-6506.  Vi behöver din ansökan senast den 4 september 2022. Vi gör första urvalet utifrån de frågor som du får svara på i vårt e-rekryteringssystem och kan komma att använda urvalstest.\n\nVälkommen att bli vår nya kollega!\nKort om Transportstyrelsen\n\nAntal anställda:\nCa 2000.\n\nVerksamhetsområden:\nTransportstyrelsen arbetar för att uppnå god tillgänglighet, hög kvalitet, säkra och miljöanpassade transporter inom järnväg, luftfart, sjöfart och väg. Vi tar fram regler, ger tillstånd och följer upp hur de efterlevs. Med hjälp av våra register arbetar vi bland annat med avgifter, tillstånd och ägarbyten.\n\nVerksamhetsorter:\nVi har medarbetare på 12 orter i landet. Den största delen av verksamheten finns i Borlänge, Norrköping och Örebro.\n\nHuvudkontoret ligger i Norrköping.\n\nLäs mer om Transportstyrelsen\n\n\nKort om avdelning It\n\nAvdelning It består av fem enheter med tillhörande sektioner. Vi är cirka 300 medarbetare och finns i Örebro, Borlänge och Norrköping.\n\nVi stöder samtliga avdelningar inom Transportstyrelsen både strategiskt och operativt i it-frågor. Vi arbetar med arkitektur, systemutveckling, förvaltning och drift av it-system samt infrastruktur."
}