{
  "meta" : {
    "jobad" : {
      "description" : {
        "requirements" : null,
        "needs" : null,
        "company_information" : null,
        "text_formatted" : "<p>Söker en person med arbetsglädje, engagemang och är sugen på nya utmaningar. </p><p>Den som tycker om att jobba, ärlig och punktlig. </p><p>Tycker om att vara socialt.</p><p id=\"oppenforalla\">Öppen för alla\nVi fokuserar på din kompetens, inte dina övriga förutsättningar. Vi är öppna för att anpassa rollen eller arbetsplatsen efter dina behov.</p>",
        "conditions" : null,
        "text" : "Söker en person med arbetsglädje, engagemang och är sugen på nya utmaningar. \nDen som tycker om att jobba, ärlig och punktlig. \nTycker om att vara socialt.\nÖppen för alla\nVi fokuserar på din kompetens, inte dina övriga förutsättningar. Vi är öppna för att anpassa rollen eller arbetsplatsen efter dina behov."
      },
      "headline" : "Kiosk och gatuköks biträde ",
      "driving_license" : [ {
        "concept_id" : "VTK8_WRx_GcM",
        "label" : "B",
        "legacy_ams_taxonomy_id" : "3"
      } ],
      "employer" : {
        "email" : null,
        "phone_number" : null,
        "organization_number" : "5591710529",
        "name" : "RazaButt AB",
        "url" : null,
        "workplace" : "RazaButt AB"
      },
      "removed_date" : null,
      "logo_url" : null,
      "last_publication_date" : "2022-08-26T00:00:00",
      "number_of_vacancies" : 1,
      "occupation" : {
        "concept_id" : "oRB5_b7i_Qzv",
        "label" : "Köksbiträde",
        "legacy_ams_taxonomy_id" : "483"
      },
      "occupation_group" : {
        "concept_id" : "tPox_ie4_X9X",
        "label" : "Restaurang- och köksbiträden m.fl.",
        "legacy_ams_taxonomy_id" : "9412"
      },
      "employment_type" : {
        "concept_id" : "PFZr_Syz_cUq",
        "label" : "Vanlig anställning",
        "legacy_ams_taxonomy_id" : "1"
      },
      "webpage_url" : "https://arbetsformedlingen.se/platsbanken/annonser/26356084",
      "driving_license_required" : true,
      "application_contacts" : [ {
        "description" : null,
        "email" : "Buttraza2016@gmail.com",
        "telephone" : "0737768649, 0707691599",
        "name" : "Usman  Raza",
        "contact_type" : null
      } ],
      "duration" : {
        "concept_id" : "a7uU_j21_mkL",
        "label" : "Tills vidare",
        "legacy_ams_taxonomy_id" : "1"
      },
      "nice_to_have" : {
        "education_level" : [ ],
        "work_experiences" : [ {
          "concept_id" : "oRB5_b7i_Qzv",
          "weight" : 5,
          "label" : "Köksbiträde",
          "legacy_ams_taxonomy_id" : "483"
        } ],
        "skills" : [ ],
        "education" : [ ],
        "languages" : [ ]
      },
      "application_details" : {
        "via_af" : false,
        "email" : "Buttraza2016@gmail.com",
        "other" : null,
        "reference" : null,
        "url" : null,
        "information" : null
      },
      "source_type" : "VIA_ANNONSERA",
      "application_deadline" : "2022-08-26T00:00:00",
      "external_id" : null,
      "workplace_address" : {
        "coordinates" : [ 14.478823268117598, 59.320013888145674 ],
        "city" : "KARLSKOGA",
        "postcode" : "69142",
        "municipality" : "Karlskoga",
        "region_concept_id" : "xTCk_nT5_Zjm",
        "region" : "Örebro län",
        "country_code" : "199",
        "region_code" : "18",
        "municipality_concept_id" : "wgJm_upX_z5W",
        "country_concept_id" : "i46j_HmG_v64",
        "municipality_code" : "1883",
        "street_address" : "Häsängs vägen 4",
        "country" : "Sverige"
      },
      "id" : "26356084",
      "experience_required" : true,
      "working_hours_type" : {
        "concept_id" : "6YE1_gAC_R2G",
        "label" : "Heltid",
        "legacy_ams_taxonomy_id" : "1"
      },
      "access" : null,
      "timestamp" : 1658876625276,
      "must_have" : {
        "education_level" : [ ],
        "work_experiences" : [ ],
        "skills" : [ ],
        "education" : [ ],
        "languages" : [ ]
      },
      "occupation_field" : {
        "concept_id" : "ScKy_FHB_7wT",
        "label" : "Hotell, restaurang, storhushåll",
        "legacy_ams_taxonomy_id" : "7"
      },
      "scope_of_work" : {
        "min" : 0,
        "max" : 100
      },
      "salary_type" : {
        "concept_id" : "oG8G_9cW_nRf",
        "label" : "Fast månads- vecko- eller timlön",
        "legacy_ams_taxonomy_id" : "1"
      },
      "removed" : false,
      "salary_description" : null,
      "access_to_own_car" : false,
      "publication_date" : "2022-07-27T01:03:45"
    },
    "name" : "Kiosk och gatuköks biträde ",
    "user" : "hannes"
  },
  "sha1" : "422623aaa5a7caca7316c9b338dfbe5a26459686",
  "annotations" : [ {
    "preferred-label" : "Grillbiträde/Gatuköksbiträde",
    "type" : "occupation-name",
    "start-position" : 10,
    "end-position" : 26,
    "concept-id" : "Cqo8_tUs_JHu",
    "matched-string" : "gatuköks biträde",
    "annotation-id" : 1
  } ],
  "text" : "Kiosk och gatuköks biträde \nSöker en person med arbetsglädje, engagemang och är sugen på nya utmaningar. \nDen som tycker om att jobba, ärlig och punktlig. \nTycker om att vara socialt.\nÖppen för alla\nVi fokuserar på din kompetens, inte dina övriga förutsättningar. Vi är öppna för att anpassa rollen eller arbetsplatsen efter dina behov."
}