{
  "meta" : {
    "jobad" : {
      "description" : {
        "requirements" : null,
        "needs" : null,
        "company_information" : null,
        "text_formatted" : "<p>Vi söker nu nya medarbetare till icha icha Centralstationen. </p><p>Vår ambition är att revolutionera snabbmaten, du ska inte längre behöva välja mellan snabb mat och bra mat, hos oss kan du njuta av båda! Vår mat är inspirerad av det japanska köket med utvalda råvaror som får dig att må bra. Utöver maten kommer vi förstås även att tillhandahålla exceptionell service och till detta behöver vi dig! Som person är du en servicemänniska ut i fingerspetsarna, du drivs av att leverera goda resultat och tycker om att arbeta med människor. Vidare är du lyhörd och en god medarbetare som gillar att arbeta i ett högt tempo. Du är självgående, och tar gärna egna initiativ.För rätt person finns på sikt mycket goda utvecklingsmöjligheter.</p><p>Erfarenhet av arbete i restaurang och café är meriterande. Sök gärna tjänsten igen trots att du inte gått vidare vid tidigare omgångar.</p><p>Tjänsten är en 75% (med möjlighet till mer) anställning med varierande arbetstider helger och vardagar. Du behöver kunna arbeta dagtid samt kvällar.</p><p>Arbetet sker i team, men också i stor del självständigt därför bör du vara väldigt självgående samt ha god förmåga att ta egna initiativ.</p><p>Arbetsplats: icha icha Centralstationen</p><p>Arbetsuppgifter</p><p>Som restaurangbiträde har du en nyckelposition i restaurangen och är vårt ansikte mot kunden. Det är du som till stor del avgör gästens upplevelse av hela restaurangbesöket. Som restaurangbiträde hos oss arbetar du på alla positioner i både köket och serveringen. I arbetsuppgifterna ingår bland annat:</p><p>Kassatjänst</p><p>Inventering av produkter och material</p><p>Tillagning och rangering.</p><p>Att alltid hålla rent och snyggt, städa och organisera</p><p>Se till att kunderna får bästa möjliga upplevelse</p><p>Aktivt arbeta för merförsäljning, effektivitet och lönsamhet.</p><p>Köksarbete</p><p>Beställning av varor.</p><p>Förberedelser och produktion.</p><p>Vi söker personal som kan arbeta 75% (med möjlighet till mer), och vi vill att du ska kunna börja arbeta omgående. För rätt person finns det även fina möjligheter att utvecklas inom företaget.</p><p>Då bolaget är litet kommer det finnas möjlighet att vara med och påverka både stort och smått och du kommer att rapportera direkt till ansvarig på plats.</p><p>Kvalifikationer</p><p>Som person är du en servicemänniska ut i fingerspetsarna, du drivs av att leverera goda resultat och tycker om att arbeta med människor. Vidare är du lyhörd och en god medarbetare som gillar att arbeta i ett högt tempo. För rätt person finns på sikt mycket goda utvecklingsmöjligheter. Du är självgående, och tar gärna egna initiativ.</p><p>Erfarenhet av arbete i restaurang och bar är meriterande.</p><p>För att söka tjänsten skicka:</p><p>CV</p><p>Bild</p><p>Personligt brev</p><p>Ange Centralen i ämnesraden. Rekryteringen till denna tjänst kommer att ske löpande och tjänsten kan således komma att tillsättas innan sista ansökningsdag sök därför tjänsten redan idag!</p><p>Specificera vilken tjänst du söker, och vänligen respektera att vi Ej tar emot ansökningar via telefon. Vi kommer omgående att kontakta personer med ansökningar av intresse, men har ej möjlighet att svara på alla.</p><p id=\"oppenforalla\">Öppen för alla\nVi fokuserar på din kompetens, inte dina övriga förutsättningar. Vi är öppna för att anpassa rollen eller arbetsplatsen efter dina behov.</p>",
        "conditions" : null,
        "text" : "Vi söker nu nya medarbetare till icha icha Centralstationen. \nVår ambition är att revolutionera snabbmaten, du ska inte längre behöva välja mellan snabb mat och bra mat, hos oss kan du njuta av båda! Vår mat är inspirerad av det japanska köket med utvalda råvaror som får dig att må bra. Utöver maten kommer vi förstås även att tillhandahålla exceptionell service och till detta behöver vi dig! Som person är du en servicemänniska ut i fingerspetsarna, du drivs av att leverera goda resultat och tycker om att arbeta med människor. Vidare är du lyhörd och en god medarbetare som gillar att arbeta i ett högt tempo. Du är självgående, och tar gärna egna initiativ.För rätt person finns på sikt mycket goda utvecklingsmöjligheter.\nErfarenhet av arbete i restaurang och café är meriterande. Sök gärna tjänsten igen trots att du inte gått vidare vid tidigare omgångar.\nTjänsten är en 75% (med möjlighet till mer) anställning med varierande arbetstider helger och vardagar. Du behöver kunna arbeta dagtid samt kvällar.\nArbetet sker i team, men också i stor del självständigt därför bör du vara väldigt självgående samt ha god förmåga att ta egna initiativ.\nArbetsplats: icha icha Centralstationen\nArbetsuppgifter\nSom restaurangbiträde har du en nyckelposition i restaurangen och är vårt ansikte mot kunden. Det är du som till stor del avgör gästens upplevelse av hela restaurangbesöket. Som restaurangbiträde hos oss arbetar du på alla positioner i både köket och serveringen. I arbetsuppgifterna ingår bland annat:\nKassatjänst\nInventering av produkter och material\nTillagning och rangering.\nAtt alltid hålla rent och snyggt, städa och organisera\nSe till att kunderna får bästa möjliga upplevelse\nAktivt arbeta för merförsäljning, effektivitet och lönsamhet.\nKöksarbete\nBeställning av varor.\nFörberedelser och produktion.\nVi söker personal som kan arbeta 75% (med möjlighet till mer), och vi vill att du ska kunna börja arbeta omgående. För rätt person finns det även fina möjligheter att utvecklas inom företaget.\nDå bolaget är litet kommer det finnas möjlighet att vara med och påverka både stort och smått och du kommer att rapportera direkt till ansvarig på plats.\nKvalifikationer\nSom person är du en servicemänniska ut i fingerspetsarna, du drivs av att leverera goda resultat och tycker om att arbeta med människor. Vidare är du lyhörd och en god medarbetare som gillar att arbeta i ett högt tempo. För rätt person finns på sikt mycket goda utvecklingsmöjligheter. Du är självgående, och tar gärna egna initiativ.\nErfarenhet av arbete i restaurang och bar är meriterande.\nFör att söka tjänsten skicka:\nCV\nBild\nPersonligt brev\nAnge Centralen i ämnesraden. Rekryteringen till denna tjänst kommer att ske löpande och tjänsten kan således komma att tillsättas innan sista ansökningsdag sök därför tjänsten redan idag!\nSpecificera vilken tjänst du söker, och vänligen respektera att vi Ej tar emot ansökningar via telefon. Vi kommer omgående att kontakta personer med ansökningar av intresse, men har ej möjlighet att svara på alla.\nÖppen för alla\nVi fokuserar på din kompetens, inte dina övriga förutsättningar. Vi är öppna för att anpassa rollen eller arbetsplatsen efter dina behov."
      },
      "headline" : "Restaurangbiträde 75%",
      "driving_license" : null,
      "employer" : {
        "email" : null,
        "phone_number" : null,
        "organization_number" : "5568545767",
        "name" : "Oshu Group AB",
        "url" : "www.ichaicha.se",
        "workplace" : "icha icha Centralstationen "
      },
      "removed_date" : null,
      "logo_url" : "https://www.arbetsformedlingen.se/rest/arbetsgivare/rest/af/v3/arbetsplatser/84063339/logotyper/logo.png",
      "last_publication_date" : "2022-09-10T23:59:59",
      "number_of_vacancies" : 1,
      "occupation" : {
        "concept_id" : "yXRQ_Ad9_E8V",
        "label" : "Restaurangbiträde",
        "legacy_ams_taxonomy_id" : "5555"
      },
      "occupation_group" : {
        "concept_id" : "tPox_ie4_X9X",
        "label" : "Restaurang- och köksbiträden m.fl.",
        "legacy_ams_taxonomy_id" : "9412"
      },
      "employment_type" : {
        "concept_id" : "PFZr_Syz_cUq",
        "label" : "Vanlig anställning",
        "legacy_ams_taxonomy_id" : "1"
      },
      "webpage_url" : "https://arbetsformedlingen.se/platsbanken/annonser/26400477",
      "driving_license_required" : false,
      "application_contacts" : [ ],
      "duration" : {
        "concept_id" : "a7uU_j21_mkL",
        "label" : "Tills vidare",
        "legacy_ams_taxonomy_id" : "1"
      },
      "nice_to_have" : {
        "education_level" : [ ],
        "work_experiences" : [ {
          "concept_id" : "yXRQ_Ad9_E8V",
          "weight" : 5,
          "label" : "Restaurangbiträde",
          "legacy_ams_taxonomy_id" : "5555"
        } ],
        "skills" : [ ],
        "education" : [ ],
        "languages" : [ ]
      },
      "application_details" : {
        "via_af" : false,
        "email" : "Sara@ichaicha.se",
        "other" : null,
        "reference" : "Centralen 75%",
        "url" : null,
        "information" : null
      },
      "source_type" : "VIA_ANNONSERA",
      "application_deadline" : "2022-09-10T23:59:59",
      "external_id" : null,
      "workplace_address" : {
        "coordinates" : [ 18.070462451025797, 59.33564974760078 ],
        "city" : "STOCKHOLM",
        "postcode" : "11143",
        "municipality" : "Stockholm",
        "region_concept_id" : "CifL_Rzy_Mku",
        "region" : "Stockholms län",
        "country_code" : "199",
        "region_code" : "01",
        "municipality_concept_id" : "AvNB_uwa_6n6",
        "country_concept_id" : "i46j_HmG_v64",
        "municipality_code" : "0180",
        "street_address" : "Centralplan",
        "country" : "Sverige"
      },
      "id" : "26400477",
      "experience_required" : true,
      "working_hours_type" : {
        "concept_id" : "947z_JGS_Uk2",
        "label" : "Deltid",
        "legacy_ams_taxonomy_id" : "2"
      },
      "access" : null,
      "timestamp" : 1660220135285,
      "must_have" : {
        "education_level" : [ ],
        "work_experiences" : [ ],
        "skills" : [ ],
        "education" : [ ],
        "languages" : [ {
          "concept_id" : "zSLA_vw2_FXN",
          "weight" : 10,
          "label" : "Svenska",
          "legacy_ams_taxonomy_id" : "502"
        }, {
          "concept_id" : "NVxJ_hLg_TYS",
          "weight" : 10,
          "label" : "Engelska",
          "legacy_ams_taxonomy_id" : "283"
        } ]
      },
      "occupation_field" : {
        "concept_id" : "ScKy_FHB_7wT",
        "label" : "Hotell, restaurang, storhushåll",
        "legacy_ams_taxonomy_id" : "7"
      },
      "scope_of_work" : {
        "min" : 75,
        "max" : 100
      },
      "salary_type" : {
        "concept_id" : "oG8G_9cW_nRf",
        "label" : "Fast månads- vecko- eller timlön",
        "legacy_ams_taxonomy_id" : "1"
      },
      "removed" : false,
      "salary_description" : null,
      "access_to_own_car" : false,
      "publication_date" : "2022-08-11T14:15:35"
    },
    "name" : "Restaurangbiträde 75%",
    "user" : "hannes"
  },
  "sha1" : "889c4a0ba88974021cfd52b64c78a7b6e3a4533c",
  "annotations" : [ {
    "preferred-label" : "Restaurangbiträde",
    "sentiment" : "MUST_HAVE",
    "type" : "occupation-name",
    "start-position" : 0,
    "end-position" : 17,
    "concept-id" : "yXRQ_Ad9_E8V",
    "matched-string" : "restaurangbiträde",
    "annotation-id" : 0
  }, {
    "preferred-label" : "Deltid",
    "type" : "worktime-extent",
    "start-position" : 18,
    "end-position" : 21,
    "concept-id" : "947z_JGS_Uk2",
    "matched-string" : "75%",
    "annotation-id" : 10
  }, {
    "preferred-label" : "Japanska",
    "sentiment" : "NOT_RELEVANT",
    "type" : "keyword",
    "start-position" : 251,
    "end-position" : 259,
    "concept-id" : "zBb6_bLJ_pcT",
    "matched-string" : "japanska",
    "annotation-id" : 1
  }, {
    "preferred-label" : "Restaurang",
    "sentiment" : "MUST_HAVE",
    "type" : "keyword",
    "start-position" : 774,
    "end-position" : 784,
    "concept-id" : "o2Cg_3Ap_qvK",
    "matched-string" : "restaurang",
    "annotation-id" : 2
  }, {
    "preferred-label" : "Café",
    "sentiment" : "MUST_HAVE",
    "type" : "skill",
    "start-position" : 789,
    "end-position" : 793,
    "concept-id" : "f2Nt_4bK_HNX",
    "matched-string" : "café",
    "annotation-id" : 3
  }, {
    "preferred-label" : "Deltid",
    "type" : "worktime-extent",
    "start-position" : 902,
    "end-position" : 905,
    "concept-id" : "947z_JGS_Uk2",
    "matched-string" : "75%",
    "annotation-id" : 11
  }, {
    "preferred-label" : "arbeta självständigt",
    "type" : "esco-skill",
    "start-position" : 1078,
    "end-position" : 1091,
    "concept-id" : "NyFu_HHd_zhz",
    "matched-string" : "självständigt",
    "annotation-id" : 12
  }, {
    "preferred-label" : "Restaurangbiträde",
    "sentiment" : "MUST_HAVE",
    "type" : "occupation-name",
    "start-position" : 1234,
    "end-position" : 1251,
    "concept-id" : "yXRQ_Ad9_E8V",
    "matched-string" : "restaurangbiträde",
    "annotation-id" : 4
  }, {
    "preferred-label" : "Restaurangbiträde",
    "sentiment" : "MUST_HAVE",
    "type" : "occupation-name",
    "start-position" : 1408,
    "end-position" : 1425,
    "concept-id" : "yXRQ_Ad9_E8V",
    "matched-string" : "restaurangbiträde",
    "annotation-id" : 5
  }, {
    "preferred-label" : "sköta en kassa",
    "sentiment" : "MUST_HAVE",
    "type" : "esco-skill",
    "start-position" : 1533,
    "end-position" : 1544,
    "concept-id" : "USNU_LMY_prY",
    "matched-string" : "Kassatjänst",
    "annotation-id" : 14
  }, {
    "preferred-label" : "Rangering",
    "sentiment" : "MUST_HAVE",
    "type" : "skill",
    "start-position" : 1598,
    "end-position" : 1607,
    "concept-id" : "LrLw_Ndd_fzd",
    "matched-string" : "rangering",
    "annotation-id" : 6
  }, {
    "preferred-label" : "Städa",
    "sentiment" : "MUST_HAVE",
    "type" : "keyword",
    "start-position" : 1643,
    "end-position" : 1648,
    "concept-id" : "r35T_iyj_ueU",
    "matched-string" : "städa",
    "annotation-id" : 7
  }, {
    "preferred-label" : "Personal",
    "sentiment" : "MUST_HAVE",
    "type" : "keyword",
    "start-position" : 1848,
    "end-position" : 1856,
    "concept-id" : "HVxM_6MS_y1c",
    "matched-string" : "personal",
    "annotation-id" : 8
  }, {
    "preferred-label" : "Deltid",
    "type" : "worktime-extent",
    "start-position" : 1872,
    "end-position" : 1875,
    "concept-id" : "947z_JGS_Uk2",
    "matched-string" : "75%",
    "annotation-id" : 13
  }, {
    "preferred-label" : "Restaurang",
    "sentiment" : "NICE_TO_HAVE",
    "type" : "keyword",
    "start-position" : 2560,
    "end-position" : 2570,
    "concept-id" : "o2Cg_3Ap_qvK",
    "matched-string" : "restaurang",
    "annotation-id" : 9
  } ],
  "text" : "Restaurangbiträde 75%\nVi söker nu nya medarbetare till icha icha Centralstationen. \nVår ambition är att revolutionera snabbmaten, du ska inte längre behöva välja mellan snabb mat och bra mat, hos oss kan du njuta av båda! Vår mat är inspirerad av det japanska köket med utvalda råvaror som får dig att må bra. Utöver maten kommer vi förstås även att tillhandahålla exceptionell service och till detta behöver vi dig! Som person är du en servicemänniska ut i fingerspetsarna, du drivs av att leverera goda resultat och tycker om att arbeta med människor. Vidare är du lyhörd och en god medarbetare som gillar att arbeta i ett högt tempo. Du är självgående, och tar gärna egna initiativ.För rätt person finns på sikt mycket goda utvecklingsmöjligheter.\nErfarenhet av arbete i restaurang och café är meriterande. Sök gärna tjänsten igen trots att du inte gått vidare vid tidigare omgångar.\nTjänsten är en 75% (med möjlighet till mer) anställning med varierande arbetstider helger och vardagar. Du behöver kunna arbeta dagtid samt kvällar.\nArbetet sker i team, men också i stor del självständigt därför bör du vara väldigt självgående samt ha god förmåga att ta egna initiativ.\nArbetsplats: icha icha Centralstationen\nArbetsuppgifter\nSom restaurangbiträde har du en nyckelposition i restaurangen och är vårt ansikte mot kunden. Det är du som till stor del avgör gästens upplevelse av hela restaurangbesöket. Som restaurangbiträde hos oss arbetar du på alla positioner i både köket och serveringen. I arbetsuppgifterna ingår bland annat:\nKassatjänst\nInventering av produkter och material\nTillagning och rangering.\nAtt alltid hålla rent och snyggt, städa och organisera\nSe till att kunderna får bästa möjliga upplevelse\nAktivt arbeta för merförsäljning, effektivitet och lönsamhet.\nKöksarbete\nBeställning av varor.\nFörberedelser och produktion.\nVi söker personal som kan arbeta 75% (med möjlighet till mer), och vi vill att du ska kunna börja arbeta omgående. För rätt person finns det även fina möjligheter att utvecklas inom företaget.\nDå bolaget är litet kommer det finnas möjlighet att vara med och påverka både stort och smått och du kommer att rapportera direkt till ansvarig på plats.\nKvalifikationer\nSom person är du en servicemänniska ut i fingerspetsarna, du drivs av att leverera goda resultat och tycker om att arbeta med människor. Vidare är du lyhörd och en god medarbetare som gillar att arbeta i ett högt tempo. För rätt person finns på sikt mycket goda utvecklingsmöjligheter. Du är självgående, och tar gärna egna initiativ.\nErfarenhet av arbete i restaurang och bar är meriterande.\nFör att söka tjänsten skicka:\nCV\nBild\nPersonligt brev\nAnge Centralen i ämnesraden. Rekryteringen till denna tjänst kommer att ske löpande och tjänsten kan således komma att tillsättas innan sista ansökningsdag sök därför tjänsten redan idag!\nSpecificera vilken tjänst du söker, och vänligen respektera att vi Ej tar emot ansökningar via telefon. Vi kommer omgående att kontakta personer med ansökningar av intresse, men har ej möjlighet att svara på alla.\nÖppen för alla\nVi fokuserar på din kompetens, inte dina övriga förutsättningar. Vi är öppna för att anpassa rollen eller arbetsplatsen efter dina behov."
}