{
  "meta" : {
    "dataset-id" : "myh-spreadsheet-2021",
    "type" : "education-description",
    "dataset-document-id" : "YH00188",
    "user" : "hannes"
  },
  "sha1" : "90674342bfd4903fd08f7e0433af38b28a89768f",
  "annotations" : [ {
    "preferred-label" : "Sverige",
    "sentiment" : "NOT_RELEVANT",
    "type" : "country",
    "start-position" : 767,
    "end-position" : 774,
    "concept-id" : "i46j_HmG_v64",
    "matched-string" : "Sverige",
    "annotation-id" : 5
  }, {
    "preferred-label" : "Företagande",
    "sentiment" : "OFFERED",
    "type" : "keyword",
    "start-position" : 975,
    "end-position" : 986,
    "concept-id" : "fxGP_Unf_RJZ",
    "matched-string" : "företagande",
    "annotation-id" : 1
  }, {
    "preferred-label" : "Marknadsföring",
    "sentiment" : "OFFERED",
    "type" : "sun-education-field-4",
    "start-position" : 1121,
    "end-position" : 1135,
    "concept-id" : "zTc5_e4U_Qsf",
    "matched-string" : "marknadsföring",
    "annotation-id" : 2
  }, {
    "preferred-label" : "Musik",
    "sentiment" : "OFFERED",
    "type" : "sun-education-field-4",
    "start-position" : 1150,
    "end-position" : 1155,
    "concept-id" : "muBr_pr4_MvG",
    "matched-string" : "musik",
    "annotation-id" : 3
  } ],
  "text" : "    Yh-utbildningen Musikmakarna / Songwriters Academy of Sweden är unik i landet,   väl etablerad och mycket framgångsrik.    Musikmakarna kom till utifrån en idé och direkt uppmaning från musikbranschen, då Marie Ledin och Joakim Bergman från Stockholm uttryckte ett behov av fler låtskrivare för att utvecklingen av ”det svenska musikundret” skulle säkerställas.     Ulla Sjöström, skolans rektor, skrev fram konceptet ”Musikmakarna” och grundade 1998 i nära samarbete med Joakim Bergman, Frank Ådahl och svensk musikbransch, landets första yrkesinriktade låtskrivarutbildning.   Idag arbetar Musikmakarna över hela världen och framgångarna avlöser varandra.    allt börjar med en bra låt...    Musikmakarna har som mål att utveckla framtidens låtskrivare i såväl Sverige som internationellt. Med många års erfarenhet som utbildare samarbetar vi idag med de mest namnkunniga musikförlagen över hela världen.     KURSER 2021 - 2023      Entreprenörskap, Ledarskap och eget Företagande           30p  Examensarbete                                                                   25p  Management, Artistprofilering och Marknadsföring          35p  Musik för Film, Reklam, Data-spel och andra medier           20p  Musikjuridik och Branschkunskap                                  35p  Podcast, Synk- och Produktionsmusik                            15p  Skrivande och produktion av populärmusik - grund            20p  Skrivande, Komposition och Produktion av populärmusik   85p  LIA 1/Praktik – Musikförlag                                                  45p  LIA 2/Praktik – Produktionsbolag                                          45p  LIA 3/Praktik – Musikadministrativt bolag                          45p                                                                           Totalt 400p\n"
}