{
  "meta" : {
    "jobad" : {
      "description" : {
        "requirements" : null,
        "needs" : null,
        "company_information" : null,
        "text_formatted" : "Länsstyrelsen är en drivande kraft för det hållbara samhället. Vi arbetar tillsammans med myndigheter, kommuner och andra aktörer med fokus på Västra Götalands län och våra 1,7 miljoner invånare. \n\nVi har ett meningsfullt och hållbart arbete med trevliga och kompetenta kollegor. Hos oss arbetar vi med att få samhällen, människor, djur, natur och kulturvärden att fungera både idag och i framtiden. \n\nMånga pratar om hållbarhet och vi arbetar med det varje dag. Vill du vara med?\n\r\n\r\nARBETSUPPGIFTER\nVeterinär- och djurskyddsenheten ansvarar för den operativa djurskyddskontrollen och den operativa kontrollen inom primärproduktionen av foder och livsmedel i länet. Dessutom utövar enheten tillsyn över länets djurhälsopersonal, kommunernas kontrollverksamhet enligt livsmedelslagen, samt arbetar för samordning och samverkan mellan de kommunala tillsynsmyndigheterna inom livsmedelsområdet.\n\nSom djurskyddskontrollant arbetar du med kontrollbesök i fält samt för- och efterarbete på kontoret.\n\nSamtliga djurslag som omfattas av djurskyddslagen kan kontrolleras och flera typer av kontroller görs, exempelvis rutinkontroller, kontroller efter anmälningar, eller kontroller efter inkommen ansökan om tillstånd. Arbetet görs både självständigt och ibland tillsammans med kollega.\n\nI arbetsuppgifterna ingår även administrativt arbete exempelvis registrering av ärendehandlingar och att skriva kontrollrapport. Vidare ingår handläggning av beslut enligt både djurskyddslagen och lagen om tillsyn över hundar och katter.\n\nVi arbetar förebyggande med djurskyddsarbetet genom kontakter med djurhållare och allmänhet samt kontakt och samarbete med andra myndigheter och organisationer. Externa kontakter är en viktig del av arbetet men även att kunna arbeta teambaserat tillsammans med kollegor. Arbetet kräver en hög social kompetens med stor samarbetsförmåga och flexibilitet.\n\nPlaceringsort: Göteborg\nResor ingår i tjänsten. Utöver kontrollarbete så försöker vi att i så stor utsträckning som möjligt använda oss av buss och tåg när vi reser.\n\r\n\r\nKVALIFIKATIONER\nKrav:\n•\tExamen från etologi- och djurskyddprogrammet, examen från agronomprogrammet inriktning djur eller annan akademisk utbildning som arbetsgivaren bedömer lämplig.\n•\tGod förmåga att uttrycka dig på ett tydligt och lättförståeligt sätt både i tal och skrift\n•\tGod kunskap om och tillämpning av förvaltningslagen\n•\tB-Körkort.\n\nMeriterande:\n•\tGod kunskap om och tillämpning av djurskyddslagstiftningen\n•\tErfarenhet av handläggning av lagen om tillsyn över hundar och katter\n•\tPraktisk erfarenhet av arbete (anställd/praktik i utbildning) med sällskapsdjur eller lantbruksdjur i minst sex månader\n•\tArbetat som djurskyddskontrollant i minst sex månader\n•\tArbetat med tillsyn på myndighet. \n•\tErfarenhet av arbete med försöksdjur.\n \nPersonliga egenskaper:\n•\tDu är lugn, stabil och trygg i dig själv och kan skilja mellan det personliga och din professionella yrkesroll.\n•\tDu har förståelse för vad det innebär att arbeta på en myndighet.\n•\tDu känner dig bekväm med att lämna svåra beslut och kan hantera stressfyllda situationer.\n•\tDu har ett prestigelöst och professionellt bemötande och kan kommunicera ut ditt budskap på ett lättförståeligt sätt i både tal och skrift.\n•\tDu är strukturerad, effektiv, flexibel och kan prioritera.\n•\tDu har en vilja att arbeta i grupp och kan ta eget ansvar för dina uppgifter. Du agera självständigt inom givna ramar och strukturerar själv ditt angreppssätt och driver dina processer vidare.\n•\tDu är förändringsvillig och har lätt för att ta till dig och omsätta nya kunskaper och arbetssätt.\n\nVi fäster stor vikt vid den personliga lämpligheten och ser det som självklart att du bidrar till ett gott arbetsklimat.\n\nVi strävar efter att personalsammansättningen ska spegla samhället i övrigt och eftersträvar en mångfald bland våra medarbetare. Då den övervägande delen av medarbetarna i gruppen är kvinnor ser vi gärna manliga sökanden.\n\nPersonlighetstester och/eller arbetsprov kan förekomma under rekryteringsprocessen. \n\r\n\nÖVRIGT\nTill bemannings- och rekryteringsföretag och till dig som är försäljare: Vi undanber oss vänligen men bestämt direktkontakt med bemannings- och rekryteringsföretag samt försäljare av ytterligare jobbannonser.",
        "conditions" : "Heltid.  Dagtid. Måndag - fredag 40 timmar per vecka.\r\nTillsvidareanställning, tillträde: Tillträde: Omgående.",
        "text" : "Länsstyrelsen är en drivande kraft för det hållbara samhället. Vi arbetar tillsammans med myndigheter, kommuner och andra aktörer med fokus på Västra Götalands län och våra 1,7 miljoner invånare. \n\nVi har ett meningsfullt och hållbart arbete med trevliga och kompetenta kollegor. Hos oss arbetar vi med att få samhällen, människor, djur, natur och kulturvärden att fungera både idag och i framtiden. \n\nMånga pratar om hållbarhet och vi arbetar med det varje dag. Vill du vara med?\n\r\n\r\nARBETSUPPGIFTER\nVeterinär- och djurskyddsenheten ansvarar för den operativa djurskyddskontrollen och den operativa kontrollen inom primärproduktionen av foder och livsmedel i länet. Dessutom utövar enheten tillsyn över länets djurhälsopersonal, kommunernas kontrollverksamhet enligt livsmedelslagen, samt arbetar för samordning och samverkan mellan de kommunala tillsynsmyndigheterna inom livsmedelsområdet.\n\nSom djurskyddskontrollant arbetar du med kontrollbesök i fält samt för- och efterarbete på kontoret.\n\nSamtliga djurslag som omfattas av djurskyddslagen kan kontrolleras och flera typer av kontroller görs, exempelvis rutinkontroller, kontroller efter anmälningar, eller kontroller efter inkommen ansökan om tillstånd. Arbetet görs både självständigt och ibland tillsammans med kollega.\n\nI arbetsuppgifterna ingår även administrativt arbete exempelvis registrering av ärendehandlingar och att skriva kontrollrapport. Vidare ingår handläggning av beslut enligt både djurskyddslagen och lagen om tillsyn över hundar och katter.\n\nVi arbetar förebyggande med djurskyddsarbetet genom kontakter med djurhållare och allmänhet samt kontakt och samarbete med andra myndigheter och organisationer. Externa kontakter är en viktig del av arbetet men även att kunna arbeta teambaserat tillsammans med kollegor. Arbetet kräver en hög social kompetens med stor samarbetsförmåga och flexibilitet.\n\nPlaceringsort: Göteborg\nResor ingår i tjänsten. Utöver kontrollarbete så försöker vi att i så stor utsträckning som möjligt använda oss av buss och tåg när vi reser.\n\r\n\r\nKVALIFIKATIONER\nKrav:\n•\tExamen från etologi- och djurskyddprogrammet, examen från agronomprogrammet inriktning djur eller annan akademisk utbildning som arbetsgivaren bedömer lämplig.\n•\tGod förmåga att uttrycka dig på ett tydligt och lättförståeligt sätt både i tal och skrift\n•\tGod kunskap om och tillämpning av förvaltningslagen\n•\tB-Körkort.\n\nMeriterande:\n•\tGod kunskap om och tillämpning av djurskyddslagstiftningen\n•\tErfarenhet av handläggning av lagen om tillsyn över hundar och katter\n•\tPraktisk erfarenhet av arbete (anställd/praktik i utbildning) med sällskapsdjur eller lantbruksdjur i minst sex månader\n•\tArbetat som djurskyddskontrollant i minst sex månader\n•\tArbetat med tillsyn på myndighet. \n•\tErfarenhet av arbete med försöksdjur.\n \nPersonliga egenskaper:\n•\tDu är lugn, stabil och trygg i dig själv och kan skilja mellan det personliga och din professionella yrkesroll.\n•\tDu har förståelse för vad det innebär att arbeta på en myndighet.\n•\tDu känner dig bekväm med att lämna svåra beslut och kan hantera stressfyllda situationer.\n•\tDu har ett prestigelöst och professionellt bemötande och kan kommunicera ut ditt budskap på ett lättförståeligt sätt i både tal och skrift.\n•\tDu är strukturerad, effektiv, flexibel och kan prioritera.\n•\tDu har en vilja att arbeta i grupp och kan ta eget ansvar för dina uppgifter. Du agera självständigt inom givna ramar och strukturerar själv ditt angreppssätt och driver dina processer vidare.\n•\tDu är förändringsvillig och har lätt för att ta till dig och omsätta nya kunskaper och arbetssätt.\n\nVi fäster stor vikt vid den personliga lämpligheten och ser det som självklart att du bidrar till ett gott arbetsklimat.\n\nVi strävar efter att personalsammansättningen ska spegla samhället i övrigt och eftersträvar en mångfald bland våra medarbetare. Då den övervägande delen av medarbetarna i gruppen är kvinnor ser vi gärna manliga sökanden.\n\nPersonlighetstester och/eller arbetsprov kan förekomma under rekryteringsprocessen. \n\r\n\nÖVRIGT\nTill bemannings- och rekryteringsföretag och till dig som är försäljare: Vi undanber oss vänligen men bestämt direktkontakt med bemannings- och rekryteringsföretag samt försäljare av ytterligare jobbannonser."
      },
      "headline" : "Djurskyddskontrollant till Göteborg",
      "driving_license" : [ {
        "concept_id" : "VTK8_WRx_GcM",
        "label" : "B",
        "legacy_ams_taxonomy_id" : "3"
      } ],
      "employer" : {
        "email" : null,
        "phone_number" : null,
        "organization_number" : "2021002361",
        "name" : "Länsstyrelsen i Västra Götalands län",
        "url" : null,
        "workplace" : "Länsstyrelsen Västra Götaland, Landsbygdsavdelningen"
      },
      "removed_date" : null,
      "logo_url" : null,
      "last_publication_date" : "2022-08-12T23:59:59",
      "number_of_vacancies" : 2,
      "occupation" : {
        "concept_id" : "wHan_NPd_h9H",
        "label" : "Djurskyddsinspektör",
        "legacy_ams_taxonomy_id" : "1914"
      },
      "occupation_group" : {
        "concept_id" : "puim_6PY_DGj",
        "label" : "Miljö- och hälsoskyddsinspektörer",
        "legacy_ams_taxonomy_id" : "2182"
      },
      "employment_type" : {
        "concept_id" : "PFZr_Syz_cUq",
        "label" : "Vanlig anställning",
        "legacy_ams_taxonomy_id" : "1"
      },
      "webpage_url" : "https://arbetsformedlingen.se/platsbanken/annonser/26278578",
      "driving_license_required" : true,
      "application_contacts" : [ {
        "description" : "Cecilia Öhman",
        "email" : null,
        "telephone" : "010-224 56 67",
        "name" : null,
        "contact_type" : "Funktionschef (nås vecka 30)"
      }, {
        "description" : "Johanna Karlsson",
        "email" : null,
        "telephone" : "010-224 52 55",
        "name" : null,
        "contact_type" : "Funktionschef (nås vecka 31-32)"
      } ],
      "duration" : {
        "concept_id" : "a7uU_j21_mkL",
        "label" : "Tills vidare",
        "legacy_ams_taxonomy_id" : "1"
      },
      "nice_to_have" : {
        "education_level" : [ ],
        "work_experiences" : [ ],
        "skills" : [ ],
        "education" : [ ],
        "languages" : [ ]
      },
      "application_details" : {
        "via_af" : false,
        "email" : null,
        "other" : null,
        "reference" : "112-27573-2022",
        "url" : "https://recruit.visma.com/Public/Apply.aspx?guidAssignment=2323d90e-89f8-43d5-beba-48ec870ff5df&publishCode=AMS&TK=af892c14-555a-44ed-8492-b16623087258",
        "information" : null
      },
      "source_type" : "VIA_PLATSBANKEN_DXA",
      "application_deadline" : "2022-08-12T23:59:59",
      "external_id" : "46-202100-2361-2323D90E89F843D5BEBA48EC870FF5DF",
      "workplace_address" : {
        "coordinates" : [ 11.97456, 57.70887 ],
        "city" : null,
        "postcode" : null,
        "municipality" : "Göteborg",
        "region_concept_id" : "zdoY_6u5_Krt",
        "region" : "Västra Götalands län",
        "country_code" : "199",
        "region_code" : "14",
        "municipality_concept_id" : "PVZL_BQT_XtL",
        "country_concept_id" : "i46j_HmG_v64",
        "municipality_code" : "1480",
        "street_address" : null,
        "country" : "Sverige"
      },
      "id" : "26278578",
      "experience_required" : true,
      "working_hours_type" : {
        "concept_id" : "6YE1_gAC_R2G",
        "label" : "Heltid",
        "legacy_ams_taxonomy_id" : "1"
      },
      "access" : null,
      "timestamp" : 1656595532554,
      "must_have" : {
        "education_level" : [ ],
        "work_experiences" : [ {
          "concept_id" : "wHan_NPd_h9H",
          "weight" : 10,
          "label" : "Djurskyddsinspektör",
          "legacy_ams_taxonomy_id" : "1914"
        } ],
        "skills" : [ ],
        "education" : [ ],
        "languages" : [ ]
      },
      "occupation_field" : {
        "concept_id" : "kJeN_wmw_9wX",
        "label" : "Naturvetenskap",
        "legacy_ams_taxonomy_id" : "14"
      },
      "scope_of_work" : {
        "min" : 100,
        "max" : 100
      },
      "salary_type" : {
        "concept_id" : "oG8G_9cW_nRf",
        "label" : "Fast månads- vecko- eller timlön",
        "legacy_ams_taxonomy_id" : "1"
      },
      "removed" : false,
      "salary_description" : "Månadslön Länsstyrelsen tillämpar individuell lönesättning.",
      "access_to_own_car" : false,
      "publication_date" : "2022-07-25T00:00:00"
    },
    "name" : "Djurskyddskontrollant till Göteborg",
    "user" : "hannes"
  },
  "sha1" : "b131a16030261a162d5e1e1299b0725fc6a3eb8b",
  "annotations" : [ {
    "preferred-label" : "djurskyddsinspektör",
    "type" : "esco-occupation",
    "start-position" : 0,
    "end-position" : 21,
    "concept-id" : "MMqH_hQF_UEJ",
    "matched-string" : "Djurskyddskontrollant",
    "annotation-id" : 11
  }, {
    "preferred-label" : "Göteborg",
    "type" : "municipality",
    "start-position" : 27,
    "end-position" : 35,
    "concept-id" : "PVZL_BQT_XtL",
    "matched-string" : "Göteborg",
    "annotation-id" : 9
  }, {
    "preferred-label" : "Västra Götalands län",
    "type" : "region",
    "start-position" : 179,
    "end-position" : 199,
    "concept-id" : "zdoY_6u5_Krt",
    "matched-string" : "Västra Götalands län",
    "annotation-id" : 10
  }, {
    "preferred-label" : "Djur",
    "sentiment" : "MUST_HAVE",
    "type" : "keyword",
    "start-position" : 368,
    "end-position" : 372,
    "concept-id" : "tcCL_d5A_iF4",
    "matched-string" : "djur",
    "annotation-id" : 0
  }, {
    "preferred-label" : "Veterinär",
    "sentiment" : "MUST_HAVE",
    "type" : "occupation-name",
    "start-position" : 537,
    "end-position" : 546,
    "concept-id" : "GgmE_SvH_mtm",
    "matched-string" : "veterinär",
    "annotation-id" : 1
  }, {
    "preferred-label" : "övervaka djurskyddet",
    "type" : "esco-skill",
    "start-position" : 552,
    "end-position" : 569,
    "concept-id" : "Uh4w_pEB_Hof",
    "matched-string" : "djurskyddsenheten",
    "annotation-id" : 12
  }, {
    "preferred-label" : "övervaka djurskyddet",
    "type" : "esco-skill",
    "start-position" : 597,
    "end-position" : 617,
    "concept-id" : "Uh4w_pEB_Hof",
    "matched-string" : "djurskyddskontrollen",
    "annotation-id" : 14
  }, {
    "preferred-label" : "Livsmedel",
    "sentiment" : "MUST_HAVE",
    "type" : "skill",
    "start-position" : 684,
    "end-position" : 693,
    "concept-id" : "tdbu_fUL_MnC",
    "matched-string" : "livsmedel",
    "annotation-id" : 2
  }, {
    "preferred-label" : "Djurskyddsinspektör",
    "type" : "occupation-name",
    "start-position" : 934,
    "end-position" : 955,
    "concept-id" : "wHan_NPd_h9H",
    "matched-string" : "djurskyddskontrollant",
    "annotation-id" : 13
  }, {
    "preferred-label" : "övervaka djurskyddet",
    "type" : "esco-skill",
    "start-position" : 1066,
    "end-position" : 1081,
    "concept-id" : "Uh4w_pEB_Hof",
    "matched-string" : "djurskyddslagen",
    "annotation-id" : 15
  }, {
    "preferred-label" : "arbeta självständigt",
    "type" : "esco-skill",
    "start-position" : 1265,
    "end-position" : 1278,
    "concept-id" : "NyFu_HHd_zhz",
    "matched-string" : "självständigt",
    "annotation-id" : 16
  }, {
    "preferred-label" : "Djurskydd",
    "type" : "keyword",
    "start-position" : 1583,
    "end-position" : 1600,
    "concept-id" : "qgYx_RG2_Q6R",
    "matched-string" : "djurskyddsarbetet",
    "annotation-id" : 17
  }, {
    "preferred-label" : "Resor i arbetet förekommer",
    "type" : "work-place-environment",
    "start-position" : 1934,
    "end-position" : 1956,
    "concept-id" : "oaM2_JTK_muh",
    "matched-string" : "Resor ingår i tjänsten",
    "annotation-id" : 18
  }, {
    "preferred-label" : "Yrkesbevis/examen",
    "sentiment" : "MUST_HAVE",
    "type" : "skill-headline",
    "start-position" : 2104,
    "end-position" : 2110,
    "concept-id" : "HjPN_99i_cFD",
    "matched-string" : "examen",
    "annotation-id" : 4
  }, {
    "preferred-label" : "Etologi",
    "sentiment" : "MUST_HAVE",
    "type" : "keyword",
    "start-position" : 2116,
    "end-position" : 2123,
    "concept-id" : "hgnc_Zyj_VyQ",
    "matched-string" : "etologi",
    "annotation-id" : 5
  }, {
    "preferred-label" : "Yrkesbevis/examen",
    "sentiment" : "MUST_HAVE",
    "type" : "skill-headline",
    "start-position" : 2150,
    "end-position" : 2156,
    "concept-id" : "HjPN_99i_cFD",
    "matched-string" : "examen",
    "annotation-id" : 6
  }, {
    "preferred-label" : "Agronomutbildning",
    "type" : "sun-education-field-4",
    "start-position" : 2162,
    "end-position" : 2179,
    "concept-id" : "7tiR_8vj_X8F",
    "matched-string" : "agronomprogrammet",
    "annotation-id" : 19
  }, {
    "preferred-label" : "Djur",
    "sentiment" : "MUST_HAVE",
    "type" : "keyword",
    "start-position" : 2191,
    "end-position" : 2195,
    "concept-id" : "tcCL_d5A_iF4",
    "matched-string" : "djur",
    "annotation-id" : 7
  }, {
    "preferred-label" : "Universitets- eller högskoleutbildning",
    "type" : "sni-level-5",
    "start-position" : 2208,
    "end-position" : 2228,
    "concept-id" : "4Hs1_pdH_C7k",
    "matched-string" : "akademisk utbildning",
    "annotation-id" : 20
  }, {
    "preferred-label" : "Förvaltningslagen",
    "sentiment" : "MUST_HAVE",
    "type" : "skill",
    "start-position" : 2393,
    "end-position" : 2410,
    "concept-id" : "MxW4_GEL_ChA",
    "matched-string" : "förvaltningslagen",
    "annotation-id" : 8
  }, {
    "preferred-label" : "B",
    "type" : "driving-licence",
    "start-position" : 2413,
    "end-position" : 2422,
    "concept-id" : "VTK8_WRx_GcM",
    "matched-string" : "B-Körkort",
    "annotation-id" : 21
  }, {
    "preferred-label" : "djurskyddsinspektör",
    "type" : "esco-occupation",
    "start-position" : 2707,
    "end-position" : 2728,
    "concept-id" : "MMqH_hQF_UEJ",
    "matched-string" : "djurskyddskontrollant",
    "annotation-id" : 22
  } ],
  "text" : "Djurskyddskontrollant till Göteborg\nLänsstyrelsen är en drivande kraft för det hållbara samhället. Vi arbetar tillsammans med myndigheter, kommuner och andra aktörer med fokus på Västra Götalands län och våra 1,7 miljoner invånare. \n\nVi har ett meningsfullt och hållbart arbete med trevliga och kompetenta kollegor. Hos oss arbetar vi med att få samhällen, människor, djur, natur och kulturvärden att fungera både idag och i framtiden. \n\nMånga pratar om hållbarhet och vi arbetar med det varje dag. Vill du vara med?\n\r\n\r\nARBETSUPPGIFTER\nVeterinär- och djurskyddsenheten ansvarar för den operativa djurskyddskontrollen och den operativa kontrollen inom primärproduktionen av foder och livsmedel i länet. Dessutom utövar enheten tillsyn över länets djurhälsopersonal, kommunernas kontrollverksamhet enligt livsmedelslagen, samt arbetar för samordning och samverkan mellan de kommunala tillsynsmyndigheterna inom livsmedelsområdet.\n\nSom djurskyddskontrollant arbetar du med kontrollbesök i fält samt för- och efterarbete på kontoret.\n\nSamtliga djurslag som omfattas av djurskyddslagen kan kontrolleras och flera typer av kontroller görs, exempelvis rutinkontroller, kontroller efter anmälningar, eller kontroller efter inkommen ansökan om tillstånd. Arbetet görs både självständigt och ibland tillsammans med kollega.\n\nI arbetsuppgifterna ingår även administrativt arbete exempelvis registrering av ärendehandlingar och att skriva kontrollrapport. Vidare ingår handläggning av beslut enligt både djurskyddslagen och lagen om tillsyn över hundar och katter.\n\nVi arbetar förebyggande med djurskyddsarbetet genom kontakter med djurhållare och allmänhet samt kontakt och samarbete med andra myndigheter och organisationer. Externa kontakter är en viktig del av arbetet men även att kunna arbeta teambaserat tillsammans med kollegor. Arbetet kräver en hög social kompetens med stor samarbetsförmåga och flexibilitet.\n\nPlaceringsort: Göteborg\nResor ingår i tjänsten. Utöver kontrollarbete så försöker vi att i så stor utsträckning som möjligt använda oss av buss och tåg när vi reser.\n\r\n\r\nKVALIFIKATIONER\nKrav:\n•\tExamen från etologi- och djurskyddprogrammet, examen från agronomprogrammet inriktning djur eller annan akademisk utbildning som arbetsgivaren bedömer lämplig.\n•\tGod förmåga att uttrycka dig på ett tydligt och lättförståeligt sätt både i tal och skrift\n•\tGod kunskap om och tillämpning av förvaltningslagen\n•\tB-Körkort.\n\nMeriterande:\n•\tGod kunskap om och tillämpning av djurskyddslagstiftningen\n•\tErfarenhet av handläggning av lagen om tillsyn över hundar och katter\n•\tPraktisk erfarenhet av arbete (anställd/praktik i utbildning) med sällskapsdjur eller lantbruksdjur i minst sex månader\n•\tArbetat som djurskyddskontrollant i minst sex månader\n•\tArbetat med tillsyn på myndighet. \n•\tErfarenhet av arbete med försöksdjur.\n \nPersonliga egenskaper:\n•\tDu är lugn, stabil och trygg i dig själv och kan skilja mellan det personliga och din professionella yrkesroll.\n•\tDu har förståelse för vad det innebär att arbeta på en myndighet.\n•\tDu känner dig bekväm med att lämna svåra beslut och kan hantera stressfyllda situationer.\n•\tDu har ett prestigelöst och professionellt bemötande och kan kommunicera ut ditt budskap på ett lättförståeligt sätt i både tal och skrift.\n•\tDu är strukturerad, effektiv, flexibel och kan prioritera.\n•\tDu har en vilja att arbeta i grupp och kan ta eget ansvar för dina uppgifter. Du agera självständigt inom givna ramar och strukturerar själv ditt angreppssätt och driver dina processer vidare.\n•\tDu är förändringsvillig och har lätt för att ta till dig och omsätta nya kunskaper och arbetssätt.\n\nVi fäster stor vikt vid den personliga lämpligheten och ser det som självklart att du bidrar till ett gott arbetsklimat.\n\nVi strävar efter att personalsammansättningen ska spegla samhället i övrigt och eftersträvar en mångfald bland våra medarbetare. Då den övervägande delen av medarbetarna i gruppen är kvinnor ser vi gärna manliga sökanden.\n\nPersonlighetstester och/eller arbetsprov kan förekomma under rekryteringsprocessen. \n\r\n\nÖVRIGT\nTill bemannings- och rekryteringsföretag och till dig som är försäljare: Vi undanber oss vänligen men bestämt direktkontakt med bemannings- och rekryteringsföretag samt försäljare av ytterligare jobbannonser."
}