{
  "meta" : {
    "jobad" : {
      "description" : {
        "requirements" : null,
        "needs" : null,
        "company_information" : null,
        "text_formatted" : "I grundskoleförvaltningen har vi en trygg och tillitsfull kultur. Vi bryr oss om våra elever och varandra. Vi finns till för eleverna, vi samarbetar med vårdnadshavarna och varandra, och vi är öppna för nya tankar och idéer. Här skapar vi bra förutsättningar för den pedagogiska utvecklingen.\n\nBli en av oss!\nNu söker vi dig som har ett stort engagemang för att utveckla en modern verksamhet där vi har fokus på att:\n• öka kvaliteten i undervisningen för att öka elevers lärande.\n• skapa tydligare ansvar, styrning och ledning för att öka elevers kunskapsresultat.\n• öka likvärdighet mellan skolor för att alla elever ska få tillgång till undervisning av hög kvalitet samt kompensera för deras olika förutsättningar.\n\nGöteborgs grundskoleförvaltning är en av de största skolförvaltningarna i Sverige. Vi ansvarar för stadens kommunala skolor från förskoleklass till årskurs nio, grundsärskolan, kulturskolan och fritidshemmen. I förvaltningen finns 138 kommunala grundskolor där nästan 47 000 elever varje dag går i skolan. Hela förvaltningen har cirka 9 700 medarbetare som gemensamt arbetar med att utveckla och ta hand om verksamheten - tillsammans banar vi väg för framtidens skola.\n\nFölj gärna vår resa på Linkedin: https://www.linkedin.com/company/goteborgs-grundskoleforvaltning\r\n\r\nARBETSUPPGIFTER\nHjuviksskolan ligger 100 meter från havet med härlig natur, friska vindar och salta bad i närområdet. Hjuviksskolan har cirka 150 elever från förskoleklass till och med år 3, samt barn i fritidshem för dessa årskurser.\n\nVi arbetar för att våra elever skall känna trygghet, trivsel och arbetsglädje. I detta arbete är våra kamratstödjare och elevrådet viktiga länkar mellan barn och vuxna. På Hjuviksskolan arbetar vi i ett öppet och vänligt klimat med ett starkt elevfokus. Hos oss får eleverna en gedigen kunskapsgrund och möjlighet att utveckla sina förmågor.\n\nSom lärare i vårt fritidshem kommer du att arbeta med att utveckla och bedriva pedagogiskt arbete med barn i årskurserna F-3 tillsammans med dina kollegor. Under skoldagen arbetar du tillsammans med en lärare i klass. Du ansvarar för planering, genomförande och utvärdering av verksamheten tillsammans med ditt arbetslag. Vi arbetar både med gemensam och enskild planering samt utvecklingsmöte för alla som arbetar på fritidshemmet.\r\n\r\nKVALIFIKATIONER\nVi söker nu en till driven lärare i fritidshem till vårt arbetslag som vill vara med och utveckla vår fritidsverksamhet! \n\nFör att passa in i rollen behöver du vara legitimerad lärare i fritidshem i F-3. Du som är nyutexaminerad får en tidsbegränsad anställning under 6 månader i avvaktan på legitimation om du erhåller tjänsten. Har du tidigare erfarenhet av att arbeta i fritidshem ser vi det som meriterande. \n\nSom person är det viktigt att du har förmågan att motivera och inspirera eleverna till att lära. Du som söker får energi av att bidra till andras lärande och du skapar förutsättningar för att lärande ska kunna ske. Du uppmuntrar till dialog, delaktighet och engagemang.\n\nFör dig är det viktigt att skapa goda relationer med elever, föräldrar och kollegor. Du utgår ifrån allas lika värde och skapar en god atmosfär genom att visa respekt och hänsyn för dem du möter i din yrkesroll. Med en öppen och positiv attityd har du elevens behov som utgångspunkt för ditt agerande och du har förmåga att se varje elev utifrån ett helhetsperspektiv.\n\nDu har en vilja att vara med och utveckla skolans verksamhet och du söker och tar fasta på möjligheter att tänka nytt i arbetsrelaterade sammanhang och hur detta kan omsättas i praktiken samt leda till förbättringar.\n\nKänner du igen dig i beskrivningen ovan?\nVarmt välkommen med din ansökan!\n\nTjänsten tillsätts under förbehåll att den inte tas i anspråk av interna skäl.\r\n\nÖVRIGT\nSom anställd i vår förvaltning erbjuds du bland annat friskvårdsbidrag, cykelförmån och medarbetarstöd.\n\nEnligt Skollagen ska utdrag ur polisens belastningsregister uppvisas av personer innan de anställs inom förskoleverksamhet, skola och skolbarnomsorg. Detta beställer du på Polisens hemsida.\n\nInför denna rekrytering har vi tagit ställning till rekryteringskanaler och därför undanber vi oss ytterligare erbjudanden om kompetensförmedling, annonserings- och rekryteringshjälp.\n\nVi tar endast emot ansökningar via vårt rekryteringssystem i enlighet med GDPR.",
        "conditions" : "Heltid. \r\nTillsvidareanställning, tillträde: Tillträde enligt överenskommelse.",
        "text" : "I grundskoleförvaltningen har vi en trygg och tillitsfull kultur. Vi bryr oss om våra elever och varandra. Vi finns till för eleverna, vi samarbetar med vårdnadshavarna och varandra, och vi är öppna för nya tankar och idéer. Här skapar vi bra förutsättningar för den pedagogiska utvecklingen.\n\nBli en av oss!\nNu söker vi dig som har ett stort engagemang för att utveckla en modern verksamhet där vi har fokus på att:\n• öka kvaliteten i undervisningen för att öka elevers lärande.\n• skapa tydligare ansvar, styrning och ledning för att öka elevers kunskapsresultat.\n• öka likvärdighet mellan skolor för att alla elever ska få tillgång till undervisning av hög kvalitet samt kompensera för deras olika förutsättningar.\n\nGöteborgs grundskoleförvaltning är en av de största skolförvaltningarna i Sverige. Vi ansvarar för stadens kommunala skolor från förskoleklass till årskurs nio, grundsärskolan, kulturskolan och fritidshemmen. I förvaltningen finns 138 kommunala grundskolor där nästan 47 000 elever varje dag går i skolan. Hela förvaltningen har cirka 9 700 medarbetare som gemensamt arbetar med att utveckla och ta hand om verksamheten - tillsammans banar vi väg för framtidens skola.\n\nFölj gärna vår resa på Linkedin: https://www.linkedin.com/company/goteborgs-grundskoleforvaltning\r\n\r\nARBETSUPPGIFTER\nHjuviksskolan ligger 100 meter från havet med härlig natur, friska vindar och salta bad i närområdet. Hjuviksskolan har cirka 150 elever från förskoleklass till och med år 3, samt barn i fritidshem för dessa årskurser.\n\nVi arbetar för att våra elever skall känna trygghet, trivsel och arbetsglädje. I detta arbete är våra kamratstödjare och elevrådet viktiga länkar mellan barn och vuxna. På Hjuviksskolan arbetar vi i ett öppet och vänligt klimat med ett starkt elevfokus. Hos oss får eleverna en gedigen kunskapsgrund och möjlighet att utveckla sina förmågor.\n\nSom lärare i vårt fritidshem kommer du att arbeta med att utveckla och bedriva pedagogiskt arbete med barn i årskurserna F-3 tillsammans med dina kollegor. Under skoldagen arbetar du tillsammans med en lärare i klass. Du ansvarar för planering, genomförande och utvärdering av verksamheten tillsammans med ditt arbetslag. Vi arbetar både med gemensam och enskild planering samt utvecklingsmöte för alla som arbetar på fritidshemmet.\r\n\r\nKVALIFIKATIONER\nVi söker nu en till driven lärare i fritidshem till vårt arbetslag som vill vara med och utveckla vår fritidsverksamhet! \n\nFör att passa in i rollen behöver du vara legitimerad lärare i fritidshem i F-3. Du som är nyutexaminerad får en tidsbegränsad anställning under 6 månader i avvaktan på legitimation om du erhåller tjänsten. Har du tidigare erfarenhet av att arbeta i fritidshem ser vi det som meriterande. \n\nSom person är det viktigt att du har förmågan att motivera och inspirera eleverna till att lära. Du som söker får energi av att bidra till andras lärande och du skapar förutsättningar för att lärande ska kunna ske. Du uppmuntrar till dialog, delaktighet och engagemang.\n\nFör dig är det viktigt att skapa goda relationer med elever, föräldrar och kollegor. Du utgår ifrån allas lika värde och skapar en god atmosfär genom att visa respekt och hänsyn för dem du möter i din yrkesroll. Med en öppen och positiv attityd har du elevens behov som utgångspunkt för ditt agerande och du har förmåga att se varje elev utifrån ett helhetsperspektiv.\n\nDu har en vilja att vara med och utveckla skolans verksamhet och du söker och tar fasta på möjligheter att tänka nytt i arbetsrelaterade sammanhang och hur detta kan omsättas i praktiken samt leda till förbättringar.\n\nKänner du igen dig i beskrivningen ovan?\nVarmt välkommen med din ansökan!\n\nTjänsten tillsätts under förbehåll att den inte tas i anspråk av interna skäl.\r\n\nÖVRIGT\nSom anställd i vår förvaltning erbjuds du bland annat friskvårdsbidrag, cykelförmån och medarbetarstöd.\n\nEnligt Skollagen ska utdrag ur polisens belastningsregister uppvisas av personer innan de anställs inom förskoleverksamhet, skola och skolbarnomsorg. Detta beställer du på Polisens hemsida.\n\nInför denna rekrytering har vi tagit ställning till rekryteringskanaler och därför undanber vi oss ytterligare erbjudanden om kompetensförmedling, annonserings- och rekryteringshjälp.\n\nVi tar endast emot ansökningar via vårt rekryteringssystem i enlighet med GDPR."
      },
      "headline" : "Lärare i fritidshem till Hjuviksskolan F-3",
      "driving_license" : null,
      "employer" : {
        "email" : null,
        "phone_number" : null,
        "organization_number" : "2120001355",
        "name" : "GÖTEBORGS KOMMUN",
        "url" : null,
        "workplace" : "Göteborgs Stad , Grundskoleförvaltningen"
      },
      "removed_date" : null,
      "logo_url" : "https://www.arbetsformedlingen.se/rest/arbetsgivare/rest/af/v3/organisation/2120001355/logotyper/logo.png",
      "last_publication_date" : "2022-08-08T23:59:59",
      "number_of_vacancies" : 1,
      "occupation" : {
        "concept_id" : "wHUj_vsP_Jhn",
        "label" : "Lärare i fritidshem/Fritidspedagog",
        "legacy_ams_taxonomy_id" : "5715"
      },
      "occupation_group" : {
        "concept_id" : "CFW8_eBa_NaV",
        "label" : "Fritidspedagoger",
        "legacy_ams_taxonomy_id" : "2342"
      },
      "employment_type" : {
        "concept_id" : "PFZr_Syz_cUq",
        "label" : "Vanlig anställning",
        "legacy_ams_taxonomy_id" : "1"
      },
      "webpage_url" : "https://arbetsformedlingen.se/platsbanken/annonser/26350395",
      "driving_license_required" : false,
      "application_contacts" : [ {
        "description" : "Charlotte Andersson",
        "email" : null,
        "telephone" : "031 366 53 15",
        "name" : null,
        "contact_type" : "Rektor"
      } ],
      "duration" : {
        "concept_id" : "a7uU_j21_mkL",
        "label" : "Tills vidare",
        "legacy_ams_taxonomy_id" : "1"
      },
      "nice_to_have" : {
        "education_level" : [ ],
        "work_experiences" : [ ],
        "skills" : [ ],
        "education" : [ ],
        "languages" : [ ]
      },
      "application_details" : {
        "via_af" : false,
        "email" : null,
        "other" : null,
        "reference" : "HC95125",
        "url" : "https://recruit.visma.com/Public/Apply.aspx?guidAssignment=e41755d4-f602-400e-88e6-9cc0f56ad7b3&publishCode=AMS&TK=c462cbcd-b376-4121-9230-21012f9a6cee",
        "information" : null
      },
      "source_type" : "VIA_PLATSBANKEN_DXA",
      "application_deadline" : "2022-08-08T23:59:59",
      "external_id" : "46-212000-1355-E41755D4F602400E88E69CC0F56AD7B3",
      "workplace_address" : {
        "coordinates" : [ 11.97456, 57.70887 ],
        "city" : null,
        "postcode" : null,
        "municipality" : "Göteborg",
        "region_concept_id" : "zdoY_6u5_Krt",
        "region" : "Västra Götalands län",
        "country_code" : "199",
        "region_code" : "14",
        "municipality_concept_id" : "PVZL_BQT_XtL",
        "country_concept_id" : "i46j_HmG_v64",
        "municipality_code" : "1480",
        "street_address" : null,
        "country" : "Sverige"
      },
      "id" : "26350395",
      "experience_required" : false,
      "working_hours_type" : {
        "concept_id" : "6YE1_gAC_R2G",
        "label" : "Heltid",
        "legacy_ams_taxonomy_id" : "1"
      },
      "access" : null,
      "timestamp" : 1658737514920,
      "must_have" : {
        "education_level" : [ ],
        "work_experiences" : [ ],
        "skills" : [ ],
        "education" : [ ],
        "languages" : [ ]
      },
      "occupation_field" : {
        "concept_id" : "MVqp_eS8_kDZ",
        "label" : "Pedagogik",
        "legacy_ams_taxonomy_id" : "15"
      },
      "scope_of_work" : {
        "min" : 100,
        "max" : 100
      },
      "salary_type" : {
        "concept_id" : "oG8G_9cW_nRf",
        "label" : "Fast månads- vecko- eller timlön",
        "legacy_ams_taxonomy_id" : "1"
      },
      "removed" : false,
      "salary_description" : "Enligt avtal.",
      "access_to_own_car" : false,
      "publication_date" : "2022-07-25T10:25:14"
    },
    "name" : "Lärare i fritidshem till Hjuviksskolan F-3",
    "user" : "kristof.fischer"
  },
  "sha1" : "a7328438321476ce1d511b4f6c5f309df7503025",
  "annotations" : [ {
    "preferred-label" : "Grundlärare, fritidshem",
    "sentiment" : "MUST_HAVE",
    "type" : "occupation-name",
    "start-position" : 0,
    "end-position" : 19,
    "concept-id" : "wHUj_vsP_Jhn",
    "matched-string" : "lärare i fritidshem",
    "annotation-id" : 0
  }, {
    "preferred-label" : "Göteborg",
    "type" : "municipality",
    "start-position" : 761,
    "end-position" : 770,
    "concept-id" : "PVZL_BQT_XtL",
    "matched-string" : "Göteborgs",
    "annotation-id" : 11
  }, {
    "preferred-label" : "Sverige",
    "type" : "country",
    "start-position" : 835,
    "end-position" : 842,
    "concept-id" : "i46j_HmG_v64",
    "matched-string" : "Sverige",
    "annotation-id" : 12
  }, {
    "preferred-label" : "Förskoleklass",
    "sentiment" : "MUST_HAVE",
    "type" : "sun-education-level-3",
    "start-position" : 890,
    "end-position" : 903,
    "concept-id" : "pCha_vWk_pbR",
    "matched-string" : "förskoleklass",
    "annotation-id" : 2
  }, {
    "preferred-label" : "Förskoleklass",
    "sentiment" : "MUST_HAVE",
    "type" : "sun-education-level-3",
    "start-position" : 1490,
    "end-position" : 1503,
    "concept-id" : "pCha_vWk_pbR",
    "matched-string" : "förskoleklass",
    "annotation-id" : 4
  }, {
    "preferred-label" : "Grundlärare, fritidshem",
    "type" : "occupation-name",
    "start-position" : 1915,
    "end-position" : 1939,
    "concept-id" : "wHUj_vsP_Jhn",
    "matched-string" : "lärare i vårt fritidshem",
    "annotation-id" : 13
  }, {
    "preferred-label" : "Pedagogiskt arbete",
    "sentiment" : "MUST_HAVE",
    "type" : "keyword",
    "start-position" : 1990,
    "end-position" : 2008,
    "concept-id" : "NXqi_A8a_X1b",
    "matched-string" : "pedagogiskt arbete",
    "annotation-id" : 7
  }, {
    "preferred-label" : "Grundlärare, fritidshem",
    "sentiment" : "MUST_HAVE",
    "type" : "occupation-name",
    "start-position" : 2390,
    "end-position" : 2409,
    "concept-id" : "wHUj_vsP_Jhn",
    "matched-string" : "lärare i fritidshem",
    "annotation-id" : 8
  }, {
    "preferred-label" : "Grundlärare, fritidshem",
    "sentiment" : "MUST_HAVE",
    "type" : "occupation-name",
    "start-position" : 2540,
    "end-position" : 2559,
    "concept-id" : "wHUj_vsP_Jhn",
    "matched-string" : "lärare i fritidshem",
    "annotation-id" : 9
  }, {
    "preferred-label" : "Tidsbegränsad anställning",
    "type" : "employment-type",
    "start-position" : 2599,
    "end-position" : 2624,
    "concept-id" : "sTu5_NBQ_udq",
    "matched-string" : "tidsbegränsad anställning",
    "annotation-id" : 14
  }, {
    "preferred-label" : "Fritidshem",
    "sentiment" : "NICE_TO_HAVE",
    "type" : "skill",
    "start-position" : 2727,
    "end-position" : 2746,
    "concept-id" : "Aq3e_Bdv_v45",
    "matched-string" : "arbeta i fritidshem",
    "annotation-id" : 15
  }, {
    "preferred-label" : "motivera andra",
    "type" : "esco-skill",
    "start-position" : 2827,
    "end-position" : 2858,
    "concept-id" : "fPbr_Gxm_PBr",
    "matched-string" : "motivera och inspirera eleverna",
    "annotation-id" : 16
  }, {
    "preferred-label" : "upprätthålla arbetsmässiga relationer",
    "sentiment" : "MUST_HAVE",
    "type" : "esco-skill",
    "start-position" : 3075,
    "end-position" : 3096,
    "concept-id" : "FSSe_5dD_kXc",
    "matched-string" : "skapa goda relationer",
    "annotation-id" : 17
  }, {
    "preferred-label" : "visa hänsyn",
    "sentiment" : "MUST_HAVE",
    "type" : "esco-skill",
    "start-position" : 3202,
    "end-position" : 3225,
    "concept-id" : "GJWS_uWb_AzA",
    "matched-string" : "visa respekt och hänsyn",
    "annotation-id" : 18
  }, {
    "preferred-label" : null,
    "sentiment" : "MUST_HAVE",
    "type" : "skill",
    "start-position" : 3372,
    "end-position" : 3415,
    "concept-id" : null,
    "matched-string" : "se varje elev utifrån ett helhetsperspektiv",
    "annotation-id" : 19
  } ],
  "text" : "Lärare i fritidshem till Hjuviksskolan F-3\nI grundskoleförvaltningen har vi en trygg och tillitsfull kultur. Vi bryr oss om våra elever och varandra. Vi finns till för eleverna, vi samarbetar med vårdnadshavarna och varandra, och vi är öppna för nya tankar och idéer. Här skapar vi bra förutsättningar för den pedagogiska utvecklingen.\n\nBli en av oss!\nNu söker vi dig som har ett stort engagemang för att utveckla en modern verksamhet där vi har fokus på att:\n• öka kvaliteten i undervisningen för att öka elevers lärande.\n• skapa tydligare ansvar, styrning och ledning för att öka elevers kunskapsresultat.\n• öka likvärdighet mellan skolor för att alla elever ska få tillgång till undervisning av hög kvalitet samt kompensera för deras olika förutsättningar.\n\nGöteborgs grundskoleförvaltning är en av de största skolförvaltningarna i Sverige. Vi ansvarar för stadens kommunala skolor från förskoleklass till årskurs nio, grundsärskolan, kulturskolan och fritidshemmen. I förvaltningen finns 138 kommunala grundskolor där nästan 47 000 elever varje dag går i skolan. Hela förvaltningen har cirka 9 700 medarbetare som gemensamt arbetar med att utveckla och ta hand om verksamheten - tillsammans banar vi väg för framtidens skola.\n\nFölj gärna vår resa på Linkedin: https://www.linkedin.com/company/goteborgs-grundskoleforvaltning\r\n\r\nARBETSUPPGIFTER\nHjuviksskolan ligger 100 meter från havet med härlig natur, friska vindar och salta bad i närområdet. Hjuviksskolan har cirka 150 elever från förskoleklass till och med år 3, samt barn i fritidshem för dessa årskurser.\n\nVi arbetar för att våra elever skall känna trygghet, trivsel och arbetsglädje. I detta arbete är våra kamratstödjare och elevrådet viktiga länkar mellan barn och vuxna. På Hjuviksskolan arbetar vi i ett öppet och vänligt klimat med ett starkt elevfokus. Hos oss får eleverna en gedigen kunskapsgrund och möjlighet att utveckla sina förmågor.\n\nSom lärare i vårt fritidshem kommer du att arbeta med att utveckla och bedriva pedagogiskt arbete med barn i årskurserna F-3 tillsammans med dina kollegor. Under skoldagen arbetar du tillsammans med en lärare i klass. Du ansvarar för planering, genomförande och utvärdering av verksamheten tillsammans med ditt arbetslag. Vi arbetar både med gemensam och enskild planering samt utvecklingsmöte för alla som arbetar på fritidshemmet.\r\n\r\nKVALIFIKATIONER\nVi söker nu en till driven lärare i fritidshem till vårt arbetslag som vill vara med och utveckla vår fritidsverksamhet! \n\nFör att passa in i rollen behöver du vara legitimerad lärare i fritidshem i F-3. Du som är nyutexaminerad får en tidsbegränsad anställning under 6 månader i avvaktan på legitimation om du erhåller tjänsten. Har du tidigare erfarenhet av att arbeta i fritidshem ser vi det som meriterande. \n\nSom person är det viktigt att du har förmågan att motivera och inspirera eleverna till att lära. Du som söker får energi av att bidra till andras lärande och du skapar förutsättningar för att lärande ska kunna ske. Du uppmuntrar till dialog, delaktighet och engagemang.\n\nFör dig är det viktigt att skapa goda relationer med elever, föräldrar och kollegor. Du utgår ifrån allas lika värde och skapar en god atmosfär genom att visa respekt och hänsyn för dem du möter i din yrkesroll. Med en öppen och positiv attityd har du elevens behov som utgångspunkt för ditt agerande och du har förmåga att se varje elev utifrån ett helhetsperspektiv.\n\nDu har en vilja att vara med och utveckla skolans verksamhet och du söker och tar fasta på möjligheter att tänka nytt i arbetsrelaterade sammanhang och hur detta kan omsättas i praktiken samt leda till förbättringar.\n\nKänner du igen dig i beskrivningen ovan?\nVarmt välkommen med din ansökan!\n\nTjänsten tillsätts under förbehåll att den inte tas i anspråk av interna skäl.\r\n\nÖVRIGT\nSom anställd i vår förvaltning erbjuds du bland annat friskvårdsbidrag, cykelförmån och medarbetarstöd.\n\nEnligt Skollagen ska utdrag ur polisens belastningsregister uppvisas av personer innan de anställs inom förskoleverksamhet, skola och skolbarnomsorg. Detta beställer du på Polisens hemsida.\n\nInför denna rekrytering har vi tagit ställning till rekryteringskanaler och därför undanber vi oss ytterligare erbjudanden om kompetensförmedling, annonserings- och rekryteringshjälp.\n\nVi tar endast emot ansökningar via vårt rekryteringssystem i enlighet med GDPR."
}