{
  "meta" : {
    "jobad" : {
      "description" : {
        "requirements" : null,
        "needs" : null,
        "company_information" : null,
        "text_formatted" : "Om oss\nGenom väl beprövade metoder och arbetssätt hjälper vi logistik- och industriföretag att optimera sin verksamhet och därmed minska sina personalkostnader. Vi planerar, levererar och opererar vårt åtagande genom en mycket erfaren och specialiserad organisation inom logistik- och industriområdet. Aditro Logistics Staffing levererar tjänster inom Uthyrning, Entreprenad, Rekrytering och konsulterande tjänster. Läs gärna mer på aditrologistics.se\n\nAditro Logistics Staffing AB är ett Auktoriserat Bemanningsföretag vilket innebär bland annat att alla anställda är kollektivavtalsanslutna och att vi som företag följer alla de regler som dikteras av branschens kollektivavtal, leveransvillkor och skrivelser om försäkringsåtaganden.\n\nVad vi erbjuder dig\nDu kommer möta utmaningar, bli inspirerad och vara stolt över att gå till jobbet. Hos Aditro Logistics Staffing är alla lika värda. Vi tar väl hand om varandra och våra beteenden är att ständigt engagera, prestera och utveckla oss själva och de uppdrag och samarbeten vi jobbar med. Vi erbjuder stor möjlighet till personlig utveckling genom alla de olika kunduppdrag vi har. Hos oss är det viktigt med ett engagerat ledarskap. Hos oss träffar du din chef varje vecka, i många fall varje dag.\n\nArbetsuppgifter\n· Montering och demontering i butik, kontor, byggarbetsplatser och mässor \n· Resor och övernattning på annan ort inom Sverige \n· Ha kundkontakt och löpande rapportering mot slutkund  \n· Utföra byte av hårdvara, implementera installationer och arbeta med felsökning \n\n\n\nDin profil\nVi söker flera till vårt team. Är du en ''doer'' som vill utvecklas och vara med på en spännande tillväxtresa? Multi Logistik söker nu nästa kollega till rollen som montör. Här kan du förvänta dig en vardag med arbetsuppgifter högt som lågt där kunden är i fokus. Låter det här som något för dig? Sök redan idag! \n\nFör rätt person finns goda utvecklingsmöjligheter och många steg att ta framåt i arbetslivet.\n\nKrav för tjänsten är:\n \n· Tidigare erfarenhet inom montage och installation eller är meriterande \n· B-körkort är ett krav. \n· Goda referenser\n· Du är i god fysisk form och klarar av tunga lyft\n· Du behärskar svenska och engelska språket flytande. Både i tal och skrift.\nPlacering: Utgår från vårt lager i Rosersberg\n\n\n\n\nMeriterande:\n· Du har med fördel tidigare arbetat med hårdvara, där det innefattat felsökning och installation\n· Du har med fördel tidigare arbetat med IT-support i kundmiljö \n· Du har ett tekniskt intresse \n· Du är noggrann och strukturerad \n· Du trivs med ett varierande arbete med nya utmaningar varje dag \n· Du gillar att arbeta fysiskt och har inga problem med tyngre lyft \n· Är öppen och flexibel när det gäller nya rutiner, idéer och förändringar och ser det som en rolig utmaning \n· Du har drivkraft och ambition att utföra dina arbetsuppgifter självständigt, i tid och på ett effektivt sätt och en vilja att lära sig nya saker och ständigt utvecklas. Men arbetar gärna i team och behjälplig dina kollegor \n· Du har inga problem med att de förekommer långa dagar och övernattning på annan ort \n· Du är kommunikativ, tar åt sig instruktioner och har ett positivt mindset med ambition att alltid göra det lilla extra när det krävs\n\n\n\nVarmt välkommen med din ansökan redan idag!\n\nVi rekryterar löpande och tjänsterna kan bli tillsatta innan sista dag.",
        "conditions" : "Heltid\r\nTillsvidare",
        "text" : "Om oss\nGenom väl beprövade metoder och arbetssätt hjälper vi logistik- och industriföretag att optimera sin verksamhet och därmed minska sina personalkostnader. Vi planerar, levererar och opererar vårt åtagande genom en mycket erfaren och specialiserad organisation inom logistik- och industriområdet. Aditro Logistics Staffing levererar tjänster inom Uthyrning, Entreprenad, Rekrytering och konsulterande tjänster. Läs gärna mer på aditrologistics.se\n\nAditro Logistics Staffing AB är ett Auktoriserat Bemanningsföretag vilket innebär bland annat att alla anställda är kollektivavtalsanslutna och att vi som företag följer alla de regler som dikteras av branschens kollektivavtal, leveransvillkor och skrivelser om försäkringsåtaganden.\n\nVad vi erbjuder dig\nDu kommer möta utmaningar, bli inspirerad och vara stolt över att gå till jobbet. Hos Aditro Logistics Staffing är alla lika värda. Vi tar väl hand om varandra och våra beteenden är att ständigt engagera, prestera och utveckla oss själva och de uppdrag och samarbeten vi jobbar med. Vi erbjuder stor möjlighet till personlig utveckling genom alla de olika kunduppdrag vi har. Hos oss är det viktigt med ett engagerat ledarskap. Hos oss träffar du din chef varje vecka, i många fall varje dag.\n\nArbetsuppgifter\n· Montering och demontering i butik, kontor, byggarbetsplatser och mässor \n· Resor och övernattning på annan ort inom Sverige \n· Ha kundkontakt och löpande rapportering mot slutkund  \n· Utföra byte av hårdvara, implementera installationer och arbeta med felsökning \n\n\n\nDin profil\nVi söker flera till vårt team. Är du en ''doer'' som vill utvecklas och vara med på en spännande tillväxtresa? Multi Logistik söker nu nästa kollega till rollen som montör. Här kan du förvänta dig en vardag med arbetsuppgifter högt som lågt där kunden är i fokus. Låter det här som något för dig? Sök redan idag! \n\nFör rätt person finns goda utvecklingsmöjligheter och många steg att ta framåt i arbetslivet.\n\nKrav för tjänsten är:\n \n· Tidigare erfarenhet inom montage och installation eller är meriterande \n· B-körkort är ett krav. \n· Goda referenser\n· Du är i god fysisk form och klarar av tunga lyft\n· Du behärskar svenska och engelska språket flytande. Både i tal och skrift.\nPlacering: Utgår från vårt lager i Rosersberg\n\n\n\n\nMeriterande:\n· Du har med fördel tidigare arbetat med hårdvara, där det innefattat felsökning och installation\n· Du har med fördel tidigare arbetat med IT-support i kundmiljö \n· Du har ett tekniskt intresse \n· Du är noggrann och strukturerad \n· Du trivs med ett varierande arbete med nya utmaningar varje dag \n· Du gillar att arbeta fysiskt och har inga problem med tyngre lyft \n· Är öppen och flexibel när det gäller nya rutiner, idéer och förändringar och ser det som en rolig utmaning \n· Du har drivkraft och ambition att utföra dina arbetsuppgifter självständigt, i tid och på ett effektivt sätt och en vilja att lära sig nya saker och ständigt utvecklas. Men arbetar gärna i team och behjälplig dina kollegor \n· Du har inga problem med att de förekommer långa dagar och övernattning på annan ort \n· Du är kommunikativ, tar åt sig instruktioner och har ett positivt mindset med ambition att alltid göra det lilla extra när det krävs\n\n\n\nVarmt välkommen med din ansökan redan idag!\n\nVi rekryterar löpande och tjänsterna kan bli tillsatta innan sista dag."
      },
      "headline" : "Montörer till Multi",
      "driving_license" : [ {
        "concept_id" : "VTK8_WRx_GcM",
        "label" : "B",
        "legacy_ams_taxonomy_id" : "3"
      } ],
      "employer" : {
        "email" : null,
        "phone_number" : null,
        "organization_number" : "5569203689",
        "name" : "Aditro Logistics Staffing AB",
        "url" : "http://aditrologistics.se/",
        "workplace" : "Aditro Logistics Staffing AB "
      },
      "removed_date" : null,
      "logo_url" : "https://www.arbetsformedlingen.se/rest/arbetsgivare/rest/af/v3/organisation/5569203689/logotyper/logo.png",
      "last_publication_date" : "2022-07-10T23:59:59",
      "number_of_vacancies" : 5,
      "occupation" : {
        "concept_id" : "AfoB_XP5_5Ak",
        "label" : "Originalmontör",
        "legacy_ams_taxonomy_id" : "4665"
      },
      "occupation_group" : {
        "concept_id" : "8Bmh_vtM_zts",
        "label" : "Grafisk formgivare m.fl.",
        "legacy_ams_taxonomy_id" : "2172"
      },
      "employment_type" : {
        "concept_id" : "PFZr_Syz_cUq",
        "label" : "Vanlig anställning",
        "legacy_ams_taxonomy_id" : "1"
      },
      "webpage_url" : "https://arbetsformedlingen.se/platsbanken/annonser/26202884",
      "driving_license_required" : true,
      "application_contacts" : [ {
        "description" : "Danayet Seium",
        "email" : "danayet.seium@aditrologistics.com",
        "telephone" : null,
        "name" : null,
        "contact_type" : null
      } ],
      "duration" : {
        "concept_id" : "a7uU_j21_mkL",
        "label" : "Tills vidare",
        "legacy_ams_taxonomy_id" : "1"
      },
      "nice_to_have" : {
        "education_level" : [ ],
        "work_experiences" : [ ],
        "skills" : [ ],
        "education" : [ ],
        "languages" : [ ]
      },
      "application_details" : {
        "via_af" : false,
        "email" : null,
        "other" : null,
        "reference" : "2204",
        "url" : "https://jobs.aditrologistics.com/jobb/2204/ansokningsformular/",
        "information" : null
      },
      "source_type" : "VIA_PLATSBANKEN_DXA",
      "application_deadline" : "2022-07-10T23:59:59",
      "external_id" : "46-556920-3689-2204",
      "workplace_address" : {
        "coordinates" : [ 18.06858, 59.329323 ],
        "city" : null,
        "postcode" : null,
        "municipality" : "Stockholm",
        "region_concept_id" : "CifL_Rzy_Mku",
        "region" : "Stockholms län",
        "country_code" : "199",
        "region_code" : "01",
        "municipality_concept_id" : "AvNB_uwa_6n6",
        "country_concept_id" : "i46j_HmG_v64",
        "municipality_code" : "0180",
        "street_address" : null,
        "country" : "Sverige"
      },
      "id" : "26202884",
      "experience_required" : true,
      "working_hours_type" : {
        "concept_id" : "6YE1_gAC_R2G",
        "label" : "Heltid",
        "legacy_ams_taxonomy_id" : "1"
      },
      "access" : null,
      "timestamp" : 1654928982627,
      "must_have" : {
        "education_level" : [ ],
        "work_experiences" : [ {
          "concept_id" : "AfoB_XP5_5Ak",
          "weight" : 10,
          "label" : "Originalmontör",
          "legacy_ams_taxonomy_id" : "4665"
        } ],
        "skills" : [ ],
        "education" : [ ],
        "languages" : [ ]
      },
      "occupation_field" : {
        "concept_id" : "9puE_nYg_crq",
        "label" : "Kultur, media, design",
        "legacy_ams_taxonomy_id" : "11"
      },
      "scope_of_work" : {
        "min" : 100,
        "max" : 100
      },
      "salary_type" : {
        "concept_id" : "oG8G_9cW_nRf",
        "label" : "Fast månads- vecko- eller timlön",
        "legacy_ams_taxonomy_id" : "1"
      },
      "removed" : false,
      "salary_description" : "Fast lön",
      "access_to_own_car" : false,
      "publication_date" : "2022-06-11T08:29:42"
    },
    "name" : "Montörer till Multi",
    "user" : "hannes"
  },
  "sha1" : "a41a59ef3edd48c9c1116933a70f5ee14b1b6f6d",
  "annotations" : [ {
    "preferred-label" : "Montörer",
    "sentiment" : "MUST_HAVE",
    "type" : "ssyk-level-3",
    "start-position" : 0,
    "end-position" : 8,
    "concept-id" : "Wz8B_WeK_vUB",
    "matched-string" : "montörer",
    "annotation-id" : 0
  }, {
    "preferred-label" : "Logistik",
    "sentiment" : "MUST_HAVE",
    "type" : "skill",
    "start-position" : 81,
    "end-position" : 89,
    "concept-id" : "yXmf_iKi_7ci",
    "matched-string" : "logistik",
    "annotation-id" : 1
  }, {
    "preferred-label" : "Logistik",
    "sentiment" : "MUST_HAVE",
    "type" : "skill",
    "start-position" : 291,
    "end-position" : 299,
    "concept-id" : "yXmf_iKi_7ci",
    "matched-string" : "logistik",
    "annotation-id" : 2
  }, {
    "preferred-label" : "Konsulttjänster till företag",
    "type" : "sni-level-3",
    "start-position" : 412,
    "end-position" : 434,
    "concept-id" : "APkH_QHR_9X2",
    "matched-string" : "konsulterande tjänster",
    "annotation-id" : 16
  }, {
    "preferred-label" : "Kollektivavtal",
    "sentiment" : "MUST_HAVE",
    "type" : "skill",
    "start-position" : 685,
    "end-position" : 699,
    "concept-id" : "z7wE_9xb_3jX",
    "matched-string" : "kollektivavtal",
    "annotation-id" : 3
  }, {
    "preferred-label" : "personlig utveckling",
    "sentiment" : "MUST_HAVE",
    "type" : "esco-skill",
    "start-position" : 1093,
    "end-position" : 1113,
    "concept-id" : "wkQj_Dah_2GD",
    "matched-string" : "personlig utveckling",
    "annotation-id" : 4
  }, {
    "preferred-label" : "Montörer",
    "type" : "ssyk-level-3",
    "start-position" : 1290,
    "end-position" : 1299,
    "concept-id" : "Wz8B_WeK_vUB",
    "matched-string" : "Montering",
    "annotation-id" : 17
  }, {
    "preferred-label" : "Demontering",
    "sentiment" : "MUST_HAVE",
    "type" : "skill",
    "start-position" : 1304,
    "end-position" : 1315,
    "concept-id" : "f8Sz_Xaf_TEU",
    "matched-string" : "demontering",
    "annotation-id" : 5
  }, {
    "preferred-label" : "Butik",
    "sentiment" : "MUST_HAVE",
    "type" : "keyword",
    "start-position" : 1318,
    "end-position" : 1323,
    "concept-id" : "xLsd_zjY_5wr",
    "matched-string" : "butik",
    "annotation-id" : 6
  }, {
    "preferred-label" : "Kontor",
    "sentiment" : "MUST_HAVE",
    "type" : "keyword",
    "start-position" : 1325,
    "end-position" : 1331,
    "concept-id" : "Hyz1_7HF_AkP",
    "matched-string" : "kontor",
    "annotation-id" : 7
  }, {
    "preferred-label" : "sätta upp tillfällig infrastruktur på byggarbetsplats",
    "type" : "esco-skill",
    "start-position" : 1333,
    "end-position" : 1350,
    "concept-id" : "o9Lw_96K_Z2q",
    "matched-string" : "byggarbetsplatser",
    "annotation-id" : 18
  }, {
    "preferred-label" : "Arrangemang av kongresser och mässor",
    "type" : "sni-level-3",
    "start-position" : 1355,
    "end-position" : 1361,
    "concept-id" : "Akiy_Uak_wVu",
    "matched-string" : "mässor",
    "annotation-id" : 19
  }, {
    "preferred-label" : "Resor",
    "sentiment" : "MUST_HAVE",
    "type" : "keyword",
    "start-position" : 1365,
    "end-position" : 1370,
    "concept-id" : "mj44_gFW_1X5",
    "matched-string" : "resor",
    "annotation-id" : 8
  }, {
    "preferred-label" : "Sverige",
    "type" : "country",
    "start-position" : 1406,
    "end-position" : 1413,
    "concept-id" : "i46j_HmG_v64",
    "matched-string" : "Sverige",
    "annotation-id" : 20
  }, {
    "preferred-label" : "Hårdvara",
    "sentiment" : "MUST_HAVE",
    "type" : "skill-headline",
    "start-position" : 1489,
    "end-position" : 1497,
    "concept-id" : "22jK_Hje_3Ec",
    "matched-string" : "hårdvara",
    "annotation-id" : 9
  }, {
    "preferred-label" : "Installation, drift, underhåll",
    "type" : "occupation-field",
    "start-position" : 1499,
    "end-position" : 1526,
    "concept-id" : "yhCP_AqT_tns",
    "matched-string" : "implementera installationer",
    "annotation-id" : 22
  }, {
    "preferred-label" : "göra felsökning",
    "type" : "esco-skill",
    "start-position" : 1531,
    "end-position" : 1552,
    "concept-id" : "HqC8_fVY_ACM",
    "matched-string" : "arbeta med felsökning",
    "annotation-id" : 21
  }, {
    "preferred-label" : "Logistik",
    "sentiment" : "MUST_HAVE",
    "type" : "skill",
    "start-position" : 1685,
    "end-position" : 1693,
    "concept-id" : "yXmf_iKi_7ci",
    "matched-string" : "logistik",
    "annotation-id" : 10
  }, {
    "preferred-label" : "Montörer",
    "type" : "ssyk-level-3",
    "start-position" : 1733,
    "end-position" : 1739,
    "concept-id" : "Wz8B_WeK_vUB",
    "matched-string" : "montör",
    "annotation-id" : 23
  }, {
    "preferred-label" : "B",
    "type" : "driving-licence",
    "start-position" : 2078,
    "end-position" : 2087,
    "concept-id" : "VTK8_WRx_GcM",
    "matched-string" : "B-körkort",
    "annotation-id" : 24
  }, {
    "preferred-label" : "Svenska",
    "sentiment" : "MUST_HAVE",
    "type" : "language",
    "start-position" : 2186,
    "end-position" : 2193,
    "concept-id" : "zSLA_vw2_FXN",
    "matched-string" : "svenska",
    "annotation-id" : 11
  }, {
    "preferred-label" : "Engelska",
    "sentiment" : "MUST_HAVE",
    "type" : "language",
    "start-position" : 2198,
    "end-position" : 2206,
    "concept-id" : "NVxJ_hLg_TYS",
    "matched-string" : "engelska",
    "annotation-id" : 12
  }, {
    "preferred-label" : "Lager",
    "sentiment" : "MUST_HAVE",
    "type" : "keyword",
    "start-position" : 2275,
    "end-position" : 2280,
    "concept-id" : "J5gJ_6vV_egQ",
    "matched-string" : "lager",
    "annotation-id" : 13
  }, {
    "preferred-label" : "Hårdvara",
    "sentiment" : "MUST_HAVE",
    "type" : "skill-headline",
    "start-position" : 2352,
    "end-position" : 2360,
    "concept-id" : "22jK_Hje_3Ec",
    "matched-string" : "hårdvara",
    "annotation-id" : 14
  }, {
    "preferred-label" : "göra felsökning",
    "type" : "esco-skill",
    "start-position" : 2381,
    "end-position" : 2391,
    "concept-id" : "HqC8_fVY_ACM",
    "matched-string" : "felsökning",
    "annotation-id" : 25
  }, {
    "preferred-label" : "IT-support",
    "sentiment" : "MUST_HAVE",
    "type" : "keyword",
    "start-position" : 2450,
    "end-position" : 2460,
    "concept-id" : "1Nz1_z46_39V",
    "matched-string" : "it-support",
    "annotation-id" : 15
  }, {
    "preferred-label" : "noggrannhet",
    "type" : "esco-skill",
    "start-position" : 2514,
    "end-position" : 2522,
    "concept-id" : "mrsW_EkL_KRD",
    "matched-string" : "noggrann",
    "annotation-id" : 26
  }, {
    "preferred-label" : "God fysik (tunga lyft)",
    "type" : "skill",
    "start-position" : 2664,
    "end-position" : 2675,
    "concept-id" : "rwir_xvu_443",
    "matched-string" : "tyngre lyft",
    "annotation-id" : 27
  }, {
    "preferred-label" : "arbeta självständigt",
    "type" : "esco-skill",
    "start-position" : 2835,
    "end-position" : 2864,
    "concept-id" : "NyFu_HHd_zhz",
    "matched-string" : "arbetsuppgifter självständigt",
    "annotation-id" : 28
  } ],
  "text" : "Montörer till Multi\nOm oss\nGenom väl beprövade metoder och arbetssätt hjälper vi logistik- och industriföretag att optimera sin verksamhet och därmed minska sina personalkostnader. Vi planerar, levererar och opererar vårt åtagande genom en mycket erfaren och specialiserad organisation inom logistik- och industriområdet. Aditro Logistics Staffing levererar tjänster inom Uthyrning, Entreprenad, Rekrytering och konsulterande tjänster. Läs gärna mer på aditrologistics.se\n\nAditro Logistics Staffing AB är ett Auktoriserat Bemanningsföretag vilket innebär bland annat att alla anställda är kollektivavtalsanslutna och att vi som företag följer alla de regler som dikteras av branschens kollektivavtal, leveransvillkor och skrivelser om försäkringsåtaganden.\n\nVad vi erbjuder dig\nDu kommer möta utmaningar, bli inspirerad och vara stolt över att gå till jobbet. Hos Aditro Logistics Staffing är alla lika värda. Vi tar väl hand om varandra och våra beteenden är att ständigt engagera, prestera och utveckla oss själva och de uppdrag och samarbeten vi jobbar med. Vi erbjuder stor möjlighet till personlig utveckling genom alla de olika kunduppdrag vi har. Hos oss är det viktigt med ett engagerat ledarskap. Hos oss träffar du din chef varje vecka, i många fall varje dag.\n\nArbetsuppgifter\n· Montering och demontering i butik, kontor, byggarbetsplatser och mässor \n· Resor och övernattning på annan ort inom Sverige \n· Ha kundkontakt och löpande rapportering mot slutkund  \n· Utföra byte av hårdvara, implementera installationer och arbeta med felsökning \n\n\n\nDin profil\nVi söker flera till vårt team. Är du en ''doer'' som vill utvecklas och vara med på en spännande tillväxtresa? Multi Logistik söker nu nästa kollega till rollen som montör. Här kan du förvänta dig en vardag med arbetsuppgifter högt som lågt där kunden är i fokus. Låter det här som något för dig? Sök redan idag! \n\nFör rätt person finns goda utvecklingsmöjligheter och många steg att ta framåt i arbetslivet.\n\nKrav för tjänsten är:\n \n· Tidigare erfarenhet inom montage och installation eller är meriterande \n· B-körkort är ett krav. \n· Goda referenser\n· Du är i god fysisk form och klarar av tunga lyft\n· Du behärskar svenska och engelska språket flytande. Både i tal och skrift.\nPlacering: Utgår från vårt lager i Rosersberg\n\n\n\n\nMeriterande:\n· Du har med fördel tidigare arbetat med hårdvara, där det innefattat felsökning och installation\n· Du har med fördel tidigare arbetat med IT-support i kundmiljö \n· Du har ett tekniskt intresse \n· Du är noggrann och strukturerad \n· Du trivs med ett varierande arbete med nya utmaningar varje dag \n· Du gillar att arbeta fysiskt och har inga problem med tyngre lyft \n· Är öppen och flexibel när det gäller nya rutiner, idéer och förändringar och ser det som en rolig utmaning \n· Du har drivkraft och ambition att utföra dina arbetsuppgifter självständigt, i tid och på ett effektivt sätt och en vilja att lära sig nya saker och ständigt utvecklas. Men arbetar gärna i team och behjälplig dina kollegor \n· Du har inga problem med att de förekommer långa dagar och övernattning på annan ort \n· Du är kommunikativ, tar åt sig instruktioner och har ett positivt mindset med ambition att alltid göra det lilla extra när det krävs\n\n\n\nVarmt välkommen med din ansökan redan idag!\n\nVi rekryterar löpande och tjänsterna kan bli tillsatta innan sista dag."
}