{
  "meta" : {
    "jobad" : {
      "description" : {
        "requirements" : null,
        "needs" : null,
        "company_information" : null,
        "text_formatted" : "Enheten Avfall Avloppsanläggningar inom teknisk förvaltning Östersunds kommun driver och utvecklar avfalls- och avloppsanläggningar. Enheten omfattar 8 avloppsreningsverk, ett 40-tal pumpstationer, en uppgraderingsanläggning för fordonsgas och en avfallsanläggning. Enheten kontrollerar också statusen i ett antal deponier och jordtippar runt om i kommunen där verksamheten sedan tidigare upphört.\n\nÖstersunds Kommun har mer än 5 600 personer anställda i sju förvaltningar. Vi verkar inom 400 olika yrken och jobbar mot ett gemensamt mål: att göra medborgarnas liv rikare, enklare och tryggare.\r\n\r\nArbetsuppgifter\r\n\r\nSom miljötekniker har du tillsammans med dina kollegor ansvar för det operativa arbetet vid Gräfsåsens avfallsanläggning. Gräfsåsen tar emot avfall från kommuner och verksamheter i hela länet. På anläggningen sker mottagning, sortering, mellanlagring, förbehandling och behandling av avfallet. Du får en roll kring avfallsanläggningens olika materialflöden och deltar i den operativa driften av avfallsanläggningen. Tillsammans ansvarar vi för att anläggningen uppfyller villkoren kopplade till anläggningens tillstånd och att aktuell lagstiftning efterlevs. Rollen innebär många kontaktytor och verksamheten bedrivs i nära samarbete med övriga delar på kommunen, tillsynsmyndigheten, anlitade entreprenörer, och våra kunder. \n\nI arbetsuppgifterna ingår:\n.Mottagning, kontroll, omlastning, förbehandling och behandling av allt inkommet avfall\n.Anläggning och underhåll av samtliga hårdgjorda ytor samt planering av deponier\n.Tillverkning av tätskikt\n.Kort- och långsiktig planering av samtliga arbetsuppgifter på anläggningen\n.I förekommande fall drift av gasstation\n.Underhåll och daglig kontroll av maskinpark\n.Daglig kontroll av anläggningens funktioner utifrån gällande tillstånd och kommunens arbete med miljö, arbetsmiljö, kvalitet och säkerhet\n.I förekommande fall provtagning vatten och drift av pumpstation\n.Aktivt delta och hålla sig uppdaterad i säkerhetsarbetet\n.Avvikelserapportering\n.Vara delaktig vid utredningar \n.Delta i de utbildningar som arbetsgivaren anser nödvändiga för att utföra arbetet\n.Underhåll av maskinpark\n.Daglig kontroll av anläggningen och maskinernas funktioner utifrån miljö och säkerhet\n.Ta hand om praktikanter och ferieanställda\r\n\r\nKvalifikationer\n\nVi söker dig som har miljöintresse och förmåga att arbeta självständigt under eget ansvar. Du är en självgående, strukturerad och anpassningsbar person. För att trivas hos oss ska du trivas med arbeten som ställer höga krav på flexibilitet och förmåga att planera och prioritera ditt arbete. Du har god förmåga att skapa relationer med kunder och leverantörer. Du är trygg i din roll och agerar serviceinriktat med stort kundfokus. Vi lägger stor vikt vid den personliga lämpligheten.\n\nDet är meriterande om du har erfarenhet av svetsning och service av fordon. Du har god förmåga att uttrycka dig i tal och skrift på svenska. \nB och C -körkort är ett krav samt förarbevis på hjullastare och grävmaskin.\n\nVälkommen med din ansökan med CV och personligt brev senast 2022-08-19. Betyg/intyg behöver inte skickas med. Uppvisande av detta blir aktuellt vid eventuell intervju. Urval och intervjuer sker fortlöpande under ansökningstiden.\n\nInför rekryteringsarbetet har Östersunds kommun tagit ställning till rekryteringskanaler och marknadsföring. Vi undanber oss därför kontakt med mediesäljare.",
        "conditions" : "Heltid\r\nTillsvidare",
        "text" : "Enheten Avfall Avloppsanläggningar inom teknisk förvaltning Östersunds kommun driver och utvecklar avfalls- och avloppsanläggningar. Enheten omfattar 8 avloppsreningsverk, ett 40-tal pumpstationer, en uppgraderingsanläggning för fordonsgas och en avfallsanläggning. Enheten kontrollerar också statusen i ett antal deponier och jordtippar runt om i kommunen där verksamheten sedan tidigare upphört.\n\nÖstersunds Kommun har mer än 5 600 personer anställda i sju förvaltningar. Vi verkar inom 400 olika yrken och jobbar mot ett gemensamt mål: att göra medborgarnas liv rikare, enklare och tryggare.\r\n\r\nArbetsuppgifter\r\n\r\nSom miljötekniker har du tillsammans med dina kollegor ansvar för det operativa arbetet vid Gräfsåsens avfallsanläggning. Gräfsåsen tar emot avfall från kommuner och verksamheter i hela länet. På anläggningen sker mottagning, sortering, mellanlagring, förbehandling och behandling av avfallet. Du får en roll kring avfallsanläggningens olika materialflöden och deltar i den operativa driften av avfallsanläggningen. Tillsammans ansvarar vi för att anläggningen uppfyller villkoren kopplade till anläggningens tillstånd och att aktuell lagstiftning efterlevs. Rollen innebär många kontaktytor och verksamheten bedrivs i nära samarbete med övriga delar på kommunen, tillsynsmyndigheten, anlitade entreprenörer, och våra kunder. \n\nI arbetsuppgifterna ingår:\n.Mottagning, kontroll, omlastning, förbehandling och behandling av allt inkommet avfall\n.Anläggning och underhåll av samtliga hårdgjorda ytor samt planering av deponier\n.Tillverkning av tätskikt\n.Kort- och långsiktig planering av samtliga arbetsuppgifter på anläggningen\n.I förekommande fall drift av gasstation\n.Underhåll och daglig kontroll av maskinpark\n.Daglig kontroll av anläggningens funktioner utifrån gällande tillstånd och kommunens arbete med miljö, arbetsmiljö, kvalitet och säkerhet\n.I förekommande fall provtagning vatten och drift av pumpstation\n.Aktivt delta och hålla sig uppdaterad i säkerhetsarbetet\n.Avvikelserapportering\n.Vara delaktig vid utredningar \n.Delta i de utbildningar som arbetsgivaren anser nödvändiga för att utföra arbetet\n.Underhåll av maskinpark\n.Daglig kontroll av anläggningen och maskinernas funktioner utifrån miljö och säkerhet\n.Ta hand om praktikanter och ferieanställda\r\n\r\nKvalifikationer\n\nVi söker dig som har miljöintresse och förmåga att arbeta självständigt under eget ansvar. Du är en självgående, strukturerad och anpassningsbar person. För att trivas hos oss ska du trivas med arbeten som ställer höga krav på flexibilitet och förmåga att planera och prioritera ditt arbete. Du har god förmåga att skapa relationer med kunder och leverantörer. Du är trygg i din roll och agerar serviceinriktat med stort kundfokus. Vi lägger stor vikt vid den personliga lämpligheten.\n\nDet är meriterande om du har erfarenhet av svetsning och service av fordon. Du har god förmåga att uttrycka dig i tal och skrift på svenska. \nB och C -körkort är ett krav samt förarbevis på hjullastare och grävmaskin.\n\nVälkommen med din ansökan med CV och personligt brev senast 2022-08-19. Betyg/intyg behöver inte skickas med. Uppvisande av detta blir aktuellt vid eventuell intervju. Urval och intervjuer sker fortlöpande under ansökningstiden.\n\nInför rekryteringsarbetet har Östersunds kommun tagit ställning till rekryteringskanaler och marknadsföring. Vi undanber oss därför kontakt med mediesäljare."
      },
      "headline" : "Maskinförare/Miljötekniker till Gräfsåsens avfallsanläggning",
      "driving_license" : [ {
        "concept_id" : "VTK8_WRx_GcM",
        "label" : "B",
        "legacy_ams_taxonomy_id" : "3"
      }, {
        "concept_id" : "BKCx_hST_Pcm",
        "label" : "C",
        "legacy_ams_taxonomy_id" : "4"
      } ],
      "employer" : {
        "email" : null,
        "phone_number" : null,
        "organization_number" : "2120002528",
        "name" : "Östersunds kommun",
        "url" : "www.ostersund.se/ledigajobb",
        "workplace" : "Östersunds kommun"
      },
      "removed_date" : null,
      "logo_url" : "https://www.arbetsformedlingen.se/rest/arbetsgivare/rest/af/v3/organisation/2120002528/logotyper/logo.png",
      "last_publication_date" : "2022-08-19T23:59:59",
      "number_of_vacancies" : 1,
      "occupation" : {
        "concept_id" : "SLfL_nQ3_MnE",
        "label" : "Miljöhandläggare",
        "legacy_ams_taxonomy_id" : "1919"
      },
      "occupation_group" : {
        "concept_id" : "rE1E_m3d_cx1",
        "label" : "Specialister inom miljöskydd och miljöteknik",
        "legacy_ams_taxonomy_id" : "2183"
      },
      "employment_type" : {
        "concept_id" : "PFZr_Syz_cUq",
        "label" : "Vanlig anställning",
        "legacy_ams_taxonomy_id" : "1"
      },
      "webpage_url" : "https://arbetsformedlingen.se/platsbanken/annonser/26349701",
      "driving_license_required" : true,
      "application_contacts" : [ {
        "description" : "Håkan Bergdahl",
        "email" : "hakan.bergdahl@ostersund.se",
        "telephone" : "063-143439",
        "name" : null,
        "contact_type" : "arbetsledare"
      }, {
        "description" : "Christian Thorgerzon",
        "email" : "christian.thorgerzon@ostersund.se",
        "telephone" : "070-363 84 49",
        "name" : null,
        "contact_type" : "arbetsledare"
      } ],
      "duration" : {
        "concept_id" : "a7uU_j21_mkL",
        "label" : "Tills vidare",
        "legacy_ams_taxonomy_id" : "1"
      },
      "nice_to_have" : {
        "education_level" : [ ],
        "work_experiences" : [ ],
        "skills" : [ ],
        "education" : [ ],
        "languages" : [ ]
      },
      "application_details" : {
        "via_af" : false,
        "email" : null,
        "other" : null,
        "reference" : "3:2022:44",
        "url" : "http://www.ostersund.se/ledigajobb",
        "information" : null
      },
      "source_type" : "VIA_PLATSBANKEN_DXA",
      "application_deadline" : "2022-08-19T23:59:59",
      "external_id" : "46-212000-2528-7117812625126996744",
      "workplace_address" : {
        "coordinates" : [ 14.636068, 63.17668 ],
        "city" : null,
        "postcode" : null,
        "municipality" : "Östersund",
        "region_concept_id" : "65Ms_7r1_RTG",
        "region" : "Jämtlands län",
        "country_code" : "199",
        "region_code" : "23",
        "municipality_concept_id" : "Vt7P_856_WZS",
        "country_concept_id" : "i46j_HmG_v64",
        "municipality_code" : "2380",
        "street_address" : null,
        "country" : "Sverige"
      },
      "id" : "26349701",
      "experience_required" : true,
      "working_hours_type" : {
        "concept_id" : "6YE1_gAC_R2G",
        "label" : "Heltid",
        "legacy_ams_taxonomy_id" : "1"
      },
      "access" : null,
      "timestamp" : 1658732384149,
      "must_have" : {
        "education_level" : [ ],
        "work_experiences" : [ {
          "concept_id" : "SLfL_nQ3_MnE",
          "weight" : 10,
          "label" : "Miljöhandläggare",
          "legacy_ams_taxonomy_id" : "1919"
        } ],
        "skills" : [ ],
        "education" : [ ],
        "languages" : [ ]
      },
      "occupation_field" : {
        "concept_id" : "kJeN_wmw_9wX",
        "label" : "Naturvetenskap",
        "legacy_ams_taxonomy_id" : "14"
      },
      "scope_of_work" : {
        "min" : 100,
        "max" : 100
      },
      "salary_type" : {
        "concept_id" : "oG8G_9cW_nRf",
        "label" : "Fast månads- vecko- eller timlön",
        "legacy_ams_taxonomy_id" : "1"
      },
      "removed" : false,
      "salary_description" : "Fast lön",
      "access_to_own_car" : false,
      "publication_date" : "2022-07-25T08:32:43"
    },
    "name" : "Maskinförare/Miljötekniker till Gräfsåsens avfallsanläggning",
    "user" : "hannes"
  },
  "sha1" : "d6243dfcb2fa8c8c503d188b6c665ccca4c5238e",
  "annotations" : [ {
    "preferred-label" : "Maskinförare",
    "sentiment" : "MUST_HAVE",
    "type" : "ssyk-level-3",
    "start-position" : 0,
    "end-position" : 12,
    "concept-id" : "UbR1_PxX_ntU",
    "matched-string" : "maskinförare",
    "annotation-id" : 0
  }, {
    "preferred-label" : "miljötekniker",
    "type" : "esco-occupation",
    "start-position" : 13,
    "end-position" : 26,
    "concept-id" : "tWYC_CCV_VKh",
    "matched-string" : "Miljötekniker",
    "annotation-id" : 13
  }, {
    "preferred-label" : "Östersund",
    "type" : "municipality",
    "start-position" : 121,
    "end-position" : 138,
    "concept-id" : "Vt7P_856_WZS",
    "matched-string" : "Östersunds kommun",
    "annotation-id" : 14
  }, {
    "preferred-label" : "Östersund",
    "type" : "municipality",
    "start-position" : 460,
    "end-position" : 477,
    "concept-id" : "Vt7P_856_WZS",
    "matched-string" : "Östersunds Kommun",
    "annotation-id" : 15
  }, {
    "preferred-label" : "miljötekniker",
    "type" : "esco-occupation",
    "start-position" : 682,
    "end-position" : 695,
    "concept-id" : "tWYC_CCV_VKh",
    "matched-string" : "miljötekniker",
    "annotation-id" : 16
  }, {
    "preferred-label" : "Avfall",
    "sentiment" : "MUST_HAVE",
    "type" : "keyword",
    "start-position" : 819,
    "end-position" : 825,
    "concept-id" : "Kx4Q_7TA_MuR",
    "matched-string" : "avfall",
    "annotation-id" : 2
  }, {
    "preferred-label" : "Vårdavdelning/Mottagning",
    "sentiment" : "MUST_HAVE",
    "type" : "skill",
    "start-position" : 892,
    "end-position" : 902,
    "concept-id" : "TuUX_3Jo_wyq",
    "matched-string" : "mottagning",
    "annotation-id" : 3
  }, {
    "preferred-label" : "sortera avfall",
    "type" : "esco-skill",
    "start-position" : 904,
    "end-position" : 913,
    "concept-id" : "r7jH_qjm_NF5",
    "matched-string" : "sortering",
    "annotation-id" : 17
  }, {
    "preferred-label" : "Vårdavdelning/Mottagning",
    "sentiment" : "MUST_HAVE",
    "type" : "skill",
    "start-position" : 1434,
    "end-position" : 1444,
    "concept-id" : "TuUX_3Jo_wyq",
    "matched-string" : "mottagning",
    "annotation-id" : 4
  }, {
    "preferred-label" : "Avfall",
    "sentiment" : "MUST_HAVE",
    "type" : "keyword",
    "start-position" : 1514,
    "end-position" : 1520,
    "concept-id" : "Kx4Q_7TA_MuR",
    "matched-string" : "avfall",
    "annotation-id" : 5
  }, {
    "preferred-label" : "Tillverkning",
    "sentiment" : "MUST_HAVE",
    "type" : "sni-level-1",
    "start-position" : 1603,
    "end-position" : 1615,
    "concept-id" : "trPt_iHy_oFP",
    "matched-string" : "tillverkning",
    "annotation-id" : 6
  }, {
    "preferred-label" : "arbetsmiljö",
    "sentiment" : "MUST_HAVE",
    "type" : "esco-skill",
    "start-position" : 1894,
    "end-position" : 1905,
    "concept-id" : "zdQY_QJh_nUH",
    "matched-string" : "arbetsmiljö",
    "annotation-id" : 7
  }, {
    "preferred-label" : "Svets",
    "type" : "keyword",
    "start-position" : 2895,
    "end-position" : 2904,
    "concept-id" : "Emhe_ce6_MYC",
    "matched-string" : "svetsning",
    "annotation-id" : 18
  }, {
    "preferred-label" : "Svenska",
    "sentiment" : "MUST_HAVE",
    "type" : "language",
    "start-position" : 2984,
    "end-position" : 2991,
    "concept-id" : "zSLA_vw2_FXN",
    "matched-string" : "svenska",
    "annotation-id" : 8
  }, {
    "preferred-label" : "B",
    "type" : "driving-licence",
    "start-position" : 2994,
    "end-position" : 2995,
    "concept-id" : "VTK8_WRx_GcM",
    "matched-string" : "B",
    "annotation-id" : 19
  }, {
    "preferred-label" : "C",
    "type" : "driving-licence",
    "start-position" : 3000,
    "end-position" : 3010,
    "concept-id" : "BKCx_hST_Pcm",
    "matched-string" : "C -körkort",
    "annotation-id" : 20
  }, {
    "preferred-label" : "Hjullastare",
    "sentiment" : "MUST_HAVE",
    "type" : "keyword",
    "start-position" : 3042,
    "end-position" : 3053,
    "concept-id" : "WUHH_Jpr_Zeh",
    "matched-string" : "hjullastare",
    "annotation-id" : 10
  }, {
    "preferred-label" : "Grävmaskin",
    "sentiment" : "MUST_HAVE",
    "type" : "skill",
    "start-position" : 3058,
    "end-position" : 3068,
    "concept-id" : "swHZ_UXk_UaE",
    "matched-string" : "grävmaskin",
    "annotation-id" : 11
  } ],
  "text" : "Maskinförare/Miljötekniker till Gräfsåsens avfallsanläggning\nEnheten Avfall Avloppsanläggningar inom teknisk förvaltning Östersunds kommun driver och utvecklar avfalls- och avloppsanläggningar. Enheten omfattar 8 avloppsreningsverk, ett 40-tal pumpstationer, en uppgraderingsanläggning för fordonsgas och en avfallsanläggning. Enheten kontrollerar också statusen i ett antal deponier och jordtippar runt om i kommunen där verksamheten sedan tidigare upphört.\n\nÖstersunds Kommun har mer än 5 600 personer anställda i sju förvaltningar. Vi verkar inom 400 olika yrken och jobbar mot ett gemensamt mål: att göra medborgarnas liv rikare, enklare och tryggare.\r\n\r\nArbetsuppgifter\r\n\r\nSom miljötekniker har du tillsammans med dina kollegor ansvar för det operativa arbetet vid Gräfsåsens avfallsanläggning. Gräfsåsen tar emot avfall från kommuner och verksamheter i hela länet. På anläggningen sker mottagning, sortering, mellanlagring, förbehandling och behandling av avfallet. Du får en roll kring avfallsanläggningens olika materialflöden och deltar i den operativa driften av avfallsanläggningen. Tillsammans ansvarar vi för att anläggningen uppfyller villkoren kopplade till anläggningens tillstånd och att aktuell lagstiftning efterlevs. Rollen innebär många kontaktytor och verksamheten bedrivs i nära samarbete med övriga delar på kommunen, tillsynsmyndigheten, anlitade entreprenörer, och våra kunder. \n\nI arbetsuppgifterna ingår:\n.Mottagning, kontroll, omlastning, förbehandling och behandling av allt inkommet avfall\n.Anläggning och underhåll av samtliga hårdgjorda ytor samt planering av deponier\n.Tillverkning av tätskikt\n.Kort- och långsiktig planering av samtliga arbetsuppgifter på anläggningen\n.I förekommande fall drift av gasstation\n.Underhåll och daglig kontroll av maskinpark\n.Daglig kontroll av anläggningens funktioner utifrån gällande tillstånd och kommunens arbete med miljö, arbetsmiljö, kvalitet och säkerhet\n.I förekommande fall provtagning vatten och drift av pumpstation\n.Aktivt delta och hålla sig uppdaterad i säkerhetsarbetet\n.Avvikelserapportering\n.Vara delaktig vid utredningar \n.Delta i de utbildningar som arbetsgivaren anser nödvändiga för att utföra arbetet\n.Underhåll av maskinpark\n.Daglig kontroll av anläggningen och maskinernas funktioner utifrån miljö och säkerhet\n.Ta hand om praktikanter och ferieanställda\r\n\r\nKvalifikationer\n\nVi söker dig som har miljöintresse och förmåga att arbeta självständigt under eget ansvar. Du är en självgående, strukturerad och anpassningsbar person. För att trivas hos oss ska du trivas med arbeten som ställer höga krav på flexibilitet och förmåga att planera och prioritera ditt arbete. Du har god förmåga att skapa relationer med kunder och leverantörer. Du är trygg i din roll och agerar serviceinriktat med stort kundfokus. Vi lägger stor vikt vid den personliga lämpligheten.\n\nDet är meriterande om du har erfarenhet av svetsning och service av fordon. Du har god förmåga att uttrycka dig i tal och skrift på svenska. \nB och C -körkort är ett krav samt förarbevis på hjullastare och grävmaskin.\n\nVälkommen med din ansökan med CV och personligt brev senast 2022-08-19. Betyg/intyg behöver inte skickas med. Uppvisande av detta blir aktuellt vid eventuell intervju. Urval och intervjuer sker fortlöpande under ansökningstiden.\n\nInför rekryteringsarbetet har Östersunds kommun tagit ställning till rekryteringskanaler och marknadsföring. Vi undanber oss därför kontakt med mediesäljare."
}