{
  "meta" : {
    "jobad" : {
      "description" : {
        "requirements" : null,
        "needs" : null,
        "company_information" : null,
        "text_formatted" : "<p>Söker efter en pizzabagare med erfarenhet på denna branschen. Om du är intresserad ta kontakt via mailed  </p><p>hatemi@mail.ru</p><p>mvh Hatam </p><p><br></p><p id=\"oppenforalla\">Öppen för alla\nVi fokuserar på din kompetens, inte dina övriga förutsättningar. Vi är öppna för att anpassa rollen eller arbetsplatsen efter dina behov.</p>",
        "conditions" : null,
        "text" : "Söker efter en pizzabagare med erfarenhet på denna branschen. Om du är intresserad ta kontakt via mailed  \nhatemi@mail.ru\nmvh Hatam \n\n\nÖppen för alla\nVi fokuserar på din kompetens, inte dina övriga förutsättningar. Vi är öppna för att anpassa rollen eller arbetsplatsen efter dina behov."
      },
      "headline" : "Pizzabagare sökes.",
      "driving_license" : [ {
        "concept_id" : "VTK8_WRx_GcM",
        "label" : "B",
        "legacy_ams_taxonomy_id" : "3"
      } ],
      "employer" : {
        "email" : null,
        "phone_number" : null,
        "organization_number" : "5569551830",
        "name" : "Pizzeria Västanvik AB",
        "url" : null,
        "workplace" : "Västanvik AB, Pizzeria"
      },
      "removed_date" : null,
      "logo_url" : null,
      "last_publication_date" : "2022-09-03T23:59:59",
      "number_of_vacancies" : 1,
      "occupation" : {
        "concept_id" : "9YaE_Syg_5ZB",
        "label" : "Pizzabagare",
        "legacy_ams_taxonomy_id" : "5505"
      },
      "occupation_group" : {
        "concept_id" : "a8gg_ktU_w8V",
        "label" : "Pizzabagare m.fl.",
        "legacy_ams_taxonomy_id" : "9411"
      },
      "employment_type" : {
        "concept_id" : "PFZr_Syz_cUq",
        "label" : "Vanlig anställning",
        "legacy_ams_taxonomy_id" : "1"
      },
      "webpage_url" : "https://arbetsformedlingen.se/platsbanken/annonser/26378490",
      "driving_license_required" : true,
      "application_contacts" : [ {
        "description" : null,
        "email" : "hatemi@mail.ru",
        "telephone" : null,
        "name" : "Hatam  Huseynzade",
        "contact_type" : null
      } ],
      "duration" : {
        "concept_id" : "a7uU_j21_mkL",
        "label" : "Tills vidare",
        "legacy_ams_taxonomy_id" : "1"
      },
      "nice_to_have" : {
        "education_level" : [ ],
        "work_experiences" : [ {
          "concept_id" : "9YaE_Syg_5ZB",
          "weight" : 5,
          "label" : "Pizzabagare",
          "legacy_ams_taxonomy_id" : "5505"
        } ],
        "skills" : [ ],
        "education" : [ ],
        "languages" : [ ]
      },
      "application_details" : {
        "via_af" : false,
        "email" : "hatemi@mail.ru",
        "other" : null,
        "reference" : null,
        "url" : null,
        "information" : null
      },
      "source_type" : "VIA_ANNONSERA",
      "application_deadline" : "2022-09-03T23:59:59",
      "external_id" : null,
      "workplace_address" : {
        "coordinates" : [ 12.999924613842943, 60.12363461827635 ],
        "city" : "Torsby",
        "postcode" : "68532",
        "municipality" : "Torsby",
        "region_concept_id" : "EVVp_h6U_GSZ",
        "region" : "Värmlands län",
        "country_code" : "199",
        "region_code" : "17",
        "municipality_concept_id" : "hQdb_zn9_Sok",
        "country_concept_id" : "i46j_HmG_v64",
        "municipality_code" : "1737",
        "street_address" : "Risätervägen 9 R",
        "country" : "Sverige"
      },
      "id" : "26378490",
      "experience_required" : true,
      "working_hours_type" : {
        "concept_id" : "6YE1_gAC_R2G",
        "label" : "Heltid",
        "legacy_ams_taxonomy_id" : "1"
      },
      "access" : null,
      "timestamp" : 1659617925267,
      "must_have" : {
        "education_level" : [ ],
        "work_experiences" : [ ],
        "skills" : [ ],
        "education" : [ ],
        "languages" : [ ]
      },
      "occupation_field" : {
        "concept_id" : "ScKy_FHB_7wT",
        "label" : "Hotell, restaurang, storhushåll",
        "legacy_ams_taxonomy_id" : "7"
      },
      "scope_of_work" : {
        "min" : 0,
        "max" : 100
      },
      "salary_type" : {
        "concept_id" : "oG8G_9cW_nRf",
        "label" : "Fast månads- vecko- eller timlön",
        "legacy_ams_taxonomy_id" : "1"
      },
      "removed" : false,
      "salary_description" : null,
      "access_to_own_car" : true,
      "publication_date" : "2022-08-04T14:58:45"
    },
    "name" : "Pizzabagare sökes.",
    "user" : "hannes"
  },
  "sha1" : "f980fac9604607a37a60429c1d020f1be43e70a9",
  "annotations" : [ {
    "preferred-label" : "Pizzabagare",
    "sentiment" : "MUST_HAVE",
    "type" : "forecast-occupation",
    "start-position" : 0,
    "end-position" : 11,
    "concept-id" : "SyvN_uBW_USt",
    "matched-string" : "pizzabagare",
    "annotation-id" : 0
  }, {
    "preferred-label" : "Pizzabagare",
    "sentiment" : "MUST_HAVE",
    "type" : "forecast-occupation",
    "start-position" : 34,
    "end-position" : 45,
    "concept-id" : "SyvN_uBW_USt",
    "matched-string" : "pizzabagare",
    "annotation-id" : 1
  } ],
  "text" : "Pizzabagare sökes.\nSöker efter en pizzabagare med erfarenhet på denna branschen. Om du är intresserad ta kontakt via mailed  \nhatemi@mail.ru\nmvh Hatam \n\n\nÖppen för alla\nVi fokuserar på din kompetens, inte dina övriga förutsättningar. Vi är öppna för att anpassa rollen eller arbetsplatsen efter dina behov."
}