{
  "meta" : {
    "jobad" : {
      "description" : {
        "requirements" : null,
        "needs" : null,
        "company_information" : null,
        "text_formatted" : "<p>Jämför och chatta med bemanningsbolagen enkelt via Vårdföretag App (vardforetag.se)</p><p>Skapa din profil på mindre än 1 minut och lägg upp dina önskemål. Få erbjudanden på uppdrag som kan passa dina önskemål och chatta med flera av de ledande bemanningsbolagen inom vården. Enkelt och kostnadsfritt!</p><p>Just nu finns ett ledigt uppdrag som barnmorska på förlossningsvården i Norrköping, Östersgötlands län. Uppdraget finns att söka bland flera bemanningsbolag i Vårdföretag.se</p><p><br></p><p>Fördelar:</p><p>-Hög ersättning</p><p>-Inga onödiga Mail Eller telefonsamtal</p><p>-Enkelt och kostnadsfritt</p><p>-Inget bindande</p><p><br></p><p><strong>Vill du starta eget aktiebolag? Vi på vardforetag.se hjälper dig att starta aktiebolag och redovisning till fasta kostnader.</strong></p>",
        "conditions" : null,
        "text" : "Jämför och chatta med bemanningsbolagen enkelt via Vårdföretag App (vardforetag.se)\nSkapa din profil på mindre än 1 minut och lägg upp dina önskemål. Få erbjudanden på uppdrag som kan passa dina önskemål och chatta med flera av de ledande bemanningsbolagen inom vården. Enkelt och kostnadsfritt!\nJust nu finns ett ledigt uppdrag som barnmorska på förlossningsvården i Norrköping, Östersgötlands län. Uppdraget finns att söka bland flera bemanningsbolag i Vårdföretag.se\n\n\nFördelar:\n-Hög ersättning\n-Inga onödiga Mail Eller telefonsamtal\n-Enkelt och kostnadsfritt\n-Inget bindande\n\n\nVill du starta eget aktiebolag? Vi på vardforetag.se hjälper dig att starta aktiebolag och redovisning till fasta kostnader."
      },
      "headline" : "Barnmorska, bemanning",
      "driving_license" : null,
      "employer" : {
        "email" : null,
        "phone_number" : null,
        "organization_number" : "5591532642",
        "name" : "VårdföretagSe AB",
        "url" : "https://vardforetag.se",
        "workplace" : "Vårdföretag"
      },
      "removed_date" : null,
      "logo_url" : "https://www.arbetsformedlingen.se/rest/arbetsgivare/rest/af/v3/arbetsplatser/87952451/logotyper/logo.png",
      "last_publication_date" : "2022-08-15T00:00:00",
      "number_of_vacancies" : 1,
      "occupation" : {
        "concept_id" : "DEDi_wap_ntF",
        "label" : "Barnmorska",
        "legacy_ams_taxonomy_id" : "5701"
      },
      "occupation_group" : {
        "concept_id" : "7XXd_4St_nit",
        "label" : "Barnmorskor",
        "legacy_ams_taxonomy_id" : "2222"
      },
      "employment_type" : {
        "concept_id" : "1paU_aCR_nGn",
        "label" : "Behovsanställning",
        "legacy_ams_taxonomy_id" : "4"
      },
      "webpage_url" : "https://arbetsformedlingen.se/platsbanken/annonser/26393619",
      "driving_license_required" : false,
      "application_contacts" : [ ],
      "duration" : {
        "concept_id" : null,
        "label" : null,
        "legacy_ams_taxonomy_id" : null
      },
      "nice_to_have" : {
        "education_level" : [ ],
        "work_experiences" : [ ],
        "skills" : [ ],
        "education" : [ ],
        "languages" : [ ]
      },
      "application_details" : {
        "via_af" : false,
        "email" : null,
        "other" : null,
        "reference" : null,
        "url" : "https://vardforetag.se",
        "information" : null
      },
      "source_type" : "VIA_ANNONSERA",
      "application_deadline" : "2022-08-15T00:00:00",
      "external_id" : null,
      "workplace_address" : {
        "coordinates" : [ 16.186766186243265, 58.59591207813578 ],
        "city" : "NORRKÖPING",
        "postcode" : "60222",
        "municipality" : "Norrköping",
        "region_concept_id" : "oLT3_Q9p_3nn",
        "region" : "Östergötlands län",
        "country_code" : "199",
        "region_code" : "05",
        "municipality_concept_id" : "SYty_Yho_JAF",
        "country_concept_id" : "i46j_HmG_v64",
        "municipality_code" : "0581",
        "street_address" : null,
        "country" : "Sverige"
      },
      "id" : "26393619",
      "experience_required" : true,
      "working_hours_type" : {
        "concept_id" : null,
        "label" : null,
        "legacy_ams_taxonomy_id" : null
      },
      "access" : null,
      "timestamp" : 1660093895277,
      "must_have" : {
        "education_level" : [ ],
        "work_experiences" : [ ],
        "skills" : [ ],
        "education" : [ ],
        "languages" : [ ]
      },
      "occupation_field" : {
        "concept_id" : "NYW6_mP6_vwf",
        "label" : "Hälso- och sjukvård",
        "legacy_ams_taxonomy_id" : "8"
      },
      "scope_of_work" : {
        "min" : 0,
        "max" : null
      },
      "salary_type" : {
        "concept_id" : "oG8G_9cW_nRf",
        "label" : "Fast månads- vecko- eller timlön",
        "legacy_ams_taxonomy_id" : "1"
      },
      "removed" : false,
      "salary_description" : null,
      "access_to_own_car" : false,
      "publication_date" : "2022-08-10T03:11:35"
    },
    "name" : "Barnmorska, bemanning",
    "user" : "hannes"
  },
  "sha1" : "4c2dd98817ba93720f0107bdfe547d757cd8b803",
  "annotations" : [ {
    "preferred-label" : "Barnmorska",
    "sentiment" : "MUST_HAVE",
    "type" : "occupation-name",
    "start-position" : 0,
    "end-position" : 10,
    "concept-id" : "DEDi_wap_ntF",
    "matched-string" : "barnmorska",
    "annotation-id" : 0
  }, {
    "preferred-label" : "Barnmorska",
    "sentiment" : "MUST_HAVE",
    "type" : "occupation-name",
    "start-position" : 355,
    "end-position" : 365,
    "concept-id" : "DEDi_wap_ntF",
    "matched-string" : "barnmorska",
    "annotation-id" : 1
  }, {
    "preferred-label" : "Norrköping",
    "type" : "municipality",
    "start-position" : 390,
    "end-position" : 400,
    "concept-id" : "SYty_Yho_JAF",
    "matched-string" : "Norrköping",
    "annotation-id" : 3
  }, {
    "preferred-label" : "Östergötlands län",
    "type" : "region",
    "start-position" : 402,
    "end-position" : 420,
    "concept-id" : "oLT3_Q9p_3nn",
    "matched-string" : "Östersgötlands län",
    "annotation-id" : 4
  }, {
    "preferred-label" : "Redovisning",
    "sentiment" : "OFFERED",
    "type" : "skill",
    "start-position" : 694,
    "end-position" : 705,
    "concept-id" : "FYk9_RXp_7c5",
    "matched-string" : "redovisning",
    "annotation-id" : 2
  } ],
  "text" : "Barnmorska, bemanning\nJämför och chatta med bemanningsbolagen enkelt via Vårdföretag App (vardforetag.se)\nSkapa din profil på mindre än 1 minut och lägg upp dina önskemål. Få erbjudanden på uppdrag som kan passa dina önskemål och chatta med flera av de ledande bemanningsbolagen inom vården. Enkelt och kostnadsfritt!\nJust nu finns ett ledigt uppdrag som barnmorska på förlossningsvården i Norrköping, Östersgötlands län. Uppdraget finns att söka bland flera bemanningsbolag i Vårdföretag.se\n\n\nFördelar:\n-Hög ersättning\n-Inga onödiga Mail Eller telefonsamtal\n-Enkelt och kostnadsfritt\n-Inget bindande\n\n\nVill du starta eget aktiebolag? Vi på vardforetag.se hjälper dig att starta aktiebolag och redovisning till fasta kostnader."
}