{
  "meta" : {
    "jobad" : {
      "description" : {
        "requirements" : null,
        "needs" : null,
        "company_information" : null,
        "text_formatted" : "<p>Är du vår nya fönstermontör?</p><p>RJ Byggmontage AB är ett företag som inriktat sig på fönstermontage. Vi är i dag 7 anställda varav 6 som monterar fönster och dörrar på heltid. Vi arbetar för att alla skall utvecklas. Vi vidareutbildar oss inom olika områden för att våra montage skall vara i mästarklass. Vi utför fönster och dörrbyten åt Mockfjärds som är ledande inom fönster och dörrbyten. </p><p>Du kommer ingå i ett monteringsteam men kan även arbeta självständigt. Vi lägger stor vikt vid personlighet och yrkeskunnande hos våra montörer.</p><p>För att lyckas som montör hos oss tror vi att du är en framåtriktad, social och samarbetsvillig person som gillar utmaningar och har ett öga för att göra det lilla extra.</p><p>Du trivs med att arbeta i grupp och du tar eget ansvar.</p><p><br></p><p>Arbetet innehåller bland annat:</p><p>-Komplett montering av fönster och dörrar.</p><p>-Byte av takfönster.</p><p>-Snickeriarbete med lister, smygar invändig och utvändigt.</p><p>-Plåtarbete i samband med fönster och dörrbyten.</p><p>Andra arbetsmoment inom snickeri kan förekomma.</p><p><br></p><p>Som montör hos oss skall du vara självgående och noggrann.</p><p>Se möjligheter att kunna leverera det bästa fönstermontaget varje dag.</p><p>Planera arbetsdagen efter arbetsorder för att säkerställa att montagen utförs korrekt.</p><p>Du behärskar svenska språket såväl i tal som i skrift då vi arbetar utifrån arbetsorder.</p><p>Bra fysik eftersom det förekommer tunga moment.</p><p>Vi utgår från Kävlinge men arbetar i hela Skåne.</p><p>Arbete i andra delar av landen kan förekomma.</p><p>Erfarenhet från fönstermontering/snickeri är ett krav.</p><p>Körkort är ett krav. BE är ett plus.</p><p>RJ Byggmontage AB är ett företag som inriktat sig på fönstermontage men där även andra arbete kan förekomma.</p><p><br></p><p>Välkomna med ansökningar till</p><p>richard@rjbyggmontage.se</p><p>Richard Jacobsson 0704-404804</p>",
        "conditions" : null,
        "text" : "Är du vår nya fönstermontör?\nRJ Byggmontage AB är ett företag som inriktat sig på fönstermontage. Vi är i dag 7 anställda varav 6 som monterar fönster och dörrar på heltid. Vi arbetar för att alla skall utvecklas. Vi vidareutbildar oss inom olika områden för att våra montage skall vara i mästarklass. Vi utför fönster och dörrbyten åt Mockfjärds som är ledande inom fönster och dörrbyten. \nDu kommer ingå i ett monteringsteam men kan även arbeta självständigt. Vi lägger stor vikt vid personlighet och yrkeskunnande hos våra montörer.\nFör att lyckas som montör hos oss tror vi att du är en framåtriktad, social och samarbetsvillig person som gillar utmaningar och har ett öga för att göra det lilla extra.\nDu trivs med att arbeta i grupp och du tar eget ansvar.\n\n\nArbetet innehåller bland annat:\n-Komplett montering av fönster och dörrar.\n-Byte av takfönster.\n-Snickeriarbete med lister, smygar invändig och utvändigt.\n-Plåtarbete i samband med fönster och dörrbyten.\nAndra arbetsmoment inom snickeri kan förekomma.\n\n\nSom montör hos oss skall du vara självgående och noggrann.\nSe möjligheter att kunna leverera det bästa fönstermontaget varje dag.\nPlanera arbetsdagen efter arbetsorder för att säkerställa att montagen utförs korrekt.\nDu behärskar svenska språket såväl i tal som i skrift då vi arbetar utifrån arbetsorder.\nBra fysik eftersom det förekommer tunga moment.\nVi utgår från Kävlinge men arbetar i hela Skåne.\nArbete i andra delar av landen kan förekomma.\nErfarenhet från fönstermontering/snickeri är ett krav.\nKörkort är ett krav. BE är ett plus.\nRJ Byggmontage AB är ett företag som inriktat sig på fönstermontage men där även andra arbete kan förekomma.\n\n\nVälkomna med ansökningar till\nrichard@rjbyggmontage.se\nRichard Jacobsson 0704-404804"
      },
      "headline" : "Fönstermontör",
      "driving_license" : [ {
        "concept_id" : "VTK8_WRx_GcM",
        "label" : "B",
        "legacy_ams_taxonomy_id" : "3"
      } ],
      "employer" : {
        "email" : null,
        "phone_number" : null,
        "organization_number" : "5569714487",
        "name" : "RJ Byggmontage AB",
        "url" : null,
        "workplace" : "Rj Byggmontage AB"
      },
      "removed_date" : null,
      "logo_url" : "https://www.arbetsformedlingen.se/rest/arbetsgivare/rest/af/v3/arbetsplatser/86496250/logotyper/logo.png",
      "last_publication_date" : "2022-08-02T23:59:59",
      "number_of_vacancies" : 1,
      "occupation" : {
        "concept_id" : "4Z7F_oBG_vMG",
        "label" : "Träarbetare/Snickare",
        "legacy_ams_taxonomy_id" : "6581"
      },
      "occupation_group" : {
        "concept_id" : "9mJN_VwW_Xjg",
        "label" : "Träarbetare, snickare m.fl.",
        "legacy_ams_taxonomy_id" : "7111"
      },
      "employment_type" : {
        "concept_id" : "PFZr_Syz_cUq",
        "label" : "Vanlig anställning",
        "legacy_ams_taxonomy_id" : "1"
      },
      "webpage_url" : "https://arbetsformedlingen.se/platsbanken/annonser/26286847",
      "driving_license_required" : true,
      "application_contacts" : [ ],
      "duration" : {
        "concept_id" : "a7uU_j21_mkL",
        "label" : "Tills vidare",
        "legacy_ams_taxonomy_id" : "1"
      },
      "nice_to_have" : {
        "education_level" : [ ],
        "work_experiences" : [ ],
        "skills" : [ ],
        "education" : [ ],
        "languages" : [ ]
      },
      "application_details" : {
        "via_af" : false,
        "email" : "richard@rjbyggmontage.se",
        "other" : null,
        "reference" : "Fönstermontör",
        "url" : null,
        "information" : null
      },
      "source_type" : "VIA_ANNONSERA",
      "application_deadline" : "2022-08-02T23:59:59",
      "external_id" : null,
      "workplace_address" : {
        "coordinates" : [ 13.177051325324253, 55.813074161146375 ],
        "city" : "Kävlinge",
        "postcode" : "24491",
        "municipality" : "Kävlinge",
        "region_concept_id" : "CaRE_1nn_cSU",
        "region" : "Skåne län",
        "country_code" : "199",
        "region_code" : "12",
        "municipality_concept_id" : "5ohg_WJU_Ktn",
        "country_concept_id" : "i46j_HmG_v64",
        "municipality_code" : "1261",
        "street_address" : "Ängbogård, Olivelugnsv 182",
        "country" : "Sverige"
      },
      "id" : "26286847",
      "experience_required" : true,
      "working_hours_type" : {
        "concept_id" : "6YE1_gAC_R2G",
        "label" : "Heltid",
        "legacy_ams_taxonomy_id" : "1"
      },
      "access" : null,
      "timestamp" : 1656859275778,
      "must_have" : {
        "education_level" : [ ],
        "work_experiences" : [ {
          "concept_id" : "4Z7F_oBG_vMG",
          "weight" : 10,
          "label" : "Träarbetare/Snickare",
          "legacy_ams_taxonomy_id" : "6581"
        } ],
        "skills" : [ ],
        "education" : [ ],
        "languages" : [ ]
      },
      "occupation_field" : {
        "concept_id" : "j7Cq_ZJe_GkT",
        "label" : "Bygg och anläggning",
        "legacy_ams_taxonomy_id" : "2"
      },
      "scope_of_work" : {
        "min" : 0,
        "max" : 100
      },
      "salary_type" : {
        "concept_id" : "oG8G_9cW_nRf",
        "label" : "Fast månads- vecko- eller timlön",
        "legacy_ams_taxonomy_id" : "1"
      },
      "removed" : false,
      "salary_description" : null,
      "access_to_own_car" : true,
      "publication_date" : "2022-07-03T16:41:15"
    },
    "name" : "Fönstermontör",
    "user" : "hannes"
  },
  "sha1" : "8028cec398a35e305c86a908bc2d85ea7905c939",
  "annotations" : [ {
    "preferred-label" : "fönstermontör",
    "type" : "esco-occupation",
    "start-position" : 0,
    "end-position" : 13,
    "concept-id" : "xx76_sML_rbh",
    "matched-string" : "Fönstermontör",
    "annotation-id" : 6
  }, {
    "preferred-label" : "fönstermontör",
    "type" : "esco-occupation",
    "start-position" : 28,
    "end-position" : 41,
    "concept-id" : "xx76_sML_rbh",
    "matched-string" : "fönstermontör",
    "annotation-id" : 7
  }, {
    "preferred-label" : "Fönstermontage/Fönstermontering",
    "sentiment" : "MUST_HAVE",
    "type" : "skill",
    "start-position" : 96,
    "end-position" : 110,
    "concept-id" : "zZpU_nc8_tDf",
    "matched-string" : "fönstermontage",
    "annotation-id" : 0
  }, {
    "preferred-label" : "Fönstermontage/Fönstermontering",
    "type" : "skill",
    "start-position" : 148,
    "end-position" : 164,
    "concept-id" : "zZpU_nc8_tDf",
    "matched-string" : "monterar fönster",
    "annotation-id" : 8
  }, {
    "preferred-label" : "Heltid",
    "type" : "worktime-extent",
    "start-position" : 179,
    "end-position" : 185,
    "concept-id" : "6YE1_gAC_R2G",
    "matched-string" : "heltid",
    "annotation-id" : 9
  }, {
    "preferred-label" : "Fönstermontage/Fönstermontering",
    "type" : "skill",
    "start-position" : 282,
    "end-position" : 289,
    "concept-id" : "zZpU_nc8_tDf",
    "matched-string" : "montage",
    "annotation-id" : 10
  }, {
    "preferred-label" : "arbeta självständigt",
    "type" : "esco-skill",
    "start-position" : 454,
    "end-position" : 474,
    "concept-id" : "NyFu_HHd_zhz",
    "matched-string" : "arbeta självständigt",
    "annotation-id" : 11
  }, {
    "preferred-label" : "Montörer",
    "sentiment" : "MUST_HAVE",
    "type" : "ssyk-level-3",
    "start-position" : 540,
    "end-position" : 548,
    "concept-id" : "Wz8B_WeK_vUB",
    "matched-string" : "montörer",
    "annotation-id" : 1
  }, {
    "preferred-label" : "fönstermontör",
    "type" : "esco-occupation",
    "start-position" : 569,
    "end-position" : 575,
    "concept-id" : "xx76_sML_rbh",
    "matched-string" : "montör",
    "annotation-id" : 12
  }, {
    "preferred-label" : "Fönstermontage/Fönstermontering",
    "type" : "skill",
    "start-position" : 821,
    "end-position" : 841,
    "concept-id" : "zZpU_nc8_tDf",
    "matched-string" : "montering av fönster",
    "annotation-id" : 13
  }, {
    "preferred-label" : "montera dörrar",
    "type" : "esco-skill",
    "start-position" : 846,
    "end-position" : 852,
    "concept-id" : "cSdA_5gH_348",
    "matched-string" : "dörrar",
    "annotation-id" : 14
  }, {
    "preferred-label" : "Snickeriarbetare",
    "type" : "keyword",
    "start-position" : 876,
    "end-position" : 884,
    "concept-id" : "jB4B_uED_vQh",
    "matched-string" : "Snickeri",
    "annotation-id" : 15
  }, {
    "preferred-label" : "Plåtbearbetning",
    "type" : "skill",
    "start-position" : 935,
    "end-position" : 945,
    "concept-id" : "SrzF_GXp_pFE",
    "matched-string" : "Plåtarbete",
    "annotation-id" : 16
  }, {
    "preferred-label" : "Snickeriarbetare",
    "type" : "keyword",
    "start-position" : 1007,
    "end-position" : 1015,
    "concept-id" : "jB4B_uED_vQh",
    "matched-string" : "snickeri",
    "annotation-id" : 17
  }, {
    "preferred-label" : "fönstermontör",
    "type" : "esco-occupation",
    "start-position" : 1037,
    "end-position" : 1043,
    "concept-id" : "xx76_sML_rbh",
    "matched-string" : "montör",
    "annotation-id" : 18
  }, {
    "preferred-label" : "arbeta självständigt",
    "type" : "esco-skill",
    "start-position" : 1066,
    "end-position" : 1077,
    "concept-id" : "NyFu_HHd_zhz",
    "matched-string" : "självgående",
    "annotation-id" : 19
  }, {
    "preferred-label" : "noggrannhet",
    "type" : "esco-skill",
    "start-position" : 1082,
    "end-position" : 1090,
    "concept-id" : "mrsW_EkL_KRD",
    "matched-string" : "noggrann",
    "annotation-id" : 20
  }, {
    "preferred-label" : "Fönstermontage/Fönstermontering",
    "type" : "skill",
    "start-position" : 1136,
    "end-position" : 1151,
    "concept-id" : "zZpU_nc8_tDf",
    "matched-string" : "fönstermontaget",
    "annotation-id" : 21
  }, {
    "preferred-label" : "Fönstermontage/Fönstermontering",
    "type" : "skill",
    "start-position" : 1225,
    "end-position" : 1233,
    "concept-id" : "zZpU_nc8_tDf",
    "matched-string" : "montagen",
    "annotation-id" : 22
  }, {
    "preferred-label" : "Svenska språket",
    "sentiment" : "MUST_HAVE",
    "type" : "keyword",
    "start-position" : 1263,
    "end-position" : 1278,
    "concept-id" : "BiGm_58D_SSn",
    "matched-string" : "svenska språket",
    "annotation-id" : 2
  }, {
    "preferred-label" : "God fysik (tunga lyft)",
    "type" : "skill",
    "start-position" : 1339,
    "end-position" : 1348,
    "concept-id" : "rwir_xvu_443",
    "matched-string" : "Bra fysik",
    "annotation-id" : 23
  }, {
    "preferred-label" : "God fysik (tunga lyft)",
    "type" : "skill",
    "start-position" : 1373,
    "end-position" : 1385,
    "concept-id" : "rwir_xvu_443",
    "matched-string" : "tunga moment",
    "annotation-id" : 24
  }, {
    "preferred-label" : "Skåne län",
    "type" : "region",
    "start-position" : 1429,
    "end-position" : 1434,
    "concept-id" : "CaRE_1nn_cSU",
    "matched-string" : "Skåne",
    "annotation-id" : 25
  }, {
    "preferred-label" : "Fönstermontage/Fönstermontering",
    "sentiment" : "MUST_HAVE",
    "type" : "skill",
    "start-position" : 1498,
    "end-position" : 1514,
    "concept-id" : "zZpU_nc8_tDf",
    "matched-string" : "fönstermontering",
    "annotation-id" : 4
  }, {
    "preferred-label" : "Snickeriarbetare",
    "type" : "keyword",
    "start-position" : 1515,
    "end-position" : 1523,
    "concept-id" : "jB4B_uED_vQh",
    "matched-string" : "snickeri",
    "annotation-id" : 26
  }, {
    "preferred-label" : "B",
    "type" : "driving-licence",
    "start-position" : 1537,
    "end-position" : 1544,
    "concept-id" : "VTK8_WRx_GcM",
    "matched-string" : "Körkort",
    "annotation-id" : 27
  }, {
    "preferred-label" : "BE",
    "type" : "driving-licence",
    "start-position" : 1558,
    "end-position" : 1560,
    "concept-id" : "bcFd_Vkt_KXL",
    "matched-string" : "BE",
    "annotation-id" : 28
  }, {
    "preferred-label" : "Fönstermontage/Fönstermontering",
    "sentiment" : "MUST_HAVE",
    "type" : "skill",
    "start-position" : 1627,
    "end-position" : 1641,
    "concept-id" : "zZpU_nc8_tDf",
    "matched-string" : "fönstermontage",
    "annotation-id" : 5
  } ],
  "text" : "Fönstermontör\nÄr du vår nya fönstermontör?\nRJ Byggmontage AB är ett företag som inriktat sig på fönstermontage. Vi är i dag 7 anställda varav 6 som monterar fönster och dörrar på heltid. Vi arbetar för att alla skall utvecklas. Vi vidareutbildar oss inom olika områden för att våra montage skall vara i mästarklass. Vi utför fönster och dörrbyten åt Mockfjärds som är ledande inom fönster och dörrbyten. \nDu kommer ingå i ett monteringsteam men kan även arbeta självständigt. Vi lägger stor vikt vid personlighet och yrkeskunnande hos våra montörer.\nFör att lyckas som montör hos oss tror vi att du är en framåtriktad, social och samarbetsvillig person som gillar utmaningar och har ett öga för att göra det lilla extra.\nDu trivs med att arbeta i grupp och du tar eget ansvar.\n\n\nArbetet innehåller bland annat:\n-Komplett montering av fönster och dörrar.\n-Byte av takfönster.\n-Snickeriarbete med lister, smygar invändig och utvändigt.\n-Plåtarbete i samband med fönster och dörrbyten.\nAndra arbetsmoment inom snickeri kan förekomma.\n\n\nSom montör hos oss skall du vara självgående och noggrann.\nSe möjligheter att kunna leverera det bästa fönstermontaget varje dag.\nPlanera arbetsdagen efter arbetsorder för att säkerställa att montagen utförs korrekt.\nDu behärskar svenska språket såväl i tal som i skrift då vi arbetar utifrån arbetsorder.\nBra fysik eftersom det förekommer tunga moment.\nVi utgår från Kävlinge men arbetar i hela Skåne.\nArbete i andra delar av landen kan förekomma.\nErfarenhet från fönstermontering/snickeri är ett krav.\nKörkort är ett krav. BE är ett plus.\nRJ Byggmontage AB är ett företag som inriktat sig på fönstermontage men där även andra arbete kan förekomma.\n\n\nVälkomna med ansökningar till\nrichard@rjbyggmontage.se\nRichard Jacobsson 0704-404804"
}