{
  "meta" : {
    "jobad" : {
      "description" : {
        "requirements" : null,
        "needs" : null,
        "company_information" : null,
        "text_formatted" : "...till kund i Lammhult. \n \nNu letar vi efter dig som vill arbeta som möbeltapetserare hos en av våra kunder i Lammhult. Vi tror att du som söker har en relevant utbildning i grunden, gärna mot möbeltapetsering eller att du har motsvarande arbetslivserfarenhet. Du är en hantverkare som gillar att arbeta med olika typer av material och fokuserar alltid på kvalitet och noggrannhet i varje steg. Vidare är du bekant med olika typer av material och är van vid att hantera olika modeller. Som person är du noggrann och en god lagspelare som trivs att arbeta i team. Vi ser gärna att du som söker ser långsiktigt på uppdraget, och vill vara med och utvecklas tillsammans med våran kund. Krav för tjänsten är att du behärskar svenska obehindrat. \n \nTjänsten inleds med en anställning hos TopWork med ett mål om att kandidaten senare ska övergå till en anställning hos kund. Som konsult hos TopWork får du en konsultchef som stöttar dig i ditt uppdrag hos kund. Vi ger dig råd och rekommendationer om hur du kan utvecklas i ditt arbete.\n\n\nTopWork är ett auktoriserat företag som arbetar med bemanning och rekrytering. Våra kunder finns inom branscher som industri, lager, logistik, bygg och administration. Vi är din trygga, professionella partner oavsett om du söker nya medarbetare eller nya utmaningar. TopWork - vi hittar rätt medarbetare till rätt arbetsgivare och arbetsplats. \r\n\r\nKrav:\n\nKörkort:\n* B (Personbil)",
        "conditions" : "Heltid\r\nTillsvidare",
        "text" : "...till kund i Lammhult. \n \nNu letar vi efter dig som vill arbeta som möbeltapetserare hos en av våra kunder i Lammhult. Vi tror att du som söker har en relevant utbildning i grunden, gärna mot möbeltapetsering eller att du har motsvarande arbetslivserfarenhet. Du är en hantverkare som gillar att arbeta med olika typer av material och fokuserar alltid på kvalitet och noggrannhet i varje steg. Vidare är du bekant med olika typer av material och är van vid att hantera olika modeller. Som person är du noggrann och en god lagspelare som trivs att arbeta i team. Vi ser gärna att du som söker ser långsiktigt på uppdraget, och vill vara med och utvecklas tillsammans med våran kund. Krav för tjänsten är att du behärskar svenska obehindrat. \n \nTjänsten inleds med en anställning hos TopWork med ett mål om att kandidaten senare ska övergå till en anställning hos kund. Som konsult hos TopWork får du en konsultchef som stöttar dig i ditt uppdrag hos kund. Vi ger dig råd och rekommendationer om hur du kan utvecklas i ditt arbete.\n\n\nTopWork är ett auktoriserat företag som arbetar med bemanning och rekrytering. Våra kunder finns inom branscher som industri, lager, logistik, bygg och administration. Vi är din trygga, professionella partner oavsett om du söker nya medarbetare eller nya utmaningar. TopWork - vi hittar rätt medarbetare till rätt arbetsgivare och arbetsplats. \r\n\r\nKrav:\n\nKörkort:\n* B (Personbil)"
      },
      "headline" : "TopWork söker erfaren möbeltapetserare...",
      "driving_license" : [ {
        "concept_id" : "VTK8_WRx_GcM",
        "label" : "B",
        "legacy_ams_taxonomy_id" : "3"
      } ],
      "employer" : {
        "email" : null,
        "phone_number" : null,
        "organization_number" : "5569026767",
        "name" : "TopWork Sverige AB",
        "url" : "http://www.topwork.se",
        "workplace" : "TopWork"
      },
      "removed_date" : null,
      "logo_url" : "https://www.arbetsformedlingen.se/rest/arbetsgivare/rest/af/v3/organisation/5569026767/logotyper/logo.png",
      "last_publication_date" : "2022-08-21T23:59:59",
      "number_of_vacancies" : 1,
      "occupation" : {
        "concept_id" : "WRqj_odW_CpM",
        "label" : "Tapetserare, industriell tillverkning",
        "legacy_ams_taxonomy_id" : "7616"
      },
      "occupation_group" : {
        "concept_id" : "vhUJ_LyD_XWc",
        "label" : "Tapetserare",
        "legacy_ams_taxonomy_id" : "7533"
      },
      "employment_type" : {
        "concept_id" : "PFZr_Syz_cUq",
        "label" : "Vanlig anställning",
        "legacy_ams_taxonomy_id" : "1"
      },
      "webpage_url" : "https://arbetsformedlingen.se/platsbanken/annonser/26381540",
      "driving_license_required" : true,
      "application_contacts" : [ {
        "description" : "Alma Jasarevic",
        "email" : null,
        "telephone" : "0729893501",
        "name" : null,
        "contact_type" : "Rekryterare"
      } ],
      "duration" : {
        "concept_id" : "a7uU_j21_mkL",
        "label" : "Tills vidare",
        "legacy_ams_taxonomy_id" : "1"
      },
      "nice_to_have" : {
        "education_level" : [ ],
        "work_experiences" : [ ],
        "skills" : [ ],
        "education" : [ ],
        "languages" : [ ]
      },
      "application_details" : {
        "via_af" : false,
        "email" : null,
        "other" : null,
        "reference" : null,
        "url" : "https://www.recruto.se/apps/ads/view/id/43686-topwork-care-varnamo-topwork-soker-erfaren-mobeltapetserare/tracking/5",
        "information" : null
      },
      "source_type" : "VIA_PLATSBANKEN_DXA",
      "application_deadline" : "2022-08-21T23:59:59",
      "external_id" : "46-556902-6767-500-43686-40",
      "workplace_address" : {
        "coordinates" : [ 14.047821, 57.18316 ],
        "city" : null,
        "postcode" : null,
        "municipality" : "Värnamo",
        "region_concept_id" : "MtbE_xWT_eMi",
        "region" : "Jönköpings län",
        "country_code" : "199",
        "region_code" : "06",
        "municipality_concept_id" : "6bS8_fzf_xpW",
        "country_concept_id" : "i46j_HmG_v64",
        "municipality_code" : "0683",
        "street_address" : null,
        "country" : "Sverige"
      },
      "id" : "26381540",
      "experience_required" : false,
      "working_hours_type" : {
        "concept_id" : "6YE1_gAC_R2G",
        "label" : "Heltid",
        "legacy_ams_taxonomy_id" : "1"
      },
      "access" : null,
      "timestamp" : 1659705367191,
      "must_have" : {
        "education_level" : [ ],
        "work_experiences" : [ ],
        "skills" : [ ],
        "education" : [ ],
        "languages" : [ ]
      },
      "occupation_field" : {
        "concept_id" : "PaxQ_o1G_wWH",
        "label" : "Hantverk",
        "legacy_ams_taxonomy_id" : "6"
      },
      "scope_of_work" : {
        "min" : 100,
        "max" : 100
      },
      "salary_type" : {
        "concept_id" : "oG8G_9cW_nRf",
        "label" : "Fast månads- vecko- eller timlön",
        "legacy_ams_taxonomy_id" : "1"
      },
      "removed" : false,
      "salary_description" : "Fast",
      "access_to_own_car" : false,
      "publication_date" : "2022-08-05T15:16:07"
    },
    "name" : "TopWork söker erfaren möbeltapetserare...",
    "user" : "hannes"
  },
  "sha1" : "4e2a3a8f98c61779334f32c09d805bb7ea5709c2",
  "annotations" : [ {
    "preferred-label" : "Tapetsering, möbler",
    "type" : "skill",
    "start-position" : 22,
    "end-position" : 38,
    "concept-id" : "ASht_i6X_E6T",
    "matched-string" : "möbeltapetserare",
    "annotation-id" : 3
  }, {
    "preferred-label" : "Tapetsering, möbler",
    "type" : "skill",
    "start-position" : 112,
    "end-position" : 128,
    "concept-id" : "ASht_i6X_E6T",
    "matched-string" : "möbeltapetserare",
    "annotation-id" : 4
  }, {
    "preferred-label" : "Tapetsering, möbler",
    "type" : "skill",
    "start-position" : 236,
    "end-position" : 252,
    "concept-id" : "ASht_i6X_E6T",
    "matched-string" : "möbeltapetsering",
    "annotation-id" : 5
  }, {
    "preferred-label" : "noggrannhet",
    "type" : "esco-skill",
    "start-position" : 412,
    "end-position" : 423,
    "concept-id" : "mrsW_EkL_KRD",
    "matched-string" : "noggrannhet",
    "annotation-id" : 6
  }, {
    "preferred-label" : "noggrannhet",
    "type" : "esco-skill",
    "start-position" : 546,
    "end-position" : 554,
    "concept-id" : "mrsW_EkL_KRD",
    "matched-string" : "noggrann",
    "annotation-id" : 7
  }, {
    "preferred-label" : "Svenska",
    "sentiment" : "MUST_HAVE",
    "type" : "language",
    "start-position" : 764,
    "end-position" : 771,
    "concept-id" : "zSLA_vw2_FXN",
    "matched-string" : "svenska",
    "annotation-id" : 0
  }, {
    "preferred-label" : "Lager",
    "sentiment" : "MUST_HAVE",
    "type" : "keyword",
    "start-position" : 1202,
    "end-position" : 1207,
    "concept-id" : "J5gJ_6vV_egQ",
    "matched-string" : "lager",
    "annotation-id" : 1
  }, {
    "preferred-label" : "Logistik",
    "sentiment" : "MUST_HAVE",
    "type" : "skill",
    "start-position" : 1209,
    "end-position" : 1217,
    "concept-id" : "yXmf_iKi_7ci",
    "matched-string" : "logistik",
    "annotation-id" : 2
  }, {
    "preferred-label" : "B",
    "type" : "driving-licence",
    "start-position" : 1431,
    "end-position" : 1455,
    "concept-id" : "VTK8_WRx_GcM",
    "matched-string" : "Körkort:\n* B (Personbil)",
    "annotation-id" : 8
  } ],
  "text" : "TopWork söker erfaren möbeltapetserare...\n...till kund i Lammhult. \n \nNu letar vi efter dig som vill arbeta som möbeltapetserare hos en av våra kunder i Lammhult. Vi tror att du som söker har en relevant utbildning i grunden, gärna mot möbeltapetsering eller att du har motsvarande arbetslivserfarenhet. Du är en hantverkare som gillar att arbeta med olika typer av material och fokuserar alltid på kvalitet och noggrannhet i varje steg. Vidare är du bekant med olika typer av material och är van vid att hantera olika modeller. Som person är du noggrann och en god lagspelare som trivs att arbeta i team. Vi ser gärna att du som söker ser långsiktigt på uppdraget, och vill vara med och utvecklas tillsammans med våran kund. Krav för tjänsten är att du behärskar svenska obehindrat. \n \nTjänsten inleds med en anställning hos TopWork med ett mål om att kandidaten senare ska övergå till en anställning hos kund. Som konsult hos TopWork får du en konsultchef som stöttar dig i ditt uppdrag hos kund. Vi ger dig råd och rekommendationer om hur du kan utvecklas i ditt arbete.\n\n\nTopWork är ett auktoriserat företag som arbetar med bemanning och rekrytering. Våra kunder finns inom branscher som industri, lager, logistik, bygg och administration. Vi är din trygga, professionella partner oavsett om du söker nya medarbetare eller nya utmaningar. TopWork - vi hittar rätt medarbetare till rätt arbetsgivare och arbetsplats. \r\n\r\nKrav:\n\nKörkort:\n* B (Personbil)"
}