{
  "meta" : {
    "jobad" : {
      "description" : {
        "requirements" : null,
        "needs" : null,
        "company_information" : null,
        "text_formatted" : "<p>Om jobbet</p><p><br></p><p>Stresstålig, snabbfotad och har intresse för matlagning ? </p><p><br></p><p>Då kan du vara Cafe Fika and Wine´s nya team-medlem i köket. Vi är ett trevligt café med alkoholrättigheter som serverar Gamla Stans mysigaste fika, enkel och vällagad mat samt erbjuder både gäster och medarbetare en historisk miljö att vistas i sommar som vinter.</p><p><br></p><p>Till oss kommer stammisen som bor runt hörnet likväl som internationella besökare från världens många hörn, middagssällskap och inbokade grupper i vårt chambre separee. Ingen dag är den andra lik eftersom vi har så många olika typer av gäster med olika behov och önskningar. Nu när sommaren är här så vi ser flödet av stammisar, nya lokala gäster likväl som turister ökar i vår verksamhet. Därför vill vi nu bygga upp ett väl fungerande team i köket som vill vara med och utveckla menyn . Därför letar vi efter dig som vill bidra till att allt som går ut från vårt kök är av hög kvalitet och är tilltalande för ögat som bidrar till att vi är stolta över vår verksamhet. </p><p><br></p><p>Vi har normalt öppet för service från lunch till och med middag. För att få vår verksamhet att fungera optimalt behöver vi förstärka vårt köksteam med dig som gillar mat och matlagning, har energi och snabbhet i kroppen och en tydlig känsla för kvalité.</p><p><br></p><p>Vi letar främst efter dig som har en ansvarfull och vuxen inställning till ditt arbete, har ett naturligt fokus på lösningar, blir glad av att jobba i team samtidigt som du har förmågan att självständigt leverera resultat när det krävs. Du behöver ha erfarenhet av att arbeta i varierat och ibland mycket högt tempo och vara bra på ordning och reda. Vi ser helst att du har kunskap om matlagning mer än i ditt eget kök men inte nödvändigtvis lång erfarenhet av fik/restaurant. För rätt person lägger vi gärna tid på upplärning ut ifrån verksamhetens behov. </p><p><br></p><p>• Gillar du att laga god mat? </p><p><br></p><p>• Har du förmågan att skapa struktur under press?</p><p><br></p><p>• Har energi i benen och ett snabbt huvud? </p><p><br></p><p>Då tror vi att du är den vi letar efter!</p><p><br></p><p>VI ERBJUDER</p><p>• Engagemang och glädje.</p><p>• Gamla stans trevligaste kunder och väldigt trivsam och mysig miljö.</p><p>Vi har lika höga ambitioner för vår arbetsmiljö och trivsel som vi har för det vi serverar våra gäster, så hos oss kommer du vara viktig!</p><p><br></p><p>KRAV </p><p><br></p><p>• Arbetslivserfarenhet av att leverera kvalitet i högt tempo, minst ett år. </p><p>• Lösningsorienterad och strukturerad.</p><p>• Positiv inställning till utmaningar.</p><p>• God svenska i tal.</p><p><br></p><p> </p><p><br></p><p>MERITERANDE</p><p>• Tidigare erfarenhet av matlagning i professionell miljö.</p><p>• Erfarenhet av service</p><p>• Utbildning som kock eller kallskänka. </p><p>• Kunskap om regler kring hygien i kök. </p><p>• Positiv attityd till tillvaron. </p><p>• Körkort.</p><p><br></p><p> </p><p><br></p><p>Vi är måna om att snabbt hitta rätt person och jobbet kommer tillsättas så fort som möjligt. Välkommen med din ansökan per mail till rekrytering@cafefika.se</p>",
        "conditions" : null,
        "text" : "Om jobbet\n\n\nStresstålig, snabbfotad och har intresse för matlagning ? \n\n\nDå kan du vara Cafe Fika and Wine´s nya team-medlem i köket. Vi är ett trevligt café med alkoholrättigheter som serverar Gamla Stans mysigaste fika, enkel och vällagad mat samt erbjuder både gäster och medarbetare en historisk miljö att vistas i sommar som vinter.\n\n\nTill oss kommer stammisen som bor runt hörnet likväl som internationella besökare från världens många hörn, middagssällskap och inbokade grupper i vårt chambre separee. Ingen dag är den andra lik eftersom vi har så många olika typer av gäster med olika behov och önskningar. Nu när sommaren är här så vi ser flödet av stammisar, nya lokala gäster likväl som turister ökar i vår verksamhet. Därför vill vi nu bygga upp ett väl fungerande team i köket som vill vara med och utveckla menyn . Därför letar vi efter dig som vill bidra till att allt som går ut från vårt kök är av hög kvalitet och är tilltalande för ögat som bidrar till att vi är stolta över vår verksamhet. \n\n\nVi har normalt öppet för service från lunch till och med middag. För att få vår verksamhet att fungera optimalt behöver vi förstärka vårt köksteam med dig som gillar mat och matlagning, har energi och snabbhet i kroppen och en tydlig känsla för kvalité.\n\n\nVi letar främst efter dig som har en ansvarfull och vuxen inställning till ditt arbete, har ett naturligt fokus på lösningar, blir glad av att jobba i team samtidigt som du har förmågan att självständigt leverera resultat när det krävs. Du behöver ha erfarenhet av att arbeta i varierat och ibland mycket högt tempo och vara bra på ordning och reda. Vi ser helst att du har kunskap om matlagning mer än i ditt eget kök men inte nödvändigtvis lång erfarenhet av fik/restaurant. För rätt person lägger vi gärna tid på upplärning ut ifrån verksamhetens behov. \n\n\n• Gillar du att laga god mat? \n\n\n• Har du förmågan att skapa struktur under press?\n\n\n• Har energi i benen och ett snabbt huvud? \n\n\nDå tror vi att du är den vi letar efter!\n\n\nVI ERBJUDER\n• Engagemang och glädje.\n• Gamla stans trevligaste kunder och väldigt trivsam och mysig miljö.\nVi har lika höga ambitioner för vår arbetsmiljö och trivsel som vi har för det vi serverar våra gäster, så hos oss kommer du vara viktig!\n\n\nKRAV \n\n\n• Arbetslivserfarenhet av att leverera kvalitet i högt tempo, minst ett år. \n• Lösningsorienterad och strukturerad.\n• Positiv inställning till utmaningar.\n• God svenska i tal.\n\n\n \n\n\nMERITERANDE\n• Tidigare erfarenhet av matlagning i professionell miljö.\n• Erfarenhet av service\n• Utbildning som kock eller kallskänka. \n• Kunskap om regler kring hygien i kök. \n• Positiv attityd till tillvaron. \n• Körkort.\n\n\n \n\n\nVi är måna om att snabbt hitta rätt person och jobbet kommer tillsättas så fort som möjligt. Välkommen med din ansökan per mail till rekrytering@cafefika.se"
      },
      "headline" : "Kallskänka / köksbiträde",
      "driving_license" : null,
      "employer" : {
        "email" : null,
        "phone_number" : null,
        "organization_number" : "5590811203",
        "name" : "Café Fika Stockholm AB",
        "url" : "www.cafefika.se",
        "workplace" : "Fika and Wine "
      },
      "removed_date" : null,
      "logo_url" : "https://www.arbetsformedlingen.se/rest/arbetsgivare/rest/af/v3/arbetsplatser/88118656/logotyper/logo.png",
      "last_publication_date" : "2022-09-12T23:59:59",
      "number_of_vacancies" : 2,
      "occupation" : {
        "concept_id" : "JECy_3w6_gah",
        "label" : "Kallskänka",
        "legacy_ams_taxonomy_id" : "5485"
      },
      "occupation_group" : {
        "concept_id" : "BStc_SJh_DKG",
        "label" : "Kockar och kallskänkor",
        "legacy_ams_taxonomy_id" : "5120"
      },
      "employment_type" : {
        "concept_id" : "PFZr_Syz_cUq",
        "label" : "Vanlig anställning",
        "legacy_ams_taxonomy_id" : "1"
      },
      "webpage_url" : "https://arbetsformedlingen.se/platsbanken/annonser/26344844",
      "driving_license_required" : false,
      "application_contacts" : [ ],
      "duration" : {
        "concept_id" : "a7uU_j21_mkL",
        "label" : "Tills vidare",
        "legacy_ams_taxonomy_id" : "1"
      },
      "nice_to_have" : {
        "education_level" : [ ],
        "work_experiences" : [ {
          "concept_id" : "JECy_3w6_gah",
          "weight" : 5,
          "label" : "Kallskänka",
          "legacy_ams_taxonomy_id" : "5485"
        } ],
        "skills" : [ ],
        "education" : [ ],
        "languages" : [ ]
      },
      "application_details" : {
        "via_af" : false,
        "email" : "rekrytering@cafefika.se",
        "other" : null,
        "reference" : null,
        "url" : null,
        "information" : null
      },
      "source_type" : "VIA_ANNONSERA",
      "application_deadline" : "2022-09-12T23:59:59",
      "external_id" : null,
      "workplace_address" : {
        "coordinates" : [ 18.073906538637818, 59.32573083962354 ],
        "city" : "Stockholm",
        "postcode" : "11131",
        "municipality" : "Stockholm",
        "region_concept_id" : "CifL_Rzy_Mku",
        "region" : "Stockholms län",
        "country_code" : "199",
        "region_code" : "01",
        "municipality_concept_id" : "AvNB_uwa_6n6",
        "country_concept_id" : "i46j_HmG_v64",
        "municipality_code" : "0180",
        "street_address" : "Österlånggatan 5",
        "country" : "Sverige"
      },
      "id" : "26344844",
      "experience_required" : true,
      "working_hours_type" : {
        "concept_id" : "6YE1_gAC_R2G",
        "label" : "Heltid",
        "legacy_ams_taxonomy_id" : "1"
      },
      "access" : null,
      "timestamp" : 1660379680302,
      "must_have" : {
        "education_level" : [ ],
        "work_experiences" : [ ],
        "skills" : [ ],
        "education" : [ ],
        "languages" : [ ]
      },
      "occupation_field" : {
        "concept_id" : "ScKy_FHB_7wT",
        "label" : "Hotell, restaurang, storhushåll",
        "legacy_ams_taxonomy_id" : "7"
      },
      "scope_of_work" : {
        "min" : 0,
        "max" : 100
      },
      "salary_type" : {
        "concept_id" : "oG8G_9cW_nRf",
        "label" : "Fast månads- vecko- eller timlön",
        "legacy_ams_taxonomy_id" : "1"
      },
      "removed" : false,
      "salary_description" : null,
      "access_to_own_car" : false,
      "publication_date" : "2022-08-13T10:34:40"
    },
    "name" : "Kallskänka / köksbiträde",
    "user" : "hannes"
  },
  "sha1" : "d92378b6c6aac59dcea5f04fad86ff64f57cf7d2",
  "annotations" : [ {
    "preferred-label" : "Kallskänka",
    "sentiment" : "MUST_HAVE",
    "type" : "occupation-name",
    "start-position" : 0,
    "end-position" : 10,
    "concept-id" : "JECy_3w6_gah",
    "matched-string" : "kallskänka",
    "annotation-id" : 0
  }, {
    "preferred-label" : "Köksbiträde",
    "sentiment" : "MUST_HAVE",
    "type" : "occupation-name",
    "start-position" : 13,
    "end-position" : 24,
    "concept-id" : "oRB5_b7i_Qzv",
    "matched-string" : "köksbiträde",
    "annotation-id" : 1
  }, {
    "preferred-label" : "hantera stress",
    "sentiment" : "MUST_HAVE",
    "type" : "esco-skill",
    "start-position" : 37,
    "end-position" : 48,
    "concept-id" : "z5Zo_DVb_VEK",
    "matched-string" : "Stresstålig",
    "annotation-id" : 7
  }, {
    "preferred-label" : "Café",
    "sentiment" : "NOT_RELEVANT",
    "type" : "skill",
    "start-position" : 178,
    "end-position" : 182,
    "concept-id" : "f2Nt_4bK_HNX",
    "matched-string" : "café",
    "annotation-id" : 2
  }, {
    "preferred-label" : "visa ansvarstagande",
    "sentiment" : "MUST_HAVE",
    "type" : "esco-skill",
    "start-position" : 1331,
    "end-position" : 1341,
    "concept-id" : "bcRp_hxV_f5G",
    "matched-string" : "ansvarfull",
    "annotation-id" : 8
  }, {
    "preferred-label" : "arbeta självständigt",
    "sentiment" : "MUST_HAVE",
    "type" : "esco-skill",
    "start-position" : 1484,
    "end-position" : 1497,
    "concept-id" : "NyFu_HHd_zhz",
    "matched-string" : "självständigt",
    "annotation-id" : 9
  }, {
    "preferred-label" : "arbetsmiljö",
    "sentiment" : "OFFERED",
    "type" : "esco-skill",
    "start-position" : 2171,
    "end-position" : 2182,
    "concept-id" : "zdQY_QJh_nUH",
    "matched-string" : "arbetsmiljö",
    "annotation-id" : 3
  }, {
    "preferred-label" : "1-2 års erfarenhet",
    "sentiment" : "MUST_HAVE",
    "type" : "occupation-experience-year",
    "start-position" : 2285,
    "end-position" : 2305,
    "concept-id" : "LLnd_5GJ_4ju",
    "matched-string" : "Arbetslivserfarenhet",
    "annotation-id" : 10
  }, {
    "preferred-label" : "1-2 års erfarenhet",
    "sentiment" : "MUST_HAVE",
    "type" : "occupation-experience-year",
    "start-position" : 2351,
    "end-position" : 2357,
    "concept-id" : "LLnd_5GJ_4ju",
    "matched-string" : "ett år",
    "annotation-id" : 11
  }, {
    "preferred-label" : "Svenska",
    "sentiment" : "MUST_HAVE",
    "type" : "language",
    "start-position" : 2444,
    "end-position" : 2451,
    "concept-id" : "zSLA_vw2_FXN",
    "matched-string" : "svenska",
    "annotation-id" : 4
  }, {
    "preferred-label" : "Kockutbildning",
    "sentiment" : "NICE_TO_HAVE",
    "type" : "keyword",
    "start-position" : 2577,
    "end-position" : 2581,
    "concept-id" : "62ja_BdV_Xdo",
    "matched-string" : "kock",
    "annotation-id" : 5
  }, {
    "preferred-label" : "Kallskänka",
    "sentiment" : "NICE_TO_HAVE",
    "type" : "occupation-name",
    "start-position" : 2588,
    "end-position" : 2598,
    "concept-id" : "JECy_3w6_gah",
    "matched-string" : "kallskänka",
    "annotation-id" : 6
  }, {
    "preferred-label" : "körkort",
    "sentiment" : "NICE_TO_HAVE",
    "type" : "esco-skill",
    "start-position" : 2679,
    "end-position" : 2686,
    "concept-id" : "UvDr_eNo_HSQ",
    "matched-string" : "Körkort",
    "annotation-id" : 12
  } ],
  "text" : "Kallskänka / köksbiträde\nOm jobbet\n\n\nStresstålig, snabbfotad och har intresse för matlagning ? \n\n\nDå kan du vara Cafe Fika and Wine´s nya team-medlem i köket. Vi är ett trevligt café med alkoholrättigheter som serverar Gamla Stans mysigaste fika, enkel och vällagad mat samt erbjuder både gäster och medarbetare en historisk miljö att vistas i sommar som vinter.\n\n\nTill oss kommer stammisen som bor runt hörnet likväl som internationella besökare från världens många hörn, middagssällskap och inbokade grupper i vårt chambre separee. Ingen dag är den andra lik eftersom vi har så många olika typer av gäster med olika behov och önskningar. Nu när sommaren är här så vi ser flödet av stammisar, nya lokala gäster likväl som turister ökar i vår verksamhet. Därför vill vi nu bygga upp ett väl fungerande team i köket som vill vara med och utveckla menyn . Därför letar vi efter dig som vill bidra till att allt som går ut från vårt kök är av hög kvalitet och är tilltalande för ögat som bidrar till att vi är stolta över vår verksamhet. \n\n\nVi har normalt öppet för service från lunch till och med middag. För att få vår verksamhet att fungera optimalt behöver vi förstärka vårt köksteam med dig som gillar mat och matlagning, har energi och snabbhet i kroppen och en tydlig känsla för kvalité.\n\n\nVi letar främst efter dig som har en ansvarfull och vuxen inställning till ditt arbete, har ett naturligt fokus på lösningar, blir glad av att jobba i team samtidigt som du har förmågan att självständigt leverera resultat när det krävs. Du behöver ha erfarenhet av att arbeta i varierat och ibland mycket högt tempo och vara bra på ordning och reda. Vi ser helst att du har kunskap om matlagning mer än i ditt eget kök men inte nödvändigtvis lång erfarenhet av fik/restaurant. För rätt person lägger vi gärna tid på upplärning ut ifrån verksamhetens behov. \n\n\n• Gillar du att laga god mat? \n\n\n• Har du förmågan att skapa struktur under press?\n\n\n• Har energi i benen och ett snabbt huvud? \n\n\nDå tror vi att du är den vi letar efter!\n\n\nVI ERBJUDER\n• Engagemang och glädje.\n• Gamla stans trevligaste kunder och väldigt trivsam och mysig miljö.\nVi har lika höga ambitioner för vår arbetsmiljö och trivsel som vi har för det vi serverar våra gäster, så hos oss kommer du vara viktig!\n\n\nKRAV \n\n\n• Arbetslivserfarenhet av att leverera kvalitet i högt tempo, minst ett år. \n• Lösningsorienterad och strukturerad.\n• Positiv inställning till utmaningar.\n• God svenska i tal.\n\n\n \n\n\nMERITERANDE\n• Tidigare erfarenhet av matlagning i professionell miljö.\n• Erfarenhet av service\n• Utbildning som kock eller kallskänka. \n• Kunskap om regler kring hygien i kök. \n• Positiv attityd till tillvaron. \n• Körkort.\n\n\n \n\n\nVi är måna om att snabbt hitta rätt person och jobbet kommer tillsättas så fort som möjligt. Välkommen med din ansökan per mail till rekrytering@cafefika.se"
}