{
  "meta" : {
    "jobad" : {
      "description" : {
        "requirements" : null,
        "needs" : null,
        "company_information" : null,
        "text_formatted" : "Har du minst 1-2 års erfarenhet inom försäljning och vill ta nästa steg? Har du en vilja och driv att lyckas och bygga upp en stor kundportfölj på Europas största privatägda tjänsteföretag med fantastiska intjänings- och utvecklingsmöjligheter? Har du erfarenhet av IT eller rekrytering och vill ta nästa steg? Då ska du läsa vidare nedan.\n\n\n\nOm företaget:\n\nVår kund specialiserar sig på uthyrning av generalister och förmedling av specialister inom IT. De är ett internationellt bolag som har hjälpt mer än 2000 personer ta nästa steg i sin karriär. Idag är man ca 400 anställda i Sverige och har kontor i Stockholm, Göteborg, Malmö och Linköping. Huvudkontoret ligger i Sundbyberg i norra Stockholm.\n\n\n\nOm tjänsten:\n\nSom Account Manager hos vår kund så kommer du att arbeta med uppsökande försäljning. Du kommer ha ett helhetsansvar över hela försäljningsprocessen från prospektering hela vägen fram till avslut. Din huvuduppgift är att självständigt hitta nya leads, driva och utveckla affärer inom IT-konsultbranschen. För att lyckas så krävs en hög aktivitet samt en målmedvetenhet och ett starkt kundfokus. Dina kollegor stöttar dig på jobbet och möjliggör för en rolig och stimulerande tillvaro där du belönas längs vägen. Företaget lägger ett stort fokus på personliga egenskaper i rekryteringsprocessen.\n\n\n\nVem är du?\n\nFör att passa för tjänsten så ser vi att:\n\n- Du har minst 1-2 års erfarenhet av B2B-försäljning.\n- Du är en person som har en enorm vilja ett starkt inre driv att lyckas. Du har en näsa för affärer och vet att du måste jobba hårt för att nå dina mål.\n- Det är ett stort plus om du kommer från IT-branschen och/eller har god förståelse för branschen.\n- Det är ett stort plus om du har erfarenhet från bemannings- och rekryteringsbranschen.\n- Du tycker om att ta ansvar och växer med uppgiften.\n- Du är en förtroendeingivande person som har lätt att connecta med alla typer av personer.\n- Du är en teamplayer som gillar att jobba ihop med andra.\n- Du är mellan 25-35 år.\n- Du har med fördel B-körkort.\n\n\nVad ingår i tjänsten?\n- Grundlön samt provision\n- Friskvårdsbidrag\n- Dator och telefon\n- Pension\n- Trevliga lokaler i expansiva Sundbyberg.\n\n\n\n\nAnsökan & Lön\n\nJobbtyp: Heltid\n\nPlats: Sundbyberg\n\nLön: Fastlön + Provision\n\nKontakt: We Quest Bemanning & Rekrytering. Vi rekommenderar att du skickar in din ansökan omgående då vi gör ett löpande urval. Välkommen med din ansökan!\n\n\n\nOm WeQuest\n\nWe Quest är ett rekrytering och bemanningsföretag som finns runt om hela Stockholm län. Vårt mål är att förenkla rekryteringsprocessen, både för dig som söker nytt jobb och för de företag som vill anställa nya medarbetare. Vi är rekryteringsspecialister inom sälj, administration, marknad och service. Genom att hålla en tydlig dialog, vara snabba och anpassningsbara samt med en passion för det vi gör säkerställer vi en framgångsrik rekryteringsprocess för alla parter.\n\nSökord: Account Manager, Business-to-business, Rekrytering, Bemanning IT, Cic",
        "conditions" : "Heltid\r\nAnställningstid enligt överenskommelse",
        "text" : "Har du minst 1-2 års erfarenhet inom försäljning och vill ta nästa steg? Har du en vilja och driv att lyckas och bygga upp en stor kundportfölj på Europas största privatägda tjänsteföretag med fantastiska intjänings- och utvecklingsmöjligheter? Har du erfarenhet av IT eller rekrytering och vill ta nästa steg? Då ska du läsa vidare nedan.\n\n\n\nOm företaget:\n\nVår kund specialiserar sig på uthyrning av generalister och förmedling av specialister inom IT. De är ett internationellt bolag som har hjälpt mer än 2000 personer ta nästa steg i sin karriär. Idag är man ca 400 anställda i Sverige och har kontor i Stockholm, Göteborg, Malmö och Linköping. Huvudkontoret ligger i Sundbyberg i norra Stockholm.\n\n\n\nOm tjänsten:\n\nSom Account Manager hos vår kund så kommer du att arbeta med uppsökande försäljning. Du kommer ha ett helhetsansvar över hela försäljningsprocessen från prospektering hela vägen fram till avslut. Din huvuduppgift är att självständigt hitta nya leads, driva och utveckla affärer inom IT-konsultbranschen. För att lyckas så krävs en hög aktivitet samt en målmedvetenhet och ett starkt kundfokus. Dina kollegor stöttar dig på jobbet och möjliggör för en rolig och stimulerande tillvaro där du belönas längs vägen. Företaget lägger ett stort fokus på personliga egenskaper i rekryteringsprocessen.\n\n\n\nVem är du?\n\nFör att passa för tjänsten så ser vi att:\n\n- Du har minst 1-2 års erfarenhet av B2B-försäljning.\n- Du är en person som har en enorm vilja ett starkt inre driv att lyckas. Du har en näsa för affärer och vet att du måste jobba hårt för att nå dina mål.\n- Det är ett stort plus om du kommer från IT-branschen och/eller har god förståelse för branschen.\n- Det är ett stort plus om du har erfarenhet från bemannings- och rekryteringsbranschen.\n- Du tycker om att ta ansvar och växer med uppgiften.\n- Du är en förtroendeingivande person som har lätt att connecta med alla typer av personer.\n- Du är en teamplayer som gillar att jobba ihop med andra.\n- Du är mellan 25-35 år.\n- Du har med fördel B-körkort.\n\n\nVad ingår i tjänsten?\n- Grundlön samt provision\n- Friskvårdsbidrag\n- Dator och telefon\n- Pension\n- Trevliga lokaler i expansiva Sundbyberg.\n\n\n\n\nAnsökan & Lön\n\nJobbtyp: Heltid\n\nPlats: Sundbyberg\n\nLön: Fastlön + Provision\n\nKontakt: We Quest Bemanning & Rekrytering. Vi rekommenderar att du skickar in din ansökan omgående då vi gör ett löpande urval. Välkommen med din ansökan!\n\n\n\nOm WeQuest\n\nWe Quest är ett rekrytering och bemanningsföretag som finns runt om hela Stockholm län. Vårt mål är att förenkla rekryteringsprocessen, både för dig som söker nytt jobb och för de företag som vill anställa nya medarbetare. Vi är rekryteringsspecialister inom sälj, administration, marknad och service. Genom att hålla en tydlig dialog, vara snabba och anpassningsbara samt med en passion för det vi gör säkerställer vi en framgångsrik rekryteringsprocess för alla parter.\n\nSökord: Account Manager, Business-to-business, Rekrytering, Bemanning IT, Cic"
      },
      "headline" : "Account Manager",
      "driving_license" : null,
      "employer" : {
        "email" : null,
        "phone_number" : null,
        "organization_number" : "5590458047",
        "name" : "We Quest AB",
        "url" : "http://wequest.se/",
        "workplace" : "We Quest "
      },
      "removed_date" : null,
      "logo_url" : "https://www.arbetsformedlingen.se/rest/arbetsgivare/rest/af/v3/organisation/5590458047/logotyper/logo.png",
      "last_publication_date" : "2022-08-22T23:59:59",
      "number_of_vacancies" : 1,
      "occupation" : {
        "concept_id" : "8jrL_5RZ_9Kt",
        "label" : "Account manager",
        "legacy_ams_taxonomy_id" : "6728"
      },
      "occupation_group" : {
        "concept_id" : "oXSW_fbY_XrY",
        "label" : "Företagssäljare",
        "legacy_ams_taxonomy_id" : "3322"
      },
      "employment_type" : {
        "concept_id" : "PFZr_Syz_cUq",
        "label" : "Vanlig anställning",
        "legacy_ams_taxonomy_id" : "1"
      },
      "webpage_url" : "https://arbetsformedlingen.se/platsbanken/annonser/26375345",
      "driving_license_required" : false,
      "application_contacts" : [ {
        "description" : "Forat Altimimi",
        "email" : "forat@wequest.se",
        "telephone" : null,
        "name" : null,
        "contact_type" : null
      } ],
      "duration" : {
        "concept_id" : "a7uU_j21_mkL",
        "label" : "Tills vidare",
        "legacy_ams_taxonomy_id" : "1"
      },
      "nice_to_have" : {
        "education_level" : [ ],
        "work_experiences" : [ ],
        "skills" : [ ],
        "education" : [ ],
        "languages" : [ ]
      },
      "application_details" : {
        "via_af" : false,
        "email" : null,
        "other" : null,
        "reference" : null,
        "url" : "https://ledigajobb.wequest.se/jobs/1374359-account-manager?promotion=287977-arbetsformedlingen",
        "information" : null
      },
      "source_type" : "VIA_PLATSBANKEN_DXA",
      "application_deadline" : "2022-08-22T23:59:59",
      "external_id" : "46-559045-8047-1374359-29",
      "workplace_address" : {
        "coordinates" : [ 17.966309, 59.367046 ],
        "city" : null,
        "postcode" : null,
        "municipality" : "Sundbyberg",
        "region_concept_id" : "CifL_Rzy_Mku",
        "region" : "Stockholms län",
        "country_code" : "199",
        "region_code" : "01",
        "municipality_concept_id" : "UTJZ_zHH_mJm",
        "country_concept_id" : "i46j_HmG_v64",
        "municipality_code" : "0183",
        "street_address" : null,
        "country" : "Sverige"
      },
      "id" : "26375345",
      "experience_required" : true,
      "working_hours_type" : {
        "concept_id" : "6YE1_gAC_R2G",
        "label" : "Heltid",
        "legacy_ams_taxonomy_id" : "1"
      },
      "access" : null,
      "timestamp" : 1659529255531,
      "must_have" : {
        "education_level" : [ ],
        "work_experiences" : [ {
          "concept_id" : "8jrL_5RZ_9Kt",
          "weight" : 10,
          "label" : "Account manager",
          "legacy_ams_taxonomy_id" : "6728"
        } ],
        "skills" : [ ],
        "education" : [ ],
        "languages" : [ ]
      },
      "occupation_field" : {
        "concept_id" : "RPTn_bxG_ExZ",
        "label" : "Försäljning, inköp, marknadsföring",
        "legacy_ams_taxonomy_id" : "5"
      },
      "scope_of_work" : {
        "min" : 100,
        "max" : 100
      },
      "salary_type" : {
        "concept_id" : "oG8G_9cW_nRf",
        "label" : "Fast månads- vecko- eller timlön",
        "legacy_ams_taxonomy_id" : "1"
      },
      "removed" : false,
      "salary_description" : "Lön enligt överenskommelse",
      "access_to_own_car" : false,
      "publication_date" : "2022-08-03T14:20:55"
    },
    "name" : "Account Manager",
    "user" : "hannes"
  },
  "sha1" : "5431856862fed96c24d3a6a031109b3d538b20ea",
  "annotations" : [ {
    "preferred-label" : "Account manager",
    "sentiment" : "MUST_HAVE",
    "type" : "occupation-name",
    "start-position" : 0,
    "end-position" : 15,
    "concept-id" : "8jrL_5RZ_9Kt",
    "matched-string" : "account manager",
    "annotation-id" : 0
  }, {
    "preferred-label" : "1-2 års erfarenhet",
    "type" : "occupation-experience-year",
    "start-position" : 29,
    "end-position" : 47,
    "concept-id" : "LLnd_5GJ_4ju",
    "matched-string" : "1-2 års erfarenhet",
    "annotation-id" : 13
  }, {
    "preferred-label" : "Försäljning, inköp, marknadsföring",
    "type" : "occupation-field",
    "start-position" : 53,
    "end-position" : 64,
    "concept-id" : "RPTn_bxG_ExZ",
    "matched-string" : "försäljning",
    "annotation-id" : 14
  }, {
    "preferred-label" : "Data/IT",
    "sentiment" : "MUST_HAVE",
    "type" : "occupation-field",
    "start-position" : 282,
    "end-position" : 284,
    "concept-id" : "apaJ_2ja_LuF",
    "matched-string" : "it",
    "annotation-id" : 1
  }, {
    "preferred-label" : "Data/IT",
    "sentiment" : "MUST_HAVE",
    "type" : "occupation-field",
    "start-position" : 466,
    "end-position" : 468,
    "concept-id" : "apaJ_2ja_LuF",
    "matched-string" : "it",
    "annotation-id" : 2
  }, {
    "preferred-label" : "Kontor",
    "sentiment" : "MUST_HAVE",
    "type" : "keyword",
    "start-position" : 614,
    "end-position" : 620,
    "concept-id" : "Hyz1_7HF_AkP",
    "matched-string" : "kontor",
    "annotation-id" : 3
  }, {
    "preferred-label" : "Account manager",
    "sentiment" : "MUST_HAVE",
    "type" : "occupation-name",
    "start-position" : 739,
    "end-position" : 754,
    "concept-id" : "8jrL_5RZ_9Kt",
    "matched-string" : "account manager",
    "annotation-id" : 4
  }, {
    "preferred-label" : "Uppsökande försäljning",
    "sentiment" : "MUST_HAVE",
    "type" : "skill",
    "start-position" : 796,
    "end-position" : 818,
    "concept-id" : "FJBT_yzk_BWe",
    "matched-string" : "uppsökande försäljning",
    "annotation-id" : 5
  }, {
    "preferred-label" : "arbeta självständigt",
    "type" : "esco-skill",
    "start-position" : 955,
    "end-position" : 968,
    "concept-id" : "NyFu_HHd_zhz",
    "matched-string" : "självständigt",
    "annotation-id" : 15
  }, {
    "preferred-label" : "Data/IT",
    "sentiment" : "MUST_HAVE",
    "type" : "occupation-field",
    "start-position" : 1018,
    "end-position" : 1020,
    "concept-id" : "apaJ_2ja_LuF",
    "matched-string" : "it",
    "annotation-id" : 6
  }, {
    "preferred-label" : "1-2 års erfarenhet",
    "type" : "occupation-experience-year",
    "start-position" : 1402,
    "end-position" : 1420,
    "concept-id" : "LLnd_5GJ_4ju",
    "matched-string" : "1-2 års erfarenhet",
    "annotation-id" : 16
  }, {
    "preferred-label" : "B2B-säljare",
    "type" : "keyword",
    "start-position" : 1424,
    "end-position" : 1439,
    "concept-id" : "gyej_EdX_JSE",
    "matched-string" : "B2B-försäljning",
    "annotation-id" : 17
  }, {
    "preferred-label" : "Data/IT",
    "sentiment" : "MUST_HAVE",
    "type" : "occupation-field",
    "start-position" : 1637,
    "end-position" : 1639,
    "concept-id" : "apaJ_2ja_LuF",
    "matched-string" : "it",
    "annotation-id" : 8
  }, {
    "preferred-label" : "visa ansvarstagande",
    "type" : "esco-skill",
    "start-position" : 1802,
    "end-position" : 1811,
    "concept-id" : "bcRp_hxV_f5G",
    "matched-string" : "ta ansvar",
    "annotation-id" : 18
  }, {
    "preferred-label" : "B",
    "type" : "driving-licence",
    "start-position" : 2033,
    "end-position" : 2042,
    "concept-id" : "VTK8_WRx_GcM",
    "matched-string" : "B-körkort",
    "annotation-id" : 19
  }, {
    "preferred-label" : "Heltid",
    "type" : "worktime-extent",
    "start-position" : 2214,
    "end-position" : 2220,
    "concept-id" : "6YE1_gAC_R2G",
    "matched-string" : "Heltid",
    "annotation-id" : 20
  }, {
    "preferred-label" : "Sälj",
    "sentiment" : "MUST_HAVE",
    "type" : "keyword",
    "start-position" : 2696,
    "end-position" : 2700,
    "concept-id" : "QaXB_Zd5_gmh",
    "matched-string" : "sälj",
    "annotation-id" : 9
  }, {
    "preferred-label" : "Account manager",
    "sentiment" : "MUST_HAVE",
    "type" : "occupation-name",
    "start-position" : 2918,
    "end-position" : 2933,
    "concept-id" : "8jrL_5RZ_9Kt",
    "matched-string" : "account manager",
    "annotation-id" : 10
  }, {
    "preferred-label" : "Business-to-business",
    "sentiment" : "MUST_HAVE",
    "type" : "keyword",
    "start-position" : 2935,
    "end-position" : 2955,
    "concept-id" : "AQVG_Sxb_rRV",
    "matched-string" : "business-to-business",
    "annotation-id" : 11
  }, {
    "preferred-label" : "Data/IT",
    "sentiment" : "MUST_HAVE",
    "type" : "occupation-field",
    "start-position" : 2980,
    "end-position" : 2982,
    "concept-id" : "apaJ_2ja_LuF",
    "matched-string" : "it",
    "annotation-id" : 12
  } ],
  "text" : "Account Manager\nHar du minst 1-2 års erfarenhet inom försäljning och vill ta nästa steg? Har du en vilja och driv att lyckas och bygga upp en stor kundportfölj på Europas största privatägda tjänsteföretag med fantastiska intjänings- och utvecklingsmöjligheter? Har du erfarenhet av IT eller rekrytering och vill ta nästa steg? Då ska du läsa vidare nedan.\n\n\n\nOm företaget:\n\nVår kund specialiserar sig på uthyrning av generalister och förmedling av specialister inom IT. De är ett internationellt bolag som har hjälpt mer än 2000 personer ta nästa steg i sin karriär. Idag är man ca 400 anställda i Sverige och har kontor i Stockholm, Göteborg, Malmö och Linköping. Huvudkontoret ligger i Sundbyberg i norra Stockholm.\n\n\n\nOm tjänsten:\n\nSom Account Manager hos vår kund så kommer du att arbeta med uppsökande försäljning. Du kommer ha ett helhetsansvar över hela försäljningsprocessen från prospektering hela vägen fram till avslut. Din huvuduppgift är att självständigt hitta nya leads, driva och utveckla affärer inom IT-konsultbranschen. För att lyckas så krävs en hög aktivitet samt en målmedvetenhet och ett starkt kundfokus. Dina kollegor stöttar dig på jobbet och möjliggör för en rolig och stimulerande tillvaro där du belönas längs vägen. Företaget lägger ett stort fokus på personliga egenskaper i rekryteringsprocessen.\n\n\n\nVem är du?\n\nFör att passa för tjänsten så ser vi att:\n\n- Du har minst 1-2 års erfarenhet av B2B-försäljning.\n- Du är en person som har en enorm vilja ett starkt inre driv att lyckas. Du har en näsa för affärer och vet att du måste jobba hårt för att nå dina mål.\n- Det är ett stort plus om du kommer från IT-branschen och/eller har god förståelse för branschen.\n- Det är ett stort plus om du har erfarenhet från bemannings- och rekryteringsbranschen.\n- Du tycker om att ta ansvar och växer med uppgiften.\n- Du är en förtroendeingivande person som har lätt att connecta med alla typer av personer.\n- Du är en teamplayer som gillar att jobba ihop med andra.\n- Du är mellan 25-35 år.\n- Du har med fördel B-körkort.\n\n\nVad ingår i tjänsten?\n- Grundlön samt provision\n- Friskvårdsbidrag\n- Dator och telefon\n- Pension\n- Trevliga lokaler i expansiva Sundbyberg.\n\n\n\n\nAnsökan & Lön\n\nJobbtyp: Heltid\n\nPlats: Sundbyberg\n\nLön: Fastlön + Provision\n\nKontakt: We Quest Bemanning & Rekrytering. Vi rekommenderar att du skickar in din ansökan omgående då vi gör ett löpande urval. Välkommen med din ansökan!\n\n\n\nOm WeQuest\n\nWe Quest är ett rekrytering och bemanningsföretag som finns runt om hela Stockholm län. Vårt mål är att förenkla rekryteringsprocessen, både för dig som söker nytt jobb och för de företag som vill anställa nya medarbetare. Vi är rekryteringsspecialister inom sälj, administration, marknad och service. Genom att hålla en tydlig dialog, vara snabba och anpassningsbara samt med en passion för det vi gör säkerställer vi en framgångsrik rekryteringsprocess för alla parter.\n\nSökord: Account Manager, Business-to-business, Rekrytering, Bemanning IT, Cic"
}