{
  "meta" : {
    "jobad" : {
      "description" : {
        "requirements" : null,
        "needs" : null,
        "company_information" : null,
        "text_formatted" : "Till vårt trevliga kundföretag Staples/Lyreco i Växjö söker vi en driven Development Manager!<br><br>Vi söker dig som vill vara med och bidra till Lyrecos fortsatta framgångar genom att utforma kundspecifika processer och implementera förändringar i Supply Chain-nätverket som förbättrar servicen och optimerar flödet i verksamheten.<br><br>Vidare arbetar du med att leda medarbetare, sätta den övergripande riktningen för verksamheten och säkerställa att mål uppnås och att rätt prioriteringar görs. Du är en del av att utveckla leveranskedjan främst genom ett kontinuerligt och strategiskt förändringsarbete.<br><br>Din vardag är intressant och spännande med ansvar för bland annat:<br> <ul>\t<li>Att utveckla och implementera samarbetsprojekt, strategiska förändringsprojekt i supply chain.</li>\t<li>Att bygga affärscase för att säkra och motivera kapitalinvesteringar samt uppföljning av genomförda projekt.</li>\t<li>Att definiera framgång i termer av målprestanda för operativa lösningar som avgör när den operativa lösningen ska överlämnas.</li></ul><br>Rollen är helt ny och kommer över tid att utvecklas, detta i takt med att verksamheten växer och nya spännande projekt ligger i den långsiktiga planen!<br><br>Varmt välkommen till ett spännande och framåtriktat företag!<br><br><strong>Din profil</strong><br>Du som antar denna utmaning har en eftergymnasial utbildning inom logistik, ekonomi eller motsvarande samt minst fem års praktisk erfarenhet inom Supply Chain och utveckling av rutiner och processer.<br><br>Vidare har du flerårig erfarenhet av projektledning med tillhörande metodik samt drivs av ett engagerat och karismatiskt ledarskap. Har du branscherfarenhet inom logistik, produktion och/eller e-handel, är det klart meriterande. <br><br>Som person har du en genuin passion för digitala processer, verktyg och metoder. Du har ett inneboende driv och förmågan att ta fram och utveckla moderna tekniska lösningar, självklart i samråd med företagets IT-avdelning och specialister.<br><br>Du har ett öppet och modernt sätt och är ständigt nyfiken på trender och innovationer inom branschen, allt för att ligga i framkant och vara en effektiv och smart logistikverksamhet. Självklart har du även intresse för IT-lösningar och den senaste tekniken inom system och mjukvara. <br><br>Kunden sätter du alltid i främsta rummet och med starkt förändringstänk, öppenhet och ett agilt förhållningssätt, når vi långsiktigt uppsatta mål och resultat för hela vår verksamhet. Vi är redo för att ta emot vår nya kollega, kanske är det just dig vi söker?<br><br>Självklart talar och skriver du flytande svenska och engelska, B-körkort är ett önskemål.<br><br>Tjänsten är en tillsvidareanställning med direktanställning hos Staples/Lyreco i Växjö!  <br><br>Vi rekryterar löpande och tjänsten kan komma att tillsättas innan ansökningstiden har gått ut.<br>Du är varmt välkommen med din ansökan redan idag!<br>Du ansöker direkt på empleo.se<br><br>Uppstart: Enligt överenskommelse.<br>Ort/Placering: Växjö.<br>Omfattning: Heltid.<br>Lön: Individuell lönesättning tillämpas.",
        "conditions" : null,
        "text" : "Till vårt trevliga kundföretag Staples/Lyreco i Växjö söker vi en driven Development Manager!\n\nVi söker dig som vill vara med och bidra till Lyrecos fortsatta framgångar genom att utforma kundspecifika processer och implementera förändringar i Supply Chain-nätverket som förbättrar servicen och optimerar flödet i verksamheten.\n\nVidare arbetar du med att leda medarbetare, sätta den övergripande riktningen för verksamheten och säkerställa att mål uppnås och att rätt prioriteringar görs. Du är en del av att utveckla leveranskedjan främst genom ett kontinuerligt och strategiskt förändringsarbete.\n\nDin vardag är intressant och spännande med ansvar för bland annat:\n  Att utveckla och implementera samarbetsprojekt, strategiska förändringsprojekt i supply chain.\n Att bygga affärscase för att säkra och motivera kapitalinvesteringar samt uppföljning av genomförda projekt.\n Att definiera framgång i termer av målprestanda för operativa lösningar som avgör när den operativa lösningen ska överlämnas.\n\nRollen är helt ny och kommer över tid att utvecklas, detta i takt med att verksamheten växer och nya spännande projekt ligger i den långsiktiga planen!\n\nVarmt välkommen till ett spännande och framåtriktat företag!\n\nDin profil\nDu som antar denna utmaning har en eftergymnasial utbildning inom logistik, ekonomi eller motsvarande samt minst fem års praktisk erfarenhet inom Supply Chain och utveckling av rutiner och processer.\n\nVidare har du flerårig erfarenhet av projektledning med tillhörande metodik samt drivs av ett engagerat och karismatiskt ledarskap. Har du branscherfarenhet inom logistik, produktion och/eller e-handel, är det klart meriterande. \n\nSom person har du en genuin passion för digitala processer, verktyg och metoder. Du har ett inneboende driv och förmågan att ta fram och utveckla moderna tekniska lösningar, självklart i samråd med företagets IT-avdelning och specialister.\n\nDu har ett öppet och modernt sätt och är ständigt nyfiken på trender och innovationer inom branschen, allt för att ligga i framkant och vara en effektiv och smart logistikverksamhet. Självklart har du även intresse för IT-lösningar och den senaste tekniken inom system och mjukvara. \n\nKunden sätter du alltid i främsta rummet och med starkt förändringstänk, öppenhet och ett agilt förhållningssätt, når vi långsiktigt uppsatta mål och resultat för hela vår verksamhet. Vi är redo för att ta emot vår nya kollega, kanske är det just dig vi söker?\n\nSjälvklart talar och skriver du flytande svenska och engelska, B-körkort är ett önskemål.\n\nTjänsten är en tillsvidareanställning med direktanställning hos Staples/Lyreco i Växjö!  \n\nVi rekryterar löpande och tjänsten kan komma att tillsättas innan ansökningstiden har gått ut.\nDu är varmt välkommen med din ansökan redan idag!\nDu ansöker direkt på empleo.se\n\nUppstart: Enligt överenskommelse.\nOrt/Placering: Växjö.\nOmfattning: Heltid.\nLön: Individuell lönesättning tillämpas."
      },
      "headline" : "Development Manager till Lyreco i Växjö",
      "driving_license" : null,
      "employer" : {
        "email" : null,
        "phone_number" : null,
        "organization_number" : "5568731425",
        "name" : "Empleo Växjö AB",
        "url" : "www.staples.com",
        "workplace" : "Lyreco Sverige AB"
      },
      "removed_date" : null,
      "logo_url" : "https://www.arbetsformedlingen.se/rest/arbetsgivare/rest/af/v3/organisation/5568731425/logotyper/logo.png",
      "last_publication_date" : "2022-06-26T23:59:59",
      "number_of_vacancies" : 1,
      "occupation" : {
        "concept_id" : "wNG8_Rsg_RQc",
        "label" : "Systemansvarig",
        "legacy_ams_taxonomy_id" : "5996"
      },
      "occupation_group" : {
        "concept_id" : "cBBa_ngH_fCx",
        "label" : "Systemförvaltare m.fl.",
        "legacy_ams_taxonomy_id" : "2515"
      },
      "employment_type" : {
        "concept_id" : "PFZr_Syz_cUq",
        "label" : "Vanlig anställning",
        "legacy_ams_taxonomy_id" : "1"
      },
      "webpage_url" : "https://arbetsformedlingen.se/platsbanken/annonser/26239583",
      "driving_license_required" : false,
      "application_contacts" : [ {
        "description" : "Marcus Royson",
        "email" : "marcus.royson@empleo.se",
        "telephone" : null,
        "name" : null,
        "contact_type" : null
      } ],
      "duration" : {
        "concept_id" : "a7uU_j21_mkL",
        "label" : "Tills vidare",
        "legacy_ams_taxonomy_id" : "1"
      },
      "nice_to_have" : {
        "education_level" : [ ],
        "work_experiences" : [ ],
        "skills" : [ ],
        "education" : [ ],
        "languages" : [ ]
      },
      "application_details" : {
        "via_af" : false,
        "email" : null,
        "other" : null,
        "reference" : null,
        "url" : "https://apply.recman.no/job_post.php?id=279612&path=ams&sub_id=452",
        "information" : null
      },
      "source_type" : "VIA_PLATSBANKEN_DXA",
      "application_deadline" : "2022-06-26T23:59:59",
      "external_id" : "46-556873-1425-27961262b0c5889ccb7",
      "workplace_address" : {
        "coordinates" : [ 13.941042, 56.833878 ],
        "city" : null,
        "postcode" : null,
        "municipality" : "Ljungby",
        "region_concept_id" : "tF3y_MF9_h5G",
        "region" : "Kronobergs län",
        "country_code" : "199",
        "region_code" : "07",
        "municipality_concept_id" : "GzKo_S48_QCm",
        "country_concept_id" : "i46j_HmG_v64",
        "municipality_code" : "0781",
        "street_address" : null,
        "country" : "Sverige"
      },
      "id" : "26239583",
      "experience_required" : true,
      "working_hours_type" : {
        "concept_id" : "6YE1_gAC_R2G",
        "label" : "Heltid",
        "legacy_ams_taxonomy_id" : "1"
      },
      "access" : null,
      "timestamp" : 1655752079671,
      "must_have" : {
        "education_level" : [ ],
        "work_experiences" : [ {
          "concept_id" : "wNG8_Rsg_RQc",
          "weight" : 10,
          "label" : "Systemansvarig",
          "legacy_ams_taxonomy_id" : "5996"
        } ],
        "skills" : [ ],
        "education" : [ ],
        "languages" : [ ]
      },
      "occupation_field" : {
        "concept_id" : "apaJ_2ja_LuF",
        "label" : "Data/IT",
        "legacy_ams_taxonomy_id" : "3"
      },
      "scope_of_work" : {
        "min" : 100,
        "max" : 100
      },
      "salary_type" : {
        "concept_id" : "oG8G_9cW_nRf",
        "label" : "Fast månads- vecko- eller timlön",
        "legacy_ams_taxonomy_id" : "1"
      },
      "removed" : false,
      "salary_description" : null,
      "access_to_own_car" : false,
      "publication_date" : "2022-06-20T21:07:59"
    },
    "name" : "Development Manager till Lyreco i Växjö",
    "user" : "fisko"
  },
  "sha1" : "6b0a119aca9d15b15eeea89cd10f71c595838f5e",
  "annotations" : [ {
    "preferred-label" : "Development manager",
    "sentiment" : "MUST_HAVE",
    "type" : "keyword",
    "start-position" : 0,
    "end-position" : 19,
    "concept-id" : "EVHK_Mfa_DtC",
    "matched-string" : "development manager",
    "annotation-id" : 0
  }, {
    "preferred-label" : "Development manager",
    "sentiment" : "MUST_HAVE",
    "type" : "keyword",
    "start-position" : 113,
    "end-position" : 132,
    "concept-id" : "EVHK_Mfa_DtC",
    "matched-string" : "development manager",
    "annotation-id" : 1
  }, {
    "preferred-label" : "Eftergymnasial utbildning",
    "sentiment" : "MUST_HAVE",
    "type" : "sni-level-3",
    "start-position" : 1303,
    "end-position" : 1328,
    "concept-id" : "bg6r_KVf_KNN",
    "matched-string" : "eftergymnasial utbildning",
    "annotation-id" : 2
  }, {
    "preferred-label" : "Transporttjänster, allmän utbildning",
    "sentiment" : "MUST_HAVE",
    "type" : "sun-education-field-4",
    "start-position" : 1334,
    "end-position" : 1342,
    "concept-id" : "PQ3V_uzo_CfN",
    "matched-string" : "logistik",
    "annotation-id" : 3
  }, {
    "preferred-label" : "Annan utbildning i industriell ekonomi och organisation",
    "sentiment" : "MUST_HAVE",
    "type" : "sun-education-field-4",
    "start-position" : 1344,
    "end-position" : 1351,
    "concept-id" : "m3Go_x9t_6xP",
    "matched-string" : "ekonomi",
    "annotation-id" : 4
  }, {
    "preferred-label" : "Flödesekonomi/Supply chain management/SCM",
    "sentiment" : "MUST_HAVE",
    "type" : "skill",
    "start-position" : 1414,
    "end-position" : 1426,
    "concept-id" : "iVyx_aLa_ZWy",
    "matched-string" : "Supply Chain",
    "annotation-id" : 13
  }, {
    "preferred-label" : "Processutveckling",
    "sentiment" : "MUST_HAVE",
    "type" : "skill",
    "start-position" : 1431,
    "end-position" : 1466,
    "concept-id" : "TuP9_SAc_iMs",
    "matched-string" : "utveckling av rutiner och processer",
    "annotation-id" : 14
  }, {
    "preferred-label" : "Projektledning, erfarenhet",
    "sentiment" : "MUST_HAVE",
    "type" : "skill",
    "start-position" : 1506,
    "end-position" : 1520,
    "concept-id" : "3TSx_fJE_Z26",
    "matched-string" : "projektledning",
    "annotation-id" : 15
  }, {
    "preferred-label" : "Logistik",
    "sentiment" : "NICE_TO_HAVE",
    "type" : "skill",
    "start-position" : 1631,
    "end-position" : 1639,
    "concept-id" : "yXmf_iKi_7ci",
    "matched-string" : "logistik",
    "annotation-id" : 5
  }, {
    "preferred-label" : "Produktionsteknik",
    "sentiment" : "NICE_TO_HAVE",
    "type" : "skill",
    "start-position" : 1641,
    "end-position" : 1651,
    "concept-id" : "PuQP_aBK_nqJ",
    "matched-string" : "produktion",
    "annotation-id" : 16
  }, {
    "preferred-label" : "E-handel",
    "sentiment" : "NICE_TO_HAVE",
    "type" : "keyword",
    "start-position" : 1662,
    "comment" : "finns bara som keyword",
    "end-position" : 1670,
    "concept-id" : "yxpW_N32_YMK",
    "matched-string" : "e-handel",
    "annotation-id" : 6
  }, {
    "preferred-label" : "Svenska",
    "sentiment" : "MUST_HAVE",
    "type" : "language",
    "start-position" : 2529,
    "end-position" : 2536,
    "concept-id" : "zSLA_vw2_FXN",
    "matched-string" : "svenska",
    "annotation-id" : 11
  }, {
    "preferred-label" : "Engelska",
    "sentiment" : "MUST_HAVE",
    "type" : "language",
    "start-position" : 2541,
    "end-position" : 2549,
    "concept-id" : "NVxJ_hLg_TYS",
    "matched-string" : "engelska",
    "annotation-id" : 12
  }, {
    "preferred-label" : "B",
    "sentiment" : "MUST_HAVE",
    "type" : "driving-licence",
    "start-position" : 2551,
    "end-position" : 2560,
    "concept-id" : "VTK8_WRx_GcM",
    "matched-string" : "B-körkort",
    "annotation-id" : 17
  } ],
  "text" : "Development Manager till Lyreco i Växjö\nTill vårt trevliga kundföretag Staples/Lyreco i Växjö söker vi en driven Development Manager!\n\nVi söker dig som vill vara med och bidra till Lyrecos fortsatta framgångar genom att utforma kundspecifika processer och implementera förändringar i Supply Chain-nätverket som förbättrar servicen och optimerar flödet i verksamheten.\n\nVidare arbetar du med att leda medarbetare, sätta den övergripande riktningen för verksamheten och säkerställa att mål uppnås och att rätt prioriteringar görs. Du är en del av att utveckla leveranskedjan främst genom ett kontinuerligt och strategiskt förändringsarbete.\n\nDin vardag är intressant och spännande med ansvar för bland annat:\n  Att utveckla och implementera samarbetsprojekt, strategiska förändringsprojekt i supply chain.\n Att bygga affärscase för att säkra och motivera kapitalinvesteringar samt uppföljning av genomförda projekt.\n Att definiera framgång i termer av målprestanda för operativa lösningar som avgör när den operativa lösningen ska överlämnas.\n\nRollen är helt ny och kommer över tid att utvecklas, detta i takt med att verksamheten växer och nya spännande projekt ligger i den långsiktiga planen!\n\nVarmt välkommen till ett spännande och framåtriktat företag!\n\nDin profil\nDu som antar denna utmaning har en eftergymnasial utbildning inom logistik, ekonomi eller motsvarande samt minst fem års praktisk erfarenhet inom Supply Chain och utveckling av rutiner och processer.\n\nVidare har du flerårig erfarenhet av projektledning med tillhörande metodik samt drivs av ett engagerat och karismatiskt ledarskap. Har du branscherfarenhet inom logistik, produktion och/eller e-handel, är det klart meriterande. \n\nSom person har du en genuin passion för digitala processer, verktyg och metoder. Du har ett inneboende driv och förmågan att ta fram och utveckla moderna tekniska lösningar, självklart i samråd med företagets IT-avdelning och specialister.\n\nDu har ett öppet och modernt sätt och är ständigt nyfiken på trender och innovationer inom branschen, allt för att ligga i framkant och vara en effektiv och smart logistikverksamhet. Självklart har du även intresse för IT-lösningar och den senaste tekniken inom system och mjukvara. \n\nKunden sätter du alltid i främsta rummet och med starkt förändringstänk, öppenhet och ett agilt förhållningssätt, når vi långsiktigt uppsatta mål och resultat för hela vår verksamhet. Vi är redo för att ta emot vår nya kollega, kanske är det just dig vi söker?\n\nSjälvklart talar och skriver du flytande svenska och engelska, B-körkort är ett önskemål.\n\nTjänsten är en tillsvidareanställning med direktanställning hos Staples/Lyreco i Växjö!  \n\nVi rekryterar löpande och tjänsten kan komma att tillsättas innan ansökningstiden har gått ut.\nDu är varmt välkommen med din ansökan redan idag!\nDu ansöker direkt på empleo.se\n\nUppstart: Enligt överenskommelse.\nOrt/Placering: Växjö.\nOmfattning: Heltid.\nLön: Individuell lönesättning tillämpas."
}