{
  "meta" : {
    "dataset-id" : "myh-spreadsheet-2021",
    "type" : "education-description",
    "dataset-document-id" : "YH01041",
    "user" : "kristof.fischer"
  },
  "sha1" : "4a727dd1ca10e148eb9ff95b039b16b9261cccec",
  "annotations" : [ {
    "preferred-label" : "Tandsköterska",
    "sentiment" : "OFFERED",
    "type" : "occupation-name",
    "start-position" : 15,
    "end-position" : 28,
    "concept-id" : "ckkD_JhH_Sc6",
    "matched-string" : "tandsköterska",
    "annotation-id" : 0
  }, {
    "preferred-label" : "Tandsköterska",
    "sentiment" : "OFFERED",
    "type" : "occupation-name",
    "start-position" : 81,
    "end-position" : 95,
    "concept-id" : "ckkD_JhH_Sc6",
    "matched-string" : "Tandsköterskan",
    "annotation-id" : 11
  }, {
    "preferred-label" : "Tandläkare",
    "sentiment" : "NOT_RELEVANT",
    "type" : "occupation-name",
    "start-position" : 121,
    "end-position" : 131,
    "concept-id" : "TdvW_S8R_CFH",
    "matched-string" : "tandläkare",
    "annotation-id" : 1
  }, {
    "preferred-label" : "Tandhygienist",
    "sentiment" : "NOT_RELEVANT",
    "type" : "occupation-name",
    "start-position" : 136,
    "end-position" : 151,
    "concept-id" : "TPRY_Wze_q6x",
    "matched-string" : "tandhygienister",
    "annotation-id" : 2
  }, {
    "preferred-label" : "Munhälsovård",
    "sentiment" : "OFFERED",
    "type" : "skill",
    "start-position" : 200,
    "end-position" : 232,
    "concept-id" : "Msbw_VmW_pGi",
    "matched-string" : "utföra munhälsovårdande insatser",
    "annotation-id" : 12
  }, {
    "preferred-label" : "Heltid",
    "sentiment" : "OFFERED",
    "type" : "worktime-extent",
    "start-position" : 404,
    "end-position" : 410,
    "concept-id" : "6YE1_gAC_R2G",
    "matched-string" : "heltid",
    "annotation-id" : 13
  }, {
    "preferred-label" : "Annan utbildning i ledning och administration",
    "sentiment" : "OFFERED",
    "type" : "sun-education-field-4",
    "start-position" : 528,
    "end-position" : 559,
    "concept-id" : "CGF1_o4T_wCo",
    "matched-string" : "Administration och organisation",
    "annotation-id" : 14
  }, {
    "preferred-label" : null,
    "sentiment" : "OFFERED",
    "type" : "sun-education-field-4",
    "start-position" : 561,
    "end-position" : 568,
    "concept-id" : null,
    "matched-string" : "Anatomi",
    "annotation-id" : 15
  }, {
    "preferred-label" : null,
    "sentiment" : "OFFERED",
    "type" : "sun-education-field-4",
    "start-position" : 571,
    "end-position" : 579,
    "concept-id" : null,
    "matched-string" : "anestesi",
    "annotation-id" : 16
  }, {
    "preferred-label" : "Biokemi, toxikologi, farmakologi och nutrition",
    "sentiment" : "OFFERED",
    "type" : "sun-education-field-4",
    "start-position" : 582,
    "end-position" : 593,
    "concept-id" : "zFUS_WCq_uHh",
    "matched-string" : "farmakologi",
    "annotation-id" : 4
  }, {
    "preferred-label" : null,
    "sentiment" : "OFFERED",
    "type" : "sun-education-field-4",
    "start-position" : 595,
    "end-position" : 613,
    "concept-id" : null,
    "matched-string" : "Material och miljö",
    "annotation-id" : 17
  }, {
    "preferred-label" : "Tandvård",
    "sentiment" : "OFFERED",
    "type" : "sun-education-field-3",
    "start-position" : 615,
    "end-position" : 646,
    "concept-id" : "LXNM_AzU_2G5",
    "matched-string" : "Munhålans och tändernas anatomi",
    "annotation-id" : 18
  }, {
    "preferred-label" : "Tandvård",
    "sentiment" : "OFFERED",
    "type" : "sun-education-field-3",
    "start-position" : 648,
    "end-position" : 658,
    "concept-id" : "LXNM_AzU_2G5",
    "matched-string" : "odontologi",
    "annotation-id" : 5
  }, {
    "preferred-label" : "Tandvård",
    "sentiment" : "OFFERED",
    "type" : "sun-education-field-3",
    "start-position" : 664,
    "end-position" : 674,
    "concept-id" : "LXNM_AzU_2G5",
    "matched-string" : "Oral hälsa",
    "annotation-id" : 19
  }, {
    "preferred-label" : "Tandvård",
    "sentiment" : "OFFERED",
    "type" : "sun-education-field-3",
    "start-position" : 680,
    "end-position" : 692,
    "concept-id" : "LXNM_AzU_2G5",
    "matched-string" : "Teamtandvård",
    "annotation-id" : 20
  }, {
    "preferred-label" : null,
    "sentiment" : "OFFERED",
    "type" : "sun-education-field-4",
    "start-position" : 694,
    "end-position" : 717,
    "concept-id" : null,
    "matched-string" : "Vårdhygien - smittskydd",
    "annotation-id" : 21
  }, {
    "preferred-label" : null,
    "sentiment" : "OFFERED",
    "type" : "sun-education-field-4",
    "start-position" : 719,
    "end-position" : 732,
    "concept-id" : null,
    "matched-string" : "Examensarbete",
    "annotation-id" : 22
  }, {
    "preferred-label" : null,
    "sentiment" : "OFFERED",
    "type" : "sun-education-field-4",
    "start-position" : 749,
    "comment" : "praktik",
    "end-position" : 752,
    "concept-id" : null,
    "matched-string" : "LIA",
    "annotation-id" : 23
  }, {
    "preferred-label" : "Tandsköterska",
    "sentiment" : "OFFERED",
    "type" : "occupation-name",
    "start-position" : 1054,
    "end-position" : 1068,
    "concept-id" : "ckkD_JhH_Sc6",
    "matched-string" : "tandsköterskor",
    "annotation-id" : 8
  }, {
    "preferred-label" : "Västra Götalands län",
    "sentiment" : "NOT_RELEVANT",
    "type" : "region",
    "start-position" : 1126,
    "end-position" : 1150,
    "concept-id" : "zdoY_6u5_Krt",
    "matched-string" : "Västra Götalandsregionen",
    "annotation-id" : 24
  }, {
    "preferred-label" : "Tandsköterska",
    "sentiment" : "OFFERED",
    "type" : "occupation-name",
    "start-position" : 1225,
    "end-position" : 1239,
    "concept-id" : "ckkD_JhH_Sc6",
    "matched-string" : "tandsköterskor",
    "annotation-id" : 10
  } ],
  "text" : "Att arbeta som tandsköterska är ett omväxlande arbete med mycket patientkontakt. Tandsköterskan ingår i ett vårdteam med tandläkare och tandhygienister, men ska även självständigt kunna informera och utföra munhälsovårdande insatser på patienter i olika åldrar. Ett yrke för den som tycker om att arbeta med människor.    Utbildningen är drygt tre terminer lång (325 YH-poäng) och läses i bunden form på heltid vilket innebär att den studerande har skolförlagd tid upp till 5 dagar i veckan. Kurser som ingår i utbildningen är: Administration och organisation, Anatomi - anestesi - farmakologi, Material och miljö, Munhålans och tändernas anatomi, Odontologi 1+2, Oral hälsa 1+2, Teamtandvård, Vårdhygien - smittskydd, Examensarbete samt 16 veckors LIA (Lärande i Arbete). I utbildningens teoretiska kurser ingår också praktiska övningar i egna metodrum (sk KTC Kliniskt träningscenter) samt att LIA genomförs på tandvårdskliniker i regionen vilket ger den studerande goda förutsättningar och många möjligheter till praktisk övning under studietiden.    Tandsköterskor är idag en yrkesgrupp där behovet av utbildad personal i Västra Götalandsregionen är betydligt större än dem som finns att anställa. Framtidsutsikterna för tandsköterskor ser därför väldigt goda ut.  "
}