{
  "meta" : {
    "jobad" : {
      "description" : {
        "requirements" : null,
        "needs" : null,
        "company_information" : null,
        "text_formatted" : "<p><strong>Känner du att du är redo för nästa steg i karriären? Vi söker en kille eller tjej som vill jobba som lagermedarbetare hos vår kund i Södertälje</strong></p><p>Vi söker efter dig som är på jakt efter ny arbetslivserfarenhet. Du kanske tidigare aldrig har jobbat på lager eller i dagsläget jobbar på ett lager du inte känner att du når din fulla potential på.</p><p>Som lagermedarbetare arbetar du självständigt med att plocka och packa på lagret. Arbetet innebär att packa varor utifrån en plocklista samt att arbeta nära med ut- och inleverans. Varje lagermedarbetare arbetar utifrån sin egna plocklista, där plockningen sker utifrån en given tidsram. Det är ett varierande och spännande jobb där man har chansen att utvecklas utifrån sin vilja och kompetens. </p><p> </p><p><strong>Arbetsuppgifter:</strong></p><ul><li>Ansvara för inleveranser av gods och material</li><li>Scanna in produkter i affärssystem</li><li>Samordna produkter utifrån en plocklista</li><li>Lastning av kurirbilar</li></ul><p><strong>Om dig: </strong></p><p>Arbetsuppgifterna i den här rollen passar dig som är stresstålig, punktlig och ansvarsfull. Du uppskattar ett högt tempo och har goda kunskaper inom logistik och lagerhantering, vilka du erhållit antingen från studier eller arbetslivet. Om du har erfarenhet av liknande arbete och har erfarenhet av orderhantering är det meriterande</p><p><strong>Meriterande:</strong></p><ul><li> Körkort </li><li> Lagererfarenhet </li><li> Truckkort A+B</li></ul><p><strong>Lagret är beläget i Järna, Södertälje.</strong></p><p><strong>Arbetet är förlagt mån-fre 07-16.</strong></p><p><strong>Om oss:</strong></p><p>Simplex Bemanning grundades år 2014 och är verksam i branscher som lager, transport och service.</p><p>Vi är ett ständigt utvecklande lag som strävar efter att ta nästa steg. Med ett stort fokus på att utbilda framtidens anställda jobbar vi väldigt mycket med ungdomar. Dessa får lära sig att ta del av det ansvar som tillkommer när du jobbar hos Simplex.</p><p>Unga människor med drivkraften att lära sig saker och anta nya utmaningar ger oss ett försprång gentemot andra inom vår bransch. Vi vet att nyfikenhet och motivation är nycklarna för att utföra varje projekt med kvalitet. Vår personal ser varje dag som ett nytt tillfälle att samla på sig nya erfarenheter samtidigt som de applicerar sin breda kunskap för att utföra sina uppgifter på bästa sätt.</p>",
        "conditions" : null,
        "text" : "Känner du att du är redo för nästa steg i karriären? Vi söker en kille eller tjej som vill jobba som lagermedarbetare hos vår kund i Södertälje\nVi söker efter dig som är på jakt efter ny arbetslivserfarenhet. Du kanske tidigare aldrig har jobbat på lager eller i dagsläget jobbar på ett lager du inte känner att du når din fulla potential på.\nSom lagermedarbetare arbetar du självständigt med att plocka och packa på lagret. Arbetet innebär att packa varor utifrån en plocklista samt att arbeta nära med ut- och inleverans. Varje lagermedarbetare arbetar utifrån sin egna plocklista, där plockningen sker utifrån en given tidsram. Det är ett varierande och spännande jobb där man har chansen att utvecklas utifrån sin vilja och kompetens. \n \nArbetsuppgifter:\nAnsvara för inleveranser av gods och material\nScanna in produkter i affärssystem\nSamordna produkter utifrån en plocklista\nLastning av kurirbilar\n\nOm dig: \nArbetsuppgifterna i den här rollen passar dig som är stresstålig, punktlig och ansvarsfull. Du uppskattar ett högt tempo och har goda kunskaper inom logistik och lagerhantering, vilka du erhållit antingen från studier eller arbetslivet. Om du har erfarenhet av liknande arbete och har erfarenhet av orderhantering är det meriterande\nMeriterande:\n Körkort \n Lagererfarenhet \n Truckkort A+B\n\nLagret är beläget i Järna, Södertälje.\nArbetet är förlagt mån-fre 07-16.\nOm oss:\nSimplex Bemanning grundades år 2014 och är verksam i branscher som lager, transport och service.\nVi är ett ständigt utvecklande lag som strävar efter att ta nästa steg. Med ett stort fokus på att utbilda framtidens anställda jobbar vi väldigt mycket med ungdomar. Dessa får lära sig att ta del av det ansvar som tillkommer när du jobbar hos Simplex.\nUnga människor med drivkraften att lära sig saker och anta nya utmaningar ger oss ett försprång gentemot andra inom vår bransch. Vi vet att nyfikenhet och motivation är nycklarna för att utföra varje projekt med kvalitet. Vår personal ser varje dag som ett nytt tillfälle att samla på sig nya erfarenheter samtidigt som de applicerar sin breda kunskap för att utföra sina uppgifter på bästa sätt."
      },
      "headline" : "Orderplockare - Järna, Södertälje - Heltid",
      "driving_license" : null,
      "employer" : {
        "email" : null,
        "phone_number" : null,
        "organization_number" : "5590010277",
        "name" : "Simplex Bemanning AB",
        "url" : "http://www.simplexbemanning.se",
        "workplace" : "Södertälje "
      },
      "removed_date" : null,
      "logo_url" : "https://www.arbetsformedlingen.se/rest/arbetsgivare/rest/af/v3/arbetsplatser/88111596/logotyper/logo.png",
      "last_publication_date" : "2022-09-02T23:59:59",
      "number_of_vacancies" : 1,
      "occupation" : {
        "concept_id" : "sizv_uPq_nWf",
        "label" : "Lagerarbetare",
        "legacy_ams_taxonomy_id" : "5842"
      },
      "occupation_group" : {
        "concept_id" : "kLyY_rwr_aJr",
        "label" : "Lager- och terminalpersonal",
        "legacy_ams_taxonomy_id" : "4322"
      },
      "employment_type" : {
        "concept_id" : "PFZr_Syz_cUq",
        "label" : "Vanlig anställning",
        "legacy_ams_taxonomy_id" : "1"
      },
      "webpage_url" : "https://arbetsformedlingen.se/platsbanken/annonser/26375951",
      "driving_license_required" : false,
      "application_contacts" : [ ],
      "duration" : {
        "concept_id" : "a7uU_j21_mkL",
        "label" : "Tills vidare",
        "legacy_ams_taxonomy_id" : "1"
      },
      "nice_to_have" : {
        "education_level" : [ ],
        "work_experiences" : [ ],
        "skills" : [ ],
        "education" : [ ],
        "languages" : [ ]
      },
      "application_details" : {
        "via_af" : false,
        "email" : null,
        "other" : null,
        "reference" : null,
        "url" : "https://simplexbemanning.teamtailor.com/jobs/1807381-orderplockare-jarna-sodertalje-heltid",
        "information" : null
      },
      "source_type" : "VIA_ANNONSERA",
      "application_deadline" : "2022-09-02T23:59:59",
      "external_id" : null,
      "workplace_address" : {
        "coordinates" : [ 17.63395315328703, 59.18205319110151 ],
        "city" : "Södertälje",
        "postcode" : "15132",
        "municipality" : "Södertälje",
        "region_concept_id" : "CifL_Rzy_Mku",
        "region" : "Stockholms län",
        "country_code" : "199",
        "region_code" : "01",
        "municipality_concept_id" : "g6hK_M1o_hiU",
        "country_concept_id" : "i46j_HmG_v64",
        "municipality_code" : "0181",
        "street_address" : null,
        "country" : "Sverige"
      },
      "id" : "26375951",
      "experience_required" : false,
      "working_hours_type" : {
        "concept_id" : "6YE1_gAC_R2G",
        "label" : "Heltid",
        "legacy_ams_taxonomy_id" : "1"
      },
      "access" : null,
      "timestamp" : 1659539360282,
      "must_have" : {
        "education_level" : [ ],
        "work_experiences" : [ ],
        "skills" : [ ],
        "education" : [ ],
        "languages" : [ ]
      },
      "occupation_field" : {
        "concept_id" : "ASGV_zcE_bWf",
        "label" : "Transport, distribution, lager",
        "legacy_ams_taxonomy_id" : "19"
      },
      "scope_of_work" : {
        "min" : 0,
        "max" : 100
      },
      "salary_type" : {
        "concept_id" : "oG8G_9cW_nRf",
        "label" : "Fast månads- vecko- eller timlön",
        "legacy_ams_taxonomy_id" : "1"
      },
      "removed" : false,
      "salary_description" : null,
      "access_to_own_car" : false,
      "publication_date" : "2022-08-03T17:09:20"
    },
    "name" : "Orderplockare - Järna, Södertälje - Heltid",
    "user" : "kristof.fischer"
  },
  "sha1" : "2722fc9056840fcea766fbd68fd3d50973695c34",
  "annotations" : [ {
    "preferred-label" : "orderplockare",
    "type" : "esco-occupation",
    "start-position" : 0,
    "end-position" : 13,
    "concept-id" : "yM9T_B1t_2pY",
    "matched-string" : "Orderplockare",
    "annotation-id" : 13
  }, {
    "preferred-label" : "Södertälje",
    "type" : "municipality",
    "start-position" : 23,
    "end-position" : 33,
    "concept-id" : "g6hK_M1o_hiU",
    "matched-string" : "Södertälje",
    "annotation-id" : 15
  }, {
    "preferred-label" : "Heltid",
    "type" : "worktime-extent",
    "start-position" : 36,
    "end-position" : 42,
    "concept-id" : "6YE1_gAC_R2G",
    "matched-string" : "Heltid",
    "annotation-id" : 14
  }, {
    "preferred-label" : "Lagerarbetare",
    "sentiment" : "MUST_HAVE",
    "type" : "occupation-name",
    "start-position" : 144,
    "end-position" : 160,
    "concept-id" : "sizv_uPq_nWf",
    "matched-string" : "lagermedarbetare",
    "annotation-id" : 0
  }, {
    "preferred-label" : "Södertälje",
    "type" : "municipality",
    "start-position" : 176,
    "end-position" : 186,
    "concept-id" : "g6hK_M1o_hiU",
    "matched-string" : "Södertälje",
    "annotation-id" : 12
  }, {
    "preferred-label" : "Lagermedarbetare",
    "sentiment" : "MUST_HAVE",
    "type" : "keyword",
    "start-position" : 390,
    "end-position" : 406,
    "concept-id" : "sSu6_qMg_nYu",
    "matched-string" : "lagermedarbetare",
    "annotation-id" : 3
  }, {
    "preferred-label" : "arbeta självständigt",
    "sentiment" : "MUST_HAVE",
    "type" : "esco-skill",
    "start-position" : 407,
    "end-position" : 431,
    "concept-id" : "NyFu_HHd_zhz",
    "matched-string" : "arbetar du självständigt",
    "annotation-id" : 9
  }, {
    "preferred-label" : "plocka order för leverans",
    "sentiment" : "MUST_HAVE",
    "type" : "esco-skill",
    "start-position" : 440,
    "end-position" : 446,
    "concept-id" : "ZUh3_Nof_FF9",
    "matched-string" : "plocka",
    "annotation-id" : 10
  }, {
    "preferred-label" : "packa varor",
    "sentiment" : "MUST_HAVE",
    "type" : "esco-skill",
    "start-position" : 451,
    "end-position" : 456,
    "concept-id" : "5YMq_iHL_wB1",
    "matched-string" : "packa",
    "annotation-id" : 11
  }, {
    "preferred-label" : "Lagerarbetare",
    "sentiment" : "MUST_HAVE",
    "type" : "occupation-name",
    "start-position" : 573,
    "end-position" : 589,
    "concept-id" : "sizv_uPq_nWf",
    "matched-string" : "lagermedarbetare",
    "annotation-id" : 4
  }, {
    "preferred-label" : "hantera stressande situationer",
    "sentiment" : "MUST_HAVE",
    "type" : "esco-skill",
    "start-position" : 1010,
    "end-position" : 1021,
    "concept-id" : "qhLq_ZdJ_rqJ",
    "matched-string" : "stresstålig",
    "annotation-id" : 16
  }, {
    "preferred-label" : "visa ansvarstagande",
    "sentiment" : "MUST_HAVE",
    "type" : "esco-skill",
    "start-position" : 1036,
    "end-position" : 1047,
    "concept-id" : "bcRp_hxV_f5G",
    "matched-string" : "ansvarsfull",
    "annotation-id" : 17
  }, {
    "preferred-label" : "Logistik",
    "sentiment" : "MUST_HAVE",
    "type" : "skill",
    "start-position" : 1106,
    "end-position" : 1114,
    "concept-id" : "yXmf_iKi_7ci",
    "matched-string" : "logistik",
    "annotation-id" : 18
  }, {
    "preferred-label" : "Terminal- och lagerarbete",
    "sentiment" : "MUST_HAVE",
    "type" : "skill",
    "start-position" : 1119,
    "end-position" : 1133,
    "concept-id" : "ijHY_aHk_ADE",
    "matched-string" : "lagerhantering",
    "annotation-id" : 19
  }, {
    "preferred-label" : "hantera orderstock",
    "sentiment" : "NICE_TO_HAVE",
    "type" : "esco-skill",
    "start-position" : 1256,
    "end-position" : 1270,
    "concept-id" : "aB8m_LiV_GS5",
    "matched-string" : "orderhantering",
    "annotation-id" : 20
  }, {
    "preferred-label" : "B",
    "sentiment" : "MUST_HAVE",
    "type" : "driving-licence",
    "start-position" : 1304,
    "end-position" : 1311,
    "concept-id" : "VTK8_WRx_GcM",
    "matched-string" : "Körkort",
    "annotation-id" : 21
  }, {
    "preferred-label" : "Terminal- och lagerarbete",
    "sentiment" : "MUST_HAVE",
    "type" : "skill",
    "start-position" : 1314,
    "end-position" : 1329,
    "concept-id" : "ijHY_aHk_ADE",
    "matched-string" : "Lagererfarenhet",
    "annotation-id" : 22
  }, {
    "preferred-label" : "A-truckar",
    "sentiment" : "MUST_HAVE",
    "type" : "skill",
    "start-position" : 1332,
    "end-position" : 1343,
    "concept-id" : "Zk4h_jP4_e85",
    "matched-string" : "Truckkort A",
    "annotation-id" : 23
  }, {
    "preferred-label" : "B-truckar",
    "sentiment" : "MUST_HAVE",
    "type" : "skill",
    "start-position" : 1344,
    "end-position" : 1345,
    "concept-id" : "HeXq_amc_ABd",
    "matched-string" : "B",
    "annotation-id" : 24
  } ],
  "text" : "Orderplockare - Järna, Södertälje - Heltid\nKänner du att du är redo för nästa steg i karriären? Vi söker en kille eller tjej som vill jobba som lagermedarbetare hos vår kund i Södertälje\nVi söker efter dig som är på jakt efter ny arbetslivserfarenhet. Du kanske tidigare aldrig har jobbat på lager eller i dagsläget jobbar på ett lager du inte känner att du når din fulla potential på.\nSom lagermedarbetare arbetar du självständigt med att plocka och packa på lagret. Arbetet innebär att packa varor utifrån en plocklista samt att arbeta nära med ut- och inleverans. Varje lagermedarbetare arbetar utifrån sin egna plocklista, där plockningen sker utifrån en given tidsram. Det är ett varierande och spännande jobb där man har chansen att utvecklas utifrån sin vilja och kompetens. \n \nArbetsuppgifter:\nAnsvara för inleveranser av gods och material\nScanna in produkter i affärssystem\nSamordna produkter utifrån en plocklista\nLastning av kurirbilar\n\nOm dig: \nArbetsuppgifterna i den här rollen passar dig som är stresstålig, punktlig och ansvarsfull. Du uppskattar ett högt tempo och har goda kunskaper inom logistik och lagerhantering, vilka du erhållit antingen från studier eller arbetslivet. Om du har erfarenhet av liknande arbete och har erfarenhet av orderhantering är det meriterande\nMeriterande:\n Körkort \n Lagererfarenhet \n Truckkort A+B\n\nLagret är beläget i Järna, Södertälje.\nArbetet är förlagt mån-fre 07-16.\nOm oss:\nSimplex Bemanning grundades år 2014 och är verksam i branscher som lager, transport och service.\nVi är ett ständigt utvecklande lag som strävar efter att ta nästa steg. Med ett stort fokus på att utbilda framtidens anställda jobbar vi väldigt mycket med ungdomar. Dessa får lära sig att ta del av det ansvar som tillkommer när du jobbar hos Simplex.\nUnga människor med drivkraften att lära sig saker och anta nya utmaningar ger oss ett försprång gentemot andra inom vår bransch. Vi vet att nyfikenhet och motivation är nycklarna för att utföra varje projekt med kvalitet. Vår personal ser varje dag som ett nytt tillfälle att samla på sig nya erfarenheter samtidigt som de applicerar sin breda kunskap för att utföra sina uppgifter på bästa sätt."
}