{
  "meta" : {
    "jobad" : {
      "description" : {
        "requirements" : null,
        "needs" : null,
        "company_information" : null,
        "text_formatted" : "<p>Diskare sökes till Konya Grill Restaurang.  </p><p>Vi söker dig som är duktig och snabb och har erfarenhet som Diskare tidigare inom restaurangbranschen. </p>",
        "conditions" : null,
        "text" : "Diskare sökes till Konya Grill Restaurang.  \nVi söker dig som är duktig och snabb och har erfarenhet som Diskare tidigare inom restaurangbranschen."
      },
      "headline" : "DISKARE ",
      "driving_license" : null,
      "employer" : {
        "email" : null,
        "phone_number" : null,
        "organization_number" : "5592057847",
        "name" : "KONYA GRILL AB",
        "url" : null,
        "workplace" : "KONYA GRILL AB"
      },
      "removed_date" : null,
      "logo_url" : null,
      "last_publication_date" : "2022-08-23T00:00:00",
      "number_of_vacancies" : 1,
      "occupation" : {
        "concept_id" : "pKTY_Kwu_sUw",
        "label" : "Diskare",
        "legacy_ams_taxonomy_id" : "5556"
      },
      "occupation_group" : {
        "concept_id" : "tPox_ie4_X9X",
        "label" : "Restaurang- och köksbiträden m.fl.",
        "legacy_ams_taxonomy_id" : "9412"
      },
      "employment_type" : {
        "concept_id" : "PFZr_Syz_cUq",
        "label" : "Vanlig anställning",
        "legacy_ams_taxonomy_id" : "1"
      },
      "webpage_url" : "https://arbetsformedlingen.se/platsbanken/annonser/26349458",
      "driving_license_required" : false,
      "application_contacts" : [ ],
      "duration" : {
        "concept_id" : "a7uU_j21_mkL",
        "label" : "Tills vidare",
        "legacy_ams_taxonomy_id" : "1"
      },
      "nice_to_have" : {
        "education_level" : [ ],
        "work_experiences" : [ ],
        "skills" : [ ],
        "education" : [ ],
        "languages" : [ ]
      },
      "application_details" : {
        "via_af" : false,
        "email" : "nur.tavukcu@gmail.com",
        "other" : null,
        "reference" : null,
        "url" : null,
        "information" : null
      },
      "source_type" : "VIA_ANNONSERA",
      "application_deadline" : "2022-08-23T00:00:00",
      "external_id" : null,
      "workplace_address" : {
        "coordinates" : [ 13.015044371407187, 55.57658632189454 ],
        "city" : "Malmö",
        "postcode" : "21455",
        "municipality" : "Malmö",
        "region_concept_id" : "CaRE_1nn_cSU",
        "region" : "Skåne län",
        "country_code" : "199",
        "region_code" : "12",
        "municipality_concept_id" : "oYPt_yRA_Smm",
        "country_concept_id" : "i46j_HmG_v64",
        "municipality_code" : "1280",
        "street_address" : "Eriksfältsgatan 30",
        "country" : "Sverige"
      },
      "id" : "26349458",
      "experience_required" : true,
      "working_hours_type" : {
        "concept_id" : "6YE1_gAC_R2G",
        "label" : "Heltid",
        "legacy_ams_taxonomy_id" : "1"
      },
      "access" : null,
      "timestamp" : 1658694125269,
      "must_have" : {
        "education_level" : [ ],
        "work_experiences" : [ {
          "concept_id" : "pKTY_Kwu_sUw",
          "weight" : 10,
          "label" : "Diskare",
          "legacy_ams_taxonomy_id" : "5556"
        } ],
        "skills" : [ ],
        "education" : [ ],
        "languages" : [ ]
      },
      "occupation_field" : {
        "concept_id" : "ScKy_FHB_7wT",
        "label" : "Hotell, restaurang, storhushåll",
        "legacy_ams_taxonomy_id" : "7"
      },
      "scope_of_work" : {
        "min" : 0,
        "max" : 100
      },
      "salary_type" : {
        "concept_id" : "oG8G_9cW_nRf",
        "label" : "Fast månads- vecko- eller timlön",
        "legacy_ams_taxonomy_id" : "1"
      },
      "removed" : false,
      "salary_description" : null,
      "access_to_own_car" : false,
      "publication_date" : "2022-07-24T22:22:05"
    },
    "name" : "DISKARE ",
    "user" : "hannes"
  },
  "sha1" : "9f4c723e91d7e83c961ffacee6590a11313b0d72",
  "annotations" : [ {
    "preferred-label" : "Diskare",
    "sentiment" : "MUST_HAVE",
    "type" : "occupation-name",
    "start-position" : 0,
    "end-position" : 7,
    "concept-id" : "pKTY_Kwu_sUw",
    "matched-string" : "diskare",
    "annotation-id" : 0
  }, {
    "preferred-label" : "Diskare",
    "sentiment" : "MUST_HAVE",
    "type" : "occupation-name",
    "start-position" : 9,
    "end-position" : 16,
    "concept-id" : "pKTY_Kwu_sUw",
    "matched-string" : "diskare",
    "annotation-id" : 1
  }, {
    "preferred-label" : "Restaurang",
    "sentiment" : "MUST_HAVE",
    "type" : "keyword",
    "start-position" : 40,
    "end-position" : 50,
    "concept-id" : "o2Cg_3Ap_qvK",
    "matched-string" : "restaurang",
    "annotation-id" : 2
  }, {
    "preferred-label" : "Diskare",
    "sentiment" : "MUST_HAVE",
    "type" : "occupation-name",
    "start-position" : 114,
    "end-position" : 121,
    "concept-id" : "pKTY_Kwu_sUw",
    "matched-string" : "diskare",
    "annotation-id" : 3
  }, {
    "preferred-label" : "Restaurangverksamhet",
    "type" : "sni-level-5",
    "start-position" : 136,
    "end-position" : 155,
    "concept-id" : "CK7M_gYV_9ea",
    "matched-string" : "restaurangbranschen",
    "annotation-id" : 4
  } ],
  "text" : "DISKARE \nDiskare sökes till Konya Grill Restaurang.  \nVi söker dig som är duktig och snabb och har erfarenhet som Diskare tidigare inom restaurangbranschen."
}