{
  "meta" : {
    "jobad" : {
      "description" : {
        "requirements" : null,
        "needs" : null,
        "company_information" : null,
        "text_formatted" : "Välkommen till en värderingsstyrd organisation\n\nI Attendo äldreomsorg är vi över 9000 medarbetare som arbetar inom hemtjänst och äldreboende i Skandinavien, vi är en del av Attendo, Nordens ledande privata vård och omsorgsföretag. Hos oss kommer du att arbeta med vår vision: Att stärka individen och alltid utgå från den enskildes behov och förutsättningar.\n\nAttendo hemtjänst på Kungsholmen söker engagerade och positiva medarbetare!\nVi kan erbjuda dig både dag- och kvällsschema. Vi söker tillsvidareanställda och timanställda.\n\nBeskrivning av tjänsten\n\nStor vikt läggs vid bemötande, kommunikation, kontaktmanskap och dokumentation i journalsystem.\n\n- Goda kunskaper i svenska språket (tal och skrift)\n- God datorkunskap/datorvana\n- Kan cykla\n- Körkort B\n- Meriterande om du har undersköterske- eller vårdbiträdesutbildning\n- Meriterande om du tidigare arbetat inom äldreomsorgen och hemtjänst\n\nDu trivs med att ge god service, skapa fina relationer och vill bidra till höjd livskvalité hos våra kunder. Du är en självständig, ödmjuk och ansvarsfull person som brinner för vård av äldre och kan se individens behov.\n\nStämmer beskrivningen in på dig? Sök redan idag!\n\nOm Attendo\n\nAttendo är ett av Sveriges ledande vård- och omsorgsföretag med 24 000 medarbetare. Mångfald värderas högt, vårt arbete ska stärka individen och vi arbetar för att ge utmärkt service både till våra kunder och kollegor. Attendo verkar i en platt organisation och är en trygg arbetsgivare, med kollektivavtal, avtalsförsäkringar och det finns stora möjligheter att göra karriär.\n\nVi går igenom ansökningarna löpande.\n\nFöre erbjudande om anställning ska utdrag ur polisens belastningsregister uppvisas tillsammans med giltig fotolegitimation.\n\nVi har även krav på vaccination mot covid-19 och kommer att kontrollera vaccinationsbevis innan anställning.\n\nLåt oss tillsammans utveckla framtidens viktigaste bransch!",
        "conditions" : "Deltid\r\nAnställningstid enligt överenskommelse",
        "text" : "Välkommen till en värderingsstyrd organisation\n\nI Attendo äldreomsorg är vi över 9000 medarbetare som arbetar inom hemtjänst och äldreboende i Skandinavien, vi är en del av Attendo, Nordens ledande privata vård och omsorgsföretag. Hos oss kommer du att arbeta med vår vision: Att stärka individen och alltid utgå från den enskildes behov och förutsättningar.\n\nAttendo hemtjänst på Kungsholmen söker engagerade och positiva medarbetare!\nVi kan erbjuda dig både dag- och kvällsschema. Vi söker tillsvidareanställda och timanställda.\n\nBeskrivning av tjänsten\n\nStor vikt läggs vid bemötande, kommunikation, kontaktmanskap och dokumentation i journalsystem.\n\n- Goda kunskaper i svenska språket (tal och skrift)\n- God datorkunskap/datorvana\n- Kan cykla\n- Körkort B\n- Meriterande om du har undersköterske- eller vårdbiträdesutbildning\n- Meriterande om du tidigare arbetat inom äldreomsorgen och hemtjänst\n\nDu trivs med att ge god service, skapa fina relationer och vill bidra till höjd livskvalité hos våra kunder. Du är en självständig, ödmjuk och ansvarsfull person som brinner för vård av äldre och kan se individens behov.\n\nStämmer beskrivningen in på dig? Sök redan idag!\n\nOm Attendo\n\nAttendo är ett av Sveriges ledande vård- och omsorgsföretag med 24 000 medarbetare. Mångfald värderas högt, vårt arbete ska stärka individen och vi arbetar för att ge utmärkt service både till våra kunder och kollegor. Attendo verkar i en platt organisation och är en trygg arbetsgivare, med kollektivavtal, avtalsförsäkringar och det finns stora möjligheter att göra karriär.\n\nVi går igenom ansökningarna löpande.\n\nFöre erbjudande om anställning ska utdrag ur polisens belastningsregister uppvisas tillsammans med giltig fotolegitimation.\n\nVi har även krav på vaccination mot covid-19 och kommer att kontrollera vaccinationsbevis innan anställning.\n\nLåt oss tillsammans utveckla framtidens viktigaste bransch!"
      },
      "headline" : "Attendo hemtjänst Kungsholmen söker engagerade medarbetare!",
      "driving_license" : null,
      "employer" : {
        "email" : null,
        "phone_number" : null,
        "organization_number" : "5561485169",
        "name" : "Attendo Sverige AB",
        "url" : "https://www.attendo.se/",
        "workplace" : "Attendo Sverige"
      },
      "removed_date" : null,
      "logo_url" : "https://www.arbetsformedlingen.se/rest/arbetsgivare/rest/af/v3/organisation/5561485169/logotyper/logo.png",
      "last_publication_date" : "2022-12-18T23:59:59",
      "number_of_vacancies" : 1,
      "occupation" : {
        "concept_id" : "4zLr_jP5_peZ",
        "label" : "Vårdbiträde",
        "legacy_ams_taxonomy_id" : "5797"
      },
      "occupation_group" : {
        "concept_id" : "tAJS_JNb_hDH",
        "label" : "Vårdbiträden",
        "legacy_ams_taxonomy_id" : "5330"
      },
      "employment_type" : {
        "concept_id" : "PFZr_Syz_cUq",
        "label" : "Vanlig anställning",
        "legacy_ams_taxonomy_id" : "1"
      },
      "webpage_url" : "https://arbetsformedlingen.se/platsbanken/annonser/26280333",
      "driving_license_required" : false,
      "application_contacts" : [ {
        "description" : "Fernanda Nevalainen",
        "email" : null,
        "telephone" : null,
        "name" : null,
        "contact_type" : null
      } ],
      "duration" : {
        "concept_id" : "Xj7x_7yZ_jEn",
        "label" : "3 månader – upp till 6 månader",
        "legacy_ams_taxonomy_id" : "3"
      },
      "nice_to_have" : {
        "education_level" : [ ],
        "work_experiences" : [ ],
        "skills" : [ ],
        "education" : [ ],
        "languages" : [ ]
      },
      "application_details" : {
        "via_af" : false,
        "email" : null,
        "other" : null,
        "reference" : null,
        "url" : "https://attendosverige.teamtailor.com/jobs/1894323-attendo-hemtjanst-kungsholmen-soker-engagerade-medarbetare?promotion=440855-arbetsformedlingen",
        "information" : null
      },
      "source_type" : "VIA_PLATSBANKEN_DXA",
      "application_deadline" : "2022-12-18T23:59:59",
      "external_id" : "46-556148-5169-1894323-1",
      "workplace_address" : {
        "coordinates" : [ 18.06858, 59.329323 ],
        "city" : null,
        "postcode" : null,
        "municipality" : "Stockholm",
        "region_concept_id" : "CifL_Rzy_Mku",
        "region" : "Stockholms län",
        "country_code" : "199",
        "region_code" : "01",
        "municipality_concept_id" : "AvNB_uwa_6n6",
        "country_concept_id" : "i46j_HmG_v64",
        "municipality_code" : "0180",
        "street_address" : null,
        "country" : "Sverige"
      },
      "id" : "26280333",
      "experience_required" : false,
      "working_hours_type" : {
        "concept_id" : "947z_JGS_Uk2",
        "label" : "Deltid",
        "legacy_ams_taxonomy_id" : "2"
      },
      "access" : null,
      "timestamp" : 1656655880533,
      "must_have" : {
        "education_level" : [ ],
        "work_experiences" : [ ],
        "skills" : [ ],
        "education" : [ ],
        "languages" : [ ]
      },
      "occupation_field" : {
        "concept_id" : "NYW6_mP6_vwf",
        "label" : "Hälso- och sjukvård",
        "legacy_ams_taxonomy_id" : "8"
      },
      "scope_of_work" : {
        "min" : 0,
        "max" : 100
      },
      "salary_type" : {
        "concept_id" : "oG8G_9cW_nRf",
        "label" : "Fast månads- vecko- eller timlön",
        "legacy_ams_taxonomy_id" : "1"
      },
      "removed" : false,
      "salary_description" : "Lön enligt överenskommelse",
      "access_to_own_car" : false,
      "publication_date" : "2022-07-01T08:11:20"
    },
    "name" : "Attendo hemtjänst Kungsholmen söker engagerade medarbetare!",
    "user" : "hannes"
  },
  "sha1" : "8b6fe377d1a67a10f333e00799d9782cab86deac",
  "annotations" : [ {
    "preferred-label" : "Hemtjänst",
    "sentiment" : "MUST_HAVE",
    "type" : "skill",
    "start-position" : 8,
    "end-position" : 17,
    "concept-id" : "xowU_8Wu_K7C",
    "matched-string" : "hemtjänst",
    "annotation-id" : 0
  }, {
    "preferred-label" : "Äldreomsorg",
    "type" : "skill",
    "start-position" : 118,
    "end-position" : 129,
    "concept-id" : "Yt2Z_1pY_MNz",
    "matched-string" : "äldreomsorg",
    "annotation-id" : 9
  }, {
    "preferred-label" : "Hemtjänst",
    "sentiment" : "MUST_HAVE",
    "type" : "skill",
    "start-position" : 175,
    "end-position" : 184,
    "concept-id" : "xowU_8Wu_K7C",
    "matched-string" : "hemtjänst",
    "annotation-id" : 1
  }, {
    "preferred-label" : "Äldreboende",
    "type" : "skill",
    "start-position" : 189,
    "end-position" : 200,
    "concept-id" : "tykJ_BZQ_Wer",
    "matched-string" : "äldreboende",
    "annotation-id" : 10
  }, {
    "preferred-label" : "Hemtjänst",
    "sentiment" : "MUST_HAVE",
    "type" : "skill",
    "start-position" : 428,
    "end-position" : 437,
    "concept-id" : "xowU_8Wu_K7C",
    "matched-string" : "hemtjänst",
    "annotation-id" : 2
  }, {
    "preferred-label" : "Tillsvidareanställning (inkl. eventuell provanställning)",
    "type" : "employment-type",
    "start-position" : 552,
    "end-position" : 572,
    "concept-id" : "kpPX_CNN_gDU",
    "matched-string" : "tillsvidareanställda",
    "annotation-id" : 11
  }, {
    "preferred-label" : "Timanställning",
    "type" : "keyword",
    "start-position" : 577,
    "end-position" : 589,
    "concept-id" : "kfXw_Vmt_Zzk",
    "matched-string" : "timanställda",
    "annotation-id" : 12
  }, {
    "preferred-label" : "Dokumentation",
    "sentiment" : "MUST_HAVE",
    "type" : "keyword",
    "start-position" : 682,
    "end-position" : 695,
    "concept-id" : "jodz_kWf_iKx",
    "matched-string" : "dokumentation",
    "annotation-id" : 3
  }, {
    "preferred-label" : "Svenska",
    "type" : "language",
    "start-position" : 733,
    "end-position" : 740,
    "concept-id" : "zSLA_vw2_FXN",
    "matched-string" : "svenska",
    "annotation-id" : 13
  }, {
    "preferred-label" : "Svenska språket",
    "type" : "keyword",
    "start-position" : 741,
    "end-position" : 748,
    "concept-id" : "BiGm_58D_SSn",
    "matched-string" : "språket",
    "annotation-id" : 14
  }, {
    "preferred-label" : "B",
    "type" : "driving-licence",
    "start-position" : 809,
    "end-position" : 818,
    "concept-id" : "VTK8_WRx_GcM",
    "matched-string" : "Körkort B",
    "annotation-id" : 15
  }, {
    "preferred-label" : "Undersköterskor",
    "type" : "ssyk-level-3",
    "start-position" : 843,
    "end-position" : 857,
    "concept-id" : "3EJj_WLs_kgD",
    "matched-string" : "undersköterske",
    "annotation-id" : 16
  }, {
    "preferred-label" : "Vårdbiträde",
    "type" : "occupation-name",
    "start-position" : 865,
    "end-position" : 876,
    "concept-id" : "4zLr_jP5_peZ",
    "matched-string" : "vårdbiträde",
    "annotation-id" : 17
  }, {
    "preferred-label" : "Äldreomsorg",
    "type" : "skill",
    "start-position" : 930,
    "end-position" : 943,
    "concept-id" : "Yt2Z_1pY_MNz",
    "matched-string" : "äldreomsorgen",
    "annotation-id" : 18
  }, {
    "preferred-label" : "Hemtjänst",
    "sentiment" : "MUST_HAVE",
    "type" : "skill",
    "start-position" : 948,
    "end-position" : 957,
    "concept-id" : "xowU_8Wu_K7C",
    "matched-string" : "hemtjänst",
    "annotation-id" : 5
  }, {
    "preferred-label" : "arbeta självständigt",
    "type" : "esco-skill",
    "start-position" : 1077,
    "end-position" : 1089,
    "concept-id" : "NyFu_HHd_zhz",
    "matched-string" : "självständig",
    "annotation-id" : 19
  }, {
    "preferred-label" : "visa ansvarstagande",
    "type" : "esco-skill",
    "start-position" : 1102,
    "end-position" : 1113,
    "concept-id" : "bcRp_hxV_f5G",
    "matched-string" : "ansvarsfull",
    "annotation-id" : 20
  }, {
    "preferred-label" : "Vård av äldre",
    "sentiment" : "MUST_HAVE",
    "type" : "skill",
    "start-position" : 1137,
    "end-position" : 1150,
    "concept-id" : "yL7p_NgY_yKc",
    "matched-string" : "vård av äldre",
    "annotation-id" : 6
  }, {
    "preferred-label" : "Kollektivavtal",
    "sentiment" : "MUST_HAVE",
    "type" : "skill",
    "start-position" : 1535,
    "end-position" : 1549,
    "concept-id" : "z7wE_9xb_3jX",
    "matched-string" : "kollektivavtal",
    "annotation-id" : 7
  }, {
    "preferred-label" : "Avtalsförsäkringar",
    "sentiment" : "MUST_HAVE",
    "type" : "skill",
    "start-position" : 1551,
    "end-position" : 1569,
    "concept-id" : "AzJi_3Dp_Sm9",
    "matched-string" : "avtalsförsäkringar",
    "annotation-id" : 8
  } ],
  "text" : "Attendo hemtjänst Kungsholmen söker engagerade medarbetare!\nVälkommen till en värderingsstyrd organisation\n\nI Attendo äldreomsorg är vi över 9000 medarbetare som arbetar inom hemtjänst och äldreboende i Skandinavien, vi är en del av Attendo, Nordens ledande privata vård och omsorgsföretag. Hos oss kommer du att arbeta med vår vision: Att stärka individen och alltid utgå från den enskildes behov och förutsättningar.\n\nAttendo hemtjänst på Kungsholmen söker engagerade och positiva medarbetare!\nVi kan erbjuda dig både dag- och kvällsschema. Vi söker tillsvidareanställda och timanställda.\n\nBeskrivning av tjänsten\n\nStor vikt läggs vid bemötande, kommunikation, kontaktmanskap och dokumentation i journalsystem.\n\n- Goda kunskaper i svenska språket (tal och skrift)\n- God datorkunskap/datorvana\n- Kan cykla\n- Körkort B\n- Meriterande om du har undersköterske- eller vårdbiträdesutbildning\n- Meriterande om du tidigare arbetat inom äldreomsorgen och hemtjänst\n\nDu trivs med att ge god service, skapa fina relationer och vill bidra till höjd livskvalité hos våra kunder. Du är en självständig, ödmjuk och ansvarsfull person som brinner för vård av äldre och kan se individens behov.\n\nStämmer beskrivningen in på dig? Sök redan idag!\n\nOm Attendo\n\nAttendo är ett av Sveriges ledande vård- och omsorgsföretag med 24 000 medarbetare. Mångfald värderas högt, vårt arbete ska stärka individen och vi arbetar för att ge utmärkt service både till våra kunder och kollegor. Attendo verkar i en platt organisation och är en trygg arbetsgivare, med kollektivavtal, avtalsförsäkringar och det finns stora möjligheter att göra karriär.\n\nVi går igenom ansökningarna löpande.\n\nFöre erbjudande om anställning ska utdrag ur polisens belastningsregister uppvisas tillsammans med giltig fotolegitimation.\n\nVi har även krav på vaccination mot covid-19 och kommer att kontrollera vaccinationsbevis innan anställning.\n\nLåt oss tillsammans utveckla framtidens viktigaste bransch!"
}