{
  "meta" : {
    "jobad" : {
      "description" : {
        "requirements" : null,
        "needs" : null,
        "company_information" : null,
        "text_formatted" : "<p>SELE SPA CLUB</p><p>Vi söker hud- massage- samt spa terapeuter till vårt nya fina SELE SPA CLUB i september. Du som söker är diplomerad och certifierad som terapeut. Dina främsta uppgifter är att ge våra gäster en förstklassig behandling och ett professionellt bemötande. </p><p>Du tycker att försäljning är roligt och brinner för att gästen ska få den bästa både i, under och efter behandlingen. Vi arbetar med Facing North och Maria Åkerbergs produkter och koncept.</p><p>Det viktigaste för oss är att du har ett genuint intresse för värdskap, spa och välmående samt att du är en teamplayer som intresserar sig för att få helheten att fungera. </p><p>Anställning sker löpande, skynda att söka till världens roligaste arbetsplats!!</p>",
        "conditions" : null,
        "text" : "SELE SPA CLUB\nVi söker hud- massage- samt spa terapeuter till vårt nya fina SELE SPA CLUB i september. Du som söker är diplomerad och certifierad som terapeut. Dina främsta uppgifter är att ge våra gäster en förstklassig behandling och ett professionellt bemötande. \nDu tycker att försäljning är roligt och brinner för att gästen ska få den bästa både i, under och efter behandlingen. Vi arbetar med Facing North och Maria Åkerbergs produkter och koncept.\nDet viktigaste för oss är att du har ett genuint intresse för värdskap, spa och välmående samt att du är en teamplayer som intresserar sig för att få helheten att fungera. \nAnställning sker löpande, skynda att söka till världens roligaste arbetsplats!!"
      },
      "headline" : "SPA TERAPEUT",
      "driving_license" : null,
      "employer" : {
        "email" : null,
        "phone_number" : null,
        "organization_number" : "5568773773",
        "name" : "Hotell Lappland AB",
        "url" : null,
        "workplace" : "HOTELL LAPPLAND AB"
      },
      "removed_date" : null,
      "logo_url" : "https://www.arbetsformedlingen.se/rest/arbetsgivare/rest/af/v3/arbetsplatser/84492069/logotyper/logo.png",
      "last_publication_date" : "2022-09-02T00:00:00",
      "number_of_vacancies" : 1,
      "occupation" : {
        "concept_id" : "2Q3q_yQV_LTm",
        "label" : "Spa- och kurterapeut",
        "legacy_ams_taxonomy_id" : "6535"
      },
      "occupation_group" : {
        "concept_id" : "ezKk_kss_CiQ",
        "label" : "Övriga skönhets- och kroppsterapeuter",
        "legacy_ams_taxonomy_id" : "5149"
      },
      "employment_type" : {
        "concept_id" : "PFZr_Syz_cUq",
        "label" : "Vanlig anställning",
        "legacy_ams_taxonomy_id" : "1"
      },
      "webpage_url" : "https://arbetsformedlingen.se/platsbanken/annonser/26375277",
      "driving_license_required" : false,
      "application_contacts" : [ ],
      "duration" : {
        "concept_id" : "a7uU_j21_mkL",
        "label" : "Tills vidare",
        "legacy_ams_taxonomy_id" : "1"
      },
      "nice_to_have" : {
        "education_level" : [ ],
        "work_experiences" : [ ],
        "skills" : [ ],
        "education" : [ ],
        "languages" : [ ]
      },
      "application_details" : {
        "via_af" : false,
        "email" : "katarina@hotelllappland.se",
        "other" : null,
        "reference" : null,
        "url" : null,
        "information" : null
      },
      "source_type" : "VIA_ANNONSERA",
      "application_deadline" : "2022-09-02T00:00:00",
      "external_id" : null,
      "workplace_address" : {
        "coordinates" : [ 18.719983771369314, 64.59553345670845 ],
        "city" : "LYCKSELE",
        "postcode" : "92142",
        "municipality" : "Lycksele",
        "region_concept_id" : "g5Tt_CAV_zBd",
        "region" : "Västerbottens län",
        "country_code" : "199",
        "region_code" : "24",
        "municipality_concept_id" : "7rpN_naz_3Uz",
        "country_concept_id" : "i46j_HmG_v64",
        "municipality_code" : "2481",
        "street_address" : "KORPBERGET 1",
        "country" : "Sverige"
      },
      "id" : "26375277",
      "experience_required" : true,
      "working_hours_type" : {
        "concept_id" : "6YE1_gAC_R2G",
        "label" : "Heltid",
        "legacy_ams_taxonomy_id" : "1"
      },
      "access" : null,
      "timestamp" : 1659528715266,
      "must_have" : {
        "education_level" : [ ],
        "work_experiences" : [ ],
        "skills" : [ ],
        "education" : [ ],
        "languages" : [ ]
      },
      "occupation_field" : {
        "concept_id" : "Uuf1_GMh_Uvw",
        "label" : "Kropps- och skönhetsvård",
        "legacy_ams_taxonomy_id" : "4"
      },
      "scope_of_work" : {
        "min" : 0,
        "max" : 100
      },
      "salary_type" : {
        "concept_id" : "oG8G_9cW_nRf",
        "label" : "Fast månads- vecko- eller timlön",
        "legacy_ams_taxonomy_id" : "1"
      },
      "removed" : false,
      "salary_description" : null,
      "access_to_own_car" : false,
      "publication_date" : "2022-08-03T14:11:55"
    },
    "name" : "SPA TERAPEUT",
    "user" : "kristof.fischer"
  },
  "sha1" : "c7174694f2554a56d37c9af0b0ca7a9ecc795fc7",
  "annotations" : [ {
    "preferred-label" : "Spa-terapeut",
    "type" : "occupation-name",
    "start-position" : 0,
    "end-position" : 12,
    "concept-id" : "2Q3q_yQV_LTm",
    "matched-string" : "SPA TERAPEUT",
    "annotation-id" : 1
  }, {
    "preferred-label" : "Hudterapeut",
    "type" : "occupation-name",
    "start-position" : 36,
    "end-position" : 40,
    "concept-id" : "zqBJ_sRm_m5Z",
    "matched-string" : "hud-",
    "annotation-id" : 2
  }, {
    "preferred-label" : "Massör/Massageterapeut",
    "type" : "occupation-name",
    "start-position" : 41,
    "end-position" : 49,
    "concept-id" : "mC28_vEv_AVx",
    "matched-string" : "massage-",
    "annotation-id" : 3
  }, {
    "preferred-label" : "Spa-terapeut",
    "type" : "occupation-name",
    "start-position" : 55,
    "end-position" : 69,
    "concept-id" : "2Q3q_yQV_LTm",
    "matched-string" : "spa terapeuter",
    "annotation-id" : 4
  }, {
    "preferred-label" : "Certifierad spa-terapeut",
    "sentiment" : "MUST_HAVE",
    "type" : "skill",
    "start-position" : 147,
    "end-position" : 171,
    "concept-id" : "KYNo_NyK_BGz",
    "matched-string" : "certifierad som terapeut",
    "annotation-id" : 5
  }, {
    "preferred-label" : "se till att kunderna är nöjda",
    "sentiment" : "MUST_HAVE",
    "type" : "esco-skill",
    "start-position" : 336,
    "end-position" : 359,
    "concept-id" : "GcZm_VYN_2VR",
    "matched-string" : "gästen ska få den bästa",
    "annotation-id" : 6
  } ],
  "text" : "SPA TERAPEUT\nSELE SPA CLUB\nVi söker hud- massage- samt spa terapeuter till vårt nya fina SELE SPA CLUB i september. Du som söker är diplomerad och certifierad som terapeut. Dina främsta uppgifter är att ge våra gäster en förstklassig behandling och ett professionellt bemötande. \nDu tycker att försäljning är roligt och brinner för att gästen ska få den bästa både i, under och efter behandlingen. Vi arbetar med Facing North och Maria Åkerbergs produkter och koncept.\nDet viktigaste för oss är att du har ett genuint intresse för värdskap, spa och välmående samt att du är en teamplayer som intresserar sig för att få helheten att fungera. \nAnställning sker löpande, skynda att söka till världens roligaste arbetsplats!!"
}