{
  "meta" : {
    "jobad" : {
      "description" : {
        "requirements" : null,
        "needs" : null,
        "company_information" : null,
        "text_formatted" : "<p>Ludde % Co Hundcenter AB är ett hunddagis som startade 2007. Arbetsplatsen är belägen vid Ängbyplan i Bromma och våra hundpromenader gör vi företrädesvis i Judarskogens naturreservat. </p><p>Vi söker nu en hundskötare. Du kommer att arbeta med praktiska sysslor som förekommer på ett hunddagis, hundpromenader, utfodring, aktivering, kundkontakter och städning.</p><p><br></p><p><strong>Beskrivning av kvalifikationer:</strong> </p><p>Gymnasieutbildning inriktning hund alternativt djurvård och att ha praktiserat på hunddagis är ett krav. Erfarenhet av arbete på hunddagis är meriterande.</p><p>Arbetet kräver gedigen hunderfarenhet och erfarenhet av promenader med flera hundar samtidigt. Arbetet innebär också dagliga kundkontakter som kräver god servicekänsla och samarbetsförmåga.  </p><p><br></p><p><strong>Varaktighet:     </strong>Tidsbegränsad anställning på 3-6 månader, eventuell möjlighet till förlängning</p><p><strong>Tillträde:</strong>              Augusti</p><p><strong>Arbetstid: </strong>          Deltid, 60% eventuellt mer</p>",
        "conditions" : null,
        "text" : "Ludde % Co Hundcenter AB är ett hunddagis som startade 2007. Arbetsplatsen är belägen vid Ängbyplan i Bromma och våra hundpromenader gör vi företrädesvis i Judarskogens naturreservat. \nVi söker nu en hundskötare. Du kommer att arbeta med praktiska sysslor som förekommer på ett hunddagis, hundpromenader, utfodring, aktivering, kundkontakter och städning.\n\n\nBeskrivning av kvalifikationer: \nGymnasieutbildning inriktning hund alternativt djurvård och att ha praktiserat på hunddagis är ett krav. Erfarenhet av arbete på hunddagis är meriterande.\nArbetet kräver gedigen hunderfarenhet och erfarenhet av promenader med flera hundar samtidigt. Arbetet innebär också dagliga kundkontakter som kräver god servicekänsla och samarbetsförmåga.  \n\n\nVaraktighet:     Tidsbegränsad anställning på 3-6 månader, eventuell möjlighet till förlängning\nTillträde:              Augusti\nArbetstid:           Deltid, 60% eventuellt mer"
      },
      "headline" : "Hundskötare till Ludde & Co Hundcenrum AB",
      "driving_license" : null,
      "employer" : {
        "email" : null,
        "phone_number" : null,
        "organization_number" : "5567266589",
        "name" : "Ludde & Co Hundcentrum AB",
        "url" : null,
        "workplace" : "Ludde & Co Hundcentrum AB"
      },
      "removed_date" : null,
      "logo_url" : null,
      "last_publication_date" : "2022-09-04T00:00:00",
      "number_of_vacancies" : 1,
      "occupation" : {
        "concept_id" : "qLCw_Azv_m1h",
        "label" : "Hundskötare/Hundvårdare",
        "legacy_ams_taxonomy_id" : "6286"
      },
      "occupation_group" : {
        "concept_id" : "MSzH_F2n_Emb",
        "label" : "Uppfödare och skötare av sällskapsdjur",
        "legacy_ams_taxonomy_id" : "6122"
      },
      "employment_type" : {
        "concept_id" : "PFZr_Syz_cUq",
        "label" : "Vanlig anställning",
        "legacy_ams_taxonomy_id" : "1"
      },
      "webpage_url" : "https://arbetsformedlingen.se/platsbanken/annonser/26364859",
      "driving_license_required" : false,
      "application_contacts" : [ {
        "description" : null,
        "email" : null,
        "telephone" : "0705385388",
        "name" : "Per Pettersson",
        "contact_type" : null
      } ],
      "duration" : {
        "concept_id" : "Xj7x_7yZ_jEn",
        "label" : "3 månader – upp till 6 månader",
        "legacy_ams_taxonomy_id" : "3"
      },
      "nice_to_have" : {
        "education_level" : [ ],
        "work_experiences" : [ ],
        "skills" : [ ],
        "education" : [ ],
        "languages" : [ ]
      },
      "application_details" : {
        "via_af" : false,
        "email" : "mail@luddeochco.se",
        "other" : null,
        "reference" : "Hundskötare HT22",
        "url" : null,
        "information" : null
      },
      "source_type" : "VIA_ANNONSERA",
      "application_deadline" : "2022-09-04T00:00:00",
      "external_id" : null,
      "workplace_address" : {
        "coordinates" : [ 17.906003156520764, 59.34185502093125 ],
        "city" : "Bromma",
        "postcode" : "16851",
        "municipality" : "Stockholm",
        "region_concept_id" : "CifL_Rzy_Mku",
        "region" : "Stockholms län",
        "country_code" : "199",
        "region_code" : "01",
        "municipality_concept_id" : "AvNB_uwa_6n6",
        "country_concept_id" : "i46j_HmG_v64",
        "municipality_code" : "0180",
        "street_address" : "Färjestadsvägen 6",
        "country" : "Sverige"
      },
      "id" : "26364859",
      "experience_required" : true,
      "working_hours_type" : {
        "concept_id" : "947z_JGS_Uk2",
        "label" : "Deltid",
        "legacy_ams_taxonomy_id" : "2"
      },
      "access" : null,
      "timestamp" : 1659259655307,
      "must_have" : {
        "education_level" : [ ],
        "work_experiences" : [ {
          "concept_id" : "qLCw_Azv_m1h",
          "weight" : 10,
          "label" : "Hundskötare/Hundvårdare",
          "legacy_ams_taxonomy_id" : "6286"
        } ],
        "skills" : [ ],
        "education" : [ ],
        "languages" : [ ]
      },
      "occupation_field" : {
        "concept_id" : "VuuL_7CH_adj",
        "label" : "Naturbruk",
        "legacy_ams_taxonomy_id" : "13"
      },
      "scope_of_work" : {
        "min" : 0,
        "max" : 100
      },
      "salary_type" : {
        "concept_id" : "oG8G_9cW_nRf",
        "label" : "Fast månads- vecko- eller timlön",
        "legacy_ams_taxonomy_id" : "1"
      },
      "removed" : false,
      "salary_description" : null,
      "access_to_own_car" : false,
      "publication_date" : "2022-07-31T11:27:35"
    },
    "name" : "Hundskötare till Ludde & Co Hundcenrum AB",
    "user" : "kristof.fischer"
  },
  "sha1" : "ebaf3b47a4840e2fb56be998d80bd1a998ed1473",
  "annotations" : [ {
    "preferred-label" : "Hundskötare/Hundvårdare",
    "sentiment" : "MUST_HAVE",
    "type" : "occupation-name",
    "start-position" : 0,
    "end-position" : 11,
    "concept-id" : "qLCw_Azv_m1h",
    "matched-string" : "hundskötare",
    "annotation-id" : 0
  }, {
    "preferred-label" : "Hundskötare/Hundvårdare",
    "sentiment" : "MUST_HAVE",
    "type" : "occupation-name",
    "start-position" : 242,
    "end-position" : 253,
    "concept-id" : "qLCw_Azv_m1h",
    "matched-string" : "hundskötare",
    "annotation-id" : 2
  }, {
    "preferred-label" : "Gymnasial utbildning",
    "sentiment" : "MUST_HAVE",
    "type" : "sni-level-3",
    "start-position" : 433,
    "end-position" : 451,
    "concept-id" : "t8bn_FTn_FiG",
    "matched-string" : "Gymnasieutbildning",
    "annotation-id" : 8
  }, {
    "preferred-label" : "Utbildning i djurvård",
    "sentiment" : "MUST_HAVE",
    "type" : "sun-education-field-4",
    "start-position" : 480,
    "end-position" : 488,
    "concept-id" : "88zZ_fdd_nJE",
    "matched-string" : "djurvård",
    "annotation-id" : 9
  }, {
    "preferred-label" : "Hunddagis",
    "sentiment" : "MUST_HAVE",
    "type" : "skill",
    "start-position" : 515,
    "end-position" : 524,
    "concept-id" : "DYvh_2Z1_WNr",
    "matched-string" : "hunddagis",
    "annotation-id" : 6
  }, {
    "preferred-label" : "Hunddagis",
    "sentiment" : "NICE_TO_HAVE",
    "type" : "skill",
    "start-position" : 562,
    "end-position" : 571,
    "concept-id" : "DYvh_2Z1_WNr",
    "matched-string" : "hunddagis",
    "annotation-id" : 7
  }, {
    "preferred-label" : null,
    "sentiment" : "MUST_HAVE",
    "type" : "skill",
    "start-position" : 644,
    "end-position" : 681,
    "concept-id" : null,
    "matched-string" : "promenader med flera hundar samtidigt",
    "annotation-id" : 10
  }, {
    "preferred-label" : "samarbeta med kolleger",
    "sentiment" : "MUST_HAVE",
    "type" : "esco-skill",
    "start-position" : 760,
    "end-position" : 776,
    "concept-id" : "X15R_797_q62",
    "matched-string" : "samarbetsförmåga",
    "annotation-id" : 11
  }, {
    "preferred-label" : "Tidsbegränsad anställning",
    "type" : "employment-type",
    "start-position" : 799,
    "end-position" : 824,
    "concept-id" : "sTu5_NBQ_udq",
    "matched-string" : "Tidsbegränsad anställning",
    "annotation-id" : 12
  }, {
    "preferred-label" : "Deltid",
    "type" : "worktime-extent",
    "start-position" : 931,
    "end-position" : 937,
    "concept-id" : "947z_JGS_Uk2",
    "matched-string" : "Deltid",
    "annotation-id" : 13
  } ],
  "text" : "Hundskötare till Ludde & Co Hundcenrum AB\nLudde % Co Hundcenter AB är ett hunddagis som startade 2007. Arbetsplatsen är belägen vid Ängbyplan i Bromma och våra hundpromenader gör vi företrädesvis i Judarskogens naturreservat. \nVi söker nu en hundskötare. Du kommer att arbeta med praktiska sysslor som förekommer på ett hunddagis, hundpromenader, utfodring, aktivering, kundkontakter och städning.\n\n\nBeskrivning av kvalifikationer: \nGymnasieutbildning inriktning hund alternativt djurvård och att ha praktiserat på hunddagis är ett krav. Erfarenhet av arbete på hunddagis är meriterande.\nArbetet kräver gedigen hunderfarenhet och erfarenhet av promenader med flera hundar samtidigt. Arbetet innebär också dagliga kundkontakter som kräver god servicekänsla och samarbetsförmåga.  \n\n\nVaraktighet:     Tidsbegränsad anställning på 3-6 månader, eventuell möjlighet till förlängning\nTillträde:              Augusti\nArbetstid:           Deltid, 60% eventuellt mer"
}