{
  "meta" : {
    "jobad" : {
      "description" : {
        "requirements" : null,
        "needs" : null,
        "company_information" : null,
        "text_formatted" : "Är du en glad pensionär, student eller egenföretagare som känner att det vore roligt att komma ut och extrajobba när det passar dig?\n\nSom timanställd på Uniflex får du möjlighet till uppdrag hos olika kunder med varierande typer av arbetsuppgifter som t e x maskinövervakning, plock/pack och sortering/avsyning och truckkörning. \nVåra kunder finns främst i Växjö och Alvesta men även i närliggande kommuner. \nArbetstider och timlön varierar mellan uppdragen. \nVi söker dig som är öppen för olika arbetstider som passar din vardag.\n\nVi ser gärna att du har körkort och tillgång till bil för att enklare ta dig till uppdragen.\n\n\nVem är du?\n\nSom person är du\n\n- Flexibel\n- Lyhörd \n- Noggrann\n- Glad\n- En go kollega\n\nTa chansen att tjäna en extra kosing samtidigt som du får socialisera med våra trevliga konsulter och kunder!\nFör att söka tjänsten behöver du ha någon annan form utan sysselsättning (pension/jobb/studier) på minst 51%.\nÄr du student och söker, vänligen bifoga aktuellt studieintyg i din ansökan.\n\n\n  \nDu skickar din ansökan via vår hemsida www.uniflex.se\n\nSe till att eventuella referenser som finns namngivna i dina ansökningshandlingar har kännedom om att de finns med där och att de eventuellt kommer att bli kontaktade vid en eventuell rekryteringsprocess.\n\nUniflex är ett auktoriserat bemanningsföretag som arbetar med uthyrning och rekrytering. Uniflex finns i Sverige, Norge och Finland. I Sverige är vi drygt 3 000 anställda och finns på ett 40 tal orter. Vi är medlemmar i Almega Kompetensföretagen samt Byggföretagen och har kollektivavtal med LO, Byggnads, Unionen och Akademikerförbunden. Uniflex är kvalitets-, miljö- och arbetsmiljöcertifierade enligt ISO 9001, ISO 14001 samt ISO 45001.\n\nPå Uniflex ser vi våra medarbetare som vår viktigaste tillgång och därför erbjuder vi följande:\n\n• Kollektivavtal\n• Tjänstepension\n• Friskvårdsbidrag och andra personalförmåner\n• Försäkringar\n• Marknadsmässig lön\n• Karriär och utveckling\n\nVi söker ständigt efter nya kollegor som arbetar i enighet med våra värderingar affärsfokus, engagemang, glädje och ansvarstagande.",
        "conditions" : "Deltid - Enligt överenskommelse\r\nTillsvidare",
        "text" : "Är du en glad pensionär, student eller egenföretagare som känner att det vore roligt att komma ut och extrajobba när det passar dig?\n\nSom timanställd på Uniflex får du möjlighet till uppdrag hos olika kunder med varierande typer av arbetsuppgifter som t e x maskinövervakning, plock/pack och sortering/avsyning och truckkörning. \nVåra kunder finns främst i Växjö och Alvesta men även i närliggande kommuner. \nArbetstider och timlön varierar mellan uppdragen. \nVi söker dig som är öppen för olika arbetstider som passar din vardag.\n\nVi ser gärna att du har körkort och tillgång till bil för att enklare ta dig till uppdragen.\n\n\nVem är du?\n\nSom person är du\n\n- Flexibel\n- Lyhörd \n- Noggrann\n- Glad\n- En go kollega\n\nTa chansen att tjäna en extra kosing samtidigt som du får socialisera med våra trevliga konsulter och kunder!\nFör att söka tjänsten behöver du ha någon annan form utan sysselsättning (pension/jobb/studier) på minst 51%.\nÄr du student och söker, vänligen bifoga aktuellt studieintyg i din ansökan.\n\n\n  \nDu skickar din ansökan via vår hemsida www.uniflex.se\n\nSe till att eventuella referenser som finns namngivna i dina ansökningshandlingar har kännedom om att de finns med där och att de eventuellt kommer att bli kontaktade vid en eventuell rekryteringsprocess.\n\nUniflex är ett auktoriserat bemanningsföretag som arbetar med uthyrning och rekrytering. Uniflex finns i Sverige, Norge och Finland. I Sverige är vi drygt 3 000 anställda och finns på ett 40 tal orter. Vi är medlemmar i Almega Kompetensföretagen samt Byggföretagen och har kollektivavtal med LO, Byggnads, Unionen och Akademikerförbunden. Uniflex är kvalitets-, miljö- och arbetsmiljöcertifierade enligt ISO 9001, ISO 14001 samt ISO 45001.\n\nPå Uniflex ser vi våra medarbetare som vår viktigaste tillgång och därför erbjuder vi följande:\n\n• Kollektivavtal\n• Tjänstepension\n• Friskvårdsbidrag och andra personalförmåner\n• Försäkringar\n• Marknadsmässig lön\n• Karriär och utveckling\n\nVi söker ständigt efter nya kollegor som arbetar i enighet med våra värderingar affärsfokus, engagemang, glädje och ansvarstagande."
      },
      "headline" : "Vi söker Dig som vill arbeta extra inom industri och lager!",
      "driving_license" : [ {
        "concept_id" : "VTK8_WRx_GcM",
        "label" : "B",
        "legacy_ams_taxonomy_id" : "3"
      } ],
      "employer" : {
        "email" : null,
        "phone_number" : null,
        "organization_number" : "5566370341",
        "name" : "Uniflex Sverige AB",
        "url" : "http://www.uniflex.se",
        "workplace" : "Uniflex Sverige AB"
      },
      "removed_date" : null,
      "logo_url" : "https://www.arbetsformedlingen.se/rest/arbetsgivare/rest/af/v3/organisation/5566370341/logotyper/logo.png",
      "last_publication_date" : "2022-08-14T23:59:59",
      "number_of_vacancies" : 8,
      "occupation" : {
        "concept_id" : "YPhx_n7J_vKG",
        "label" : "Avsynare, metallprodukter",
        "legacy_ams_taxonomy_id" : "6003"
      },
      "occupation_group" : {
        "concept_id" : "4bxV_58E_P9N",
        "label" : "Slipare m.fl.",
        "legacy_ams_taxonomy_id" : "7224"
      },
      "employment_type" : {
        "concept_id" : "PFZr_Syz_cUq",
        "label" : "Vanlig anställning",
        "legacy_ams_taxonomy_id" : "1"
      },
      "webpage_url" : "https://arbetsformedlingen.se/platsbanken/annonser/26307980",
      "driving_license_required" : true,
      "application_contacts" : [ {
        "description" : "Emilia Neskovska",
        "email" : "emilia.neskovska@uniflex.se",
        "telephone" : null,
        "name" : null,
        "contact_type" : null
      } ],
      "duration" : {
        "concept_id" : "a7uU_j21_mkL",
        "label" : "Tills vidare",
        "legacy_ams_taxonomy_id" : "1"
      },
      "nice_to_have" : {
        "education_level" : [ ],
        "work_experiences" : [ ],
        "skills" : [ ],
        "education" : [ ],
        "languages" : [ ]
      },
      "application_details" : {
        "via_af" : false,
        "email" : null,
        "other" : null,
        "reference" : "59809",
        "url" : "http://www.uniflex.se/jobbannons?jaid=59809",
        "information" : null
      },
      "source_type" : "VIA_PLATSBANKEN_DXA",
      "application_deadline" : "2022-08-14T23:59:59",
      "external_id" : "46-556637-0341-59809",
      "workplace_address" : {
        "coordinates" : [ 14.805852, 56.879005 ],
        "city" : null,
        "postcode" : null,
        "municipality" : "Växjö",
        "region_concept_id" : "tF3y_MF9_h5G",
        "region" : "Kronobergs län",
        "country_code" : "199",
        "region_code" : "07",
        "municipality_concept_id" : "mmot_H3A_auW",
        "country_concept_id" : "i46j_HmG_v64",
        "municipality_code" : "0780",
        "street_address" : null,
        "country" : "Sverige"
      },
      "id" : "26307980",
      "experience_required" : false,
      "working_hours_type" : {
        "concept_id" : "947z_JGS_Uk2",
        "label" : "Deltid",
        "legacy_ams_taxonomy_id" : "2"
      },
      "access" : null,
      "timestamp" : 1657266612308,
      "must_have" : {
        "education_level" : [ ],
        "work_experiences" : [ ],
        "skills" : [ ],
        "education" : [ ],
        "languages" : [ ]
      },
      "occupation_field" : {
        "concept_id" : "wTEr_CBC_bqh",
        "label" : "Industriell tillverkning",
        "legacy_ams_taxonomy_id" : "9"
      },
      "scope_of_work" : {
        "min" : 0,
        "max" : 100
      },
      "salary_type" : {
        "concept_id" : "oG8G_9cW_nRf",
        "label" : "Fast månads- vecko- eller timlön",
        "legacy_ams_taxonomy_id" : "1"
      },
      "removed" : false,
      "salary_description" : "Fast lön",
      "access_to_own_car" : false,
      "publication_date" : "2022-07-08T09:50:12"
    },
    "name" : "Vi söker Dig som vill arbeta extra inom industri och lager!",
    "user" : "hannes"
  },
  "sha1" : "417dc0e78bda0039bb1b323e44f71f62830130d4",
  "annotations" : [ {
    "preferred-label" : "Lager",
    "sentiment" : "MUST_HAVE",
    "type" : "keyword",
    "start-position" : 53,
    "end-position" : 58,
    "concept-id" : "J5gJ_6vV_egQ",
    "matched-string" : "lager",
    "annotation-id" : 0
  }, {
    "preferred-label" : "Timanställning",
    "type" : "keyword",
    "start-position" : 198,
    "end-position" : 209,
    "concept-id" : "kfXw_Vmt_Zzk",
    "matched-string" : "timanställd",
    "annotation-id" : 4
  }, {
    "preferred-label" : "plocka order för leverans",
    "type" : "esco-skill",
    "start-position" : 337,
    "end-position" : 342,
    "concept-id" : "ZUh3_Nof_FF9",
    "matched-string" : "plock",
    "annotation-id" : 5
  }, {
    "preferred-label" : "packare",
    "type" : "esco-occupation",
    "start-position" : 343,
    "end-position" : 347,
    "concept-id" : "RH1P_4KB_1WT",
    "matched-string" : "pack",
    "annotation-id" : 6
  }, {
    "preferred-label" : "Avsyning",
    "sentiment" : "MUST_HAVE",
    "type" : "skill",
    "start-position" : 362,
    "end-position" : 370,
    "concept-id" : "X4EU_ZC7_QmK",
    "matched-string" : "avsyning",
    "annotation-id" : 1
  }, {
    "preferred-label" : "Truck",
    "type" : "keyword",
    "start-position" : 375,
    "end-position" : 380,
    "concept-id" : "Wz82_4Xv_ZFr",
    "matched-string" : "truck",
    "annotation-id" : 7
  }, {
    "preferred-label" : "Växjö",
    "type" : "municipality",
    "start-position" : 417,
    "end-position" : 422,
    "concept-id" : "mmot_H3A_auW",
    "matched-string" : "Växjö",
    "annotation-id" : 8
  }, {
    "preferred-label" : "Alvesta",
    "type" : "municipality",
    "start-position" : 427,
    "end-position" : 434,
    "concept-id" : "MMph_wmN_esc",
    "matched-string" : "Alvesta",
    "annotation-id" : 9
  }, {
    "preferred-label" : "B",
    "type" : "driving-licence",
    "start-position" : 616,
    "end-position" : 623,
    "concept-id" : "VTK8_WRx_GcM",
    "matched-string" : "körkort",
    "annotation-id" : 10
  }, {
    "preferred-label" : "noggrannhet",
    "type" : "esco-skill",
    "start-position" : 740,
    "end-position" : 748,
    "concept-id" : "mrsW_EkL_KRD",
    "matched-string" : "Noggrann",
    "annotation-id" : 11
  }, {
    "preferred-label" : "Kollektivavtal",
    "sentiment" : "MUST_HAVE",
    "type" : "skill",
    "start-position" : 1609,
    "end-position" : 1623,
    "concept-id" : "z7wE_9xb_3jX",
    "matched-string" : "kollektivavtal",
    "annotation-id" : 2
  }, {
    "preferred-label" : "Miljöledning (ISO 14000-serien)",
    "type" : "skill",
    "start-position" : 1750,
    "end-position" : 1759,
    "concept-id" : "3Sj1_uuL_y1A",
    "matched-string" : "ISO 14001",
    "annotation-id" : 12
  }, {
    "preferred-label" : "Kollektivavtal",
    "sentiment" : "MUST_HAVE",
    "type" : "skill",
    "start-position" : 1876,
    "end-position" : 1890,
    "concept-id" : "z7wE_9xb_3jX",
    "matched-string" : "kollektivavtal",
    "annotation-id" : 3
  } ],
  "text" : "Vi söker Dig som vill arbeta extra inom industri och lager!\nÄr du en glad pensionär, student eller egenföretagare som känner att det vore roligt att komma ut och extrajobba när det passar dig?\n\nSom timanställd på Uniflex får du möjlighet till uppdrag hos olika kunder med varierande typer av arbetsuppgifter som t e x maskinövervakning, plock/pack och sortering/avsyning och truckkörning. \nVåra kunder finns främst i Växjö och Alvesta men även i närliggande kommuner. \nArbetstider och timlön varierar mellan uppdragen. \nVi söker dig som är öppen för olika arbetstider som passar din vardag.\n\nVi ser gärna att du har körkort och tillgång till bil för att enklare ta dig till uppdragen.\n\n\nVem är du?\n\nSom person är du\n\n- Flexibel\n- Lyhörd \n- Noggrann\n- Glad\n- En go kollega\n\nTa chansen att tjäna en extra kosing samtidigt som du får socialisera med våra trevliga konsulter och kunder!\nFör att söka tjänsten behöver du ha någon annan form utan sysselsättning (pension/jobb/studier) på minst 51%.\nÄr du student och söker, vänligen bifoga aktuellt studieintyg i din ansökan.\n\n\n  \nDu skickar din ansökan via vår hemsida www.uniflex.se\n\nSe till att eventuella referenser som finns namngivna i dina ansökningshandlingar har kännedom om att de finns med där och att de eventuellt kommer att bli kontaktade vid en eventuell rekryteringsprocess.\n\nUniflex är ett auktoriserat bemanningsföretag som arbetar med uthyrning och rekrytering. Uniflex finns i Sverige, Norge och Finland. I Sverige är vi drygt 3 000 anställda och finns på ett 40 tal orter. Vi är medlemmar i Almega Kompetensföretagen samt Byggföretagen och har kollektivavtal med LO, Byggnads, Unionen och Akademikerförbunden. Uniflex är kvalitets-, miljö- och arbetsmiljöcertifierade enligt ISO 9001, ISO 14001 samt ISO 45001.\n\nPå Uniflex ser vi våra medarbetare som vår viktigaste tillgång och därför erbjuder vi följande:\n\n• Kollektivavtal\n• Tjänstepension\n• Friskvårdsbidrag och andra personalförmåner\n• Försäkringar\n• Marknadsmässig lön\n• Karriär och utveckling\n\nVi söker ständigt efter nya kollegor som arbetar i enighet med våra värderingar affärsfokus, engagemang, glädje och ansvarstagande."
}