{
  "meta" : {
    "jobad" : {
      "description" : {
        "requirements" : null,
        "needs" : null,
        "company_information" : null,
        "text_formatted" : "Kringelgården är ett hantverksbageri i tredje generationen.\n\nVi söker dig som är engagerad, har lätt till ett leende och är service minded. Du ska ha tagit studenten och vara ansvarstagande.\n\nDu ska gärna ha erfarenhet av att arbeta med råvaror och ha ett stort intresse av mat. Vi bakar pizza, serverar sallader, soppa, säljer bröd och hanterar espressomaskin.\n\nNu erbjuder vi en heltidstjänst i vårt kök, där vi söker dig som är en god lagspelare, serviceinriktad, gillar kundkontakt och högt tempo.\n\nMed oss får du jobba i en lokal där det bakats och sålts bröd av hög kvalitet sedan 1902, och där samma familj i tre generationer arbetat med, och förvaltat verksamheten sedan 1942.",
        "conditions" : "Heltid\r\nTillsvidare",
        "text" : "Kringelgården är ett hantverksbageri i tredje generationen.\n\nVi söker dig som är engagerad, har lätt till ett leende och är service minded. Du ska ha tagit studenten och vara ansvarstagande.\n\nDu ska gärna ha erfarenhet av att arbeta med råvaror och ha ett stort intresse av mat. Vi bakar pizza, serverar sallader, soppa, säljer bröd och hanterar espressomaskin.\n\nNu erbjuder vi en heltidstjänst i vårt kök, där vi söker dig som är en god lagspelare, serviceinriktad, gillar kundkontakt och högt tempo.\n\nMed oss får du jobba i en lokal där det bakats och sålts bröd av hög kvalitet sedan 1902, och där samma familj i tre generationer arbetat med, och förvaltat verksamheten sedan 1942."
      },
      "headline" : "Pizza/kök",
      "driving_license" : null,
      "employer" : {
        "email" : null,
        "phone_number" : null,
        "organization_number" : "5567697353",
        "name" : "Kringelgården AB",
        "url" : null,
        "workplace" : "Kringelgården AB"
      },
      "removed_date" : null,
      "logo_url" : "https://www.arbetsformedlingen.se/rest/arbetsgivare/rest/af/v3/organisation/5567697353/logotyper/logo.png",
      "last_publication_date" : "2022-09-04T23:59:59",
      "number_of_vacancies" : 1,
      "occupation" : {
        "concept_id" : "oRB5_b7i_Qzv",
        "label" : "Köksbiträde",
        "legacy_ams_taxonomy_id" : "483"
      },
      "occupation_group" : {
        "concept_id" : "tPox_ie4_X9X",
        "label" : "Restaurang- och köksbiträden m.fl.",
        "legacy_ams_taxonomy_id" : "9412"
      },
      "employment_type" : {
        "concept_id" : "PFZr_Syz_cUq",
        "label" : "Vanlig anställning",
        "legacy_ams_taxonomy_id" : "1"
      },
      "webpage_url" : "https://arbetsformedlingen.se/platsbanken/annonser/26379251",
      "driving_license_required" : false,
      "application_contacts" : [ ],
      "duration" : {
        "concept_id" : "a7uU_j21_mkL",
        "label" : "Tills vidare",
        "legacy_ams_taxonomy_id" : "1"
      },
      "nice_to_have" : {
        "education_level" : [ ],
        "work_experiences" : [ ],
        "skills" : [ ],
        "education" : [ ],
        "languages" : [ ]
      },
      "application_details" : {
        "via_af" : false,
        "email" : null,
        "other" : null,
        "reference" : null,
        "url" : "https://kringelgarden.uhigher.com/job-details?job=1a2cabca-3979-4109-82df-4a3e45ecc01b",
        "information" : null
      },
      "source_type" : "VIA_PLATSBANKEN_DXA",
      "application_deadline" : "2022-09-04T23:59:59",
      "external_id" : "46-556769-7353-4734",
      "workplace_address" : {
        "coordinates" : [ 18.156042, 59.307903 ],
        "city" : null,
        "postcode" : null,
        "municipality" : "Nacka",
        "region_concept_id" : "CifL_Rzy_Mku",
        "region" : "Stockholms län",
        "country_code" : "199",
        "region_code" : "01",
        "municipality_concept_id" : "aYA7_PpG_BqP",
        "country_concept_id" : "i46j_HmG_v64",
        "municipality_code" : "0182",
        "street_address" : null,
        "country" : "Sverige"
      },
      "id" : "26379251",
      "experience_required" : false,
      "working_hours_type" : {
        "concept_id" : "6YE1_gAC_R2G",
        "label" : "Heltid",
        "legacy_ams_taxonomy_id" : "1"
      },
      "access" : null,
      "timestamp" : 1659676884069,
      "must_have" : {
        "education_level" : [ ],
        "work_experiences" : [ ],
        "skills" : [ ],
        "education" : [ ],
        "languages" : [ ]
      },
      "occupation_field" : {
        "concept_id" : "ScKy_FHB_7wT",
        "label" : "Hotell, restaurang, storhushåll",
        "legacy_ams_taxonomy_id" : "7"
      },
      "scope_of_work" : {
        "min" : 100,
        "max" : 100
      },
      "salary_type" : {
        "concept_id" : "oG8G_9cW_nRf",
        "label" : "Fast månads- vecko- eller timlön",
        "legacy_ams_taxonomy_id" : "1"
      },
      "removed" : false,
      "salary_description" : "Fast månads- vecko- eller timlön",
      "access_to_own_car" : false,
      "publication_date" : "2022-08-05T07:21:24"
    },
    "name" : "Pizza/kök",
    "user" : "hannes"
  },
  "sha1" : "dad4dcb2cb7f20a97fb1903f408f17db32969906",
  "annotations" : [ {
    "preferred-label" : "Pizza",
    "sentiment" : "MUST_HAVE",
    "type" : "keyword",
    "start-position" : 0,
    "end-position" : 5,
    "concept-id" : "aoCa_BaF_g6Z",
    "matched-string" : "pizza",
    "annotation-id" : 0
  }, {
    "preferred-label" : "visa ansvarstagande",
    "type" : "esco-skill",
    "start-position" : 185,
    "end-position" : 199,
    "concept-id" : "bcRp_hxV_f5G",
    "matched-string" : "ansvarstagande",
    "annotation-id" : 3
  }, {
    "preferred-label" : "Pizza",
    "sentiment" : "MUST_HAVE",
    "type" : "keyword",
    "start-position" : 298,
    "end-position" : 303,
    "concept-id" : "aoCa_BaF_g6Z",
    "matched-string" : "pizza",
    "annotation-id" : 1
  }, {
    "preferred-label" : "Heltid",
    "type" : "worktime-extent",
    "start-position" : 391,
    "end-position" : 404,
    "concept-id" : "6YE1_gAC_R2G",
    "matched-string" : "heltidstjänst",
    "annotation-id" : 2
  } ],
  "text" : "Pizza/kök\nKringelgården är ett hantverksbageri i tredje generationen.\n\nVi söker dig som är engagerad, har lätt till ett leende och är service minded. Du ska ha tagit studenten och vara ansvarstagande.\n\nDu ska gärna ha erfarenhet av att arbeta med råvaror och ha ett stort intresse av mat. Vi bakar pizza, serverar sallader, soppa, säljer bröd och hanterar espressomaskin.\n\nNu erbjuder vi en heltidstjänst i vårt kök, där vi söker dig som är en god lagspelare, serviceinriktad, gillar kundkontakt och högt tempo.\n\nMed oss får du jobba i en lokal där det bakats och sålts bröd av hög kvalitet sedan 1902, och där samma familj i tre generationer arbetat med, och förvaltat verksamheten sedan 1942."
}