{
  "meta" : {
    "jobad" : {
      "description" : {
        "requirements" : null,
        "needs" : null,
        "company_information" : null,
        "text_formatted" : "<h4>Är du en tekniskt intresserad person som drivs av att lösa problem? Vi söker två Underhållsmekaniker till Södra Wood i Mönsterås!</h4><p><strong>ARBETSBESKRIVNING</strong><br>Vi söker två drivna och mångkunniga underhållsmekaniker till underhållsavdelningen där du ansvarar för mekaniska arbetsuppgifter som exempelvis reparation, drift och underhåll av företagets maskiner. Arbetet innebär både förebyggande och avhjälpande underhåll tar du tar emot, bereder, planerar, utför och rapporterar ditt arbete på ett effektivt sett. Du ser till att ditt eget arbete utförs enligt fastställda rutiner, instruktioner och verksamhetsprocesser. <br><br><strong>DIN PROFIL</strong><br>Arbetet ställer krav på att du har god kunskap inom mekanik, är tekniskt intresserad och ser dig själv som en problemlösare. Arbetet innebär ständigt nya förbättringar och utmaningar varför vi ser att du har en klurig ådra. Vi ser att du är en ansvarskännande, noggrann samt flexibel person med god samarbetsförmåga. För att trivas hos oss värdesätter du säkerheten högt och är noggrann i ditt arbete. Du trivs i ett nära samarbete med dina kollegor i teamet men har även förmågan att driva på ditt eget arbete. Vi ser att du har B-körkort, heta arbeten-certifikat och goda kunskaper i svenska. <br><br>Tjänstgöringsort: Mönsterås<br>Omfattning: Heltid med start enligt överenskommelse<br>Arbetstid: 3-skift<br>Anställning: Tjänsten innebär initialt en anställning i OnePartnerGroups konsultverksamhet med goda möjligheter att på sikt bli direkt anställd hos kund.<br><br>Sista ansökningsdag är den 26 juli 2022 men vi tillämpar löpande urval så tveka inte att skicka in din ansökan redan idag. Läs gärna mer och ansök via <a href=\"https://eur03.safelinks.protection.outlook.com/?url=http%3A%2F%2Fwww.onepartnergroup.se%2Fdata=05%7C01%7Csanna.olsson%40onepartnergroup.se%7C8f98f8c8658840856cac08da3d64c4f1%7C3f99a14678f443a6b7e3d6a08a703c09%7C0%7C0%7C637889800457348564%7CUnknown%7CTWFpbGZsb3d8eyJWIjoiMC4wLjAwMDAiLCJQIjoiV2luMzIiLCJBTiI6Ik1haWwiLCJXVCI6Mn0%3D%7C1000%7C%7C%7Csdata=1ECkoGrJhoMP8ycLiVHU5ZWnMWza6oWIrfDm24EhAsM%3Dreserved=0\">www.onepartnergroup.se</a>. För ytterligare frågor om tjänsten är du varmt välkommen att kontakta Angelica Persson på 0708150261 eller angelica.persson@onepartnergroup.se.</p>",
        "conditions" : null,
        "text" : "Är du en tekniskt intresserad person som drivs av att lösa problem? Vi söker två Underhållsmekaniker till Södra Wood i Mönsterås!\nARBETSBESKRIVNING\nVi söker två drivna och mångkunniga underhållsmekaniker till underhållsavdelningen där du ansvarar för mekaniska arbetsuppgifter som exempelvis reparation, drift och underhåll av företagets maskiner. Arbetet innebär både förebyggande och avhjälpande underhåll tar du tar emot, bereder, planerar, utför och rapporterar ditt arbete på ett effektivt sett. Du ser till att ditt eget arbete utförs enligt fastställda rutiner, instruktioner och verksamhetsprocesser. \n\nDIN PROFIL\nArbetet ställer krav på att du har god kunskap inom mekanik, är tekniskt intresserad och ser dig själv som en problemlösare. Arbetet innebär ständigt nya förbättringar och utmaningar varför vi ser att du har en klurig ådra. Vi ser att du är en ansvarskännande, noggrann samt flexibel person med god samarbetsförmåga. För att trivas hos oss värdesätter du säkerheten högt och är noggrann i ditt arbete. Du trivs i ett nära samarbete med dina kollegor i teamet men har även förmågan att driva på ditt eget arbete. Vi ser att du har B-körkort, heta arbeten-certifikat och goda kunskaper i svenska. \n\nTjänstgöringsort: Mönsterås\nOmfattning: Heltid med start enligt överenskommelse\nArbetstid: 3-skift\nAnställning: Tjänsten innebär initialt en anställning i OnePartnerGroups konsultverksamhet med goda möjligheter att på sikt bli direkt anställd hos kund.\n\nSista ansökningsdag är den 26 juli 2022 men vi tillämpar löpande urval så tveka inte att skicka in din ansökan redan idag. Läs gärna mer och ansök via www.onepartnergroup.se. För ytterligare frågor om tjänsten är du varmt välkommen att kontakta Angelica Persson på 0708150261 eller angelica.persson@onepartnergroup.se."
      },
      "headline" : "Underhållsmekaniker",
      "driving_license" : [ {
        "concept_id" : "VTK8_WRx_GcM",
        "label" : "B",
        "legacy_ams_taxonomy_id" : "3"
      } ],
      "employer" : {
        "email" : null,
        "phone_number" : null,
        "organization_number" : "5590758180",
        "name" : "OnePartnerGroup Kalmar AB",
        "url" : "www.sodra.com",
        "workplace" : "Södra Skogsägarna ekonomisk förening"
      },
      "removed_date" : null,
      "logo_url" : null,
      "last_publication_date" : "2022-07-26T23:59:59",
      "number_of_vacancies" : 2,
      "occupation" : {
        "concept_id" : "yeAd_C6h_DqV",
        "label" : "Sågverksarbetare",
        "legacy_ams_taxonomy_id" : "763"
      },
      "occupation_group" : {
        "concept_id" : "UdrS_qzV_P7i",
        "label" : "Operatörer inom sågverk, hyvleri och plywood m.m.",
        "legacy_ams_taxonomy_id" : "8173"
      },
      "employment_type" : {
        "concept_id" : "PFZr_Syz_cUq",
        "label" : "Vanlig anställning",
        "legacy_ams_taxonomy_id" : "1"
      },
      "webpage_url" : "https://arbetsformedlingen.se/platsbanken/annonser/26293269",
      "driving_license_required" : true,
      "application_contacts" : [ {
        "description" : "Angelica Persson",
        "email" : "angelica.persson@onepartnergroup.se",
        "telephone" : null,
        "name" : null,
        "contact_type" : null
      } ],
      "duration" : {
        "concept_id" : "a7uU_j21_mkL",
        "label" : "Tills vidare",
        "legacy_ams_taxonomy_id" : "1"
      },
      "nice_to_have" : {
        "education_level" : [ ],
        "work_experiences" : [ ],
        "skills" : [ ],
        "education" : [ ],
        "languages" : [ ]
      },
      "application_details" : {
        "via_af" : false,
        "email" : null,
        "other" : null,
        "reference" : null,
        "url" : "https://apply.recman.no/job_post.php?id=280664&path=ams&sub_id=462",
        "information" : null
      },
      "source_type" : "VIA_PLATSBANKEN_DXA",
      "application_deadline" : "2022-07-26T23:59:59",
      "external_id" : "46-559075-8180-280664629aea5ad767e",
      "workplace_address" : {
        "coordinates" : [ 16.44312, 57.04158 ],
        "city" : null,
        "postcode" : null,
        "municipality" : "Mönsterås",
        "region_concept_id" : "9QUH_2bb_6Np",
        "region" : "Kalmar län",
        "country_code" : "199",
        "region_code" : "08",
        "municipality_concept_id" : "8eEp_iz4_cNN",
        "country_concept_id" : "i46j_HmG_v64",
        "municipality_code" : "0861",
        "street_address" : null,
        "country" : "Sverige"
      },
      "id" : "26293269",
      "experience_required" : true,
      "working_hours_type" : {
        "concept_id" : "6YE1_gAC_R2G",
        "label" : "Heltid",
        "legacy_ams_taxonomy_id" : "1"
      },
      "access" : null,
      "timestamp" : 1657006222432,
      "must_have" : {
        "education_level" : [ ],
        "work_experiences" : [ {
          "concept_id" : "yeAd_C6h_DqV",
          "weight" : 10,
          "label" : "Sågverksarbetare",
          "legacy_ams_taxonomy_id" : "763"
        } ],
        "skills" : [ ],
        "education" : [ ],
        "languages" : [ ]
      },
      "occupation_field" : {
        "concept_id" : "wTEr_CBC_bqh",
        "label" : "Industriell tillverkning",
        "legacy_ams_taxonomy_id" : "9"
      },
      "scope_of_work" : {
        "min" : 100,
        "max" : 100
      },
      "salary_type" : {
        "concept_id" : "oG8G_9cW_nRf",
        "label" : "Fast månads- vecko- eller timlön",
        "legacy_ams_taxonomy_id" : "1"
      },
      "removed" : false,
      "salary_description" : null,
      "access_to_own_car" : true,
      "publication_date" : "2022-07-05T09:30:22"
    },
    "name" : "Underhållsmekaniker",
    "user" : "hannes"
  },
  "sha1" : "d4d6a1b76afc4a58f4ecbd32203bcc66545b7a41",
  "annotations" : [ {
    "preferred-label" : "Underhållsmekaniker",
    "sentiment" : "MUST_HAVE",
    "type" : "occupation-name",
    "start-position" : 0,
    "end-position" : 19,
    "concept-id" : "ci6b_Nc2_FmS",
    "matched-string" : "underhållsmekaniker",
    "annotation-id" : 0
  }, {
    "preferred-label" : "Underhållsmekaniker",
    "sentiment" : "MUST_HAVE",
    "type" : "occupation-name",
    "start-position" : 101,
    "end-position" : 120,
    "concept-id" : "ci6b_Nc2_FmS",
    "matched-string" : "underhållsmekaniker",
    "annotation-id" : 1
  }, {
    "preferred-label" : "Mönsterås",
    "type" : "municipality",
    "start-position" : 139,
    "end-position" : 148,
    "concept-id" : "8eEp_iz4_cNN",
    "matched-string" : "Mönsterås",
    "annotation-id" : 6
  }, {
    "preferred-label" : "Underhållsmekaniker",
    "sentiment" : "MUST_HAVE",
    "type" : "occupation-name",
    "start-position" : 204,
    "end-position" : 223,
    "concept-id" : "ci6b_Nc2_FmS",
    "matched-string" : "underhållsmekaniker",
    "annotation-id" : 2
  }, {
    "preferred-label" : "Mekanik",
    "sentiment" : "MUST_HAVE",
    "type" : "skill",
    "start-position" : 694,
    "end-position" : 701,
    "concept-id" : "ygEQ_Pwp_ozn",
    "matched-string" : "mekanik",
    "annotation-id" : 3
  }, {
    "preferred-label" : "noggrannhet",
    "type" : "esco-skill",
    "start-position" : 903,
    "end-position" : 911,
    "concept-id" : "mrsW_EkL_KRD",
    "matched-string" : "noggrann",
    "annotation-id" : 7
  }, {
    "preferred-label" : "noggrannhet",
    "type" : "esco-skill",
    "start-position" : 1020,
    "end-position" : 1028,
    "concept-id" : "mrsW_EkL_KRD",
    "matched-string" : "noggrann",
    "annotation-id" : 8
  }, {
    "preferred-label" : "samarbeta med kolleger",
    "type" : "esco-skill",
    "start-position" : 1064,
    "end-position" : 1077,
    "concept-id" : "X15R_797_q62",
    "matched-string" : "samarbete med",
    "annotation-id" : 9
  }, {
    "preferred-label" : "samarbeta med kolleger",
    "type" : "esco-skill",
    "start-position" : 1083,
    "end-position" : 1091,
    "concept-id" : "X15R_797_q62",
    "matched-string" : "kollegor",
    "annotation-id" : 10
  }, {
    "preferred-label" : "B",
    "type" : "driving-licence",
    "start-position" : 1172,
    "end-position" : 1181,
    "concept-id" : "VTK8_WRx_GcM",
    "matched-string" : "B-körkort",
    "annotation-id" : 11
  }, {
    "preferred-label" : "Certifikat, heta arbeten",
    "type" : "skill",
    "start-position" : 1183,
    "end-position" : 1206,
    "concept-id" : "Q7eC_B7g_QiU",
    "matched-string" : "heta arbeten-certifikat",
    "annotation-id" : 12
  }, {
    "preferred-label" : "Svenska",
    "sentiment" : "MUST_HAVE",
    "type" : "language",
    "start-position" : 1228,
    "end-position" : 1235,
    "concept-id" : "zSLA_vw2_FXN",
    "matched-string" : "svenska",
    "annotation-id" : 5
  }, {
    "preferred-label" : "Heltid",
    "type" : "worktime-extent",
    "start-position" : 1279,
    "end-position" : 1285,
    "concept-id" : "6YE1_gAC_R2G",
    "matched-string" : "Heltid",
    "annotation-id" : 13
  } ],
  "text" : "Underhållsmekaniker\nÄr du en tekniskt intresserad person som drivs av att lösa problem? Vi söker två Underhållsmekaniker till Södra Wood i Mönsterås!\nARBETSBESKRIVNING\nVi söker två drivna och mångkunniga underhållsmekaniker till underhållsavdelningen där du ansvarar för mekaniska arbetsuppgifter som exempelvis reparation, drift och underhåll av företagets maskiner. Arbetet innebär både förebyggande och avhjälpande underhåll tar du tar emot, bereder, planerar, utför och rapporterar ditt arbete på ett effektivt sett. Du ser till att ditt eget arbete utförs enligt fastställda rutiner, instruktioner och verksamhetsprocesser. \n\nDIN PROFIL\nArbetet ställer krav på att du har god kunskap inom mekanik, är tekniskt intresserad och ser dig själv som en problemlösare. Arbetet innebär ständigt nya förbättringar och utmaningar varför vi ser att du har en klurig ådra. Vi ser att du är en ansvarskännande, noggrann samt flexibel person med god samarbetsförmåga. För att trivas hos oss värdesätter du säkerheten högt och är noggrann i ditt arbete. Du trivs i ett nära samarbete med dina kollegor i teamet men har även förmågan att driva på ditt eget arbete. Vi ser att du har B-körkort, heta arbeten-certifikat och goda kunskaper i svenska. \n\nTjänstgöringsort: Mönsterås\nOmfattning: Heltid med start enligt överenskommelse\nArbetstid: 3-skift\nAnställning: Tjänsten innebär initialt en anställning i OnePartnerGroups konsultverksamhet med goda möjligheter att på sikt bli direkt anställd hos kund.\n\nSista ansökningsdag är den 26 juli 2022 men vi tillämpar löpande urval så tveka inte att skicka in din ansökan redan idag. Läs gärna mer och ansök via www.onepartnergroup.se. För ytterligare frågor om tjänsten är du varmt välkommen att kontakta Angelica Persson på 0708150261 eller angelica.persson@onepartnergroup.se."
}