{
  "meta" : {
    "jobad" : {
      "description" : {
        "requirements" : null,
        "needs" : null,
        "company_information" : null,
        "text_formatted" : "<p>Vi på Miri Bygg AB växer varje dag och behovet är stort för nya medarbetare så nu söker vi 2-3 snickare med erfarenhet och självgående </p>",
        "conditions" : null,
        "text" : "Vi på Miri Bygg AB växer varje dag och behovet är stort för nya medarbetare så nu söker vi 2-3 snickare med erfarenhet och självgående"
      },
      "headline" : "snickare",
      "driving_license" : null,
      "employer" : {
        "email" : null,
        "phone_number" : null,
        "organization_number" : "5568321300",
        "name" : "Miri Bygg AB",
        "url" : null,
        "workplace" : "Miri Bygg AB"
      },
      "removed_date" : null,
      "logo_url" : null,
      "last_publication_date" : "2022-07-17T00:00:00",
      "number_of_vacancies" : 3,
      "occupation" : {
        "concept_id" : "4Z7F_oBG_vMG",
        "label" : "Träarbetare/Snickare",
        "legacy_ams_taxonomy_id" : "6581"
      },
      "occupation_group" : {
        "concept_id" : "9mJN_VwW_Xjg",
        "label" : "Träarbetare, snickare m.fl.",
        "legacy_ams_taxonomy_id" : "7111"
      },
      "employment_type" : {
        "concept_id" : "PFZr_Syz_cUq",
        "label" : "Vanlig anställning",
        "legacy_ams_taxonomy_id" : "1"
      },
      "webpage_url" : "https://arbetsformedlingen.se/platsbanken/annonser/26286905",
      "driving_license_required" : false,
      "application_contacts" : [ ],
      "duration" : {
        "concept_id" : "a7uU_j21_mkL",
        "label" : "Tills vidare",
        "legacy_ams_taxonomy_id" : "1"
      },
      "nice_to_have" : {
        "education_level" : [ ],
        "work_experiences" : [ ],
        "skills" : [ ],
        "education" : [ ],
        "languages" : [ ]
      },
      "application_details" : {
        "via_af" : false,
        "email" : "info@miribygg.se",
        "other" : "via post ",
        "reference" : null,
        "url" : null,
        "information" : null
      },
      "source_type" : "VIA_ANNONSERA",
      "application_deadline" : "2022-07-17T00:00:00",
      "external_id" : null,
      "workplace_address" : {
        "coordinates" : [ 13.068685313781573, 55.57752923667949 ],
        "city" : "Malmö",
        "postcode" : "21235",
        "municipality" : "Malmö",
        "region_concept_id" : "CaRE_1nn_cSU",
        "region" : "Skåne län",
        "country_code" : "199",
        "region_code" : "12",
        "municipality_concept_id" : "oYPt_yRA_Smm",
        "country_concept_id" : "i46j_HmG_v64",
        "municipality_code" : "1280",
        "street_address" : "Remontgatan 12",
        "country" : "Sverige"
      },
      "id" : "26286905",
      "experience_required" : true,
      "working_hours_type" : {
        "concept_id" : "6YE1_gAC_R2G",
        "label" : "Heltid",
        "legacy_ams_taxonomy_id" : "1"
      },
      "access" : null,
      "timestamp" : 1656868100774,
      "must_have" : {
        "education_level" : [ ],
        "work_experiences" : [ {
          "concept_id" : "4Z7F_oBG_vMG",
          "weight" : 10,
          "label" : "Träarbetare/Snickare",
          "legacy_ams_taxonomy_id" : "6581"
        } ],
        "skills" : [ ],
        "education" : [ ],
        "languages" : [ ]
      },
      "occupation_field" : {
        "concept_id" : "j7Cq_ZJe_GkT",
        "label" : "Bygg och anläggning",
        "legacy_ams_taxonomy_id" : "2"
      },
      "scope_of_work" : {
        "min" : 0,
        "max" : 100
      },
      "salary_type" : {
        "concept_id" : "oG8G_9cW_nRf",
        "label" : "Fast månads- vecko- eller timlön",
        "legacy_ams_taxonomy_id" : "1"
      },
      "removed" : false,
      "salary_description" : null,
      "access_to_own_car" : false,
      "publication_date" : "2022-07-03T19:08:20"
    },
    "name" : "snickare",
    "user" : "hannes"
  },
  "sha1" : "71b848490c6d5b86dbd401160274b331ef805958",
  "annotations" : [ {
    "preferred-label" : "snickare",
    "sentiment" : "MUST_HAVE",
    "type" : "esco-occupation",
    "start-position" : 0,
    "end-position" : 8,
    "concept-id" : "qhAJ_Euo_tNx",
    "matched-string" : "snickare",
    "annotation-id" : 0
  }, {
    "preferred-label" : "snickare",
    "sentiment" : "MUST_HAVE",
    "type" : "esco-occupation",
    "start-position" : 104,
    "end-position" : 112,
    "concept-id" : "qhAJ_Euo_tNx",
    "matched-string" : "snickare",
    "annotation-id" : 1
  }, {
    "preferred-label" : "arbeta självständigt",
    "type" : "esco-skill",
    "start-position" : 132,
    "end-position" : 143,
    "concept-id" : "NyFu_HHd_zhz",
    "matched-string" : "självgående",
    "annotation-id" : 2
  } ],
  "text" : "snickare\nVi på Miri Bygg AB växer varje dag och behovet är stort för nya medarbetare så nu söker vi 2-3 snickare med erfarenhet och självgående"
}