{
  "meta" : {
    "jobad" : {
      "description" : {
        "requirements" : null,
        "needs" : null,
        "company_information" : null,
        "text_formatted" : "Om tjänsten\n\nVi söker en butiksmedarbetare till Ica Supermarket söder. Du kommer arbeta med kassa, post och spel. Vi söker dig med ett enormt butiksdriv och servicekänsla. Du är den som tillsammans med dina medarbetare, ser till att avdelningen och butiken drivs framåt och säkerställs på bästa sätt efter uppsatta mål.\n\nKunden är ständigt i fokus. Du är engagerad och motiverad som person. Givetvis tycker du det är kul att \"hugga i\" och hitta lösningar för att optimera avdelningen på bästa sätt.\n\nKunskap om förbutik är ett krav.\n\nArbetsuppgifter\n\nDagligt förbutiksarbete\nSvenska Spel\nATG och post\nOrdning och reda i förbutiken\nFölja uppsatta rutiner och regler\n\nPersonliga egenskaper\n\nVi ser gärna att som söker gillar att arbeta i ett högt tempo.\n\nDu behöver vara en lagspelare för att få ihop arbetsuppgifterna för dagen, men du ska även kunna arbeta självständigt och ha en stor ansvarskänsla för det arbete du utför. Du arbetar alltid fokuserat och utför arbetet med en högklassig servicekänsla.\n\nVi ser gärna att du som söker har en flexibel inställning till dina arbetsuppgifter och är behjälplig på andra avdelningar när det behövs.\n\nAnställningsform\n\nCa 30 h/v provanställning tillämpas\n\nStart senast det 15/6\n\nKvällar och helger förekommer\n\nLön enligt handelskollektiv avtal\n\nIntervjuer sker löpande\n\nOm oss\n\nMRC Bemanning ansvarar för rekryteringen av denna tjänst.\n\nHar du frågor kring dessa tjänster, mejla Konsultchef på MRC Syd: bokningsansvarig@mrcbemanning.se\n\nObservera att vi inte tar emot några ansökningar via e-post, du ansöker via länken nedan. Då urvalet sker löpande ser vi gärna att du skickar din ansökan snarast.\n\nVi ser fram emot din ansökan!",
        "conditions" : "Deltid\r\nAnställningstid enligt överenskommelse",
        "text" : "Om tjänsten\n\nVi söker en butiksmedarbetare till Ica Supermarket söder. Du kommer arbeta med kassa, post och spel. Vi söker dig med ett enormt butiksdriv och servicekänsla. Du är den som tillsammans med dina medarbetare, ser till att avdelningen och butiken drivs framåt och säkerställs på bästa sätt efter uppsatta mål.\n\nKunden är ständigt i fokus. Du är engagerad och motiverad som person. Givetvis tycker du det är kul att \"hugga i\" och hitta lösningar för att optimera avdelningen på bästa sätt.\n\nKunskap om förbutik är ett krav.\n\nArbetsuppgifter\n\nDagligt förbutiksarbete\nSvenska Spel\nATG och post\nOrdning och reda i förbutiken\nFölja uppsatta rutiner och regler\n\nPersonliga egenskaper\n\nVi ser gärna att som söker gillar att arbeta i ett högt tempo.\n\nDu behöver vara en lagspelare för att få ihop arbetsuppgifterna för dagen, men du ska även kunna arbeta självständigt och ha en stor ansvarskänsla för det arbete du utför. Du arbetar alltid fokuserat och utför arbetet med en högklassig servicekänsla.\n\nVi ser gärna att du som söker har en flexibel inställning till dina arbetsuppgifter och är behjälplig på andra avdelningar när det behövs.\n\nAnställningsform\n\nCa 30 h/v provanställning tillämpas\n\nStart senast det 15/6\n\nKvällar och helger förekommer\n\nLön enligt handelskollektiv avtal\n\nIntervjuer sker löpande\n\nOm oss\n\nMRC Bemanning ansvarar för rekryteringen av denna tjänst.\n\nHar du frågor kring dessa tjänster, mejla Konsultchef på MRC Syd: bokningsansvarig@mrcbemanning.se\n\nObservera att vi inte tar emot några ansökningar via e-post, du ansöker via länken nedan. Då urvalet sker löpande ser vi gärna att du skickar din ansökan snarast.\n\nVi ser fram emot din ansökan!"
      },
      "headline" : "Medarbetare till förbutiken till Ica Supermarket Söder",
      "driving_license" : null,
      "employer" : {
        "email" : null,
        "phone_number" : null,
        "organization_number" : "5566471412",
        "name" : "Mrc Stockholm AB",
        "url" : "https://mrcbemanning.se/",
        "workplace" : "MRC Bemanning AB"
      },
      "removed_date" : null,
      "logo_url" : "https://www.arbetsformedlingen.se/rest/arbetsgivare/rest/af/v3/organisation/5566471412/logotyper/logo.png",
      "last_publication_date" : "2023-01-01T23:59:59",
      "number_of_vacancies" : 1,
      "occupation" : {
        "concept_id" : "pBhS_6fg_727",
        "label" : "Butikssäljare/Medarbetare, dagligvaror",
        "legacy_ams_taxonomy_id" : "2284"
      },
      "occupation_group" : {
        "concept_id" : "s1Qk_o98_2o1",
        "label" : "Butikssäljare, dagligvaror",
        "legacy_ams_taxonomy_id" : "5222"
      },
      "employment_type" : {
        "concept_id" : "PFZr_Syz_cUq",
        "label" : "Vanlig anställning",
        "legacy_ams_taxonomy_id" : "1"
      },
      "webpage_url" : "https://arbetsformedlingen.se/platsbanken/annonser/26331857",
      "driving_license_required" : false,
      "application_contacts" : [ {
        "description" : "Ann-Charlott Kvant Eriksson",
        "email" : "ann-charlott@mrcbemanning.se",
        "telephone" : "0733574351",
        "name" : null,
        "contact_type" : null
      } ],
      "duration" : {
        "concept_id" : "qQUd_4qe_NDT",
        "label" : "6 månader eller längre",
        "legacy_ams_taxonomy_id" : "2"
      },
      "nice_to_have" : {
        "education_level" : [ ],
        "work_experiences" : [ ],
        "skills" : [ ],
        "education" : [ ],
        "languages" : [ ]
      },
      "application_details" : {
        "via_af" : false,
        "email" : null,
        "other" : null,
        "reference" : null,
        "url" : "https://jobb.mrcbemanning.se/jobs/1716997-medarbetare-till-forbutiken-till-ica-supermarket-soder?promotion=394761-arbetsformedlingen",
        "information" : null
      },
      "source_type" : "VIA_PLATSBANKEN_DXA",
      "application_deadline" : "2023-01-01T23:59:59",
      "external_id" : "46-556647-1412-1716997-25",
      "workplace_address" : {
        "coordinates" : [ 13.003822, 55.60498 ],
        "city" : null,
        "postcode" : null,
        "municipality" : "Malmö",
        "region_concept_id" : "CaRE_1nn_cSU",
        "region" : "Skåne län",
        "country_code" : "199",
        "region_code" : "12",
        "municipality_concept_id" : "oYPt_yRA_Smm",
        "country_concept_id" : "i46j_HmG_v64",
        "municipality_code" : "1280",
        "street_address" : null,
        "country" : "Sverige"
      },
      "id" : "26331857",
      "experience_required" : true,
      "working_hours_type" : {
        "concept_id" : "947z_JGS_Uk2",
        "label" : "Deltid",
        "legacy_ams_taxonomy_id" : "2"
      },
      "access" : null,
      "timestamp" : 1657889702832,
      "must_have" : {
        "education_level" : [ ],
        "work_experiences" : [ {
          "concept_id" : "pBhS_6fg_727",
          "weight" : 10,
          "label" : "Butikssäljare, dagligvaror/Medarbetare, dagligvaror",
          "legacy_ams_taxonomy_id" : "2284"
        } ],
        "skills" : [ ],
        "education" : [ ],
        "languages" : [ ]
      },
      "occupation_field" : {
        "concept_id" : "RPTn_bxG_ExZ",
        "label" : "Försäljning, inköp, marknadsföring",
        "legacy_ams_taxonomy_id" : "5"
      },
      "scope_of_work" : {
        "min" : 0,
        "max" : 100
      },
      "salary_type" : {
        "concept_id" : "oG8G_9cW_nRf",
        "label" : "Fast månads- vecko- eller timlön",
        "legacy_ams_taxonomy_id" : "1"
      },
      "removed" : false,
      "salary_description" : "Lön enligt överenskommelse",
      "access_to_own_car" : false,
      "publication_date" : "2022-07-15T14:55:02"
    },
    "name" : "Medarbetare till förbutiken till Ica Supermarket Söder",
    "user" : "hannes"
  },
  "sha1" : "1b8c66682b251e57dd3ae26a00b903149140db6d",
  "annotations" : [ {
    "preferred-label" : "Butiksmedarbetare",
    "sentiment" : "MUST_HAVE",
    "type" : "keyword",
    "start-position" : 80,
    "end-position" : 97,
    "concept-id" : "ifET_wHx_6w5",
    "matched-string" : "butiksmedarbetare",
    "annotation-id" : 0
  }, {
    "preferred-label" : "sköta en kassa",
    "type" : "esco-skill",
    "start-position" : 147,
    "end-position" : 152,
    "concept-id" : "USNU_LMY_prY",
    "matched-string" : "kassa",
    "annotation-id" : 3
  }, {
    "preferred-label" : "arbeta självständigt",
    "type" : "esco-skill",
    "start-position" : 905,
    "end-position" : 925,
    "concept-id" : "NyFu_HHd_zhz",
    "matched-string" : "arbeta självständigt",
    "annotation-id" : 4
  }, {
    "preferred-label" : "Deltid",
    "type" : "worktime-extent",
    "start-position" : 1221,
    "end-position" : 1227,
    "concept-id" : "947z_JGS_Uk2",
    "matched-string" : "30 h/v",
    "annotation-id" : 5
  } ],
  "text" : "Medarbetare till förbutiken till Ica Supermarket Söder\nOm tjänsten\n\nVi söker en butiksmedarbetare till Ica Supermarket söder. Du kommer arbeta med kassa, post och spel. Vi söker dig med ett enormt butiksdriv och servicekänsla. Du är den som tillsammans med dina medarbetare, ser till att avdelningen och butiken drivs framåt och säkerställs på bästa sätt efter uppsatta mål.\n\nKunden är ständigt i fokus. Du är engagerad och motiverad som person. Givetvis tycker du det är kul att \"hugga i\" och hitta lösningar för att optimera avdelningen på bästa sätt.\n\nKunskap om förbutik är ett krav.\n\nArbetsuppgifter\n\nDagligt förbutiksarbete\nSvenska Spel\nATG och post\nOrdning och reda i förbutiken\nFölja uppsatta rutiner och regler\n\nPersonliga egenskaper\n\nVi ser gärna att som söker gillar att arbeta i ett högt tempo.\n\nDu behöver vara en lagspelare för att få ihop arbetsuppgifterna för dagen, men du ska även kunna arbeta självständigt och ha en stor ansvarskänsla för det arbete du utför. Du arbetar alltid fokuserat och utför arbetet med en högklassig servicekänsla.\n\nVi ser gärna att du som söker har en flexibel inställning till dina arbetsuppgifter och är behjälplig på andra avdelningar när det behövs.\n\nAnställningsform\n\nCa 30 h/v provanställning tillämpas\n\nStart senast det 15/6\n\nKvällar och helger förekommer\n\nLön enligt handelskollektiv avtal\n\nIntervjuer sker löpande\n\nOm oss\n\nMRC Bemanning ansvarar för rekryteringen av denna tjänst.\n\nHar du frågor kring dessa tjänster, mejla Konsultchef på MRC Syd: bokningsansvarig@mrcbemanning.se\n\nObservera att vi inte tar emot några ansökningar via e-post, du ansöker via länken nedan. Då urvalet sker löpande ser vi gärna att du skickar din ansökan snarast.\n\nVi ser fram emot din ansökan!"
}