{
  "meta" : {
    "jobad" : {
      "description" : {
        "requirements" : null,
        "needs" : null,
        "company_information" : null,
        "text_formatted" : "Nu finns chansen för dig som vill bli en del av ett starkt och kompetent utvecklingsbolag med huvudkontor i Norrköping. Som Supporttekniker hos Briljant blir du en del av det team som arbetar med teknisk support av Briljants molntjänst. Rollen passar både dig som är i starten av din karriär eller dig som har några års erfarenhet inom teknisk support. Här får du möjlighet att ta ett stort eget ansvar och utvecklas i din roll!\n\nOM TJÄNSTEN \nBriljant Ekonomisystem AB äger och utvecklar Briljant Ekonomisystem. Bakom produkten står ett utvecklingsbolag samt åtta fristående återförsäljarbolag. Briljant växer och välkomnar nu ytterligare en kollega till avdelningen för Briljants molntjänst. Briljant ASP är en molnbaserad version av Briljant Ekonomisystem som idag har ca 6400 användare. Du blir en del av teamet som sköter support, drift och administration av ASP. Teamet, som präglas av gemenskap och tätt samarbete, består idag av 3 Supporttekniker med stor kompetens inom området som kommer att stötta dig i din introduktion och i arbetet.\n\nSåhär beskriver Jack varför han trivs i rollen som Supporttekniker:\n\n”Jag är både 1st, 2nd och 3rd linesupport vilket gör rollen varierande och utvecklande. Vi är ett litet bolag med härlig stämning där alla jobbar för att utveckla Briljant tillsammans. Vi har också trevliga kunder som vi har en bra relation med vilket gör jobbet extra roligt.”\n\n#\n\nDu erbjuds\n\n\n* Ett utvecklande och utmanande arbete med mycket eget ansvar\n* Goda möjligheter till kompetensutveckling och att fördjupa din tekniska kompetens inom områden som du tycker är spännande\n* Arbete i en organisation där alla, oavsett roll, bidrar till att utveckla ekonomisystemet för att möta efterfrågan från kund\n* Möjlighet att arbeta i ett team som präglas av stark samhörighet med stor kompetens\n* Möjligheten att på sikt välja om du vill arbeta hemifrån eller på kontoret vissa dagar i veckan\n\n\nARBETSUPPGIFTER \n- Hantera beställningar och administrera konton\n- Hantera inkommande ärenden via mejl och telefon\n- Felsökning och problemlösning i Briljant ASP\n- Felsökning hos kunder med egen drift av Briljant Ekonomisystem\n- För dig med intresse och kunskap finns det även möjlighet att vidareutveckla och underhålla underliggande system för molntjänsten\n\nVI SÖKER DIG SOM \n- Har erfarenhet av liknande arbetsuppgifter inom teknisk support eller har läst tekniska ämnen på eftergymnasial nivå och har ett genuint intresse för IT\n- Har grundläggande kunskap i Windows Server, Active Directory, databaser och nätverk\n- Är obehindrad i svenska i tal och skrift samt har goda kunskaper i engelska\n\nDet är meriterande om du:\n\n\n* Har goda kunskaper i C# och VB.NET samt PowerShell\n\n\nFörutom detta är du:\n\n\n* Serviceinriktad och trivs med kundkontakt\n* Noggrann\n* Har en god problemlösningsförmåga\n* Har en god samarbetsförmåga\n\n\nÖvrig information\n\n\n* Start: September\n* Omfattning: Heltid\n* Placering: Norrköping\n* Rekryteringsprocessen hanteras av Academic Work och Briljants önskemål är att alla frågor rörande tjänsten hanteras av Academic Work.\n\n\nVi går igenom urvalet löpande och annonsen kan stängas ner innan tjänsten är tillsatt om vi gått över till urvals- och intervjufasen.\n\nINFORMATION OM FÖRETAGET \nBriljant Ekonomisystem är utvecklat i Sverige av personer med bakgrund från redovisning, revision, ekonomi och administration. Vi har varit verksamma sedan 1994 och är idag 35 personer och omsätter cirka 35 miljoner kronor. Mer än 60 000 företag sköter sin redovisning i Briljant.",
        "conditions" : "Heltid, tillsvidare\r\n08:00-17:00",
        "text" : "Nu finns chansen för dig som vill bli en del av ett starkt och kompetent utvecklingsbolag med huvudkontor i Norrköping. Som Supporttekniker hos Briljant blir du en del av det team som arbetar med teknisk support av Briljants molntjänst. Rollen passar både dig som är i starten av din karriär eller dig som har några års erfarenhet inom teknisk support. Här får du möjlighet att ta ett stort eget ansvar och utvecklas i din roll!\n\nOM TJÄNSTEN \nBriljant Ekonomisystem AB äger och utvecklar Briljant Ekonomisystem. Bakom produkten står ett utvecklingsbolag samt åtta fristående återförsäljarbolag. Briljant växer och välkomnar nu ytterligare en kollega till avdelningen för Briljants molntjänst. Briljant ASP är en molnbaserad version av Briljant Ekonomisystem som idag har ca 6400 användare. Du blir en del av teamet som sköter support, drift och administration av ASP. Teamet, som präglas av gemenskap och tätt samarbete, består idag av 3 Supporttekniker med stor kompetens inom området som kommer att stötta dig i din introduktion och i arbetet.\n\nSåhär beskriver Jack varför han trivs i rollen som Supporttekniker:\n\n”Jag är både 1st, 2nd och 3rd linesupport vilket gör rollen varierande och utvecklande. Vi är ett litet bolag med härlig stämning där alla jobbar för att utveckla Briljant tillsammans. Vi har också trevliga kunder som vi har en bra relation med vilket gör jobbet extra roligt.”\n\n#\n\nDu erbjuds\n\n\n* Ett utvecklande och utmanande arbete med mycket eget ansvar\n* Goda möjligheter till kompetensutveckling och att fördjupa din tekniska kompetens inom områden som du tycker är spännande\n* Arbete i en organisation där alla, oavsett roll, bidrar till att utveckla ekonomisystemet för att möta efterfrågan från kund\n* Möjlighet att arbeta i ett team som präglas av stark samhörighet med stor kompetens\n* Möjligheten att på sikt välja om du vill arbeta hemifrån eller på kontoret vissa dagar i veckan\n\n\nARBETSUPPGIFTER \n- Hantera beställningar och administrera konton\n- Hantera inkommande ärenden via mejl och telefon\n- Felsökning och problemlösning i Briljant ASP\n- Felsökning hos kunder med egen drift av Briljant Ekonomisystem\n- För dig med intresse och kunskap finns det även möjlighet att vidareutveckla och underhålla underliggande system för molntjänsten\n\nVI SÖKER DIG SOM \n- Har erfarenhet av liknande arbetsuppgifter inom teknisk support eller har läst tekniska ämnen på eftergymnasial nivå och har ett genuint intresse för IT\n- Har grundläggande kunskap i Windows Server, Active Directory, databaser och nätverk\n- Är obehindrad i svenska i tal och skrift samt har goda kunskaper i engelska\n\nDet är meriterande om du:\n\n\n* Har goda kunskaper i C# och VB.NET samt PowerShell\n\n\nFörutom detta är du:\n\n\n* Serviceinriktad och trivs med kundkontakt\n* Noggrann\n* Har en god problemlösningsförmåga\n* Har en god samarbetsförmåga\n\n\nÖvrig information\n\n\n* Start: September\n* Omfattning: Heltid\n* Placering: Norrköping\n* Rekryteringsprocessen hanteras av Academic Work och Briljants önskemål är att alla frågor rörande tjänsten hanteras av Academic Work.\n\n\nVi går igenom urvalet löpande och annonsen kan stängas ner innan tjänsten är tillsatt om vi gått över till urvals- och intervjufasen.\n\nINFORMATION OM FÖRETAGET \nBriljant Ekonomisystem är utvecklat i Sverige av personer med bakgrund från redovisning, revision, ekonomi och administration. Vi har varit verksamma sedan 1994 och är idag 35 personer och omsätter cirka 35 miljoner kronor. Mer än 60 000 företag sköter sin redovisning i Briljant."
      },
      "headline" : "Supporttekniker till Briljant i Norrköping",
      "driving_license" : null,
      "employer" : {
        "email" : null,
        "phone_number" : null,
        "organization_number" : "5565595450",
        "name" : "Academic Work Sweden AB",
        "url" : "http://www.academicwork.se",
        "workplace" : "Academic Work"
      },
      "removed_date" : null,
      "logo_url" : "https://www.arbetsformedlingen.se/rest/arbetsgivare/rest/af/v3/organisation/5565595450/logotyper/logo.png",
      "last_publication_date" : "2022-09-12T23:59:59",
      "number_of_vacancies" : 1,
      "occupation" : {
        "concept_id" : "KQty_E1u_cia",
        "label" : "Helpdesktekniker/Supporttekniker",
        "legacy_ams_taxonomy_id" : "7020"
      },
      "occupation_group" : {
        "concept_id" : "hmaC_cfi_UKg",
        "label" : "Supporttekniker, IT",
        "legacy_ams_taxonomy_id" : "3512"
      },
      "employment_type" : {
        "concept_id" : "PFZr_Syz_cUq",
        "label" : "Vanlig anställning",
        "legacy_ams_taxonomy_id" : "1"
      },
      "webpage_url" : "https://arbetsformedlingen.se/platsbanken/annonser/26401905",
      "driving_license_required" : false,
      "application_contacts" : [ {
        "description" : "Elin Pettersson",
        "email" : null,
        "telephone" : null,
        "name" : null,
        "contact_type" : null
      } ],
      "duration" : {
        "concept_id" : "qQUd_4qe_NDT",
        "label" : "6 månader eller längre",
        "legacy_ams_taxonomy_id" : "2"
      },
      "nice_to_have" : {
        "education_level" : [ ],
        "work_experiences" : [ ],
        "skills" : [ ],
        "education" : [ ],
        "languages" : [ ]
      },
      "application_details" : {
        "via_af" : false,
        "email" : null,
        "other" : null,
        "reference" : "15078325",
        "url" : "http://www.academicwork.se/jobad/supporttekniker-till-briljant-i-norrkoping/15078325?apply=1",
        "information" : null
      },
      "source_type" : "VIA_PLATSBANKEN_DXA",
      "application_deadline" : "2022-09-12T23:59:59",
      "external_id" : "46-556559-5450-15078325",
      "workplace_address" : {
        "coordinates" : [ 16.192421, 58.587746 ],
        "city" : null,
        "postcode" : null,
        "municipality" : "Norrköping",
        "region_concept_id" : "oLT3_Q9p_3nn",
        "region" : "Östergötlands län",
        "country_code" : "199",
        "region_code" : "05",
        "municipality_concept_id" : "SYty_Yho_JAF",
        "country_concept_id" : "i46j_HmG_v64",
        "municipality_code" : "0581",
        "street_address" : null,
        "country" : "Sverige"
      },
      "id" : "26401905",
      "experience_required" : true,
      "working_hours_type" : {
        "concept_id" : "6YE1_gAC_R2G",
        "label" : "Heltid",
        "legacy_ams_taxonomy_id" : "1"
      },
      "access" : null,
      "timestamp" : 1660255255220,
      "must_have" : {
        "education_level" : [ ],
        "work_experiences" : [ {
          "concept_id" : "KQty_E1u_cia",
          "weight" : 10,
          "label" : "Helpdesktekniker/Supporttekniker",
          "legacy_ams_taxonomy_id" : "7020"
        } ],
        "skills" : [ ],
        "education" : [ ],
        "languages" : [ ]
      },
      "occupation_field" : {
        "concept_id" : "apaJ_2ja_LuF",
        "label" : "Data/IT",
        "legacy_ams_taxonomy_id" : "3"
      },
      "scope_of_work" : {
        "min" : 100,
        "max" : 100
      },
      "salary_type" : {
        "concept_id" : "oG8G_9cW_nRf",
        "label" : "Fast månads- vecko- eller timlön",
        "legacy_ams_taxonomy_id" : "1"
      },
      "removed" : false,
      "salary_description" : "Enligt avtal",
      "access_to_own_car" : false,
      "publication_date" : "2022-08-12T00:00:55"
    },
    "name" : "Supporttekniker till Briljant i Norrköping",
    "user" : "hannes"
  },
  "sha1" : "3f9131e596d8ca16404932d7a9e322cf9cadd6ff",
  "annotations" : [ {
    "preferred-label" : "Helpdesktekniker/Supporttekniker",
    "sentiment" : "MUST_HAVE",
    "type" : "occupation-name",
    "start-position" : 0,
    "end-position" : 15,
    "concept-id" : "KQty_E1u_cia",
    "matched-string" : "supporttekniker",
    "annotation-id" : 0
  }, {
    "preferred-label" : "Norrköping",
    "type" : "municipality",
    "start-position" : 32,
    "end-position" : 42,
    "concept-id" : "SYty_Yho_JAF",
    "matched-string" : "Norrköping",
    "annotation-id" : 30
  }, {
    "preferred-label" : "Norrköping",
    "type" : "municipality",
    "start-position" : 151,
    "end-position" : 161,
    "concept-id" : "SYty_Yho_JAF",
    "matched-string" : "Norrköping",
    "annotation-id" : 31
  }, {
    "preferred-label" : "Helpdesktekniker/Supporttekniker",
    "sentiment" : "MUST_HAVE",
    "type" : "occupation-name",
    "start-position" : 167,
    "end-position" : 182,
    "concept-id" : "KQty_E1u_cia",
    "matched-string" : "supporttekniker",
    "annotation-id" : 2
  }, {
    "preferred-label" : "Briljant, redovisningssystem",
    "type" : "skill",
    "start-position" : 531,
    "end-position" : 554,
    "concept-id" : "KN5V_Gxm_nGL",
    "matched-string" : "Briljant Ekonomisystem.",
    "annotation-id" : 33
  }, {
    "preferred-label" : "Briljant, redovisningssystem",
    "type" : "skill",
    "start-position" : 778,
    "end-position" : 800,
    "concept-id" : "KN5V_Gxm_nGL",
    "matched-string" : "Briljant Ekonomisystem",
    "annotation-id" : 32
  }, {
    "preferred-label" : "Helpdesktekniker/Supporttekniker",
    "sentiment" : "MUST_HAVE",
    "type" : "occupation-name",
    "start-position" : 981,
    "end-position" : 996,
    "concept-id" : "KQty_E1u_cia",
    "matched-string" : "supporttekniker",
    "annotation-id" : 11
  }, {
    "preferred-label" : "Helpdesktekniker/Supporttekniker",
    "sentiment" : "MUST_HAVE",
    "type" : "occupation-name",
    "start-position" : 1141,
    "end-position" : 1156,
    "concept-id" : "KQty_E1u_cia",
    "matched-string" : "supporttekniker",
    "annotation-id" : 12
  }, {
    "preferred-label" : "Line-support",
    "sentiment" : "NOT_RELEVANT",
    "type" : "keyword",
    "start-position" : 1189,
    "end-position" : 1200,
    "concept-id" : "k2U3_c4q_FjL",
    "matched-string" : "linesupport",
    "annotation-id" : 34
  }, {
    "preferred-label" : "Kompetensutveckling, personalarbete",
    "sentiment" : "OFFERED",
    "type" : "skill",
    "start-position" : 1540,
    "end-position" : 1559,
    "concept-id" : "oTKR_GSK_e9B",
    "matched-string" : "kompetensutveckling",
    "annotation-id" : 35
  }, {
    "preferred-label" : "Distansarbete",
    "sentiment" : "OFFERED",
    "type" : "work-place-environment",
    "start-position" : 1896,
    "end-position" : 1911,
    "concept-id" : "uwzb_xcR_vxS",
    "matched-string" : "arbeta hemifrån",
    "annotation-id" : 36
  }, {
    "preferred-label" : "göra felsökning",
    "type" : "esco-skill",
    "start-position" : 2070,
    "end-position" : 2080,
    "concept-id" : "HqC8_fVY_ACM",
    "matched-string" : "Felsökning",
    "annotation-id" : 37
  }, {
    "preferred-label" : "göra felsökning",
    "type" : "esco-skill",
    "start-position" : 2117,
    "end-position" : 2127,
    "concept-id" : "HqC8_fVY_ACM",
    "matched-string" : "Felsökning",
    "annotation-id" : 39
  }, {
    "preferred-label" : "Briljant, redovisningssystem",
    "type" : "skill",
    "start-position" : 2157,
    "end-position" : 2179,
    "concept-id" : "KN5V_Gxm_nGL",
    "matched-string" : "Briljant Ekonomisystem",
    "annotation-id" : 38
  }, {
    "preferred-label" : "Data/IT",
    "sentiment" : "MUST_HAVE",
    "type" : "occupation-field",
    "start-position" : 2483,
    "end-position" : 2485,
    "concept-id" : "apaJ_2ja_LuF",
    "matched-string" : "it",
    "annotation-id" : 17
  }, {
    "preferred-label" : "Windows Server, applikationsplattform",
    "sentiment" : "MUST_HAVE",
    "type" : "skill",
    "start-position" : 2516,
    "end-position" : 2530,
    "concept-id" : "LZBg_ARY_3qS",
    "matched-string" : "Windows Server",
    "annotation-id" : 40
  }, {
    "preferred-label" : "Active Directory, programmeringsverktyg",
    "sentiment" : "MUST_HAVE",
    "type" : "skill",
    "start-position" : 2532,
    "end-position" : 2548,
    "concept-id" : "xGPG_PpL_zWN",
    "matched-string" : "Active Directory",
    "annotation-id" : 41
  }, {
    "preferred-label" : "Databaser",
    "sentiment" : "MUST_HAVE",
    "type" : "skill-headline",
    "start-position" : 2550,
    "end-position" : 2559,
    "concept-id" : "Uj5W_dft_Ssg",
    "matched-string" : "databaser",
    "annotation-id" : 42
  }, {
    "preferred-label" : "Nätverk",
    "sentiment" : "MUST_HAVE",
    "type" : "skill-headline",
    "start-position" : 2564,
    "end-position" : 2571,
    "concept-id" : "nHDU_dpj_R9H",
    "matched-string" : "nätverk",
    "annotation-id" : 43
  }, {
    "preferred-label" : "Svenska",
    "sentiment" : "MUST_HAVE",
    "type" : "language",
    "start-position" : 2590,
    "end-position" : 2597,
    "concept-id" : "zSLA_vw2_FXN",
    "matched-string" : "svenska",
    "annotation-id" : 21
  }, {
    "preferred-label" : "Engelska",
    "sentiment" : "MUST_HAVE",
    "type" : "language",
    "start-position" : 2641,
    "end-position" : 2649,
    "concept-id" : "NVxJ_hLg_TYS",
    "matched-string" : "engelska",
    "annotation-id" : 22
  }, {
    "preferred-label" : "C#, programmeringsspråk",
    "sentiment" : "NICE_TO_HAVE",
    "type" : "skill",
    "start-position" : 2702,
    "end-position" : 2704,
    "concept-id" : "jBKc_5Yx_Y6T",
    "matched-string" : "C#",
    "annotation-id" : 44
  }, {
    "preferred-label" : "Windows Powershell, systemutvecklingsverktyg",
    "sentiment" : "NICE_TO_HAVE",
    "type" : "skill",
    "start-position" : 2721,
    "end-position" : 2731,
    "concept-id" : "SnKF_v7d_qUH",
    "matched-string" : "PowerShell",
    "annotation-id" : 45
  }, {
    "preferred-label" : "noggrannhet",
    "sentiment" : "MUST_HAVE",
    "type" : "esco-skill",
    "start-position" : 2803,
    "end-position" : 2811,
    "concept-id" : "mrsW_EkL_KRD",
    "matched-string" : "Noggrann",
    "annotation-id" : 46
  }, {
    "preferred-label" : "Heltid",
    "type" : "worktime-extent",
    "start-position" : 2933,
    "end-position" : 2939,
    "concept-id" : "6YE1_gAC_R2G",
    "matched-string" : "Heltid",
    "annotation-id" : 47
  }, {
    "preferred-label" : "Norrköping",
    "type" : "municipality",
    "start-position" : 2953,
    "end-position" : 2963,
    "concept-id" : "SYty_Yho_JAF",
    "matched-string" : "Norrköping",
    "annotation-id" : 48
  }, {
    "preferred-label" : "Sverige",
    "type" : "country",
    "start-position" : 3301,
    "end-position" : 3308,
    "concept-id" : "i46j_HmG_v64",
    "matched-string" : "Sverige",
    "annotation-id" : 49
  }, {
    "preferred-label" : "Redovisning",
    "sentiment" : "NOT_RELEVANT",
    "type" : "skill",
    "start-position" : 3339,
    "end-position" : 3350,
    "concept-id" : "FYk9_RXp_7c5",
    "matched-string" : "redovisning",
    "annotation-id" : 50
  }, {
    "preferred-label" : "Revision",
    "sentiment" : "NOT_RELEVANT",
    "type" : "skill",
    "start-position" : 3352,
    "end-position" : 3360,
    "concept-id" : "hVq9_mTt_xkv",
    "matched-string" : "revision",
    "annotation-id" : 26
  }, {
    "preferred-label" : "Ekonomi",
    "sentiment" : "NOT_RELEVANT",
    "type" : "keyword",
    "start-position" : 3362,
    "end-position" : 3369,
    "concept-id" : "PW4f_bmT_new",
    "matched-string" : "ekonomi",
    "annotation-id" : 27
  }, {
    "preferred-label" : "sköta administration",
    "sentiment" : "NOT_RELEVANT",
    "type" : "esco-skill",
    "start-position" : 3374,
    "end-position" : 3388,
    "concept-id" : "NEWh_NMX_RCZ",
    "matched-string" : "administration",
    "annotation-id" : 51
  }, {
    "preferred-label" : "redovisning",
    "sentiment" : "NOT_RELEVANT",
    "type" : "esco-skill",
    "start-position" : 3520,
    "end-position" : 3531,
    "concept-id" : "aAbn_jKY_u2g",
    "matched-string" : "redovisning",
    "annotation-id" : 28
  } ],
  "text" : "Supporttekniker till Briljant i Norrköping\nNu finns chansen för dig som vill bli en del av ett starkt och kompetent utvecklingsbolag med huvudkontor i Norrköping. Som Supporttekniker hos Briljant blir du en del av det team som arbetar med teknisk support av Briljants molntjänst. Rollen passar både dig som är i starten av din karriär eller dig som har några års erfarenhet inom teknisk support. Här får du möjlighet att ta ett stort eget ansvar och utvecklas i din roll!\n\nOM TJÄNSTEN \nBriljant Ekonomisystem AB äger och utvecklar Briljant Ekonomisystem. Bakom produkten står ett utvecklingsbolag samt åtta fristående återförsäljarbolag. Briljant växer och välkomnar nu ytterligare en kollega till avdelningen för Briljants molntjänst. Briljant ASP är en molnbaserad version av Briljant Ekonomisystem som idag har ca 6400 användare. Du blir en del av teamet som sköter support, drift och administration av ASP. Teamet, som präglas av gemenskap och tätt samarbete, består idag av 3 Supporttekniker med stor kompetens inom området som kommer att stötta dig i din introduktion och i arbetet.\n\nSåhär beskriver Jack varför han trivs i rollen som Supporttekniker:\n\n”Jag är både 1st, 2nd och 3rd linesupport vilket gör rollen varierande och utvecklande. Vi är ett litet bolag med härlig stämning där alla jobbar för att utveckla Briljant tillsammans. Vi har också trevliga kunder som vi har en bra relation med vilket gör jobbet extra roligt.”\n\n#\n\nDu erbjuds\n\n\n* Ett utvecklande och utmanande arbete med mycket eget ansvar\n* Goda möjligheter till kompetensutveckling och att fördjupa din tekniska kompetens inom områden som du tycker är spännande\n* Arbete i en organisation där alla, oavsett roll, bidrar till att utveckla ekonomisystemet för att möta efterfrågan från kund\n* Möjlighet att arbeta i ett team som präglas av stark samhörighet med stor kompetens\n* Möjligheten att på sikt välja om du vill arbeta hemifrån eller på kontoret vissa dagar i veckan\n\n\nARBETSUPPGIFTER \n- Hantera beställningar och administrera konton\n- Hantera inkommande ärenden via mejl och telefon\n- Felsökning och problemlösning i Briljant ASP\n- Felsökning hos kunder med egen drift av Briljant Ekonomisystem\n- För dig med intresse och kunskap finns det även möjlighet att vidareutveckla och underhålla underliggande system för molntjänsten\n\nVI SÖKER DIG SOM \n- Har erfarenhet av liknande arbetsuppgifter inom teknisk support eller har läst tekniska ämnen på eftergymnasial nivå och har ett genuint intresse för IT\n- Har grundläggande kunskap i Windows Server, Active Directory, databaser och nätverk\n- Är obehindrad i svenska i tal och skrift samt har goda kunskaper i engelska\n\nDet är meriterande om du:\n\n\n* Har goda kunskaper i C# och VB.NET samt PowerShell\n\n\nFörutom detta är du:\n\n\n* Serviceinriktad och trivs med kundkontakt\n* Noggrann\n* Har en god problemlösningsförmåga\n* Har en god samarbetsförmåga\n\n\nÖvrig information\n\n\n* Start: September\n* Omfattning: Heltid\n* Placering: Norrköping\n* Rekryteringsprocessen hanteras av Academic Work och Briljants önskemål är att alla frågor rörande tjänsten hanteras av Academic Work.\n\n\nVi går igenom urvalet löpande och annonsen kan stängas ner innan tjänsten är tillsatt om vi gått över till urvals- och intervjufasen.\n\nINFORMATION OM FÖRETAGET \nBriljant Ekonomisystem är utvecklat i Sverige av personer med bakgrund från redovisning, revision, ekonomi och administration. Vi har varit verksamma sedan 1994 och är idag 35 personer och omsätter cirka 35 miljoner kronor. Mer än 60 000 företag sköter sin redovisning i Briljant."
}