{
  "meta" : {
    "jobad" : {
      "description" : {
        "requirements" : null,
        "needs" : null,
        "company_information" : null,
        "text_formatted" : "<p>Nu rullar jobben in på löpande band och vi behöver därför anställa mer förare. Vi söker just nu efter dig som är färdig tornkranförare.</p><p>Merparten av jobben är inom Göteborgsområdet.</p><p><br></p><p>Tjänsten startar med en 6 månader lång provanställning.</p>",
        "conditions" : null,
        "text" : "Nu rullar jobben in på löpande band och vi behöver därför anställa mer förare. Vi söker just nu efter dig som är färdig tornkranförare.\nMerparten av jobben är inom Göteborgsområdet.\n\n\nTjänsten startar med en 6 månader lång provanställning."
      },
      "headline" : "Tornkranaförare",
      "driving_license" : [ {
        "concept_id" : "VTK8_WRx_GcM",
        "label" : "B",
        "legacy_ams_taxonomy_id" : "3"
      } ],
      "employer" : {
        "email" : null,
        "phone_number" : null,
        "organization_number" : "5590740949",
        "name" : "JIRO Allservice AB",
        "url" : null,
        "workplace" : "JIRO Allservice AB"
      },
      "removed_date" : null,
      "logo_url" : "https://www.arbetsformedlingen.se/rest/arbetsgivare/rest/af/v3/arbetsplatser/88121445/logotyper/logo.png",
      "last_publication_date" : "2022-08-10T23:59:59",
      "number_of_vacancies" : 4,
      "occupation" : {
        "concept_id" : "z1K2_Ens_9zu",
        "label" : "Tornkranförare",
        "legacy_ams_taxonomy_id" : "1329"
      },
      "occupation_group" : {
        "concept_id" : "XYzP_5Tn_7Ep",
        "label" : "Kranförare m.fl.",
        "legacy_ams_taxonomy_id" : "8343"
      },
      "employment_type" : {
        "concept_id" : "PFZr_Syz_cUq",
        "label" : "Vanlig anställning",
        "legacy_ams_taxonomy_id" : "1"
      },
      "webpage_url" : "https://arbetsformedlingen.se/platsbanken/annonser/26313230",
      "driving_license_required" : true,
      "application_contacts" : [ {
        "description" : null,
        "email" : "Info@jiroallservice.se",
        "telephone" : "0735178436",
        "name" : "Robin Nurmisto",
        "contact_type" : null
      } ],
      "duration" : {
        "concept_id" : "a7uU_j21_mkL",
        "label" : "Tills vidare",
        "legacy_ams_taxonomy_id" : "1"
      },
      "nice_to_have" : {
        "education_level" : [ ],
        "work_experiences" : [ ],
        "skills" : [ ],
        "education" : [ ],
        "languages" : [ {
          "concept_id" : "Gp9q_gTW_XAw",
          "weight" : 5,
          "label" : "Polska",
          "legacy_ams_taxonomy_id" : "415"
        } ]
      },
      "application_details" : {
        "via_af" : false,
        "email" : "info@jiroallservice.se",
        "other" : null,
        "reference" : "Tornkranaförare",
        "url" : null,
        "information" : null
      },
      "source_type" : "VIA_ANNONSERA",
      "application_deadline" : "2022-08-10T23:59:59",
      "external_id" : null,
      "workplace_address" : {
        "coordinates" : [ null, null ],
        "city" : null,
        "postcode" : null,
        "municipality" : "Göteborg",
        "region_concept_id" : "zdoY_6u5_Krt",
        "region" : "Västra Götalands län",
        "country_code" : "199",
        "region_code" : "14",
        "municipality_concept_id" : "PVZL_BQT_XtL",
        "country_concept_id" : "i46j_HmG_v64",
        "municipality_code" : "1480",
        "street_address" : null,
        "country" : "Sverige"
      },
      "id" : "26313230",
      "experience_required" : true,
      "working_hours_type" : {
        "concept_id" : "6YE1_gAC_R2G",
        "label" : "Heltid",
        "legacy_ams_taxonomy_id" : "1"
      },
      "access" : null,
      "timestamp" : 1657520905282,
      "must_have" : {
        "education_level" : [ ],
        "work_experiences" : [ {
          "concept_id" : "z1K2_Ens_9zu",
          "weight" : 10,
          "label" : "Tornkranförare",
          "legacy_ams_taxonomy_id" : "1329"
        } ],
        "skills" : [ ],
        "education" : [ ],
        "languages" : [ {
          "concept_id" : "zSLA_vw2_FXN",
          "weight" : 10,
          "label" : "Svenska",
          "legacy_ams_taxonomy_id" : "502"
        }, {
          "concept_id" : "NVxJ_hLg_TYS",
          "weight" : 10,
          "label" : "Engelska",
          "legacy_ams_taxonomy_id" : "283"
        } ]
      },
      "occupation_field" : {
        "concept_id" : "j7Cq_ZJe_GkT",
        "label" : "Bygg och anläggning",
        "legacy_ams_taxonomy_id" : "2"
      },
      "scope_of_work" : {
        "min" : 0,
        "max" : 100
      },
      "salary_type" : {
        "concept_id" : "oG8G_9cW_nRf",
        "label" : "Fast månads- vecko- eller timlön",
        "legacy_ams_taxonomy_id" : "1"
      },
      "removed" : false,
      "salary_description" : null,
      "access_to_own_car" : true,
      "publication_date" : "2022-07-11T08:28:25"
    },
    "name" : "Tornkranaförare",
    "user" : "hannes"
  },
  "sha1" : "88d64575ec4e573e63feccfce1139af85b4aedb7",
  "annotations" : [ {
    "preferred-label" : "Tornkranförare",
    "type" : "occupation-name",
    "start-position" : 0,
    "end-position" : 15,
    "concept-id" : "z1K2_Ens_9zu",
    "matched-string" : "Tornkranaförare",
    "annotation-id" : 1
  }, {
    "preferred-label" : "Tornkranförare",
    "sentiment" : "MUST_HAVE",
    "type" : "occupation-name",
    "start-position" : 136,
    "end-position" : 150,
    "concept-id" : "z1K2_Ens_9zu",
    "matched-string" : "tornkranförare",
    "annotation-id" : 0
  }, {
    "preferred-label" : "Göteborg",
    "type" : "municipality",
    "start-position" : 180,
    "end-position" : 196,
    "concept-id" : "PVZL_BQT_XtL",
    "matched-string" : "Göteborgsområdet",
    "annotation-id" : 2
  } ],
  "text" : "Tornkranaförare\nNu rullar jobben in på löpande band och vi behöver därför anställa mer förare. Vi söker just nu efter dig som är färdig tornkranförare.\nMerparten av jobben är inom Göteborgsområdet.\n\n\nTjänsten startar med en 6 månader lång provanställning."
}