{
  "meta" : {
    "jobad" : {
      "description" : {
        "requirements" : null,
        "needs" : null,
        "company_information" : null,
        "text_formatted" : "Vi finns till för dem som bor och verkar i Mjölby kommun. Med drygt 28 000 invånare möter vi dagligen människor i olika åldrar och livssituationer, från barnet på förskolan till våra äldre på äldreboendet, från enmansföretagare till stora internationella företag. Våra 2500 medarbetare hjälper, stöttar och servar människor på ett eller annat sätt under hela deras liv. Vill du också bli en av oss?\n\nÄr du en erfaren kock som brinner för matlagning och vill vara med och bidra till en god måltidsupplevelse? \n\nÖstergårdens förskola ligger centralt i Mjölby, nära stationen och skogen och består av fem avdelningar. Köket ansvarar för att barn och pedagoger på Östergårdens förskola får god och näringsriktig mat. Vi arbetar för hållbara måltider med mat lagad från grunden. Varje dag lagas det ca 95 portioner frukost, lunch och mellanmål.\r\n\r\nARBETSUPPGIFTER\nDu kommer arbeta ensam och ansvara för matlagning och beställningar och övriga arbetsuppgifter.\n\nArbetet innebär tillagning av god och näringsriktig mat samt sedvanliga arbetsuppgifter inom storkök som till exempel städning, disk, beställningar och dokumentering av egenkontroll. Du planerar inköp och beställning av varor. Du följer lagar och förordningar som berör verksamheten. \n\nAdministrativt arbete som till exempel fakturahantering ingår. Du arbetar efter ledningssystem för kvalitet och miljö och har dagliga kundkontakter.\r\n\r\nKVALIFIKATIONER\nVi söker dig som har kockutbildning eller annan utbildning som arbetsgivaren bedömer likvärdig. Minst 3 års dokumenterad erfarenhet av storkök eller restaurang.\n\nDu har en mycket god serviceförmåga, där du sätter kunden i fokus genom att vara uppmärksam och tillmötesgående i ditt bemötande. Du är strukturerad, men har samtidigt lätt för att anpassa dig efter ändrade omständigheter och har förmågan att komma på nya förslag på lösningar. Du kan behålla lugnet i stressade situationer och trivs med att arbeta såväl självständigt som i samarbete med andra.\n\nDu har goda kunskaper om livsmedelslagen, egenkontroll och specialkost. Du har god datavana och kan uttrycka dig på svenska i både tal och skrift. \n\nVid en eventuell anställning måste utdrag ur belastningsregistret kunna visas upp.\n\nVi erbjuder dig som kock en individuell introduktion för att ge dig rätt förutsättningar att göra ett bra jobb, ett friskvårdsbidrag som du kan använda till hälsofrämjande fysisk aktivitet och avgiftsfria arbetskläder.\r\n\nÖVRIGT\nVår kommun är expansiv med cirka 28 000 invånare. Vi har nära till varandra och nära till resten av världen, kommunikationerna är utmärkta. Mjölby kommuns vision sammanfattas i en slogan: Världsvan och hemkär. Världsvan står för öppenhet, nytänkande, vilja att växa och tro på framtiden. Hemkär står för stolthet och glädje över hembygden. Hos oss är det enkelt att leva ett gott liv.",
        "conditions" : "Heltid. \r\nTillsvidareanställning, tillträde: 2022-10-24  eller enligt överenskommelse.",
        "text" : "Vi finns till för dem som bor och verkar i Mjölby kommun. Med drygt 28 000 invånare möter vi dagligen människor i olika åldrar och livssituationer, från barnet på förskolan till våra äldre på äldreboendet, från enmansföretagare till stora internationella företag. Våra 2500 medarbetare hjälper, stöttar och servar människor på ett eller annat sätt under hela deras liv. Vill du också bli en av oss?\n\nÄr du en erfaren kock som brinner för matlagning och vill vara med och bidra till en god måltidsupplevelse? \n\nÖstergårdens förskola ligger centralt i Mjölby, nära stationen och skogen och består av fem avdelningar. Köket ansvarar för att barn och pedagoger på Östergårdens förskola får god och näringsriktig mat. Vi arbetar för hållbara måltider med mat lagad från grunden. Varje dag lagas det ca 95 portioner frukost, lunch och mellanmål.\r\n\r\nARBETSUPPGIFTER\nDu kommer arbeta ensam och ansvara för matlagning och beställningar och övriga arbetsuppgifter.\n\nArbetet innebär tillagning av god och näringsriktig mat samt sedvanliga arbetsuppgifter inom storkök som till exempel städning, disk, beställningar och dokumentering av egenkontroll. Du planerar inköp och beställning av varor. Du följer lagar och förordningar som berör verksamheten. \n\nAdministrativt arbete som till exempel fakturahantering ingår. Du arbetar efter ledningssystem för kvalitet och miljö och har dagliga kundkontakter.\r\n\r\nKVALIFIKATIONER\nVi söker dig som har kockutbildning eller annan utbildning som arbetsgivaren bedömer likvärdig. Minst 3 års dokumenterad erfarenhet av storkök eller restaurang.\n\nDu har en mycket god serviceförmåga, där du sätter kunden i fokus genom att vara uppmärksam och tillmötesgående i ditt bemötande. Du är strukturerad, men har samtidigt lätt för att anpassa dig efter ändrade omständigheter och har förmågan att komma på nya förslag på lösningar. Du kan behålla lugnet i stressade situationer och trivs med att arbeta såväl självständigt som i samarbete med andra.\n\nDu har goda kunskaper om livsmedelslagen, egenkontroll och specialkost. Du har god datavana och kan uttrycka dig på svenska i både tal och skrift. \n\nVid en eventuell anställning måste utdrag ur belastningsregistret kunna visas upp.\n\nVi erbjuder dig som kock en individuell introduktion för att ge dig rätt förutsättningar att göra ett bra jobb, ett friskvårdsbidrag som du kan använda till hälsofrämjande fysisk aktivitet och avgiftsfria arbetskläder.\r\n\nÖVRIGT\nVår kommun är expansiv med cirka 28 000 invånare. Vi har nära till varandra och nära till resten av världen, kommunikationerna är utmärkta. Mjölby kommuns vision sammanfattas i en slogan: Världsvan och hemkär. Världsvan står för öppenhet, nytänkande, vilja att växa och tro på framtiden. Hemkär står för stolthet och glädje över hembygden. Hos oss är det enkelt att leva ett gott liv."
      },
      "headline" : "Kock till Östergårdens förskola ",
      "driving_license" : null,
      "employer" : {
        "email" : null,
        "phone_number" : null,
        "organization_number" : "2120000480",
        "name" : "Mjölby kommun",
        "url" : null,
        "workplace" : "Mjölby kommun, Service- och teknikförvaltningen"
      },
      "removed_date" : null,
      "logo_url" : null,
      "last_publication_date" : "2022-08-23T23:59:59",
      "number_of_vacancies" : 1,
      "occupation" : {
        "concept_id" : "Vg3d_Azf_p5Y",
        "label" : "Kock, storhushåll",
        "legacy_ams_taxonomy_id" : "7664"
      },
      "occupation_group" : {
        "concept_id" : "BStc_SJh_DKG",
        "label" : "Kockar och kallskänkor",
        "legacy_ams_taxonomy_id" : "5120"
      },
      "employment_type" : {
        "concept_id" : "PFZr_Syz_cUq",
        "label" : "Vanlig anställning",
        "legacy_ams_taxonomy_id" : "1"
      },
      "webpage_url" : "https://arbetsformedlingen.se/platsbanken/annonser/26390326",
      "driving_license_required" : false,
      "application_contacts" : [ {
        "description" : "Emmelie Bockegården",
        "email" : "emmelie.bockegarden@mjolby.se",
        "telephone" : "010 - 234 62 31",
        "name" : null,
        "contact_type" : "Driftchef Måltids-och lokalvårdsavdelningen"
      }, {
        "description" : "Helén Borger",
        "email" : "helen.borger@mjolby.se",
        "telephone" : "010 - 234 62 32",
        "name" : null,
        "contact_type" : "Driftchef Måltids- och lokalvårdsavdelningen"
      } ],
      "duration" : {
        "concept_id" : "a7uU_j21_mkL",
        "label" : "Tills vidare",
        "legacy_ams_taxonomy_id" : "1"
      },
      "nice_to_have" : {
        "education_level" : [ ],
        "work_experiences" : [ ],
        "skills" : [ ],
        "education" : [ ],
        "languages" : [ ]
      },
      "application_details" : {
        "via_af" : false,
        "email" : null,
        "other" : null,
        "reference" : "C97870",
        "url" : "https://recruit.visma.com/Public/Apply.aspx?guidAssignment=bdfc6184-3ee8-446c-bd8a-6102f10216a5&publishCode=AMS&TK=99fcf87e-b8e8-49ad-a0df-d5b4fb96ab3a",
        "information" : null
      },
      "source_type" : "VIA_PLATSBANKEN_DXA",
      "application_deadline" : "2022-08-23T23:59:59",
      "external_id" : "46-212000-0480-BDFC61843EE8446CBD8A6102F10216A5",
      "workplace_address" : {
        "coordinates" : [ 15.133534, 58.32269 ],
        "city" : null,
        "postcode" : null,
        "municipality" : "Mjölby",
        "region_concept_id" : "oLT3_Q9p_3nn",
        "region" : "Östergötlands län",
        "country_code" : "199",
        "region_code" : "05",
        "municipality_concept_id" : "stqv_JGB_x8A",
        "country_concept_id" : "i46j_HmG_v64",
        "municipality_code" : "0586",
        "street_address" : null,
        "country" : "Sverige"
      },
      "id" : "26390326",
      "experience_required" : true,
      "working_hours_type" : {
        "concept_id" : "6YE1_gAC_R2G",
        "label" : "Heltid",
        "legacy_ams_taxonomy_id" : "1"
      },
      "access" : null,
      "timestamp" : 1660033520398,
      "must_have" : {
        "education_level" : [ ],
        "work_experiences" : [ {
          "concept_id" : "Vg3d_Azf_p5Y",
          "weight" : 10,
          "label" : "Kock, storhushåll",
          "legacy_ams_taxonomy_id" : "7664"
        } ],
        "skills" : [ ],
        "education" : [ ],
        "languages" : [ ]
      },
      "occupation_field" : {
        "concept_id" : "ScKy_FHB_7wT",
        "label" : "Hotell, restaurang, storhushåll",
        "legacy_ams_taxonomy_id" : "7"
      },
      "scope_of_work" : {
        "min" : 100,
        "max" : 100
      },
      "salary_type" : {
        "concept_id" : "oG8G_9cW_nRf",
        "label" : "Fast månads- vecko- eller timlön",
        "legacy_ams_taxonomy_id" : "1"
      },
      "removed" : false,
      "salary_description" : "Enligt avtal.",
      "access_to_own_car" : false,
      "publication_date" : "2022-08-09T10:25:20"
    },
    "name" : "Kock till Östergårdens förskola ",
    "user" : "hannes"
  },
  "sha1" : "bfa519b09e502dfb73aad26d8d9e25e3832d9d77",
  "annotations" : [ {
    "preferred-label" : "kock",
    "sentiment" : "MUST_HAVE",
    "type" : "esco-occupation",
    "start-position" : 0,
    "end-position" : 4,
    "concept-id" : "Ti2H_QoQ_EMX",
    "matched-string" : "kock",
    "annotation-id" : 0
  }, {
    "preferred-label" : "Förskola",
    "sentiment" : "MUST_HAVE",
    "type" : "keyword",
    "start-position" : 23,
    "end-position" : 31,
    "concept-id" : "6o2S_cvR_GwA",
    "matched-string" : "förskola",
    "annotation-id" : 1
  }, {
    "preferred-label" : "Mjölby",
    "type" : "municipality",
    "start-position" : 76,
    "end-position" : 89,
    "concept-id" : "stqv_JGB_x8A",
    "matched-string" : "Mjölby kommun",
    "annotation-id" : 13
  }, {
    "preferred-label" : "Förskola",
    "type" : "keyword",
    "start-position" : 196,
    "end-position" : 205,
    "concept-id" : "6o2S_cvR_GwA",
    "matched-string" : "förskolan",
    "annotation-id" : 15
  }, {
    "preferred-label" : "Äldreboende",
    "type" : "skill",
    "start-position" : 225,
    "end-position" : 237,
    "concept-id" : "tykJ_BZQ_Wer",
    "matched-string" : "äldreboendet",
    "annotation-id" : 16
  }, {
    "preferred-label" : "kock",
    "sentiment" : "MUST_HAVE",
    "type" : "esco-occupation",
    "start-position" : 450,
    "end-position" : 454,
    "concept-id" : "Ti2H_QoQ_EMX",
    "matched-string" : "kock",
    "annotation-id" : 2
  }, {
    "preferred-label" : "Förskola",
    "sentiment" : "MUST_HAVE",
    "type" : "sun-education-level-3",
    "start-position" : 556,
    "end-position" : 564,
    "concept-id" : "p3Nu_zzc_L7T",
    "matched-string" : "förskola",
    "annotation-id" : 3
  }, {
    "preferred-label" : "Mjölby",
    "type" : "municipality",
    "start-position" : 583,
    "end-position" : 589,
    "concept-id" : "stqv_JGB_x8A",
    "matched-string" : "Mjölby",
    "annotation-id" : 14
  }, {
    "preferred-label" : "Förskola",
    "sentiment" : "MUST_HAVE",
    "type" : "keyword",
    "start-position" : 706,
    "end-position" : 714,
    "concept-id" : "6o2S_cvR_GwA",
    "matched-string" : "förskola",
    "annotation-id" : 4
  }, {
    "preferred-label" : "Storkök",
    "sentiment" : "MUST_HAVE",
    "type" : "skill",
    "start-position" : 1082,
    "end-position" : 1089,
    "concept-id" : "GQ9R_2Za_Awt",
    "matched-string" : "storkök",
    "annotation-id" : 5
  }, {
    "preferred-label" : "Kockutbildning",
    "sentiment" : "MUST_HAVE",
    "type" : "keyword",
    "start-position" : 1464,
    "end-position" : 1478,
    "concept-id" : "62ja_BdV_Xdo",
    "matched-string" : "kockutbildning",
    "annotation-id" : 6
  }, {
    "preferred-label" : "2-4 års erfarenhet",
    "type" : "occupation-experience-year",
    "start-position" : 1545,
    "end-position" : 1550,
    "concept-id" : "RWA2_uu6_udD",
    "matched-string" : "3 års",
    "annotation-id" : 18
  }, {
    "preferred-label" : "2-4 års erfarenhet",
    "type" : "occupation-experience-year",
    "start-position" : 1564,
    "end-position" : 1574,
    "concept-id" : "RWA2_uu6_udD",
    "matched-string" : "erfarenhet",
    "annotation-id" : 17
  }, {
    "preferred-label" : "Storkök",
    "sentiment" : "MUST_HAVE",
    "type" : "skill",
    "start-position" : 1578,
    "end-position" : 1585,
    "concept-id" : "GQ9R_2Za_Awt",
    "matched-string" : "storkök",
    "annotation-id" : 7
  }, {
    "preferred-label" : "Restaurang",
    "sentiment" : "MUST_HAVE",
    "type" : "keyword",
    "start-position" : 1592,
    "end-position" : 1602,
    "concept-id" : "o2Cg_3Ap_qvK",
    "matched-string" : "restaurang",
    "annotation-id" : 8
  }, {
    "preferred-label" : "arbeta självständigt",
    "type" : "esco-skill",
    "start-position" : 1947,
    "end-position" : 1953,
    "concept-id" : "NyFu_HHd_zhz",
    "matched-string" : "arbeta",
    "annotation-id" : 21
  }, {
    "preferred-label" : "arbeta självständigt",
    "type" : "esco-skill",
    "start-position" : 1960,
    "end-position" : 1973,
    "concept-id" : "NyFu_HHd_zhz",
    "matched-string" : "självständigt",
    "annotation-id" : 20
  }, {
    "preferred-label" : "samarbeta med kolleger",
    "type" : "esco-skill",
    "start-position" : 1980,
    "end-position" : 1999,
    "concept-id" : "X15R_797_q62",
    "matched-string" : "samarbete med andra",
    "annotation-id" : 19
  }, {
    "preferred-label" : "Specialkost",
    "sentiment" : "MUST_HAVE",
    "type" : "skill",
    "start-position" : 2061,
    "end-position" : 2072,
    "concept-id" : "JYKn_PRX_tif",
    "matched-string" : "specialkost",
    "annotation-id" : 9
  }, {
    "preferred-label" : "Svenska",
    "sentiment" : "MUST_HAVE",
    "type" : "language",
    "start-position" : 2118,
    "end-position" : 2125,
    "concept-id" : "zSLA_vw2_FXN",
    "matched-string" : "svenska",
    "annotation-id" : 10
  }, {
    "preferred-label" : "kock",
    "sentiment" : "MUST_HAVE",
    "type" : "esco-occupation",
    "start-position" : 2255,
    "end-position" : 2259,
    "concept-id" : "Ti2H_QoQ_EMX",
    "matched-string" : "kock",
    "annotation-id" : 11
  }, {
    "preferred-label" : "Idrott/aktivitet",
    "sentiment" : "MUST_HAVE",
    "type" : "skill-headline",
    "start-position" : 2414,
    "end-position" : 2423,
    "concept-id" : "LeJk_Xa1_TuS",
    "matched-string" : "aktivitet",
    "annotation-id" : 12
  }, {
    "preferred-label" : "Mjölby",
    "type" : "municipality",
    "start-position" : 2467,
    "end-position" : 2473,
    "concept-id" : "stqv_JGB_x8A",
    "matched-string" : "kommun",
    "annotation-id" : 22
  }, {
    "preferred-label" : "Mjölby",
    "type" : "municipality",
    "start-position" : 2603,
    "end-position" : 2617,
    "concept-id" : "stqv_JGB_x8A",
    "matched-string" : "Mjölby kommuns",
    "annotation-id" : 23
  } ],
  "text" : "Kock till Östergårdens förskola \nVi finns till för dem som bor och verkar i Mjölby kommun. Med drygt 28 000 invånare möter vi dagligen människor i olika åldrar och livssituationer, från barnet på förskolan till våra äldre på äldreboendet, från enmansföretagare till stora internationella företag. Våra 2500 medarbetare hjälper, stöttar och servar människor på ett eller annat sätt under hela deras liv. Vill du också bli en av oss?\n\nÄr du en erfaren kock som brinner för matlagning och vill vara med och bidra till en god måltidsupplevelse? \n\nÖstergårdens förskola ligger centralt i Mjölby, nära stationen och skogen och består av fem avdelningar. Köket ansvarar för att barn och pedagoger på Östergårdens förskola får god och näringsriktig mat. Vi arbetar för hållbara måltider med mat lagad från grunden. Varje dag lagas det ca 95 portioner frukost, lunch och mellanmål.\r\n\r\nARBETSUPPGIFTER\nDu kommer arbeta ensam och ansvara för matlagning och beställningar och övriga arbetsuppgifter.\n\nArbetet innebär tillagning av god och näringsriktig mat samt sedvanliga arbetsuppgifter inom storkök som till exempel städning, disk, beställningar och dokumentering av egenkontroll. Du planerar inköp och beställning av varor. Du följer lagar och förordningar som berör verksamheten. \n\nAdministrativt arbete som till exempel fakturahantering ingår. Du arbetar efter ledningssystem för kvalitet och miljö och har dagliga kundkontakter.\r\n\r\nKVALIFIKATIONER\nVi söker dig som har kockutbildning eller annan utbildning som arbetsgivaren bedömer likvärdig. Minst 3 års dokumenterad erfarenhet av storkök eller restaurang.\n\nDu har en mycket god serviceförmåga, där du sätter kunden i fokus genom att vara uppmärksam och tillmötesgående i ditt bemötande. Du är strukturerad, men har samtidigt lätt för att anpassa dig efter ändrade omständigheter och har förmågan att komma på nya förslag på lösningar. Du kan behålla lugnet i stressade situationer och trivs med att arbeta såväl självständigt som i samarbete med andra.\n\nDu har goda kunskaper om livsmedelslagen, egenkontroll och specialkost. Du har god datavana och kan uttrycka dig på svenska i både tal och skrift. \n\nVid en eventuell anställning måste utdrag ur belastningsregistret kunna visas upp.\n\nVi erbjuder dig som kock en individuell introduktion för att ge dig rätt förutsättningar att göra ett bra jobb, ett friskvårdsbidrag som du kan använda till hälsofrämjande fysisk aktivitet och avgiftsfria arbetskläder.\r\n\nÖVRIGT\nVår kommun är expansiv med cirka 28 000 invånare. Vi har nära till varandra och nära till resten av världen, kommunikationerna är utmärkta. Mjölby kommuns vision sammanfattas i en slogan: Världsvan och hemkär. Världsvan står för öppenhet, nytänkande, vilja att växa och tro på framtiden. Hemkär står för stolthet och glädje över hembygden. Hos oss är det enkelt att leva ett gott liv."
}