{
  "meta" : {
    "jobad" : {
      "description" : {
        "requirements" : null,
        "needs" : null,
        "company_information" : null,
        "text_formatted" : "Vi på Coop erbjuder våra kunder och medlemmar ett hållbart och prisvärt sortiment i butiker som utstrålar matglädje. Vi brinner för kundmötet och vår vision är att vara den goda kraften i mat-Sverige. Inspireras du som oss av matglädje, försäljning och hållbarhet? \n\nKunden i våra butiker ska inte bara mötas av bra varor till bra priser, vi vill även att de varje dag upplever matinspiration, intressanta händelser, överraskningar och inte minst får ett bra personligt bemötande från all vår personal. Verklig framgång bygger på att vi älskar våra jobb och visar äkta omtanke och glädje för våra kunder! \n\nNu söker vi en Bagare/Konditor till vår butik Stora Coop Huddinge. Bageriet är en viktig del och har en betydande framtoning i butiken. Som bagare/konditor har du ett stort ansvar att tillsammans med dina kollegor skapa en levande butik som ständigt överträffar kundens förväntningar. Varje kund ska känna sig unik, med din servicekänsla och kreativitet ger du kunderna något utöver det vanliga. \n\nArbetsuppgifter:\n\nSom bagare/konditor hos oss består dina arbetsuppgifter av att producera matbröd, tårtor, bakelser och kakor samt att exponera i manuella diskar. Du ansvarar till stor del för att driva bageriets sortiment framåt och framgångsrikt. Samtidigt har du en viktig roll i att leverera ett kundbemötande i världsklass. \n\nI ditt arbete ingår vidare att:\n\n - Vara med och skapa en säljande och inspirerande miljö inom bageriet\n - Säkerställa att Coops hållbarhetspolicy efterlevs\n\nTjänsten är en visstidsanställning på heltid 40 timmar i veckan. \r\n\n - Utbildad konditor eller bagare\n - Erfarenhet och kompetens inom detaljhandelsförsäljning (meriterande)\n - Dokumenterad erfarenhet från konditori/bageri är ett krav\n\nSom bagare/konditor ska du ha en säljglädje och stort engagemang för butikens hela brödförsäljning och uttryck. Du är en person med initiativförmåga och stark positiv energi som smittar av sig, och som ser kundens behov och med glädje ger det bästa kundbemötandet. Vidare har du förmågan att hantera stressiga situationer. \n\nKontaktpersoner\n\nHelene Sandberg | Butikschef\n\nUrval sker löpande och tjänsten kan komma att tillsättas före sista ansökningsdatum. Vi ser fram emot din ansökan! \n\nCoop är unikt! Det är lätt att tro att alla matbutiker är lika. Samma varor på hyllorna, samma kundvagnar och så kassan vid utgången. Men Coop är annorlunda eftersom vi ägs av våra 3,5 miljoner medlemmar. Det är vad som gör oss unika. Det ger oss också ett extra stort ansvar, men också extra stora möjligheter. \n\nCoop är en av Sveriges största arbetsgivare och vi drivs av uppgiften att ge alla tillgång till den goda maten. Vi är inne i en spännande förändringsresa mot att vara den goda kraften i mat-Sverige. Vi ska förenkla vardagen och ge alla tillgång till goda råvaror – något som är bra för både kropp, själ och vår miljö. \n\nCoop har länge levt i framkant och förverkligat vikten av ekologiskt tänkande. Vår fisk är certifierad, hönsen utsläppta och vårt egna varumärke Änglamark är utsett till Sveriges Grönaste Varumärke - men vår resa slutar inte där. \n\nTillsammans med våra medarbetare arbetar vi varje dag tillsammans med våra kunder för att fortsätta vara bäst på hållbar utveckling och nu satsar vi ännu mer på att sprida matglädje och mer kärlek till bra råvaror. \n\nTillsammans kan och ska vi bli den goda kraften i mat-Sverige! \n\nCoop värdesätter kvaliteter som en jämn ålders- och könsfördelning samt etnisk och kulturell mångfald tillför verksamheten.",
        "conditions" : "Heltid\r\nTillsvidare",
        "text" : "Vi på Coop erbjuder våra kunder och medlemmar ett hållbart och prisvärt sortiment i butiker som utstrålar matglädje. Vi brinner för kundmötet och vår vision är att vara den goda kraften i mat-Sverige. Inspireras du som oss av matglädje, försäljning och hållbarhet? \n\nKunden i våra butiker ska inte bara mötas av bra varor till bra priser, vi vill även att de varje dag upplever matinspiration, intressanta händelser, överraskningar och inte minst får ett bra personligt bemötande från all vår personal. Verklig framgång bygger på att vi älskar våra jobb och visar äkta omtanke och glädje för våra kunder! \n\nNu söker vi en Bagare/Konditor till vår butik Stora Coop Huddinge. Bageriet är en viktig del och har en betydande framtoning i butiken. Som bagare/konditor har du ett stort ansvar att tillsammans med dina kollegor skapa en levande butik som ständigt överträffar kundens förväntningar. Varje kund ska känna sig unik, med din servicekänsla och kreativitet ger du kunderna något utöver det vanliga. \n\nArbetsuppgifter:\n\nSom bagare/konditor hos oss består dina arbetsuppgifter av att producera matbröd, tårtor, bakelser och kakor samt att exponera i manuella diskar. Du ansvarar till stor del för att driva bageriets sortiment framåt och framgångsrikt. Samtidigt har du en viktig roll i att leverera ett kundbemötande i världsklass. \n\nI ditt arbete ingår vidare att:\n\n - Vara med och skapa en säljande och inspirerande miljö inom bageriet\n - Säkerställa att Coops hållbarhetspolicy efterlevs\n\nTjänsten är en visstidsanställning på heltid 40 timmar i veckan. \r\n\n - Utbildad konditor eller bagare\n - Erfarenhet och kompetens inom detaljhandelsförsäljning (meriterande)\n - Dokumenterad erfarenhet från konditori/bageri är ett krav\n\nSom bagare/konditor ska du ha en säljglädje och stort engagemang för butikens hela brödförsäljning och uttryck. Du är en person med initiativförmåga och stark positiv energi som smittar av sig, och som ser kundens behov och med glädje ger det bästa kundbemötandet. Vidare har du förmågan att hantera stressiga situationer. \n\nKontaktpersoner\n\nHelene Sandberg | Butikschef\n\nUrval sker löpande och tjänsten kan komma att tillsättas före sista ansökningsdatum. Vi ser fram emot din ansökan! \n\nCoop är unikt! Det är lätt att tro att alla matbutiker är lika. Samma varor på hyllorna, samma kundvagnar och så kassan vid utgången. Men Coop är annorlunda eftersom vi ägs av våra 3,5 miljoner medlemmar. Det är vad som gör oss unika. Det ger oss också ett extra stort ansvar, men också extra stora möjligheter. \n\nCoop är en av Sveriges största arbetsgivare och vi drivs av uppgiften att ge alla tillgång till den goda maten. Vi är inne i en spännande förändringsresa mot att vara den goda kraften i mat-Sverige. Vi ska förenkla vardagen och ge alla tillgång till goda råvaror – något som är bra för både kropp, själ och vår miljö. \n\nCoop har länge levt i framkant och förverkligat vikten av ekologiskt tänkande. Vår fisk är certifierad, hönsen utsläppta och vårt egna varumärke Änglamark är utsett till Sveriges Grönaste Varumärke - men vår resa slutar inte där. \n\nTillsammans med våra medarbetare arbetar vi varje dag tillsammans med våra kunder för att fortsätta vara bäst på hållbar utveckling och nu satsar vi ännu mer på att sprida matglädje och mer kärlek till bra råvaror. \n\nTillsammans kan och ska vi bli den goda kraften i mat-Sverige! \n\nCoop värdesätter kvaliteter som en jämn ålders- och könsfördelning samt etnisk och kulturell mångfald tillför verksamheten."
      },
      "headline" : "Bagare/konditor – Stora Coop Huddinge",
      "driving_license" : null,
      "employer" : {
        "email" : null,
        "phone_number" : null,
        "organization_number" : "5560305921",
        "name" : "Coop Butiker & Stormarknader AB",
        "url" : "https://www.coop.se/",
        "workplace" : "Coop"
      },
      "removed_date" : null,
      "logo_url" : "https://www.arbetsformedlingen.se/rest/arbetsgivare/rest/af/v3/organisation/5560305921/logotyper/logo.png",
      "last_publication_date" : "2022-08-31T23:59:59",
      "number_of_vacancies" : 1,
      "occupation" : {
        "concept_id" : "XugJ_6hw_wVV",
        "label" : "Bagare/Konditor",
        "legacy_ams_taxonomy_id" : "5504"
      },
      "occupation_group" : {
        "concept_id" : "5qT8_z9d_8rw",
        "label" : "Bagare och konditorer",
        "legacy_ams_taxonomy_id" : "7612"
      },
      "employment_type" : {
        "concept_id" : "PFZr_Syz_cUq",
        "label" : "Vanlig anställning",
        "legacy_ams_taxonomy_id" : "1"
      },
      "webpage_url" : "https://arbetsformedlingen.se/platsbanken/annonser/26337191",
      "driving_license_required" : false,
      "application_contacts" : [ ],
      "duration" : {
        "concept_id" : "a7uU_j21_mkL",
        "label" : "Tills vidare",
        "legacy_ams_taxonomy_id" : "1"
      },
      "nice_to_have" : {
        "education_level" : [ ],
        "work_experiences" : [ ],
        "skills" : [ ],
        "education" : [ ],
        "languages" : [ ]
      },
      "application_details" : {
        "via_af" : false,
        "email" : null,
        "other" : null,
        "reference" : null,
        "url" : "https://emp.jobylon.com/applications/jobs/137157/create/?utm_source=ams&utm_medium=promotionserializer",
        "information" : null
      },
      "source_type" : "VIA_PLATSBANKEN_DXA",
      "application_deadline" : "2022-08-31T23:59:59",
      "external_id" : "46-556030-5921-137157-72224",
      "workplace_address" : {
        "coordinates" : [ 17.982157, 59.23633 ],
        "city" : null,
        "postcode" : null,
        "municipality" : "Huddinge",
        "region_concept_id" : "CifL_Rzy_Mku",
        "region" : "Stockholms län",
        "country_code" : "199",
        "region_code" : "01",
        "municipality_concept_id" : "g1Gc_aXK_EKu",
        "country_concept_id" : "i46j_HmG_v64",
        "municipality_code" : "0126",
        "street_address" : null,
        "country" : "Sverige"
      },
      "id" : "26337191",
      "experience_required" : true,
      "working_hours_type" : {
        "concept_id" : "6YE1_gAC_R2G",
        "label" : "Heltid",
        "legacy_ams_taxonomy_id" : "1"
      },
      "access" : null,
      "timestamp" : 1658154513683,
      "must_have" : {
        "education_level" : [ ],
        "work_experiences" : [ {
          "concept_id" : "XugJ_6hw_wVV",
          "weight" : 10,
          "label" : "Bagare/Konditor",
          "legacy_ams_taxonomy_id" : "5504"
        } ],
        "skills" : [ ],
        "education" : [ ],
        "languages" : [ ]
      },
      "occupation_field" : {
        "concept_id" : "PaxQ_o1G_wWH",
        "label" : "Hantverk",
        "legacy_ams_taxonomy_id" : "6"
      },
      "scope_of_work" : {
        "min" : 100,
        "max" : 100
      },
      "salary_type" : {
        "concept_id" : "oG8G_9cW_nRf",
        "label" : "Fast månads- vecko- eller timlön",
        "legacy_ams_taxonomy_id" : "1"
      },
      "removed" : false,
      "salary_description" : "Fast månads- vecko- eller timlön",
      "access_to_own_car" : false,
      "publication_date" : "2022-07-18T16:28:33"
    },
    "name" : "Bagare/konditor – Stora Coop Huddinge",
    "user" : "kristof.fischer"
  },
  "sha1" : "5f76fe4357d25f517b7304956442432d97acb7a3",
  "annotations" : [ {
    "preferred-label" : "Bagare/Konditor",
    "sentiment" : "MUST_HAVE",
    "type" : "occupation-name",
    "start-position" : 0,
    "end-position" : 15,
    "concept-id" : "XugJ_6hw_wVV",
    "matched-string" : "bagare/konditor",
    "annotation-id" : 0
  }, {
    "preferred-label" : "Bagare/Konditor",
    "sentiment" : "MUST_HAVE",
    "type" : "occupation-name",
    "start-position" : 660,
    "end-position" : 675,
    "concept-id" : "XugJ_6hw_wVV",
    "matched-string" : "bagare/konditor",
    "annotation-id" : 4
  }, {
    "preferred-label" : "Bagare/Konditor",
    "sentiment" : "MUST_HAVE",
    "type" : "occupation-name",
    "start-position" : 785,
    "end-position" : 800,
    "concept-id" : "XugJ_6hw_wVV",
    "matched-string" : "bagare/konditor",
    "annotation-id" : 7
  }, {
    "preferred-label" : "Bagare/Konditor",
    "sentiment" : "MUST_HAVE",
    "type" : "occupation-name",
    "start-position" : 1065,
    "end-position" : 1080,
    "concept-id" : "XugJ_6hw_wVV",
    "matched-string" : "bagare/konditor",
    "annotation-id" : 9
  }, {
    "preferred-label" : "Matbröd",
    "sentiment" : "MUST_HAVE",
    "type" : "skill",
    "start-position" : 1134,
    "end-position" : 1141,
    "concept-id" : "gzxa_drN_Uud",
    "matched-string" : "matbröd",
    "annotation-id" : 10
  }, {
    "preferred-label" : "Tårtor/Bakelser",
    "sentiment" : "MUST_HAVE",
    "type" : "skill",
    "start-position" : 1143,
    "end-position" : 1149,
    "concept-id" : "UVj4_qZp_iqS",
    "matched-string" : "tårtor",
    "annotation-id" : 11
  }, {
    "preferred-label" : "Tårtor/Bakelser",
    "sentiment" : "MUST_HAVE",
    "type" : "skill",
    "start-position" : 1151,
    "end-position" : 1159,
    "concept-id" : "UVj4_qZp_iqS",
    "matched-string" : "bakelser",
    "annotation-id" : 12
  }, {
    "preferred-label" : "Tårtor/Bakelser",
    "sentiment" : "MUST_HAVE",
    "type" : "skill",
    "start-position" : 1164,
    "end-position" : 1169,
    "concept-id" : "UVj4_qZp_iqS",
    "matched-string" : "kakor",
    "annotation-id" : 23
  }, {
    "preferred-label" : "Bagare/Konditor",
    "sentiment" : "MUST_HAVE",
    "type" : "occupation-name",
    "start-position" : 1613,
    "end-position" : 1621,
    "concept-id" : "XugJ_6hw_wVV",
    "matched-string" : "konditor",
    "annotation-id" : 13
  }, {
    "preferred-label" : "Bagare/Konditor",
    "sentiment" : "MUST_HAVE",
    "type" : "occupation-name",
    "start-position" : 1628,
    "end-position" : 1634,
    "concept-id" : "XugJ_6hw_wVV",
    "matched-string" : "bagare",
    "annotation-id" : 14
  }, {
    "preferred-label" : "Försäljningsvana, direktförsäljning konsument",
    "sentiment" : "NICE_TO_HAVE",
    "type" : "skill",
    "start-position" : 1668,
    "end-position" : 1692,
    "concept-id" : "tPU1_wJL_suB",
    "matched-string" : "detaljhandelsförsäljning",
    "annotation-id" : 24
  }, {
    "preferred-label" : "Konditorivaror",
    "sentiment" : "MUST_HAVE",
    "type" : "skill",
    "start-position" : 1739,
    "end-position" : 1755,
    "concept-id" : "zjQb_VwQ_eaC",
    "matched-string" : "konditori/bageri",
    "annotation-id" : 25
  }, {
    "preferred-label" : "Bagare/Konditor",
    "sentiment" : "MUST_HAVE",
    "type" : "occupation-name",
    "start-position" : 1773,
    "end-position" : 1788,
    "concept-id" : "XugJ_6hw_wVV",
    "matched-string" : "bagare/konditor",
    "annotation-id" : 15
  }, {
    "preferred-label" : "hantera stressande situationer",
    "sentiment" : "MUST_HAVE",
    "type" : "esco-skill",
    "start-position" : 2061,
    "end-position" : 2090,
    "concept-id" : "qhLq_ZdJ_rqJ",
    "matched-string" : "hantera stressiga situationer",
    "annotation-id" : 26
  } ],
  "text" : "Bagare/konditor – Stora Coop Huddinge\nVi på Coop erbjuder våra kunder och medlemmar ett hållbart och prisvärt sortiment i butiker som utstrålar matglädje. Vi brinner för kundmötet och vår vision är att vara den goda kraften i mat-Sverige. Inspireras du som oss av matglädje, försäljning och hållbarhet? \n\nKunden i våra butiker ska inte bara mötas av bra varor till bra priser, vi vill även att de varje dag upplever matinspiration, intressanta händelser, överraskningar och inte minst får ett bra personligt bemötande från all vår personal. Verklig framgång bygger på att vi älskar våra jobb och visar äkta omtanke och glädje för våra kunder! \n\nNu söker vi en Bagare/Konditor till vår butik Stora Coop Huddinge. Bageriet är en viktig del och har en betydande framtoning i butiken. Som bagare/konditor har du ett stort ansvar att tillsammans med dina kollegor skapa en levande butik som ständigt överträffar kundens förväntningar. Varje kund ska känna sig unik, med din servicekänsla och kreativitet ger du kunderna något utöver det vanliga. \n\nArbetsuppgifter:\n\nSom bagare/konditor hos oss består dina arbetsuppgifter av att producera matbröd, tårtor, bakelser och kakor samt att exponera i manuella diskar. Du ansvarar till stor del för att driva bageriets sortiment framåt och framgångsrikt. Samtidigt har du en viktig roll i att leverera ett kundbemötande i världsklass. \n\nI ditt arbete ingår vidare att:\n\n - Vara med och skapa en säljande och inspirerande miljö inom bageriet\n - Säkerställa att Coops hållbarhetspolicy efterlevs\n\nTjänsten är en visstidsanställning på heltid 40 timmar i veckan. \r\n\n - Utbildad konditor eller bagare\n - Erfarenhet och kompetens inom detaljhandelsförsäljning (meriterande)\n - Dokumenterad erfarenhet från konditori/bageri är ett krav\n\nSom bagare/konditor ska du ha en säljglädje och stort engagemang för butikens hela brödförsäljning och uttryck. Du är en person med initiativförmåga och stark positiv energi som smittar av sig, och som ser kundens behov och med glädje ger det bästa kundbemötandet. Vidare har du förmågan att hantera stressiga situationer. \n\nKontaktpersoner\n\nHelene Sandberg | Butikschef\n\nUrval sker löpande och tjänsten kan komma att tillsättas före sista ansökningsdatum. Vi ser fram emot din ansökan! \n\nCoop är unikt! Det är lätt att tro att alla matbutiker är lika. Samma varor på hyllorna, samma kundvagnar och så kassan vid utgången. Men Coop är annorlunda eftersom vi ägs av våra 3,5 miljoner medlemmar. Det är vad som gör oss unika. Det ger oss också ett extra stort ansvar, men också extra stora möjligheter. \n\nCoop är en av Sveriges största arbetsgivare och vi drivs av uppgiften att ge alla tillgång till den goda maten. Vi är inne i en spännande förändringsresa mot att vara den goda kraften i mat-Sverige. Vi ska förenkla vardagen och ge alla tillgång till goda råvaror – något som är bra för både kropp, själ och vår miljö. \n\nCoop har länge levt i framkant och förverkligat vikten av ekologiskt tänkande. Vår fisk är certifierad, hönsen utsläppta och vårt egna varumärke Änglamark är utsett till Sveriges Grönaste Varumärke - men vår resa slutar inte där. \n\nTillsammans med våra medarbetare arbetar vi varje dag tillsammans med våra kunder för att fortsätta vara bäst på hållbar utveckling och nu satsar vi ännu mer på att sprida matglädje och mer kärlek till bra råvaror. \n\nTillsammans kan och ska vi bli den goda kraften i mat-Sverige! \n\nCoop värdesätter kvaliteter som en jämn ålders- och könsfördelning samt etnisk och kulturell mångfald tillför verksamheten."
}