{
  "meta" : {
    "jobad" : {
      "description" : {
        "requirements" : null,
        "needs" : null,
        "company_information" : null,
        "text_formatted" : "På DHL arbetar vi med att få våra kunders vardag att fungera. Som ett av de ledande företagen i världen inom logistik, ser vi till att våra kunder får leverans av varor och material. Utan transporter stannar samhället, vi har ett viktigt uppdrag - Förena människor, förbättra liv.  Som medarbetare hos oss är du en viktig nyckelspelare.\n\nVill du arbeta med digital marknadsföring i en internationell organisation där du erbjuds strategiska och operativa arbetsuppgifter? Då tycker vi att du ska läsa vidare.\n\nVi letar nu efter en digital expert som brinner för digitala marknadsföring  samt gillar analys och data. Inom bolaget kommer du ha en nyckelroll för att fortsätta driva och utveckla den digitala marknadsföringen samt optimera den digitala kundresan mot våra företagskunder. Du kommer även ansvara över en egen säljkanal, där du driver utvecklingen av kanalen, effektiviserar processer samt ökar tillväxten. Dessa kunder bearbetas och hanteras till största del digitalt och till din hjälp har du även vårt kvalificeringsteams som hanterar inkommande leads från hemsidan.  Du kommer också att arbeta med exempelvis att optimera DHL Freight hemsida, driva in leads, analys, uppföljning samt att utveckla och leda digitala projekt.\n\nTjänsten rapporterar till Head of Marketing på DHL Freight Sverige och tillhör Markandsteamet.\n \n\nArbetsuppgifter och ansvar\n     * Driva arbetet och utvecklingen av säljkanalen ”Direct Marketing”.\n     * Ta fram marknadsstrategier och utföra arbetet med hur vi arbetar med hemsidan och kundportalen med fokus på försäljning.\n     * Ansvara för SEO och SEM genom att agera beställare gentemot externa samarbetspartners samt att själv hantera optimeringen på hemsidan.\n     * Agera specialist i digitala kampanjer.\n     * Leda och initiera projekt inom marknad och se till att milstolpar och tidsramar hålls.\n     * Analysera data och ta fram uppföljningar via Adobe Analytics och vår egen kundbas.\n     * Budgetansvar.\n        \n\nProfil & Bakgrund\n\nDu är en lagspelare som har ena foten i den digitala världen och den andra inom det kommersiella. Det är därför viktigt att du gillar att arbeta krossfunktionellt med flera olika avdelningar och länder. Vi tror att ditt tillvägagångsätt är att arbeta strukturerat, datadrivet, agilt och nytänkande kring digital utveckling inom bolaget.\n\nVi ser att du har:\n     * Akademisk utbildning inom marknadsföring, kommunikation eller annan likvärdig utbildning.\n     * Minst 3-4 års arbetslivserfarenhet från liknande arbetsuppgifter.\n     * Brinnande intresse för digital marknadsföring och försäljning.\n     * Vana att arbeta med kundresan (User Expreience).\n     * Erfarenhet och intresse av analys.\n     * Erfarenhet av projektledning.\n     * Fördel om du har arbetat med CRM.\n     * Goda kunskaper i webbpubliceringsverktyg och grafiska program som exempelvis InDesign och Photoshop.\n     * Mycket goda kunskaper i både svenska och engelska i tal och skrift är ett krav.\n\nTjänsten är tillsvidare med 100 % tjänstgöringsgrad. Vi tillämpar provanställning.\nTjänsten är placerad i Solna, Stockholm.\n\nVad erbjuder vi dig?\n\nVi på DHL trivs och många av oss har jobbat här länge. Vi är ett företag som ser våra medarbetares utveckling och potential – vi vågar satsa på våra medarbetare! I det stora globala, och internationella bolaget som...",
        "conditions" : "FULLTIME\r\nPERMANENT",
        "text" : "På DHL arbetar vi med att få våra kunders vardag att fungera. Som ett av de ledande företagen i världen inom logistik, ser vi till att våra kunder får leverans av varor och material. Utan transporter stannar samhället, vi har ett viktigt uppdrag - Förena människor, förbättra liv.  Som medarbetare hos oss är du en viktig nyckelspelare.\n\nVill du arbeta med digital marknadsföring i en internationell organisation där du erbjuds strategiska och operativa arbetsuppgifter? Då tycker vi att du ska läsa vidare.\n\nVi letar nu efter en digital expert som brinner för digitala marknadsföring  samt gillar analys och data. Inom bolaget kommer du ha en nyckelroll för att fortsätta driva och utveckla den digitala marknadsföringen samt optimera den digitala kundresan mot våra företagskunder. Du kommer även ansvara över en egen säljkanal, där du driver utvecklingen av kanalen, effektiviserar processer samt ökar tillväxten. Dessa kunder bearbetas och hanteras till största del digitalt och till din hjälp har du även vårt kvalificeringsteams som hanterar inkommande leads från hemsidan.  Du kommer också att arbeta med exempelvis att optimera DHL Freight hemsida, driva in leads, analys, uppföljning samt att utveckla och leda digitala projekt.\n\nTjänsten rapporterar till Head of Marketing på DHL Freight Sverige och tillhör Markandsteamet.\n \n\nArbetsuppgifter och ansvar\n     * Driva arbetet och utvecklingen av säljkanalen ”Direct Marketing”.\n     * Ta fram marknadsstrategier och utföra arbetet med hur vi arbetar med hemsidan och kundportalen med fokus på försäljning.\n     * Ansvara för SEO och SEM genom att agera beställare gentemot externa samarbetspartners samt att själv hantera optimeringen på hemsidan.\n     * Agera specialist i digitala kampanjer.\n     * Leda och initiera projekt inom marknad och se till att milstolpar och tidsramar hålls.\n     * Analysera data och ta fram uppföljningar via Adobe Analytics och vår egen kundbas.\n     * Budgetansvar.\n        \n\nProfil & Bakgrund\n\nDu är en lagspelare som har ena foten i den digitala världen och den andra inom det kommersiella. Det är därför viktigt att du gillar att arbeta krossfunktionellt med flera olika avdelningar och länder. Vi tror att ditt tillvägagångsätt är att arbeta strukturerat, datadrivet, agilt och nytänkande kring digital utveckling inom bolaget.\n\nVi ser att du har:\n     * Akademisk utbildning inom marknadsföring, kommunikation eller annan likvärdig utbildning.\n     * Minst 3-4 års arbetslivserfarenhet från liknande arbetsuppgifter.\n     * Brinnande intresse för digital marknadsföring och försäljning.\n     * Vana att arbeta med kundresan (User Expreience).\n     * Erfarenhet och intresse av analys.\n     * Erfarenhet av projektledning.\n     * Fördel om du har arbetat med CRM.\n     * Goda kunskaper i webbpubliceringsverktyg och grafiska program som exempelvis InDesign och Photoshop.\n     * Mycket goda kunskaper i både svenska och engelska i tal och skrift är ett krav.\n\nTjänsten är tillsvidare med 100 % tjänstgöringsgrad. Vi tillämpar provanställning.\nTjänsten är placerad i Solna, Stockholm.\n\nVad erbjuder vi dig?\n\nVi på DHL trivs och många av oss har jobbat här länge. Vi är ett företag som ser våra medarbetares utveckling och potential – vi vågar satsa på våra medarbetare! I det stora globala, och internationella bolaget som..."
      },
      "headline" : "DHL Freight söker: Digital Marketing Manager",
      "driving_license" : null,
      "employer" : {
        "email" : null,
        "phone_number" : null,
        "organization_number" : "5561030437",
        "name" : "Dhl Freight (Sweden) AB",
        "url" : null,
        "workplace" : "DHL Freight (Sweden) AB"
      },
      "removed_date" : null,
      "logo_url" : "https://www.arbetsformedlingen.se/rest/arbetsgivare/rest/af/v3/organisation/5561030437/logotyper/logo.png",
      "last_publication_date" : "2022-08-31T23:59:59",
      "number_of_vacancies" : 1,
      "occupation" : {
        "concept_id" : "Eh2z_fA6_4Ls",
        "label" : "Marknadsanalytiker",
        "legacy_ams_taxonomy_id" : "5548"
      },
      "occupation_group" : {
        "concept_id" : "WX67_Pfb_WMN",
        "label" : "Marknadsanalytiker och marknadsförare m.fl.",
        "legacy_ams_taxonomy_id" : "2431"
      },
      "employment_type" : {
        "concept_id" : "PFZr_Syz_cUq",
        "label" : "Vanlig anställning",
        "legacy_ams_taxonomy_id" : "1"
      },
      "webpage_url" : "https://arbetsformedlingen.se/platsbanken/annonser/26365125",
      "driving_license_required" : false,
      "application_contacts" : [ {
        "description" : "Freight Sweden",
        "email" : null,
        "telephone" : null,
        "name" : null,
        "contact_type" : null
      } ],
      "duration" : {
        "concept_id" : "a7uU_j21_mkL",
        "label" : "Tills vidare",
        "legacy_ams_taxonomy_id" : "1"
      },
      "nice_to_have" : {
        "education_level" : [ ],
        "work_experiences" : [ ],
        "skills" : [ ],
        "education" : [ ],
        "languages" : [ ]
      },
      "application_details" : {
        "via_af" : false,
        "email" : null,
        "other" : null,
        "reference" : "130518",
        "url" : "https://ars2.equest.com/?response_id=6f532f92344bcc4e8510e91ff7829ba4",
        "information" : null
      },
      "source_type" : "VIA_PLATSBANKEN_DXA",
      "application_deadline" : "2022-08-31T23:59:59",
      "external_id" : "46-556103-0437-265380652",
      "workplace_address" : {
        "coordinates" : [ 18.008434, 59.368877 ],
        "city" : null,
        "postcode" : null,
        "municipality" : "Solna",
        "region_concept_id" : "CifL_Rzy_Mku",
        "region" : "Stockholms län",
        "country_code" : "199",
        "region_code" : "01",
        "municipality_concept_id" : "zHxw_uJZ_NJ8",
        "country_concept_id" : "i46j_HmG_v64",
        "municipality_code" : "0184",
        "street_address" : null,
        "country" : "Sverige"
      },
      "id" : "26365125",
      "experience_required" : true,
      "working_hours_type" : {
        "concept_id" : "6YE1_gAC_R2G",
        "label" : "Heltid",
        "legacy_ams_taxonomy_id" : "1"
      },
      "access" : null,
      "timestamp" : 1659307814013,
      "must_have" : {
        "education_level" : [ ],
        "work_experiences" : [ {
          "concept_id" : "Eh2z_fA6_4Ls",
          "weight" : 10,
          "label" : "Marknadsanalytiker",
          "legacy_ams_taxonomy_id" : "5548"
        } ],
        "skills" : [ ],
        "education" : [ ],
        "languages" : [ ]
      },
      "occupation_field" : {
        "concept_id" : "RPTn_bxG_ExZ",
        "label" : "Försäljning, inköp, marknadsföring",
        "legacy_ams_taxonomy_id" : "5"
      },
      "scope_of_work" : {
        "min" : 100,
        "max" : 100
      },
      "salary_type" : {
        "concept_id" : "oG8G_9cW_nRf",
        "label" : "Fast månads- vecko- eller timlön",
        "legacy_ams_taxonomy_id" : "1"
      },
      "removed" : false,
      "salary_description" : "SALARY",
      "access_to_own_car" : false,
      "publication_date" : "2022-08-01T00:50:14"
    },
    "name" : "DHL Freight söker: Digital Marketing Manager",
    "user" : "kristof.fischer"
  },
  "sha1" : "9d97c59d01639392678aba5ae91780493462a840",
  "annotations" : [ {
    "preferred-label" : "Manager",
    "sentiment" : "MUST_HAVE",
    "type" : "occupation-name",
    "start-position" : 19,
    "end-position" : 44,
    "concept-id" : "X9jv_K2b_m48",
    "matched-string" : "digital marketing manager",
    "annotation-id" : 0
  }, {
    "preferred-label" : "Sökordsoptimering/SEO",
    "sentiment" : "MUST_HAVE",
    "type" : "skill",
    "start-position" : 1629,
    "end-position" : 1632,
    "concept-id" : "zYHW_Mtu_jqq",
    "matched-string" : "seo",
    "annotation-id" : 5
  }, {
    "preferred-label" : "Sökmotormarknadsföring/SEM",
    "sentiment" : "MUST_HAVE",
    "type" : "skill",
    "start-position" : 1637,
    "end-position" : 1640,
    "concept-id" : "VANx_32R_rU1",
    "matched-string" : "sem",
    "annotation-id" : 6
  }, {
    "preferred-label" : "Adobe Analytics/SiteCatalyst",
    "sentiment" : "MUST_HAVE",
    "type" : "skill",
    "start-position" : 1944,
    "end-position" : 1959,
    "concept-id" : "TvaC_Wot_Xnz",
    "matched-string" : "adobe analytics",
    "annotation-id" : 8
  }, {
    "preferred-label" : "Budgetansvar",
    "sentiment" : "MUST_HAVE",
    "type" : "skill",
    "start-position" : 1989,
    "end-position" : 2001,
    "concept-id" : "Gt5f_wdi_FSJ",
    "matched-string" : "budgetansvar",
    "annotation-id" : 9
  }, {
    "preferred-label" : "Universitets- eller högskoleutbildning",
    "sentiment" : "MUST_HAVE",
    "type" : "sni-level-4",
    "start-position" : 2396,
    "end-position" : 2416,
    "concept-id" : "m1vC_Ssq_5Y7",
    "matched-string" : "Akademisk utbildning",
    "annotation-id" : 15
  }, {
    "preferred-label" : "Marknadsföring",
    "sentiment" : "MUST_HAVE",
    "type" : "sun-education-field-4",
    "start-position" : 2422,
    "end-position" : 2436,
    "concept-id" : "zTc5_e4U_Qsf",
    "matched-string" : "marknadsföring",
    "annotation-id" : 10
  }, {
    "preferred-label" : "Informations- och kommunikationsteknik (IKT), allmän utbildning",
    "sentiment" : "MUST_HAVE",
    "type" : "sun-education-field-4",
    "start-position" : 2438,
    "end-position" : 2451,
    "concept-id" : "Wswh_P8P_qEL",
    "matched-string" : "kommunikation",
    "annotation-id" : 16
  }, {
    "preferred-label" : "2-4 års erfarenhet",
    "sentiment" : "MUST_HAVE",
    "type" : "occupation-experience-year",
    "start-position" : 2493,
    "end-position" : 2527,
    "concept-id" : "RWA2_uu6_udD",
    "matched-string" : "Minst 3-4 års arbetslivserfarenhet",
    "annotation-id" : 17
  }, {
    "preferred-label" : "Digital marknadsföring/Onlinemarknadsföring",
    "sentiment" : "MUST_HAVE",
    "type" : "skill",
    "start-position" : 2589,
    "end-position" : 2611,
    "concept-id" : "Lz84_K5d_CcL",
    "matched-string" : "digital marknadsföring",
    "annotation-id" : 11
  }, {
    "preferred-label" : "User experience",
    "sentiment" : "MUST_HAVE",
    "type" : "skill",
    "start-position" : 2667,
    "end-position" : 2682,
    "concept-id" : "AdgQ_txR_S3M",
    "matched-string" : "User Expreience",
    "annotation-id" : 18
  }, {
    "preferred-label" : "Analysteknik",
    "sentiment" : "MUST_HAVE",
    "type" : "skill",
    "start-position" : 2719,
    "end-position" : 2725,
    "concept-id" : "Nwrk_3XY_Yur",
    "matched-string" : "analys",
    "annotation-id" : 19
  }, {
    "preferred-label" : "Projektledning, erfarenhet",
    "sentiment" : "MUST_HAVE",
    "type" : "skill",
    "start-position" : 2748,
    "end-position" : 2762,
    "concept-id" : "3TSx_fJE_Z26",
    "matched-string" : "projektledning",
    "annotation-id" : 20
  }, {
    "preferred-label" : "Customer Relationship Management/CRM",
    "sentiment" : "MUST_HAVE",
    "type" : "skill",
    "start-position" : 2800,
    "end-position" : 2803,
    "concept-id" : "dQre_aBF_3dE",
    "matched-string" : "crm",
    "annotation-id" : 12
  }, {
    "preferred-label" : "Layout-Adobe InDesign",
    "sentiment" : "MUST_HAVE",
    "type" : "skill",
    "start-position" : 2889,
    "end-position" : 2897,
    "concept-id" : "Y2t4_aS8_tGo",
    "matched-string" : "InDesign",
    "annotation-id" : 21
  }, {
    "preferred-label" : "2D-grafik-Adobe Photoshop",
    "sentiment" : "MUST_HAVE",
    "type" : "skill",
    "start-position" : 2902,
    "end-position" : 2911,
    "concept-id" : "xNyv_PTi_fSa",
    "matched-string" : "Photoshop",
    "annotation-id" : 22
  }, {
    "preferred-label" : "Svenska",
    "sentiment" : "MUST_HAVE",
    "type" : "language",
    "start-position" : 2949,
    "end-position" : 2956,
    "concept-id" : "zSLA_vw2_FXN",
    "matched-string" : "svenska",
    "annotation-id" : 13
  }, {
    "preferred-label" : "Engelska",
    "sentiment" : "MUST_HAVE",
    "type" : "language",
    "start-position" : 2961,
    "end-position" : 2969,
    "concept-id" : "NVxJ_hLg_TYS",
    "matched-string" : "engelska",
    "annotation-id" : 14
  }, {
    "preferred-label" : "Tillsvidareanställning (inkl. eventuell provanställning)",
    "type" : "employment-type",
    "start-position" : 3013,
    "end-position" : 3024,
    "concept-id" : "kpPX_CNN_gDU",
    "matched-string" : "tillsvidare",
    "annotation-id" : 23
  }, {
    "preferred-label" : "Heltid",
    "type" : "worktime-extent",
    "start-position" : 3029,
    "end-position" : 3034,
    "concept-id" : "6YE1_gAC_R2G",
    "matched-string" : "100 %",
    "annotation-id" : 24
  }, {
    "preferred-label" : "Solna",
    "type" : "municipality",
    "start-position" : 3107,
    "end-position" : 3112,
    "concept-id" : "zHxw_uJZ_NJ8",
    "matched-string" : "Solna",
    "annotation-id" : 26
  }, {
    "preferred-label" : "Stockholm",
    "type" : "municipality",
    "start-position" : 3114,
    "end-position" : 3123,
    "concept-id" : "AvNB_uwa_6n6",
    "matched-string" : "Stockholm",
    "annotation-id" : 25
  } ],
  "text" : "DHL Freight söker: Digital Marketing Manager\nPå DHL arbetar vi med att få våra kunders vardag att fungera. Som ett av de ledande företagen i världen inom logistik, ser vi till att våra kunder får leverans av varor och material. Utan transporter stannar samhället, vi har ett viktigt uppdrag - Förena människor, förbättra liv.  Som medarbetare hos oss är du en viktig nyckelspelare.\n\nVill du arbeta med digital marknadsföring i en internationell organisation där du erbjuds strategiska och operativa arbetsuppgifter? Då tycker vi att du ska läsa vidare.\n\nVi letar nu efter en digital expert som brinner för digitala marknadsföring  samt gillar analys och data. Inom bolaget kommer du ha en nyckelroll för att fortsätta driva och utveckla den digitala marknadsföringen samt optimera den digitala kundresan mot våra företagskunder. Du kommer även ansvara över en egen säljkanal, där du driver utvecklingen av kanalen, effektiviserar processer samt ökar tillväxten. Dessa kunder bearbetas och hanteras till största del digitalt och till din hjälp har du även vårt kvalificeringsteams som hanterar inkommande leads från hemsidan.  Du kommer också att arbeta med exempelvis att optimera DHL Freight hemsida, driva in leads, analys, uppföljning samt att utveckla och leda digitala projekt.\n\nTjänsten rapporterar till Head of Marketing på DHL Freight Sverige och tillhör Markandsteamet.\n \n\nArbetsuppgifter och ansvar\n     * Driva arbetet och utvecklingen av säljkanalen ”Direct Marketing”.\n     * Ta fram marknadsstrategier och utföra arbetet med hur vi arbetar med hemsidan och kundportalen med fokus på försäljning.\n     * Ansvara för SEO och SEM genom att agera beställare gentemot externa samarbetspartners samt att själv hantera optimeringen på hemsidan.\n     * Agera specialist i digitala kampanjer.\n     * Leda och initiera projekt inom marknad och se till att milstolpar och tidsramar hålls.\n     * Analysera data och ta fram uppföljningar via Adobe Analytics och vår egen kundbas.\n     * Budgetansvar.\n        \n\nProfil & Bakgrund\n\nDu är en lagspelare som har ena foten i den digitala världen och den andra inom det kommersiella. Det är därför viktigt att du gillar att arbeta krossfunktionellt med flera olika avdelningar och länder. Vi tror att ditt tillvägagångsätt är att arbeta strukturerat, datadrivet, agilt och nytänkande kring digital utveckling inom bolaget.\n\nVi ser att du har:\n     * Akademisk utbildning inom marknadsföring, kommunikation eller annan likvärdig utbildning.\n     * Minst 3-4 års arbetslivserfarenhet från liknande arbetsuppgifter.\n     * Brinnande intresse för digital marknadsföring och försäljning.\n     * Vana att arbeta med kundresan (User Expreience).\n     * Erfarenhet och intresse av analys.\n     * Erfarenhet av projektledning.\n     * Fördel om du har arbetat med CRM.\n     * Goda kunskaper i webbpubliceringsverktyg och grafiska program som exempelvis InDesign och Photoshop.\n     * Mycket goda kunskaper i både svenska och engelska i tal och skrift är ett krav.\n\nTjänsten är tillsvidare med 100 % tjänstgöringsgrad. Vi tillämpar provanställning.\nTjänsten är placerad i Solna, Stockholm.\n\nVad erbjuder vi dig?\n\nVi på DHL trivs och många av oss har jobbat här länge. Vi är ett företag som ser våra medarbetares utveckling och potential – vi vågar satsa på våra medarbetare! I det stora globala, och internationella bolaget som..."
}