{
  "meta" : {
    "jobad" : {
      "description" : {
        "requirements" : null,
        "needs" : null,
        "company_information" : null,
        "text_formatted" : "Vill du bli vår nya kollega? I Motala, Östergötlands sjöstad, är vi öppna, stolta och nyskapande. Vår kommun är rätt plats för att bidra, utvecklas och trivas. Hos oss får du arbeta med engagerade kollegor, utveckla dig inom ditt område och jobba med det viktigaste som finns.\n\nVi gillar dig – och vi hjälper dig att utvecklas. Vår mission är att barn och vuxna tillsammans ska utvecklas till kreativa, positiva individer som väljer livsglädje. Därför erbjuder vi en bred och djup verksamhet där vi ger dig möjligheterna, oavsett vilka mål du har. Motala ska vara en attraktiv och innovativ del av östgötaregionen där det är enkelt att bo och verka. Det är också vår drivkraft inom bildningsförvaltningen. \n\nCarlsund Utbildningscentrum är en av Motala kommuns två gymnasieskolor. Skolan leds av två rektorer. På skolan finns sju nationella yrkesprogram samt Introduktionsprogrammet IM. \n\n\r\n\r\nARBETSUPPGIFTER\nVi rekryterar just nu en ny rektor till Carlsunds Utbildningscentrum. Ditt uppdrag som interim rektor blir att under rekryteringstiden leda den dagliga driften vid skolenheten och programmen Bygg-och anläggningsprogrammet, Fordon och transportprogrammet, Industritekniska programmet, Hotell och turismprogrammet samt IM. Du har ansvar för ekonomi, personal och verksamhet på enheten och rapporterar till verksamhetschef. Arbetet utför du i nära samarbete med ytterligare en rektor som idag arbetar på Carlsunds Utbildningscentrum. \r\n\r\nKVALIFIKATIONER\nVi söker dig med högskoleutbildning inom relevant område, gärna inom skolområdet. Du har tidigare erfarenhet av chefs- och ledaruppdrag och har arbetat som rektor inom utbildningssektorn.  Vi ser det som meriterande om du har påbörjad eller genomförd rektorsutbildning. Vi söker dig som är trygg och stabil i ditt ledarskap. Du har god kommunikativ förmåga och uttrycker dig väl i tal och skrift. \r\n\nÖVRIGT\nTillsättning sker under förutsättning av vederbörliga beslut. \n\nRekrytering sker fortlöpande - så skicka in din ansökan redan idag!\n\nHar du önskemål om annan tjänstgöringsgrad än heltid så kan det vara möjligt \n\nNotera vikten av att du söker tjänsten digitalt via www.offentligajobb.se \n\nVi undanber oss all extern rekryterings- och annonseringshjälp i samband med denna annons.",
        "conditions" : "Heltid. \r\nTidsbegränsad anställning, tillträde: Tillträde snarast möjligt eller enligt överenskommelse. \n\nIntervjuer kommer att ske löpande- så skicka in din ansökan redan idag. , upphör: 2023-01-08  .",
        "text" : "Vill du bli vår nya kollega? I Motala, Östergötlands sjöstad, är vi öppna, stolta och nyskapande. Vår kommun är rätt plats för att bidra, utvecklas och trivas. Hos oss får du arbeta med engagerade kollegor, utveckla dig inom ditt område och jobba med det viktigaste som finns.\n\nVi gillar dig – och vi hjälper dig att utvecklas. Vår mission är att barn och vuxna tillsammans ska utvecklas till kreativa, positiva individer som väljer livsglädje. Därför erbjuder vi en bred och djup verksamhet där vi ger dig möjligheterna, oavsett vilka mål du har. Motala ska vara en attraktiv och innovativ del av östgötaregionen där det är enkelt att bo och verka. Det är också vår drivkraft inom bildningsförvaltningen. \n\nCarlsund Utbildningscentrum är en av Motala kommuns två gymnasieskolor. Skolan leds av två rektorer. På skolan finns sju nationella yrkesprogram samt Introduktionsprogrammet IM. \n\n\r\n\r\nARBETSUPPGIFTER\nVi rekryterar just nu en ny rektor till Carlsunds Utbildningscentrum. Ditt uppdrag som interim rektor blir att under rekryteringstiden leda den dagliga driften vid skolenheten och programmen Bygg-och anläggningsprogrammet, Fordon och transportprogrammet, Industritekniska programmet, Hotell och turismprogrammet samt IM. Du har ansvar för ekonomi, personal och verksamhet på enheten och rapporterar till verksamhetschef. Arbetet utför du i nära samarbete med ytterligare en rektor som idag arbetar på Carlsunds Utbildningscentrum. \r\n\r\nKVALIFIKATIONER\nVi söker dig med högskoleutbildning inom relevant område, gärna inom skolområdet. Du har tidigare erfarenhet av chefs- och ledaruppdrag och har arbetat som rektor inom utbildningssektorn.  Vi ser det som meriterande om du har påbörjad eller genomförd rektorsutbildning. Vi söker dig som är trygg och stabil i ditt ledarskap. Du har god kommunikativ förmåga och uttrycker dig väl i tal och skrift. \r\n\nÖVRIGT\nTillsättning sker under förutsättning av vederbörliga beslut. \n\nRekrytering sker fortlöpande - så skicka in din ansökan redan idag!\n\nHar du önskemål om annan tjänstgöringsgrad än heltid så kan det vara möjligt \n\nNotera vikten av att du söker tjänsten digitalt via www.offentligajobb.se \n\nVi undanber oss all extern rekryterings- och annonseringshjälp i samband med denna annons."
      },
      "headline" : "Interim rektor- Carlsund",
      "driving_license" : null,
      "employer" : {
        "email" : null,
        "phone_number" : null,
        "organization_number" : "2120002817",
        "name" : "Motala kommun",
        "url" : null,
        "workplace" : "Motala kommun, Carlsund"
      },
      "removed_date" : null,
      "logo_url" : null,
      "last_publication_date" : "2022-08-14T23:59:59",
      "number_of_vacancies" : 1,
      "occupation" : {
        "concept_id" : "hr5f_dci_NcD",
        "label" : "Rektor",
        "legacy_ams_taxonomy_id" : "3422"
      },
      "occupation_group" : {
        "concept_id" : "z8di_AqX_GBr",
        "label" : "Chefer inom grund- och gymnasieskola samt vuxenutbildning",
        "legacy_ams_taxonomy_id" : "1410"
      },
      "employment_type" : {
        "concept_id" : "PFZr_Syz_cUq",
        "label" : "Vanlig anställning",
        "legacy_ams_taxonomy_id" : "1"
      },
      "webpage_url" : "https://arbetsformedlingen.se/platsbanken/annonser/26270594",
      "driving_license_required" : false,
      "application_contacts" : [ {
        "description" : "Natalie Hansson",
        "email" : null,
        "telephone" : "+46141225000 (växel)",
        "name" : null,
        "contact_type" : "HR-partner"
      }, {
        "description" : "Hans Grimsell",
        "email" : "hans.grimsell@motala.se",
        "telephone" : null,
        "name" : null,
        "contact_type" : "Verksamhetschef"
      } ],
      "duration" : {
        "concept_id" : "Xj7x_7yZ_jEn",
        "label" : "3 månader – upp till 6 månader",
        "legacy_ams_taxonomy_id" : "3"
      },
      "nice_to_have" : {
        "education_level" : [ ],
        "work_experiences" : [ ],
        "skills" : [ ],
        "education" : [ ],
        "languages" : [ ]
      },
      "application_details" : {
        "via_af" : false,
        "email" : null,
        "other" : null,
        "reference" : "B 334/22",
        "url" : "https://recruit.visma.com/Public/Apply.aspx?guidAssignment=53c30fc3-c31c-4cf5-a926-390b71938ba5&publishCode=AMS&TK=613b2111-8726-44a2-82fb-48fa481a0b21",
        "information" : null
      },
      "source_type" : "VIA_PLATSBANKEN_DXA",
      "application_deadline" : "2022-08-14T23:59:59",
      "external_id" : "46-212000-2817-53C30FC3C31C4CF5A926390B71938BA5",
      "workplace_address" : {
        "coordinates" : [ 15.047093, 58.538033 ],
        "city" : null,
        "postcode" : null,
        "municipality" : "Motala",
        "region_concept_id" : "oLT3_Q9p_3nn",
        "region" : "Östergötlands län",
        "country_code" : "199",
        "region_code" : "05",
        "municipality_concept_id" : "E1MC_1uG_phm",
        "country_concept_id" : "i46j_HmG_v64",
        "municipality_code" : "0583",
        "street_address" : null,
        "country" : "Sverige"
      },
      "id" : "26270594",
      "experience_required" : true,
      "working_hours_type" : {
        "concept_id" : "6YE1_gAC_R2G",
        "label" : "Heltid",
        "legacy_ams_taxonomy_id" : "1"
      },
      "access" : null,
      "timestamp" : 1656587418414,
      "must_have" : {
        "education_level" : [ ],
        "work_experiences" : [ {
          "concept_id" : "hr5f_dci_NcD",
          "weight" : 10,
          "label" : "Rektor",
          "legacy_ams_taxonomy_id" : "3422"
        } ],
        "skills" : [ ],
        "education" : [ ],
        "languages" : [ ]
      },
      "occupation_field" : {
        "concept_id" : "bh3H_Y3h_5eD",
        "label" : "Chefer och verksamhetsledare",
        "legacy_ams_taxonomy_id" : "20"
      },
      "scope_of_work" : {
        "min" : 100,
        "max" : 100
      },
      "salary_type" : {
        "concept_id" : "oG8G_9cW_nRf",
        "label" : "Fast månads- vecko- eller timlön",
        "legacy_ams_taxonomy_id" : "1"
      },
      "removed" : false,
      "salary_description" : "Enligt avtal.",
      "access_to_own_car" : false,
      "publication_date" : "2022-06-30T00:00:00"
    },
    "name" : "Interim rektor- Carlsund",
    "user" : "hannes"
  },
  "sha1" : "ba19648b9fd79536fb5c61eb29cb38c189d176d5",
  "annotations" : [ {
    "preferred-label" : "Rektor",
    "type" : "occupation-name",
    "start-position" : 8,
    "end-position" : 14,
    "concept-id" : "hr5f_dci_NcD",
    "matched-string" : "rektor",
    "annotation-id" : 4
  }, {
    "preferred-label" : "Motala",
    "type" : "municipality",
    "start-position" : 56,
    "end-position" : 62,
    "concept-id" : "E1MC_1uG_phm",
    "matched-string" : "Motala",
    "annotation-id" : 5
  }, {
    "preferred-label" : "Motala",
    "type" : "municipality",
    "start-position" : 573,
    "end-position" : 579,
    "concept-id" : "E1MC_1uG_phm",
    "matched-string" : "Motala",
    "annotation-id" : 6
  }, {
    "preferred-label" : "Östergötlands län",
    "type" : "region",
    "start-position" : 623,
    "end-position" : 638,
    "concept-id" : "oLT3_Q9p_3nn",
    "matched-string" : "östgötaregionen",
    "annotation-id" : 7
  }, {
    "preferred-label" : "Motala",
    "type" : "municipality",
    "start-position" : 770,
    "end-position" : 784,
    "concept-id" : "E1MC_1uG_phm",
    "matched-string" : "Motala kommuns",
    "annotation-id" : 8
  }, {
    "preferred-label" : "Rektor",
    "type" : "occupation-name",
    "start-position" : 824,
    "end-position" : 832,
    "concept-id" : "hr5f_dci_NcD",
    "matched-string" : "rektorer",
    "annotation-id" : 9
  }, {
    "preferred-label" : "Gymnasieskolans bygg- och anläggningsprogram, inriktning husbyggnad",
    "type" : "keyword",
    "start-position" : 1124,
    "end-position" : 1154,
    "concept-id" : "cH6v_inP_pBN",
    "matched-string" : "Bygg-och anläggningsprogrammet",
    "annotation-id" : 10
  }, {
    "preferred-label" : "Gymnasieskolans fordons- och transportprogram, inriktning transport",
    "type" : "keyword",
    "start-position" : 1156,
    "end-position" : 1186,
    "concept-id" : "2cVb_SQk_Ygo",
    "matched-string" : "Fordon och transportprogrammet",
    "annotation-id" : 11
  }, {
    "preferred-label" : "Gymnasieskolans industritekniska program",
    "type" : "keyword",
    "start-position" : 1188,
    "end-position" : 1215,
    "concept-id" : "UxgM_KuE_pwv",
    "matched-string" : "Industritekniska programmet",
    "annotation-id" : 12
  }, {
    "preferred-label" : "Gymnasieskolans hotell- och turismprogram, inriktning turism och resor",
    "type" : "keyword",
    "start-position" : 1217,
    "end-position" : 1244,
    "concept-id" : "FbhR_shS_md2",
    "matched-string" : "Hotell och turismprogrammet",
    "annotation-id" : 13
  }, {
    "preferred-label" : "Ekonomi",
    "sentiment" : "MUST_HAVE",
    "type" : "keyword",
    "start-position" : 1272,
    "end-position" : 1279,
    "concept-id" : "PW4f_bmT_new",
    "matched-string" : "ekonomi",
    "annotation-id" : 2
  }, {
    "preferred-label" : "Personal",
    "sentiment" : "MUST_HAVE",
    "type" : "keyword",
    "start-position" : 1281,
    "end-position" : 1289,
    "concept-id" : "HVxM_6MS_y1c",
    "matched-string" : "personal",
    "annotation-id" : 3
  }, {
    "preferred-label" : "Verksamhetsledning, gymnasieskolan",
    "type" : "skill",
    "start-position" : 1294,
    "end-position" : 1304,
    "concept-id" : "Ju2P_fHA_n5B",
    "matched-string" : "verksamhet",
    "annotation-id" : 14
  }, {
    "preferred-label" : "Chefer inom grund- och gymnasieskola samt vuxenutbildning",
    "type" : "ssyk-level-4",
    "start-position" : 1337,
    "end-position" : 1352,
    "concept-id" : "z8di_AqX_GBr",
    "matched-string" : "verksamhetschef",
    "annotation-id" : 15
  }, {
    "preferred-label" : "Rektor",
    "type" : "occupation-name",
    "start-position" : 1407,
    "end-position" : 1413,
    "concept-id" : "hr5f_dci_NcD",
    "matched-string" : "rektor",
    "annotation-id" : 16
  }, {
    "preferred-label" : "Högskoleutbildning, generell, 3 år",
    "type" : "sun-education-level-3",
    "start-position" : 1501,
    "end-position" : 1519,
    "concept-id" : "u9Qr_2wJ_nVu",
    "matched-string" : "högskoleutbildning",
    "annotation-id" : 17
  }, {
    "preferred-label" : "Rektor",
    "type" : "occupation-name",
    "start-position" : 1640,
    "end-position" : 1646,
    "concept-id" : "hr5f_dci_NcD",
    "matched-string" : "rektor",
    "annotation-id" : 18
  }, {
    "preferred-label" : "Heltid",
    "type" : "worktime-extent",
    "start-position" : 2070,
    "end-position" : 2076,
    "concept-id" : "6YE1_gAC_R2G",
    "matched-string" : "heltid",
    "annotation-id" : 19
  } ],
  "text" : "Interim rektor- Carlsund\nVill du bli vår nya kollega? I Motala, Östergötlands sjöstad, är vi öppna, stolta och nyskapande. Vår kommun är rätt plats för att bidra, utvecklas och trivas. Hos oss får du arbeta med engagerade kollegor, utveckla dig inom ditt område och jobba med det viktigaste som finns.\n\nVi gillar dig – och vi hjälper dig att utvecklas. Vår mission är att barn och vuxna tillsammans ska utvecklas till kreativa, positiva individer som väljer livsglädje. Därför erbjuder vi en bred och djup verksamhet där vi ger dig möjligheterna, oavsett vilka mål du har. Motala ska vara en attraktiv och innovativ del av östgötaregionen där det är enkelt att bo och verka. Det är också vår drivkraft inom bildningsförvaltningen. \n\nCarlsund Utbildningscentrum är en av Motala kommuns två gymnasieskolor. Skolan leds av två rektorer. På skolan finns sju nationella yrkesprogram samt Introduktionsprogrammet IM. \n\n\r\n\r\nARBETSUPPGIFTER\nVi rekryterar just nu en ny rektor till Carlsunds Utbildningscentrum. Ditt uppdrag som interim rektor blir att under rekryteringstiden leda den dagliga driften vid skolenheten och programmen Bygg-och anläggningsprogrammet, Fordon och transportprogrammet, Industritekniska programmet, Hotell och turismprogrammet samt IM. Du har ansvar för ekonomi, personal och verksamhet på enheten och rapporterar till verksamhetschef. Arbetet utför du i nära samarbete med ytterligare en rektor som idag arbetar på Carlsunds Utbildningscentrum. \r\n\r\nKVALIFIKATIONER\nVi söker dig med högskoleutbildning inom relevant område, gärna inom skolområdet. Du har tidigare erfarenhet av chefs- och ledaruppdrag och har arbetat som rektor inom utbildningssektorn.  Vi ser det som meriterande om du har påbörjad eller genomförd rektorsutbildning. Vi söker dig som är trygg och stabil i ditt ledarskap. Du har god kommunikativ förmåga och uttrycker dig väl i tal och skrift. \r\n\nÖVRIGT\nTillsättning sker under förutsättning av vederbörliga beslut. \n\nRekrytering sker fortlöpande - så skicka in din ansökan redan idag!\n\nHar du önskemål om annan tjänstgöringsgrad än heltid så kan det vara möjligt \n\nNotera vikten av att du söker tjänsten digitalt via www.offentligajobb.se \n\nVi undanber oss all extern rekryterings- och annonseringshjälp i samband med denna annons."
}