{
  "meta" : {
    "jobad" : {
      "description" : {
        "requirements" : null,
        "needs" : null,
        "company_information" : null,
        "text_formatted" : "Tänndalens skidanläggning söker nu Skidområdesmedarbetare/liftskötare till vintersäsongen 2022/23.\n \nSom Skidområdesmedarbetare/liftskötare ser du till så att våra liftar snurrar hela tiden, samt hjälper våra gäster med byglar och information. Du vistas ute i naturen hela dagarna och du får gott om frisk luft och en härlig solbränna. Du är glad och utåtriktad, hjälper gärna till och tycker om att möta nya människor.\n \nVi erbjuder många nya kompisar och kollegor men också oförglömliga minnen och roliga stunder! Tidigare arbete inom skidindustrin är meriterande men ett brett leende väger alltid tyngst.\n \nTjänsten är från mitten på december - början på maj.\n \nRekrytering sker löpande och kan komma att tillsättas innan sista ansökningsdagen.\n\n\n\nTänndalen är en av Sveriges större skidanläggningar och ingår som en del i Skandinaviens största skidområde Funäsfjällen, Härjedalen. Tänndalens skidområde består av 13 liftar och 54 nedfarter. På området finns ett flertal restauranger, caféer, värmestugor, skiduthyrning med sportbutik samt livsmedelsbutik. Hamrafjällets Lift även kallat Tänndalen ingår i Grönklittsgruppen som också äger skidanläggningen Orsa Grönklitt i Dalarna",
        "conditions" : "Schemalagd\r\nVisstid",
        "text" : "Tänndalens skidanläggning söker nu Skidområdesmedarbetare/liftskötare till vintersäsongen 2022/23.\n \nSom Skidområdesmedarbetare/liftskötare ser du till så att våra liftar snurrar hela tiden, samt hjälper våra gäster med byglar och information. Du vistas ute i naturen hela dagarna och du får gott om frisk luft och en härlig solbränna. Du är glad och utåtriktad, hjälper gärna till och tycker om att möta nya människor.\n \nVi erbjuder många nya kompisar och kollegor men också oförglömliga minnen och roliga stunder! Tidigare arbete inom skidindustrin är meriterande men ett brett leende väger alltid tyngst.\n \nTjänsten är från mitten på december - början på maj.\n \nRekrytering sker löpande och kan komma att tillsättas innan sista ansökningsdagen.\n\n\n\nTänndalen är en av Sveriges större skidanläggningar och ingår som en del i Skandinaviens största skidområde Funäsfjällen, Härjedalen. Tänndalens skidområde består av 13 liftar och 54 nedfarter. På området finns ett flertal restauranger, caféer, värmestugor, skiduthyrning med sportbutik samt livsmedelsbutik. Hamrafjällets Lift även kallat Tänndalen ingår i Grönklittsgruppen som också äger skidanläggningen Orsa Grönklitt i Dalarna"
      },
      "headline" : "Skidområdesmedarbetare",
      "driving_license" : null,
      "employer" : {
        "email" : null,
        "phone_number" : null,
        "organization_number" : "5560987462",
        "name" : "Grönklittsgruppen AB (Publ)",
        "url" : "http://gronklittsgruppen.se",
        "workplace" : "Hamrafjällets Lift AB"
      },
      "removed_date" : null,
      "logo_url" : null,
      "last_publication_date" : "2022-10-30T23:59:59",
      "number_of_vacancies" : 15,
      "occupation" : {
        "concept_id" : "VkYt_FPS_23Q",
        "label" : "Skidliftskötare",
        "legacy_ams_taxonomy_id" : "5686"
      },
      "occupation_group" : {
        "concept_id" : "XYzP_5Tn_7Ep",
        "label" : "Kranförare m.fl.",
        "legacy_ams_taxonomy_id" : "8343"
      },
      "employment_type" : {
        "concept_id" : "PFZr_Syz_cUq",
        "label" : "Vanlig anställning",
        "legacy_ams_taxonomy_id" : "1"
      },
      "webpage_url" : "https://arbetsformedlingen.se/platsbanken/annonser/26170760",
      "driving_license_required" : false,
      "application_contacts" : [ {
        "description" : "Nike  Bent",
        "email" : "nike.b@tanndalen.com",
        "telephone" : null,
        "name" : null,
        "contact_type" : "Sportchef"
      } ],
      "duration" : {
        "concept_id" : "Xj7x_7yZ_jEn",
        "label" : "3 månader – upp till 6 månader",
        "legacy_ams_taxonomy_id" : "3"
      },
      "nice_to_have" : {
        "education_level" : [ ],
        "work_experiences" : [ ],
        "skills" : [ ],
        "education" : [ ],
        "languages" : [ ]
      },
      "application_details" : {
        "via_af" : false,
        "email" : null,
        "other" : null,
        "reference" : null,
        "url" : "https://www.recruto.se/apps/ads/view/id/49127-gronklittsgruppen-harjedalen-skidomrdesmedarbetare/tracking/5",
        "information" : null
      },
      "source_type" : "VIA_PLATSBANKEN_DXA",
      "application_deadline" : "2022-10-30T23:59:59",
      "external_id" : "46-556098-7462-322-49127-2",
      "workplace_address" : {
        "coordinates" : [ 13.407971, 62.36934 ],
        "city" : null,
        "postcode" : null,
        "municipality" : "Härjedalen",
        "region_concept_id" : "65Ms_7r1_RTG",
        "region" : "Jämtlands län",
        "country_code" : "199",
        "region_code" : "23",
        "municipality_concept_id" : "j35Q_VKL_NiM",
        "country_concept_id" : "i46j_HmG_v64",
        "municipality_code" : "2361",
        "street_address" : null,
        "country" : "Sverige"
      },
      "id" : "26170760",
      "experience_required" : false,
      "working_hours_type" : {
        "concept_id" : "947z_JGS_Uk2",
        "label" : "Deltid",
        "legacy_ams_taxonomy_id" : "2"
      },
      "access" : null,
      "timestamp" : 1654241891706,
      "must_have" : {
        "education_level" : [ ],
        "work_experiences" : [ ],
        "skills" : [ ],
        "education" : [ ],
        "languages" : [ ]
      },
      "occupation_field" : {
        "concept_id" : "j7Cq_ZJe_GkT",
        "label" : "Bygg och anläggning",
        "legacy_ams_taxonomy_id" : "2"
      },
      "scope_of_work" : {
        "min" : 0,
        "max" : 100
      },
      "salary_type" : {
        "concept_id" : "oG8G_9cW_nRf",
        "label" : "Fast månads- vecko- eller timlön",
        "legacy_ams_taxonomy_id" : "1"
      },
      "removed" : false,
      "salary_description" : "Fast",
      "access_to_own_car" : false,
      "publication_date" : "2022-06-03T09:16:13"
    },
    "name" : "Skidområdesmedarbetare",
    "user" : "hannes"
  },
  "sha1" : "3864a127ab8d0820e3b4b0cff5dd45b54ec07d7f",
  "annotations" : [ {
    "preferred-label" : "Liftskötare/Lifttekniker",
    "sentiment" : "MUST_HAVE",
    "type" : "occupation-name",
    "start-position" : 81,
    "end-position" : 92,
    "concept-id" : "PNes_JEh_hiT",
    "matched-string" : "liftskötare",
    "annotation-id" : 0
  }, {
    "preferred-label" : "Liftskötare/Lifttekniker",
    "sentiment" : "MUST_HAVE",
    "type" : "occupation-name",
    "start-position" : 151,
    "end-position" : 162,
    "concept-id" : "PNes_JEh_hiT",
    "matched-string" : "liftskötare",
    "annotation-id" : 1
  } ],
  "text" : "Skidområdesmedarbetare\nTänndalens skidanläggning söker nu Skidområdesmedarbetare/liftskötare till vintersäsongen 2022/23.\n \nSom Skidområdesmedarbetare/liftskötare ser du till så att våra liftar snurrar hela tiden, samt hjälper våra gäster med byglar och information. Du vistas ute i naturen hela dagarna och du får gott om frisk luft och en härlig solbränna. Du är glad och utåtriktad, hjälper gärna till och tycker om att möta nya människor.\n \nVi erbjuder många nya kompisar och kollegor men också oförglömliga minnen och roliga stunder! Tidigare arbete inom skidindustrin är meriterande men ett brett leende väger alltid tyngst.\n \nTjänsten är från mitten på december - början på maj.\n \nRekrytering sker löpande och kan komma att tillsättas innan sista ansökningsdagen.\n\n\n\nTänndalen är en av Sveriges större skidanläggningar och ingår som en del i Skandinaviens största skidområde Funäsfjällen, Härjedalen. Tänndalens skidområde består av 13 liftar och 54 nedfarter. På området finns ett flertal restauranger, caféer, värmestugor, skiduthyrning med sportbutik samt livsmedelsbutik. Hamrafjällets Lift även kallat Tänndalen ingår i Grönklittsgruppen som också äger skidanläggningen Orsa Grönklitt i Dalarna"
}