{
  "meta" : {
    "jobad" : {
      "description" : {
        "requirements" : null,
        "needs" : null,
        "company_information" : null,
        "text_formatted" : "<p><br></p><p><strong>Företagsbeskrivning</strong></p><p>På AFRY samlar vi ledande digital expertis och teknologier i AFRY X. Den nya divisionen AFRY X är en digital ledare och experthubb inom industriell IoT, AI, design och cybersäkerhet som hjälper kunder att accelerera sin digitala transformation.</p><p>AFRY är en europeisk ledare inom ingenjörs-, design- och rådgivningstjänster med global räckvidd. Vi påskyndar omställningen mot ett hållbart samhälle.</p><p>Vi är 16 000 hängivna experter inom infrastruktur, industri, energi och digitalisering, som skapar hållbara lösningar för kommande generationer.</p><p><br></p><p><strong>Jobbeskrivning</strong></p><p>Vi på Digital Quality i Stockholm är ett team med mer än 50 specialister och ledare inom digitalisering och kvalitetssäkring. För att möta efterfrågan hos våra kunder och i våra projekt söker vi just nu fler kollegor som har erfarenhet från och vill fortsätta utvecklas inom kravhantering.</p><p>Vi ser otroliga fördelar i att ha ett team med olika bakgrund och erfarenheter där den gemensamma faktorn är kvalitetssäkring till våra kunder. En avgörande egenskap hos dig som person är att känna ett driv och stort intresse inom just detta. Som kravanalytiker och konsult hos oss har du en viktig roll i något av våra uppdrag där vi har en variation av kunduppdrag, interna projekt samt åtaganden och teamleveranser. Vi söker dig som vill utvecklas inom kravhantering och ser variationen som konsultrollen innebär som spännande.</p><p>Något vi är extra stolta över är när vi med samlad kompetens kan gå in och bidra i samhällsnyttiga funktioner och det är där vi vill ha dig med ombord!</p><p><br></p><p><strong>Kravspecifikation</strong></p><p>I alla våra rekryteringar lägger vi stor vikt vid personliga egenskaper och tror att du är en person som gillar att inspirera och lämna avtryck hos andra. Du värnar om kvalitet och vill stötta verksamheter i att lyckas med sina projekt genom ledning och styrning och genom effektiv förmedling av deras önskemål, behov och krav. Du har erfarenhet av att arbeta med krav på ett strukturerat sätt efter Agila metoder. Vidare har du erfarenhet av att driva workshops, intressentanalyser och är bekant med Use Case och User Storys. </p><p><strong>Kravprofil:</strong></p><ul><li>Flerårig erfarenhet av rollen som kravanalytiker och/eller kravledare</li><li>Djup kunskap och erfarenhet av att arbeta som kravanlytiker i en Agil kontext </li><li>Erfarenhet av behovsanalyser, förstudier och att hålla workshops</li><li>Mycket goda kunskaper i svenska och engelska, både i tal och skrift</li></ul><p><strong>Meriterande: </strong></p><ul><li>Erfarenhet som Agil coach, produktägare, projektledare eller Scrum Master</li><li>Akademisk utbildning</li></ul><p><br></p><p><strong>Ytterligare information</strong></p><p>Som anställd hos oss inom Digital Quality på AFRY kommer du att ingå i ett team med härliga kollegor där våra kärnvärden genomsyrar vårt dagliga arbete. För oss innebär det en gemenskap och ett driv att utmana oss själva och våra kunder i att utvecklas och bli starkare i kvalitetsarbetet.</p><p>Vårt team består av hjälpsamma och omtänksamma kollegor där vi värderar gemenskap och balans mellan arbete och fritid. Under dina första månader som anställd får du utöver din chef en AFRY Buddy som introducerar dig till företaget och att bolla frågor och funderingar med. Du får även möjlighet att arbeta tillsammans med engagerade ledare där Mattias, Jenny, Oscar, Anneli och Philippe arbetar för att ge dig de allra bästa förutsättningarna för att göra ett bra jobb hos våra kunder.</p><p>Hos oss får du möjligheten att ta del av: </p><ul><li>Individuell kompetensutvecklingsplan inom ditt spetsområde</li><li>Balans i arbetslivet och en Buddy som bollplank för att du ska utvecklas i din profession och som konsult</li><li>Tillgång till ett stort utbud aktiviteter genom vår sociala klubb: Club AFRY, till exempel Hackathons, yoga, restaurangbesök med mera</li><li>Konkurrenskraftiga förmåner gällande pension, friskvård och föräldraledighet reglerat i vårt kollektivavtal</li><li>Företagsrabatter med externa partners genom vår förmånsportal: Advantage You</li><li>Restauranger och kaféer på plats (platsberoende)</li><li>Ett enormt nätverk av tekniska experter</li><li>+ 16 000 kollegor med kontor i 50 länder och projekt i 100</li></ul><p><strong>Om rekryteringsprocessen</strong></p><p><strong>Under vecka 26-29 tar vår process ett sommaruppehåll. </strong>Sista ansökningsdag är 15 augusti 2022, urval görs löpande och kan komma att tillsättas innan dess. </p><p>Vår rekryteringsprocess består av minst två intervjusteg, ett personlighetstest samt logiktest (GMA) samt digital referenstagning. Kopplat till karaktären på flera av våra uppdrag inom bank och finans görs även UC samt utdrag ur belastningsregistret. </p><p>Magdalena Klasson (Rekrytering och HR)</p><p><strong>Magdalenas LinkedIn</strong></p><p>Oscar Hjärtström (anställande chef)</p><p><strong>Oscars LinkedIn</strong> </p><p><em>AFRY is committed to creating an inclusive &amp; diverse environment and we are actively looking for qualified candidates irrespective of gender, gender identity, sexual orientation, ethnicity, religion, disability, or age. You will be part of a global and diverse company where our differences are our strengths. Join us to accelerate the transition towards a sustainable society.</em></p>",
        "conditions" : null,
        "text" : "Företagsbeskrivning\nPå AFRY samlar vi ledande digital expertis och teknologier i AFRY X. Den nya divisionen AFRY X är en digital ledare och experthubb inom industriell IoT, AI, design och cybersäkerhet som hjälper kunder att accelerera sin digitala transformation.\nAFRY är en europeisk ledare inom ingenjörs-, design- och rådgivningstjänster med global räckvidd. Vi påskyndar omställningen mot ett hållbart samhälle.\nVi är 16 000 hängivna experter inom infrastruktur, industri, energi och digitalisering, som skapar hållbara lösningar för kommande generationer.\n\n\nJobbeskrivning\nVi på Digital Quality i Stockholm är ett team med mer än 50 specialister och ledare inom digitalisering och kvalitetssäkring. För att möta efterfrågan hos våra kunder och i våra projekt söker vi just nu fler kollegor som har erfarenhet från och vill fortsätta utvecklas inom kravhantering.\nVi ser otroliga fördelar i att ha ett team med olika bakgrund och erfarenheter där den gemensamma faktorn är kvalitetssäkring till våra kunder. En avgörande egenskap hos dig som person är att känna ett driv och stort intresse inom just detta. Som kravanalytiker och konsult hos oss har du en viktig roll i något av våra uppdrag där vi har en variation av kunduppdrag, interna projekt samt åtaganden och teamleveranser. Vi söker dig som vill utvecklas inom kravhantering och ser variationen som konsultrollen innebär som spännande.\nNågot vi är extra stolta över är när vi med samlad kompetens kan gå in och bidra i samhällsnyttiga funktioner och det är där vi vill ha dig med ombord!\n\n\nKravspecifikation\nI alla våra rekryteringar lägger vi stor vikt vid personliga egenskaper och tror att du är en person som gillar att inspirera och lämna avtryck hos andra. Du värnar om kvalitet och vill stötta verksamheter i att lyckas med sina projekt genom ledning och styrning och genom effektiv förmedling av deras önskemål, behov och krav. Du har erfarenhet av att arbeta med krav på ett strukturerat sätt efter Agila metoder. Vidare har du erfarenhet av att driva workshops, intressentanalyser och är bekant med Use Case och User Storys. \nKravprofil:\nFlerårig erfarenhet av rollen som kravanalytiker och/eller kravledare\nDjup kunskap och erfarenhet av att arbeta som kravanlytiker i en Agil kontext \nErfarenhet av behovsanalyser, förstudier och att hålla workshops\nMycket goda kunskaper i svenska och engelska, både i tal och skrift\n\nMeriterande: \nErfarenhet som Agil coach, produktägare, projektledare eller Scrum Master\nAkademisk utbildning\n\n\n\nYtterligare information\nSom anställd hos oss inom Digital Quality på AFRY kommer du att ingå i ett team med härliga kollegor där våra kärnvärden genomsyrar vårt dagliga arbete. För oss innebär det en gemenskap och ett driv att utmana oss själva och våra kunder i att utvecklas och bli starkare i kvalitetsarbetet.\nVårt team består av hjälpsamma och omtänksamma kollegor där vi värderar gemenskap och balans mellan arbete och fritid. Under dina första månader som anställd får du utöver din chef en AFRY Buddy som introducerar dig till företaget och att bolla frågor och funderingar med. Du får även möjlighet att arbeta tillsammans med engagerade ledare där Mattias, Jenny, Oscar, Anneli och Philippe arbetar för att ge dig de allra bästa förutsättningarna för att göra ett bra jobb hos våra kunder.\nHos oss får du möjligheten att ta del av: \nIndividuell kompetensutvecklingsplan inom ditt spetsområde\nBalans i arbetslivet och en Buddy som bollplank för att du ska utvecklas i din profession och som konsult\nTillgång till ett stort utbud aktiviteter genom vår sociala klubb: Club AFRY, till exempel Hackathons, yoga, restaurangbesök med mera\nKonkurrenskraftiga förmåner gällande pension, friskvård och föräldraledighet reglerat i vårt kollektivavtal\nFöretagsrabatter med externa partners genom vår förmånsportal: Advantage You\nRestauranger och kaféer på plats (platsberoende)\nEtt enormt nätverk av tekniska experter\n+ 16 000 kollegor med kontor i 50 länder och projekt i 100\n\nOm rekryteringsprocessen\nUnder vecka 26-29 tar vår process ett sommaruppehåll. Sista ansökningsdag är 15 augusti 2022, urval görs löpande och kan komma att tillsättas innan dess. \nVår rekryteringsprocess består av minst två intervjusteg, ett personlighetstest samt logiktest (GMA) samt digital referenstagning. Kopplat till karaktären på flera av våra uppdrag inom bank och finans görs även UC samt utdrag ur belastningsregistret. \nMagdalena Klasson (Rekrytering och HR)\nMagdalenas LinkedIn\nOscar Hjärtström (anställande chef)\nOscars LinkedIn \nAFRY is committed to creating an inclusive & diverse environment and we are actively looking for qualified candidates irrespective of gender, gender identity, sexual orientation, ethnicity, religion, disability, or age. You will be part of a global and diverse company where our differences are our strengths. Join us to accelerate the transition towards a sustainable society."
      },
      "headline" : "Kravanalytiker",
      "driving_license" : null,
      "employer" : {
        "email" : null,
        "phone_number" : null,
        "organization_number" : "5561206474",
        "name" : "AFRY AB",
        "url" : null,
        "workplace" : "AFRY AB"
      },
      "removed_date" : null,
      "logo_url" : "https://www.arbetsformedlingen.se/rest/arbetsgivare/rest/af/v3/arbetsplatser/87599217/logotyper/logo.png",
      "last_publication_date" : "2022-08-27T00:00:00",
      "number_of_vacancies" : 1,
      "occupation" : {
        "concept_id" : "Gjz2_EJT_HGL",
        "label" : "Kravanalytiker",
        "legacy_ams_taxonomy_id" : "7621"
      },
      "occupation_group" : {
        "concept_id" : "UXKZ_3zZ_ipB",
        "label" : "Systemanalytiker och IT-arkitekter m.fl.",
        "legacy_ams_taxonomy_id" : "2511"
      },
      "employment_type" : {
        "concept_id" : "PFZr_Syz_cUq",
        "label" : "Vanlig anställning",
        "legacy_ams_taxonomy_id" : "1"
      },
      "webpage_url" : "https://arbetsformedlingen.se/platsbanken/annonser/26360523",
      "driving_license_required" : false,
      "application_contacts" : [ ],
      "duration" : {
        "concept_id" : "a7uU_j21_mkL",
        "label" : "Tills vidare",
        "legacy_ams_taxonomy_id" : "1"
      },
      "nice_to_have" : {
        "education_level" : [ ],
        "work_experiences" : [ ],
        "skills" : [ ],
        "education" : [ ],
        "languages" : [ ]
      },
      "application_details" : {
        "via_af" : false,
        "email" : null,
        "other" : null,
        "reference" : null,
        "url" : "https://jobs.smartrecruiters.com/AFRY/743999841407504-kravanalytiker",
        "information" : null
      },
      "source_type" : "VIA_ANNONSERA",
      "application_deadline" : "2022-08-27T00:00:00",
      "external_id" : null,
      "workplace_address" : {
        "coordinates" : [ 18.02939284362965, 59.30988244132199 ],
        "city" : "Stockholm",
        "postcode" : "11743",
        "municipality" : "Stockholm",
        "region_concept_id" : "CifL_Rzy_Mku",
        "region" : "Stockholms län",
        "country_code" : "199",
        "region_code" : "01",
        "municipality_concept_id" : "AvNB_uwa_6n6",
        "country_concept_id" : "i46j_HmG_v64",
        "municipality_code" : "0180",
        "street_address" : "Årstaängsvägen 17",
        "country" : "Sverige"
      },
      "id" : "26360523",
      "experience_required" : true,
      "working_hours_type" : {
        "concept_id" : "6YE1_gAC_R2G",
        "label" : "Heltid",
        "legacy_ams_taxonomy_id" : "1"
      },
      "access" : null,
      "timestamp" : 1659010435278,
      "must_have" : {
        "education_level" : [ ],
        "work_experiences" : [ ],
        "skills" : [ ],
        "education" : [ ],
        "languages" : [ ]
      },
      "occupation_field" : {
        "concept_id" : "apaJ_2ja_LuF",
        "label" : "Data/IT",
        "legacy_ams_taxonomy_id" : "3"
      },
      "scope_of_work" : {
        "min" : 0,
        "max" : 100
      },
      "salary_type" : {
        "concept_id" : "oG8G_9cW_nRf",
        "label" : "Fast månads- vecko- eller timlön",
        "legacy_ams_taxonomy_id" : "1"
      },
      "removed" : false,
      "salary_description" : null,
      "access_to_own_car" : false,
      "publication_date" : "2022-07-28T14:13:55"
    },
    "name" : "Kravanalytiker",
    "user" : "hannes"
  },
  "sha1" : "12d28e7cfc1b160462384aeaa1e0959226cd8e1c",
  "annotations" : [ {
    "preferred-label" : "Kravanalytiker",
    "sentiment" : "MUST_HAVE",
    "type" : "occupation-name",
    "start-position" : 0,
    "end-position" : 14,
    "concept-id" : "Gjz2_EJT_HGL",
    "matched-string" : "kravanalytiker",
    "annotation-id" : 0
  }, {
    "preferred-label" : "Internet of things/IoT",
    "sentiment" : "MUST_HAVE",
    "type" : "skill",
    "start-position" : 183,
    "end-position" : 186,
    "concept-id" : "v1kW_h4M_Kej",
    "matched-string" : "iot",
    "annotation-id" : 1
  }, {
    "preferred-label" : "Artificial Intelligence/Artificiell intelligens/AI",
    "sentiment" : "MUST_HAVE",
    "type" : "skill",
    "start-position" : 188,
    "end-position" : 190,
    "concept-id" : "SaTd_K5z_ex1",
    "matched-string" : "ai",
    "annotation-id" : 2
  }, {
    "preferred-label" : "cybersäkerhet",
    "type" : "esco-skill",
    "start-position" : 203,
    "end-position" : 216,
    "concept-id" : "cUku_oZH_AtX",
    "matched-string" : "cybersäkerhet",
    "annotation-id" : 18
  }, {
    "preferred-label" : "Stockholm",
    "type" : "municipality",
    "start-position" : 618,
    "end-position" : 627,
    "concept-id" : "AvNB_uwa_6n6",
    "matched-string" : "Stockholm",
    "annotation-id" : 19
  }, {
    "preferred-label" : "Kvalitetssäkring",
    "sentiment" : "MUST_HAVE",
    "type" : "skill",
    "start-position" : 702,
    "end-position" : 718,
    "concept-id" : "a1Sf_mey_gVk",
    "matched-string" : "kvalitetssäkring",
    "annotation-id" : 3
  }, {
    "preferred-label" : "Kvalitetssäkring",
    "sentiment" : "MUST_HAVE",
    "type" : "skill",
    "start-position" : 993,
    "end-position" : 1009,
    "concept-id" : "a1Sf_mey_gVk",
    "matched-string" : "kvalitetssäkring",
    "annotation-id" : 4
  }, {
    "preferred-label" : "Kravanalytiker",
    "sentiment" : "MUST_HAVE",
    "type" : "occupation-name",
    "start-position" : 1131,
    "end-position" : 1145,
    "concept-id" : "Gjz2_EJT_HGL",
    "matched-string" : "kravanalytiker",
    "annotation-id" : 5
  }, {
    "preferred-label" : "Agila arbetsmetoder",
    "type" : "skill",
    "start-position" : 1987,
    "end-position" : 2000,
    "concept-id" : "TMVb_DnH_etF",
    "matched-string" : "Agila metoder",
    "annotation-id" : 20
  }, {
    "preferred-label" : "Kravanalytiker",
    "sentiment" : "MUST_HAVE",
    "type" : "occupation-name",
    "start-position" : 2161,
    "end-position" : 2175,
    "concept-id" : "Gjz2_EJT_HGL",
    "matched-string" : "kravanalytiker",
    "annotation-id" : 6
  }, {
    "preferred-label" : "Agila arbetsmetoder",
    "type" : "skill",
    "start-position" : 2262,
    "end-position" : 2274,
    "concept-id" : "TMVb_DnH_etF",
    "matched-string" : "Agil kontext",
    "annotation-id" : 21
  }, {
    "preferred-label" : "Svenska",
    "sentiment" : "MUST_HAVE",
    "type" : "language",
    "start-position" : 2365,
    "end-position" : 2372,
    "concept-id" : "zSLA_vw2_FXN",
    "matched-string" : "svenska",
    "annotation-id" : 7
  }, {
    "preferred-label" : "Engelska",
    "sentiment" : "MUST_HAVE",
    "type" : "language",
    "start-position" : 2377,
    "end-position" : 2385,
    "concept-id" : "NVxJ_hLg_TYS",
    "matched-string" : "engelska",
    "annotation-id" : 8
  }, {
    "preferred-label" : "Agil coach/Agile coach",
    "sentiment" : "MUST_HAVE",
    "type" : "occupation-name",
    "start-position" : 2439,
    "end-position" : 2449,
    "concept-id" : "xJQz_S3z_vab",
    "matched-string" : "agil coach",
    "annotation-id" : 9
  }, {
    "preferred-label" : "projektledare",
    "type" : "esco-occupation",
    "start-position" : 2465,
    "end-position" : 2478,
    "concept-id" : "nzMp_xN5_r6G",
    "matched-string" : "projektledare",
    "annotation-id" : 22
  }, {
    "preferred-label" : "Scrum master",
    "sentiment" : "MUST_HAVE",
    "type" : "occupation-name",
    "start-position" : 2485,
    "end-position" : 2497,
    "concept-id" : "1UTZ_bS9_kUD",
    "matched-string" : "scrum master",
    "annotation-id" : 10
  }, {
    "preferred-label" : "Universitets- eller högskoleutbildning",
    "type" : "sni-level-5",
    "start-position" : 2498,
    "end-position" : 2518,
    "concept-id" : "4Hs1_pdH_C7k",
    "matched-string" : "Akademisk utbildning",
    "annotation-id" : 23
  }, {
    "preferred-label" : "Friskvård",
    "sentiment" : "MUST_HAVE",
    "type" : "keyword",
    "start-position" : 3710,
    "end-position" : 3719,
    "concept-id" : "yoHe_xjK_qjH",
    "matched-string" : "friskvård",
    "annotation-id" : 13
  }, {
    "preferred-label" : "Kollektivavtal",
    "sentiment" : "MUST_HAVE",
    "type" : "skill",
    "start-position" : 3757,
    "end-position" : 3771,
    "concept-id" : "z7wE_9xb_3jX",
    "matched-string" : "kollektivavtal",
    "annotation-id" : 14
  }, {
    "preferred-label" : "Kontor",
    "sentiment" : "MUST_HAVE",
    "type" : "keyword",
    "start-position" : 3960,
    "end-position" : 3966,
    "concept-id" : "Hyz1_7HF_AkP",
    "matched-string" : "kontor",
    "annotation-id" : 15
  }, {
    "preferred-label" : "Bank",
    "sentiment" : "MUST_HAVE",
    "type" : "keyword",
    "start-position" : 4363,
    "end-position" : 4367,
    "concept-id" : "xqgq_CRg_5mv",
    "matched-string" : "bank",
    "annotation-id" : 16
  } ],
  "text" : "Kravanalytiker\nFöretagsbeskrivning\nPå AFRY samlar vi ledande digital expertis och teknologier i AFRY X. Den nya divisionen AFRY X är en digital ledare och experthubb inom industriell IoT, AI, design och cybersäkerhet som hjälper kunder att accelerera sin digitala transformation.\nAFRY är en europeisk ledare inom ingenjörs-, design- och rådgivningstjänster med global räckvidd. Vi påskyndar omställningen mot ett hållbart samhälle.\nVi är 16 000 hängivna experter inom infrastruktur, industri, energi och digitalisering, som skapar hållbara lösningar för kommande generationer.\n\n\nJobbeskrivning\nVi på Digital Quality i Stockholm är ett team med mer än 50 specialister och ledare inom digitalisering och kvalitetssäkring. För att möta efterfrågan hos våra kunder och i våra projekt söker vi just nu fler kollegor som har erfarenhet från och vill fortsätta utvecklas inom kravhantering.\nVi ser otroliga fördelar i att ha ett team med olika bakgrund och erfarenheter där den gemensamma faktorn är kvalitetssäkring till våra kunder. En avgörande egenskap hos dig som person är att känna ett driv och stort intresse inom just detta. Som kravanalytiker och konsult hos oss har du en viktig roll i något av våra uppdrag där vi har en variation av kunduppdrag, interna projekt samt åtaganden och teamleveranser. Vi söker dig som vill utvecklas inom kravhantering och ser variationen som konsultrollen innebär som spännande.\nNågot vi är extra stolta över är när vi med samlad kompetens kan gå in och bidra i samhällsnyttiga funktioner och det är där vi vill ha dig med ombord!\n\n\nKravspecifikation\nI alla våra rekryteringar lägger vi stor vikt vid personliga egenskaper och tror att du är en person som gillar att inspirera och lämna avtryck hos andra. Du värnar om kvalitet och vill stötta verksamheter i att lyckas med sina projekt genom ledning och styrning och genom effektiv förmedling av deras önskemål, behov och krav. Du har erfarenhet av att arbeta med krav på ett strukturerat sätt efter Agila metoder. Vidare har du erfarenhet av att driva workshops, intressentanalyser och är bekant med Use Case och User Storys. \nKravprofil:\nFlerårig erfarenhet av rollen som kravanalytiker och/eller kravledare\nDjup kunskap och erfarenhet av att arbeta som kravanlytiker i en Agil kontext \nErfarenhet av behovsanalyser, förstudier och att hålla workshops\nMycket goda kunskaper i svenska och engelska, både i tal och skrift\n\nMeriterande: \nErfarenhet som Agil coach, produktägare, projektledare eller Scrum Master\nAkademisk utbildning\n\n\n\nYtterligare information\nSom anställd hos oss inom Digital Quality på AFRY kommer du att ingå i ett team med härliga kollegor där våra kärnvärden genomsyrar vårt dagliga arbete. För oss innebär det en gemenskap och ett driv att utmana oss själva och våra kunder i att utvecklas och bli starkare i kvalitetsarbetet.\nVårt team består av hjälpsamma och omtänksamma kollegor där vi värderar gemenskap och balans mellan arbete och fritid. Under dina första månader som anställd får du utöver din chef en AFRY Buddy som introducerar dig till företaget och att bolla frågor och funderingar med. Du får även möjlighet att arbeta tillsammans med engagerade ledare där Mattias, Jenny, Oscar, Anneli och Philippe arbetar för att ge dig de allra bästa förutsättningarna för att göra ett bra jobb hos våra kunder.\nHos oss får du möjligheten att ta del av: \nIndividuell kompetensutvecklingsplan inom ditt spetsområde\nBalans i arbetslivet och en Buddy som bollplank för att du ska utvecklas i din profession och som konsult\nTillgång till ett stort utbud aktiviteter genom vår sociala klubb: Club AFRY, till exempel Hackathons, yoga, restaurangbesök med mera\nKonkurrenskraftiga förmåner gällande pension, friskvård och föräldraledighet reglerat i vårt kollektivavtal\nFöretagsrabatter med externa partners genom vår förmånsportal: Advantage You\nRestauranger och kaféer på plats (platsberoende)\nEtt enormt nätverk av tekniska experter\n+ 16 000 kollegor med kontor i 50 länder och projekt i 100\n\nOm rekryteringsprocessen\nUnder vecka 26-29 tar vår process ett sommaruppehåll. Sista ansökningsdag är 15 augusti 2022, urval görs löpande och kan komma att tillsättas innan dess. \nVår rekryteringsprocess består av minst två intervjusteg, ett personlighetstest samt logiktest (GMA) samt digital referenstagning. Kopplat till karaktären på flera av våra uppdrag inom bank och finans görs även UC samt utdrag ur belastningsregistret. \nMagdalena Klasson (Rekrytering och HR)\nMagdalenas LinkedIn\nOscar Hjärtström (anställande chef)\nOscars LinkedIn \nAFRY is committed to creating an inclusive & diverse environment and we are actively looking for qualified candidates irrespective of gender, gender identity, sexual orientation, ethnicity, religion, disability, or age. You will be part of a global and diverse company where our differences are our strengths. Join us to accelerate the transition towards a sustainable society."
}