{
  "meta" : {
    "jobad" : {
      "description" : {
        "requirements" : null,
        "needs" : null,
        "company_information" : null,
        "text_formatted" : "Klara söker\nSocionomer med erfarenhet inm området barn/ungdom. Behov finns omgående och för arbete under sommarmånaderna.\n\nTillsammans gör vi världen lite bättre en människa i taget!\n\nOrt\nStockholm norrort\n\nArbetsuppgifter\nSedvanlig handläggning.\n\nKvalifikationer\nSocionomexamen samt minst två års yrkeserfarenhet inom området. \n\n \n\n\nPersonliga egenskaper\nSom socionomkonsult  hos Klara får du chansen att bredda din kompetens, få nya erfarenheter och utvidga ditt kontaktnät. Som person är du flexibel, lösningsorienterad och initiativtagande.\n\nDu är trygg i din profession och har ett patientfokuserat arbetssätt.\n\nOm arbetsgivaren\nKlara är en trygg arbetsgivare som månar om att man ska trivas och må bra i rollen som socionomkonsult. Vi söker alltid långa samarbeten och relationer.\nEfter att vi har lärt känna varandra bestämmer du var, när och i vilken omfattning du vill arbeta, och vi bevakar att du matchas mot lämpliga uppdrag. Vi har ramavtal i flera kommuner i hela landet och det är sannolikt att vi kommer att kunna erbjuda dig uppdrag som passar just dina önskemål. Vår ledning består av erfarna konsultchefer och vana problemlösare som kan erbjuda adekvat stöttning utifrån dina behov under hela uppdragsperioden. Vår förhoppning är att du vill och att du fortsätter vilja vara med på vår resa.\n\nAnsökan\nDu är varmt välkommen att skicka in din ansökan till oss redan idag.\n\nHar frågor om den utannonserade tjänsten är du välkommen att kontakta oss.\n\nPå vår hemsida www.klarakompetens.se/lediga-uppdrag/ presenterar vi alla våra lediga uppdrag.\n\nUrval och intervjuer sker löpande, så vänta inte med din ansökan.\n\nTillsättning\nSnarast",
        "conditions" : "Deltid - Enligt överenskommelse\r\nVisstid, mer än 6 månader",
        "text" : "Klara söker\nSocionomer med erfarenhet inm området barn/ungdom. Behov finns omgående och för arbete under sommarmånaderna.\n\nTillsammans gör vi världen lite bättre en människa i taget!\n\nOrt\nStockholm norrort\n\nArbetsuppgifter\nSedvanlig handläggning.\n\nKvalifikationer\nSocionomexamen samt minst två års yrkeserfarenhet inom området. \n\n \n\n\nPersonliga egenskaper\nSom socionomkonsult  hos Klara får du chansen att bredda din kompetens, få nya erfarenheter och utvidga ditt kontaktnät. Som person är du flexibel, lösningsorienterad och initiativtagande.\n\nDu är trygg i din profession och har ett patientfokuserat arbetssätt.\n\nOm arbetsgivaren\nKlara är en trygg arbetsgivare som månar om att man ska trivas och må bra i rollen som socionomkonsult. Vi söker alltid långa samarbeten och relationer.\nEfter att vi har lärt känna varandra bestämmer du var, när och i vilken omfattning du vill arbeta, och vi bevakar att du matchas mot lämpliga uppdrag. Vi har ramavtal i flera kommuner i hela landet och det är sannolikt att vi kommer att kunna erbjuda dig uppdrag som passar just dina önskemål. Vår ledning består av erfarna konsultchefer och vana problemlösare som kan erbjuda adekvat stöttning utifrån dina behov under hela uppdragsperioden. Vår förhoppning är att du vill och att du fortsätter vilja vara med på vår resa.\n\nAnsökan\nDu är varmt välkommen att skicka in din ansökan till oss redan idag.\n\nHar frågor om den utannonserade tjänsten är du välkommen att kontakta oss.\n\nPå vår hemsida www.klarakompetens.se/lediga-uppdrag/ presenterar vi alla våra lediga uppdrag.\n\nUrval och intervjuer sker löpande, så vänta inte med din ansökan.\n\nTillsättning\nSnarast"
      },
      "headline" : "Socionomer  inom området barn och unga",
      "driving_license" : null,
      "employer" : {
        "email" : null,
        "phone_number" : null,
        "organization_number" : "5565780847",
        "name" : "Klara D AB",
        "url" : "https://www.klarakompetens.se/",
        "workplace" : "Klara D AB"
      },
      "removed_date" : null,
      "logo_url" : "https://www.arbetsformedlingen.se/rest/arbetsgivare/rest/af/v3/organisation/5565780847/logotyper/logo.png",
      "last_publication_date" : "2022-09-02T23:59:59",
      "number_of_vacancies" : 1,
      "occupation" : {
        "concept_id" : "aEF1_qeh_5Qe",
        "label" : "Socionom",
        "legacy_ams_taxonomy_id" : "7502"
      },
      "occupation_group" : {
        "concept_id" : "pok1_ipJ_yzD",
        "label" : "Socialsekreterare",
        "legacy_ams_taxonomy_id" : "2661"
      },
      "employment_type" : {
        "concept_id" : "PFZr_Syz_cUq",
        "label" : "Vanlig anställning",
        "legacy_ams_taxonomy_id" : "1"
      },
      "webpage_url" : "https://arbetsformedlingen.se/platsbanken/annonser/26293287",
      "driving_license_required" : false,
      "application_contacts" : [ {
        "description" : "Marie Olander",
        "email" : "marie.olander@klarakompetens.se",
        "telephone" : null,
        "name" : null,
        "contact_type" : null
      } ],
      "duration" : {
        "concept_id" : "qQUd_4qe_NDT",
        "label" : "6 månader eller längre",
        "legacy_ams_taxonomy_id" : "2"
      },
      "nice_to_have" : {
        "education_level" : [ ],
        "work_experiences" : [ ],
        "skills" : [ ],
        "education" : [ ],
        "languages" : [ ]
      },
      "application_details" : {
        "via_af" : false,
        "email" : null,
        "other" : null,
        "reference" : "6040",
        "url" : "http://cv-klaran-se.app.intelliplan.eu/JobAd/Show?jaid=6040",
        "information" : null
      },
      "source_type" : "VIA_PLATSBANKEN_DXA",
      "application_deadline" : "2022-09-02T23:59:59",
      "external_id" : "46-556578-0847-6040",
      "workplace_address" : {
        "coordinates" : [ 18.156042, 59.307903 ],
        "city" : null,
        "postcode" : null,
        "municipality" : "Nacka",
        "region_concept_id" : "CifL_Rzy_Mku",
        "region" : "Stockholms län",
        "country_code" : "199",
        "region_code" : "01",
        "municipality_concept_id" : "aYA7_PpG_BqP",
        "country_concept_id" : "i46j_HmG_v64",
        "municipality_code" : "0182",
        "street_address" : null,
        "country" : "Sverige"
      },
      "id" : "26293287",
      "experience_required" : true,
      "working_hours_type" : {
        "concept_id" : "947z_JGS_Uk2",
        "label" : "Deltid",
        "legacy_ams_taxonomy_id" : "2"
      },
      "access" : null,
      "timestamp" : 1657006313844,
      "must_have" : {
        "education_level" : [ ],
        "work_experiences" : [ {
          "concept_id" : "aEF1_qeh_5Qe",
          "weight" : 10,
          "label" : "Socionom",
          "legacy_ams_taxonomy_id" : "7502"
        } ],
        "skills" : [ ],
        "education" : [ ],
        "languages" : [ ]
      },
      "occupation_field" : {
        "concept_id" : "GazW_2TU_kJw",
        "label" : "Yrken med social inriktning",
        "legacy_ams_taxonomy_id" : "16"
      },
      "scope_of_work" : {
        "min" : 0,
        "max" : 100
      },
      "salary_type" : {
        "concept_id" : "oG8G_9cW_nRf",
        "label" : "Fast månads- vecko- eller timlön",
        "legacy_ams_taxonomy_id" : "1"
      },
      "removed" : false,
      "salary_description" : "Fast lön",
      "access_to_own_car" : false,
      "publication_date" : "2022-08-03T00:00:00"
    },
    "name" : "Socionomer  inom området barn och unga",
    "user" : "kristof.fischer"
  },
  "sha1" : "78185cbd27d32996568b4819a440fa1e148c3a94",
  "annotations" : [ {
    "preferred-label" : "Socionom",
    "type" : "occupation-name",
    "start-position" : 0,
    "end-position" : 10,
    "concept-id" : "aEF1_qeh_5Qe",
    "matched-string" : "Socionomer",
    "annotation-id" : 3
  }, {
    "preferred-label" : "Socionom",
    "type" : "occupation-name",
    "start-position" : 51,
    "end-position" : 61,
    "concept-id" : "aEF1_qeh_5Qe",
    "matched-string" : "Socionomer",
    "annotation-id" : 4
  }, {
    "preferred-label" : "Stockholm",
    "type" : "municipality",
    "start-position" : 227,
    "end-position" : 236,
    "concept-id" : "AvNB_uwa_6n6",
    "matched-string" : "Stockholm",
    "annotation-id" : 5
  }, {
    "preferred-label" : "Socionomexamen",
    "sentiment" : "MUST_HAVE",
    "type" : "skill",
    "start-position" : 303,
    "end-position" : 317,
    "concept-id" : "MjPH_341_Zmc",
    "matched-string" : "socionomexamen",
    "annotation-id" : 0
  }, {
    "preferred-label" : "2-4 års erfarenhet",
    "sentiment" : "MUST_HAVE",
    "type" : "occupation-experience-year",
    "start-position" : 323,
    "end-position" : 352,
    "concept-id" : "RWA2_uu6_udD",
    "matched-string" : "minst två års yrkeserfarenhet",
    "annotation-id" : 6
  }, {
    "preferred-label" : "Socionom",
    "sentiment" : "MUST_HAVE",
    "type" : "occupation-name",
    "start-position" : 399,
    "end-position" : 414,
    "concept-id" : "aEF1_qeh_5Qe",
    "matched-string" : "socionomkonsult",
    "annotation-id" : 1
  }, {
    "preferred-label" : "hitta lösningar på problem",
    "sentiment" : "MUST_HAVE",
    "type" : "esco-skill",
    "start-position" : 543,
    "end-position" : 561,
    "concept-id" : "WFSY_Bwt_QWE",
    "matched-string" : "lösningsorienterad",
    "annotation-id" : 7
  }, {
    "preferred-label" : "Socionom",
    "sentiment" : "MUST_HAVE",
    "type" : "occupation-name",
    "start-position" : 760,
    "end-position" : 775,
    "concept-id" : "aEF1_qeh_5Qe",
    "matched-string" : "socionomkonsult",
    "annotation-id" : 2
  } ],
  "text" : "Socionomer  inom området barn och unga\nKlara söker\nSocionomer med erfarenhet inm området barn/ungdom. Behov finns omgående och för arbete under sommarmånaderna.\n\nTillsammans gör vi världen lite bättre en människa i taget!\n\nOrt\nStockholm norrort\n\nArbetsuppgifter\nSedvanlig handläggning.\n\nKvalifikationer\nSocionomexamen samt minst två års yrkeserfarenhet inom området. \n\n \n\n\nPersonliga egenskaper\nSom socionomkonsult  hos Klara får du chansen att bredda din kompetens, få nya erfarenheter och utvidga ditt kontaktnät. Som person är du flexibel, lösningsorienterad och initiativtagande.\n\nDu är trygg i din profession och har ett patientfokuserat arbetssätt.\n\nOm arbetsgivaren\nKlara är en trygg arbetsgivare som månar om att man ska trivas och må bra i rollen som socionomkonsult. Vi söker alltid långa samarbeten och relationer.\nEfter att vi har lärt känna varandra bestämmer du var, när och i vilken omfattning du vill arbeta, och vi bevakar att du matchas mot lämpliga uppdrag. Vi har ramavtal i flera kommuner i hela landet och det är sannolikt att vi kommer att kunna erbjuda dig uppdrag som passar just dina önskemål. Vår ledning består av erfarna konsultchefer och vana problemlösare som kan erbjuda adekvat stöttning utifrån dina behov under hela uppdragsperioden. Vår förhoppning är att du vill och att du fortsätter vilja vara med på vår resa.\n\nAnsökan\nDu är varmt välkommen att skicka in din ansökan till oss redan idag.\n\nHar frågor om den utannonserade tjänsten är du välkommen att kontakta oss.\n\nPå vår hemsida www.klarakompetens.se/lediga-uppdrag/ presenterar vi alla våra lediga uppdrag.\n\nUrval och intervjuer sker löpande, så vänta inte med din ansökan.\n\nTillsättning\nSnarast"
}