{
  "meta" : {
    "jobad" : {
      "description" : {
        "requirements" : null,
        "needs" : null,
        "company_information" : null,
        "text_formatted" : "<p>Nöjeskvarteret Malmborgen AB i centrala Malmö har som ambition att tillgodose en helhetsupplevelse avseende nöjen till våra gäster genom våra olika inriktningar. Hos oss hittar man allt från pub, restauranger, nattklubbar, vinkällare, festvåningar, gatukök samt vår fina uteservering Gränden på sommaren. </p><p>Vi strävar hela tiden efter att ge våra gäster det lilla extra vad gäller miljö, service samt gastronomisk upplevelse. Till vår Restaurang S:t Markus Vinkällare som är en del av Nöjeskvarteret Malmborgen, och som primärt serverar buffé och klassisk à la carte, söker vi nu ambitiös och engagerade serveringspersonal med start till sensommaren.</p><p>Arbetet omfattar primärt traditionell servering där gästen sätts i fokus. Du finner det intressant att hålla dig à jour<strong><em> </em></strong>med både mat och dryck och speciellt vin, samt att kunna förmedla dessa på bästa sätt till våra gäster. Vi ser gärna att du har arbetat med servering sedan tidigare samt har kassaerfarenhet. Du bör ha kunskap utav vin och kunna förmedla denna kunskap till våra gäster.</p><p>Som person är du glad, ambitiös, stresstålig och pålitlig. Du brinner för att ge våra gäster den absolut bästa service. Vidare är du en lagspelare som trivs i en dynamisk miljö. För våra gästers skull ser vi gärna att du är snus- och rökfri.</p><p>Möjlighet finns att även arbeta på någon av våra andra inriktningar inom Nöjeskvarteret Malmborgen såsom Gränden på sommaren eller en av våra nattklubbar som ett komplement. För rätt person finns fina utvecklingsmöjligheter inom vårt företag som kan leda till en mer senior roll.</p><p>Tjänster är för heltid, deltid samt vid behov.</p><p>Lön enligt kollektivavtal. Vänligen skicka ditt CV och gärna en bild på dig.</p><p>Vänligen märk er ansökan ”Servitris/servitör S:t Markus Vinkällare 2022”</p><p>Ansökningar tages emot löpande och anställning påbörjas inom en relativ snar framtid.</p><p>För mer info, kontakta: info@malmborgen.nu</p><p id=\"oppenforalla\">Öppen för alla\nVi fokuserar på din kompetens, inte dina övriga förutsättningar. Vi är öppna för att anpassa rollen eller arbetsplatsen efter dina behov.</p>",
        "conditions" : null,
        "text" : "Nöjeskvarteret Malmborgen AB i centrala Malmö har som ambition att tillgodose en helhetsupplevelse avseende nöjen till våra gäster genom våra olika inriktningar. Hos oss hittar man allt från pub, restauranger, nattklubbar, vinkällare, festvåningar, gatukök samt vår fina uteservering Gränden på sommaren. \nVi strävar hela tiden efter att ge våra gäster det lilla extra vad gäller miljö, service samt gastronomisk upplevelse. Till vår Restaurang S:t Markus Vinkällare som är en del av Nöjeskvarteret Malmborgen, och som primärt serverar buffé och klassisk à la carte, söker vi nu ambitiös och engagerade serveringspersonal med start till sensommaren.\nArbetet omfattar primärt traditionell servering där gästen sätts i fokus. Du finner det intressant att hålla dig à jour med både mat och dryck och speciellt vin, samt att kunna förmedla dessa på bästa sätt till våra gäster. Vi ser gärna att du har arbetat med servering sedan tidigare samt har kassaerfarenhet. Du bör ha kunskap utav vin och kunna förmedla denna kunskap till våra gäster.\nSom person är du glad, ambitiös, stresstålig och pålitlig. Du brinner för att ge våra gäster den absolut bästa service. Vidare är du en lagspelare som trivs i en dynamisk miljö. För våra gästers skull ser vi gärna att du är snus- och rökfri.\nMöjlighet finns att även arbeta på någon av våra andra inriktningar inom Nöjeskvarteret Malmborgen såsom Gränden på sommaren eller en av våra nattklubbar som ett komplement. För rätt person finns fina utvecklingsmöjligheter inom vårt företag som kan leda till en mer senior roll.\nTjänster är för heltid, deltid samt vid behov.\nLön enligt kollektivavtal. Vänligen skicka ditt CV och gärna en bild på dig.\nVänligen märk er ansökan ”Servitris/servitör S:t Markus Vinkällare 2022”\nAnsökningar tages emot löpande och anställning påbörjas inom en relativ snar framtid.\nFör mer info, kontakta: info@malmborgen.nu\nÖppen för alla\nVi fokuserar på din kompetens, inte dina övriga förutsättningar. Vi är öppna för att anpassa rollen eller arbetsplatsen efter dina behov."
      },
      "headline" : "Servitris/Servitör S:t Markus Vinkällare",
      "driving_license" : null,
      "employer" : {
        "email" : null,
        "phone_number" : null,
        "organization_number" : "5592933120",
        "name" : "Nöjeskvarteret Malmborgen AB",
        "url" : null,
        "workplace" : "Nöjeskvarteret Malmborgen AB"
      },
      "removed_date" : null,
      "logo_url" : null,
      "last_publication_date" : "2022-09-12T23:59:59",
      "number_of_vacancies" : 5,
      "occupation" : {
        "concept_id" : "rGGf_KLs_To7",
        "label" : "Servitör/Servitris",
        "legacy_ams_taxonomy_id" : "5487"
      },
      "occupation_group" : {
        "concept_id" : "UjoW_meY_Zwt",
        "label" : "Hovmästare och servitörer",
        "legacy_ams_taxonomy_id" : "5131"
      },
      "employment_type" : {
        "concept_id" : "PFZr_Syz_cUq",
        "label" : "Vanlig anställning",
        "legacy_ams_taxonomy_id" : "1"
      },
      "webpage_url" : "https://arbetsformedlingen.se/platsbanken/annonser/26406394",
      "driving_license_required" : false,
      "application_contacts" : [ ],
      "duration" : {
        "concept_id" : "a7uU_j21_mkL",
        "label" : "Tills vidare",
        "legacy_ams_taxonomy_id" : "1"
      },
      "nice_to_have" : {
        "education_level" : [ ],
        "work_experiences" : [ {
          "concept_id" : "rGGf_KLs_To7",
          "weight" : 5,
          "label" : "Servitör/Servitris",
          "legacy_ams_taxonomy_id" : "5487"
        } ],
        "skills" : [ ],
        "education" : [ ],
        "languages" : [ ]
      },
      "application_details" : {
        "via_af" : false,
        "email" : "info@malmborgen.nu",
        "other" : null,
        "reference" : "Servis S:t Markus Vink. 2022",
        "url" : null,
        "information" : null
      },
      "source_type" : "VIA_ANNONSERA",
      "application_deadline" : "2022-09-12T23:59:59",
      "external_id" : null,
      "workplace_address" : {
        "coordinates" : [ 13.003355356765507, 55.60273330753059 ],
        "city" : "Malmö",
        "postcode" : "21138",
        "municipality" : "Malmö",
        "region_concept_id" : "CaRE_1nn_cSU",
        "region" : "Skåne län",
        "country_code" : "199",
        "region_code" : "12",
        "municipality_concept_id" : "oYPt_yRA_Smm",
        "country_concept_id" : "i46j_HmG_v64",
        "municipality_code" : "1280",
        "street_address" : "Malmborgsgatan 7",
        "country" : "Sverige"
      },
      "id" : "26406394",
      "experience_required" : true,
      "working_hours_type" : {
        "concept_id" : "947z_JGS_Uk2",
        "label" : "Deltid",
        "legacy_ams_taxonomy_id" : "2"
      },
      "access" : null,
      "timestamp" : 1660389880284,
      "must_have" : {
        "education_level" : [ ],
        "work_experiences" : [ ],
        "skills" : [ ],
        "education" : [ ],
        "languages" : [ ]
      },
      "occupation_field" : {
        "concept_id" : "ScKy_FHB_7wT",
        "label" : "Hotell, restaurang, storhushåll",
        "legacy_ams_taxonomy_id" : "7"
      },
      "scope_of_work" : {
        "min" : 0,
        "max" : 100
      },
      "salary_type" : {
        "concept_id" : "oG8G_9cW_nRf",
        "label" : "Fast månads- vecko- eller timlön",
        "legacy_ams_taxonomy_id" : "1"
      },
      "removed" : false,
      "salary_description" : null,
      "access_to_own_car" : false,
      "publication_date" : "2022-08-13T13:24:40"
    },
    "name" : "Servitris/Servitör S:t Markus Vinkällare",
    "user" : "hannes"
  },
  "sha1" : "660ff4078d0c1507c99724c75865a116caef3e1b",
  "annotations" : [ {
    "preferred-label" : "Servitör/Servitris",
    "sentiment" : "MUST_HAVE",
    "type" : "occupation-name",
    "start-position" : 0,
    "end-position" : 18,
    "concept-id" : "rGGf_KLs_To7",
    "matched-string" : "Servitris/Servitör",
    "annotation-id" : 10
  }, {
    "preferred-label" : "Malmö",
    "sentiment" : "NOT_RELEVANT",
    "type" : "municipality",
    "start-position" : 81,
    "end-position" : 86,
    "concept-id" : "oYPt_yRA_Smm",
    "matched-string" : "Malmö",
    "annotation-id" : 11
  }, {
    "preferred-label" : "Restaurang",
    "sentiment" : "NOT_RELEVANT",
    "type" : "keyword",
    "start-position" : 237,
    "end-position" : 249,
    "concept-id" : "o2Cg_3Ap_qvK",
    "matched-string" : "restauranger",
    "annotation-id" : 12
  }, {
    "preferred-label" : "Gatukök",
    "sentiment" : "NOT_RELEVANT",
    "type" : "skill",
    "start-position" : 290,
    "end-position" : 297,
    "concept-id" : "dmi6_Jfs_pso",
    "matched-string" : "gatukök",
    "annotation-id" : 2
  }, {
    "preferred-label" : "Restaurang",
    "sentiment" : "NOT_RELEVANT",
    "type" : "keyword",
    "start-position" : 475,
    "end-position" : 485,
    "concept-id" : "o2Cg_3Ap_qvK",
    "matched-string" : "restaurang",
    "annotation-id" : 3
  }, {
    "preferred-label" : "A la carte",
    "sentiment" : "NOT_RELEVANT",
    "type" : "skill",
    "start-position" : 596,
    "end-position" : 606,
    "concept-id" : "Bb4Q_Vou_pbq",
    "matched-string" : "à la carte",
    "annotation-id" : 13
  }, {
    "preferred-label" : "Serveringspersonal",
    "sentiment" : "NOT_RELEVANT",
    "type" : "keyword",
    "start-position" : 644,
    "end-position" : 662,
    "concept-id" : "VqRa_738_v98",
    "matched-string" : "serveringspersonal",
    "annotation-id" : 4
  }, {
    "preferred-label" : "Sprit/Vin",
    "sentiment" : "NOT_RELEVANT",
    "type" : "skill",
    "start-position" : 848,
    "end-position" : 851,
    "concept-id" : "S4vL_AVu_s6q",
    "matched-string" : "vin",
    "annotation-id" : 5
  }, {
    "preferred-label" : "Sprit/Vin",
    "sentiment" : "NOT_RELEVANT",
    "type" : "skill",
    "start-position" : 1025,
    "end-position" : 1028,
    "concept-id" : "S4vL_AVu_s6q",
    "matched-string" : "vin",
    "annotation-id" : 6
  }, {
    "preferred-label" : "hantera stress",
    "sentiment" : "MUST_HAVE",
    "type" : "esco-skill",
    "start-position" : 1113,
    "end-position" : 1124,
    "concept-id" : "z5Zo_DVb_VEK",
    "matched-string" : "stresstålig",
    "annotation-id" : 14
  }, {
    "preferred-label" : "Kollektivavtal",
    "sentiment" : "OFFERED",
    "type" : "skill",
    "start-position" : 1660,
    "end-position" : 1674,
    "concept-id" : "z7wE_9xb_3jX",
    "matched-string" : "kollektivavtal",
    "annotation-id" : 7
  }, {
    "preferred-label" : "Servitör/Servitris",
    "sentiment" : "MUST_HAVE",
    "type" : "occupation-name",
    "start-position" : 1752,
    "end-position" : 1770,
    "concept-id" : "rGGf_KLs_To7",
    "matched-string" : "Servitris/servitör",
    "annotation-id" : 15
  } ],
  "text" : "Servitris/Servitör S:t Markus Vinkällare\nNöjeskvarteret Malmborgen AB i centrala Malmö har som ambition att tillgodose en helhetsupplevelse avseende nöjen till våra gäster genom våra olika inriktningar. Hos oss hittar man allt från pub, restauranger, nattklubbar, vinkällare, festvåningar, gatukök samt vår fina uteservering Gränden på sommaren. \nVi strävar hela tiden efter att ge våra gäster det lilla extra vad gäller miljö, service samt gastronomisk upplevelse. Till vår Restaurang S:t Markus Vinkällare som är en del av Nöjeskvarteret Malmborgen, och som primärt serverar buffé och klassisk à la carte, söker vi nu ambitiös och engagerade serveringspersonal med start till sensommaren.\nArbetet omfattar primärt traditionell servering där gästen sätts i fokus. Du finner det intressant att hålla dig à jour med både mat och dryck och speciellt vin, samt att kunna förmedla dessa på bästa sätt till våra gäster. Vi ser gärna att du har arbetat med servering sedan tidigare samt har kassaerfarenhet. Du bör ha kunskap utav vin och kunna förmedla denna kunskap till våra gäster.\nSom person är du glad, ambitiös, stresstålig och pålitlig. Du brinner för att ge våra gäster den absolut bästa service. Vidare är du en lagspelare som trivs i en dynamisk miljö. För våra gästers skull ser vi gärna att du är snus- och rökfri.\nMöjlighet finns att även arbeta på någon av våra andra inriktningar inom Nöjeskvarteret Malmborgen såsom Gränden på sommaren eller en av våra nattklubbar som ett komplement. För rätt person finns fina utvecklingsmöjligheter inom vårt företag som kan leda till en mer senior roll.\nTjänster är för heltid, deltid samt vid behov.\nLön enligt kollektivavtal. Vänligen skicka ditt CV och gärna en bild på dig.\nVänligen märk er ansökan ”Servitris/servitör S:t Markus Vinkällare 2022”\nAnsökningar tages emot löpande och anställning påbörjas inom en relativ snar framtid.\nFör mer info, kontakta: info@malmborgen.nu\nÖppen för alla\nVi fokuserar på din kompetens, inte dina övriga förutsättningar. Vi är öppna för att anpassa rollen eller arbetsplatsen efter dina behov."
}