{
  "meta" : {
    "jobad" : {
      "description" : {
        "requirements" : null,
        "needs" : null,
        "company_information" : null,
        "text_formatted" : "<p>Vi på Grillbaren111 söker en Ny diskare. Du är snabblärd, noggrann, effektiv i ditt arbete och en lagspelare. Du är villig att jobba mycket och har en erfarenhet från jobb i disken.</p>",
        "conditions" : null,
        "text" : "Vi på Grillbaren111 söker en Ny diskare. Du är snabblärd, noggrann, effektiv i ditt arbete och en lagspelare. Du är villig att jobba mycket och har en erfarenhet från jobb i disken."
      },
      "headline" : "Diskare",
      "driving_license" : null,
      "employer" : {
        "email" : null,
        "phone_number" : null,
        "organization_number" : "5591638811",
        "name" : "FAEK AB",
        "url" : null,
        "workplace" : "Grillbaren111"
      },
      "removed_date" : null,
      "logo_url" : null,
      "last_publication_date" : "2022-08-31T23:59:59",
      "number_of_vacancies" : 2,
      "occupation" : {
        "concept_id" : "pKTY_Kwu_sUw",
        "label" : "Diskare",
        "legacy_ams_taxonomy_id" : "5556"
      },
      "occupation_group" : {
        "concept_id" : "tPox_ie4_X9X",
        "label" : "Restaurang- och köksbiträden m.fl.",
        "legacy_ams_taxonomy_id" : "9412"
      },
      "employment_type" : {
        "concept_id" : "PFZr_Syz_cUq",
        "label" : "Vanlig anställning",
        "legacy_ams_taxonomy_id" : "1"
      },
      "webpage_url" : "https://arbetsformedlingen.se/platsbanken/annonser/26368302",
      "driving_license_required" : false,
      "application_contacts" : [ ],
      "duration" : {
        "concept_id" : "a7uU_j21_mkL",
        "label" : "Tills vidare",
        "legacy_ams_taxonomy_id" : "1"
      },
      "nice_to_have" : {
        "education_level" : [ ],
        "work_experiences" : [ {
          "concept_id" : "pKTY_Kwu_sUw",
          "weight" : 5,
          "label" : "Diskare",
          "legacy_ams_taxonomy_id" : "5556"
        } ],
        "skills" : [ ],
        "education" : [ ],
        "languages" : [ ]
      },
      "application_details" : {
        "via_af" : false,
        "email" : "info@grillbaren111.com",
        "other" : null,
        "reference" : null,
        "url" : null,
        "information" : null
      },
      "source_type" : "VIA_ANNONSERA",
      "application_deadline" : "2022-08-31T23:59:59",
      "external_id" : null,
      "workplace_address" : {
        "coordinates" : [ 18.074629271658516, 59.313095023919004 ],
        "city" : "STOCKHOLM",
        "postcode" : "11624",
        "municipality" : "Stockholm",
        "region_concept_id" : "CifL_Rzy_Mku",
        "region" : "Stockholms län",
        "country_code" : "199",
        "region_code" : "01",
        "municipality_concept_id" : "AvNB_uwa_6n6",
        "country_concept_id" : "i46j_HmG_v64",
        "municipality_code" : "0180",
        "street_address" : "Åsögatan 111",
        "country" : "Sverige"
      },
      "id" : "26368302",
      "experience_required" : true,
      "working_hours_type" : {
        "concept_id" : "6YE1_gAC_R2G",
        "label" : "Heltid",
        "legacy_ams_taxonomy_id" : "1"
      },
      "access" : null,
      "timestamp" : 1659356505294,
      "must_have" : {
        "education_level" : [ ],
        "work_experiences" : [ ],
        "skills" : [ ],
        "education" : [ ],
        "languages" : [ ]
      },
      "occupation_field" : {
        "concept_id" : "ScKy_FHB_7wT",
        "label" : "Hotell, restaurang, storhushåll",
        "legacy_ams_taxonomy_id" : "7"
      },
      "scope_of_work" : {
        "min" : 0,
        "max" : 100
      },
      "salary_type" : {
        "concept_id" : "oG8G_9cW_nRf",
        "label" : "Fast månads- vecko- eller timlön",
        "legacy_ams_taxonomy_id" : "1"
      },
      "removed" : false,
      "salary_description" : null,
      "access_to_own_car" : false,
      "publication_date" : "2022-08-01T14:21:45"
    },
    "name" : "Diskare",
    "user" : "hannes"
  },
  "sha1" : "1c750562260f6d25a7d82d6233d27a259f2885e2",
  "annotations" : [ {
    "preferred-label" : "Diskare",
    "sentiment" : "MUST_HAVE",
    "type" : "occupation-name",
    "start-position" : 0,
    "end-position" : 7,
    "concept-id" : "pKTY_Kwu_sUw",
    "matched-string" : "diskare",
    "annotation-id" : 0
  }, {
    "preferred-label" : "Diskare",
    "sentiment" : "MUST_HAVE",
    "type" : "occupation-name",
    "start-position" : 40,
    "end-position" : 47,
    "concept-id" : "pKTY_Kwu_sUw",
    "matched-string" : "diskare",
    "annotation-id" : 1
  }, {
    "preferred-label" : "noggrannhet",
    "type" : "esco-skill",
    "start-position" : 66,
    "end-position" : 74,
    "concept-id" : "mrsW_EkL_KRD",
    "matched-string" : "noggrann",
    "annotation-id" : 2
  } ],
  "text" : "Diskare\nVi på Grillbaren111 söker en Ny diskare. Du är snabblärd, noggrann, effektiv i ditt arbete och en lagspelare. Du är villig att jobba mycket och har en erfarenhet från jobb i disken."
}