{
  "meta" : {
    "jobad" : {
      "description" : {
        "requirements" : null,
        "needs" : null,
        "company_information" : null,
        "text_formatted" : "<p><strong>Vill du jobba på en av Stockholms mest populära frisörkedjor med ett kreativt team?</strong></p><p>Vi söker nu 4 st drivna frisörer till vårt team i Odenplan.</p><p>Salongen ligger centralt belägen på Odenplan, ca 50 meter från Åhlens samt ett stenkast från pendelstation och tunnelbana. Vi är en väletablerad kedja som behöver utöka med frisörer samt barberare för förstklassiga behandlingar som klippning &amp; färgning samt slingning av hår. Vi sitter i mycket fina lokaler och idag är det åtta stycken som jobbar på salongen.</p><p>Vi har sedan starten lyckats att attrahera mängder av kunder, då nuvarande frisörer är i princip fullbelagda behöver vi nu utöka personalgruppen för att kunna ta emot alla nya kunder som strömmar till Vasastans populäraste salong.</p><p>Vi jobbar mest med färgbehandlingar, klippningar och keratinbehandlingar samt naglar. Vi har ett tätt samarbete med Schwarzkopf och utbildar oss alltid inom senaste teknikerna tillsammans med tekniker från schwarzkopf.</p><p>Nu utökar vi med ännu fler medarbetare på våra innerstadssalonger i Stockholm.</p><p><br></p><p>Vi söker dig som har erfarenhet från yrkesområdet herr &amp; damfrisör och fixar både färgningar slingor permanent m.m</p><p><br></p><p>Är du intresserad av att arbeta med ett glatt gäng frisörer på en trevlig arbetsplats är du välkommen med din sökning</p><p><br></p><p>maila din sökning :</p><p>harklippet.odenplan@hotmail.com</p><p id=\"oppenforalla\">Öppen för alla\nVi fokuserar på din kompetens, inte dina övriga förutsättningar. Vi är öppna för att anpassa rollen eller arbetsplatsen efter dina behov.</p>",
        "conditions" : null,
        "text" : "Vill du jobba på en av Stockholms mest populära frisörkedjor med ett kreativt team?\nVi söker nu 4 st drivna frisörer till vårt team i Odenplan.\nSalongen ligger centralt belägen på Odenplan, ca 50 meter från Åhlens samt ett stenkast från pendelstation och tunnelbana. Vi är en väletablerad kedja som behöver utöka med frisörer samt barberare för förstklassiga behandlingar som klippning & färgning samt slingning av hår. Vi sitter i mycket fina lokaler och idag är det åtta stycken som jobbar på salongen.\nVi har sedan starten lyckats att attrahera mängder av kunder, då nuvarande frisörer är i princip fullbelagda behöver vi nu utöka personalgruppen för att kunna ta emot alla nya kunder som strömmar till Vasastans populäraste salong.\nVi jobbar mest med färgbehandlingar, klippningar och keratinbehandlingar samt naglar. Vi har ett tätt samarbete med Schwarzkopf och utbildar oss alltid inom senaste teknikerna tillsammans med tekniker från schwarzkopf.\nNu utökar vi med ännu fler medarbetare på våra innerstadssalonger i Stockholm.\n\n\nVi söker dig som har erfarenhet från yrkesområdet herr & damfrisör och fixar både färgningar slingor permanent m.m\n\n\nÄr du intresserad av att arbeta med ett glatt gäng frisörer på en trevlig arbetsplats är du välkommen med din sökning\n\n\nmaila din sökning :\nharklippet.odenplan@hotmail.com\nÖppen för alla\nVi fokuserar på din kompetens, inte dina övriga förutsättningar. Vi är öppna för att anpassa rollen eller arbetsplatsen efter dina behov."
      },
      "headline" : "Frisörer sökes till väletablerad kedja",
      "driving_license" : null,
      "employer" : {
        "email" : null,
        "phone_number" : null,
        "organization_number" : "9697459338",
        "name" : "Salong Hårklippet Vasastan HB",
        "url" : null,
        "workplace" : "Hårklippet Vasastan HB, Salong"
      },
      "removed_date" : null,
      "logo_url" : null,
      "last_publication_date" : "2022-08-25T23:59:59",
      "number_of_vacancies" : 4,
      "occupation" : {
        "concept_id" : "tuoE_9Nj_fAS",
        "label" : "Frisör",
        "legacy_ams_taxonomy_id" : "5491"
      },
      "occupation_group" : {
        "concept_id" : "LyBp_bY6_bZK",
        "label" : "Frisörer",
        "legacy_ams_taxonomy_id" : "5141"
      },
      "employment_type" : {
        "concept_id" : "PFZr_Syz_cUq",
        "label" : "Vanlig anställning",
        "legacy_ams_taxonomy_id" : "1"
      },
      "webpage_url" : "https://arbetsformedlingen.se/platsbanken/annonser/26353314",
      "driving_license_required" : false,
      "application_contacts" : [ ],
      "duration" : {
        "concept_id" : "a7uU_j21_mkL",
        "label" : "Tills vidare",
        "legacy_ams_taxonomy_id" : "1"
      },
      "nice_to_have" : {
        "education_level" : [ ],
        "work_experiences" : [ ],
        "skills" : [ ],
        "education" : [ ],
        "languages" : [ ]
      },
      "application_details" : {
        "via_af" : false,
        "email" : "harklippet.odenplan@hotmail.com",
        "other" : null,
        "reference" : null,
        "url" : null,
        "information" : null
      },
      "source_type" : "VIA_ANNONSERA",
      "application_deadline" : "2022-08-25T23:59:59",
      "external_id" : null,
      "workplace_address" : {
        "coordinates" : [ 18.051910273774467, 59.34215822404474 ],
        "city" : "STOCKHOLM",
        "postcode" : "11329",
        "municipality" : "Stockholm",
        "region_concept_id" : "CifL_Rzy_Mku",
        "region" : "Stockholms län",
        "country_code" : "199",
        "region_code" : "01",
        "municipality_concept_id" : "AvNB_uwa_6n6",
        "country_concept_id" : "i46j_HmG_v64",
        "municipality_code" : "0180",
        "street_address" : "NORRTULLSGATAN 4",
        "country" : "Sverige"
      },
      "id" : "26353314",
      "experience_required" : true,
      "working_hours_type" : {
        "concept_id" : "6YE1_gAC_R2G",
        "label" : "Heltid",
        "legacy_ams_taxonomy_id" : "1"
      },
      "access" : null,
      "timestamp" : 1658801450283,
      "must_have" : {
        "education_level" : [ ],
        "work_experiences" : [ {
          "concept_id" : "tuoE_9Nj_fAS",
          "weight" : 10,
          "label" : "Frisör",
          "legacy_ams_taxonomy_id" : "5491"
        } ],
        "skills" : [ ],
        "education" : [ ],
        "languages" : [ ]
      },
      "occupation_field" : {
        "concept_id" : "Uuf1_GMh_Uvw",
        "label" : "Kropps- och skönhetsvård",
        "legacy_ams_taxonomy_id" : "4"
      },
      "scope_of_work" : {
        "min" : 0,
        "max" : 100
      },
      "salary_type" : {
        "concept_id" : "oG8G_9cW_nRf",
        "label" : "Fast månads- vecko- eller timlön",
        "legacy_ams_taxonomy_id" : "1"
      },
      "removed" : false,
      "salary_description" : null,
      "access_to_own_car" : false,
      "publication_date" : "2022-07-26T04:10:50"
    },
    "name" : "Frisörer sökes till väletablerad kedja",
    "user" : "kristof.fischer"
  },
  "sha1" : "bcdb7ba2d62d62f0dca808abc485758595807705",
  "annotations" : [ {
    "preferred-label" : "Frisör",
    "sentiment" : "MUST_HAVE",
    "type" : "occupation-name",
    "start-position" : 0,
    "end-position" : 8,
    "concept-id" : "tuoE_9Nj_fAS",
    "matched-string" : "frisörer",
    "annotation-id" : 0
  }, {
    "preferred-label" : "Stockholm",
    "type" : "municipality",
    "start-position" : 62,
    "end-position" : 72,
    "concept-id" : "AvNB_uwa_6n6",
    "matched-string" : "Stockholms",
    "annotation-id" : 8
  }, {
    "preferred-label" : "Frisör",
    "sentiment" : "MUST_HAVE",
    "type" : "occupation-name",
    "start-position" : 147,
    "end-position" : 155,
    "concept-id" : "tuoE_9Nj_fAS",
    "matched-string" : "frisörer",
    "annotation-id" : 1
  }, {
    "preferred-label" : "Frisör",
    "sentiment" : "MUST_HAVE",
    "type" : "occupation-name",
    "start-position" : 356,
    "end-position" : 364,
    "concept-id" : "tuoE_9Nj_fAS",
    "matched-string" : "frisörer",
    "annotation-id" : 2
  }, {
    "preferred-label" : "Barberare",
    "sentiment" : "MUST_HAVE",
    "type" : "occupation-name",
    "start-position" : 370,
    "end-position" : 379,
    "concept-id" : "hDzC_BF5_Wz2",
    "matched-string" : "barberare",
    "annotation-id" : 3
  }, {
    "preferred-label" : "Frisör",
    "sentiment" : "MUST_HAVE",
    "type" : "occupation-name",
    "start-position" : 619,
    "end-position" : 627,
    "concept-id" : "tuoE_9Nj_fAS",
    "matched-string" : "frisörer",
    "annotation-id" : 4
  }, {
    "preferred-label" : "Stockholm",
    "type" : "municipality",
    "start-position" : 1062,
    "end-position" : 1071,
    "concept-id" : "AvNB_uwa_6n6",
    "matched-string" : "Stockholm",
    "annotation-id" : 9
  }, {
    "preferred-label" : "Herrfrisör",
    "type" : "occupation-name",
    "start-position" : 1125,
    "end-position" : 1129,
    "concept-id" : "84wd_wvd_zH8",
    "matched-string" : "herr",
    "annotation-id" : 10
  }, {
    "preferred-label" : "Damfrisör",
    "sentiment" : "MUST_HAVE",
    "type" : "occupation-name",
    "start-position" : 1132,
    "end-position" : 1141,
    "concept-id" : "M9CN_jxU_54j",
    "matched-string" : "damfrisör",
    "annotation-id" : 5
  }, {
    "preferred-label" : "hårfärgning",
    "sentiment" : "MUST_HAVE",
    "type" : "esco-skill",
    "start-position" : 1157,
    "end-position" : 1167,
    "concept-id" : "4ket_STk_esu",
    "matched-string" : "färgningar",
    "annotation-id" : 11
  }, {
    "preferred-label" : "styla hår",
    "sentiment" : "MUST_HAVE",
    "type" : "esco-skill",
    "start-position" : 1168,
    "end-position" : 1175,
    "concept-id" : "sQfi_ypW_X6x",
    "matched-string" : "slingor",
    "annotation-id" : 12
  }, {
    "preferred-label" : "permanenta hår",
    "sentiment" : "MUST_HAVE",
    "type" : "esco-skill",
    "start-position" : 1176,
    "end-position" : 1185,
    "concept-id" : "q7KK_WNw_jKy",
    "matched-string" : "permanent",
    "annotation-id" : 13
  }, {
    "preferred-label" : "Frisör",
    "sentiment" : "MUST_HAVE",
    "type" : "occupation-name",
    "start-position" : 1243,
    "end-position" : 1251,
    "concept-id" : "tuoE_9Nj_fAS",
    "matched-string" : "frisörer",
    "annotation-id" : 6
  } ],
  "text" : "Frisörer sökes till väletablerad kedja\nVill du jobba på en av Stockholms mest populära frisörkedjor med ett kreativt team?\nVi söker nu 4 st drivna frisörer till vårt team i Odenplan.\nSalongen ligger centralt belägen på Odenplan, ca 50 meter från Åhlens samt ett stenkast från pendelstation och tunnelbana. Vi är en väletablerad kedja som behöver utöka med frisörer samt barberare för förstklassiga behandlingar som klippning & färgning samt slingning av hår. Vi sitter i mycket fina lokaler och idag är det åtta stycken som jobbar på salongen.\nVi har sedan starten lyckats att attrahera mängder av kunder, då nuvarande frisörer är i princip fullbelagda behöver vi nu utöka personalgruppen för att kunna ta emot alla nya kunder som strömmar till Vasastans populäraste salong.\nVi jobbar mest med färgbehandlingar, klippningar och keratinbehandlingar samt naglar. Vi har ett tätt samarbete med Schwarzkopf och utbildar oss alltid inom senaste teknikerna tillsammans med tekniker från schwarzkopf.\nNu utökar vi med ännu fler medarbetare på våra innerstadssalonger i Stockholm.\n\n\nVi söker dig som har erfarenhet från yrkesområdet herr & damfrisör och fixar både färgningar slingor permanent m.m\n\n\nÄr du intresserad av att arbeta med ett glatt gäng frisörer på en trevlig arbetsplats är du välkommen med din sökning\n\n\nmaila din sökning :\nharklippet.odenplan@hotmail.com\nÖppen för alla\nVi fokuserar på din kompetens, inte dina övriga förutsättningar. Vi är öppna för att anpassa rollen eller arbetsplatsen efter dina behov."
}