{
  "meta" : {
    "jobad" : {
      "description" : {
        "requirements" : null,
        "needs" : null,
        "company_information" : null,
        "text_formatted" : "Svetsare/Plåtslagare Muskö\n\nPå Saab blickar vi ständigt framåt och utmanar gränserna för vad som är tekniskt möjligt. Vi samarbetar med kollegor runt om i världen som alla delar vår utmaning - att göra världen till en säkrare plats.\nPå Saab, Muskö blir du en del av ett sammansvetsat gäng som gör nästan allt för att Marinens fartyg skall vara tillgängliga och körklara.\n\nVad du blir en del av\nSaab är en helhetsleverantör av marin högteknologi i världsklass - på ytan och under. Vi designar, bygger och underhåller marina ytfartyg och ubåtar som innehåller världens mest avancerade smygteknik. Andra framgångsrika produkter är det luftoberoende Stirling (AIP) systemet och minröjningssystem. På Saab är produktionen hjärtat i varvsverksamheten. Vi ansvarar för nybyggnation, ombyggnad samt underhåll av ytfartyg och u-båtar. Att jobba hos oss innebär att du får jobba med morgondagens teknologi i en miljö som andas både nytänkande och världsarv. För att Saab ska kunna tillhöra världseliten, både på ytan och under, krävs framsynthet, fantasi och kreativitet. Kanske är just Du den vi söker.\n\nDin framtida utmaning\nSom del i plåt/svets verkstaden på Muskö kommer dina arbetsuppgifter vara allt från nytillverkning av enstycksdetaljer, byte av inredning detaljer, samt många kontroller som ska göras tex ankarkätting, Livflotte arrangemang m.m. Även stor som små renovering och ombyggnationer av marinens ytfartyg,. varför det ställs krav på din förmåga att kunna ta egna initiativ och komma med egna kreativa lösningar. Du är en problemlösare som älskar att arbeta med teknik. På Muskö finns möjlighet att utveckla dina tekniska kunskaper då du kommer arbeta med kollegor som har hög kompetens. Arbetet är varierande eftersom det handlar om olika fartyg med olika komplexitet och ålder. Vill du utveckla dig själv och arbeta i en spännande miljö? \n\nResor både inrikes/utrikes kan förekomma.\n\nDen du är idag\nGlad och positiv Kille/Tjej, som är ordningsam till avdelning stål/svets. Du är utbildad plåtslagare eller svetsare med några år i yrket och erfarenhet inom framförallt aluminium och rostfritt men även stål. Du bör ha erfarenhet och kunskap i metoderna TIG, MIG och MAG. Licenser är meriterande men inget krav. Din noggrannhet ska märkas i dina jobb, kvalitet är mycket viktigt och genom ett strukturerat arbetssätt, god planering och rätt prioritering kan du själv utvärdera och lämna ifrån dig dina jobb.\n\nFör att lyckas hos oss ser vi gärna att du har:\n\nDu kan uttrycka dig i tal och skrift på svenska och på engelska samt innehar minst B-körkort.Samarbete är viktigt men också förmågan att kunna jobba självständigt. Du måste vara ansvarstagande, ordningsam och strukturerad, innehar minst B-körkort och god grundläggande datorvana. \n\nMeriterande:\n\nOm du har erfarenheter ifrån arbete med travers-, truck och mobil plattforms-arbete, tunglyft arbeten tex taljor. Bearbetat material med bland annat borrning, svarvning, fräsning samt gängning\n \n\nBefattningen kräver att du genomgår och godkänns enligt vid var tid gällande bestämmelser för säkerhetsskydd. För befattningar där Saab har krav på säkerhetsklassinplacering kan, i förekommande fall, medföra på visst medborgarskap. Vänligen observera att vi arbetar med löpande urval och tjänsten kan komma att tillsättas innan sista ansökningsdatum har gått ut.\n\nI denna rekrytering samarbetar Saab med Skill. Kontakta ansvarig rekryterare Nina Torebrink, 0455-10405 nina.torebrink@skill.se, Mikaela Samuelsson, 0455-365365, mikaela.samuelsson@skill.se\n\nOm Saab\n\nSaab är ett globalt försvars- och säkerhetsföretag verksamt inom flyg-, land- och marinförsvar, civil säkerhet och kommersiell flygteknik. Vi är 15 500 medarbetare och har verksamhet på alla kontinenter. Tekniskt är vi ledande inom många områden och en femtedel av våra intäkter går till forskning och utveckling. Saab är också ett möjligheternas företag. Ett företag där vi ser mångfald som en tillgång och där du som medarbetare får stort ansvar och goda utvecklingsmöjligheter. Men också ett företag som respekterar varje människas behov av ett liv utanför arbetet.",
        "conditions" : "Heltid\r\nPermanent",
        "text" : "Svetsare/Plåtslagare Muskö\n\nPå Saab blickar vi ständigt framåt och utmanar gränserna för vad som är tekniskt möjligt. Vi samarbetar med kollegor runt om i världen som alla delar vår utmaning - att göra världen till en säkrare plats.\nPå Saab, Muskö blir du en del av ett sammansvetsat gäng som gör nästan allt för att Marinens fartyg skall vara tillgängliga och körklara.\n\nVad du blir en del av\nSaab är en helhetsleverantör av marin högteknologi i världsklass - på ytan och under. Vi designar, bygger och underhåller marina ytfartyg och ubåtar som innehåller världens mest avancerade smygteknik. Andra framgångsrika produkter är det luftoberoende Stirling (AIP) systemet och minröjningssystem. På Saab är produktionen hjärtat i varvsverksamheten. Vi ansvarar för nybyggnation, ombyggnad samt underhåll av ytfartyg och u-båtar. Att jobba hos oss innebär att du får jobba med morgondagens teknologi i en miljö som andas både nytänkande och världsarv. För att Saab ska kunna tillhöra världseliten, både på ytan och under, krävs framsynthet, fantasi och kreativitet. Kanske är just Du den vi söker.\n\nDin framtida utmaning\nSom del i plåt/svets verkstaden på Muskö kommer dina arbetsuppgifter vara allt från nytillverkning av enstycksdetaljer, byte av inredning detaljer, samt många kontroller som ska göras tex ankarkätting, Livflotte arrangemang m.m. Även stor som små renovering och ombyggnationer av marinens ytfartyg,. varför det ställs krav på din förmåga att kunna ta egna initiativ och komma med egna kreativa lösningar. Du är en problemlösare som älskar att arbeta med teknik. På Muskö finns möjlighet att utveckla dina tekniska kunskaper då du kommer arbeta med kollegor som har hög kompetens. Arbetet är varierande eftersom det handlar om olika fartyg med olika komplexitet och ålder. Vill du utveckla dig själv och arbeta i en spännande miljö? \n\nResor både inrikes/utrikes kan förekomma.\n\nDen du är idag\nGlad och positiv Kille/Tjej, som är ordningsam till avdelning stål/svets. Du är utbildad plåtslagare eller svetsare med några år i yrket och erfarenhet inom framförallt aluminium och rostfritt men även stål. Du bör ha erfarenhet och kunskap i metoderna TIG, MIG och MAG. Licenser är meriterande men inget krav. Din noggrannhet ska märkas i dina jobb, kvalitet är mycket viktigt och genom ett strukturerat arbetssätt, god planering och rätt prioritering kan du själv utvärdera och lämna ifrån dig dina jobb.\n\nFör att lyckas hos oss ser vi gärna att du har:\n\nDu kan uttrycka dig i tal och skrift på svenska och på engelska samt innehar minst B-körkort.Samarbete är viktigt men också förmågan att kunna jobba självständigt. Du måste vara ansvarstagande, ordningsam och strukturerad, innehar minst B-körkort och god grundläggande datorvana. \n\nMeriterande:\n\nOm du har erfarenheter ifrån arbete med travers-, truck och mobil plattforms-arbete, tunglyft arbeten tex taljor. Bearbetat material med bland annat borrning, svarvning, fräsning samt gängning\n \n\nBefattningen kräver att du genomgår och godkänns enligt vid var tid gällande bestämmelser för säkerhetsskydd. För befattningar där Saab har krav på säkerhetsklassinplacering kan, i förekommande fall, medföra på visst medborgarskap. Vänligen observera att vi arbetar med löpande urval och tjänsten kan komma att tillsättas innan sista ansökningsdatum har gått ut.\n\nI denna rekrytering samarbetar Saab med Skill. Kontakta ansvarig rekryterare Nina Torebrink, 0455-10405 nina.torebrink@skill.se, Mikaela Samuelsson, 0455-365365, mikaela.samuelsson@skill.se\n\nOm Saab\n\nSaab är ett globalt försvars- och säkerhetsföretag verksamt inom flyg-, land- och marinförsvar, civil säkerhet och kommersiell flygteknik. Vi är 15 500 medarbetare och har verksamhet på alla kontinenter. Tekniskt är vi ledande inom många områden och en femtedel av våra intäkter går till forskning och utveckling. Saab är också ett möjligheternas företag. Ett företag där vi ser mångfald som en tillgång och där du som medarbetare får stort ansvar och goda utvecklingsmöjligheter. Men också ett företag som respekterar varje människas behov av ett liv utanför arbetet."
      },
      "headline" : "Svetsare/Plåtslagare",
      "driving_license" : [ {
        "concept_id" : "VTK8_WRx_GcM",
        "label" : "B",
        "legacy_ams_taxonomy_id" : "3"
      } ],
      "employer" : {
        "email" : null,
        "phone_number" : null,
        "organization_number" : "5560360793",
        "name" : "SAAB AB",
        "url" : null,
        "workplace" : "Saab"
      },
      "removed_date" : null,
      "logo_url" : "https://www.arbetsformedlingen.se/rest/arbetsgivare/rest/af/v3/organisation/5560360793/logotyper/logo.png",
      "last_publication_date" : "2022-09-07T23:59:59",
      "number_of_vacancies" : 1,
      "occupation" : {
        "concept_id" : "wf1E_nWA_EJp",
        "label" : "Svetsare, manuell",
        "legacy_ams_taxonomy_id" : "5945"
      },
      "occupation_group" : {
        "concept_id" : "wQ1E_Bzk_ZyA",
        "label" : "Svetsare och gasskärare",
        "legacy_ams_taxonomy_id" : "7212"
      },
      "employment_type" : {
        "concept_id" : "PFZr_Syz_cUq",
        "label" : "Vanlig anställning",
        "legacy_ams_taxonomy_id" : "1"
      },
      "webpage_url" : "https://arbetsformedlingen.se/platsbanken/annonser/26375036",
      "driving_license_required" : true,
      "application_contacts" : [ {
        "description" : "Saab AB",
        "email" : null,
        "telephone" : null,
        "name" : null,
        "contact_type" : null
      } ],
      "duration" : {
        "concept_id" : "a7uU_j21_mkL",
        "label" : "Tills vidare",
        "legacy_ams_taxonomy_id" : "1"
      },
      "nice_to_have" : {
        "education_level" : [ ],
        "work_experiences" : [ ],
        "skills" : [ ],
        "education" : [ ],
        "languages" : [ ]
      },
      "application_details" : {
        "via_af" : false,
        "email" : null,
        "other" : null,
        "reference" : "REQ_13913",
        "url" : "https://www.aplitrak.com/?adid=bi50b3JlYnJpbmsuMjA0NDIuMzEwMUBzYWFiLmFwbGl0cmFrLmNvbQ",
        "information" : null
      },
      "source_type" : "VIA_PLATSBANKEN_DXA",
      "application_deadline" : "2022-09-07T23:59:59",
      "external_id" : "46-556036-0793-REQ_13913",
      "workplace_address" : {
        "coordinates" : [ 17.94653, 58.902927 ],
        "city" : null,
        "postcode" : null,
        "municipality" : "Nynäshamn",
        "region_concept_id" : "CifL_Rzy_Mku",
        "region" : "Stockholms län",
        "country_code" : "199",
        "region_code" : "01",
        "municipality_concept_id" : "37UU_T7x_oxG",
        "country_concept_id" : "i46j_HmG_v64",
        "municipality_code" : "0192",
        "street_address" : null,
        "country" : "Sverige"
      },
      "id" : "26375036",
      "experience_required" : true,
      "working_hours_type" : {
        "concept_id" : "6YE1_gAC_R2G",
        "label" : "Heltid",
        "legacy_ams_taxonomy_id" : "1"
      },
      "access" : null,
      "timestamp" : 1659526244236,
      "must_have" : {
        "education_level" : [ ],
        "work_experiences" : [ {
          "concept_id" : "wf1E_nWA_EJp",
          "weight" : 10,
          "label" : "Svetsare, manuell",
          "legacy_ams_taxonomy_id" : "5945"
        } ],
        "skills" : [ ],
        "education" : [ ],
        "languages" : [ ]
      },
      "occupation_field" : {
        "concept_id" : "wTEr_CBC_bqh",
        "label" : "Industriell tillverkning",
        "legacy_ams_taxonomy_id" : "9"
      },
      "scope_of_work" : {
        "min" : 100,
        "max" : 100
      },
      "salary_type" : {
        "concept_id" : "oG8G_9cW_nRf",
        "label" : "Fast månads- vecko- eller timlön",
        "legacy_ams_taxonomy_id" : "1"
      },
      "removed" : false,
      "salary_description" : "Not Specified",
      "access_to_own_car" : false,
      "publication_date" : "2022-08-03T13:30:44"
    },
    "name" : "Svetsare/Plåtslagare",
    "user" : "hannes"
  },
  "sha1" : "e3e8ca8366e2ec9a5aa5542cb4cb3d538ad94368",
  "annotations" : [ {
    "preferred-label" : "Svetsare",
    "sentiment" : "MUST_HAVE",
    "type" : "keyword",
    "start-position" : 0,
    "end-position" : 8,
    "concept-id" : "ouXc_F9J_bAC",
    "matched-string" : "svetsare",
    "annotation-id" : 0
  }, {
    "preferred-label" : "Plåtslagare",
    "sentiment" : "MUST_HAVE",
    "type" : "keyword",
    "start-position" : 9,
    "end-position" : 20,
    "concept-id" : "JezX_oUD_TZr",
    "matched-string" : "plåtslagare",
    "annotation-id" : 1
  }, {
    "preferred-label" : "Svetsare",
    "sentiment" : "MUST_HAVE",
    "type" : "keyword",
    "start-position" : 21,
    "end-position" : 29,
    "concept-id" : "ouXc_F9J_bAC",
    "matched-string" : "svetsare",
    "annotation-id" : 2
  }, {
    "preferred-label" : "Plåtslagare",
    "sentiment" : "MUST_HAVE",
    "type" : "keyword",
    "start-position" : 30,
    "end-position" : 41,
    "concept-id" : "JezX_oUD_TZr",
    "matched-string" : "plåtslagare",
    "annotation-id" : 3
  }, {
    "preferred-label" : "Fartyg",
    "sentiment" : "MUST_HAVE",
    "type" : "keyword",
    "start-position" : 347,
    "end-position" : 353,
    "concept-id" : "dRFw_Rcu_dX7",
    "matched-string" : "fartyg",
    "annotation-id" : 4
  }, {
    "preferred-label" : "Teknologi",
    "sentiment" : "MUST_HAVE",
    "type" : "keyword",
    "start-position" : 907,
    "end-position" : 916,
    "concept-id" : "KQjv_TUZ_Hy9",
    "matched-string" : "teknologi",
    "annotation-id" : 5
  }, {
    "preferred-label" : "Svets",
    "sentiment" : "MUST_HAVE",
    "type" : "keyword",
    "start-position" : 1153,
    "end-position" : 1158,
    "concept-id" : "Emhe_ce6_MYC",
    "matched-string" : "svets",
    "annotation-id" : 6
  }, {
    "preferred-label" : "Inredning",
    "sentiment" : "MUST_HAVE",
    "type" : "keyword",
    "start-position" : 1266,
    "end-position" : 1275,
    "concept-id" : "uAtM_95o_kaj",
    "matched-string" : "inredning",
    "annotation-id" : 7
  }, {
    "preferred-label" : "Fartyg",
    "sentiment" : "MUST_HAVE",
    "type" : "keyword",
    "start-position" : 1770,
    "end-position" : 1776,
    "concept-id" : "dRFw_Rcu_dX7",
    "matched-string" : "fartyg",
    "annotation-id" : 8
  }, {
    "preferred-label" : "Resor i arbetet förekommer",
    "type" : "work-place-environment",
    "start-position" : 1872,
    "end-position" : 1877,
    "concept-id" : "oaM2_JTK_muh",
    "matched-string" : "Resor",
    "annotation-id" : 20
  }, {
    "preferred-label" : "Resor i arbetet förekommer",
    "type" : "work-place-environment",
    "start-position" : 1899,
    "end-position" : 1912,
    "concept-id" : "oaM2_JTK_muh",
    "matched-string" : "kan förekomma",
    "annotation-id" : 21
  }, {
    "preferred-label" : "Svets",
    "sentiment" : "MUST_HAVE",
    "type" : "keyword",
    "start-position" : 1997,
    "end-position" : 2002,
    "concept-id" : "Emhe_ce6_MYC",
    "matched-string" : "svets",
    "annotation-id" : 10
  }, {
    "preferred-label" : "Plåtslagare",
    "sentiment" : "MUST_HAVE",
    "type" : "keyword",
    "start-position" : 2019,
    "end-position" : 2030,
    "concept-id" : "JezX_oUD_TZr",
    "matched-string" : "plåtslagare",
    "annotation-id" : 11
  }, {
    "preferred-label" : "Svetsare",
    "sentiment" : "MUST_HAVE",
    "type" : "keyword",
    "start-position" : 2037,
    "end-position" : 2045,
    "concept-id" : "ouXc_F9J_bAC",
    "matched-string" : "svetsare",
    "annotation-id" : 12
  }, {
    "preferred-label" : "TIG-svetsning",
    "type" : "skill",
    "start-position" : 2183,
    "end-position" : 2186,
    "concept-id" : "WBnc_JXj_MvY",
    "matched-string" : "TIG",
    "annotation-id" : 22
  }, {
    "preferred-label" : "MIG-svetsning",
    "type" : "skill",
    "start-position" : 2188,
    "end-position" : 2191,
    "concept-id" : "Q1D1_Pdc_rnT",
    "matched-string" : "MIG",
    "annotation-id" : 23
  }, {
    "preferred-label" : "MAG-svetsning",
    "type" : "skill",
    "start-position" : 2196,
    "end-position" : 2199,
    "concept-id" : "NH9n_Snj_CNM",
    "matched-string" : "MAG",
    "annotation-id" : 24
  }, {
    "preferred-label" : "Certifikat/licenser",
    "sentiment" : "MUST_HAVE",
    "type" : "skill-headline",
    "start-position" : 2201,
    "end-position" : 2209,
    "concept-id" : "s48H_Sft_DTn",
    "matched-string" : "licenser",
    "annotation-id" : 13
  }, {
    "preferred-label" : "noggrannhet",
    "type" : "esco-skill",
    "start-position" : 2245,
    "end-position" : 2256,
    "concept-id" : "mrsW_EkL_KRD",
    "matched-string" : "noggrannhet",
    "annotation-id" : 25
  }, {
    "preferred-label" : "Svenska",
    "sentiment" : "MUST_HAVE",
    "type" : "language",
    "start-position" : 2527,
    "end-position" : 2534,
    "concept-id" : "zSLA_vw2_FXN",
    "matched-string" : "svenska",
    "annotation-id" : 14
  }, {
    "preferred-label" : "Engelska",
    "sentiment" : "MUST_HAVE",
    "type" : "language",
    "start-position" : 2542,
    "end-position" : 2550,
    "concept-id" : "NVxJ_hLg_TYS",
    "matched-string" : "engelska",
    "annotation-id" : 15
  }, {
    "preferred-label" : "B",
    "type" : "driving-licence",
    "start-position" : 2570,
    "end-position" : 2579,
    "concept-id" : "VTK8_WRx_GcM",
    "matched-string" : "B-körkort",
    "annotation-id" : 26
  }, {
    "preferred-label" : "arbeta självständigt",
    "type" : "esco-skill",
    "start-position" : 2630,
    "end-position" : 2649,
    "concept-id" : "NyFu_HHd_zhz",
    "matched-string" : "jobba självständigt",
    "annotation-id" : 27
  }, {
    "preferred-label" : "visa ansvarstagande",
    "type" : "esco-skill",
    "start-position" : 2665,
    "end-position" : 2679,
    "concept-id" : "bcRp_hxV_f5G",
    "matched-string" : "ansvarstagande",
    "annotation-id" : 28
  }, {
    "preferred-label" : "B",
    "type" : "driving-licence",
    "start-position" : 2724,
    "end-position" : 2733,
    "concept-id" : "VTK8_WRx_GcM",
    "matched-string" : "B-körkort",
    "annotation-id" : 29
  }, {
    "preferred-label" : "Travers/Lyftanordningar",
    "sentiment" : "MUST_HAVE",
    "type" : "skill",
    "start-position" : 2823,
    "end-position" : 2830,
    "concept-id" : "R6ZK_FGC_ovb",
    "matched-string" : "travers",
    "annotation-id" : 16
  }, {
    "preferred-label" : "Truck",
    "sentiment" : "MUST_HAVE",
    "type" : "keyword",
    "start-position" : 2833,
    "end-position" : 2838,
    "concept-id" : "Wz82_4Xv_ZFr",
    "matched-string" : "truck",
    "annotation-id" : 17
  }, {
    "preferred-label" : "Borrning, konventionell maskin",
    "type" : "skill",
    "start-position" : 2932,
    "end-position" : 2940,
    "concept-id" : "ZuMC_5GQ_9jw",
    "matched-string" : "borrning",
    "annotation-id" : 30
  }, {
    "preferred-label" : "Svarvning, konventionell maskin",
    "type" : "skill",
    "start-position" : 2942,
    "end-position" : 2951,
    "concept-id" : "EGCS_78o_x3F",
    "matched-string" : "svarvning",
    "annotation-id" : 31
  }, {
    "preferred-label" : "Fräsning, konventionell maskin",
    "type" : "skill",
    "start-position" : 2953,
    "end-position" : 2961,
    "concept-id" : "ZqZp_rib_2PF",
    "matched-string" : "fräsning",
    "annotation-id" : 32
  }, {
    "preferred-label" : "sköta gängningsmaskin",
    "type" : "esco-skill",
    "start-position" : 2967,
    "end-position" : 2975,
    "concept-id" : "oRGL_Kzb_G83",
    "matched-string" : "gängning",
    "annotation-id" : 33
  }, {
    "preferred-label" : "Rekryterare/Rekryteringskonsult",
    "sentiment" : "MUST_HAVE",
    "type" : "occupation-name",
    "start-position" : 3408,
    "end-position" : 3419,
    "concept-id" : "QaQC_ozP_Bme",
    "matched-string" : "rekryterare",
    "annotation-id" : 18
  }, {
    "preferred-label" : "Flygteknik",
    "sentiment" : "MUST_HAVE",
    "type" : "skill",
    "start-position" : 3670,
    "end-position" : 3680,
    "concept-id" : "23tt_fXS_N7o",
    "matched-string" : "flygteknik",
    "annotation-id" : 19
  } ],
  "text" : "Svetsare/Plåtslagare\nSvetsare/Plåtslagare Muskö\n\nPå Saab blickar vi ständigt framåt och utmanar gränserna för vad som är tekniskt möjligt. Vi samarbetar med kollegor runt om i världen som alla delar vår utmaning - att göra världen till en säkrare plats.\nPå Saab, Muskö blir du en del av ett sammansvetsat gäng som gör nästan allt för att Marinens fartyg skall vara tillgängliga och körklara.\n\nVad du blir en del av\nSaab är en helhetsleverantör av marin högteknologi i världsklass - på ytan och under. Vi designar, bygger och underhåller marina ytfartyg och ubåtar som innehåller världens mest avancerade smygteknik. Andra framgångsrika produkter är det luftoberoende Stirling (AIP) systemet och minröjningssystem. På Saab är produktionen hjärtat i varvsverksamheten. Vi ansvarar för nybyggnation, ombyggnad samt underhåll av ytfartyg och u-båtar. Att jobba hos oss innebär att du får jobba med morgondagens teknologi i en miljö som andas både nytänkande och världsarv. För att Saab ska kunna tillhöra världseliten, både på ytan och under, krävs framsynthet, fantasi och kreativitet. Kanske är just Du den vi söker.\n\nDin framtida utmaning\nSom del i plåt/svets verkstaden på Muskö kommer dina arbetsuppgifter vara allt från nytillverkning av enstycksdetaljer, byte av inredning detaljer, samt många kontroller som ska göras tex ankarkätting, Livflotte arrangemang m.m. Även stor som små renovering och ombyggnationer av marinens ytfartyg,. varför det ställs krav på din förmåga att kunna ta egna initiativ och komma med egna kreativa lösningar. Du är en problemlösare som älskar att arbeta med teknik. På Muskö finns möjlighet att utveckla dina tekniska kunskaper då du kommer arbeta med kollegor som har hög kompetens. Arbetet är varierande eftersom det handlar om olika fartyg med olika komplexitet och ålder. Vill du utveckla dig själv och arbeta i en spännande miljö? \n\nResor både inrikes/utrikes kan förekomma.\n\nDen du är idag\nGlad och positiv Kille/Tjej, som är ordningsam till avdelning stål/svets. Du är utbildad plåtslagare eller svetsare med några år i yrket och erfarenhet inom framförallt aluminium och rostfritt men även stål. Du bör ha erfarenhet och kunskap i metoderna TIG, MIG och MAG. Licenser är meriterande men inget krav. Din noggrannhet ska märkas i dina jobb, kvalitet är mycket viktigt och genom ett strukturerat arbetssätt, god planering och rätt prioritering kan du själv utvärdera och lämna ifrån dig dina jobb.\n\nFör att lyckas hos oss ser vi gärna att du har:\n\nDu kan uttrycka dig i tal och skrift på svenska och på engelska samt innehar minst B-körkort.Samarbete är viktigt men också förmågan att kunna jobba självständigt. Du måste vara ansvarstagande, ordningsam och strukturerad, innehar minst B-körkort och god grundläggande datorvana. \n\nMeriterande:\n\nOm du har erfarenheter ifrån arbete med travers-, truck och mobil plattforms-arbete, tunglyft arbeten tex taljor. Bearbetat material med bland annat borrning, svarvning, fräsning samt gängning\n \n\nBefattningen kräver att du genomgår och godkänns enligt vid var tid gällande bestämmelser för säkerhetsskydd. För befattningar där Saab har krav på säkerhetsklassinplacering kan, i förekommande fall, medföra på visst medborgarskap. Vänligen observera att vi arbetar med löpande urval och tjänsten kan komma att tillsättas innan sista ansökningsdatum har gått ut.\n\nI denna rekrytering samarbetar Saab med Skill. Kontakta ansvarig rekryterare Nina Torebrink, 0455-10405 nina.torebrink@skill.se, Mikaela Samuelsson, 0455-365365, mikaela.samuelsson@skill.se\n\nOm Saab\n\nSaab är ett globalt försvars- och säkerhetsföretag verksamt inom flyg-, land- och marinförsvar, civil säkerhet och kommersiell flygteknik. Vi är 15 500 medarbetare och har verksamhet på alla kontinenter. Tekniskt är vi ledande inom många områden och en femtedel av våra intäkter går till forskning och utveckling. Saab är också ett möjligheternas företag. Ett företag där vi ser mångfald som en tillgång och där du som medarbetare får stort ansvar och goda utvecklingsmöjligheter. Men också ett företag som respekterar varje människas behov av ett liv utanför arbetet."
}