{
  "meta" : {
    "jobad" : {
      "description" : {
        "requirements" : null,
        "needs" : null,
        "company_information" : null,
        "text_formatted" : "Brinner du för service? Det gör vi!\n\nMRC Syd växer med sina kunder! Därav söker vi personal boende i sjöbo med omnejd. Vi söker dig som har tidigare erfarenhet från livsmedelsbranschen för arbete hos någon av alla våra kunder i Malmö med omnejd.\n\nBil och körkort är ett plus.\n\nDu ska brinna för serviceyrket och kunna arbeta både självgående och i ett team som håller ett högt tempo.\n\nTjänsten kräver en viss flexibilitet där du bör kunna hoppa in med kort varsel och där du med fördel är bosatt i närområdet kring Malmö.\n\nVanliga arbetsuppgifter i butik är varuplock, kassa, delikatess och förbutik.\nAnställningen är vid behov men kan leda till fast arbete.\n\nErfarenhet från ICA, Coop, Willys, Hemköp & Citygross är direkt meriterande!\n\nVi är ett auktoriserat bemanningsföretag via Almega samt verksamma under Handels kollektivavtal.\n\n- Tillgång till egen bil.",
        "conditions" : "Deltid\r\nAnställningstid enligt överenskommelse",
        "text" : "Brinner du för service? Det gör vi!\n\nMRC Syd växer med sina kunder! Därav söker vi personal boende i sjöbo med omnejd. Vi söker dig som har tidigare erfarenhet från livsmedelsbranschen för arbete hos någon av alla våra kunder i Malmö med omnejd.\n\nBil och körkort är ett plus.\n\nDu ska brinna för serviceyrket och kunna arbeta både självgående och i ett team som håller ett högt tempo.\n\nTjänsten kräver en viss flexibilitet där du bör kunna hoppa in med kort varsel och där du med fördel är bosatt i närområdet kring Malmö.\n\nVanliga arbetsuppgifter i butik är varuplock, kassa, delikatess och förbutik.\nAnställningen är vid behov men kan leda till fast arbete.\n\nErfarenhet från ICA, Coop, Willys, Hemköp & Citygross är direkt meriterande!\n\nVi är ett auktoriserat bemanningsföretag via Almega samt verksamma under Handels kollektivavtal.\n\n- Tillgång till egen bil."
      },
      "headline" : "Butiksmedarbetare till vår bemanningspool Sjöbo",
      "driving_license" : null,
      "employer" : {
        "email" : null,
        "phone_number" : null,
        "organization_number" : "5566471412",
        "name" : "Mrc Stockholm AB",
        "url" : "https://mrcbemanning.se/",
        "workplace" : "MRC Bemanning AB"
      },
      "removed_date" : null,
      "logo_url" : "https://www.arbetsformedlingen.se/rest/arbetsgivare/rest/af/v3/organisation/5566471412/logotyper/logo.png",
      "last_publication_date" : "2023-01-18T23:59:59",
      "number_of_vacancies" : 1,
      "occupation" : {
        "concept_id" : "pBhS_6fg_727",
        "label" : "Butikssäljare/Medarbetare, dagligvaror",
        "legacy_ams_taxonomy_id" : "2284"
      },
      "occupation_group" : {
        "concept_id" : "s1Qk_o98_2o1",
        "label" : "Butikssäljare, dagligvaror",
        "legacy_ams_taxonomy_id" : "5222"
      },
      "employment_type" : {
        "concept_id" : "PFZr_Syz_cUq",
        "label" : "Vanlig anställning",
        "legacy_ams_taxonomy_id" : "1"
      },
      "webpage_url" : "https://arbetsformedlingen.se/platsbanken/annonser/26365149",
      "driving_license_required" : false,
      "application_contacts" : [ {
        "description" : "Ann-Charlott Kvant Eriksson",
        "email" : "ann-charlott@mrcbemanning.se",
        "telephone" : "0733574351",
        "name" : null,
        "contact_type" : null
      } ],
      "duration" : {
        "concept_id" : "qQUd_4qe_NDT",
        "label" : "6 månader eller längre",
        "legacy_ams_taxonomy_id" : "2"
      },
      "nice_to_have" : {
        "education_level" : [ ],
        "work_experiences" : [ ],
        "skills" : [ ],
        "education" : [ ],
        "languages" : [ ]
      },
      "application_details" : {
        "via_af" : false,
        "email" : null,
        "other" : null,
        "reference" : null,
        "url" : "https://jobb.mrcbemanning.se/jobs/1834871-butiksmedarbetare-till-var-bemanningspool-sjobo?promotion=425858-arbetsformedlingen",
        "information" : null
      },
      "source_type" : "VIA_PLATSBANKEN_DXA",
      "application_deadline" : "2023-01-18T23:59:59",
      "external_id" : "46-556647-1412-1834871-15",
      "workplace_address" : {
        "coordinates" : [ 13.70337, 55.634823 ],
        "city" : null,
        "postcode" : null,
        "municipality" : "Sjöbo",
        "region_concept_id" : "CaRE_1nn_cSU",
        "region" : "Skåne län",
        "country_code" : "199",
        "region_code" : "12",
        "municipality_concept_id" : "P3Cs_1ZP_9XB",
        "country_concept_id" : "i46j_HmG_v64",
        "municipality_code" : "1265",
        "street_address" : null,
        "country" : "Sverige"
      },
      "id" : "26365149",
      "experience_required" : false,
      "working_hours_type" : {
        "concept_id" : "947z_JGS_Uk2",
        "label" : "Deltid",
        "legacy_ams_taxonomy_id" : "2"
      },
      "access" : null,
      "timestamp" : 1659325275007,
      "must_have" : {
        "education_level" : [ ],
        "work_experiences" : [ ],
        "skills" : [ ],
        "education" : [ ],
        "languages" : [ ]
      },
      "occupation_field" : {
        "concept_id" : "RPTn_bxG_ExZ",
        "label" : "Försäljning, inköp, marknadsföring",
        "legacy_ams_taxonomy_id" : "5"
      },
      "scope_of_work" : {
        "min" : 0,
        "max" : 100
      },
      "salary_type" : {
        "concept_id" : "oG8G_9cW_nRf",
        "label" : "Fast månads- vecko- eller timlön",
        "legacy_ams_taxonomy_id" : "1"
      },
      "removed" : false,
      "salary_description" : "Lön enligt överenskommelse",
      "access_to_own_car" : false,
      "publication_date" : "2022-08-01T05:41:15"
    },
    "name" : "Butiksmedarbetare till vår bemanningspool Sjöbo",
    "user" : "kristof.fischer"
  },
  "sha1" : "50543683b5979b9cce081cc3bde23a9cb6a6924f",
  "annotations" : [ {
    "preferred-label" : "Butikssäljare, dagligvaror/Medarbetare, dagligvaror",
    "sentiment" : "MUST_HAVE",
    "type" : "occupation-name",
    "start-position" : 0,
    "end-position" : 17,
    "concept-id" : "pBhS_6fg_727",
    "matched-string" : "butiksmedarbetare",
    "annotation-id" : 0
  }, {
    "preferred-label" : "Sjöbo",
    "type" : "municipality",
    "start-position" : 42,
    "end-position" : 47,
    "concept-id" : "P3Cs_1ZP_9XB",
    "matched-string" : "Sjöbo",
    "annotation-id" : 6
  }, {
    "preferred-label" : "Sjöbo",
    "type" : "municipality",
    "start-position" : 149,
    "end-position" : 154,
    "concept-id" : "P3Cs_1ZP_9XB",
    "matched-string" : "sjöbo",
    "annotation-id" : 7
  }, {
    "preferred-label" : "Malmö",
    "type" : "municipality",
    "start-position" : 276,
    "end-position" : 281,
    "concept-id" : "oYPt_yRA_Smm",
    "matched-string" : "Malmö",
    "annotation-id" : 8
  }, {
    "preferred-label" : "B",
    "sentiment" : "NICE_TO_HAVE",
    "type" : "driving-licence",
    "start-position" : 303,
    "end-position" : 310,
    "concept-id" : "VTK8_WRx_GcM",
    "matched-string" : "körkort",
    "annotation-id" : 9
  }, {
    "preferred-label" : "arbeta självständigt",
    "sentiment" : "MUST_HAVE",
    "type" : "esco-skill",
    "start-position" : 378,
    "end-position" : 389,
    "concept-id" : "NyFu_HHd_zhz",
    "matched-string" : "självgående",
    "annotation-id" : 10
  }, {
    "preferred-label" : "arbeta som ett team",
    "sentiment" : "MUST_HAVE",
    "type" : "esco-skill",
    "start-position" : 394,
    "end-position" : 404,
    "concept-id" : "VFVZ_4YG_Ydi",
    "matched-string" : "i ett team",
    "annotation-id" : 11
  }, {
    "preferred-label" : "Malmö",
    "type" : "municipality",
    "start-position" : 563,
    "end-position" : 568,
    "concept-id" : "oYPt_yRA_Smm",
    "matched-string" : "Malmö",
    "annotation-id" : 12
  }, {
    "preferred-label" : "Behovsanställning",
    "type" : "employment-type",
    "start-position" : 666,
    "end-position" : 675,
    "concept-id" : "1paU_aCR_nGn",
    "matched-string" : "vid behov",
    "annotation-id" : 13
  } ],
  "text" : "Butiksmedarbetare till vår bemanningspool Sjöbo\nBrinner du för service? Det gör vi!\n\nMRC Syd växer med sina kunder! Därav söker vi personal boende i sjöbo med omnejd. Vi söker dig som har tidigare erfarenhet från livsmedelsbranschen för arbete hos någon av alla våra kunder i Malmö med omnejd.\n\nBil och körkort är ett plus.\n\nDu ska brinna för serviceyrket och kunna arbeta både självgående och i ett team som håller ett högt tempo.\n\nTjänsten kräver en viss flexibilitet där du bör kunna hoppa in med kort varsel och där du med fördel är bosatt i närområdet kring Malmö.\n\nVanliga arbetsuppgifter i butik är varuplock, kassa, delikatess och förbutik.\nAnställningen är vid behov men kan leda till fast arbete.\n\nErfarenhet från ICA, Coop, Willys, Hemköp & Citygross är direkt meriterande!\n\nVi är ett auktoriserat bemanningsföretag via Almega samt verksamma under Handels kollektivavtal.\n\n- Tillgång till egen bil."
}