{
  "meta" : {
    "jobad" : {
      "description" : {
        "requirements" : null,
        "needs" : null,
        "company_information" : null,
        "text_formatted" : "<p><strong>#jobbjustnu</strong></p><p>Vi söker dig som gillar service och vill vara med i vårt härliga team.</p><p>Du vill ge bästa service till våra gäster och tycker om att vara social. Du är inte rädd att hjälpa till med det mesta i restaurangen och kan arbeta dels <u>luncher</u> dels några <u>kvällar</u> samt vid stora bokningar.</p><p>Du har gott ordningssinne och tycker om när det är snyggt och städat omkring dig.</p><p>Du bör vara stresstålig och kunna ta initiativ för att lösa problem som ofta uppstår under arbetstid i denna bransch.</p><p>Man bör också vara utåtriktad, trevlig, pratglad och tillmötesgående.</p><p>Du bör ha fyllt 18 år för att vi har alkoholtillstånd. Du ska kunna tala och förstå svenska.</p><p>Tjänsten är på minst 75% med möjlighet till 100%</p><p>Är du den vi letar efter? Gillar du när tempot är högt? Är du den som alltid ger bäst service?</p><p><strong>#jobbjustnu</strong></p>",
        "conditions" : null,
        "text" : "#jobbjustnu\nVi söker dig som gillar service och vill vara med i vårt härliga team.\nDu vill ge bästa service till våra gäster och tycker om att vara social. Du är inte rädd att hjälpa till med det mesta i restaurangen och kan arbeta dels luncher dels några kvällar samt vid stora bokningar.\nDu har gott ordningssinne och tycker om när det är snyggt och städat omkring dig.\nDu bör vara stresstålig och kunna ta initiativ för att lösa problem som ofta uppstår under arbetstid i denna bransch.\nMan bör också vara utåtriktad, trevlig, pratglad och tillmötesgående.\nDu bör ha fyllt 18 år för att vi har alkoholtillstånd. Du ska kunna tala och förstå svenska.\nTjänsten är på minst 75% med möjlighet till 100%\nÄr du den vi letar efter? Gillar du när tempot är högt? Är du den som alltid ger bäst service?\n#jobbjustnu"
      },
      "headline" : "Serveringspersonal",
      "driving_license" : null,
      "employer" : {
        "email" : null,
        "phone_number" : null,
        "organization_number" : "5590340146",
        "name" : "Hellas Bistro i Linköping AB",
        "url" : "www.soderkrogen.se",
        "workplace" : "Restaurang Söderkrogen"
      },
      "removed_date" : null,
      "logo_url" : "https://www.arbetsformedlingen.se/rest/arbetsgivare/rest/af/v3/arbetsplatser/86645003/logotyper/logo.png",
      "last_publication_date" : "2022-09-12T23:59:59",
      "number_of_vacancies" : 2,
      "occupation" : {
        "concept_id" : "rGGf_KLs_To7",
        "label" : "Servitör/Servitris",
        "legacy_ams_taxonomy_id" : "5487"
      },
      "occupation_group" : {
        "concept_id" : "UjoW_meY_Zwt",
        "label" : "Hovmästare och servitörer",
        "legacy_ams_taxonomy_id" : "5131"
      },
      "employment_type" : {
        "concept_id" : "PFZr_Syz_cUq",
        "label" : "Vanlig anställning",
        "legacy_ams_taxonomy_id" : "1"
      },
      "webpage_url" : "https://arbetsformedlingen.se/platsbanken/annonser/26406426",
      "driving_license_required" : false,
      "application_contacts" : [ ],
      "duration" : {
        "concept_id" : "qQUd_4qe_NDT",
        "label" : "6 månader eller längre",
        "legacy_ams_taxonomy_id" : "2"
      },
      "nice_to_have" : {
        "education_level" : [ ],
        "work_experiences" : [ ],
        "skills" : [ ],
        "education" : [ ],
        "languages" : [ ]
      },
      "application_details" : {
        "via_af" : false,
        "email" : "soderkrogen@gmail.com",
        "other" : null,
        "reference" : "Servispersonal lunch/kväll",
        "url" : null,
        "information" : null
      },
      "source_type" : "VIA_ANNONSERA",
      "application_deadline" : "2022-09-12T23:59:59",
      "external_id" : null,
      "workplace_address" : {
        "coordinates" : [ 15.626234923810438, 58.39127498094724 ],
        "city" : "Linköping",
        "postcode" : "58750",
        "municipality" : "Linköping",
        "region_concept_id" : "oLT3_Q9p_3nn",
        "region" : "Östergötlands län",
        "country_code" : "199",
        "region_code" : "05",
        "municipality_concept_id" : "bm2x_1mr_Qhx",
        "country_concept_id" : "i46j_HmG_v64",
        "municipality_code" : "0580",
        "street_address" : "Garnisonsvägen 52",
        "country" : "Sverige"
      },
      "id" : "26406426",
      "experience_required" : true,
      "working_hours_type" : {
        "concept_id" : "947z_JGS_Uk2",
        "label" : "Deltid",
        "legacy_ams_taxonomy_id" : "2"
      },
      "access" : null,
      "timestamp" : 1660401115274,
      "must_have" : {
        "education_level" : [ ],
        "work_experiences" : [ {
          "concept_id" : "rGGf_KLs_To7",
          "weight" : 10,
          "label" : "Servitör/Servitris",
          "legacy_ams_taxonomy_id" : "5487"
        } ],
        "skills" : [ ],
        "education" : [ ],
        "languages" : [ {
          "concept_id" : "zSLA_vw2_FXN",
          "weight" : 10,
          "label" : "Svenska",
          "legacy_ams_taxonomy_id" : "502"
        } ]
      },
      "occupation_field" : {
        "concept_id" : "ScKy_FHB_7wT",
        "label" : "Hotell, restaurang, storhushåll",
        "legacy_ams_taxonomy_id" : "7"
      },
      "scope_of_work" : {
        "min" : 65,
        "max" : 75
      },
      "salary_type" : {
        "concept_id" : "oG8G_9cW_nRf",
        "label" : "Fast månads- vecko- eller timlön",
        "legacy_ams_taxonomy_id" : "1"
      },
      "removed" : false,
      "salary_description" : null,
      "access_to_own_car" : false,
      "publication_date" : "2022-08-13T16:31:55"
    },
    "name" : "Serveringspersonal",
    "user" : "hannes"
  },
  "sha1" : "454746901320a83ae61b4962314d1beae0b455ea",
  "annotations" : [ {
    "preferred-label" : "Serveringspersonal",
    "sentiment" : "MUST_HAVE",
    "type" : "keyword",
    "start-position" : 0,
    "end-position" : 18,
    "concept-id" : "VqRa_738_v98",
    "matched-string" : "serveringspersonal",
    "annotation-id" : 0
  }, {
    "preferred-label" : "Restaurang",
    "sentiment" : "NOT_RELEVANT",
    "type" : "keyword",
    "start-position" : 223,
    "end-position" : 235,
    "concept-id" : "o2Cg_3Ap_qvK",
    "matched-string" : "restaurangen",
    "annotation-id" : 2
  }, {
    "preferred-label" : "hantera stress",
    "sentiment" : "MUST_HAVE",
    "type" : "esco-skill",
    "start-position" : 403,
    "end-position" : 414,
    "concept-id" : "z5Zo_DVb_VEK",
    "matched-string" : "stresstålig",
    "annotation-id" : 3
  }, {
    "preferred-label" : "Svenska",
    "sentiment" : "MUST_HAVE",
    "type" : "language",
    "start-position" : 663,
    "end-position" : 670,
    "concept-id" : "zSLA_vw2_FXN",
    "matched-string" : "svenska",
    "annotation-id" : 1
  }, {
    "preferred-label" : "Deltid",
    "sentiment" : "MUST_HAVE",
    "type" : "worktime-extent",
    "start-position" : 693,
    "end-position" : 696,
    "concept-id" : "947z_JGS_Uk2",
    "matched-string" : "75%",
    "annotation-id" : 4
  }, {
    "preferred-label" : "Heltid",
    "sentiment" : "OFFERED",
    "type" : "worktime-extent",
    "start-position" : 716,
    "end-position" : 720,
    "concept-id" : "6YE1_gAC_R2G",
    "matched-string" : "100%",
    "annotation-id" : 5
  } ],
  "text" : "Serveringspersonal\n#jobbjustnu\nVi söker dig som gillar service och vill vara med i vårt härliga team.\nDu vill ge bästa service till våra gäster och tycker om att vara social. Du är inte rädd att hjälpa till med det mesta i restaurangen och kan arbeta dels luncher dels några kvällar samt vid stora bokningar.\nDu har gott ordningssinne och tycker om när det är snyggt och städat omkring dig.\nDu bör vara stresstålig och kunna ta initiativ för att lösa problem som ofta uppstår under arbetstid i denna bransch.\nMan bör också vara utåtriktad, trevlig, pratglad och tillmötesgående.\nDu bör ha fyllt 18 år för att vi har alkoholtillstånd. Du ska kunna tala och förstå svenska.\nTjänsten är på minst 75% med möjlighet till 100%\nÄr du den vi letar efter? Gillar du när tempot är högt? Är du den som alltid ger bäst service?\n#jobbjustnu"
}