{
  "meta" : {
    "jobad" : {
      "description" : {
        "requirements" : null,
        "needs" : null,
        "company_information" : null,
        "text_formatted" : "Inom Teleservice Installation och Service jobbar idag ca 10 tekniker som fibersvetsare, installation- och servicetekniker för både företag och privatpersoner inom främst fiber men även Adsl, kabel-tv och radiolänkar. Vi söker nu ytterligare kollegor till vårt härliga team.\n\nOm rollen\n\nI arbetet ingår att blåsa fiber mellan kund och kopplingspunkt, fibersvetsning, montering och driftsättning av aktiv utrustning. Det ingår även att hjälpa kunden att koppla in de tjänster kunden har beställt. I serviceuppdragen utför du arbete i våra siter och nät för att avhjälpa incidenter men även proaktivt säkerställa god driftsäkerhet och hög tillgänglighet. Inom installations och servicegruppen arbetar vi även med installation av fastighetsnät i flerfamiljshus samt företagsnätverk. Andra förekommande arbetsuppgifter är inmätning och verifiering av utförda installationer. Nätuppbyggnad för data, tv och telefoni ingår också i rollen.\n\nOm dig\n\nFör att passa i rollen har du troligen arbetat inom fiberinstallation och fibersvetsning eller annan form av installation och servicearbete tidigare. Har du arbetat inom elinstallation tidigare är det ett extra plus. Du arbetar självständigt och effektivt och gör alltid ditt allra bästa för att hjälpa kunden på ett professionellt sätt. Som person är du lösningsorienterad och ser mycket hellre möjligheter än problem. Du är inte rädd för att anta nya utmaningar och vill gärna lära dig nytt. För teamet är du en lagspelare som är generös med att dela med dig av din kompetens och ditt engagemang och ser till att ni har det riktigt kul tillsammans på jobbet.\n\nUtbildning/Erfarenhet\n\n- Minst gymnasial utbildning gärna inom el eller teknik\n- B-körkort\n- Goda datorkunskaper\n- Du behärskar svenska och engelska i såväl tal som skrift\n\n\nMeriterande men inte ett krav\n\n- Fibersvetsutbildning/erfarenhet\n- Nätverkskunskap (tcp/ip)\n- Mastklättringscertifikat\n- CANT-certifikat (Fiber/LAN)\n\nOm Teleservice\n\nTeleservice är ett expansivt it-företag som driver digitaliseringen framåt. Våra affärsområden - it, fiberutbyggnad och bredband implementerar dagligen ny modern teknik till privat- och företagskunder. Vi har tagit fram lösningar efter våra kunders behov sedan starten 1973. Alltid med fokus på ständig utveckling och exemplarisk service. Idag är vi över 150 grymma Teleservare med kontor i Sjöbo, Ystad och Malmö.\n\nVi erbjuder dig\n\n- En härlig arbetsplats med kompetenta, engagerade och supertrevliga kollegor\n- Ett nära och lyhört ledarskap\n- Goda utvecklingsmöjligheter i ett företag med en målsättning att växa och hela tiden bli bättre på det vi gör. Vi jobbar strukturerat och aktivt med mål- och individbaserad kompetensutveckling för alla roller. Vi vill att våra medarbetare hel tiden är med och växer med Teleservice\n- Ett attraktivt förmånspaket\n\n\nÄr du vår nya kollega?\n\nAnsök då redan idag, dock senast den 19 augusti. Vi tillämpar löpande urval och intervjuer och tjänsten kan komma att tillsättas innan sista ansökningsdatum. Har du frågor om tjänsten är du varmt välkommen att kontakta Mats Kleman mats.kleman@teleservice.net (from 1 aug)\n\nOmfattning 100%\n\nAnställningsform Tillsvidare\n\nPlacering: Sjöbo",
        "conditions" : "Heltid\r\nAnställningstid enligt överenskommelse",
        "text" : "Inom Teleservice Installation och Service jobbar idag ca 10 tekniker som fibersvetsare, installation- och servicetekniker för både företag och privatpersoner inom främst fiber men även Adsl, kabel-tv och radiolänkar. Vi söker nu ytterligare kollegor till vårt härliga team.\n\nOm rollen\n\nI arbetet ingår att blåsa fiber mellan kund och kopplingspunkt, fibersvetsning, montering och driftsättning av aktiv utrustning. Det ingår även att hjälpa kunden att koppla in de tjänster kunden har beställt. I serviceuppdragen utför du arbete i våra siter och nät för att avhjälpa incidenter men även proaktivt säkerställa god driftsäkerhet och hög tillgänglighet. Inom installations och servicegruppen arbetar vi även med installation av fastighetsnät i flerfamiljshus samt företagsnätverk. Andra förekommande arbetsuppgifter är inmätning och verifiering av utförda installationer. Nätuppbyggnad för data, tv och telefoni ingår också i rollen.\n\nOm dig\n\nFör att passa i rollen har du troligen arbetat inom fiberinstallation och fibersvetsning eller annan form av installation och servicearbete tidigare. Har du arbetat inom elinstallation tidigare är det ett extra plus. Du arbetar självständigt och effektivt och gör alltid ditt allra bästa för att hjälpa kunden på ett professionellt sätt. Som person är du lösningsorienterad och ser mycket hellre möjligheter än problem. Du är inte rädd för att anta nya utmaningar och vill gärna lära dig nytt. För teamet är du en lagspelare som är generös med att dela med dig av din kompetens och ditt engagemang och ser till att ni har det riktigt kul tillsammans på jobbet.\n\nUtbildning/Erfarenhet\n\n- Minst gymnasial utbildning gärna inom el eller teknik\n- B-körkort\n- Goda datorkunskaper\n- Du behärskar svenska och engelska i såväl tal som skrift\n\n\nMeriterande men inte ett krav\n\n- Fibersvetsutbildning/erfarenhet\n- Nätverkskunskap (tcp/ip)\n- Mastklättringscertifikat\n- CANT-certifikat (Fiber/LAN)\n\nOm Teleservice\n\nTeleservice är ett expansivt it-företag som driver digitaliseringen framåt. Våra affärsområden - it, fiberutbyggnad och bredband implementerar dagligen ny modern teknik till privat- och företagskunder. Vi har tagit fram lösningar efter våra kunders behov sedan starten 1973. Alltid med fokus på ständig utveckling och exemplarisk service. Idag är vi över 150 grymma Teleservare med kontor i Sjöbo, Ystad och Malmö.\n\nVi erbjuder dig\n\n- En härlig arbetsplats med kompetenta, engagerade och supertrevliga kollegor\n- Ett nära och lyhört ledarskap\n- Goda utvecklingsmöjligheter i ett företag med en målsättning att växa och hela tiden bli bättre på det vi gör. Vi jobbar strukturerat och aktivt med mål- och individbaserad kompetensutveckling för alla roller. Vi vill att våra medarbetare hel tiden är med och växer med Teleservice\n- Ett attraktivt förmånspaket\n\n\nÄr du vår nya kollega?\n\nAnsök då redan idag, dock senast den 19 augusti. Vi tillämpar löpande urval och intervjuer och tjänsten kan komma att tillsättas innan sista ansökningsdatum. Har du frågor om tjänsten är du varmt välkommen att kontakta Mats Kleman mats.kleman@teleservice.net (from 1 aug)\n\nOmfattning 100%\n\nAnställningsform Tillsvidare\n\nPlacering: Sjöbo"
      },
      "headline" : "Installations- och Servicetekniker",
      "driving_license" : null,
      "employer" : {
        "email" : null,
        "phone_number" : null,
        "organization_number" : "5561821785",
        "name" : "Teleservice Skåne AB",
        "url" : null,
        "workplace" : "Teleservice Skåne"
      },
      "removed_date" : null,
      "logo_url" : "https://www.arbetsformedlingen.se/rest/arbetsgivare/rest/af/v3/organisation/5561821785/logotyper/logo.png",
      "last_publication_date" : "2022-08-19T23:59:59",
      "number_of_vacancies" : 1,
      "occupation" : {
        "concept_id" : "K3iK_iEb_41Y",
        "label" : "Serviceelektriker, installation",
        "legacy_ams_taxonomy_id" : "4781"
      },
      "occupation_group" : {
        "concept_id" : "yyF7_jsW_EeP",
        "label" : "Installations- och serviceelektriker",
        "legacy_ams_taxonomy_id" : "7411"
      },
      "employment_type" : {
        "concept_id" : "PFZr_Syz_cUq",
        "label" : "Vanlig anställning",
        "legacy_ams_taxonomy_id" : "1"
      },
      "webpage_url" : "https://arbetsformedlingen.se/platsbanken/annonser/26355649",
      "driving_license_required" : false,
      "application_contacts" : [ {
        "description" : "Mats Kleman",
        "email" : null,
        "telephone" : null,
        "name" : null,
        "contact_type" : null
      } ],
      "duration" : {
        "concept_id" : "a7uU_j21_mkL",
        "label" : "Tills vidare",
        "legacy_ams_taxonomy_id" : "1"
      },
      "nice_to_have" : {
        "education_level" : [ ],
        "work_experiences" : [ ],
        "skills" : [ ],
        "education" : [ ],
        "languages" : [ ]
      },
      "application_details" : {
        "via_af" : false,
        "email" : null,
        "other" : null,
        "reference" : null,
        "url" : "https://jobb.teleservice.net/jobs/1940044-installations-och-servicetekniker?promotion=454187-arbetsformedlingen",
        "information" : null
      },
      "source_type" : "VIA_PLATSBANKEN_DXA",
      "application_deadline" : "2022-08-19T23:59:59",
      "external_id" : "46-556182-1785-1940044-1",
      "workplace_address" : {
        "coordinates" : [ 13.70337, 55.634823 ],
        "city" : null,
        "postcode" : null,
        "municipality" : "Sjöbo",
        "region_concept_id" : "CaRE_1nn_cSU",
        "region" : "Skåne län",
        "country_code" : "199",
        "region_code" : "12",
        "municipality_concept_id" : "P3Cs_1ZP_9XB",
        "country_concept_id" : "i46j_HmG_v64",
        "municipality_code" : "1265",
        "street_address" : null,
        "country" : "Sverige"
      },
      "id" : "26355649",
      "experience_required" : true,
      "working_hours_type" : {
        "concept_id" : "6YE1_gAC_R2G",
        "label" : "Heltid",
        "legacy_ams_taxonomy_id" : "1"
      },
      "access" : null,
      "timestamp" : 1658846643648,
      "must_have" : {
        "education_level" : [ ],
        "work_experiences" : [ {
          "concept_id" : "K3iK_iEb_41Y",
          "weight" : 10,
          "label" : "Serviceelektriker, installation",
          "legacy_ams_taxonomy_id" : "4781"
        } ],
        "skills" : [ ],
        "education" : [ ],
        "languages" : [ ]
      },
      "occupation_field" : {
        "concept_id" : "yhCP_AqT_tns",
        "label" : "Installation, drift, underhåll",
        "legacy_ams_taxonomy_id" : "10"
      },
      "scope_of_work" : {
        "min" : 100,
        "max" : 100
      },
      "salary_type" : {
        "concept_id" : "oG8G_9cW_nRf",
        "label" : "Fast månads- vecko- eller timlön",
        "legacy_ams_taxonomy_id" : "1"
      },
      "removed" : false,
      "salary_description" : "Lön enligt överenskommelse",
      "access_to_own_car" : false,
      "publication_date" : "2022-07-26T16:44:03"
    },
    "name" : "Installations- och Servicetekniker",
    "user" : "kristof.fischer"
  },
  "sha1" : "2f40ea08e87b32b874c6a7f928ad2af3703e3b3e",
  "annotations" : [ {
    "preferred-label" : "Servicetekniker, data",
    "type" : "occupation-name",
    "start-position" : 0,
    "end-position" : 34,
    "concept-id" : "F1De_SS2_Qgt",
    "matched-string" : "Installations- och Servicetekniker",
    "annotation-id" : 12
  }, {
    "preferred-label" : "Fibertekniker/Optotekniker",
    "type" : "occupation-name",
    "start-position" : 108,
    "end-position" : 121,
    "concept-id" : "r6AA_UrV_qw3",
    "matched-string" : "fibersvetsare",
    "annotation-id" : 13
  }, {
    "preferred-label" : "Servicetekniker, data",
    "type" : "occupation-name",
    "start-position" : 123,
    "end-position" : 156,
    "concept-id" : "F1De_SS2_Qgt",
    "matched-string" : "installation- och servicetekniker",
    "annotation-id" : 14
  }, {
    "preferred-label" : null,
    "sentiment" : "MUST_HAVE",
    "type" : "skill",
    "start-position" : 1028,
    "end-position" : 1045,
    "concept-id" : null,
    "matched-string" : "fiberinstallation",
    "annotation-id" : 17
  }, {
    "preferred-label" : "Fibersvetsning",
    "sentiment" : "MUST_HAVE",
    "type" : "skill",
    "start-position" : 1050,
    "end-position" : 1064,
    "concept-id" : "qyxC_Z7Z_dXH",
    "matched-string" : "fibersvetsning",
    "annotation-id" : 3
  }, {
    "preferred-label" : null,
    "sentiment" : "NICE_TO_HAVE",
    "type" : "skill",
    "start-position" : 1146,
    "end-position" : 1160,
    "concept-id" : null,
    "matched-string" : "elinstallation",
    "annotation-id" : 18
  }, {
    "preferred-label" : "arbeta självständigt",
    "sentiment" : "MUST_HAVE",
    "type" : "esco-skill",
    "start-position" : 1204,
    "end-position" : 1217,
    "concept-id" : "NyFu_HHd_zhz",
    "matched-string" : "självständigt",
    "annotation-id" : 19
  }, {
    "preferred-label" : "hitta lösningar på problem",
    "sentiment" : "MUST_HAVE",
    "type" : "esco-skill",
    "start-position" : 1331,
    "end-position" : 1349,
    "concept-id" : "WFSY_Bwt_QWE",
    "matched-string" : "lösningsorienterad",
    "annotation-id" : 20
  }, {
    "preferred-label" : "Gymnasial utbildning",
    "sentiment" : "MUST_HAVE",
    "type" : "sun-education-level-1",
    "start-position" : 1669,
    "end-position" : 1689,
    "concept-id" : "wyLL_K3a_HRC",
    "matched-string" : "gymnasial utbildning",
    "annotation-id" : 4
  }, {
    "preferred-label" : "B",
    "sentiment" : "MUST_HAVE",
    "type" : "driving-licence",
    "start-position" : 1719,
    "end-position" : 1728,
    "concept-id" : "VTK8_WRx_GcM",
    "matched-string" : "B-körkort",
    "annotation-id" : 15
  }, {
    "preferred-label" : "använda dator",
    "sentiment" : "MUST_HAVE",
    "type" : "esco-skill",
    "start-position" : 1731,
    "end-position" : 1750,
    "concept-id" : "HEbR_xrb_MpT",
    "matched-string" : "Goda datorkunskaper",
    "annotation-id" : 16
  }, {
    "preferred-label" : "Svenska",
    "sentiment" : "MUST_HAVE",
    "type" : "language",
    "start-position" : 1766,
    "end-position" : 1773,
    "concept-id" : "zSLA_vw2_FXN",
    "matched-string" : "svenska",
    "annotation-id" : 5
  }, {
    "preferred-label" : "Engelska",
    "sentiment" : "MUST_HAVE",
    "type" : "language",
    "start-position" : 1778,
    "end-position" : 1786,
    "concept-id" : "NVxJ_hLg_TYS",
    "matched-string" : "engelska",
    "annotation-id" : 6
  }, {
    "preferred-label" : null,
    "sentiment" : "NICE_TO_HAVE",
    "type" : "sni-level-4",
    "start-position" : 1845,
    "end-position" : 1865,
    "concept-id" : null,
    "matched-string" : "Fibersvetsutbildning",
    "annotation-id" : 21
  }, {
    "preferred-label" : "TCP/IP, kommunikationsprotokoll",
    "sentiment" : "MUST_HAVE",
    "type" : "skill",
    "start-position" : 1896,
    "end-position" : 1902,
    "concept-id" : "HQJ2_68A_AiZ",
    "matched-string" : "tcp/ip",
    "annotation-id" : 7
  }, {
    "preferred-label" : "Certifikat/licenser",
    "sentiment" : "NICE_TO_HAVE",
    "type" : "skill-headline",
    "start-position" : 1906,
    "end-position" : 1930,
    "concept-id" : "s48H_Sft_DTn",
    "matched-string" : "Mastklättringscertifikat",
    "annotation-id" : 22
  }, {
    "preferred-label" : "CANT-Auktorisation (auktorisation för kabel-TV)",
    "sentiment" : "NICE_TO_HAVE",
    "type" : "skill",
    "start-position" : 1933,
    "end-position" : 1960,
    "concept-id" : "hm7J_rXU_c1Z",
    "matched-string" : "CANT-certifikat (Fiber/LAN)",
    "annotation-id" : 23
  }, {
    "preferred-label" : "Tillsvidareanställning (inkl. eventuell provanställning)",
    "type" : "employment-type",
    "start-position" : 3168,
    "end-position" : 3179,
    "concept-id" : "kpPX_CNN_gDU",
    "matched-string" : "Tillsvidare",
    "annotation-id" : 24
  } ],
  "text" : "Installations- och Servicetekniker\nInom Teleservice Installation och Service jobbar idag ca 10 tekniker som fibersvetsare, installation- och servicetekniker för både företag och privatpersoner inom främst fiber men även Adsl, kabel-tv och radiolänkar. Vi söker nu ytterligare kollegor till vårt härliga team.\n\nOm rollen\n\nI arbetet ingår att blåsa fiber mellan kund och kopplingspunkt, fibersvetsning, montering och driftsättning av aktiv utrustning. Det ingår även att hjälpa kunden att koppla in de tjänster kunden har beställt. I serviceuppdragen utför du arbete i våra siter och nät för att avhjälpa incidenter men även proaktivt säkerställa god driftsäkerhet och hög tillgänglighet. Inom installations och servicegruppen arbetar vi även med installation av fastighetsnät i flerfamiljshus samt företagsnätverk. Andra förekommande arbetsuppgifter är inmätning och verifiering av utförda installationer. Nätuppbyggnad för data, tv och telefoni ingår också i rollen.\n\nOm dig\n\nFör att passa i rollen har du troligen arbetat inom fiberinstallation och fibersvetsning eller annan form av installation och servicearbete tidigare. Har du arbetat inom elinstallation tidigare är det ett extra plus. Du arbetar självständigt och effektivt och gör alltid ditt allra bästa för att hjälpa kunden på ett professionellt sätt. Som person är du lösningsorienterad och ser mycket hellre möjligheter än problem. Du är inte rädd för att anta nya utmaningar och vill gärna lära dig nytt. För teamet är du en lagspelare som är generös med att dela med dig av din kompetens och ditt engagemang och ser till att ni har det riktigt kul tillsammans på jobbet.\n\nUtbildning/Erfarenhet\n\n- Minst gymnasial utbildning gärna inom el eller teknik\n- B-körkort\n- Goda datorkunskaper\n- Du behärskar svenska och engelska i såväl tal som skrift\n\n\nMeriterande men inte ett krav\n\n- Fibersvetsutbildning/erfarenhet\n- Nätverkskunskap (tcp/ip)\n- Mastklättringscertifikat\n- CANT-certifikat (Fiber/LAN)\n\nOm Teleservice\n\nTeleservice är ett expansivt it-företag som driver digitaliseringen framåt. Våra affärsområden - it, fiberutbyggnad och bredband implementerar dagligen ny modern teknik till privat- och företagskunder. Vi har tagit fram lösningar efter våra kunders behov sedan starten 1973. Alltid med fokus på ständig utveckling och exemplarisk service. Idag är vi över 150 grymma Teleservare med kontor i Sjöbo, Ystad och Malmö.\n\nVi erbjuder dig\n\n- En härlig arbetsplats med kompetenta, engagerade och supertrevliga kollegor\n- Ett nära och lyhört ledarskap\n- Goda utvecklingsmöjligheter i ett företag med en målsättning att växa och hela tiden bli bättre på det vi gör. Vi jobbar strukturerat och aktivt med mål- och individbaserad kompetensutveckling för alla roller. Vi vill att våra medarbetare hel tiden är med och växer med Teleservice\n- Ett attraktivt förmånspaket\n\n\nÄr du vår nya kollega?\n\nAnsök då redan idag, dock senast den 19 augusti. Vi tillämpar löpande urval och intervjuer och tjänsten kan komma att tillsättas innan sista ansökningsdatum. Har du frågor om tjänsten är du varmt välkommen att kontakta Mats Kleman mats.kleman@teleservice.net (from 1 aug)\n\nOmfattning 100%\n\nAnställningsform Tillsvidare\n\nPlacering: Sjöbo"
}