{
  "meta" : {
    "jobad" : {
      "description" : {
        "requirements" : null,
        "needs" : null,
        "company_information" : null,
        "text_formatted" : "MAX är Sveriges äldsta burgarkedja och den enda rikstäckande burgarkedjan som bara använder svenskt kött, kyckling och bacon. Vi vill bli världens bästa burgarkedja och vägen dit är att göra världen lite godare, både genom att servera de godaste burgarna och genom att vara en god kraft i samhället. Vi har över 150 restauranger och sysselsätter cirka 5500 medarbetare.\n\n\n\r\n\r\nÄr du sugen på en karriär inom snabbmatsbranschen eller ett extra jobb vid sidan av studierna? Oavsett vilket mål du har för framtiden så tror vi du kan gilla att jobba hos oss!  \n\nMax utgångspunkt är alla människors lika värde.\r\n\r\nFör oss betyder det lika möjligheter, rättigheter och skyldigheter oavsett vem du är. Det är dina egna ambitioner och resultat som avgör hur långt du kan gå. Vi hjälper dig på vägen med en tydlig plan, interna utbildningar och goda utvecklingsmöjligheter på Sveriges godaste burgarkedja.\n\n \n\nSom restaurangbiträde serverar du gäster, jobbar i köket, kassan och håller rent i restaurangen. Tillsammans med dina kollegor ser du till att vi alltid serverar gästerna Sveriges godaste burgare. Arbetet innebär varierande arbetstider på dagar, kvällar, nätter och helger. Under handledning av restaurangchefen eller en erfaren kollega lär du dig jobbet steg för steg på de olika stationerna samt genom våra digitala utbildningar. Nästan alla våra chefer har börjat precis här.\n\n \n\nVem är du?\n\nFör att trivas hos oss behöver du vara serviceinriktad och gilla ett högt arbetstempo. Du tycker om att jobba i team och presterar bäst som en del av en grupp. Kvalitet är det allra viktigaste för oss och därför tror vi att du är noggrann men samtidigt effektiv.\n\n \n\nVad erbjuder vi?\n\nEtt fartfyllt jobb i ett sammansvetsat team med väldigt goda möjligheter att växa och utvecklas. Lön och villkor enligt kollektivavtal samt friskvårdsbidrag.\n\n \n\nVi tittar på ansökningarna löpande och jobbet kan tillsättas innan sista ansökningsdag. Välkommen med din ansökan!\n\nVill du läsa om hur vi hanterar dina personuppgifter? Gå in på www.max.se/dataskydd",
        "conditions" : "4h/v\r\nProvanställning t.o.m. ",
        "text" : "MAX är Sveriges äldsta burgarkedja och den enda rikstäckande burgarkedjan som bara använder svenskt kött, kyckling och bacon. Vi vill bli världens bästa burgarkedja och vägen dit är att göra världen lite godare, både genom att servera de godaste burgarna och genom att vara en god kraft i samhället. Vi har över 150 restauranger och sysselsätter cirka 5500 medarbetare.\n\n\n\r\n\r\nÄr du sugen på en karriär inom snabbmatsbranschen eller ett extra jobb vid sidan av studierna? Oavsett vilket mål du har för framtiden så tror vi du kan gilla att jobba hos oss!  \n\nMax utgångspunkt är alla människors lika värde.\r\n\r\nFör oss betyder det lika möjligheter, rättigheter och skyldigheter oavsett vem du är. Det är dina egna ambitioner och resultat som avgör hur långt du kan gå. Vi hjälper dig på vägen med en tydlig plan, interna utbildningar och goda utvecklingsmöjligheter på Sveriges godaste burgarkedja.\n\n \n\nSom restaurangbiträde serverar du gäster, jobbar i köket, kassan och håller rent i restaurangen. Tillsammans med dina kollegor ser du till att vi alltid serverar gästerna Sveriges godaste burgare. Arbetet innebär varierande arbetstider på dagar, kvällar, nätter och helger. Under handledning av restaurangchefen eller en erfaren kollega lär du dig jobbet steg för steg på de olika stationerna samt genom våra digitala utbildningar. Nästan alla våra chefer har börjat precis här.\n\n \n\nVem är du?\n\nFör att trivas hos oss behöver du vara serviceinriktad och gilla ett högt arbetstempo. Du tycker om att jobba i team och presterar bäst som en del av en grupp. Kvalitet är det allra viktigaste för oss och därför tror vi att du är noggrann men samtidigt effektiv.\n\n \n\nVad erbjuder vi?\n\nEtt fartfyllt jobb i ett sammansvetsat team med väldigt goda möjligheter att växa och utvecklas. Lön och villkor enligt kollektivavtal samt friskvårdsbidrag.\n\n \n\nVi tittar på ansökningarna löpande och jobbet kan tillsättas innan sista ansökningsdag. Välkommen med din ansökan!\n\nVill du läsa om hur vi hanterar dina personuppgifter? Gå in på www.max.se/dataskydd"
      },
      "headline" : "Max Gnista söker medarbetare",
      "driving_license" : null,
      "employer" : {
        "email" : null,
        "phone_number" : null,
        "organization_number" : "5561887562",
        "name" : "Max Burgers AB",
        "url" : null,
        "workplace" : "MAX i Uppsala 5 - Gnista"
      },
      "removed_date" : null,
      "logo_url" : "https://www.arbetsformedlingen.se/rest/arbetsgivare/rest/af/v3/organisation/5561887562/logotyper/logo.png",
      "last_publication_date" : "2022-08-14T23:59:59",
      "number_of_vacancies" : 3,
      "occupation" : {
        "concept_id" : "yXRQ_Ad9_E8V",
        "label" : "Restaurangbiträde",
        "legacy_ams_taxonomy_id" : "5555"
      },
      "occupation_group" : {
        "concept_id" : "tPox_ie4_X9X",
        "label" : "Restaurang- och köksbiträden m.fl.",
        "legacy_ams_taxonomy_id" : "9412"
      },
      "employment_type" : {
        "concept_id" : "PFZr_Syz_cUq",
        "label" : "Vanlig anställning",
        "legacy_ams_taxonomy_id" : "1"
      },
      "webpage_url" : "https://arbetsformedlingen.se/platsbanken/annonser/26356482",
      "driving_license_required" : false,
      "application_contacts" : [ {
        "description" : "Alice Eiengård",
        "email" : null,
        "telephone" : "018142270",
        "name" : null,
        "contact_type" : null
      } ],
      "duration" : {
        "concept_id" : "qQUd_4qe_NDT",
        "label" : "6 månader eller längre",
        "legacy_ams_taxonomy_id" : "2"
      },
      "nice_to_have" : {
        "education_level" : [ ],
        "work_experiences" : [ ],
        "skills" : [ ],
        "education" : [ ],
        "languages" : [ ]
      },
      "application_details" : {
        "via_af" : false,
        "email" : null,
        "other" : null,
        "reference" : "2022/1117",
        "url" : "https://max.varbi.com/what:job/jobID:532045/type:job/where:1/apply:1",
        "information" : null
      },
      "source_type" : "VIA_PLATSBANKEN_DXA",
      "application_deadline" : "2022-08-14T23:59:59",
      "external_id" : "46-556188-7562-532045",
      "workplace_address" : {
        "coordinates" : [ 17.638927, 59.858562 ],
        "city" : null,
        "postcode" : null,
        "municipality" : "Uppsala",
        "region_concept_id" : "zBon_eET_fFU",
        "region" : "Uppsala län",
        "country_code" : "199",
        "region_code" : "03",
        "municipality_concept_id" : "otaF_bQY_4ZD",
        "country_concept_id" : "i46j_HmG_v64",
        "municipality_code" : "0380",
        "street_address" : null,
        "country" : "Sverige"
      },
      "id" : "26356482",
      "experience_required" : false,
      "working_hours_type" : {
        "concept_id" : "947z_JGS_Uk2",
        "label" : "Deltid",
        "legacy_ams_taxonomy_id" : "2"
      },
      "access" : null,
      "timestamp" : 1658906475058,
      "must_have" : {
        "education_level" : [ ],
        "work_experiences" : [ ],
        "skills" : [ ],
        "education" : [ ],
        "languages" : [ ]
      },
      "occupation_field" : {
        "concept_id" : "ScKy_FHB_7wT",
        "label" : "Hotell, restaurang, storhushåll",
        "legacy_ams_taxonomy_id" : "7"
      },
      "scope_of_work" : {
        "min" : 0,
        "max" : 100
      },
      "salary_type" : {
        "concept_id" : "oG8G_9cW_nRf",
        "label" : "Fast månads- vecko- eller timlön",
        "legacy_ams_taxonomy_id" : "1"
      },
      "removed" : false,
      "salary_description" : "Timlön",
      "access_to_own_car" : false,
      "publication_date" : "2022-07-27T09:21:15"
    },
    "name" : "Max Gnista söker medarbetare",
    "user" : "hannes"
  },
  "sha1" : "e55e68641ca84ef92c6a853e4b4e395aede08b07",
  "annotations" : [ {
    "preferred-label" : "Restaurangbiträde",
    "sentiment" : "MUST_HAVE",
    "type" : "occupation-name",
    "start-position" : 933,
    "end-position" : 950,
    "concept-id" : "yXRQ_Ad9_E8V",
    "matched-string" : "restaurangbiträde",
    "annotation-id" : 1
  }, {
    "preferred-label" : "noggrannhet",
    "type" : "esco-skill",
    "start-position" : 1654,
    "end-position" : 1662,
    "concept-id" : "mrsW_EkL_KRD",
    "matched-string" : "noggrann",
    "annotation-id" : 3
  }, {
    "preferred-label" : "Kollektivavtal",
    "sentiment" : "MUST_HAVE",
    "type" : "skill",
    "start-position" : 1829,
    "end-position" : 1843,
    "concept-id" : "z7wE_9xb_3jX",
    "matched-string" : "kollektivavtal",
    "annotation-id" : 2
  } ],
  "text" : "Max Gnista söker medarbetare\nMAX är Sveriges äldsta burgarkedja och den enda rikstäckande burgarkedjan som bara använder svenskt kött, kyckling och bacon. Vi vill bli världens bästa burgarkedja och vägen dit är att göra världen lite godare, både genom att servera de godaste burgarna och genom att vara en god kraft i samhället. Vi har över 150 restauranger och sysselsätter cirka 5500 medarbetare.\n\n\n\r\n\r\nÄr du sugen på en karriär inom snabbmatsbranschen eller ett extra jobb vid sidan av studierna? Oavsett vilket mål du har för framtiden så tror vi du kan gilla att jobba hos oss!  \n\nMax utgångspunkt är alla människors lika värde.\r\n\r\nFör oss betyder det lika möjligheter, rättigheter och skyldigheter oavsett vem du är. Det är dina egna ambitioner och resultat som avgör hur långt du kan gå. Vi hjälper dig på vägen med en tydlig plan, interna utbildningar och goda utvecklingsmöjligheter på Sveriges godaste burgarkedja.\n\n \n\nSom restaurangbiträde serverar du gäster, jobbar i köket, kassan och håller rent i restaurangen. Tillsammans med dina kollegor ser du till att vi alltid serverar gästerna Sveriges godaste burgare. Arbetet innebär varierande arbetstider på dagar, kvällar, nätter och helger. Under handledning av restaurangchefen eller en erfaren kollega lär du dig jobbet steg för steg på de olika stationerna samt genom våra digitala utbildningar. Nästan alla våra chefer har börjat precis här.\n\n \n\nVem är du?\n\nFör att trivas hos oss behöver du vara serviceinriktad och gilla ett högt arbetstempo. Du tycker om att jobba i team och presterar bäst som en del av en grupp. Kvalitet är det allra viktigaste för oss och därför tror vi att du är noggrann men samtidigt effektiv.\n\n \n\nVad erbjuder vi?\n\nEtt fartfyllt jobb i ett sammansvetsat team med väldigt goda möjligheter att växa och utvecklas. Lön och villkor enligt kollektivavtal samt friskvårdsbidrag.\n\n \n\nVi tittar på ansökningarna löpande och jobbet kan tillsättas innan sista ansökningsdag. Välkommen med din ansökan!\n\nVill du läsa om hur vi hanterar dina personuppgifter? Gå in på www.max.se/dataskydd"
}