{
  "meta" : {
    "jobad" : {
      "description" : {
        "requirements" : null,
        "needs" : null,
        "company_information" : null,
        "text_formatted" : "Språk: Engelska, Svenska\n\nUtbildning: Meriterande eller med gedigen arbetserfarenhet.\n\nVår uppdragsgivare söker nu flera kockar som är lika engagerade i deras gästers mat upplevelser som de själva är.\n\nAlpa Bemanning söker dig med känsla för värdskap och hög arbetsmoral.\n\nSom anställd är du inte bara anställd, du är en av oss!\n\nÖnskade kvalifikationer:\n- minst 5 års erfarenhet. Meriterande om du tidigare haft en ledande roll.\n- arbetat på flera ställen tidigare inom À la carte, lunch och bankett.\n- flexibel för varierande tider och pass.\n- genuin känsla för service och förstår vikten av att prestera på topp.\n- noggrann, ansvarsfull, med stort engagemang för människor och service.\n- talar flytande på såväl svenska som engelska.\n- ser service och hög kvalitet som förutsättningar för ett gott arbete.\n\n\nVi erbjuder en spännande och kreativ arbetsmiljö. I rollen som kock är det viktigt att du kan hantera flera arbetsuppgifter samtidigt under tidspress. Stor vikt läggs vid personlig lämplighet och samarbetsförmåga. Dina arbetsuppgifter som kock är sedvanliga arbetsuppgifter i ett kök. Du ska kunna ta egna initiativ och vara självgående och samarbeta bra tillsammans med kökschef och övriga kollegor.\n\nTjänsten är en tillsvidareanställning med tillträde omgående.\n\nProvanställning tillämpas under de första sex månaderna. Arbetstiden är 40 timmar. Lön enligt överenskommelse.",
        "conditions" : "Heltid\r\nAnställningstid enligt överenskommelse",
        "text" : "Språk: Engelska, Svenska\n\nUtbildning: Meriterande eller med gedigen arbetserfarenhet.\n\nVår uppdragsgivare söker nu flera kockar som är lika engagerade i deras gästers mat upplevelser som de själva är.\n\nAlpa Bemanning söker dig med känsla för värdskap och hög arbetsmoral.\n\nSom anställd är du inte bara anställd, du är en av oss!\n\nÖnskade kvalifikationer:\n- minst 5 års erfarenhet. Meriterande om du tidigare haft en ledande roll.\n- arbetat på flera ställen tidigare inom À la carte, lunch och bankett.\n- flexibel för varierande tider och pass.\n- genuin känsla för service och förstår vikten av att prestera på topp.\n- noggrann, ansvarsfull, med stort engagemang för människor och service.\n- talar flytande på såväl svenska som engelska.\n- ser service och hög kvalitet som förutsättningar för ett gott arbete.\n\n\nVi erbjuder en spännande och kreativ arbetsmiljö. I rollen som kock är det viktigt att du kan hantera flera arbetsuppgifter samtidigt under tidspress. Stor vikt läggs vid personlig lämplighet och samarbetsförmåga. Dina arbetsuppgifter som kock är sedvanliga arbetsuppgifter i ett kök. Du ska kunna ta egna initiativ och vara självgående och samarbeta bra tillsammans med kökschef och övriga kollegor.\n\nTjänsten är en tillsvidareanställning med tillträde omgående.\n\nProvanställning tillämpas under de första sex månaderna. Arbetstiden är 40 timmar. Lön enligt överenskommelse."
      },
      "headline" : "Á la carte Kock",
      "driving_license" : null,
      "employer" : {
        "email" : null,
        "phone_number" : null,
        "organization_number" : "5592070782",
        "name" : "ALPA bemanning & rekrytering AB",
        "url" : "http://www.alpabemanning.se",
        "workplace" : "ALPA Bemanning & Rekrytering "
      },
      "removed_date" : null,
      "logo_url" : "https://www.arbetsformedlingen.se/rest/arbetsgivare/rest/af/v3/organisation/5592070782/logotyper/logo.png",
      "last_publication_date" : "2023-01-11T23:59:59",
      "number_of_vacancies" : 1,
      "occupation" : {
        "concept_id" : "JbJw_as4_S93",
        "label" : "Kock, à la carte",
        "legacy_ams_taxonomy_id" : "7663"
      },
      "occupation_group" : {
        "concept_id" : "BStc_SJh_DKG",
        "label" : "Kockar och kallskänkor",
        "legacy_ams_taxonomy_id" : "5120"
      },
      "employment_type" : {
        "concept_id" : "PFZr_Syz_cUq",
        "label" : "Vanlig anställning",
        "legacy_ams_taxonomy_id" : "1"
      },
      "webpage_url" : "https://arbetsformedlingen.se/platsbanken/annonser/26350061",
      "driving_license_required" : false,
      "application_contacts" : [ {
        "description" : "Alex Parnian",
        "email" : null,
        "telephone" : null,
        "name" : null,
        "contact_type" : null
      } ],
      "duration" : {
        "concept_id" : "a7uU_j21_mkL",
        "label" : "Tills vidare",
        "legacy_ams_taxonomy_id" : "1"
      },
      "nice_to_have" : {
        "education_level" : [ ],
        "work_experiences" : [ ],
        "skills" : [ ],
        "education" : [ ],
        "languages" : [ ]
      },
      "application_details" : {
        "via_af" : false,
        "email" : null,
        "other" : null,
        "reference" : null,
        "url" : "https://jobb.alpabemanning.se/jobs/1892763-a-la-carte-kock?promotion=440441-arbetsformedlingen",
        "information" : null
      },
      "source_type" : "VIA_PLATSBANKEN_DXA",
      "application_deadline" : "2023-01-11T23:59:59",
      "external_id" : "46-559207-0782-1892763-40",
      "workplace_address" : {
        "coordinates" : [ 18.06858, 59.329323 ],
        "city" : null,
        "postcode" : null,
        "municipality" : "Stockholm",
        "region_concept_id" : "CifL_Rzy_Mku",
        "region" : "Stockholms län",
        "country_code" : "199",
        "region_code" : "01",
        "municipality_concept_id" : "AvNB_uwa_6n6",
        "country_concept_id" : "i46j_HmG_v64",
        "municipality_code" : "0180",
        "street_address" : null,
        "country" : "Sverige"
      },
      "id" : "26350061",
      "experience_required" : true,
      "working_hours_type" : {
        "concept_id" : "6YE1_gAC_R2G",
        "label" : "Heltid",
        "legacy_ams_taxonomy_id" : "1"
      },
      "access" : null,
      "timestamp" : 1658734476924,
      "must_have" : {
        "education_level" : [ ],
        "work_experiences" : [ {
          "concept_id" : "JbJw_as4_S93",
          "weight" : 10,
          "label" : "Kock, à la carte",
          "legacy_ams_taxonomy_id" : "7663"
        } ],
        "skills" : [ ],
        "education" : [ ],
        "languages" : [ ]
      },
      "occupation_field" : {
        "concept_id" : "ScKy_FHB_7wT",
        "label" : "Hotell, restaurang, storhushåll",
        "legacy_ams_taxonomy_id" : "7"
      },
      "scope_of_work" : {
        "min" : 100,
        "max" : 100
      },
      "salary_type" : {
        "concept_id" : "oG8G_9cW_nRf",
        "label" : "Fast månads- vecko- eller timlön",
        "legacy_ams_taxonomy_id" : "1"
      },
      "removed" : false,
      "salary_description" : "Lön enligt överenskommelse",
      "access_to_own_car" : false,
      "publication_date" : "2022-07-25T09:34:36"
    },
    "name" : "Á la carte Kock",
    "user" : "hannes"
  },
  "sha1" : "c36db2b71f52d979c526e373eb9c96efe2f28235",
  "annotations" : [ {
    "preferred-label" : "À la carte kock",
    "type" : "keyword",
    "start-position" : 0,
    "end-position" : 15,
    "concept-id" : "HDtc_qrc_esL",
    "matched-string" : "Á la carte Kock",
    "annotation-id" : 9
  }, {
    "preferred-label" : "Engelska",
    "sentiment" : "MUST_HAVE",
    "type" : "language",
    "start-position" : 23,
    "end-position" : 31,
    "concept-id" : "NVxJ_hLg_TYS",
    "matched-string" : "engelska",
    "annotation-id" : 1
  }, {
    "preferred-label" : "Svenska",
    "sentiment" : "MUST_HAVE",
    "type" : "language",
    "start-position" : 33,
    "end-position" : 40,
    "concept-id" : "zSLA_vw2_FXN",
    "matched-string" : "svenska",
    "annotation-id" : 2
  }, {
    "preferred-label" : "5 års erfarenhet eller mer",
    "type" : "occupation-experience-year",
    "start-position" : 373,
    "end-position" : 395,
    "concept-id" : "8CVf_zRX_aZj",
    "matched-string" : "minst 5 års erfarenhet",
    "annotation-id" : 10
  }, {
    "preferred-label" : "A la carte",
    "type" : "skill",
    "start-position" : 487,
    "end-position" : 497,
    "concept-id" : "Bb4Q_Vou_pbq",
    "matched-string" : "À la carte",
    "annotation-id" : 11
  }, {
    "preferred-label" : "noggrannhet",
    "type" : "esco-skill",
    "start-position" : 634,
    "end-position" : 642,
    "concept-id" : "mrsW_EkL_KRD",
    "matched-string" : "noggrann",
    "annotation-id" : 12
  }, {
    "preferred-label" : "Svenska",
    "sentiment" : "MUST_HAVE",
    "type" : "language",
    "start-position" : 731,
    "end-position" : 738,
    "concept-id" : "zSLA_vw2_FXN",
    "matched-string" : "svenska",
    "annotation-id" : 3
  }, {
    "preferred-label" : "Engelska",
    "sentiment" : "MUST_HAVE",
    "type" : "language",
    "start-position" : 743,
    "end-position" : 751,
    "concept-id" : "NVxJ_hLg_TYS",
    "matched-string" : "engelska",
    "annotation-id" : 4
  }, {
    "preferred-label" : "arbetsmiljö",
    "sentiment" : "MUST_HAVE",
    "type" : "esco-skill",
    "start-position" : 864,
    "end-position" : 875,
    "concept-id" : "zdQY_QJh_nUH",
    "matched-string" : "arbetsmiljö",
    "annotation-id" : 5
  }, {
    "preferred-label" : "kock",
    "sentiment" : "MUST_HAVE",
    "type" : "esco-occupation",
    "start-position" : 890,
    "end-position" : 894,
    "concept-id" : "Ti2H_QoQ_EMX",
    "matched-string" : "kock",
    "annotation-id" : 6
  }, {
    "preferred-label" : "kock",
    "sentiment" : "MUST_HAVE",
    "type" : "esco-occupation",
    "start-position" : 1066,
    "end-position" : 1070,
    "concept-id" : "Ti2H_QoQ_EMX",
    "matched-string" : "kock",
    "annotation-id" : 7
  }, {
    "preferred-label" : "Kökschef",
    "sentiment" : "MUST_HAVE",
    "type" : "occupation-name",
    "start-position" : 1198,
    "end-position" : 1206,
    "concept-id" : "kntm_Uen_7Bn",
    "matched-string" : "kökschef",
    "annotation-id" : 8
  }, {
    "preferred-label" : "Tillsvidareanställning (inkl. eventuell provanställning)",
    "type" : "employment-type",
    "start-position" : 1244,
    "end-position" : 1266,
    "concept-id" : "kpPX_CNN_gDU",
    "matched-string" : "tillsvidareanställning",
    "annotation-id" : 13
  }, {
    "preferred-label" : "Heltid",
    "type" : "worktime-extent",
    "start-position" : 1364,
    "end-position" : 1373,
    "concept-id" : "6YE1_gAC_R2G",
    "matched-string" : "40 timmar",
    "annotation-id" : 14
  } ],
  "text" : "Á la carte Kock\nSpråk: Engelska, Svenska\n\nUtbildning: Meriterande eller med gedigen arbetserfarenhet.\n\nVår uppdragsgivare söker nu flera kockar som är lika engagerade i deras gästers mat upplevelser som de själva är.\n\nAlpa Bemanning söker dig med känsla för värdskap och hög arbetsmoral.\n\nSom anställd är du inte bara anställd, du är en av oss!\n\nÖnskade kvalifikationer:\n- minst 5 års erfarenhet. Meriterande om du tidigare haft en ledande roll.\n- arbetat på flera ställen tidigare inom À la carte, lunch och bankett.\n- flexibel för varierande tider och pass.\n- genuin känsla för service och förstår vikten av att prestera på topp.\n- noggrann, ansvarsfull, med stort engagemang för människor och service.\n- talar flytande på såväl svenska som engelska.\n- ser service och hög kvalitet som förutsättningar för ett gott arbete.\n\n\nVi erbjuder en spännande och kreativ arbetsmiljö. I rollen som kock är det viktigt att du kan hantera flera arbetsuppgifter samtidigt under tidspress. Stor vikt läggs vid personlig lämplighet och samarbetsförmåga. Dina arbetsuppgifter som kock är sedvanliga arbetsuppgifter i ett kök. Du ska kunna ta egna initiativ och vara självgående och samarbeta bra tillsammans med kökschef och övriga kollegor.\n\nTjänsten är en tillsvidareanställning med tillträde omgående.\n\nProvanställning tillämpas under de första sex månaderna. Arbetstiden är 40 timmar. Lön enligt överenskommelse."
}