{
  "meta" : {
    "jobad" : {
      "description" : {
        "requirements" : null,
        "needs" : null,
        "company_information" : null,
        "text_formatted" : "<p>Vi på restaurang Thuy söker en servitris/servitör för omgående anställning.</p><p>Restaurang THUY är en vietnamesisk restaurang i centrala Lund.</p><p>Dina erfarenheter och personliga egenskaper som vi vill se hos dig som medarbetare är:</p><p>- Att vara bekant med serveringen är ett måste.</p><p>- En glad och positiv person som alltid ska kunna ge en bra service till kunderna.</p><p>- Öppen och lätt att samarbeta med.</p><p>- Är noggrann, ansvarsfull och uppmärksam i arbetet.</p><p><br></p><p>Arbetsuppgifter: Servering av maten till kunderna.</p><p>Arbetstider: Mån - Lör  kl. 11.30 - 14.30 samt 17 - 22. Arbetsbelastning ca 20-40%.</p><p>Vi förväntar oss att du som söker ska vara servicevan, ha bra kundbemötande och ska ha jobbat inom restaurangbranschen förut. Att kunna jobba självständigt är ett måste. Eftersom arbetsbelastningen inte är 100% så är det lämpligt att bo nära Lund.</p><p><br></p><p>Passar jobbet för dig? Mejla CV och personligt brev till: Bao99lu@gmail.com</p>",
        "conditions" : null,
        "text" : "Vi på restaurang Thuy söker en servitris/servitör för omgående anställning.\nRestaurang THUY är en vietnamesisk restaurang i centrala Lund.\nDina erfarenheter och personliga egenskaper som vi vill se hos dig som medarbetare är:\n- Att vara bekant med serveringen är ett måste.\n- En glad och positiv person som alltid ska kunna ge en bra service till kunderna.\n- Öppen och lätt att samarbeta med.\n- Är noggrann, ansvarsfull och uppmärksam i arbetet.\n\n\nArbetsuppgifter: Servering av maten till kunderna.\nArbetstider: Mån - Lör  kl. 11.30 - 14.30 samt 17 - 22. Arbetsbelastning ca 20-40%.\nVi förväntar oss att du som söker ska vara servicevan, ha bra kundbemötande och ska ha jobbat inom restaurangbranschen förut. Att kunna jobba självständigt är ett måste. Eftersom arbetsbelastningen inte är 100% så är det lämpligt att bo nära Lund.\n\n\nPassar jobbet för dig? Mejla CV och personligt brev till: Bao99lu@gmail.com"
      },
      "headline" : "Servitris/Servitör",
      "driving_license" : null,
      "employer" : {
        "email" : null,
        "phone_number" : null,
        "organization_number" : "5566883277",
        "name" : "Thuy NG AB",
        "url" : null,
        "workplace" : "Restaurang THUY"
      },
      "removed_date" : null,
      "logo_url" : null,
      "last_publication_date" : "2022-09-03T23:59:59",
      "number_of_vacancies" : 1,
      "occupation" : {
        "concept_id" : "rGGf_KLs_To7",
        "label" : "Servitör/Servitris",
        "legacy_ams_taxonomy_id" : "5487"
      },
      "occupation_group" : {
        "concept_id" : "UjoW_meY_Zwt",
        "label" : "Hovmästare och servitörer",
        "legacy_ams_taxonomy_id" : "5131"
      },
      "employment_type" : {
        "concept_id" : "PFZr_Syz_cUq",
        "label" : "Vanlig anställning",
        "legacy_ams_taxonomy_id" : "1"
      },
      "webpage_url" : "https://arbetsformedlingen.se/platsbanken/annonser/26379197",
      "driving_license_required" : false,
      "application_contacts" : [ {
        "description" : null,
        "email" : "bao99lu@gmail.com",
        "telephone" : null,
        "name" : "Bao Lu",
        "contact_type" : null
      } ],
      "duration" : {
        "concept_id" : "qQUd_4qe_NDT",
        "label" : "6 månader eller längre",
        "legacy_ams_taxonomy_id" : "2"
      },
      "nice_to_have" : {
        "education_level" : [ ],
        "work_experiences" : [ ],
        "skills" : [ ],
        "education" : [ ],
        "languages" : [ ]
      },
      "application_details" : {
        "via_af" : false,
        "email" : "bao99lu@gmail.com",
        "other" : null,
        "reference" : null,
        "url" : null,
        "information" : null
      },
      "source_type" : "VIA_ANNONSERA",
      "application_deadline" : "2022-09-03T23:59:59",
      "external_id" : null,
      "workplace_address" : {
        "coordinates" : [ 13.189946338497796, 55.704153067277964 ],
        "city" : "LUND",
        "postcode" : "22222",
        "municipality" : "Lund",
        "region_concept_id" : "CaRE_1nn_cSU",
        "region" : "Skåne län",
        "country_code" : "199",
        "region_code" : "12",
        "municipality_concept_id" : "muSY_tsR_vDZ",
        "country_concept_id" : "i46j_HmG_v64",
        "municipality_code" : "1281",
        "street_address" : "Klostergatan 12",
        "country" : "Sverige"
      },
      "id" : "26379197",
      "experience_required" : true,
      "working_hours_type" : {
        "concept_id" : "947z_JGS_Uk2",
        "label" : "Deltid",
        "legacy_ams_taxonomy_id" : "2"
      },
      "access" : null,
      "timestamp" : 1659648700268,
      "must_have" : {
        "education_level" : [ ],
        "work_experiences" : [ {
          "concept_id" : "rGGf_KLs_To7",
          "weight" : 10,
          "label" : "Servitör/Servitris",
          "legacy_ams_taxonomy_id" : "5487"
        } ],
        "skills" : [ ],
        "education" : [ ],
        "languages" : [ ]
      },
      "occupation_field" : {
        "concept_id" : "ScKy_FHB_7wT",
        "label" : "Hotell, restaurang, storhushåll",
        "legacy_ams_taxonomy_id" : "7"
      },
      "scope_of_work" : {
        "min" : 20,
        "max" : 40
      },
      "salary_type" : {
        "concept_id" : "oG8G_9cW_nRf",
        "label" : "Fast månads- vecko- eller timlön",
        "legacy_ams_taxonomy_id" : "1"
      },
      "removed" : false,
      "salary_description" : null,
      "access_to_own_car" : false,
      "publication_date" : "2022-08-04T23:31:40"
    },
    "name" : "Servitris/Servitör",
    "user" : "hannes"
  },
  "sha1" : "6233ca1df8d7e610b30d5103f8ec0b9ae9d865e7",
  "annotations" : [ {
    "preferred-label" : "Servitör/Servitris",
    "type" : "occupation-name",
    "start-position" : 0,
    "end-position" : 18,
    "concept-id" : "rGGf_KLs_To7",
    "matched-string" : "Servitris/Servitör",
    "annotation-id" : 8
  }, {
    "preferred-label" : "Restaurang",
    "sentiment" : "MUST_HAVE",
    "type" : "keyword",
    "start-position" : 25,
    "end-position" : 35,
    "concept-id" : "o2Cg_3Ap_qvK",
    "matched-string" : "restaurang",
    "annotation-id" : 2
  }, {
    "preferred-label" : "Servitör/Servitris",
    "type" : "occupation-name",
    "start-position" : 50,
    "end-position" : 68,
    "concept-id" : "rGGf_KLs_To7",
    "matched-string" : "servitris/servitör",
    "annotation-id" : 9
  }, {
    "preferred-label" : "Restaurang",
    "sentiment" : "MUST_HAVE",
    "type" : "keyword",
    "start-position" : 95,
    "end-position" : 105,
    "concept-id" : "o2Cg_3Ap_qvK",
    "matched-string" : "restaurang",
    "annotation-id" : 5
  }, {
    "preferred-label" : "Restaurang",
    "sentiment" : "MUST_HAVE",
    "type" : "keyword",
    "start-position" : 130,
    "end-position" : 140,
    "concept-id" : "o2Cg_3Ap_qvK",
    "matched-string" : "restaurang",
    "annotation-id" : 6
  }, {
    "preferred-label" : "Lund",
    "type" : "municipality",
    "start-position" : 152,
    "end-position" : 156,
    "concept-id" : "muSY_tsR_vDZ",
    "matched-string" : "Lund",
    "annotation-id" : 10
  }, {
    "preferred-label" : "noggrannhet",
    "type" : "esco-skill",
    "start-position" : 417,
    "end-position" : 425,
    "concept-id" : "mrsW_EkL_KRD",
    "matched-string" : "noggrann",
    "annotation-id" : 11
  }, {
    "preferred-label" : "visa ansvarstagande",
    "type" : "esco-skill",
    "start-position" : 427,
    "end-position" : 438,
    "concept-id" : "bcRp_hxV_f5G",
    "matched-string" : "ansvarsfull",
    "annotation-id" : 12
  }, {
    "preferred-label" : "Deltid",
    "type" : "worktime-extent",
    "start-position" : 594,
    "end-position" : 600,
    "concept-id" : "947z_JGS_Uk2",
    "matched-string" : "20-40%",
    "annotation-id" : 13
  }, {
    "preferred-label" : "Restaurang",
    "type" : "keyword",
    "start-position" : 701,
    "end-position" : 720,
    "concept-id" : "o2Cg_3Ap_qvK",
    "matched-string" : "restaurangbranschen",
    "annotation-id" : 14
  } ],
  "text" : "Servitris/Servitör\nVi på restaurang Thuy söker en servitris/servitör för omgående anställning.\nRestaurang THUY är en vietnamesisk restaurang i centrala Lund.\nDina erfarenheter och personliga egenskaper som vi vill se hos dig som medarbetare är:\n- Att vara bekant med serveringen är ett måste.\n- En glad och positiv person som alltid ska kunna ge en bra service till kunderna.\n- Öppen och lätt att samarbeta med.\n- Är noggrann, ansvarsfull och uppmärksam i arbetet.\n\n\nArbetsuppgifter: Servering av maten till kunderna.\nArbetstider: Mån - Lör  kl. 11.30 - 14.30 samt 17 - 22. Arbetsbelastning ca 20-40%.\nVi förväntar oss att du som söker ska vara servicevan, ha bra kundbemötande och ska ha jobbat inom restaurangbranschen förut. Att kunna jobba självständigt är ett måste. Eftersom arbetsbelastningen inte är 100% så är det lämpligt att bo nära Lund.\n\n\nPassar jobbet för dig? Mejla CV och personligt brev till: Bao99lu@gmail.com"
}