{
  "meta" : {
    "jobad" : {
      "description" : {
        "requirements" : null,
        "needs" : null,
        "company_information" : null,
        "text_formatted" : "Vi på Södra Älvsborgs sjukhus (SÄS) söker nu livsviktiga medarbetare till ett av de viktigaste uppdrag man kan ha - att hjälpa människor till en bättre hälsa. Här är vi över 3700 medarbetare som är verksamma inom 120 olika yrken och tillsammans arbetar mot en vård i toppklass. På SÄS är vi kända för att sätta utvecklingen i fokus. Nu tar vi nästa steg i utformningen av framtidens hälso- och sjukvård och letar efter nya medarbetare som vill göra skillnad på riktigt. Kan det vara du? Välkommen till SÄS! \n\n\n\nVill du veta mer om oss? Följ oss i sociala medier: https://www.facebook.com/sodraalvsborgssjukhusvgr, https://www.linkedin.com/company/s%C3%B6dra-%C3%A4lvsborgs-sjukhus/mycompany/, https://www.instagram.com/sodra_alvsborgs_sjukhus/?hl=sv\n\n\r\n\r\nVi söker dig som vill vara med och utveckla den specialistpsykiatriska vården på Södra Älvsborgs Sjukhus och vill ge dig goda förutsättningar för ett hållbart yrkesliv hos oss inom VO psykiatri!\n\nOm våra lediga tjänster\nDu kommer att få en introduktion som utgår från en av våra slutenvårdsavdelningar.\r\n\r\nDetta kommer att vara din basenhet och här kommer du tjänstgöra på heltid under dina första fyra månader. Efter det fortsätter du med auskultation på samarbetsenheter efter egna önskemål och verksamhetens behov varvat med arbete på din basenhet. Du kommer även få utvecklas inom ramen för kliniskt basår och vi kommer ha ett nära samarbete med utbildningsenheten och kunskapscentrum på SÄS.\nVår tanke är att ni anställs\" i par\" för att skapa bästa förutsättningar att möjliggöra auskultation och kompetensutveckling utanför den egna basenheten. Detta leder fram till ett mål i din individuella plan för det fortsatta arbetet inom verksamhetsområdet. Efter introduktionstiden på ca 18 månader har du hittat din plats där du fortsätter att utvecklas och bidrar till verksamhetsområdets utveckling.\n\nDet kommer att läggas stor vikt på din lämplighet och intresse. Du erbjuds kompetensutveckling i samklang med dina egna och verksamhetsområdets behov. Exempel på kompetensområden som du kommer erbjudas fördjupning i är psykiatrisk omvårdnad och behandling, vårdande samtal, bemötande/hot och våld-utbildning, teamarbete, omvärldskunskap och ett hållbart yrkesliv.\n\nOm oss inom VO psykiatri\nVi inom VO psykiatri brinner för psykiatri och jobbar ständigt med utveckling och dagligt förbättringsarbete i våra nya och anpassade lokaler i Psykiatrins kvarter. Vårt övergripande uppdrag är att försäkra vuxna och barn med allvarlig psykisk ohälsa tillgång till god specialiserad psykiatrisk vård, och vi har enheter för psykossjukdom, förstämningssyndrom, psykisk störning i kombination med missbruk och äldrepsykiatri med flera.\n\nDin profil\nVi söker dig som är sjuksköterska med intresse för psykiatri. Du kan vara antingen nyutexaminerad sjuksköterska men vi söker även dig som idag arbetar som sjuksköterska inom annat område men kanske är nyfiken på psykiatrin.\n\nMångfald och jämställdhet är två viktiga aspekter i urvalsprocessen. Vi värnar om allas trygghet och begär utdrag ur belastnings- och misstankeregistret på alla som erbjuds anställning hos oss.\n\nVälkommen med din ansökan! Bifoga yrkeslegitimation.\n\nOm Västra Götalandsregionen\nVästra Götalandsregionen finns till för människorna i Västra Götaland. Vi ser till att det finns god hälso- och sjukvård för alla. Vi arbetar för en hållbar utveckling och tillväxt, bra miljö, förbättrad folkhälsa, ett rikt kulturliv och goda kommunikationer i hela Västra Götaland.\nVästra Götalandsregionen arbetar aktivt för att digitalisera fler arbetssätt. För att vara en del av den digitala omvandlingen har du med dig grundläggande färdigheter och kan använda digitala verktyg och tjänster. Du kan söka information, kommunicera, interagera digitalt, är riskmedveten och har motivation att delta i utvecklingen för att lära nytt.\n\n\nVill du veta mer om Västra Götalandsregionen kan du besöka vår introduktion till nya medarbetare på länken https://www.vgregion.se/introduktion\n\n\nAnsökan\nVästra Götalandsregionen ser helst att du registrerar din ansökan via rekryteringssystemet. Om du som sökande har frågor om den utannonserade tjänsten eller av särskilda och speciella skäl inte kan registrera dina uppgifter i ett offentligt system - kontakta kontaktperson för respektive annons.\n\n\nTill bemannings-, förmedlings- och rekryteringsföretag och till dig som är försäljare:\nVi undanber oss vänligen men bestämt direktkontakt med bemannings-, förmedlings- och rekryteringsföretag samt andra externa aktörer och försäljare av ytterligare jobbannonser. Västra Götalandsregionen har upphandlade avtal.",
        "conditions" : "100%. Tillträde: Enligt överenskommelse\r\nTillsvidareanställning",
        "text" : "Vi på Södra Älvsborgs sjukhus (SÄS) söker nu livsviktiga medarbetare till ett av de viktigaste uppdrag man kan ha - att hjälpa människor till en bättre hälsa. Här är vi över 3700 medarbetare som är verksamma inom 120 olika yrken och tillsammans arbetar mot en vård i toppklass. På SÄS är vi kända för att sätta utvecklingen i fokus. Nu tar vi nästa steg i utformningen av framtidens hälso- och sjukvård och letar efter nya medarbetare som vill göra skillnad på riktigt. Kan det vara du? Välkommen till SÄS! \n\n\n\nVill du veta mer om oss? Följ oss i sociala medier: https://www.facebook.com/sodraalvsborgssjukhusvgr, https://www.linkedin.com/company/s%C3%B6dra-%C3%A4lvsborgs-sjukhus/mycompany/, https://www.instagram.com/sodra_alvsborgs_sjukhus/?hl=sv\n\n\r\n\r\nVi söker dig som vill vara med och utveckla den specialistpsykiatriska vården på Södra Älvsborgs Sjukhus och vill ge dig goda förutsättningar för ett hållbart yrkesliv hos oss inom VO psykiatri!\n\nOm våra lediga tjänster\nDu kommer att få en introduktion som utgår från en av våra slutenvårdsavdelningar.\r\n\r\nDetta kommer att vara din basenhet och här kommer du tjänstgöra på heltid under dina första fyra månader. Efter det fortsätter du med auskultation på samarbetsenheter efter egna önskemål och verksamhetens behov varvat med arbete på din basenhet. Du kommer även få utvecklas inom ramen för kliniskt basår och vi kommer ha ett nära samarbete med utbildningsenheten och kunskapscentrum på SÄS.\nVår tanke är att ni anställs\" i par\" för att skapa bästa förutsättningar att möjliggöra auskultation och kompetensutveckling utanför den egna basenheten. Detta leder fram till ett mål i din individuella plan för det fortsatta arbetet inom verksamhetsområdet. Efter introduktionstiden på ca 18 månader har du hittat din plats där du fortsätter att utvecklas och bidrar till verksamhetsområdets utveckling.\n\nDet kommer att läggas stor vikt på din lämplighet och intresse. Du erbjuds kompetensutveckling i samklang med dina egna och verksamhetsområdets behov. Exempel på kompetensområden som du kommer erbjudas fördjupning i är psykiatrisk omvårdnad och behandling, vårdande samtal, bemötande/hot och våld-utbildning, teamarbete, omvärldskunskap och ett hållbart yrkesliv.\n\nOm oss inom VO psykiatri\nVi inom VO psykiatri brinner för psykiatri och jobbar ständigt med utveckling och dagligt förbättringsarbete i våra nya och anpassade lokaler i Psykiatrins kvarter. Vårt övergripande uppdrag är att försäkra vuxna och barn med allvarlig psykisk ohälsa tillgång till god specialiserad psykiatrisk vård, och vi har enheter för psykossjukdom, förstämningssyndrom, psykisk störning i kombination med missbruk och äldrepsykiatri med flera.\n\nDin profil\nVi söker dig som är sjuksköterska med intresse för psykiatri. Du kan vara antingen nyutexaminerad sjuksköterska men vi söker även dig som idag arbetar som sjuksköterska inom annat område men kanske är nyfiken på psykiatrin.\n\nMångfald och jämställdhet är två viktiga aspekter i urvalsprocessen. Vi värnar om allas trygghet och begär utdrag ur belastnings- och misstankeregistret på alla som erbjuds anställning hos oss.\n\nVälkommen med din ansökan! Bifoga yrkeslegitimation.\n\nOm Västra Götalandsregionen\nVästra Götalandsregionen finns till för människorna i Västra Götaland. Vi ser till att det finns god hälso- och sjukvård för alla. Vi arbetar för en hållbar utveckling och tillväxt, bra miljö, förbättrad folkhälsa, ett rikt kulturliv och goda kommunikationer i hela Västra Götaland.\nVästra Götalandsregionen arbetar aktivt för att digitalisera fler arbetssätt. För att vara en del av den digitala omvandlingen har du med dig grundläggande färdigheter och kan använda digitala verktyg och tjänster. Du kan söka information, kommunicera, interagera digitalt, är riskmedveten och har motivation att delta i utvecklingen för att lära nytt.\n\n\nVill du veta mer om Västra Götalandsregionen kan du besöka vår introduktion till nya medarbetare på länken https://www.vgregion.se/introduktion\n\n\nAnsökan\nVästra Götalandsregionen ser helst att du registrerar din ansökan via rekryteringssystemet. Om du som sökande har frågor om den utannonserade tjänsten eller av särskilda och speciella skäl inte kan registrera dina uppgifter i ett offentligt system - kontakta kontaktperson för respektive annons.\n\n\nTill bemannings-, förmedlings- och rekryteringsföretag och till dig som är försäljare:\nVi undanber oss vänligen men bestämt direktkontakt med bemannings-, förmedlings- och rekryteringsföretag samt andra externa aktörer och försäljare av ytterligare jobbannonser. Västra Götalandsregionen har upphandlade avtal."
      },
      "headline" : "Introduktionstjänst för sjuksköterskor inom Verksamhetsområde psykiatri",
      "driving_license" : null,
      "employer" : {
        "email" : null,
        "phone_number" : null,
        "organization_number" : "2321000131",
        "name" : "VÄSTRA GÖTALANDSREGIONEN",
        "url" : null,
        "workplace" : "Södra Älvsborgs sjukhus, VO psykiatri "
      },
      "removed_date" : null,
      "logo_url" : "https://www.arbetsformedlingen.se/rest/arbetsgivare/rest/af/v3/organisation/2321000131/logotyper/logo.png",
      "last_publication_date" : "2022-07-18T23:59:59",
      "number_of_vacancies" : 8,
      "occupation" : {
        "concept_id" : "bXNH_MNX_dUR",
        "label" : "Sjuksköterska, grundutbildad",
        "legacy_ams_taxonomy_id" : "7296"
      },
      "occupation_group" : {
        "concept_id" : "Z8ci_bBE_tmx",
        "label" : "Grundutbildade sjuksköterskor",
        "legacy_ams_taxonomy_id" : "2221"
      },
      "employment_type" : {
        "concept_id" : "PFZr_Syz_cUq",
        "label" : "Vanlig anställning",
        "legacy_ams_taxonomy_id" : "1"
      },
      "webpage_url" : "https://arbetsformedlingen.se/platsbanken/annonser/26280171",
      "driving_license_required" : false,
      "application_contacts" : [ {
        "description" : "Monika Ekeberg, huvudhandledare VO psykiatri",
        "email" : null,
        "telephone" : "033-6163540",
        "name" : null,
        "contact_type" : null
      }, {
        "description" : "Karolina Andersson, vårdenhetschef",
        "email" : null,
        "telephone" : "033-6161470",
        "name" : null,
        "contact_type" : null
      } ],
      "duration" : {
        "concept_id" : "a7uU_j21_mkL",
        "label" : "Tills vidare",
        "legacy_ams_taxonomy_id" : "1"
      },
      "nice_to_have" : {
        "education_level" : [ ],
        "work_experiences" : [ ],
        "skills" : [ ],
        "education" : [ ],
        "languages" : [ ]
      },
      "application_details" : {
        "via_af" : false,
        "email" : null,
        "other" : null,
        "reference" : "2022/4794",
        "url" : "https://vgregion.varbi.com/what:job/jobID:517866/type:job/where:1/apply:1",
        "information" : null
      },
      "source_type" : "VIA_PLATSBANKEN_DXA",
      "application_deadline" : "2022-07-18T23:59:59",
      "external_id" : "46-232100-0131-517866-1",
      "workplace_address" : {
        "coordinates" : [ 12.939819, 57.721035 ],
        "city" : null,
        "postcode" : null,
        "municipality" : "Borås",
        "region_concept_id" : "zdoY_6u5_Krt",
        "region" : "Västra Götalands län",
        "country_code" : "199",
        "region_code" : "14",
        "municipality_concept_id" : "TpRZ_bFL_jhL",
        "country_concept_id" : "i46j_HmG_v64",
        "municipality_code" : "1490",
        "street_address" : null,
        "country" : "Sverige"
      },
      "id" : "26280171",
      "experience_required" : false,
      "working_hours_type" : {
        "concept_id" : "6YE1_gAC_R2G",
        "label" : "Heltid",
        "legacy_ams_taxonomy_id" : "1"
      },
      "access" : null,
      "timestamp" : 1656653098084,
      "must_have" : {
        "education_level" : [ ],
        "work_experiences" : [ ],
        "skills" : [ ],
        "education" : [ ],
        "languages" : [ ]
      },
      "occupation_field" : {
        "concept_id" : "NYW6_mP6_vwf",
        "label" : "Hälso- och sjukvård",
        "legacy_ams_taxonomy_id" : "8"
      },
      "scope_of_work" : {
        "min" : 100,
        "max" : 100
      },
      "salary_type" : {
        "concept_id" : "oG8G_9cW_nRf",
        "label" : "Fast månads- vecko- eller timlön",
        "legacy_ams_taxonomy_id" : "1"
      },
      "removed" : false,
      "salary_description" : "Månadslön",
      "access_to_own_car" : false,
      "publication_date" : "2022-07-01T07:24:58"
    },
    "name" : "Introduktionstjänst för sjuksköterskor inom Verksamhetsområde psykiatri",
    "user" : "hannes"
  },
  "sha1" : "857342dbe18d663f3ce22c53f8672de4a2c3d853",
  "annotations" : [ {
    "preferred-label" : "Sjuksköterskor",
    "sentiment" : "MUST_HAVE",
    "type" : "ssyk-level-3",
    "start-position" : 24,
    "end-position" : 38,
    "concept-id" : "jzaN_Vqk_TP1",
    "matched-string" : "sjuksköterskor",
    "annotation-id" : 0
  }, {
    "preferred-label" : "Psykiatri",
    "sentiment" : "MUST_HAVE",
    "type" : "skill",
    "start-position" : 62,
    "end-position" : 71,
    "concept-id" : "sXoR_gGY_ycN",
    "matched-string" : "psykiatri",
    "annotation-id" : 1
  }, {
    "preferred-label" : "Hälsa",
    "sentiment" : "MUST_HAVE",
    "type" : "keyword",
    "start-position" : 224,
    "end-position" : 229,
    "concept-id" : "Abys_5p1_Cnq",
    "matched-string" : "hälsa",
    "annotation-id" : 2
  }, {
    "preferred-label" : "Hälso- och sjukvård",
    "type" : "sni-level-2",
    "start-position" : 455,
    "end-position" : 474,
    "concept-id" : "KhNL_Quq_Xjk",
    "matched-string" : "hälso- och sjukvård",
    "annotation-id" : 22
  }, {
    "preferred-label" : "Psykiatri",
    "sentiment" : "MUST_HAVE",
    "type" : "skill",
    "start-position" : 1011,
    "end-position" : 1020,
    "concept-id" : "sXoR_gGY_ycN",
    "matched-string" : "psykiatri",
    "annotation-id" : 7
  }, {
    "preferred-label" : "Heltid",
    "type" : "worktime-extent",
    "start-position" : 1200,
    "end-position" : 1206,
    "concept-id" : "6YE1_gAC_R2G",
    "matched-string" : "heltid",
    "annotation-id" : 23
  }, {
    "preferred-label" : "Psykiatrisk vård",
    "type" : "skill",
    "start-position" : 2149,
    "end-position" : 2170,
    "concept-id" : "5JNC_VaM_zve",
    "matched-string" : "psykiatrisk omvårdnad",
    "annotation-id" : 24
  }, {
    "preferred-label" : "Psykiatri",
    "sentiment" : "MUST_HAVE",
    "type" : "skill",
    "start-position" : 2310,
    "end-position" : 2319,
    "concept-id" : "sXoR_gGY_ycN",
    "matched-string" : "psykiatri",
    "annotation-id" : 9
  }, {
    "preferred-label" : "Psykiatri",
    "sentiment" : "MUST_HAVE",
    "type" : "skill",
    "start-position" : 2331,
    "end-position" : 2340,
    "concept-id" : "sXoR_gGY_ycN",
    "matched-string" : "psykiatri",
    "annotation-id" : 10
  }, {
    "preferred-label" : "Psykiatri",
    "sentiment" : "MUST_HAVE",
    "type" : "skill",
    "start-position" : 2353,
    "end-position" : 2362,
    "concept-id" : "sXoR_gGY_ycN",
    "matched-string" : "psykiatri",
    "annotation-id" : 11
  }, {
    "preferred-label" : "Psykiatri",
    "type" : "skill",
    "start-position" : 2464,
    "end-position" : 2475,
    "concept-id" : "sXoR_gGY_ycN",
    "matched-string" : "Psykiatrins",
    "annotation-id" : 25
  }, {
    "preferred-label" : "Psykiatrisk vård",
    "sentiment" : "MUST_HAVE",
    "type" : "skill",
    "start-position" : 2603,
    "end-position" : 2619,
    "concept-id" : "5JNC_VaM_zve",
    "matched-string" : "psykiatrisk vård",
    "annotation-id" : 12
  }, {
    "preferred-label" : "Sjuksköterska",
    "sentiment" : "MUST_HAVE",
    "type" : "keyword",
    "start-position" : 2786,
    "end-position" : 2799,
    "concept-id" : "jrjV_wcz_fxg",
    "matched-string" : "sjuksköterska",
    "annotation-id" : 13
  }, {
    "preferred-label" : "Psykiatri",
    "sentiment" : "MUST_HAVE",
    "type" : "skill",
    "start-position" : 2817,
    "end-position" : 2826,
    "concept-id" : "sXoR_gGY_ycN",
    "matched-string" : "psykiatri",
    "annotation-id" : 14
  }, {
    "preferred-label" : "Sjuksköterska",
    "sentiment" : "MUST_HAVE",
    "type" : "keyword",
    "start-position" : 2864,
    "end-position" : 2877,
    "concept-id" : "jrjV_wcz_fxg",
    "matched-string" : "sjuksköterska",
    "annotation-id" : 15
  }, {
    "preferred-label" : "Sjuksköterska",
    "sentiment" : "MUST_HAVE",
    "type" : "keyword",
    "start-position" : 2921,
    "end-position" : 2934,
    "concept-id" : "jrjV_wcz_fxg",
    "matched-string" : "sjuksköterska",
    "annotation-id" : 16
  }, {
    "preferred-label" : "Psykiatri",
    "type" : "skill",
    "start-position" : 2978,
    "end-position" : 2988,
    "concept-id" : "sXoR_gGY_ycN",
    "matched-string" : "psykiatrin",
    "annotation-id" : 26
  }, {
    "preferred-label" : "Jämställdhet",
    "sentiment" : "MUST_HAVE",
    "type" : "keyword",
    "start-position" : 3004,
    "end-position" : 3016,
    "concept-id" : "WgGj_zNt_Pzz",
    "matched-string" : "jämställdhet",
    "annotation-id" : 17
  }, {
    "preferred-label" : "Västra Götalands län",
    "type" : "region",
    "start-position" : 3243,
    "end-position" : 3267,
    "concept-id" : "zdoY_6u5_Krt",
    "matched-string" : "Västra Götalandsregionen",
    "annotation-id" : 27
  }, {
    "preferred-label" : "Västra Götalands län",
    "type" : "region",
    "start-position" : 3268,
    "end-position" : 3292,
    "concept-id" : "zdoY_6u5_Krt",
    "matched-string" : "Västra Götalandsregionen",
    "annotation-id" : 28
  }, {
    "preferred-label" : "Västra Götalands län",
    "type" : "region",
    "start-position" : 3322,
    "end-position" : 3337,
    "concept-id" : "zdoY_6u5_Krt",
    "matched-string" : "Västra Götaland",
    "annotation-id" : 29
  }, {
    "preferred-label" : "Hälso- och sjukvård",
    "type" : "sun-education-field-2",
    "start-position" : 3369,
    "end-position" : 3388,
    "concept-id" : "xPJU_eQm_ehe",
    "matched-string" : "hälso- och sjukvård",
    "annotation-id" : 33
  }, {
    "preferred-label" : "Hållbar utveckling",
    "sentiment" : "MUST_HAVE",
    "type" : "keyword",
    "start-position" : 3417,
    "end-position" : 3435,
    "concept-id" : "RKw3_zWW_1pf",
    "matched-string" : "hållbar utveckling",
    "annotation-id" : 19
  }, {
    "preferred-label" : "folkhälsa",
    "sentiment" : "MUST_HAVE",
    "type" : "esco-skill",
    "start-position" : 3472,
    "end-position" : 3481,
    "concept-id" : "jEdA_1Fe_Jji",
    "matched-string" : "folkhälsa",
    "annotation-id" : 20
  }, {
    "preferred-label" : "Västra Götalands län",
    "type" : "region",
    "start-position" : 3534,
    "end-position" : 3549,
    "concept-id" : "zdoY_6u5_Krt",
    "matched-string" : "Västra Götaland",
    "annotation-id" : 34
  }, {
    "preferred-label" : "Västra Götalands län",
    "type" : "region",
    "start-position" : 3551,
    "end-position" : 3575,
    "concept-id" : "zdoY_6u5_Krt",
    "matched-string" : "Västra Götalandsregionen",
    "annotation-id" : 30
  }, {
    "preferred-label" : "Västra Götalands län",
    "type" : "region",
    "start-position" : 3926,
    "end-position" : 3950,
    "concept-id" : "zdoY_6u5_Krt",
    "matched-string" : "Västra Götalandsregionen",
    "annotation-id" : 31
  }, {
    "preferred-label" : "Västra Götalands län",
    "type" : "region",
    "start-position" : 4060,
    "end-position" : 4084,
    "concept-id" : "zdoY_6u5_Krt",
    "matched-string" : "Västra Götalandsregionen",
    "annotation-id" : 32
  }, {
    "preferred-label" : "Västra Götalands län",
    "type" : "region",
    "start-position" : 4621,
    "end-position" : 4645,
    "concept-id" : "zdoY_6u5_Krt",
    "matched-string" : "Västra Götalandsregionen",
    "annotation-id" : 35
  } ],
  "text" : "Introduktionstjänst för sjuksköterskor inom Verksamhetsområde psykiatri\nVi på Södra Älvsborgs sjukhus (SÄS) söker nu livsviktiga medarbetare till ett av de viktigaste uppdrag man kan ha - att hjälpa människor till en bättre hälsa. Här är vi över 3700 medarbetare som är verksamma inom 120 olika yrken och tillsammans arbetar mot en vård i toppklass. På SÄS är vi kända för att sätta utvecklingen i fokus. Nu tar vi nästa steg i utformningen av framtidens hälso- och sjukvård och letar efter nya medarbetare som vill göra skillnad på riktigt. Kan det vara du? Välkommen till SÄS! \n\n\n\nVill du veta mer om oss? Följ oss i sociala medier: https://www.facebook.com/sodraalvsborgssjukhusvgr, https://www.linkedin.com/company/s%C3%B6dra-%C3%A4lvsborgs-sjukhus/mycompany/, https://www.instagram.com/sodra_alvsborgs_sjukhus/?hl=sv\n\n\r\n\r\nVi söker dig som vill vara med och utveckla den specialistpsykiatriska vården på Södra Älvsborgs Sjukhus och vill ge dig goda förutsättningar för ett hållbart yrkesliv hos oss inom VO psykiatri!\n\nOm våra lediga tjänster\nDu kommer att få en introduktion som utgår från en av våra slutenvårdsavdelningar.\r\n\r\nDetta kommer att vara din basenhet och här kommer du tjänstgöra på heltid under dina första fyra månader. Efter det fortsätter du med auskultation på samarbetsenheter efter egna önskemål och verksamhetens behov varvat med arbete på din basenhet. Du kommer även få utvecklas inom ramen för kliniskt basår och vi kommer ha ett nära samarbete med utbildningsenheten och kunskapscentrum på SÄS.\nVår tanke är att ni anställs\" i par\" för att skapa bästa förutsättningar att möjliggöra auskultation och kompetensutveckling utanför den egna basenheten. Detta leder fram till ett mål i din individuella plan för det fortsatta arbetet inom verksamhetsområdet. Efter introduktionstiden på ca 18 månader har du hittat din plats där du fortsätter att utvecklas och bidrar till verksamhetsområdets utveckling.\n\nDet kommer att läggas stor vikt på din lämplighet och intresse. Du erbjuds kompetensutveckling i samklang med dina egna och verksamhetsområdets behov. Exempel på kompetensområden som du kommer erbjudas fördjupning i är psykiatrisk omvårdnad och behandling, vårdande samtal, bemötande/hot och våld-utbildning, teamarbete, omvärldskunskap och ett hållbart yrkesliv.\n\nOm oss inom VO psykiatri\nVi inom VO psykiatri brinner för psykiatri och jobbar ständigt med utveckling och dagligt förbättringsarbete i våra nya och anpassade lokaler i Psykiatrins kvarter. Vårt övergripande uppdrag är att försäkra vuxna och barn med allvarlig psykisk ohälsa tillgång till god specialiserad psykiatrisk vård, och vi har enheter för psykossjukdom, förstämningssyndrom, psykisk störning i kombination med missbruk och äldrepsykiatri med flera.\n\nDin profil\nVi söker dig som är sjuksköterska med intresse för psykiatri. Du kan vara antingen nyutexaminerad sjuksköterska men vi söker även dig som idag arbetar som sjuksköterska inom annat område men kanske är nyfiken på psykiatrin.\n\nMångfald och jämställdhet är två viktiga aspekter i urvalsprocessen. Vi värnar om allas trygghet och begär utdrag ur belastnings- och misstankeregistret på alla som erbjuds anställning hos oss.\n\nVälkommen med din ansökan! Bifoga yrkeslegitimation.\n\nOm Västra Götalandsregionen\nVästra Götalandsregionen finns till för människorna i Västra Götaland. Vi ser till att det finns god hälso- och sjukvård för alla. Vi arbetar för en hållbar utveckling och tillväxt, bra miljö, förbättrad folkhälsa, ett rikt kulturliv och goda kommunikationer i hela Västra Götaland.\nVästra Götalandsregionen arbetar aktivt för att digitalisera fler arbetssätt. För att vara en del av den digitala omvandlingen har du med dig grundläggande färdigheter och kan använda digitala verktyg och tjänster. Du kan söka information, kommunicera, interagera digitalt, är riskmedveten och har motivation att delta i utvecklingen för att lära nytt.\n\n\nVill du veta mer om Västra Götalandsregionen kan du besöka vår introduktion till nya medarbetare på länken https://www.vgregion.se/introduktion\n\n\nAnsökan\nVästra Götalandsregionen ser helst att du registrerar din ansökan via rekryteringssystemet. Om du som sökande har frågor om den utannonserade tjänsten eller av särskilda och speciella skäl inte kan registrera dina uppgifter i ett offentligt system - kontakta kontaktperson för respektive annons.\n\n\nTill bemannings-, förmedlings- och rekryteringsföretag och till dig som är försäljare:\nVi undanber oss vänligen men bestämt direktkontakt med bemannings-, förmedlings- och rekryteringsföretag samt andra externa aktörer och försäljare av ytterligare jobbannonser. Västra Götalandsregionen har upphandlade avtal."
}