{
  "meta" : {
    "jobad" : {
      "description" : {
        "requirements" : null,
        "needs" : null,
        "company_information" : null,
        "text_formatted" : "...till kund i Markaryd.\n \n\nVi söker dig med erfarenhet av praktiskt arbete och ”rätt” inställning, då vi lägger stor vikt vid dina personliga egenskaper. Du ska vara en bra lagspelare och god arbetskamrat. Det är meriterande om du har erfarenhet av montering eller liknande arbetsuppgifter. \n \nVi rekryterar löpande så tveka inte att lämna in din ansökan redan idag. Varmt välkommen med din ansökan!\n \nTjänsten inleds med en anställning hos TopWork med ett mål om att kandidaten senare ska övergå till en anställning hos kund. Som konsult hos TopWork får du en konsultchef som stöttar dig i ditt uppdrag hos kund. Vi ger dig råd och rekommendationer om hur du kan utvecklas i ditt arbete.\n\n\nTopWork är ett auktoriserat företag som arbetar med bemanning och rekrytering. Våra kunder finns inom branscher som industri, lager, logistik, bygg och administration. Vi är din trygga, professionella partner oavsett om du söker nya medarbetare eller nya utmaningar. TopWork - vi hittar rätt medarbetare till rätt arbetsgivare och arbetsplats.",
        "conditions" : "Heltid\r\nVisstid",
        "text" : "...till kund i Markaryd.\n \n\nVi söker dig med erfarenhet av praktiskt arbete och ”rätt” inställning, då vi lägger stor vikt vid dina personliga egenskaper. Du ska vara en bra lagspelare och god arbetskamrat. Det är meriterande om du har erfarenhet av montering eller liknande arbetsuppgifter. \n \nVi rekryterar löpande så tveka inte att lämna in din ansökan redan idag. Varmt välkommen med din ansökan!\n \nTjänsten inleds med en anställning hos TopWork med ett mål om att kandidaten senare ska övergå till en anställning hos kund. Som konsult hos TopWork får du en konsultchef som stöttar dig i ditt uppdrag hos kund. Vi ger dig råd och rekommendationer om hur du kan utvecklas i ditt arbete.\n\n\nTopWork är ett auktoriserat företag som arbetar med bemanning och rekrytering. Våra kunder finns inom branscher som industri, lager, logistik, bygg och administration. Vi är din trygga, professionella partner oavsett om du söker nya medarbetare eller nya utmaningar. TopWork - vi hittar rätt medarbetare till rätt arbetsgivare och arbetsplats."
      },
      "headline" : "TopWork söker montör...",
      "driving_license" : null,
      "employer" : {
        "email" : null,
        "phone_number" : null,
        "organization_number" : "5569026767",
        "name" : "TopWork Sverige AB",
        "url" : "http://www.topwork.se",
        "workplace" : "TopWork"
      },
      "removed_date" : null,
      "logo_url" : "https://www.arbetsformedlingen.se/rest/arbetsgivare/rest/af/v3/organisation/5569026767/logotyper/logo.png",
      "last_publication_date" : "2022-07-24T23:59:59",
      "number_of_vacancies" : 1,
      "occupation" : {
        "concept_id" : "rAjz_1xP_f1a",
        "label" : "Montör, metallprodukter",
        "legacy_ams_taxonomy_id" : "297"
      },
      "occupation_group" : {
        "concept_id" : "Kxm9_N3V_shF",
        "label" : "Montörer, metall-, gummi- och plastprodukter",
        "legacy_ams_taxonomy_id" : "8213"
      },
      "employment_type" : {
        "concept_id" : "PFZr_Syz_cUq",
        "label" : "Vanlig anställning",
        "legacy_ams_taxonomy_id" : "1"
      },
      "webpage_url" : "https://arbetsformedlingen.se/platsbanken/annonser/26307973",
      "driving_license_required" : false,
      "application_contacts" : [ {
        "description" : "Patrick Groves",
        "email" : null,
        "telephone" : "0702604822",
        "name" : null,
        "contact_type" : "Rekryterare"
      } ],
      "duration" : {
        "concept_id" : "Xj7x_7yZ_jEn",
        "label" : "3 månader – upp till 6 månader",
        "legacy_ams_taxonomy_id" : "3"
      },
      "nice_to_have" : {
        "education_level" : [ ],
        "work_experiences" : [ ],
        "skills" : [ ],
        "education" : [ ],
        "languages" : [ ]
      },
      "application_details" : {
        "via_af" : false,
        "email" : null,
        "other" : null,
        "reference" : null,
        "url" : "https://www.recruto.se/apps/ads/view/id/50028-topwork-care-markaryd-topwork-soker-montor/tracking/5",
        "information" : null
      },
      "source_type" : "VIA_PLATSBANKEN_DXA",
      "application_deadline" : "2022-07-24T23:59:59",
      "external_id" : "46-556902-6767-500-50028-2",
      "workplace_address" : {
        "coordinates" : [ 13.596274, 56.461773 ],
        "city" : null,
        "postcode" : null,
        "municipality" : "Markaryd",
        "region_concept_id" : "tF3y_MF9_h5G",
        "region" : "Kronobergs län",
        "country_code" : "199",
        "region_code" : "07",
        "municipality_concept_id" : "ZhVf_yL5_Q5g",
        "country_concept_id" : "i46j_HmG_v64",
        "municipality_code" : "0767",
        "street_address" : null,
        "country" : "Sverige"
      },
      "id" : "26307973",
      "experience_required" : false,
      "working_hours_type" : {
        "concept_id" : "6YE1_gAC_R2G",
        "label" : "Heltid",
        "legacy_ams_taxonomy_id" : "1"
      },
      "access" : null,
      "timestamp" : 1657266540928,
      "must_have" : {
        "education_level" : [ ],
        "work_experiences" : [ ],
        "skills" : [ ],
        "education" : [ ],
        "languages" : [ ]
      },
      "occupation_field" : {
        "concept_id" : "wTEr_CBC_bqh",
        "label" : "Industriell tillverkning",
        "legacy_ams_taxonomy_id" : "9"
      },
      "scope_of_work" : {
        "min" : 100,
        "max" : 100
      },
      "salary_type" : {
        "concept_id" : "oG8G_9cW_nRf",
        "label" : "Fast månads- vecko- eller timlön",
        "legacy_ams_taxonomy_id" : "1"
      },
      "removed" : false,
      "salary_description" : "Fast",
      "access_to_own_car" : false,
      "publication_date" : "2022-07-08T09:49:00"
    },
    "name" : "TopWork söker montör...",
    "user" : "hannes"
  },
  "sha1" : "616c63b518489066b4bd31970395ce685816ae23",
  "annotations" : [ {
    "preferred-label" : "Montörer",
    "type" : "ssyk-level-3",
    "start-position" : 14,
    "end-position" : 20,
    "concept-id" : "Wz8B_WeK_vUB",
    "matched-string" : "montör",
    "annotation-id" : 2
  }, {
    "preferred-label" : "Markaryd",
    "type" : "municipality",
    "start-position" : 39,
    "end-position" : 47,
    "concept-id" : "ZhVf_yL5_Q5g",
    "matched-string" : "Markaryd",
    "annotation-id" : 3
  }, {
    "preferred-label" : "Lager",
    "sentiment" : "MUST_HAVE",
    "type" : "keyword",
    "start-position" : 842,
    "end-position" : 847,
    "concept-id" : "J5gJ_6vV_egQ",
    "matched-string" : "lager",
    "annotation-id" : 0
  }, {
    "preferred-label" : "Logistik",
    "sentiment" : "MUST_HAVE",
    "type" : "skill",
    "start-position" : 849,
    "end-position" : 857,
    "concept-id" : "yXmf_iKi_7ci",
    "matched-string" : "logistik",
    "annotation-id" : 1
  }, {
    "preferred-label" : "Bygg",
    "type" : "occupation-collection",
    "start-position" : 859,
    "end-position" : 863,
    "concept-id" : "ja7J_P8X_YC9",
    "matched-string" : "bygg",
    "annotation-id" : 4
  } ],
  "text" : "TopWork söker montör...\n...till kund i Markaryd.\n \n\nVi söker dig med erfarenhet av praktiskt arbete och ”rätt” inställning, då vi lägger stor vikt vid dina personliga egenskaper. Du ska vara en bra lagspelare och god arbetskamrat. Det är meriterande om du har erfarenhet av montering eller liknande arbetsuppgifter. \n \nVi rekryterar löpande så tveka inte att lämna in din ansökan redan idag. Varmt välkommen med din ansökan!\n \nTjänsten inleds med en anställning hos TopWork med ett mål om att kandidaten senare ska övergå till en anställning hos kund. Som konsult hos TopWork får du en konsultchef som stöttar dig i ditt uppdrag hos kund. Vi ger dig råd och rekommendationer om hur du kan utvecklas i ditt arbete.\n\n\nTopWork är ett auktoriserat företag som arbetar med bemanning och rekrytering. Våra kunder finns inom branscher som industri, lager, logistik, bygg och administration. Vi är din trygga, professionella partner oavsett om du söker nya medarbetare eller nya utmaningar. TopWork - vi hittar rätt medarbetare till rätt arbetsgivare och arbetsplats."
}