{
  "meta" : {
    "jobad" : {
      "description" : {
        "requirements" : null,
        "needs" : null,
        "company_information" : null,
        "text_formatted" : "<p>Swing Inn Nightclub är en del av Nöjeskvarteret Malmborgen och är ett av Malmös mest berömda diskotek. Vi värderar god mat, bra service och kompetens.</p><p>Vi ser gärna att du har arbetat som bartender tidigare och har erfarenhet både när det gäller beredning av drinkar, öl och övrigt samt har kassavana. Viss utbildning sker på plats. Du har tidigare arbetat som bartender och har gärna diplom.</p><p>Som person ska du vara stresstålig, positiv och serviceminded och ge det lilla extra till våra gäster. Arbetsuppgifter omfattar en kombination av att kunna blanda drinkar samt hantera kassa. Utifrån standardrepertoaren tillgodoser du våra gästers behov. </p><p>Vi söker dig som kan jobba fredag och/eller lördag.</p><p>Lön enligt kollektivavtal.</p><p>Skicka ett CV och gärna en tillhörande bild på dig.</p><p>Ansökningar tages emot löpande och arbete påbörjas inom en snar framtid.</p><p>För mer info, kontakta: info@malmborgen.se</p><p>Vänligen märk er ansökan \"Bartender Swing Inn 2022\"</p><p id=\"oppenforalla\">Öppen för alla\nVi fokuserar på din kompetens, inte dina övriga förutsättningar. Vi är öppna för att anpassa rollen eller arbetsplatsen efter dina behov.</p>",
        "conditions" : null,
        "text" : "Swing Inn Nightclub är en del av Nöjeskvarteret Malmborgen och är ett av Malmös mest berömda diskotek. Vi värderar god mat, bra service och kompetens.\nVi ser gärna att du har arbetat som bartender tidigare och har erfarenhet både när det gäller beredning av drinkar, öl och övrigt samt har kassavana. Viss utbildning sker på plats. Du har tidigare arbetat som bartender och har gärna diplom.\nSom person ska du vara stresstålig, positiv och serviceminded och ge det lilla extra till våra gäster. Arbetsuppgifter omfattar en kombination av att kunna blanda drinkar samt hantera kassa. Utifrån standardrepertoaren tillgodoser du våra gästers behov. \nVi söker dig som kan jobba fredag och/eller lördag.\nLön enligt kollektivavtal.\nSkicka ett CV och gärna en tillhörande bild på dig.\nAnsökningar tages emot löpande och arbete påbörjas inom en snar framtid.\nFör mer info, kontakta: info@malmborgen.se\nVänligen märk er ansökan \"Bartender Swing Inn 2022\"\nÖppen för alla\nVi fokuserar på din kompetens, inte dina övriga förutsättningar. Vi är öppna för att anpassa rollen eller arbetsplatsen efter dina behov."
      },
      "headline" : "Bartender Swing Inn",
      "driving_license" : null,
      "employer" : {
        "email" : null,
        "phone_number" : null,
        "organization_number" : "5592933120",
        "name" : "Nöjeskvarteret Malmborgen AB",
        "url" : null,
        "workplace" : "Nöjeskvarteret Malmborgen AB"
      },
      "removed_date" : null,
      "logo_url" : null,
      "last_publication_date" : "2022-09-12T23:59:59",
      "number_of_vacancies" : 3,
      "occupation" : {
        "concept_id" : "fLps_qRU_1CC",
        "label" : "Bartender",
        "legacy_ams_taxonomy_id" : "5488"
      },
      "occupation_group" : {
        "concept_id" : "XFXX_Jq9_Y2a",
        "label" : "Bartendrar",
        "legacy_ams_taxonomy_id" : "5132"
      },
      "employment_type" : {
        "concept_id" : "1paU_aCR_nGn",
        "label" : "Behovsanställning",
        "legacy_ams_taxonomy_id" : "4"
      },
      "webpage_url" : "https://arbetsformedlingen.se/platsbanken/annonser/26406391",
      "driving_license_required" : false,
      "application_contacts" : [ ],
      "duration" : {
        "concept_id" : null,
        "label" : null,
        "legacy_ams_taxonomy_id" : null
      },
      "nice_to_have" : {
        "education_level" : [ ],
        "work_experiences" : [ {
          "concept_id" : "fLps_qRU_1CC",
          "weight" : 5,
          "label" : "Bartender",
          "legacy_ams_taxonomy_id" : "5488"
        } ],
        "skills" : [ ],
        "education" : [ ],
        "languages" : [ ]
      },
      "application_details" : {
        "via_af" : false,
        "email" : "info@malmborgen.se",
        "other" : null,
        "reference" : "Bartender Club Privé 2022",
        "url" : null,
        "information" : null
      },
      "source_type" : "VIA_ANNONSERA",
      "application_deadline" : "2022-09-12T23:59:59",
      "external_id" : null,
      "workplace_address" : {
        "coordinates" : [ 13.003355356765507, 55.60273330753059 ],
        "city" : "Malmö",
        "postcode" : "21138",
        "municipality" : "Malmö",
        "region_concept_id" : "CaRE_1nn_cSU",
        "region" : "Skåne län",
        "country_code" : "199",
        "region_code" : "12",
        "municipality_concept_id" : "oYPt_yRA_Smm",
        "country_concept_id" : "i46j_HmG_v64",
        "municipality_code" : "1280",
        "street_address" : "Malmborgsgatan 7",
        "country" : "Sverige"
      },
      "id" : "26406391",
      "experience_required" : true,
      "working_hours_type" : {
        "concept_id" : null,
        "label" : null,
        "legacy_ams_taxonomy_id" : null
      },
      "access" : null,
      "timestamp" : 1660389825275,
      "must_have" : {
        "education_level" : [ ],
        "work_experiences" : [ ],
        "skills" : [ ],
        "education" : [ ],
        "languages" : [ ]
      },
      "occupation_field" : {
        "concept_id" : "ScKy_FHB_7wT",
        "label" : "Hotell, restaurang, storhushåll",
        "legacy_ams_taxonomy_id" : "7"
      },
      "scope_of_work" : {
        "min" : 0,
        "max" : null
      },
      "salary_type" : {
        "concept_id" : "oG8G_9cW_nRf",
        "label" : "Fast månads- vecko- eller timlön",
        "legacy_ams_taxonomy_id" : "1"
      },
      "removed" : false,
      "salary_description" : null,
      "access_to_own_car" : false,
      "publication_date" : "2022-08-13T13:23:45"
    },
    "name" : "Bartender Swing Inn",
    "user" : "hannes"
  },
  "sha1" : "3e662d4261a966cb124810c9710c0431bf86fe48",
  "annotations" : [ {
    "preferred-label" : "bartender",
    "sentiment" : "MUST_HAVE",
    "type" : "esco-occupation",
    "start-position" : 0,
    "end-position" : 9,
    "concept-id" : "tr5M_uUa_wdz",
    "matched-string" : "bartender",
    "annotation-id" : 0
  }, {
    "preferred-label" : "Swing",
    "sentiment" : "MUST_HAVE",
    "type" : "skill",
    "start-position" : 10,
    "end-position" : 15,
    "concept-id" : "DWgh_AvF_T7z",
    "matched-string" : "swing",
    "annotation-id" : 1
  }, {
    "preferred-label" : "Swing",
    "sentiment" : "MUST_HAVE",
    "type" : "skill",
    "start-position" : 20,
    "end-position" : 25,
    "concept-id" : "DWgh_AvF_T7z",
    "matched-string" : "swing",
    "annotation-id" : 2
  }, {
    "preferred-label" : "bartender",
    "sentiment" : "MUST_HAVE",
    "type" : "esco-occupation",
    "start-position" : 207,
    "end-position" : 216,
    "concept-id" : "tr5M_uUa_wdz",
    "matched-string" : "bartender",
    "annotation-id" : 3
  }, {
    "preferred-label" : "Cocktails/Drinkar",
    "sentiment" : "MUST_HAVE",
    "type" : "skill",
    "start-position" : 278,
    "end-position" : 285,
    "concept-id" : "ZvbR_g69_jGv",
    "matched-string" : "drinkar",
    "annotation-id" : 4
  }, {
    "preferred-label" : "Kassavana",
    "sentiment" : "MUST_HAVE",
    "type" : "skill",
    "start-position" : 310,
    "end-position" : 319,
    "concept-id" : "hYpk_RYx_y3V",
    "matched-string" : "kassavana",
    "annotation-id" : 5
  }, {
    "preferred-label" : "bartender",
    "sentiment" : "MUST_HAVE",
    "type" : "esco-occupation",
    "start-position" : 380,
    "end-position" : 389,
    "concept-id" : "tr5M_uUa_wdz",
    "matched-string" : "bartender",
    "annotation-id" : 6
  }, {
    "preferred-label" : "Cocktails/Drinkar",
    "sentiment" : "MUST_HAVE",
    "type" : "skill",
    "start-position" : 575,
    "end-position" : 582,
    "concept-id" : "ZvbR_g69_jGv",
    "matched-string" : "drinkar",
    "annotation-id" : 7
  }, {
    "preferred-label" : "Kollektivavtal",
    "sentiment" : "MUST_HAVE",
    "type" : "skill",
    "start-position" : 730,
    "end-position" : 744,
    "concept-id" : "z7wE_9xb_3jX",
    "matched-string" : "kollektivavtal",
    "annotation-id" : 8
  }, {
    "preferred-label" : "Bartender",
    "sentiment" : "MUST_HAVE",
    "type" : "occupation-name",
    "start-position" : 940,
    "end-position" : 949,
    "concept-id" : "fLps_qRU_1CC",
    "matched-string" : "bartender",
    "annotation-id" : 9
  } ],
  "text" : "Bartender Swing Inn\nSwing Inn Nightclub är en del av Nöjeskvarteret Malmborgen och är ett av Malmös mest berömda diskotek. Vi värderar god mat, bra service och kompetens.\nVi ser gärna att du har arbetat som bartender tidigare och har erfarenhet både när det gäller beredning av drinkar, öl och övrigt samt har kassavana. Viss utbildning sker på plats. Du har tidigare arbetat som bartender och har gärna diplom.\nSom person ska du vara stresstålig, positiv och serviceminded och ge det lilla extra till våra gäster. Arbetsuppgifter omfattar en kombination av att kunna blanda drinkar samt hantera kassa. Utifrån standardrepertoaren tillgodoser du våra gästers behov. \nVi söker dig som kan jobba fredag och/eller lördag.\nLön enligt kollektivavtal.\nSkicka ett CV och gärna en tillhörande bild på dig.\nAnsökningar tages emot löpande och arbete påbörjas inom en snar framtid.\nFör mer info, kontakta: info@malmborgen.se\nVänligen märk er ansökan \"Bartender Swing Inn 2022\"\nÖppen för alla\nVi fokuserar på din kompetens, inte dina övriga förutsättningar. Vi är öppna för att anpassa rollen eller arbetsplatsen efter dina behov."
}