{
  "meta" : {
    "jobad" : {
      "description" : {
        "requirements" : null,
        "needs" : null,
        "company_information" : null,
        "text_formatted" : "Arbetstid\n\nVi söker utbildade massörer allt från varannan helg till 75%.\nTjänsterna på 75% innefattar dagtid kvällstid och helger i ett rullande schema.\nSkriv gärna vilken mottagning som passar dig bäst att arbeta på.\n\nBeskrivning av kvalifikationer\n\nVi söker dig som är Diplomerad massör som vill utvecklas i vårt koncept. Det spelar ingen roll om du är nyutbildad eller har gått utbildningen för flera år sedan, vi uppdaterar dina kunskaper när du börjar hos oss, vårt koncept kvalitetssäkrar dig. Många av våra anställda har läst till massageterapeut, hälsopedagog, hälsopromotion eller liknande och detta ser vi som ett stort plus då du har stor nytta av dina kunskaper i din roll hos oss. Självklart anställer vi även massageterapeuter, men hos oss kommer du framförallt arbeta som massör.\n\nAnställningsform/Lönevillkor\n\nVi har seriösa avtal med 6 timmars arbetsdag med fast timlön samt en bonus - baserad del som ger dig ökad motivation samt extra tillägg.\nVi har självklart semesterlön, OB, sjuklöner och följer LAS.\n\nErfarenhet\n\nIngen erfarenhet som massör krävs men är ett plus. Viktigaste är personlighet och lämplighet för tjänsten och andra arbetserfarenheter.\n\nVaraktighet\n\nTjänsten beräknas starta efter överenskommelse.\nTillsvidareanställning med 6 månaders provanställning.\n\nFlex-konceptet\n\nhttps://flexmassage.se/wp-content/uploads/2014/08/image1-1-e1480451634850.jpg)Vi arbetar med ett koncept som du får utbildning i och som gör det enklare för dig som massör att kunna arbeta hållbart och skonsamt med djupgående massage. Vi ger dig även betald utbildning genom FLEX-ACADEMY så att du känner dig trygg i konceptet innan du startar din anställning. Utbildningen ger dig fördjupning inom massage med nya tekniker, bindvävsmassage, gravidmassage samt våra tekniska system så som bokningssytem, intranät och kassahantering. Alla mottagningar har öppet alla dagar i veckan. Vi besöker även ett 30-tal företagskunder på plats hos dem. Vi är i expansion och kommer att utöka vår verksamhet med fler företagskunder samt mottagningar framöver så tveka inte att skicka din ansökan till Göteborgs största men personliga massagekedja.\n\nVi ser fram emot din ansökan!",
        "conditions" : "Heltid\r\nAnställningstid enligt överenskommelse",
        "text" : "Arbetstid\n\nVi söker utbildade massörer allt från varannan helg till 75%.\nTjänsterna på 75% innefattar dagtid kvällstid och helger i ett rullande schema.\nSkriv gärna vilken mottagning som passar dig bäst att arbeta på.\n\nBeskrivning av kvalifikationer\n\nVi söker dig som är Diplomerad massör som vill utvecklas i vårt koncept. Det spelar ingen roll om du är nyutbildad eller har gått utbildningen för flera år sedan, vi uppdaterar dina kunskaper när du börjar hos oss, vårt koncept kvalitetssäkrar dig. Många av våra anställda har läst till massageterapeut, hälsopedagog, hälsopromotion eller liknande och detta ser vi som ett stort plus då du har stor nytta av dina kunskaper i din roll hos oss. Självklart anställer vi även massageterapeuter, men hos oss kommer du framförallt arbeta som massör.\n\nAnställningsform/Lönevillkor\n\nVi har seriösa avtal med 6 timmars arbetsdag med fast timlön samt en bonus - baserad del som ger dig ökad motivation samt extra tillägg.\nVi har självklart semesterlön, OB, sjuklöner och följer LAS.\n\nErfarenhet\n\nIngen erfarenhet som massör krävs men är ett plus. Viktigaste är personlighet och lämplighet för tjänsten och andra arbetserfarenheter.\n\nVaraktighet\n\nTjänsten beräknas starta efter överenskommelse.\nTillsvidareanställning med 6 månaders provanställning.\n\nFlex-konceptet\n\nhttps://flexmassage.se/wp-content/uploads/2014/08/image1-1-e1480451634850.jpg)Vi arbetar med ett koncept som du får utbildning i och som gör det enklare för dig som massör att kunna arbeta hållbart och skonsamt med djupgående massage. Vi ger dig även betald utbildning genom FLEX-ACADEMY så att du känner dig trygg i konceptet innan du startar din anställning. Utbildningen ger dig fördjupning inom massage med nya tekniker, bindvävsmassage, gravidmassage samt våra tekniska system så som bokningssytem, intranät och kassahantering. Alla mottagningar har öppet alla dagar i veckan. Vi besöker även ett 30-tal företagskunder på plats hos dem. Vi är i expansion och kommer att utöka vår verksamhet med fler företagskunder samt mottagningar framöver så tveka inte att skicka din ansökan till Göteborgs största men personliga massagekedja.\n\nVi ser fram emot din ansökan!"
      },
      "headline" : "Massör - Göteborg",
      "driving_license" : null,
      "employer" : {
        "email" : null,
        "phone_number" : null,
        "organization_number" : "5567726368",
        "name" : "Flexmassage AB",
        "url" : "http://www.flexmassage.se",
        "workplace" : "Flexmassage"
      },
      "removed_date" : null,
      "logo_url" : "https://www.arbetsformedlingen.se/rest/arbetsgivare/rest/af/v3/organisation/5567726368/logotyper/logo.png",
      "last_publication_date" : "2022-08-31T23:59:59",
      "number_of_vacancies" : 1,
      "occupation" : {
        "concept_id" : "mC28_vEv_AVx",
        "label" : "Massör/Massageterapeut",
        "legacy_ams_taxonomy_id" : "6308"
      },
      "occupation_group" : {
        "concept_id" : "uxHV_KXc_PKD",
        "label" : "Massörer och massageterapeuter",
        "legacy_ams_taxonomy_id" : "5143"
      },
      "employment_type" : {
        "concept_id" : "PFZr_Syz_cUq",
        "label" : "Vanlig anställning",
        "legacy_ams_taxonomy_id" : "1"
      },
      "webpage_url" : "https://arbetsformedlingen.se/platsbanken/annonser/26315896",
      "driving_license_required" : false,
      "application_contacts" : [ {
        "description" : "elin@flexmassage.se",
        "email" : "elin@flexmassage.se",
        "telephone" : null,
        "name" : null,
        "contact_type" : null
      } ],
      "duration" : {
        "concept_id" : "a7uU_j21_mkL",
        "label" : "Tills vidare",
        "legacy_ams_taxonomy_id" : "1"
      },
      "nice_to_have" : {
        "education_level" : [ ],
        "work_experiences" : [ ],
        "skills" : [ ],
        "education" : [ ],
        "languages" : [ ]
      },
      "application_details" : {
        "via_af" : false,
        "email" : null,
        "other" : null,
        "reference" : null,
        "url" : "https://jobb.flexmassage.se/jobs/1913878-massor-goteborg?promotion=446828-arbetsformedlingen",
        "information" : null
      },
      "source_type" : "VIA_PLATSBANKEN_DXA",
      "application_deadline" : "2022-08-31T23:59:59",
      "external_id" : "46-556772-6368-1913878-1",
      "workplace_address" : {
        "coordinates" : [ 11.97456, 57.70887 ],
        "city" : null,
        "postcode" : null,
        "municipality" : "Göteborg",
        "region_concept_id" : "zdoY_6u5_Krt",
        "region" : "Västra Götalands län",
        "country_code" : "199",
        "region_code" : "14",
        "municipality_concept_id" : "PVZL_BQT_XtL",
        "country_concept_id" : "i46j_HmG_v64",
        "municipality_code" : "1480",
        "street_address" : null,
        "country" : "Sverige"
      },
      "id" : "26315896",
      "experience_required" : false,
      "working_hours_type" : {
        "concept_id" : "6YE1_gAC_R2G",
        "label" : "Heltid",
        "legacy_ams_taxonomy_id" : "1"
      },
      "access" : null,
      "timestamp" : 1657542589662,
      "must_have" : {
        "education_level" : [ ],
        "work_experiences" : [ ],
        "skills" : [ ],
        "education" : [ ],
        "languages" : [ ]
      },
      "occupation_field" : {
        "concept_id" : "Uuf1_GMh_Uvw",
        "label" : "Kropps- och skönhetsvård",
        "legacy_ams_taxonomy_id" : "4"
      },
      "scope_of_work" : {
        "min" : 100,
        "max" : 100
      },
      "salary_type" : {
        "concept_id" : "oG8G_9cW_nRf",
        "label" : "Fast månads- vecko- eller timlön",
        "legacy_ams_taxonomy_id" : "1"
      },
      "removed" : false,
      "salary_description" : "Lön enligt överenskommelse",
      "access_to_own_car" : false,
      "publication_date" : "2022-07-11T14:29:49"
    },
    "name" : "Massör - Göteborg",
    "user" : "kristof.fischer"
  },
  "sha1" : "3b18f3ec7a1251d156d8304a4cb7d82935f1de26",
  "annotations" : [ {
    "preferred-label" : "Massör/Massageterapeut",
    "sentiment" : "MUST_HAVE",
    "type" : "occupation-name",
    "start-position" : 0,
    "end-position" : 6,
    "concept-id" : "mC28_vEv_AVx",
    "matched-string" : "massör",
    "annotation-id" : 0
  }, {
    "preferred-label" : "Göteborg",
    "type" : "municipality",
    "start-position" : 9,
    "end-position" : 17,
    "concept-id" : "PVZL_BQT_XtL",
    "matched-string" : "Göteborg",
    "annotation-id" : 9
  }, {
    "preferred-label" : "Deltid",
    "type" : "worktime-extent",
    "start-position" : 86,
    "end-position" : 90,
    "concept-id" : "947z_JGS_Uk2",
    "matched-string" : "75%.",
    "annotation-id" : 10
  }, {
    "preferred-label" : "Deltid",
    "type" : "worktime-extent",
    "start-position" : 105,
    "end-position" : 108,
    "concept-id" : "947z_JGS_Uk2",
    "matched-string" : "75%",
    "annotation-id" : 11
  }, {
    "preferred-label" : "Massör/Massageterapeut",
    "sentiment" : "MUST_HAVE",
    "type" : "occupation-name",
    "start-position" : 300,
    "end-position" : 306,
    "concept-id" : "mC28_vEv_AVx",
    "matched-string" : "massör",
    "annotation-id" : 2
  }, {
    "preferred-label" : "Massör/Massageterapeut",
    "sentiment" : "MUST_HAVE",
    "type" : "occupation-name",
    "start-position" : 556,
    "end-position" : 571,
    "concept-id" : "mC28_vEv_AVx",
    "matched-string" : "massageterapeut",
    "annotation-id" : 3
  }, {
    "preferred-label" : "Hälsopedagog",
    "sentiment" : "MUST_HAVE",
    "type" : "occupation-name",
    "start-position" : 573,
    "end-position" : 585,
    "concept-id" : "qSsm_wXn_Z6i",
    "matched-string" : "hälsopedagog",
    "annotation-id" : 4
  }, {
    "preferred-label" : "Hälsocoach",
    "sentiment" : "MUST_HAVE",
    "type" : "occupation-name",
    "start-position" : 587,
    "end-position" : 601,
    "concept-id" : "EyYy_NBz_aei",
    "matched-string" : "hälsopromotion",
    "annotation-id" : 12
  }, {
    "preferred-label" : "Massör/Massageterapeut",
    "type" : "occupation-name",
    "start-position" : 741,
    "end-position" : 758,
    "concept-id" : "mC28_vEv_AVx",
    "matched-string" : "massageterapeuter",
    "annotation-id" : 13
  }, {
    "preferred-label" : "Massör/Massageterapeut",
    "sentiment" : "MUST_HAVE",
    "type" : "occupation-name",
    "start-position" : 805,
    "end-position" : 811,
    "concept-id" : "mC28_vEv_AVx",
    "matched-string" : "massör",
    "annotation-id" : 5
  }, {
    "preferred-label" : "Massör/Massageterapeut",
    "sentiment" : "MUST_HAVE",
    "type" : "occupation-name",
    "start-position" : 1076,
    "end-position" : 1082,
    "concept-id" : "mC28_vEv_AVx",
    "matched-string" : "massör",
    "annotation-id" : 6
  }, {
    "preferred-label" : "Tillsvidareanställning (inkl. eventuell provanställning)",
    "type" : "employment-type",
    "start-position" : 1253,
    "end-position" : 1275,
    "concept-id" : "kpPX_CNN_gDU",
    "matched-string" : "Tillsvidareanställning",
    "annotation-id" : 14
  }, {
    "preferred-label" : "Massör/Massageterapeut",
    "sentiment" : "MUST_HAVE",
    "type" : "occupation-name",
    "start-position" : 1490,
    "end-position" : 1496,
    "concept-id" : "mC28_vEv_AVx",
    "matched-string" : "massör",
    "annotation-id" : 7
  }, {
    "preferred-label" : "Massageutbildning",
    "sentiment" : "OFFERED",
    "type" : "sun-education-field-4",
    "start-position" : 1583,
    "end-position" : 1593,
    "concept-id" : "Ts2C_rEd_nLs",
    "matched-string" : "utbildning",
    "annotation-id" : 21
  }, {
    "preferred-label" : "Bindvävsmassage",
    "sentiment" : "OFFERED",
    "type" : "skill",
    "start-position" : 1750,
    "end-position" : 1765,
    "concept-id" : "854B_a1L_phG",
    "matched-string" : "bindvävsmassage",
    "annotation-id" : 15
  }, {
    "preferred-label" : "massagetyper",
    "sentiment" : "OFFERED",
    "type" : "esco-skill",
    "start-position" : 1767,
    "end-position" : 1780,
    "concept-id" : "sTvW_rBg_SEz",
    "matched-string" : "gravidmassage",
    "annotation-id" : 16
  }, {
    "preferred-label" : "Bokningssystem",
    "sentiment" : "OFFERED",
    "type" : "skill-headline",
    "start-position" : 1814,
    "end-position" : 1827,
    "concept-id" : "kRoQ_fPR_8oK",
    "matched-string" : "bokningssytem",
    "annotation-id" : 17
  }, {
    "preferred-label" : null,
    "sentiment" : "OFFERED",
    "type" : "skill",
    "start-position" : 1829,
    "end-position" : 1837,
    "concept-id" : null,
    "matched-string" : "intranät",
    "annotation-id" : 18
  }, {
    "preferred-label" : "Kassavana",
    "sentiment" : "OFFERED",
    "type" : "skill",
    "start-position" : 1842,
    "end-position" : 1856,
    "concept-id" : "hYpk_RYx_y3V",
    "matched-string" : "kassahantering",
    "annotation-id" : 19
  }, {
    "preferred-label" : "Göteborg",
    "type" : "municipality",
    "start-position" : 2114,
    "end-position" : 2123,
    "concept-id" : "PVZL_BQT_XtL",
    "matched-string" : "Göteborgs",
    "annotation-id" : 20
  } ],
  "text" : "Massör - Göteborg\nArbetstid\n\nVi söker utbildade massörer allt från varannan helg till 75%.\nTjänsterna på 75% innefattar dagtid kvällstid och helger i ett rullande schema.\nSkriv gärna vilken mottagning som passar dig bäst att arbeta på.\n\nBeskrivning av kvalifikationer\n\nVi söker dig som är Diplomerad massör som vill utvecklas i vårt koncept. Det spelar ingen roll om du är nyutbildad eller har gått utbildningen för flera år sedan, vi uppdaterar dina kunskaper när du börjar hos oss, vårt koncept kvalitetssäkrar dig. Många av våra anställda har läst till massageterapeut, hälsopedagog, hälsopromotion eller liknande och detta ser vi som ett stort plus då du har stor nytta av dina kunskaper i din roll hos oss. Självklart anställer vi även massageterapeuter, men hos oss kommer du framförallt arbeta som massör.\n\nAnställningsform/Lönevillkor\n\nVi har seriösa avtal med 6 timmars arbetsdag med fast timlön samt en bonus - baserad del som ger dig ökad motivation samt extra tillägg.\nVi har självklart semesterlön, OB, sjuklöner och följer LAS.\n\nErfarenhet\n\nIngen erfarenhet som massör krävs men är ett plus. Viktigaste är personlighet och lämplighet för tjänsten och andra arbetserfarenheter.\n\nVaraktighet\n\nTjänsten beräknas starta efter överenskommelse.\nTillsvidareanställning med 6 månaders provanställning.\n\nFlex-konceptet\n\nhttps://flexmassage.se/wp-content/uploads/2014/08/image1-1-e1480451634850.jpg)Vi arbetar med ett koncept som du får utbildning i och som gör det enklare för dig som massör att kunna arbeta hållbart och skonsamt med djupgående massage. Vi ger dig även betald utbildning genom FLEX-ACADEMY så att du känner dig trygg i konceptet innan du startar din anställning. Utbildningen ger dig fördjupning inom massage med nya tekniker, bindvävsmassage, gravidmassage samt våra tekniska system så som bokningssytem, intranät och kassahantering. Alla mottagningar har öppet alla dagar i veckan. Vi besöker även ett 30-tal företagskunder på plats hos dem. Vi är i expansion och kommer att utöka vår verksamhet med fler företagskunder samt mottagningar framöver så tveka inte att skicka din ansökan till Göteborgs största men personliga massagekedja.\n\nVi ser fram emot din ansökan!"
}