{
  "meta" : {
    "jobad" : {
      "description" : {
        "requirements" : null,
        "needs" : null,
        "company_information" : null,
        "text_formatted" : "<p>Vi söker konstant efter fler medarbetare!</p><p>Vi behöver medarbetare till flera av våra monteringsavdelningar!</p><p>Arbetsuppgifterna kan bestå av allt från montering av kyl- och frysdiskar, bygga maskinplattor, svetsa rörkopplingar med lödgas till plåtbearbetning på vår skumavdelning.</p><p>Du arbetar utifrån monteringsinstruktioner och givna processer. Du arbetar i ett team, där ni tillsammans arbetar för att nå de uppsatta målen.</p><p>Vi söker dig som antingen:</p><ul><li><strong>redan har arbete idag och som har uppsägningstid, vi är beredda att vänta på dig!</strong></li><li>eller</li><li><strong>är mellan två jobb och kan börja omgående!</strong></li><li>eller</li><li><strong>tagit studenten och detta är ditt första arbete!</strong></li></ul><p>Arbetet sker främst dagtid, må-to 06.50-16.30, fre 06.50-13.20</p><p>Du ska ha lätt för att lära dig nya saker, vara driven och kan leverera god kvalitet. Du är flexibel, har god samarbetsförmåga och positiv inställning.</p><p>Arbetet kräver goda kunskaper i svenska, i både tal och skrift.</p><p>Vi erbjuder dig:</p><ul><li>En arbetsplats där vi är ett gott gäng som hjälper varandra .</li><li>Möjligheten att representera ett företag som har stor investeringsvilja och stora ambitioner!</li><li>En utvecklande och spännande arbetsplats med högt tempo där vi alla arbetar mot gemensamma mål.</li><li>Årliga kick-offer, sommar- och julfester och däremellan Teambuildingaktiviteter.</li><li>Heltidstjänst.</li></ul><p><br></p><p>Ansök redan idag:</p><p>Vi vill ha din ansökan så snart som möjligt dock senast 2022-07-24, urval och intervjuer sker löpande. Skicka din ansökan märkt med Montör till personal@wica.se</p>",
        "conditions" : null,
        "text" : "Vi söker konstant efter fler medarbetare!\nVi behöver medarbetare till flera av våra monteringsavdelningar!\nArbetsuppgifterna kan bestå av allt från montering av kyl- och frysdiskar, bygga maskinplattor, svetsa rörkopplingar med lödgas till plåtbearbetning på vår skumavdelning.\nDu arbetar utifrån monteringsinstruktioner och givna processer. Du arbetar i ett team, där ni tillsammans arbetar för att nå de uppsatta målen.\nVi söker dig som antingen:\nredan har arbete idag och som har uppsägningstid, vi är beredda att vänta på dig!\neller\när mellan två jobb och kan börja omgående!\neller\ntagit studenten och detta är ditt första arbete!\n\nArbetet sker främst dagtid, må-to 06.50-16.30, fre 06.50-13.20\nDu ska ha lätt för att lära dig nya saker, vara driven och kan leverera god kvalitet. Du är flexibel, har god samarbetsförmåga och positiv inställning.\nArbetet kräver goda kunskaper i svenska, i både tal och skrift.\nVi erbjuder dig:\nEn arbetsplats där vi är ett gott gäng som hjälper varandra .\nMöjligheten att representera ett företag som har stor investeringsvilja och stora ambitioner!\nEn utvecklande och spännande arbetsplats med högt tempo där vi alla arbetar mot gemensamma mål.\nÅrliga kick-offer, sommar- och julfester och däremellan Teambuildingaktiviteter.\nHeltidstjänst.\n\n\n\nAnsök redan idag:\nVi vill ha din ansökan så snart som möjligt dock senast 2022-07-24, urval och intervjuer sker löpande. Skicka din ansökan märkt med Montör till personal@wica.se"
      },
      "headline" : "Montörer till produktionen",
      "driving_license" : null,
      "employer" : {
        "email" : null,
        "phone_number" : null,
        "organization_number" : "5562934462",
        "name" : "Wica Cold AB",
        "url" : "wica.se",
        "workplace" : "Wica Cold AB"
      },
      "removed_date" : null,
      "logo_url" : "https://www.arbetsformedlingen.se/rest/arbetsgivare/rest/af/v3/arbetsplatser/10070110/logotyper/logo.png",
      "last_publication_date" : "2022-07-24T23:59:59",
      "number_of_vacancies" : 7,
      "occupation" : {
        "concept_id" : "rAjz_1xP_f1a",
        "label" : "Montör, metallprodukter",
        "legacy_ams_taxonomy_id" : "297"
      },
      "occupation_group" : {
        "concept_id" : "Kxm9_N3V_shF",
        "label" : "Montörer, metall-, gummi- och plastprodukter",
        "legacy_ams_taxonomy_id" : "8213"
      },
      "employment_type" : {
        "concept_id" : "PFZr_Syz_cUq",
        "label" : "Vanlig anställning",
        "legacy_ams_taxonomy_id" : "1"
      },
      "webpage_url" : "https://arbetsformedlingen.se/platsbanken/annonser/26319409",
      "driving_license_required" : false,
      "application_contacts" : [ ],
      "duration" : {
        "concept_id" : "qQUd_4qe_NDT",
        "label" : "6 månader eller längre",
        "legacy_ams_taxonomy_id" : "2"
      },
      "nice_to_have" : {
        "education_level" : [ ],
        "work_experiences" : [ {
          "concept_id" : "rAjz_1xP_f1a",
          "weight" : 5,
          "label" : "Montör, metallprodukter",
          "legacy_ams_taxonomy_id" : "297"
        } ],
        "skills" : [ ],
        "education" : [ ],
        "languages" : [ ]
      },
      "application_details" : {
        "via_af" : false,
        "email" : "personal@wica.se",
        "other" : null,
        "reference" : "Montör",
        "url" : null,
        "information" : null
      },
      "source_type" : "VIA_ANNONSERA",
      "application_deadline" : "2022-07-24T23:59:59",
      "external_id" : null,
      "workplace_address" : {
        "coordinates" : [ 14.454866821867883, 56.78238463649617 ],
        "city" : "Vislanda",
        "postcode" : "34251",
        "municipality" : "Alvesta",
        "region_concept_id" : "tF3y_MF9_h5G",
        "region" : "Kronobergs län",
        "country_code" : "199",
        "region_code" : "07",
        "municipality_concept_id" : "MMph_wmN_esc",
        "country_concept_id" : "i46j_HmG_v64",
        "municipality_code" : "0764",
        "street_address" : "Elnarydsvägen 22",
        "country" : "Sverige"
      },
      "id" : "26319409",
      "experience_required" : true,
      "working_hours_type" : {
        "concept_id" : "6YE1_gAC_R2G",
        "label" : "Heltid",
        "legacy_ams_taxonomy_id" : "1"
      },
      "access" : null,
      "timestamp" : 1657621100311,
      "must_have" : {
        "education_level" : [ ],
        "work_experiences" : [ ],
        "skills" : [ ],
        "education" : [ ],
        "languages" : [ ]
      },
      "occupation_field" : {
        "concept_id" : "wTEr_CBC_bqh",
        "label" : "Industriell tillverkning",
        "legacy_ams_taxonomy_id" : "9"
      },
      "scope_of_work" : {
        "min" : 0,
        "max" : 100
      },
      "salary_type" : {
        "concept_id" : "oG8G_9cW_nRf",
        "label" : "Fast månads- vecko- eller timlön",
        "legacy_ams_taxonomy_id" : "1"
      },
      "removed" : false,
      "salary_description" : null,
      "access_to_own_car" : false,
      "publication_date" : "2022-07-12T12:18:20"
    },
    "name" : "Montörer till produktionen",
    "user" : "hannes"
  },
  "sha1" : "937c04eed805a0ffbd9ba8e0430dadc40c32ba6d",
  "annotations" : [ {
    "preferred-label" : "Montörer",
    "sentiment" : "MUST_HAVE",
    "type" : "ssyk-level-3",
    "start-position" : 0,
    "end-position" : 8,
    "concept-id" : "Wz8B_WeK_vUB",
    "matched-string" : "montörer",
    "annotation-id" : 0
  }, {
    "preferred-label" : "Svets",
    "type" : "keyword",
    "start-position" : 230,
    "end-position" : 236,
    "concept-id" : "Emhe_ce6_MYC",
    "matched-string" : "svetsa",
    "annotation-id" : 4
  }, {
    "preferred-label" : "Plåtbearbetning",
    "sentiment" : "MUST_HAVE",
    "type" : "skill",
    "start-position" : 267,
    "end-position" : 282,
    "concept-id" : "SrzF_GXp_pFE",
    "matched-string" : "plåtbearbetning",
    "annotation-id" : 1
  }, {
    "preferred-label" : "Svenska",
    "sentiment" : "MUST_HAVE",
    "type" : "language",
    "start-position" : 910,
    "end-position" : 917,
    "concept-id" : "zSLA_vw2_FXN",
    "matched-string" : "svenska",
    "annotation-id" : 2
  } ],
  "text" : "Montörer till produktionen\nVi söker konstant efter fler medarbetare!\nVi behöver medarbetare till flera av våra monteringsavdelningar!\nArbetsuppgifterna kan bestå av allt från montering av kyl- och frysdiskar, bygga maskinplattor, svetsa rörkopplingar med lödgas till plåtbearbetning på vår skumavdelning.\nDu arbetar utifrån monteringsinstruktioner och givna processer. Du arbetar i ett team, där ni tillsammans arbetar för att nå de uppsatta målen.\nVi söker dig som antingen:\nredan har arbete idag och som har uppsägningstid, vi är beredda att vänta på dig!\neller\när mellan två jobb och kan börja omgående!\neller\ntagit studenten och detta är ditt första arbete!\n\nArbetet sker främst dagtid, må-to 06.50-16.30, fre 06.50-13.20\nDu ska ha lätt för att lära dig nya saker, vara driven och kan leverera god kvalitet. Du är flexibel, har god samarbetsförmåga och positiv inställning.\nArbetet kräver goda kunskaper i svenska, i både tal och skrift.\nVi erbjuder dig:\nEn arbetsplats där vi är ett gott gäng som hjälper varandra .\nMöjligheten att representera ett företag som har stor investeringsvilja och stora ambitioner!\nEn utvecklande och spännande arbetsplats med högt tempo där vi alla arbetar mot gemensamma mål.\nÅrliga kick-offer, sommar- och julfester och däremellan Teambuildingaktiviteter.\nHeltidstjänst.\n\n\n\nAnsök redan idag:\nVi vill ha din ansökan så snart som möjligt dock senast 2022-07-24, urval och intervjuer sker löpande. Skicka din ansökan märkt med Montör till personal@wica.se"
}