{
  "meta" : {
    "jobad" : {
      "description" : {
        "requirements" : null,
        "needs" : null,
        "company_information" : null,
        "text_formatted" : "<p>Jag är en tonåring som bor med min familj och söker en till assistent som vill följa med mig i min vardag. Jag har en mental och motorisk funktions variation och kommunicerar med bilder som stöd. Jag gillar att vara ute, oavsett väder, så därför är det önskvärt att du känner likadant.</p><p>Jag söker dig som är aktiv, lekfull och har ett gott tålamod. Du får gärna vara initiativtagande och komma på aktiviteter som vi kan utföra utomhus likväl som i hemmet.</p><p>Det är även viktigt för mig att du är duktig på att passa tider och ansvarstagande.</p><p>Körkort och tillgång till bil är meriterande men inget krav, då viss möjlighet till kollektivtrafik finns.</p><p><strong>Om tjänsten:</strong></p><p>Vi söker personal till en tjänst på 49,8%. Tjänsten är med start efter överenskommelse men helst omgående. Tjänsten är förlagd varannan vecka på jämna veckor men med möjlighet till mer arbete vid exempelvis sjukdom eller ledighet.</p><p>Det finns goda möjligheter till förlängning efter sommaren.</p><p>Arbetstiderna är förlagda på eftermiddagarna samt att arbete på helgen förekommer.</p><p>Då detta är arbete med barn, kommer vi att begära ut ett utdrag från belastningsregistret.</p><p><strong>Om LS Assistans:</strong></p><p>LS Assistans grundades 2011 i Umeå och har verksamhet i hela Sverige. Vi är ett norrländskt familjeföretag som levererar personlig assistans med hög kvalitet. Vi drivs av en stark värdegrund och jobbar med snabba, enkla beslutsvägar.</p><p>Vårt mål är att tillgodose varje kunds individuella och specifika behov. Vi vill vara ett föredöme och ledande i branschen. Vi arbetar medvetet för jämställdhet, delaktighet och mångfald för att värna om individens olika behov och genom detta kunna ge bästa möjliga assistans.</p><p>Vi ser personalen som en långsiktig investering. Medarbetare som trivs, blir sedda och är delaktiga i vår verksamhet är för oss vår viktigaste resurs. Som anställd hos oss får du utbildning, bra anställningsförhållanden och god lön.</p><p>Vi erbjuder dig ett viktigt jobb där din vilja och ditt engagemang är avgörande för assistansens kvalitet.</p><p>Vill du vara med och göra skillnad? Sök då till oss på LS Assistans!</p>",
        "conditions" : null,
        "text" : "Jag är en tonåring som bor med min familj och söker en till assistent som vill följa med mig i min vardag. Jag har en mental och motorisk funktions variation och kommunicerar med bilder som stöd. Jag gillar att vara ute, oavsett väder, så därför är det önskvärt att du känner likadant.\nJag söker dig som är aktiv, lekfull och har ett gott tålamod. Du får gärna vara initiativtagande och komma på aktiviteter som vi kan utföra utomhus likväl som i hemmet.\nDet är även viktigt för mig att du är duktig på att passa tider och ansvarstagande.\nKörkort och tillgång till bil är meriterande men inget krav, då viss möjlighet till kollektivtrafik finns.\nOm tjänsten:\nVi söker personal till en tjänst på 49,8%. Tjänsten är med start efter överenskommelse men helst omgående. Tjänsten är förlagd varannan vecka på jämna veckor men med möjlighet till mer arbete vid exempelvis sjukdom eller ledighet.\nDet finns goda möjligheter till förlängning efter sommaren.\nArbetstiderna är förlagda på eftermiddagarna samt att arbete på helgen förekommer.\nDå detta är arbete med barn, kommer vi att begära ut ett utdrag från belastningsregistret.\nOm LS Assistans:\nLS Assistans grundades 2011 i Umeå och har verksamhet i hela Sverige. Vi är ett norrländskt familjeföretag som levererar personlig assistans med hög kvalitet. Vi drivs av en stark värdegrund och jobbar med snabba, enkla beslutsvägar.\nVårt mål är att tillgodose varje kunds individuella och specifika behov. Vi vill vara ett föredöme och ledande i branschen. Vi arbetar medvetet för jämställdhet, delaktighet och mångfald för att värna om individens olika behov och genom detta kunna ge bästa möjliga assistans.\nVi ser personalen som en långsiktig investering. Medarbetare som trivs, blir sedda och är delaktiga i vår verksamhet är för oss vår viktigaste resurs. Som anställd hos oss får du utbildning, bra anställningsförhållanden och god lön.\nVi erbjuder dig ett viktigt jobb där din vilja och ditt engagemang är avgörande för assistansens kvalitet.\nVill du vara med och göra skillnad? Sök då till oss på LS Assistans!"
      },
      "headline" : "Personlig assistent sökes till tonårig kille",
      "driving_license" : null,
      "employer" : {
        "email" : null,
        "phone_number" : null,
        "organization_number" : "5568728561",
        "name" : "L&S Assistans AB",
        "url" : "https://lsassistans.se/",
        "workplace" : "L&S Assistans AB"
      },
      "removed_date" : null,
      "logo_url" : "https://www.arbetsformedlingen.se/rest/arbetsgivare/rest/af/v3/arbetsplatser/84163456/logotyper/logo.png",
      "last_publication_date" : "2022-08-23T23:59:59",
      "number_of_vacancies" : 1,
      "occupation" : {
        "concept_id" : "eU1q_zvL_9Rf",
        "label" : "Personlig assistent",
        "legacy_ams_taxonomy_id" : "5798"
      },
      "occupation_group" : {
        "concept_id" : "sq3e_WVv_Fjd",
        "label" : "Personliga assistenter",
        "legacy_ams_taxonomy_id" : "5343"
      },
      "employment_type" : {
        "concept_id" : "PFZr_Syz_cUq",
        "label" : "Vanlig anställning",
        "legacy_ams_taxonomy_id" : "1"
      },
      "webpage_url" : "https://arbetsformedlingen.se/platsbanken/annonser/26372795",
      "driving_license_required" : false,
      "application_contacts" : [ {
        "description" : null,
        "email" : null,
        "telephone" : "090-349 35 69",
        "name" : "Camilla Sakayan",
        "contact_type" : "Rekrytering"
      } ],
      "duration" : {
        "concept_id" : "a7uU_j21_mkL",
        "label" : "Tills vidare",
        "legacy_ams_taxonomy_id" : "1"
      },
      "nice_to_have" : {
        "education_level" : [ ],
        "work_experiences" : [ {
          "concept_id" : "eU1q_zvL_9Rf",
          "weight" : 5,
          "label" : "Personlig assistent",
          "legacy_ams_taxonomy_id" : "5798"
        } ],
        "skills" : [ ],
        "education" : [ ],
        "languages" : [ ]
      },
      "application_details" : {
        "via_af" : false,
        "email" : "ansokan@lsassistans.se",
        "other" : null,
        "reference" : "K055 ",
        "url" : null,
        "information" : null
      },
      "source_type" : "VIA_ANNONSERA",
      "application_deadline" : "2022-08-23T23:59:59",
      "external_id" : null,
      "workplace_address" : {
        "coordinates" : [ null, null ],
        "city" : null,
        "postcode" : null,
        "municipality" : "Västerås",
        "region_concept_id" : "G6DV_fKE_Viz",
        "region" : "Västmanlands län",
        "country_code" : "199",
        "region_code" : "19",
        "municipality_concept_id" : "8deT_FRF_2SP",
        "country_concept_id" : "i46j_HmG_v64",
        "municipality_code" : "1980",
        "street_address" : null,
        "country" : "Sverige"
      },
      "id" : "26372795",
      "experience_required" : true,
      "working_hours_type" : {
        "concept_id" : "947z_JGS_Uk2",
        "label" : "Deltid",
        "legacy_ams_taxonomy_id" : "2"
      },
      "access" : null,
      "timestamp" : 1659457720344,
      "must_have" : {
        "education_level" : [ ],
        "work_experiences" : [ ],
        "skills" : [ ],
        "education" : [ ],
        "languages" : [ {
          "concept_id" : "zSLA_vw2_FXN",
          "weight" : 10,
          "label" : "Svenska",
          "legacy_ams_taxonomy_id" : "502"
        } ]
      },
      "occupation_field" : {
        "concept_id" : "GazW_2TU_kJw",
        "label" : "Yrken med social inriktning",
        "legacy_ams_taxonomy_id" : "16"
      },
      "scope_of_work" : {
        "min" : 37,
        "max" : 100
      },
      "salary_type" : {
        "concept_id" : "oG8G_9cW_nRf",
        "label" : "Fast månads- vecko- eller timlön",
        "legacy_ams_taxonomy_id" : "1"
      },
      "removed" : false,
      "salary_description" : null,
      "access_to_own_car" : false,
      "publication_date" : "2022-08-02T18:26:35"
    },
    "name" : "Personlig assistent sökes till tonårig kille",
    "user" : "kristof.fischer"
  },
  "sha1" : "b476082d03e3468dfbb90e18c86fbd50c1351391",
  "annotations" : [ {
    "preferred-label" : "Personlig assistent",
    "sentiment" : "MUST_HAVE",
    "type" : "occupation-name",
    "start-position" : 0,
    "end-position" : 19,
    "concept-id" : "eU1q_zvL_9Rf",
    "matched-string" : "personlig assistent",
    "annotation-id" : 0
  }, {
    "preferred-label" : "visa ansvarstagande",
    "sentiment" : "MUST_HAVE",
    "type" : "esco-skill",
    "start-position" : 568,
    "end-position" : 582,
    "concept-id" : "bcRp_hxV_f5G",
    "matched-string" : "ansvarstagande",
    "annotation-id" : 4
  }, {
    "preferred-label" : "B",
    "sentiment" : "NICE_TO_HAVE",
    "type" : "driving-licence",
    "start-position" : 584,
    "end-position" : 591,
    "concept-id" : "VTK8_WRx_GcM",
    "matched-string" : "Körkort",
    "annotation-id" : 5
  }, {
    "preferred-label" : "Deltid",
    "type" : "worktime-extent",
    "start-position" : 740,
    "end-position" : 745,
    "concept-id" : "947z_JGS_Uk2",
    "matched-string" : "49,8%",
    "annotation-id" : 6
  } ],
  "text" : "Personlig assistent sökes till tonårig kille\nJag är en tonåring som bor med min familj och söker en till assistent som vill följa med mig i min vardag. Jag har en mental och motorisk funktions variation och kommunicerar med bilder som stöd. Jag gillar att vara ute, oavsett väder, så därför är det önskvärt att du känner likadant.\nJag söker dig som är aktiv, lekfull och har ett gott tålamod. Du får gärna vara initiativtagande och komma på aktiviteter som vi kan utföra utomhus likväl som i hemmet.\nDet är även viktigt för mig att du är duktig på att passa tider och ansvarstagande.\nKörkort och tillgång till bil är meriterande men inget krav, då viss möjlighet till kollektivtrafik finns.\nOm tjänsten:\nVi söker personal till en tjänst på 49,8%. Tjänsten är med start efter överenskommelse men helst omgående. Tjänsten är förlagd varannan vecka på jämna veckor men med möjlighet till mer arbete vid exempelvis sjukdom eller ledighet.\nDet finns goda möjligheter till förlängning efter sommaren.\nArbetstiderna är förlagda på eftermiddagarna samt att arbete på helgen förekommer.\nDå detta är arbete med barn, kommer vi att begära ut ett utdrag från belastningsregistret.\nOm LS Assistans:\nLS Assistans grundades 2011 i Umeå och har verksamhet i hela Sverige. Vi är ett norrländskt familjeföretag som levererar personlig assistans med hög kvalitet. Vi drivs av en stark värdegrund och jobbar med snabba, enkla beslutsvägar.\nVårt mål är att tillgodose varje kunds individuella och specifika behov. Vi vill vara ett föredöme och ledande i branschen. Vi arbetar medvetet för jämställdhet, delaktighet och mångfald för att värna om individens olika behov och genom detta kunna ge bästa möjliga assistans.\nVi ser personalen som en långsiktig investering. Medarbetare som trivs, blir sedda och är delaktiga i vår verksamhet är för oss vår viktigaste resurs. Som anställd hos oss får du utbildning, bra anställningsförhållanden och god lön.\nVi erbjuder dig ett viktigt jobb där din vilja och ditt engagemang är avgörande för assistansens kvalitet.\nVill du vara med och göra skillnad? Sök då till oss på LS Assistans!"
}