{
  "meta" : {
    "jobad" : {
      "description" : {
        "requirements" : null,
        "needs" : null,
        "company_information" : null,
        "text_formatted" : "<p>Vi söker ett duktig pizzabagare eller kock!</p><p>Vår företag har goda arbetstider från 16:00 till 21:00</p><p>Vi söker en person som kan jobba hel eller del tid.</p><p>Ett krav är att du har jobbat med pizza eller jobbat som kock och har erfarenhet!</p><p>Hör av dig om du har några frågor.</p><p>Med vänliga häsningar</p><p>Dashti Rostam 0762323057</p><p><br></p><p><br></p>",
        "conditions" : null,
        "text" : "Vi söker ett duktig pizzabagare eller kock!\nVår företag har goda arbetstider från 16:00 till 21:00\nVi söker en person som kan jobba hel eller del tid.\nEtt krav är att du har jobbat med pizza eller jobbat som kock och har erfarenhet!\nHör av dig om du har några frågor.\nMed vänliga häsningar\nDashti Rostam 0762323057"
      },
      "headline" : "Pizzabagare ",
      "driving_license" : null,
      "employer" : {
        "email" : null,
        "phone_number" : null,
        "organization_number" : "9697975176",
        "name" : "Prego restaurang HB",
        "url" : null,
        "workplace" : "Prego restaurang HB"
      },
      "removed_date" : null,
      "logo_url" : null,
      "last_publication_date" : "2022-11-30T23:59:59",
      "number_of_vacancies" : 1,
      "occupation" : {
        "concept_id" : "yXRQ_Ad9_E8V",
        "label" : "Restaurangbiträde",
        "legacy_ams_taxonomy_id" : "5555"
      },
      "occupation_group" : {
        "concept_id" : "tPox_ie4_X9X",
        "label" : "Restaurang- och köksbiträden m.fl.",
        "legacy_ams_taxonomy_id" : "9412"
      },
      "employment_type" : {
        "concept_id" : "PFZr_Syz_cUq",
        "label" : "Vanlig anställning",
        "legacy_ams_taxonomy_id" : "1"
      },
      "webpage_url" : "https://arbetsformedlingen.se/platsbanken/annonser/26368206",
      "driving_license_required" : false,
      "application_contacts" : [ ],
      "duration" : {
        "concept_id" : "a7uU_j21_mkL",
        "label" : "Tills vidare",
        "legacy_ams_taxonomy_id" : "1"
      },
      "nice_to_have" : {
        "education_level" : [ ],
        "work_experiences" : [ ],
        "skills" : [ ],
        "education" : [ ],
        "languages" : [ ]
      },
      "application_details" : {
        "via_af" : false,
        "email" : "Adam.asi@hotmail.com",
        "other" : null,
        "reference" : null,
        "url" : null,
        "information" : null
      },
      "source_type" : "VIA_ANNONSERA",
      "application_deadline" : "2022-11-30T23:59:59",
      "external_id" : null,
      "workplace_address" : {
        "coordinates" : [ null, null ],
        "city" : null,
        "postcode" : null,
        "municipality" : "Höganäs",
        "region_concept_id" : "CaRE_1nn_cSU",
        "region" : "Skåne län",
        "country_code" : "199",
        "region_code" : "12",
        "municipality_concept_id" : "8QQ6_e95_a1d",
        "country_concept_id" : "i46j_HmG_v64",
        "municipality_code" : "1284",
        "street_address" : null,
        "country" : "Sverige"
      },
      "id" : "26368206",
      "experience_required" : true,
      "working_hours_type" : {
        "concept_id" : "6YE1_gAC_R2G",
        "label" : "Heltid",
        "legacy_ams_taxonomy_id" : "1"
      },
      "access" : null,
      "timestamp" : 1659355610300,
      "must_have" : {
        "education_level" : [ ],
        "work_experiences" : [ {
          "concept_id" : "yXRQ_Ad9_E8V",
          "weight" : 10,
          "label" : "Restaurangbiträde",
          "legacy_ams_taxonomy_id" : "5555"
        } ],
        "skills" : [ ],
        "education" : [ ],
        "languages" : [ ]
      },
      "occupation_field" : {
        "concept_id" : "ScKy_FHB_7wT",
        "label" : "Hotell, restaurang, storhushåll",
        "legacy_ams_taxonomy_id" : "7"
      },
      "scope_of_work" : {
        "min" : 0,
        "max" : 100
      },
      "salary_type" : {
        "concept_id" : "oG8G_9cW_nRf",
        "label" : "Fast månads- vecko- eller timlön",
        "legacy_ams_taxonomy_id" : "1"
      },
      "removed" : false,
      "salary_description" : null,
      "access_to_own_car" : false,
      "publication_date" : "2022-08-01T14:06:50"
    },
    "name" : "Pizzabagare ",
    "user" : "hannes"
  },
  "sha1" : "93f013bb3878f793e97473d5a63c9c99ae097359",
  "annotations" : [ {
    "preferred-label" : "Pizzabagare",
    "sentiment" : "MUST_HAVE",
    "type" : "forecast-occupation",
    "start-position" : 0,
    "end-position" : 11,
    "concept-id" : "SyvN_uBW_USt",
    "matched-string" : "pizzabagare",
    "annotation-id" : 0
  }, {
    "preferred-label" : "Pizzabagare",
    "sentiment" : "MUST_HAVE",
    "type" : "forecast-occupation",
    "start-position" : 33,
    "end-position" : 44,
    "concept-id" : "SyvN_uBW_USt",
    "matched-string" : "pizzabagare",
    "annotation-id" : 1
  }, {
    "preferred-label" : "kock",
    "sentiment" : "MUST_HAVE",
    "type" : "esco-occupation",
    "start-position" : 51,
    "end-position" : 55,
    "concept-id" : "Ti2H_QoQ_EMX",
    "matched-string" : "kock",
    "annotation-id" : 2
  }, {
    "preferred-label" : "Heltid/Deltid",
    "type" : "worktime-extent",
    "start-position" : 145,
    "end-position" : 162,
    "concept-id" : "hGCt_6Ni_XPz",
    "matched-string" : "hel eller del tid",
    "annotation-id" : 5
  }, {
    "preferred-label" : "Pizza",
    "sentiment" : "MUST_HAVE",
    "type" : "keyword",
    "start-position" : 198,
    "end-position" : 203,
    "concept-id" : "aoCa_BaF_g6Z",
    "matched-string" : "pizza",
    "annotation-id" : 3
  }, {
    "preferred-label" : "kock",
    "sentiment" : "MUST_HAVE",
    "type" : "esco-occupation",
    "start-position" : 221,
    "end-position" : 225,
    "concept-id" : "Ti2H_QoQ_EMX",
    "matched-string" : "kock",
    "annotation-id" : 4
  } ],
  "text" : "Pizzabagare \nVi söker ett duktig pizzabagare eller kock!\nVår företag har goda arbetstider från 16:00 till 21:00\nVi söker en person som kan jobba hel eller del tid.\nEtt krav är att du har jobbat med pizza eller jobbat som kock och har erfarenhet!\nHör av dig om du har några frågor.\nMed vänliga häsningar\nDashti Rostam 0762323057"
}