{
  "meta" : {
    "jobad" : {
      "description" : {
        "requirements" : null,
        "needs" : null,
        "company_information" : null,
        "text_formatted" : "Hos oss på Region Dalarna får du ett meningsfullt arbete där du kan göra skillnad. Tillsammans arbetar vi för ett hälsosamt Dalarna!\r\n\r\nARBETSBESKRIVNING\r\n\r\nVill du bli en av oss? Vi är 40 medarbetare, undersköterskor och sjuksköterskor. Nu söker vi en sjuksköterska, då en av våra medarbetare går i pension. \n\nSom sjuksköterska på kirurgkliniken får du en bred erfarenhet av olika patientgrupper och diagnoser inom kirurgi och urologi. Vi har till största delen akut verksamhet, men även planerad verksamhet. Då det mesta är akut, så är ingen dag den andra lik. Du kommer varje dag känna att du gör skillnad för patienten.\n\nDu erbjuds ett arbete där du ständigt får utvecklas. Arbetet är omväxlande och självständigt. Du får ta stort ansvar och fatta beslut kring patientens omvårdnad.\n\nTjänsten är heltid natt alternativt rotation.\n \nMöjlighet till deltid finns.\r\n\nKVALIFIKATIONER\r\n\r\nLegitimerad sjuksköterska.\n\nVi lägger stor vikt vid personlig lämplighet. Du bör ha god samarbetsförmåga och kunna anpassa dig till förändrade förutsättningar. Du har en positiv inställning till ditt arbete.\r\n\nRegion Dalarna värnar om en hälsosam arbetsmiljö för våra medarbetare samt säkra och trygga möten med medborgare, patienter, kunder och samarbetspartners. Som en del i vår rekryteringsprocess genomför vi därför drogtest innan erbjudande om anställning, samt kontrollerar ditt vaccinationsbevis då Region Dalarna har som krav att våra medarbetare ska vara vaccinerade mot covid-19. \n\nAlla anställda inom Region Dalarna som arbetar i en verksamhet där direkt och regelbunden kontakt med barn och ungdomar förekommer ska uppvisa godtagbart utdrag ur Polisens belastningsregister. Före erbjudande av anställning ska ett giltigt utdrag uppvisas i osprättat kuvert.\n\nRegion Dalarna tillämpar krigsplacering i samband med nyanställning. Detta innebär att du som arbetstagare har ett lagkrav att ta dig till ordinarie arbetsplats i händelse av högsta beredskap.\n\nRegion Dalarnas uppgift är att göra Dalarna till en ännu bättre plats att leva på. Vi har ett brett uppdrag så möjligheterna är stora att du hittar ditt drömjobb hos oss! Vi ansvarar för hälso- och sjukvård, tandvård, hjälpmedel, kollektivtrafik och folkhögskolor, samt arbetar med folkbildning, forskning, folkhälsa och kultur. Vi arbetar också med utvecklingsfrågor inom infrastruktur, näringsliv, arbetsmarknad och miljö. \n\nVår värdegrund Öppenhet, Respekt och Ansvar ska genomsyra hela vår organisation. Det ledarskap Region Dalarna strävar mot beskrivs utifrån orden: tydlighet, mod och tillit.\n\nLäs mer om hur det är att jobba hos oss på regiondalarna.se/jobb",
        "conditions" : "Heltid. Tillträde enligt överenskommelse.\r\nTillsvidare",
        "text" : "Hos oss på Region Dalarna får du ett meningsfullt arbete där du kan göra skillnad. Tillsammans arbetar vi för ett hälsosamt Dalarna!\r\n\r\nARBETSBESKRIVNING\r\n\r\nVill du bli en av oss? Vi är 40 medarbetare, undersköterskor och sjuksköterskor. Nu söker vi en sjuksköterska, då en av våra medarbetare går i pension. \n\nSom sjuksköterska på kirurgkliniken får du en bred erfarenhet av olika patientgrupper och diagnoser inom kirurgi och urologi. Vi har till största delen akut verksamhet, men även planerad verksamhet. Då det mesta är akut, så är ingen dag den andra lik. Du kommer varje dag känna att du gör skillnad för patienten.\n\nDu erbjuds ett arbete där du ständigt får utvecklas. Arbetet är omväxlande och självständigt. Du får ta stort ansvar och fatta beslut kring patientens omvårdnad.\n\nTjänsten är heltid natt alternativt rotation.\n \nMöjlighet till deltid finns.\r\n\nKVALIFIKATIONER\r\n\r\nLegitimerad sjuksköterska.\n\nVi lägger stor vikt vid personlig lämplighet. Du bör ha god samarbetsförmåga och kunna anpassa dig till förändrade förutsättningar. Du har en positiv inställning till ditt arbete.\r\n\nRegion Dalarna värnar om en hälsosam arbetsmiljö för våra medarbetare samt säkra och trygga möten med medborgare, patienter, kunder och samarbetspartners. Som en del i vår rekryteringsprocess genomför vi därför drogtest innan erbjudande om anställning, samt kontrollerar ditt vaccinationsbevis då Region Dalarna har som krav att våra medarbetare ska vara vaccinerade mot covid-19. \n\nAlla anställda inom Region Dalarna som arbetar i en verksamhet där direkt och regelbunden kontakt med barn och ungdomar förekommer ska uppvisa godtagbart utdrag ur Polisens belastningsregister. Före erbjudande av anställning ska ett giltigt utdrag uppvisas i osprättat kuvert.\n\nRegion Dalarna tillämpar krigsplacering i samband med nyanställning. Detta innebär att du som arbetstagare har ett lagkrav att ta dig till ordinarie arbetsplats i händelse av högsta beredskap.\n\nRegion Dalarnas uppgift är att göra Dalarna till en ännu bättre plats att leva på. Vi har ett brett uppdrag så möjligheterna är stora att du hittar ditt drömjobb hos oss! Vi ansvarar för hälso- och sjukvård, tandvård, hjälpmedel, kollektivtrafik och folkhögskolor, samt arbetar med folkbildning, forskning, folkhälsa och kultur. Vi arbetar också med utvecklingsfrågor inom infrastruktur, näringsliv, arbetsmarknad och miljö. \n\nVår värdegrund Öppenhet, Respekt och Ansvar ska genomsyra hela vår organisation. Det ledarskap Region Dalarna strävar mot beskrivs utifrån orden: tydlighet, mod och tillit.\n\nLäs mer om hur det är att jobba hos oss på regiondalarna.se/jobb"
      },
      "headline" : "Sjuksköterska natt/rotation Kirurgkliniken avdelning 42 Mora lasarett",
      "driving_license" : null,
      "employer" : {
        "email" : null,
        "phone_number" : null,
        "organization_number" : "2321000180",
        "name" : "REGION DALARNA",
        "url" : "www.regiondalarna.se",
        "workplace" : "Region Dalarna"
      },
      "removed_date" : null,
      "logo_url" : "https://www.arbetsformedlingen.se/rest/arbetsgivare/rest/af/v3/organisation/2321000180/logotyper/logo.png",
      "last_publication_date" : "2022-08-14T23:59:59",
      "number_of_vacancies" : 1,
      "occupation" : {
        "concept_id" : "bXNH_MNX_dUR",
        "label" : "Sjuksköterska, grundutbildad",
        "legacy_ams_taxonomy_id" : "7296"
      },
      "occupation_group" : {
        "concept_id" : "Z8ci_bBE_tmx",
        "label" : "Grundutbildade sjuksköterskor",
        "legacy_ams_taxonomy_id" : "2221"
      },
      "employment_type" : {
        "concept_id" : "PFZr_Syz_cUq",
        "label" : "Vanlig anställning",
        "legacy_ams_taxonomy_id" : "1"
      },
      "webpage_url" : "https://arbetsformedlingen.se/platsbanken/annonser/26280312",
      "driving_license_required" : false,
      "application_contacts" : [ {
        "description" : "Susanne Fyhr",
        "email" : "susanne.fyhr@regiondalarna.se",
        "telephone" : "0250-493007",
        "name" : null,
        "contact_type" : "Avdelningschef"
      } ],
      "duration" : {
        "concept_id" : "a7uU_j21_mkL",
        "label" : "Tills vidare",
        "legacy_ams_taxonomy_id" : "1"
      },
      "nice_to_have" : {
        "education_level" : [ ],
        "work_experiences" : [ ],
        "skills" : [ ],
        "education" : [ ],
        "languages" : [ ]
      },
      "application_details" : {
        "via_af" : false,
        "email" : null,
        "other" : null,
        "reference" : "50:2022:558",
        "url" : "https://jobb.regiondalarna.se/Externwebb/Ansokan/EW2PageBesvaraFragor.aspx?arenderef=7037497071413459245",
        "information" : null
      },
      "source_type" : "VIA_PLATSBANKEN_DXA",
      "application_deadline" : "2022-08-14T23:59:59",
      "external_id" : "46-232100-0180-7039226151417721769",
      "workplace_address" : {
        "coordinates" : [ 14.537003, 61.00488 ],
        "city" : null,
        "postcode" : null,
        "municipality" : "Mora",
        "region_concept_id" : "oDpK_oZ2_WYt",
        "region" : "Dalarnas län",
        "country_code" : "199",
        "region_code" : "20",
        "municipality_concept_id" : "UGcC_kYx_fTs",
        "country_concept_id" : "i46j_HmG_v64",
        "municipality_code" : "2062",
        "street_address" : null,
        "country" : "Sverige"
      },
      "id" : "26280312",
      "experience_required" : true,
      "working_hours_type" : {
        "concept_id" : "6YE1_gAC_R2G",
        "label" : "Heltid",
        "legacy_ams_taxonomy_id" : "1"
      },
      "access" : null,
      "timestamp" : 1656655621752,
      "must_have" : {
        "education_level" : [ ],
        "work_experiences" : [ {
          "concept_id" : "bXNH_MNX_dUR",
          "weight" : 10,
          "label" : "Sjuksköterska, grundutbildad",
          "legacy_ams_taxonomy_id" : "7296"
        } ],
        "skills" : [ ],
        "education" : [ ],
        "languages" : [ ]
      },
      "occupation_field" : {
        "concept_id" : "NYW6_mP6_vwf",
        "label" : "Hälso- och sjukvård",
        "legacy_ams_taxonomy_id" : "8"
      },
      "scope_of_work" : {
        "min" : 100,
        "max" : 100
      },
      "salary_type" : {
        "concept_id" : "oG8G_9cW_nRf",
        "label" : "Fast månads- vecko- eller timlön",
        "legacy_ams_taxonomy_id" : "1"
      },
      "removed" : false,
      "salary_description" : "Månadslön",
      "access_to_own_car" : false,
      "publication_date" : "2022-07-01T08:07:01"
    },
    "name" : "Sjuksköterska natt/rotation Kirurgkliniken avdelning 42 Mora lasarett",
    "user" : "hannes"
  },
  "sha1" : "f8acf81cc498745856acf564c5a5e7c2c269536a",
  "annotations" : [ {
    "preferred-label" : "Sjuksköterska",
    "sentiment" : "MUST_HAVE",
    "type" : "keyword",
    "start-position" : 0,
    "end-position" : 13,
    "concept-id" : "jrjV_wcz_fxg",
    "matched-string" : "sjuksköterska",
    "annotation-id" : 0
  }, {
    "preferred-label" : "Mora",
    "type" : "municipality",
    "start-position" : 56,
    "end-position" : 60,
    "concept-id" : "UGcC_kYx_fTs",
    "matched-string" : "Mora",
    "annotation-id" : 14
  }, {
    "preferred-label" : "Dalarnas län",
    "type" : "region",
    "start-position" : 81,
    "end-position" : 95,
    "concept-id" : "oDpK_oZ2_WYt",
    "matched-string" : "Region Dalarna",
    "annotation-id" : 15
  }, {
    "preferred-label" : "Dalarnas län",
    "type" : "region",
    "start-position" : 194,
    "end-position" : 201,
    "concept-id" : "oDpK_oZ2_WYt",
    "matched-string" : "Dalarna",
    "annotation-id" : 16
  }, {
    "preferred-label" : "Undersköterskor",
    "sentiment" : "MUST_HAVE",
    "type" : "forecast-occupation",
    "start-position" : 272,
    "end-position" : 287,
    "concept-id" : "GWv6_oua_bkS",
    "matched-string" : "undersköterskor",
    "annotation-id" : 1
  }, {
    "preferred-label" : "Sjuksköterskor",
    "sentiment" : "MUST_HAVE",
    "type" : "ssyk-level-3",
    "start-position" : 292,
    "end-position" : 306,
    "concept-id" : "jzaN_Vqk_TP1",
    "matched-string" : "sjuksköterskor",
    "annotation-id" : 2
  }, {
    "preferred-label" : "Sjuksköterska",
    "sentiment" : "MUST_HAVE",
    "type" : "keyword",
    "start-position" : 323,
    "end-position" : 336,
    "concept-id" : "jrjV_wcz_fxg",
    "matched-string" : "sjuksköterska",
    "annotation-id" : 3
  }, {
    "preferred-label" : "Sjuksköterska",
    "sentiment" : "MUST_HAVE",
    "type" : "keyword",
    "start-position" : 385,
    "end-position" : 398,
    "concept-id" : "jrjV_wcz_fxg",
    "matched-string" : "sjuksköterska",
    "annotation-id" : 4
  }, {
    "preferred-label" : "Kirurgi",
    "sentiment" : "MUST_HAVE",
    "type" : "skill",
    "start-position" : 486,
    "end-position" : 493,
    "concept-id" : "iD5y_V1Z_Exw",
    "matched-string" : "kirurgi",
    "annotation-id" : 5
  }, {
    "preferred-label" : "urologi",
    "sentiment" : "MUST_HAVE",
    "type" : "esco-skill",
    "start-position" : 498,
    "end-position" : 505,
    "concept-id" : "wo9D_SWi_LUa",
    "matched-string" : "urologi",
    "annotation-id" : 6
  }, {
    "preferred-label" : "akutvård",
    "type" : "esco-skill",
    "start-position" : 533,
    "end-position" : 548,
    "concept-id" : "qsst_tTk_cv8",
    "matched-string" : "akut verksamhet",
    "annotation-id" : 17
  }, {
    "preferred-label" : "akutvård",
    "type" : "esco-skill",
    "start-position" : 596,
    "end-position" : 600,
    "concept-id" : "qsst_tTk_cv8",
    "matched-string" : "akut",
    "annotation-id" : 18
  }, {
    "preferred-label" : "arbeta självständigt",
    "type" : "esco-skill",
    "start-position" : 774,
    "end-position" : 787,
    "concept-id" : "NyFu_HHd_zhz",
    "matched-string" : "självständigt",
    "annotation-id" : 19
  }, {
    "preferred-label" : "Omvårdnad",
    "sentiment" : "MUST_HAVE",
    "type" : "skill",
    "start-position" : 846,
    "end-position" : 855,
    "concept-id" : "MR4H_FFT_mTj",
    "matched-string" : "omvårdnad",
    "annotation-id" : 7
  }, {
    "preferred-label" : "Heltid",
    "type" : "worktime-extent",
    "start-position" : 870,
    "end-position" : 876,
    "concept-id" : "6YE1_gAC_R2G",
    "matched-string" : "heltid",
    "annotation-id" : 20
  }, {
    "preferred-label" : "Deltid",
    "type" : "worktime-extent",
    "start-position" : 921,
    "end-position" : 927,
    "concept-id" : "947z_JGS_Uk2",
    "matched-string" : "deltid",
    "annotation-id" : 21
  }, {
    "preferred-label" : "Sjuksköterska",
    "sentiment" : "MUST_HAVE",
    "type" : "keyword",
    "start-position" : 968,
    "end-position" : 981,
    "concept-id" : "jrjV_wcz_fxg",
    "matched-string" : "sjuksköterska",
    "annotation-id" : 8
  }, {
    "preferred-label" : "Dalarnas län",
    "type" : "region",
    "start-position" : 1166,
    "end-position" : 1180,
    "concept-id" : "oDpK_oZ2_WYt",
    "matched-string" : "Region Dalarna",
    "annotation-id" : 22
  }, {
    "preferred-label" : "arbetsmiljö",
    "sentiment" : "MUST_HAVE",
    "type" : "esco-skill",
    "start-position" : 1203,
    "end-position" : 1214,
    "concept-id" : "zdQY_QJh_nUH",
    "matched-string" : "arbetsmiljö",
    "annotation-id" : 9
  }, {
    "preferred-label" : "Dalarnas län",
    "type" : "region",
    "start-position" : 1463,
    "end-position" : 1477,
    "concept-id" : "oDpK_oZ2_WYt",
    "matched-string" : "Region Dalarna",
    "annotation-id" : 23
  }, {
    "preferred-label" : "Dalarnas län",
    "type" : "region",
    "start-position" : 1569,
    "end-position" : 1583,
    "concept-id" : "oDpK_oZ2_WYt",
    "matched-string" : "Region Dalarna",
    "annotation-id" : 24
  }, {
    "preferred-label" : "Dalarnas län",
    "type" : "region",
    "start-position" : 1827,
    "end-position" : 1841,
    "concept-id" : "oDpK_oZ2_WYt",
    "matched-string" : "Region Dalarna",
    "annotation-id" : 25
  }, {
    "preferred-label" : "Dalarnas län",
    "type" : "region",
    "start-position" : 2021,
    "end-position" : 2036,
    "concept-id" : "oDpK_oZ2_WYt",
    "matched-string" : "Region Dalarnas",
    "annotation-id" : 26
  }, {
    "preferred-label" : "Dalarnas län",
    "type" : "region",
    "start-position" : 2057,
    "end-position" : 2064,
    "concept-id" : "oDpK_oZ2_WYt",
    "matched-string" : "Dalarna",
    "annotation-id" : 27
  }, {
    "preferred-label" : "Hälso- och sjukvård",
    "type" : "occupation-field",
    "start-position" : 2208,
    "end-position" : 2227,
    "concept-id" : "NYW6_mP6_vwf",
    "matched-string" : "hälso- och sjukvård",
    "annotation-id" : 28
  }, {
    "preferred-label" : "Tandvård",
    "sentiment" : "MUST_HAVE",
    "type" : "keyword",
    "start-position" : 2229,
    "end-position" : 2237,
    "concept-id" : "ba6n_RTw_PEr",
    "matched-string" : "tandvård",
    "annotation-id" : 11
  }, {
    "preferred-label" : "Kollektivtrafik",
    "sentiment" : "MUST_HAVE",
    "type" : "sni-level-4",
    "start-position" : 2251,
    "end-position" : 2266,
    "concept-id" : "XVG5_tVe_RFd",
    "matched-string" : "kollektivtrafik",
    "annotation-id" : 12
  }, {
    "preferred-label" : "Folkhögskola",
    "type" : "keyword",
    "start-position" : 2271,
    "end-position" : 2284,
    "concept-id" : "WT9H_nAT_wW7",
    "matched-string" : "folkhögskolor",
    "annotation-id" : 29
  }, {
    "preferred-label" : "Folkbildningsarbete",
    "type" : "skill",
    "start-position" : 2303,
    "end-position" : 2315,
    "concept-id" : "8V12_wQM_NWp",
    "matched-string" : "folkbildning",
    "annotation-id" : 30
  }, {
    "preferred-label" : "folkhälsa",
    "sentiment" : "MUST_HAVE",
    "type" : "esco-skill",
    "start-position" : 2328,
    "end-position" : 2337,
    "concept-id" : "jEdA_1Fe_Jji",
    "matched-string" : "folkhälsa",
    "annotation-id" : 13
  }, {
    "preferred-label" : "Dalarnas län",
    "type" : "region",
    "start-position" : 2543,
    "end-position" : 2557,
    "concept-id" : "oDpK_oZ2_WYt",
    "matched-string" : "Region Dalarna",
    "annotation-id" : 31
  } ],
  "text" : "Sjuksköterska natt/rotation Kirurgkliniken avdelning 42 Mora lasarett\nHos oss på Region Dalarna får du ett meningsfullt arbete där du kan göra skillnad. Tillsammans arbetar vi för ett hälsosamt Dalarna!\r\n\r\nARBETSBESKRIVNING\r\n\r\nVill du bli en av oss? Vi är 40 medarbetare, undersköterskor och sjuksköterskor. Nu söker vi en sjuksköterska, då en av våra medarbetare går i pension. \n\nSom sjuksköterska på kirurgkliniken får du en bred erfarenhet av olika patientgrupper och diagnoser inom kirurgi och urologi. Vi har till största delen akut verksamhet, men även planerad verksamhet. Då det mesta är akut, så är ingen dag den andra lik. Du kommer varje dag känna att du gör skillnad för patienten.\n\nDu erbjuds ett arbete där du ständigt får utvecklas. Arbetet är omväxlande och självständigt. Du får ta stort ansvar och fatta beslut kring patientens omvårdnad.\n\nTjänsten är heltid natt alternativt rotation.\n \nMöjlighet till deltid finns.\r\n\nKVALIFIKATIONER\r\n\r\nLegitimerad sjuksköterska.\n\nVi lägger stor vikt vid personlig lämplighet. Du bör ha god samarbetsförmåga och kunna anpassa dig till förändrade förutsättningar. Du har en positiv inställning till ditt arbete.\r\n\nRegion Dalarna värnar om en hälsosam arbetsmiljö för våra medarbetare samt säkra och trygga möten med medborgare, patienter, kunder och samarbetspartners. Som en del i vår rekryteringsprocess genomför vi därför drogtest innan erbjudande om anställning, samt kontrollerar ditt vaccinationsbevis då Region Dalarna har som krav att våra medarbetare ska vara vaccinerade mot covid-19. \n\nAlla anställda inom Region Dalarna som arbetar i en verksamhet där direkt och regelbunden kontakt med barn och ungdomar förekommer ska uppvisa godtagbart utdrag ur Polisens belastningsregister. Före erbjudande av anställning ska ett giltigt utdrag uppvisas i osprättat kuvert.\n\nRegion Dalarna tillämpar krigsplacering i samband med nyanställning. Detta innebär att du som arbetstagare har ett lagkrav att ta dig till ordinarie arbetsplats i händelse av högsta beredskap.\n\nRegion Dalarnas uppgift är att göra Dalarna till en ännu bättre plats att leva på. Vi har ett brett uppdrag så möjligheterna är stora att du hittar ditt drömjobb hos oss! Vi ansvarar för hälso- och sjukvård, tandvård, hjälpmedel, kollektivtrafik och folkhögskolor, samt arbetar med folkbildning, forskning, folkhälsa och kultur. Vi arbetar också med utvecklingsfrågor inom infrastruktur, näringsliv, arbetsmarknad och miljö. \n\nVår värdegrund Öppenhet, Respekt och Ansvar ska genomsyra hela vår organisation. Det ledarskap Region Dalarna strävar mot beskrivs utifrån orden: tydlighet, mod och tillit.\n\nLäs mer om hur det är att jobba hos oss på regiondalarna.se/jobb"
}