{
  "meta" : {
    "jobad" : {
      "description" : {
        "requirements" : null,
        "needs" : null,
        "company_information" : null,
        "text_formatted" : "Nu söker vi dig som vill ingå i vårt barn och ungdoms team på Södertäljes Stadsbibliotek. \nVill du ha ett omväxlande, roligt och kreativt arbete? Nästan varje dag bjuder på dynamiska möten, utmaningar och inspiration.\nÄr du öppen, orädd och energisk?\nDå passar du här hos oss!\n\nVi ser fram emot ett personligt brev där du berättar mer om dig själv, men också dina tankar kring hur du vill utveckla läsfrämjande mot främst målgruppen barn och unga.\nPå barn- och ungdomsavdelningen arbetar du tillsammans i ett team och du har ett delat ansvar över verksamheten för barn och unga. Vi strävar efter att tillsammans ge barn- och unga det bästa möjliga biblioteket. I ditt arbete ingår bland annat att förmedla litteratur och berättelser genom t.ex. visningar, programverksamhet, skyltning och läsfrämjande samtal. \nVem är du?\nFör att lyckas i tjänsten ska du vara lyhörd, ansvarsfull och driven. Du är van att ta initiativ och kan arbeta såväl självständigt som tillsammans med andra. Du verkställer planer med engagemang och följer upp samt utvärderar resultatet. Du har pedagogisk förmåga med fokus på barn och unga som målgrupp. \nDu tycker om att möta olika slags människor och mångfald är för dig en självklarhet, liksom ett gott bemötande och en hög servicenivå. Stor vikt kommer att läggas vid personlig lämplighet. \n\nKrav:\n- Bibliotekarieexamen, magisterexamen i biblioteks- och informationsvetenskap eller annan utbildning som arbetsgivaren bedömer vara likvärdig och relevant för tjänsten.\n- Du har god kännedom om och ett stort intresse för litteratur och andra kulturella uttryck för bibliotekets prioriterade målgrupper.\n- Goda kunskaper i svenska och engelska.\nMeriterande:\n- Erfarenhet av programverksamhet, särskilt riktad mot barn och unga\n- Erfarenhet av arbete på folkbibliotek.\n- Erfarenhet av book-it\n- Erfarenhet av arbete med mångfaldsperspektiv.  \n- Flerspråkighet.\nPersonliga egenskaper:\n- Du har god samarbetsförmåga och ett inkluderande arbetssätt med stark känsla för bemötande och relationsbyggande.\n- Vi ser att du på ett flexibelt sätt ser möjligheter i olika situationer och är van att ta egna initiativ för att nå resultat.\n- Du vill arbeta läsfrämjande med berättelser, litteratur och andra kulturella uttryck med fokus på målgruppens perspektiv.\n- För att lyckas i tjänsten ska du vara lyhörd, ansvarsfull och energisk.\n- Du är kreativ, nyfiken och omvärldsorienterad.\n- Du tycker om att arbeta såväl självständigt som tillsammans med andra och ser mötet med olika slags människor som en tillgång.\n- För dig är mångfald en självklarhet, liksom ett gott bemötande och en hög servicenivå.\nTjänsten är en tillsvidaretjänst.\nKvälls- och helgtjänstgöring ingår enligt schema.   \nVi erbjuder dig\n\nÅrsarbetstid, vilket innebär att du i den mån verksamheten tillåter kan styra över din egen arbetstid.   \nFriskvårdsbidrag i form av friskvårdspeng upp till 3000 kronor per år.\nMöjlighet till semesterväxling vilket innebär att du kan växla in din semesterersättning till extra lediga dagar.\nMöjlighet till utbildning och utveckling.  \nVälkommen till oss!\n\nKultur och fritidskontoret ansvarar för att det finns ett rikt kultur- och idrottsliv och ett mångsidigt fritidsutbud i Södertälje kommun. Vi ansvarar för bibliotek, kulturskola, konsthall, ung fritid, idrottsanläggningar och friluftsliv.\nBiblioteken i Södertälje består av Stadsbiblioteket med målgruppsbiblioteket TIO14, ett områdesbibliotek i Hovsjö samt kommundelsbibliotek i Enhörna, Järna, Hölö och Mölnbo. Under 2022 utökades verksamheten också med en ny bokbuss. Organisationen består av bibliotekschef, två gruppchefer med olika ansvarsområden. Sammanlagt arbetar ca 45 personer inom bibliotekens verksamhet. Läs mer: www.bibliotek.sodertalje.se\nVi tar gärna emot samtal från dig som är intresserad av jobbet men vi tackar nej till dig som säljer annonser och rekryteringstjänster.",
        "conditions" : "Heltid",
        "text" : "Nu söker vi dig som vill ingå i vårt barn och ungdoms team på Södertäljes Stadsbibliotek. \nVill du ha ett omväxlande, roligt och kreativt arbete? Nästan varje dag bjuder på dynamiska möten, utmaningar och inspiration.\nÄr du öppen, orädd och energisk?\nDå passar du här hos oss!\n\nVi ser fram emot ett personligt brev där du berättar mer om dig själv, men också dina tankar kring hur du vill utveckla läsfrämjande mot främst målgruppen barn och unga.\nPå barn- och ungdomsavdelningen arbetar du tillsammans i ett team och du har ett delat ansvar över verksamheten för barn och unga. Vi strävar efter att tillsammans ge barn- och unga det bästa möjliga biblioteket. I ditt arbete ingår bland annat att förmedla litteratur och berättelser genom t.ex. visningar, programverksamhet, skyltning och läsfrämjande samtal. \nVem är du?\nFör att lyckas i tjänsten ska du vara lyhörd, ansvarsfull och driven. Du är van att ta initiativ och kan arbeta såväl självständigt som tillsammans med andra. Du verkställer planer med engagemang och följer upp samt utvärderar resultatet. Du har pedagogisk förmåga med fokus på barn och unga som målgrupp. \nDu tycker om att möta olika slags människor och mångfald är för dig en självklarhet, liksom ett gott bemötande och en hög servicenivå. Stor vikt kommer att läggas vid personlig lämplighet. \n\nKrav:\n- Bibliotekarieexamen, magisterexamen i biblioteks- och informationsvetenskap eller annan utbildning som arbetsgivaren bedömer vara likvärdig och relevant för tjänsten.\n- Du har god kännedom om och ett stort intresse för litteratur och andra kulturella uttryck för bibliotekets prioriterade målgrupper.\n- Goda kunskaper i svenska och engelska.\nMeriterande:\n- Erfarenhet av programverksamhet, särskilt riktad mot barn och unga\n- Erfarenhet av arbete på folkbibliotek.\n- Erfarenhet av book-it\n- Erfarenhet av arbete med mångfaldsperspektiv.  \n- Flerspråkighet.\nPersonliga egenskaper:\n- Du har god samarbetsförmåga och ett inkluderande arbetssätt med stark känsla för bemötande och relationsbyggande.\n- Vi ser att du på ett flexibelt sätt ser möjligheter i olika situationer och är van att ta egna initiativ för att nå resultat.\n- Du vill arbeta läsfrämjande med berättelser, litteratur och andra kulturella uttryck med fokus på målgruppens perspektiv.\n- För att lyckas i tjänsten ska du vara lyhörd, ansvarsfull och energisk.\n- Du är kreativ, nyfiken och omvärldsorienterad.\n- Du tycker om att arbeta såväl självständigt som tillsammans med andra och ser mötet med olika slags människor som en tillgång.\n- För dig är mångfald en självklarhet, liksom ett gott bemötande och en hög servicenivå.\nTjänsten är en tillsvidaretjänst.\nKvälls- och helgtjänstgöring ingår enligt schema.   \nVi erbjuder dig\n\nÅrsarbetstid, vilket innebär att du i den mån verksamheten tillåter kan styra över din egen arbetstid.   \nFriskvårdsbidrag i form av friskvårdspeng upp till 3000 kronor per år.\nMöjlighet till semesterväxling vilket innebär att du kan växla in din semesterersättning till extra lediga dagar.\nMöjlighet till utbildning och utveckling.  \nVälkommen till oss!\n\nKultur och fritidskontoret ansvarar för att det finns ett rikt kultur- och idrottsliv och ett mångsidigt fritidsutbud i Södertälje kommun. Vi ansvarar för bibliotek, kulturskola, konsthall, ung fritid, idrottsanläggningar och friluftsliv.\nBiblioteken i Södertälje består av Stadsbiblioteket med målgruppsbiblioteket TIO14, ett områdesbibliotek i Hovsjö samt kommundelsbibliotek i Enhörna, Järna, Hölö och Mölnbo. Under 2022 utökades verksamheten också med en ny bokbuss. Organisationen består av bibliotekschef, två gruppchefer med olika ansvarsområden. Sammanlagt arbetar ca 45 personer inom bibliotekens verksamhet. Läs mer: www.bibliotek.sodertalje.se\nVi tar gärna emot samtal från dig som är intresserad av jobbet men vi tackar nej till dig som säljer annonser och rekryteringstjänster."
      },
      "headline" : "Barn och ungdomsbibliotekarie till Södertälje stadsbibliotek ",
      "driving_license" : null,
      "employer" : {
        "email" : null,
        "phone_number" : null,
        "organization_number" : "2120000159",
        "name" : "Södertälje kommun",
        "url" : null,
        "workplace" : "Södertälje kommun"
      },
      "removed_date" : null,
      "logo_url" : "https://www.arbetsformedlingen.se/rest/arbetsgivare/rest/af/v3/organisation/2120000159/logotyper/logo.png",
      "last_publication_date" : "2022-07-31T23:59:59",
      "number_of_vacancies" : 1,
      "occupation" : {
        "concept_id" : "GujS_MtW_PRH",
        "label" : "Bibliotekarie",
        "legacy_ams_taxonomy_id" : "5899"
      },
      "occupation_group" : {
        "concept_id" : "wVfo_Njx_1rB",
        "label" : "Bibliotekarier och arkivarier",
        "legacy_ams_taxonomy_id" : "2622"
      },
      "employment_type" : {
        "concept_id" : "PFZr_Syz_cUq",
        "label" : "Vanlig anställning",
        "legacy_ams_taxonomy_id" : "1"
      },
      "webpage_url" : "https://arbetsformedlingen.se/platsbanken/annonser/26298612",
      "driving_license_required" : false,
      "application_contacts" : [ {
        "description" : null,
        "email" : "hanna.ahlstrom@sodertalje.se",
        "telephone" : "08-523 016 14",
        "name" : "Hanna Ahlström",
        "contact_type" : null
      }, {
        "description" : null,
        "email" : "helena.gomer@sodertalje.se",
        "telephone" : "08-5230 2259",
        "name" : "Helena Gomér",
        "contact_type" : null
      } ],
      "duration" : {
        "concept_id" : "a7uU_j21_mkL",
        "label" : "Tills vidare",
        "legacy_ams_taxonomy_id" : "1"
      },
      "nice_to_have" : {
        "education_level" : [ ],
        "work_experiences" : [ ],
        "skills" : [ ],
        "education" : [ ],
        "languages" : [ ]
      },
      "application_details" : {
        "via_af" : false,
        "email" : null,
        "other" : null,
        "reference" : "148835",
        "url" : "https://candidate.hr-manager.net/ApplicationInit.aspx?cid=1362&ProjectId=148835&DepartmentId=18988&MediaId=4615&SkipAdvertisement=true",
        "information" : null
      },
      "source_type" : "VIA_PLATSBANKEN_DXA",
      "application_deadline" : "2022-07-31T23:59:59",
      "external_id" : "46-212000-0159-00104957",
      "workplace_address" : {
        "coordinates" : [ 17.625689, 59.195362 ],
        "city" : null,
        "postcode" : null,
        "municipality" : "Södertälje",
        "region_concept_id" : "CifL_Rzy_Mku",
        "region" : "Stockholms län",
        "country_code" : "199",
        "region_code" : "01",
        "municipality_concept_id" : "g6hK_M1o_hiU",
        "country_concept_id" : "i46j_HmG_v64",
        "municipality_code" : "0181",
        "street_address" : null,
        "country" : "Sverige"
      },
      "id" : "26298612",
      "experience_required" : true,
      "working_hours_type" : {
        "concept_id" : "6YE1_gAC_R2G",
        "label" : "Heltid",
        "legacy_ams_taxonomy_id" : "1"
      },
      "access" : null,
      "timestamp" : 1657096498141,
      "must_have" : {
        "education_level" : [ ],
        "work_experiences" : [ {
          "concept_id" : "GujS_MtW_PRH",
          "weight" : 10,
          "label" : "Bibliotekarie",
          "legacy_ams_taxonomy_id" : "5899"
        } ],
        "skills" : [ ],
        "education" : [ ],
        "languages" : [ ]
      },
      "occupation_field" : {
        "concept_id" : "9puE_nYg_crq",
        "label" : "Kultur, media, design",
        "legacy_ams_taxonomy_id" : "11"
      },
      "scope_of_work" : {
        "min" : 100,
        "max" : 100
      },
      "salary_type" : {
        "concept_id" : "oG8G_9cW_nRf",
        "label" : "Fast månads- vecko- eller timlön",
        "legacy_ams_taxonomy_id" : "1"
      },
      "removed" : false,
      "salary_description" : null,
      "access_to_own_car" : false,
      "publication_date" : "2022-07-06T10:34:58"
    },
    "name" : "Barn och ungdomsbibliotekarie till Södertälje stadsbibliotek ",
    "user" : "kristof.fischer"
  },
  "sha1" : "cbc45104db93360c457e091c7a60c2d41521be40",
  "annotations" : [ {
    "preferred-label" : "Bibliotekarie",
    "type" : "occupation-name",
    "start-position" : 0,
    "end-position" : 29,
    "concept-id" : "GujS_MtW_PRH",
    "matched-string" : "Barn och ungdomsbibliotekarie",
    "annotation-id" : 10
  }, {
    "preferred-label" : "Södertälje",
    "type" : "municipality",
    "start-position" : 35,
    "end-position" : 45,
    "concept-id" : "g6hK_M1o_hiU",
    "matched-string" : "Södertälje",
    "annotation-id" : 11
  }, {
    "preferred-label" : "arbeta som ett team",
    "sentiment" : "MUST_HAVE",
    "type" : "esco-skill",
    "start-position" : 571,
    "end-position" : 575,
    "concept-id" : "VFVZ_4YG_Ydi",
    "matched-string" : "team",
    "annotation-id" : 12
  }, {
    "preferred-label" : "visa ansvarstagande",
    "sentiment" : "MUST_HAVE",
    "type" : "esco-skill",
    "start-position" : 930,
    "end-position" : 941,
    "concept-id" : "bcRp_hxV_f5G",
    "matched-string" : "ansvarsfull",
    "annotation-id" : 13
  }, {
    "preferred-label" : "arbeta självständigt",
    "sentiment" : "MUST_HAVE",
    "type" : "esco-skill",
    "start-position" : 1002,
    "end-position" : 1015,
    "concept-id" : "NyFu_HHd_zhz",
    "matched-string" : "självständigt",
    "annotation-id" : 14
  }, {
    "preferred-label" : "samarbeta med kolleger",
    "sentiment" : "MUST_HAVE",
    "type" : "esco-skill",
    "start-position" : 1020,
    "end-position" : 1041,
    "concept-id" : "X15R_797_q62",
    "matched-string" : "tillsammans med andra",
    "annotation-id" : 15
  }, {
    "preferred-label" : "Pedagogiskt förhållningssätt",
    "sentiment" : "MUST_HAVE",
    "type" : "skill",
    "start-position" : 1130,
    "end-position" : 1148,
    "concept-id" : "qMfa_U8e_Lto",
    "matched-string" : "pedagogisk förmåga",
    "annotation-id" : 16
  }, {
    "preferred-label" : "Universitets- eller högskoleutbildning",
    "sentiment" : "MUST_HAVE",
    "type" : "sni-level-4",
    "start-position" : 1390,
    "end-position" : 1409,
    "concept-id" : "m1vC_Ssq_5Y7",
    "matched-string" : "Bibliotekarieexamen",
    "annotation-id" : 17
  }, {
    "preferred-label" : "Universitets- eller högskoleutbildning",
    "sentiment" : "MUST_HAVE",
    "type" : "sni-level-4",
    "start-position" : 1411,
    "end-position" : 1425,
    "concept-id" : "m1vC_Ssq_5Y7",
    "matched-string" : "magisterexamen",
    "annotation-id" : 18
  }, {
    "preferred-label" : "Bibliotekarieutbildning samt biblioteks- och informationsvetenskap",
    "sentiment" : "MUST_HAVE",
    "type" : "sun-education-field-4",
    "start-position" : 1428,
    "end-position" : 1465,
    "concept-id" : "FsKa_aFC_yPT",
    "matched-string" : "biblioteks- och informationsvetenskap",
    "annotation-id" : 2
  }, {
    "preferred-label" : "Litteratur",
    "sentiment" : "MUST_HAVE",
    "type" : "skill",
    "start-position" : 1609,
    "end-position" : 1619,
    "concept-id" : "nGtv_qkF_AxF",
    "matched-string" : "litteratur",
    "annotation-id" : 19
  }, {
    "preferred-label" : "Svenska",
    "sentiment" : "MUST_HAVE",
    "type" : "language",
    "start-position" : 1710,
    "end-position" : 1717,
    "concept-id" : "zSLA_vw2_FXN",
    "matched-string" : "svenska",
    "annotation-id" : 4
  }, {
    "preferred-label" : "Engelska",
    "sentiment" : "MUST_HAVE",
    "type" : "language",
    "start-position" : 1722,
    "end-position" : 1730,
    "concept-id" : "NVxJ_hLg_TYS",
    "matched-string" : "engelska",
    "annotation-id" : 5
  }, {
    "preferred-label" : "Arkiv- och biblioteksverksamhet",
    "sentiment" : "NICE_TO_HAVE",
    "type" : "skill",
    "start-position" : 1761,
    "end-position" : 1778,
    "concept-id" : "udqs_kCm_YJ6",
    "matched-string" : "programverksamhet",
    "annotation-id" : 21
  }, {
    "preferred-label" : "Barn och ungdom",
    "sentiment" : "NICE_TO_HAVE",
    "type" : "skill",
    "start-position" : 1800,
    "end-position" : 1813,
    "concept-id" : "qkyH_MC1_YKU",
    "matched-string" : "barn och unga",
    "annotation-id" : 20
  }, {
    "preferred-label" : "Arkiv- och biblioteksverksamhet",
    "sentiment" : "NICE_TO_HAVE",
    "type" : "skill",
    "start-position" : 1840,
    "end-position" : 1853,
    "concept-id" : "udqs_kCm_YJ6",
    "matched-string" : "folkbibliotek",
    "annotation-id" : 22
  }, {
    "preferred-label" : "Affärssystem, produktkunskap",
    "sentiment" : "NICE_TO_HAVE",
    "type" : "skill",
    "start-position" : 1871,
    "end-position" : 1878,
    "concept-id" : "AzHc_kX3_veu",
    "matched-string" : "book-it",
    "annotation-id" : 23
  }, {
    "preferred-label" : "stödja kulturell mångfald",
    "sentiment" : "NICE_TO_HAVE",
    "type" : "esco-skill",
    "start-position" : 1906,
    "end-position" : 1925,
    "concept-id" : "ARp9_7Lk_uhS",
    "matched-string" : "mångfaldsperspektiv",
    "annotation-id" : 24
  }, {
    "preferred-label" : "tala olika språk",
    "sentiment" : "NICE_TO_HAVE",
    "type" : "esco-skill",
    "start-position" : 1931,
    "end-position" : 1945,
    "concept-id" : "Su26_6Y5_txd",
    "matched-string" : "Flerspråkighet",
    "annotation-id" : 25
  }, {
    "preferred-label" : "samarbeta med kolleger",
    "sentiment" : "MUST_HAVE",
    "type" : "esco-skill",
    "start-position" : 1983,
    "end-position" : 1999,
    "concept-id" : "X15R_797_q62",
    "matched-string" : "samarbetsförmåga",
    "annotation-id" : 26
  }, {
    "preferred-label" : "Litteratur",
    "sentiment" : "MUST_HAVE",
    "type" : "skill",
    "start-position" : 2261,
    "end-position" : 2271,
    "concept-id" : "nGtv_qkF_AxF",
    "matched-string" : "litteratur",
    "annotation-id" : 7
  }, {
    "preferred-label" : "arbeta självständigt",
    "sentiment" : "MUST_HAVE",
    "type" : "esco-skill",
    "start-position" : 2493,
    "end-position" : 2506,
    "concept-id" : "NyFu_HHd_zhz",
    "matched-string" : "självständigt",
    "annotation-id" : 27
  }, {
    "preferred-label" : "stödja kulturell mångfald",
    "sentiment" : "MUST_HAVE",
    "type" : "esco-skill",
    "start-position" : 2603,
    "end-position" : 2611,
    "concept-id" : "ARp9_7Lk_uhS",
    "matched-string" : "mångfald",
    "annotation-id" : 28
  }, {
    "preferred-label" : "Tillsvidareanställning (inkl. eventuell provanställning)",
    "type" : "employment-type",
    "start-position" : 2694,
    "end-position" : 2711,
    "concept-id" : "kpPX_CNN_gDU",
    "matched-string" : "tillsvidaretjänst",
    "annotation-id" : 29
  } ],
  "text" : "Barn och ungdomsbibliotekarie till Södertälje stadsbibliotek \nNu söker vi dig som vill ingå i vårt barn och ungdoms team på Södertäljes Stadsbibliotek. \nVill du ha ett omväxlande, roligt och kreativt arbete? Nästan varje dag bjuder på dynamiska möten, utmaningar och inspiration.\nÄr du öppen, orädd och energisk?\nDå passar du här hos oss!\n\nVi ser fram emot ett personligt brev där du berättar mer om dig själv, men också dina tankar kring hur du vill utveckla läsfrämjande mot främst målgruppen barn och unga.\nPå barn- och ungdomsavdelningen arbetar du tillsammans i ett team och du har ett delat ansvar över verksamheten för barn och unga. Vi strävar efter att tillsammans ge barn- och unga det bästa möjliga biblioteket. I ditt arbete ingår bland annat att förmedla litteratur och berättelser genom t.ex. visningar, programverksamhet, skyltning och läsfrämjande samtal. \nVem är du?\nFör att lyckas i tjänsten ska du vara lyhörd, ansvarsfull och driven. Du är van att ta initiativ och kan arbeta såväl självständigt som tillsammans med andra. Du verkställer planer med engagemang och följer upp samt utvärderar resultatet. Du har pedagogisk förmåga med fokus på barn och unga som målgrupp. \nDu tycker om att möta olika slags människor och mångfald är för dig en självklarhet, liksom ett gott bemötande och en hög servicenivå. Stor vikt kommer att läggas vid personlig lämplighet. \n\nKrav:\n- Bibliotekarieexamen, magisterexamen i biblioteks- och informationsvetenskap eller annan utbildning som arbetsgivaren bedömer vara likvärdig och relevant för tjänsten.\n- Du har god kännedom om och ett stort intresse för litteratur och andra kulturella uttryck för bibliotekets prioriterade målgrupper.\n- Goda kunskaper i svenska och engelska.\nMeriterande:\n- Erfarenhet av programverksamhet, särskilt riktad mot barn och unga\n- Erfarenhet av arbete på folkbibliotek.\n- Erfarenhet av book-it\n- Erfarenhet av arbete med mångfaldsperspektiv.  \n- Flerspråkighet.\nPersonliga egenskaper:\n- Du har god samarbetsförmåga och ett inkluderande arbetssätt med stark känsla för bemötande och relationsbyggande.\n- Vi ser att du på ett flexibelt sätt ser möjligheter i olika situationer och är van att ta egna initiativ för att nå resultat.\n- Du vill arbeta läsfrämjande med berättelser, litteratur och andra kulturella uttryck med fokus på målgruppens perspektiv.\n- För att lyckas i tjänsten ska du vara lyhörd, ansvarsfull och energisk.\n- Du är kreativ, nyfiken och omvärldsorienterad.\n- Du tycker om att arbeta såväl självständigt som tillsammans med andra och ser mötet med olika slags människor som en tillgång.\n- För dig är mångfald en självklarhet, liksom ett gott bemötande och en hög servicenivå.\nTjänsten är en tillsvidaretjänst.\nKvälls- och helgtjänstgöring ingår enligt schema.   \nVi erbjuder dig\n\nÅrsarbetstid, vilket innebär att du i den mån verksamheten tillåter kan styra över din egen arbetstid.   \nFriskvårdsbidrag i form av friskvårdspeng upp till 3000 kronor per år.\nMöjlighet till semesterväxling vilket innebär att du kan växla in din semesterersättning till extra lediga dagar.\nMöjlighet till utbildning och utveckling.  \nVälkommen till oss!\n\nKultur och fritidskontoret ansvarar för att det finns ett rikt kultur- och idrottsliv och ett mångsidigt fritidsutbud i Södertälje kommun. Vi ansvarar för bibliotek, kulturskola, konsthall, ung fritid, idrottsanläggningar och friluftsliv.\nBiblioteken i Södertälje består av Stadsbiblioteket med målgruppsbiblioteket TIO14, ett områdesbibliotek i Hovsjö samt kommundelsbibliotek i Enhörna, Järna, Hölö och Mölnbo. Under 2022 utökades verksamheten också med en ny bokbuss. Organisationen består av bibliotekschef, två gruppchefer med olika ansvarsområden. Sammanlagt arbetar ca 45 personer inom bibliotekens verksamhet. Läs mer: www.bibliotek.sodertalje.se\nVi tar gärna emot samtal från dig som är intresserad av jobbet men vi tackar nej till dig som säljer annonser och rekryteringstjänster."
}