{
  "meta" : {
    "dataset-id" : "myh-spreadsheet-2021",
    "type" : "education-description",
    "dataset-document-id" : "YH01460",
    "user" : "kristof.fischer"
  },
  "sha1" : "31bce9c41b9af76efcb5708b77e8f2e4b5ef5d13",
  "annotations" : [ {
    "preferred-label" : "Systemutvecklare/Programmerare",
    "sentiment" : "OFFERED",
    "type" : "occupation-name",
    "start-position" : 85,
    "end-position" : 95,
    "concept-id" : "fg7B_yov_smw",
    "matched-string" : "utvecklare",
    "annotation-id" : 1
  }, {
    "preferred-label" : "SharePoint (MOSS), publicerings- och portalverktyg",
    "sentiment" : "OFFERED",
    "type" : "skill",
    "start-position" : 166,
    "end-position" : 176,
    "concept-id" : "8bXt_tci_RGE",
    "matched-string" : "SharePoint",
    "annotation-id" : 2
  }, {
    "preferred-label" : null,
    "sentiment" : "OFFERED",
    "type" : "skill",
    "start-position" : 178,
    "end-position" : 183,
    "concept-id" : null,
    "matched-string" : "Teams",
    "annotation-id" : 3
  }, {
    "preferred-label" : null,
    "sentiment" : "OFFERED",
    "type" : "skill",
    "start-position" : 188,
    "end-position" : 203,
    "concept-id" : null,
    "matched-string" : "Power platforms",
    "annotation-id" : 4
  }, {
    "preferred-label" : "arbeta som ett team",
    "sentiment" : "OFFERED",
    "type" : "esco-skill",
    "start-position" : 210,
    "end-position" : 243,
    "concept-id" : "VFVZ_4YG_Ydi",
    "matched-string" : "arbetar du tillsammans i ett team",
    "annotation-id" : 5
  }, {
    "preferred-label" : "Systemutveckling",
    "sentiment" : "OFFERED",
    "type" : "skill",
    "start-position" : 251,
    "end-position" : 260,
    "concept-id" : "D7Ns_RG6_hD2",
    "matched-string" : "utvecklar",
    "annotation-id" : 6
  }, {
    "preferred-label" : "produktkunskap",
    "sentiment" : "OFFERED",
    "type" : "esco-skill",
    "start-position" : 379,
    "end-position" : 416,
    "concept-id" : "FC5o_4w6_cLJ",
    "matched-string" : "hur Microsofts applikationer fungerar",
    "annotation-id" : 7
  }, {
    "preferred-label" : "föreslå IT-lösningar för företagsproblem",
    "sentiment" : "OFFERED",
    "type" : "esco-skill",
    "start-position" : 432,
    "end-position" : 494,
    "concept-id" : "26yA_kX2_R1B",
    "matched-string" : "hjälpa företag att få ut det bästa av deras digitala lösningar",
    "annotation-id" : 8
  }, {
    "preferred-label" : "Teknisk rådgivning",
    "sentiment" : "OFFERED",
    "type" : "skill",
    "start-position" : 689,
    "end-position" : 720,
    "concept-id" : "jT7b_EUq_z3A",
    "matched-string" : "arbete i en mer rådgivande roll",
    "annotation-id" : 9
  }, {
    "preferred-label" : "Produktutveckling",
    "sentiment" : "OFFERED",
    "type" : "skill",
    "start-position" : 831,
    "end-position" : 881,
    "concept-id" : "uwev_L2n_fpz",
    "matched-string" : "förvaltar och utvecklar redan befintliga lösningar",
    "annotation-id" : 10
  } ],
  "text" : "Microsoft erbjuder idag ett stort antal applikationer och molnbaserade tjänster. Som utvecklare inom Microsoft 365 har du spetskompetens inom dessa produkter så som; SharePoint, Teams och Power platforms. Ofta arbetar du tillsammans i ett team där ni utvecklar och anpassar Microsoft's applikationer för att skapa ännu mer nytta för slutkunden.     Under utbildningen lär du dig hur Microsofts applikationer fungerar och hur du kan hjälpa företag att få ut det bästa av deras digitala lösningar.     Kompetens inom just Microsoft 365 är extremt efterfrågad i branschen, inte minst det senaste året har efterfrågan ökat ordentligt. Dina kunskaper efter utbildningen gör att du antingen kan arbete i en mer rådgivande roll, där implementering och utveckling hamnar i fokus. Eller så kan du istället välja att arbeta i en roll där du förvaltar och utvecklar redan befintliga lösningar.     Läs mer om utbildningen på:  https://www.ecutbildning.se/utbildningar/mjukvarutestare"
}