{
  "meta" : {
    "jobad" : {
      "description" : {
        "requirements" : null,
        "needs" : null,
        "company_information" : null,
        "text_formatted" : "<p>Hejsan! Nu söker vi en duktig kock, alternativt köksbiträde som har kunskapen inom köket. Du får gärna kunna husmanskost och Ala carte.</p><p id=\"oppenforalla\">Öppen för alla\nVi fokuserar på din kompetens, inte dina övriga förutsättningar. Vi är öppna för att anpassa rollen eller arbetsplatsen efter dina behov.</p>",
        "conditions" : null,
        "text" : "Hejsan! Nu söker vi en duktig kock, alternativt köksbiträde som har kunskapen inom köket. Du får gärna kunna husmanskost och Ala carte.\nÖppen för alla\nVi fokuserar på din kompetens, inte dina övriga förutsättningar. Vi är öppna för att anpassa rollen eller arbetsplatsen efter dina behov."
      },
      "headline" : "Kock/pizzabagare/köksbiträde/servitör",
      "driving_license" : null,
      "employer" : {
        "email" : null,
        "phone_number" : null,
        "organization_number" : "5592048556",
        "name" : "Kronan i Värmland AB",
        "url" : null,
        "workplace" : "Kronan i Värmland AB"
      },
      "removed_date" : null,
      "logo_url" : null,
      "last_publication_date" : "2022-09-03T00:00:00",
      "number_of_vacancies" : 1,
      "occupation" : {
        "concept_id" : "JbJw_as4_S93",
        "label" : "Kock, à la carte",
        "legacy_ams_taxonomy_id" : "7663"
      },
      "occupation_group" : {
        "concept_id" : "BStc_SJh_DKG",
        "label" : "Kockar och kallskänkor",
        "legacy_ams_taxonomy_id" : "5120"
      },
      "employment_type" : {
        "concept_id" : "PFZr_Syz_cUq",
        "label" : "Vanlig anställning",
        "legacy_ams_taxonomy_id" : "1"
      },
      "webpage_url" : "https://arbetsformedlingen.se/platsbanken/annonser/26379072",
      "driving_license_required" : false,
      "application_contacts" : [ {
        "description" : null,
        "email" : "fotball_Ahmed@live.se",
        "telephone" : "0729644705",
        "name" : "Ahmed Bachalan",
        "contact_type" : "Chef"
      } ],
      "duration" : {
        "concept_id" : "a7uU_j21_mkL",
        "label" : "Tills vidare",
        "legacy_ams_taxonomy_id" : "1"
      },
      "nice_to_have" : {
        "education_level" : [ ],
        "work_experiences" : [ ],
        "skills" : [ ],
        "education" : [ ],
        "languages" : [ {
          "concept_id" : "zSLA_vw2_FXN",
          "weight" : 5,
          "label" : "Svenska",
          "legacy_ams_taxonomy_id" : "502"
        }, {
          "concept_id" : "NVxJ_hLg_TYS",
          "weight" : 5,
          "label" : "Engelska",
          "legacy_ams_taxonomy_id" : "283"
        }, {
          "concept_id" : "3iEY_RGP_qXq",
          "weight" : 5,
          "label" : "Arabiska",
          "legacy_ams_taxonomy_id" : "247"
        } ]
      },
      "application_details" : {
        "via_af" : false,
        "email" : "Mohbadjalan@gmail.com",
        "other" : null,
        "reference" : "Arbetssökande",
        "url" : null,
        "information" : null
      },
      "source_type" : "VIA_ANNONSERA",
      "application_deadline" : "2022-09-03T00:00:00",
      "external_id" : null,
      "workplace_address" : {
        "coordinates" : [ 13.69976424563045, 60.031507319027014 ],
        "city" : "Hagfors",
        "postcode" : "68330",
        "municipality" : "Hagfors",
        "region_concept_id" : "EVVp_h6U_GSZ",
        "region" : "Värmlands län",
        "country_code" : "199",
        "region_code" : "17",
        "municipality_concept_id" : "qk9a_g5U_sAH",
        "country_concept_id" : "i46j_HmG_v64",
        "municipality_code" : "1783",
        "street_address" : "Kyrkogatan 6",
        "country" : "Sverige"
      },
      "id" : "26379072",
      "experience_required" : true,
      "working_hours_type" : {
        "concept_id" : "6YE1_gAC_R2G",
        "label" : "Heltid",
        "legacy_ams_taxonomy_id" : "1"
      },
      "access" : null,
      "timestamp" : 1659627765270,
      "must_have" : {
        "education_level" : [ ],
        "work_experiences" : [ {
          "concept_id" : "JbJw_as4_S93",
          "weight" : 10,
          "label" : "Kock, à la carte",
          "legacy_ams_taxonomy_id" : "7663"
        } ],
        "skills" : [ ],
        "education" : [ ],
        "languages" : [ ]
      },
      "occupation_field" : {
        "concept_id" : "ScKy_FHB_7wT",
        "label" : "Hotell, restaurang, storhushåll",
        "legacy_ams_taxonomy_id" : "7"
      },
      "scope_of_work" : {
        "min" : 0,
        "max" : 100
      },
      "salary_type" : {
        "concept_id" : "oG8G_9cW_nRf",
        "label" : "Fast månads- vecko- eller timlön",
        "legacy_ams_taxonomy_id" : "1"
      },
      "removed" : false,
      "salary_description" : null,
      "access_to_own_car" : false,
      "publication_date" : "2022-08-04T17:42:45"
    },
    "name" : "Kock/pizzabagare/köksbiträde/servitör",
    "user" : "hannes"
  },
  "sha1" : "58242bb026e53643f7cf954093fc8f646215d6f1",
  "annotations" : [ {
    "preferred-label" : "kock",
    "sentiment" : "MUST_HAVE",
    "type" : "esco-occupation",
    "start-position" : 0,
    "end-position" : 4,
    "concept-id" : "Ti2H_QoQ_EMX",
    "matched-string" : "kock",
    "annotation-id" : 0
  }, {
    "preferred-label" : "Pizzabagare",
    "sentiment" : "MUST_HAVE",
    "type" : "forecast-occupation",
    "start-position" : 5,
    "end-position" : 16,
    "concept-id" : "SyvN_uBW_USt",
    "matched-string" : "pizzabagare",
    "annotation-id" : 1
  }, {
    "preferred-label" : "Köksbiträde",
    "sentiment" : "MUST_HAVE",
    "type" : "occupation-name",
    "start-position" : 17,
    "end-position" : 28,
    "concept-id" : "oRB5_b7i_Qzv",
    "matched-string" : "köksbiträde",
    "annotation-id" : 2
  }, {
    "preferred-label" : "Servitör/Servitris",
    "sentiment" : "MUST_HAVE",
    "type" : "occupation-name",
    "start-position" : 29,
    "end-position" : 37,
    "concept-id" : "rGGf_KLs_To7",
    "matched-string" : "servitör",
    "annotation-id" : 3
  }, {
    "preferred-label" : "kock",
    "sentiment" : "MUST_HAVE",
    "type" : "esco-occupation",
    "start-position" : 68,
    "end-position" : 72,
    "concept-id" : "Ti2H_QoQ_EMX",
    "matched-string" : "kock",
    "annotation-id" : 4
  }, {
    "preferred-label" : "Köksbiträde",
    "sentiment" : "MUST_HAVE",
    "type" : "occupation-name",
    "start-position" : 86,
    "end-position" : 97,
    "concept-id" : "oRB5_b7i_Qzv",
    "matched-string" : "köksbiträde",
    "annotation-id" : 5
  }, {
    "preferred-label" : "Husmanskost",
    "sentiment" : "MUST_HAVE",
    "type" : "skill",
    "start-position" : 147,
    "end-position" : 158,
    "concept-id" : "HfAs_ZWA_Jvv",
    "matched-string" : "husmanskost",
    "annotation-id" : 6
  }, {
    "preferred-label" : "A la carte",
    "type" : "skill",
    "start-position" : 163,
    "end-position" : 172,
    "concept-id" : "Bb4Q_Vou_pbq",
    "matched-string" : "Ala carte",
    "annotation-id" : 7
  } ],
  "text" : "Kock/pizzabagare/köksbiträde/servitör\nHejsan! Nu söker vi en duktig kock, alternativt köksbiträde som har kunskapen inom köket. Du får gärna kunna husmanskost och Ala carte.\nÖppen för alla\nVi fokuserar på din kompetens, inte dina övriga förutsättningar. Vi är öppna för att anpassa rollen eller arbetsplatsen efter dina behov."
}