{
  "meta" : {
    "jobad" : {
      "description" : {
        "requirements" : null,
        "needs" : null,
        "company_information" : null,
        "text_formatted" : "<em>Skräddarsy ditt jobb! Hos oss på Centric Care hjälper vi dig att hitta ditt drömjobb oavsett om det gäller arbete nära eller långt håll, korta som långa uppdrag. Trygga villkor och bra lön ingår! Bemanning behöver inte vara krångligt. <a href=\"mailto:banu.tumer@centric.eu?subject=Uppdrag%20som%20IVAsk%C3%B6terska%20till%20AVA%20i%20Oskarshamn%20\">Kontakta oss redan idag så berättar vi mer!</a> </em><br><br><strong>OM UPPDRAGET</strong><br>Är du legitimerad Röntgensjuksköterska och söker fortfarande efter nya spännande utmaningar i sommar? Då kan du vara den vi söker till ett bemanningsuppdrag i Kalmar! <br><br>För vår kunds räkning söker vi nu dig som är legitimerad röntgensjuksköterska med erfarenhet av CT eller MR till röntgen i Kalmar. Till uppdraget söker vi dig som är tillgänglig under perioden v.28 till och med v.31. Schemat är på heltid dag, men kvälls- och jourtjänstgöring kan komma att bli aktuellt. Oavsett om du kan hela perioden eller endast delar är du varmt välkommen med din ansökan! <br> <br><strong>DINA ARBETSUPPGIFTER</strong><br>Sedvanliga arbetsuppgifter för sjuksköterska på enhet med inriktning mot röntgen.<br> <br><strong>DIN PROFIL</strong><br>Du är legitimerad röntgensjuksköterska och har minst 2 års dokumenterad yrkeserfarenhet.<br>Du har erfarenhet av att jobba i SECTRA RIS/PACS samt erfarenhet från Siemens utrustning på MR och CT.<p><br><strong>ATT ARBETA SOM BEMANNINGSSJUKSKÖTERSKA </strong><br>Hos oss får du ett välplanerat äventyr eller större flexibilitet på hemmaplan. Du väljer själv! Möjligheterna är många och du kommer att få bra betalt i både lönekuvertet och på ditt pensionskonto. Vi lovar aldrig mer än vad vi kan hålla och du och din personliga konsultchef har tät kontakt under hela uppdragets gång. </p>Vem passar som bemanningssjuksköterska? Du som är självständig i ditt arbete och trygg i din profession samt mån om både kvalitet och patientsäkerhet. Du har god samarbetsförmåga då arbetet sker i team runt patienten samt  kan anpassa ditt bemötande och förhållningssätt utifrån individ och situation. Om den här beskrivningen passar in på dig så tror vi att du kommer att trivas bra i rollen som bemanningssjuksköterska. <br><br>Vi på Centric Care tror på ärlighet, transparens och personlig service. Tillsammans gör vi vården bättre, med oss är du trygg.<br> <p><strong>OM CENTRIC CARE </strong><br>Centric Care har bemannat hälso- och sjukvård sedan år 2000. Vi kan branschen och många som jobbar internt hos oss har en sjukvårdsutbildning i botten. Centric Care är ett auktoriserat bemanningsbolag och är medlem i Almega Kompetensföretagarna. Auktorisationen betyder att Centric Care lever upp till svensk lagstiftning och de etiska branschkrav som Almega ställer. Auktorisationen är en kvalitetsstämpel både för våra medarbetare, underleverantörer och kunder. </p><br>Centric Care har kollektivavtal för alla våra anställda. Det betyder att vi erbjuder trygga arbetsvillkor utöver vad lagstiftningen kräver. Alla anställda hos oss omfattas av försäkringar, extra hög semesterersättning och tjänstepension enligt <a href=\"https://www.minpension.se/allt-om-pensioner/pension-for-nyborjare/om-itp\">ITP</a>. Som anställd hos oss får du dessutom tillgång till ett förmånligt friskvårdbidrag, årlig HLR-utbildning och mycket mer.  <br><br>Nyfiken på att veta mer? Sökt tjänsten eller gör en intresseanmälan så tar en av våra erfarna konsultchefer kontakt med dig.<br><br>Välkommen!<br><br><a href=\"https://www.instagram.com/centric_care/\"><img alt=\"\" src=\"https://share.recman.no/file.php?id=53744_312_f71728f56a6d119c3b22e96e0bba9625f3b1f3bd133f719a58d9ee5c5199d4a485467bd46bc407b97cfbb274dc7def50747c01d8c809327468c2837fbe40c81fc2f7559db6fb1af879e3f9sub_id=312\" /></a><br><br><a href=\"https://www.instagram.com/centric_care/\"><img alt=\"\" src=\"https://share.recman.no/file.php?id=53758_312_77b59d7ccc4e286c980cf07710469d2feaefb3dc721db5c9084d3a876ff6bf8f3d139b93bb870bade9852de2565205c41b4943f8b130efbbe6f9c2531018b1906f3141c0b2c4c42cb6e3fe7fsub_id=312\" /></a><a href=\"https://sv-se.facebook.com/CentricCare/\"><img alt=\"\" src=\"https://share.recman.no/file.php?id=53757_312_eaca99060bdebb4adaadb6297f5e77fa9bbcbd3af3118946a516df08fd2550b6bf3dfae4e6d87b9331b993379823035c69a52a930fc209f5fecf398699cd452c85d13e00a0e6aa7d8ca11esub_id=312\" /></a><a href=\"https://www.linkedin.com/company/centric-care-sweden/mycompany/\"><img alt=\"\" src=\"https://share.recman.no/file.php?id=53759_312_f2794e29801ac3deb3ca9425c4bf2d3a70a7ad930765cffa505eb01e03c916c65787b11f5b0abf42261653bcdd26bd9f40b120f90a0d0f13eaf6678c257f117c0116374349dc71df1asub_id=312\" /></a>",
        "conditions" : null,
        "text" : "Skräddarsy ditt jobb! Hos oss på Centric Care hjälper vi dig att hitta ditt drömjobb oavsett om det gäller arbete nära eller långt håll, korta som långa uppdrag. Trygga villkor och bra lön ingår! Bemanning behöver inte vara krångligt. Kontakta oss redan idag så berättar vi mer! \n\nOM UPPDRAGET\nÄr du legitimerad Röntgensjuksköterska och söker fortfarande efter nya spännande utmaningar i sommar? Då kan du vara den vi söker till ett bemanningsuppdrag i Kalmar! \n\nFör vår kunds räkning söker vi nu dig som är legitimerad röntgensjuksköterska med erfarenhet av CT eller MR till röntgen i Kalmar. Till uppdraget söker vi dig som är tillgänglig under perioden v.28 till och med v.31. Schemat är på heltid dag, men kvälls- och jourtjänstgöring kan komma att bli aktuellt. Oavsett om du kan hela perioden eller endast delar är du varmt välkommen med din ansökan! \n \nDINA ARBETSUPPGIFTER\nSedvanliga arbetsuppgifter för sjuksköterska på enhet med inriktning mot röntgen.\n \nDIN PROFIL\nDu är legitimerad röntgensjuksköterska och har minst 2 års dokumenterad yrkeserfarenhet.\nDu har erfarenhet av att jobba i SECTRA RIS/PACS samt erfarenhet från Siemens utrustning på MR och CT.\n\nATT ARBETA SOM BEMANNINGSSJUKSKÖTERSKA \nHos oss får du ett välplanerat äventyr eller större flexibilitet på hemmaplan. Du väljer själv! Möjligheterna är många och du kommer att få bra betalt i både lönekuvertet och på ditt pensionskonto. Vi lovar aldrig mer än vad vi kan hålla och du och din personliga konsultchef har tät kontakt under hela uppdragets gång. \nVem passar som bemanningssjuksköterska? Du som är självständig i ditt arbete och trygg i din profession samt mån om både kvalitet och patientsäkerhet. Du har god samarbetsförmåga då arbetet sker i team runt patienten samt  kan anpassa ditt bemötande och förhållningssätt utifrån individ och situation. Om den här beskrivningen passar in på dig så tror vi att du kommer att trivas bra i rollen som bemanningssjuksköterska. \n\nVi på Centric Care tror på ärlighet, transparens och personlig service. Tillsammans gör vi vården bättre, med oss är du trygg.\n \nOM CENTRIC CARE \nCentric Care har bemannat hälso- och sjukvård sedan år 2000. Vi kan branschen och många som jobbar internt hos oss har en sjukvårdsutbildning i botten. Centric Care är ett auktoriserat bemanningsbolag och är medlem i Almega Kompetensföretagarna. Auktorisationen betyder att Centric Care lever upp till svensk lagstiftning och de etiska branschkrav som Almega ställer. Auktorisationen är en kvalitetsstämpel både för våra medarbetare, underleverantörer och kunder. \n\nCentric Care har kollektivavtal för alla våra anställda. Det betyder att vi erbjuder trygga arbetsvillkor utöver vad lagstiftningen kräver. Alla anställda hos oss omfattas av försäkringar, extra hög semesterersättning och tjänstepension enligt ITP. Som anställd hos oss får du dessutom tillgång till ett förmånligt friskvårdbidrag, årlig HLR-utbildning och mycket mer.  \n\nNyfiken på att veta mer? Sökt tjänsten eller gör en intresseanmälan så tar en av våra erfarna konsultchefer kontakt med dig.\n\nVälkommen!"
      },
      "headline" : "Röntgensjuksköterska till mottagning i sydöstra Sverige",
      "driving_license" : null,
      "employer" : {
        "email" : null,
        "phone_number" : null,
        "organization_number" : "5565963351",
        "name" : "Centric Care AB",
        "url" : "https://centriccare.eu",
        "workplace" : "Centric Care AB"
      },
      "removed_date" : null,
      "logo_url" : "https://www.arbetsformedlingen.se/rest/arbetsgivare/rest/af/v3/organisation/5565963351/logotyper/logo.png",
      "last_publication_date" : "2022-08-31T23:59:59",
      "number_of_vacancies" : 1,
      "occupation" : {
        "concept_id" : "ztEq_Vts_77r",
        "label" : "Röntgensjuksköterska",
        "legacy_ams_taxonomy_id" : "5784"
      },
      "occupation_group" : {
        "concept_id" : "1tGC_fXC_mxX",
        "label" : "Röntgensjuksköterskor",
        "legacy_ams_taxonomy_id" : "2235"
      },
      "employment_type" : {
        "concept_id" : "PFZr_Syz_cUq",
        "label" : "Vanlig anställning",
        "legacy_ams_taxonomy_id" : "1"
      },
      "webpage_url" : "https://arbetsformedlingen.se/platsbanken/annonser/26295399",
      "driving_license_required" : false,
      "application_contacts" : [ {
        "description" : "Banu Tümer",
        "email" : "banu.tumer@centric.eu",
        "telephone" : null,
        "name" : null,
        "contact_type" : null
      } ],
      "duration" : {
        "concept_id" : "Xj7x_7yZ_jEn",
        "label" : "3 månader – upp till 6 månader",
        "legacy_ams_taxonomy_id" : "3"
      },
      "nice_to_have" : {
        "education_level" : [ ],
        "work_experiences" : [ ],
        "skills" : [ ],
        "education" : [ ],
        "languages" : [ ]
      },
      "application_details" : {
        "via_af" : false,
        "email" : null,
        "other" : null,
        "reference" : null,
        "url" : "https://apply.recman.no/job_post.php?id=284877&path=ams&sub_id=312",
        "information" : null
      },
      "source_type" : "VIA_PLATSBANKEN_DXA",
      "application_deadline" : "2022-08-31T23:59:59",
      "external_id" : "46-556596-3351-28487762c424c1d8e30",
      "workplace_address" : {
        "coordinates" : [ 16.35678, 56.663445 ],
        "city" : null,
        "postcode" : null,
        "municipality" : "Kalmar",
        "region_concept_id" : "9QUH_2bb_6Np",
        "region" : "Kalmar län",
        "country_code" : "199",
        "region_code" : "08",
        "municipality_concept_id" : "Pnmg_SgP_uHQ",
        "country_concept_id" : "i46j_HmG_v64",
        "municipality_code" : "0880",
        "street_address" : null,
        "country" : "Sverige"
      },
      "id" : "26295399",
      "experience_required" : true,
      "working_hours_type" : {
        "concept_id" : "6YE1_gAC_R2G",
        "label" : "Heltid",
        "legacy_ams_taxonomy_id" : "1"
      },
      "access" : null,
      "timestamp" : 1657021668246,
      "must_have" : {
        "education_level" : [ ],
        "work_experiences" : [ {
          "concept_id" : "ztEq_Vts_77r",
          "weight" : 10,
          "label" : "Röntgensjuksköterska",
          "legacy_ams_taxonomy_id" : "5784"
        } ],
        "skills" : [ ],
        "education" : [ ],
        "languages" : [ ]
      },
      "occupation_field" : {
        "concept_id" : "NYW6_mP6_vwf",
        "label" : "Hälso- och sjukvård",
        "legacy_ams_taxonomy_id" : "8"
      },
      "scope_of_work" : {
        "min" : 100,
        "max" : 100
      },
      "salary_type" : {
        "concept_id" : "oG8G_9cW_nRf",
        "label" : "Fast månads- vecko- eller timlön",
        "legacy_ams_taxonomy_id" : "1"
      },
      "removed" : false,
      "salary_description" : null,
      "access_to_own_car" : false,
      "publication_date" : "2022-07-05T13:47:19"
    },
    "name" : "Röntgensjuksköterska till mottagning i sydöstra Sverige",
    "user" : "kristof.fischer"
  },
  "sha1" : "bbbad8f2c6a6d78b4e47de0af9a770553e99f3f8",
  "annotations" : [ {
    "preferred-label" : "Röntgensjuksköterska",
    "sentiment" : "MUST_HAVE",
    "type" : "occupation-name",
    "start-position" : 0,
    "end-position" : 20,
    "concept-id" : "ztEq_Vts_77r",
    "matched-string" : "röntgensjuksköterska",
    "annotation-id" : 0
  }, {
    "preferred-label" : "Vårdavdelning/Mottagning",
    "sentiment" : "MUST_HAVE",
    "type" : "skill",
    "start-position" : 26,
    "end-position" : 36,
    "concept-id" : "TuUX_3Jo_wyq",
    "matched-string" : "mottagning",
    "annotation-id" : 1
  }, {
    "preferred-label" : "Sverige",
    "type" : "country",
    "start-position" : 48,
    "end-position" : 55,
    "concept-id" : "i46j_HmG_v64",
    "matched-string" : "Sverige",
    "annotation-id" : 12
  }, {
    "preferred-label" : "Röntgensjuksköterska",
    "sentiment" : "MUST_HAVE",
    "type" : "occupation-name",
    "start-position" : 368,
    "end-position" : 388,
    "concept-id" : "ztEq_Vts_77r",
    "matched-string" : "röntgensjuksköterska",
    "annotation-id" : 2
  }, {
    "preferred-label" : "Kalmar",
    "type" : "municipality",
    "start-position" : 509,
    "end-position" : 515,
    "concept-id" : "Pnmg_SgP_uHQ",
    "matched-string" : "Kalmar",
    "annotation-id" : 13
  }, {
    "preferred-label" : "Röntgensjuksköterska",
    "sentiment" : "MUST_HAVE",
    "type" : "occupation-name",
    "start-position" : 576,
    "end-position" : 596,
    "concept-id" : "ztEq_Vts_77r",
    "matched-string" : "röntgensjuksköterska",
    "annotation-id" : 3
  }, {
    "preferred-label" : "PET/CT",
    "sentiment" : "MUST_HAVE",
    "type" : "skill",
    "start-position" : 615,
    "end-position" : 617,
    "concept-id" : "Wv7A_env_1X7",
    "matched-string" : "ct",
    "annotation-id" : 4
  }, {
    "preferred-label" : "Magnetisk resonanstomografi/MRT",
    "sentiment" : "MUST_HAVE",
    "type" : "skill",
    "start-position" : 624,
    "end-position" : 626,
    "concept-id" : "3V84_7u9_kSN",
    "matched-string" : "MR",
    "annotation-id" : 14
  }, {
    "preferred-label" : "Kalmar",
    "type" : "municipality",
    "start-position" : 642,
    "end-position" : 648,
    "concept-id" : "Pnmg_SgP_uHQ",
    "matched-string" : "Kalmar",
    "annotation-id" : 15
  }, {
    "preferred-label" : "Heltid",
    "type" : "worktime-extent",
    "start-position" : 750,
    "end-position" : 756,
    "concept-id" : "6YE1_gAC_R2G",
    "matched-string" : "heltid",
    "annotation-id" : 16
  }, {
    "preferred-label" : "Röntgensjuksköterska",
    "sentiment" : "MUST_HAVE",
    "type" : "occupation-name",
    "start-position" : 968,
    "end-position" : 981,
    "concept-id" : "ztEq_Vts_77r",
    "matched-string" : "sjuksköterska",
    "annotation-id" : 5
  }, {
    "preferred-label" : "Röntgensjuksköterska",
    "sentiment" : "MUST_HAVE",
    "type" : "occupation-name",
    "start-position" : 1050,
    "end-position" : 1070,
    "concept-id" : "ztEq_Vts_77r",
    "matched-string" : "röntgensjuksköterska",
    "annotation-id" : 6
  }, {
    "preferred-label" : "2-4 års erfarenhet",
    "sentiment" : "MUST_HAVE",
    "type" : "occupation-experience-year",
    "start-position" : 1079,
    "end-position" : 1119,
    "concept-id" : "RWA2_uu6_udD",
    "matched-string" : "minst 2 års dokumenterad yrkeserfarenhet",
    "annotation-id" : 17
  }, {
    "preferred-label" : null,
    "sentiment" : "MUST_HAVE",
    "type" : "skill",
    "start-position" : 1154,
    "end-position" : 1164,
    "concept-id" : null,
    "matched-string" : "SECTRA RIS",
    "annotation-id" : 18
  }, {
    "preferred-label" : null,
    "sentiment" : "MUST_HAVE",
    "type" : "skill",
    "start-position" : 1165,
    "end-position" : 1169,
    "concept-id" : null,
    "matched-string" : "PACS",
    "annotation-id" : 19
  }, {
    "preferred-label" : "Magnetisk resonanstomografi/MRT",
    "sentiment" : "MUST_HAVE",
    "type" : "skill",
    "start-position" : 1213,
    "end-position" : 1215,
    "concept-id" : "3V84_7u9_kSN",
    "matched-string" : "MR",
    "annotation-id" : 20
  }, {
    "preferred-label" : "PET/CT",
    "sentiment" : "MUST_HAVE",
    "type" : "skill",
    "start-position" : 1220,
    "end-position" : 1222,
    "concept-id" : "Wv7A_env_1X7",
    "matched-string" : "ct",
    "annotation-id" : 7
  }, {
    "preferred-label" : "Bemanningssjuksköterska",
    "sentiment" : "MUST_HAVE",
    "type" : "keyword",
    "start-position" : 1601,
    "end-position" : 1624,
    "concept-id" : "KJLV_h2y_PG9",
    "matched-string" : "bemanningssjuksköterska",
    "annotation-id" : 8
  }, {
    "preferred-label" : "arbeta självständigt",
    "sentiment" : "MUST_HAVE",
    "type" : "esco-skill",
    "start-position" : 1636,
    "end-position" : 1662,
    "concept-id" : "NyFu_HHd_zhz",
    "matched-string" : "självständig i ditt arbete",
    "annotation-id" : 21
  }, {
    "preferred-label" : "samarbeta med kolleger",
    "sentiment" : "MUST_HAVE",
    "type" : "esco-skill",
    "start-position" : 1748,
    "end-position" : 1764,
    "concept-id" : "X15R_797_q62",
    "matched-string" : "samarbetsförmåga",
    "annotation-id" : 22
  }, {
    "preferred-label" : "Bemanningssjuksköterska",
    "sentiment" : "MUST_HAVE",
    "type" : "keyword",
    "start-position" : 1983,
    "end-position" : 2006,
    "concept-id" : "KJLV_h2y_PG9",
    "matched-string" : "bemanningssjuksköterska",
    "annotation-id" : 9
  } ],
  "text" : "Röntgensjuksköterska till mottagning i sydöstra Sverige\nSkräddarsy ditt jobb! Hos oss på Centric Care hjälper vi dig att hitta ditt drömjobb oavsett om det gäller arbete nära eller långt håll, korta som långa uppdrag. Trygga villkor och bra lön ingår! Bemanning behöver inte vara krångligt. Kontakta oss redan idag så berättar vi mer! \n\nOM UPPDRAGET\nÄr du legitimerad Röntgensjuksköterska och söker fortfarande efter nya spännande utmaningar i sommar? Då kan du vara den vi söker till ett bemanningsuppdrag i Kalmar! \n\nFör vår kunds räkning söker vi nu dig som är legitimerad röntgensjuksköterska med erfarenhet av CT eller MR till röntgen i Kalmar. Till uppdraget söker vi dig som är tillgänglig under perioden v.28 till och med v.31. Schemat är på heltid dag, men kvälls- och jourtjänstgöring kan komma att bli aktuellt. Oavsett om du kan hela perioden eller endast delar är du varmt välkommen med din ansökan! \n \nDINA ARBETSUPPGIFTER\nSedvanliga arbetsuppgifter för sjuksköterska på enhet med inriktning mot röntgen.\n \nDIN PROFIL\nDu är legitimerad röntgensjuksköterska och har minst 2 års dokumenterad yrkeserfarenhet.\nDu har erfarenhet av att jobba i SECTRA RIS/PACS samt erfarenhet från Siemens utrustning på MR och CT.\n\nATT ARBETA SOM BEMANNINGSSJUKSKÖTERSKA \nHos oss får du ett välplanerat äventyr eller större flexibilitet på hemmaplan. Du väljer själv! Möjligheterna är många och du kommer att få bra betalt i både lönekuvertet och på ditt pensionskonto. Vi lovar aldrig mer än vad vi kan hålla och du och din personliga konsultchef har tät kontakt under hela uppdragets gång. \nVem passar som bemanningssjuksköterska? Du som är självständig i ditt arbete och trygg i din profession samt mån om både kvalitet och patientsäkerhet. Du har god samarbetsförmåga då arbetet sker i team runt patienten samt  kan anpassa ditt bemötande och förhållningssätt utifrån individ och situation. Om den här beskrivningen passar in på dig så tror vi att du kommer att trivas bra i rollen som bemanningssjuksköterska. \n\nVi på Centric Care tror på ärlighet, transparens och personlig service. Tillsammans gör vi vården bättre, med oss är du trygg.\n \nOM CENTRIC CARE \nCentric Care har bemannat hälso- och sjukvård sedan år 2000. Vi kan branschen och många som jobbar internt hos oss har en sjukvårdsutbildning i botten. Centric Care är ett auktoriserat bemanningsbolag och är medlem i Almega Kompetensföretagarna. Auktorisationen betyder att Centric Care lever upp till svensk lagstiftning och de etiska branschkrav som Almega ställer. Auktorisationen är en kvalitetsstämpel både för våra medarbetare, underleverantörer och kunder. \n\nCentric Care har kollektivavtal för alla våra anställda. Det betyder att vi erbjuder trygga arbetsvillkor utöver vad lagstiftningen kräver. Alla anställda hos oss omfattas av försäkringar, extra hög semesterersättning och tjänstepension enligt ITP. Som anställd hos oss får du dessutom tillgång till ett förmånligt friskvårdbidrag, årlig HLR-utbildning och mycket mer.  \n\nNyfiken på att veta mer? Sökt tjänsten eller gör en intresseanmälan så tar en av våra erfarna konsultchefer kontakt med dig.\n\nVälkommen!"
}