{
  "meta" : {
    "jobad" : {
      "description" : {
        "requirements" : null,
        "needs" : null,
        "company_information" : null,
        "text_formatted" : "Uniflex söker en Maskinoperatör till JD Stenqvists produktionsanläggning i Nissafors. Du kommer bli anställd av Uniflex bemanning men vara uthyrd till kund under sex månaders tid för att sedan gå över till en tillsvidareanställning hos Stenqvist. \n\nStenqvist grundades 1894 i Kvidinge, nära Helsingborg, i södra Sverige. Företaget är en av de största förpackningstillverkarna i Skandinavien, med en bred produktportfölj som täcker allt ifrån bärkassar till rullmaterial tillverkat av papper och plast eller i kombination. Innovativa och miljövänliga förpackningslösningar som passar perfekt för både livsmedelsindustrin och retailsegmentet. \n\nVi söker dig som har tidigare erfarenheter inom produktion, gärna som maskinoperatör och är mekaniskt intresserad. Dina arbetsuppgifter kommer bland annat bestå av att hålla produktionsmaskiner igång med allt vad detta innebär. Du kommer erbjudas intern utbildning på plats i början av din anställning.\n\nVem är du?\nSom person är du positiv, driven och social. Du trivs med att arbeta tillsammans med kollegor och du är noggrann i de arbete du utför och lämnar efter dig efter dagens slut. \n\nSom Maskinoperatör kräver vi att du är: \n* Tekniskt intresserad \n* Kan arbeta i skiftgång \n* Har goda språkkunskaper i både svenska och engelska i tal och skrift\n* B-körkort\n\nTjänsten är med start omgående eller enligt överenskommelse. \n\nIntervjuer sker löpande och tjänsten kan komma att tillsättas innan sista ansökningsdag, välkommen in med din ansökan redan idag!\n\n\n  \nEventuella namngivna referenter bör ha kännedom om att de finns i dina ansökningshandlingar. \n\nUniflex är ett auktoriserat bemanningsföretag som arbetar med uthyrning och rekrytering. Uniflex finns i Sverige, Norge och Finland. I Sverige är vi drygt 3 000 anställda och finns på ett 40 tal orter. Vi är medlemmar i Almega Kompetensföretagen samt Byggföretagen och har kollektivavtal med LO, Byggnads, Unionen och Akademikerförbunden. Uniflex är kvalitets-, miljö- och arbetsmiljöcertifierade enligt ISO 9001, ISO 14001 samt ISO 45001.\n\nPå Uniflex ser vi våra medarbetare som vår viktigaste tillgång och därför erbjuder vi följande:\n\n• Kollektivavtal\n• Tjänstepension\n• Friskvårdsbidrag och andra personalförmåner\n• Försäkringar\n• Marknadsmässig lön\n• Karriär och utveckling\n\nVi söker ständigt efter nya kollegor som arbetar i enighet med våra värderingar affärsfokus, engagemang, glädje och ansvarstagande.",
        "conditions" : "Heltid\r\nTillsvidare",
        "text" : "Uniflex söker en Maskinoperatör till JD Stenqvists produktionsanläggning i Nissafors. Du kommer bli anställd av Uniflex bemanning men vara uthyrd till kund under sex månaders tid för att sedan gå över till en tillsvidareanställning hos Stenqvist. \n\nStenqvist grundades 1894 i Kvidinge, nära Helsingborg, i södra Sverige. Företaget är en av de största förpackningstillverkarna i Skandinavien, med en bred produktportfölj som täcker allt ifrån bärkassar till rullmaterial tillverkat av papper och plast eller i kombination. Innovativa och miljövänliga förpackningslösningar som passar perfekt för både livsmedelsindustrin och retailsegmentet. \n\nVi söker dig som har tidigare erfarenheter inom produktion, gärna som maskinoperatör och är mekaniskt intresserad. Dina arbetsuppgifter kommer bland annat bestå av att hålla produktionsmaskiner igång med allt vad detta innebär. Du kommer erbjudas intern utbildning på plats i början av din anställning.\n\nVem är du?\nSom person är du positiv, driven och social. Du trivs med att arbeta tillsammans med kollegor och du är noggrann i de arbete du utför och lämnar efter dig efter dagens slut. \n\nSom Maskinoperatör kräver vi att du är: \n* Tekniskt intresserad \n* Kan arbeta i skiftgång \n* Har goda språkkunskaper i både svenska och engelska i tal och skrift\n* B-körkort\n\nTjänsten är med start omgående eller enligt överenskommelse. \n\nIntervjuer sker löpande och tjänsten kan komma att tillsättas innan sista ansökningsdag, välkommen in med din ansökan redan idag!\n\n\n  \nEventuella namngivna referenter bör ha kännedom om att de finns i dina ansökningshandlingar. \n\nUniflex är ett auktoriserat bemanningsföretag som arbetar med uthyrning och rekrytering. Uniflex finns i Sverige, Norge och Finland. I Sverige är vi drygt 3 000 anställda och finns på ett 40 tal orter. Vi är medlemmar i Almega Kompetensföretagen samt Byggföretagen och har kollektivavtal med LO, Byggnads, Unionen och Akademikerförbunden. Uniflex är kvalitets-, miljö- och arbetsmiljöcertifierade enligt ISO 9001, ISO 14001 samt ISO 45001.\n\nPå Uniflex ser vi våra medarbetare som vår viktigaste tillgång och därför erbjuder vi följande:\n\n• Kollektivavtal\n• Tjänstepension\n• Friskvårdsbidrag och andra personalförmåner\n• Försäkringar\n• Marknadsmässig lön\n• Karriär och utveckling\n\nVi söker ständigt efter nya kollegor som arbetar i enighet med våra värderingar affärsfokus, engagemang, glädje och ansvarstagande."
      },
      "headline" : "Maskinoperatör sökes till produktion i Nissafors",
      "driving_license" : [ {
        "concept_id" : "VTK8_WRx_GcM",
        "label" : "B",
        "legacy_ams_taxonomy_id" : "3"
      } ],
      "employer" : {
        "email" : null,
        "phone_number" : null,
        "organization_number" : "5566370341",
        "name" : "Uniflex Sverige AB",
        "url" : "http://www.uniflex.se",
        "workplace" : "Uniflex Sverige AB"
      },
      "removed_date" : null,
      "logo_url" : "https://www.arbetsformedlingen.se/rest/arbetsgivare/rest/af/v3/organisation/5566370341/logotyper/logo.png",
      "last_publication_date" : "2022-08-27T23:59:59",
      "number_of_vacancies" : 1,
      "occupation" : {
        "concept_id" : "mAFA_4h6_ppV",
        "label" : "Maskinoperatör, tryckeri",
        "legacy_ams_taxonomy_id" : "4829"
      },
      "occupation_group" : {
        "concept_id" : "XeJB_bkn_mRn",
        "label" : "Tryckare",
        "legacy_ams_taxonomy_id" : "7322"
      },
      "employment_type" : {
        "concept_id" : "PFZr_Syz_cUq",
        "label" : "Vanlig anställning",
        "legacy_ams_taxonomy_id" : "1"
      },
      "webpage_url" : "https://arbetsformedlingen.se/platsbanken/annonser/26361745",
      "driving_license_required" : true,
      "application_contacts" : [ {
        "description" : "Ida Hurtig",
        "email" : null,
        "telephone" : null,
        "name" : null,
        "contact_type" : null
      } ],
      "duration" : {
        "concept_id" : "a7uU_j21_mkL",
        "label" : "Tills vidare",
        "legacy_ams_taxonomy_id" : "1"
      },
      "nice_to_have" : {
        "education_level" : [ ],
        "work_experiences" : [ ],
        "skills" : [ ],
        "education" : [ ],
        "languages" : [ ]
      },
      "application_details" : {
        "via_af" : false,
        "email" : null,
        "other" : null,
        "reference" : "58132",
        "url" : "http://www.uniflex.se/jobbannons?jaid=58132",
        "information" : null
      },
      "source_type" : "VIA_PLATSBANKEN_DXA",
      "application_deadline" : "2022-08-27T23:59:59",
      "external_id" : "46-556637-0341-58132",
      "workplace_address" : {
        "coordinates" : [ 13.54326, 57.2985 ],
        "city" : null,
        "postcode" : null,
        "municipality" : "Gislaved",
        "region_concept_id" : "MtbE_xWT_eMi",
        "region" : "Jönköpings län",
        "country_code" : "199",
        "region_code" : "06",
        "municipality_concept_id" : "cNQx_Yqi_83Q",
        "country_concept_id" : "i46j_HmG_v64",
        "municipality_code" : "0662",
        "street_address" : null,
        "country" : "Sverige"
      },
      "id" : "26361745",
      "experience_required" : true,
      "working_hours_type" : {
        "concept_id" : "6YE1_gAC_R2G",
        "label" : "Heltid",
        "legacy_ams_taxonomy_id" : "1"
      },
      "access" : null,
      "timestamp" : 1659075694386,
      "must_have" : {
        "education_level" : [ ],
        "work_experiences" : [ {
          "concept_id" : "mAFA_4h6_ppV",
          "weight" : 10,
          "label" : "Maskinoperatör, tryckeri",
          "legacy_ams_taxonomy_id" : "4829"
        } ],
        "skills" : [ ],
        "education" : [ ],
        "languages" : [ ]
      },
      "occupation_field" : {
        "concept_id" : "wTEr_CBC_bqh",
        "label" : "Industriell tillverkning",
        "legacy_ams_taxonomy_id" : "9"
      },
      "scope_of_work" : {
        "min" : 100,
        "max" : 100
      },
      "salary_type" : {
        "concept_id" : "oG8G_9cW_nRf",
        "label" : "Fast månads- vecko- eller timlön",
        "legacy_ams_taxonomy_id" : "1"
      },
      "removed" : false,
      "salary_description" : "Fast lön",
      "access_to_own_car" : false,
      "publication_date" : "2022-07-29T08:21:34"
    },
    "name" : "Maskinoperatör sökes till produktion i Nissafors",
    "user" : "kristof.fischer"
  },
  "sha1" : "f40fd0273d71b862dddb4832ae5e68bd1b28ac3b",
  "annotations" : [ {
    "preferred-label" : "Övriga process- och maskinoperatörer",
    "type" : "ssyk-level-4",
    "start-position" : 0,
    "end-position" : 14,
    "concept-id" : "hxm6_xkr_dHm",
    "matched-string" : "Maskinoperatör",
    "annotation-id" : 4
  }, {
    "preferred-label" : "Övriga process- och maskinoperatörer",
    "type" : "ssyk-level-4",
    "start-position" : 66,
    "end-position" : 80,
    "concept-id" : "hxm6_xkr_dHm",
    "matched-string" : "Maskinoperatör",
    "annotation-id" : 5
  }, {
    "preferred-label" : "Tillsvidareanställning (inkl. eventuell provanställning)",
    "type" : "employment-type",
    "start-position" : 258,
    "end-position" : 280,
    "concept-id" : "kpPX_CNN_gDU",
    "matched-string" : "tillsvidareanställning",
    "annotation-id" : 6
  }, {
    "preferred-label" : "Helsingborg",
    "type" : "municipality",
    "start-position" : 340,
    "end-position" : 351,
    "concept-id" : "qj3q_oXH_MGR",
    "matched-string" : "Helsingborg",
    "annotation-id" : 7
  }, {
    "preferred-label" : "Sverige",
    "type" : "country",
    "start-position" : 361,
    "end-position" : 368,
    "concept-id" : "i46j_HmG_v64",
    "matched-string" : "Sverige",
    "annotation-id" : 8
  }, {
    "preferred-label" : "Övriga process- och maskinoperatörer",
    "type" : "ssyk-level-4",
    "start-position" : 762,
    "end-position" : 776,
    "concept-id" : "hxm6_xkr_dHm",
    "matched-string" : "maskinoperatör",
    "annotation-id" : 9
  }, {
    "preferred-label" : "noggrannhet",
    "sentiment" : "MUST_HAVE",
    "type" : "esco-skill",
    "start-position" : 1111,
    "end-position" : 1119,
    "concept-id" : "mrsW_EkL_KRD",
    "matched-string" : "noggrann",
    "annotation-id" : 10
  }, {
    "preferred-label" : "Övriga process- och maskinoperatörer",
    "type" : "ssyk-level-4",
    "start-position" : 1187,
    "end-position" : 1201,
    "concept-id" : "hxm6_xkr_dHm",
    "matched-string" : "Maskinoperatör",
    "annotation-id" : 11
  }, {
    "preferred-label" : "Skiftarbete",
    "type" : "work-place-environment",
    "start-position" : 1263,
    "end-position" : 1272,
    "concept-id" : "YnG9_nVP_CsZ",
    "matched-string" : "skiftgång",
    "annotation-id" : 12
  }, {
    "preferred-label" : "Svenska",
    "sentiment" : "MUST_HAVE",
    "type" : "language",
    "start-position" : 1307,
    "end-position" : 1314,
    "concept-id" : "zSLA_vw2_FXN",
    "matched-string" : "svenska",
    "annotation-id" : 0
  }, {
    "preferred-label" : "Engelska",
    "sentiment" : "MUST_HAVE",
    "type" : "language",
    "start-position" : 1319,
    "end-position" : 1327,
    "concept-id" : "NVxJ_hLg_TYS",
    "matched-string" : "engelska",
    "annotation-id" : 1
  }, {
    "preferred-label" : "B",
    "sentiment" : "MUST_HAVE",
    "type" : "driving-licence",
    "start-position" : 1347,
    "end-position" : 1356,
    "concept-id" : "VTK8_WRx_GcM",
    "matched-string" : "B-körkort",
    "annotation-id" : 13
  } ],
  "text" : "Maskinoperatör sökes till produktion i Nissafors\nUniflex söker en Maskinoperatör till JD Stenqvists produktionsanläggning i Nissafors. Du kommer bli anställd av Uniflex bemanning men vara uthyrd till kund under sex månaders tid för att sedan gå över till en tillsvidareanställning hos Stenqvist. \n\nStenqvist grundades 1894 i Kvidinge, nära Helsingborg, i södra Sverige. Företaget är en av de största förpackningstillverkarna i Skandinavien, med en bred produktportfölj som täcker allt ifrån bärkassar till rullmaterial tillverkat av papper och plast eller i kombination. Innovativa och miljövänliga förpackningslösningar som passar perfekt för både livsmedelsindustrin och retailsegmentet. \n\nVi söker dig som har tidigare erfarenheter inom produktion, gärna som maskinoperatör och är mekaniskt intresserad. Dina arbetsuppgifter kommer bland annat bestå av att hålla produktionsmaskiner igång med allt vad detta innebär. Du kommer erbjudas intern utbildning på plats i början av din anställning.\n\nVem är du?\nSom person är du positiv, driven och social. Du trivs med att arbeta tillsammans med kollegor och du är noggrann i de arbete du utför och lämnar efter dig efter dagens slut. \n\nSom Maskinoperatör kräver vi att du är: \n* Tekniskt intresserad \n* Kan arbeta i skiftgång \n* Har goda språkkunskaper i både svenska och engelska i tal och skrift\n* B-körkort\n\nTjänsten är med start omgående eller enligt överenskommelse. \n\nIntervjuer sker löpande och tjänsten kan komma att tillsättas innan sista ansökningsdag, välkommen in med din ansökan redan idag!\n\n\n  \nEventuella namngivna referenter bör ha kännedom om att de finns i dina ansökningshandlingar. \n\nUniflex är ett auktoriserat bemanningsföretag som arbetar med uthyrning och rekrytering. Uniflex finns i Sverige, Norge och Finland. I Sverige är vi drygt 3 000 anställda och finns på ett 40 tal orter. Vi är medlemmar i Almega Kompetensföretagen samt Byggföretagen och har kollektivavtal med LO, Byggnads, Unionen och Akademikerförbunden. Uniflex är kvalitets-, miljö- och arbetsmiljöcertifierade enligt ISO 9001, ISO 14001 samt ISO 45001.\n\nPå Uniflex ser vi våra medarbetare som vår viktigaste tillgång och därför erbjuder vi följande:\n\n• Kollektivavtal\n• Tjänstepension\n• Friskvårdsbidrag och andra personalförmåner\n• Försäkringar\n• Marknadsmässig lön\n• Karriär och utveckling\n\nVi söker ständigt efter nya kollegor som arbetar i enighet med våra värderingar affärsfokus, engagemang, glädje och ansvarstagande."
}