{
  "meta" : {
    "jobad" : {
      "description" : {
        "requirements" : null,
        "needs" : null,
        "company_information" : null,
        "text_formatted" : "<p><strong>Redaktör/journalist till nyhetssajt online</strong></p><p>Deltidsskribenter med nyhetsintresse och vana att skriva texter och göra nyhetsvärdering sökes till framgångsrik nyhetssajt som läses av mer än 100 000 personer dagligen.</p><p>Du följer nyhetsutvecklingen i Sverige och världen och väljer ut texter som du bedömer intresserar den breda allmänheten.</p><p>Arbetstiden är helger i första hand och kvällstid i andra hand. Flexibiliteten är stor då du jobbar på distans hemifrån och därmed kan befinna dig var du vill i Sverige eller utomlands. Rätt person har goda utvecklingsmöjligheter internt inklusive möjlighet till heltidstjänst. Du publicerar på webben och i sociala medier. Du har inga resor i jobbet. Det är en hel del ensamarbete men du har dagligt stöd och kontakt med redaktionsledningen.</p><p>Vi rekryterar löpande. Mer information ges vid ansökan.</p><p>Sänd en presentationstext samt CV till framtidensmedia@outlook.com.</p>",
        "conditions" : null,
        "text" : "Redaktör/journalist till nyhetssajt online\nDeltidsskribenter med nyhetsintresse och vana att skriva texter och göra nyhetsvärdering sökes till framgångsrik nyhetssajt som läses av mer än 100 000 personer dagligen.\nDu följer nyhetsutvecklingen i Sverige och världen och väljer ut texter som du bedömer intresserar den breda allmänheten.\nArbetstiden är helger i första hand och kvällstid i andra hand. Flexibiliteten är stor då du jobbar på distans hemifrån och därmed kan befinna dig var du vill i Sverige eller utomlands. Rätt person har goda utvecklingsmöjligheter internt inklusive möjlighet till heltidstjänst. Du publicerar på webben och i sociala medier. Du har inga resor i jobbet. Det är en hel del ensamarbete men du har dagligt stöd och kontakt med redaktionsledningen.\nVi rekryterar löpande. Mer information ges vid ansökan.\nSänd en presentationstext samt CV till framtidensmedia@outlook.com."
      },
      "headline" : "Redaktör/journalist till expansiv nyhetssajt",
      "driving_license" : null,
      "employer" : {
        "email" : null,
        "phone_number" : null,
        "organization_number" : "5569650392",
        "name" : "Pennsylvania Avenue AB",
        "url" : null,
        "workplace" : "Pennsylvania A."
      },
      "removed_date" : null,
      "logo_url" : null,
      "last_publication_date" : "2022-08-31T23:59:59",
      "number_of_vacancies" : 1,
      "occupation" : {
        "concept_id" : "BduY_UUY_pvK",
        "label" : "Journalist/Reporter",
        "legacy_ams_taxonomy_id" : "6056"
      },
      "occupation_group" : {
        "concept_id" : "SgNH_hag_n9D",
        "label" : "Journalister m.fl.",
        "legacy_ams_taxonomy_id" : "2642"
      },
      "employment_type" : {
        "concept_id" : "PFZr_Syz_cUq",
        "label" : "Vanlig anställning",
        "legacy_ams_taxonomy_id" : "1"
      },
      "webpage_url" : "https://arbetsformedlingen.se/platsbanken/annonser/26373408",
      "driving_license_required" : false,
      "application_contacts" : [ ],
      "duration" : {
        "concept_id" : "a7uU_j21_mkL",
        "label" : "Tills vidare",
        "legacy_ams_taxonomy_id" : "1"
      },
      "nice_to_have" : {
        "education_level" : [ ],
        "work_experiences" : [ ],
        "skills" : [ ],
        "education" : [ ],
        "languages" : [ ]
      },
      "application_details" : {
        "via_af" : false,
        "email" : "framtidensmedia@outlook.com",
        "other" : null,
        "reference" : null,
        "url" : null,
        "information" : null
      },
      "source_type" : "VIA_ANNONSERA",
      "application_deadline" : "2022-08-31T23:59:59",
      "external_id" : null,
      "workplace_address" : {
        "coordinates" : [ null, null ],
        "city" : null,
        "postcode" : null,
        "municipality" : null,
        "region_concept_id" : null,
        "region" : null,
        "country_code" : "199",
        "region_code" : null,
        "municipality_concept_id" : null,
        "country_concept_id" : "i46j_HmG_v64",
        "municipality_code" : null,
        "street_address" : null,
        "country" : "Sverige"
      },
      "id" : "26373408",
      "experience_required" : true,
      "working_hours_type" : {
        "concept_id" : "947z_JGS_Uk2",
        "label" : "Deltid",
        "legacy_ams_taxonomy_id" : "2"
      },
      "access" : null,
      "timestamp" : 1659591330272,
      "must_have" : {
        "education_level" : [ ],
        "work_experiences" : [ ],
        "skills" : [ ],
        "education" : [ ],
        "languages" : [ ]
      },
      "occupation_field" : {
        "concept_id" : "9puE_nYg_crq",
        "label" : "Kultur, media, design",
        "legacy_ams_taxonomy_id" : "11"
      },
      "scope_of_work" : {
        "min" : 0,
        "max" : 100
      },
      "salary_type" : {
        "concept_id" : "oG8G_9cW_nRf",
        "label" : "Fast månads- vecko- eller timlön",
        "legacy_ams_taxonomy_id" : "1"
      },
      "removed" : false,
      "salary_description" : null,
      "access_to_own_car" : false,
      "publication_date" : "2022-08-04T07:35:30"
    },
    "name" : "Redaktör/journalist till expansiv nyhetssajt",
    "user" : "hannes"
  },
  "sha1" : "53ac87522ffecdc1a6b7e0148adf1a7d22b7146b",
  "annotations" : [ {
    "preferred-label" : "redaktör",
    "sentiment" : "MUST_HAVE",
    "type" : "esco-occupation",
    "start-position" : 0,
    "end-position" : 8,
    "concept-id" : "tRiS_ixp_5bD",
    "matched-string" : "redaktör",
    "annotation-id" : 0
  }, {
    "preferred-label" : "Journalist/Reporter",
    "sentiment" : "MUST_HAVE",
    "type" : "occupation-name",
    "start-position" : 9,
    "end-position" : 19,
    "concept-id" : "BduY_UUY_pvK",
    "matched-string" : "journalist",
    "annotation-id" : 1
  }, {
    "preferred-label" : "redaktör",
    "sentiment" : "MUST_HAVE",
    "type" : "esco-occupation",
    "start-position" : 45,
    "end-position" : 53,
    "concept-id" : "tRiS_ixp_5bD",
    "matched-string" : "redaktör",
    "annotation-id" : 2
  }, {
    "preferred-label" : "Journalist/Reporter",
    "sentiment" : "MUST_HAVE",
    "type" : "occupation-name",
    "start-position" : 54,
    "end-position" : 64,
    "concept-id" : "BduY_UUY_pvK",
    "matched-string" : "journalist",
    "annotation-id" : 3
  }, {
    "preferred-label" : "Deltid",
    "type" : "worktime-extent",
    "start-position" : 88,
    "end-position" : 94,
    "concept-id" : "947z_JGS_Uk2",
    "matched-string" : "Deltid",
    "annotation-id" : 6
  }, {
    "preferred-label" : "Sverige",
    "type" : "country",
    "start-position" : 290,
    "end-position" : 297,
    "concept-id" : "i46j_HmG_v64",
    "matched-string" : "Sverige",
    "annotation-id" : 7
  }, {
    "preferred-label" : "Distansarbete",
    "type" : "work-place-environment",
    "start-position" : 484,
    "end-position" : 491,
    "concept-id" : "uwzb_xcR_vxS",
    "matched-string" : "distans",
    "annotation-id" : 8
  }, {
    "preferred-label" : "Sverige",
    "type" : "country",
    "start-position" : 542,
    "end-position" : 549,
    "concept-id" : "i46j_HmG_v64",
    "matched-string" : "Sverige",
    "annotation-id" : 9
  }, {
    "preferred-label" : "Heltid",
    "type" : "worktime-extent",
    "start-position" : 644,
    "end-position" : 657,
    "concept-id" : "6YE1_gAC_R2G",
    "matched-string" : "heltidstjänst",
    "annotation-id" : 10
  }, {
    "preferred-label" : "Object Component Model/COM",
    "sentiment" : "MUST_HAVE",
    "type" : "skill",
    "start-position" : 943,
    "end-position" : 946,
    "concept-id" : "Np6W_aQg_Rkn",
    "matched-string" : "com",
    "annotation-id" : 5
  } ],
  "text" : "Redaktör/journalist till expansiv nyhetssajt\nRedaktör/journalist till nyhetssajt online\nDeltidsskribenter med nyhetsintresse och vana att skriva texter och göra nyhetsvärdering sökes till framgångsrik nyhetssajt som läses av mer än 100 000 personer dagligen.\nDu följer nyhetsutvecklingen i Sverige och världen och väljer ut texter som du bedömer intresserar den breda allmänheten.\nArbetstiden är helger i första hand och kvällstid i andra hand. Flexibiliteten är stor då du jobbar på distans hemifrån och därmed kan befinna dig var du vill i Sverige eller utomlands. Rätt person har goda utvecklingsmöjligheter internt inklusive möjlighet till heltidstjänst. Du publicerar på webben och i sociala medier. Du har inga resor i jobbet. Det är en hel del ensamarbete men du har dagligt stöd och kontakt med redaktionsledningen.\nVi rekryterar löpande. Mer information ges vid ansökan.\nSänd en presentationstext samt CV till framtidensmedia@outlook.com."
}