{
  "meta" : {
    "jobad" : {
      "description" : {
        "requirements" : null,
        "needs" : null,
        "company_information" : null,
        "text_formatted" : "Skaraborgs Sjukhus (SkaS) har verksamhet på flera orter i Skaraborg bl.a. i Falköping, Lidköping, Mariestad och Skövde. Vi ger specialistsjukvård inom ett trettiotal specialiteter och arbetar tillsammans för patientens hälsa genom livet, där vi erbjuder en sammanhållen och trygg vård. Varje dag och varje timma gör våra medarbetare insatser som påverkar andra människors liv. Vi bryr oss om dig som gör skillnad för andra och tillsammans skapar vi framtidens arbetsplats.\n\n\r\n\r\nBeskrivning/arbetsuppgifter\n\nSmärtmottagningen på Skaraborgs Sjukhus, Skövde söker smärtläkare eller läkare med intresse för arbete inom smärtlindring.\r\n\r\nPå smärtmottagningen arbetar läkare, sjuksköterskor och medicinska sekreterare.\n\nVi erbjuder tillsvidareanställning på deltid/heltid med tillträde enligt överenskommelse. Du blir då en del av ett välfungerande team på enheten. Vi erbjuder smärtpatienter en välutvecklad kvalitativ poliklinisk bedömning och behandling omfattande såväl akut- som kronisk smärta, benign som malign.\n\nDu kommer delta i remissbedömningar i team, arbeta med ny- och återbesök samt följa upp smärtinsatser per distans i samråd med enhetens smärtsjuksköterskor. Möjlighet erbjudes även att delta i rehabverksamhet och extern utbildning av kollegor, vårdpersonal och patienter. Som konsulter är vi ej engagerade i sjukskrivnings- eller intygsärenden.\n\nKvalifikationer\n\nDu är smärtläkare, eller har någon annan grundspecialitet, som till exempel allmänmedicin, rehabiliteringsmedicin, psykiatri eller internmedicin. Har du intresse av att skaffa dig smärtläkarkompetens och arbeta med smärtpatienter är du välkommen att söka då vi har möjlighet att ordna med handledare och utbildning. Kravet är att du ska vara intresserad av att arbeta med patienter med långvarig smärta och dess konsekvenser för individen. Som läkare hos oss får du således möjlighet till en fortsatt god kompetensutveckling alternativt specialistutbildning som ST-läkare.\n\nFör att du ska trivas hos oss tror vi att du som person är självgående och har god samarbetsförmåga. Stor vikt kommer läggas på personlig lämplighet.\n\n \n\nFör mer information om tjänsten kan du kontakta enhetschef Åsa Appelqvist, 072 46 39 347.\n\nVälkommen med din ansökan!\n\nOm Västra Götalandsregionen\nVästra Götalandsregionen finns till för människorna i Västra Götaland. Vi ser till att det finns god hälso- och sjukvård för alla. Vi arbetar för en hållbar utveckling och tillväxt, bra miljö, förbättrad folkhälsa, ett rikt kulturliv och goda kommunikationer i hela Västra Götaland.\nVästra Götalandsregionen arbetar aktivt för att digitalisera fler arbetssätt. För att vara en del av den digitala omvandlingen har du med dig grundläggande färdigheter och kan använda digitala verktyg och tjänster. Du kan söka information, kommunicera, interagera digitalt, är riskmedveten och har motivation att delta i utvecklingen för att lära nytt.\n\n\nVill du veta mer om Västra Götalandsregionen kan du besöka vår introduktion till nya medarbetare på länken https://www.vgregion.se/introduktion\n\n\nAnsökan\nVästra Götalandsregionen ser helst att du registrerar din ansökan via rekryteringssystemet. Om du som sökande har frågor om den utannonserade tjänsten eller av särskilda och speciella skäl inte kan registrera dina uppgifter i ett offentligt system - kontakta kontaktperson för respektive annons.\n\n\nTill bemannings-, förmedlings- och rekryteringsföretag och till dig som är försäljare:\nVi undanber oss vänligen men bestämt direktkontakt med bemannings-, förmedlings- och rekryteringsföretag samt andra externa aktörer och försäljare av ytterligare jobbannonser. Västra Götalandsregionen har upphandlade avtal.",
        "conditions" : "Enligt överenskommelse. Tillträde: Enligt överenskommelse\r\nTillsvidareanställning",
        "text" : "Skaraborgs Sjukhus (SkaS) har verksamhet på flera orter i Skaraborg bl.a. i Falköping, Lidköping, Mariestad och Skövde. Vi ger specialistsjukvård inom ett trettiotal specialiteter och arbetar tillsammans för patientens hälsa genom livet, där vi erbjuder en sammanhållen och trygg vård. Varje dag och varje timma gör våra medarbetare insatser som påverkar andra människors liv. Vi bryr oss om dig som gör skillnad för andra och tillsammans skapar vi framtidens arbetsplats.\n\n\r\n\r\nBeskrivning/arbetsuppgifter\n\nSmärtmottagningen på Skaraborgs Sjukhus, Skövde söker smärtläkare eller läkare med intresse för arbete inom smärtlindring.\r\n\r\nPå smärtmottagningen arbetar läkare, sjuksköterskor och medicinska sekreterare.\n\nVi erbjuder tillsvidareanställning på deltid/heltid med tillträde enligt överenskommelse. Du blir då en del av ett välfungerande team på enheten. Vi erbjuder smärtpatienter en välutvecklad kvalitativ poliklinisk bedömning och behandling omfattande såväl akut- som kronisk smärta, benign som malign.\n\nDu kommer delta i remissbedömningar i team, arbeta med ny- och återbesök samt följa upp smärtinsatser per distans i samråd med enhetens smärtsjuksköterskor. Möjlighet erbjudes även att delta i rehabverksamhet och extern utbildning av kollegor, vårdpersonal och patienter. Som konsulter är vi ej engagerade i sjukskrivnings- eller intygsärenden.\n\nKvalifikationer\n\nDu är smärtläkare, eller har någon annan grundspecialitet, som till exempel allmänmedicin, rehabiliteringsmedicin, psykiatri eller internmedicin. Har du intresse av att skaffa dig smärtläkarkompetens och arbeta med smärtpatienter är du välkommen att söka då vi har möjlighet att ordna med handledare och utbildning. Kravet är att du ska vara intresserad av att arbeta med patienter med långvarig smärta och dess konsekvenser för individen. Som läkare hos oss får du således möjlighet till en fortsatt god kompetensutveckling alternativt specialistutbildning som ST-läkare.\n\nFör att du ska trivas hos oss tror vi att du som person är självgående och har god samarbetsförmåga. Stor vikt kommer läggas på personlig lämplighet.\n\n \n\nFör mer information om tjänsten kan du kontakta enhetschef Åsa Appelqvist, 072 46 39 347.\n\nVälkommen med din ansökan!\n\nOm Västra Götalandsregionen\nVästra Götalandsregionen finns till för människorna i Västra Götaland. Vi ser till att det finns god hälso- och sjukvård för alla. Vi arbetar för en hållbar utveckling och tillväxt, bra miljö, förbättrad folkhälsa, ett rikt kulturliv och goda kommunikationer i hela Västra Götaland.\nVästra Götalandsregionen arbetar aktivt för att digitalisera fler arbetssätt. För att vara en del av den digitala omvandlingen har du med dig grundläggande färdigheter och kan använda digitala verktyg och tjänster. Du kan söka information, kommunicera, interagera digitalt, är riskmedveten och har motivation att delta i utvecklingen för att lära nytt.\n\n\nVill du veta mer om Västra Götalandsregionen kan du besöka vår introduktion till nya medarbetare på länken https://www.vgregion.se/introduktion\n\n\nAnsökan\nVästra Götalandsregionen ser helst att du registrerar din ansökan via rekryteringssystemet. Om du som sökande har frågor om den utannonserade tjänsten eller av särskilda och speciella skäl inte kan registrera dina uppgifter i ett offentligt system - kontakta kontaktperson för respektive annons.\n\n\nTill bemannings-, förmedlings- och rekryteringsföretag och till dig som är försäljare:\nVi undanber oss vänligen men bestämt direktkontakt med bemannings-, förmedlings- och rekryteringsföretag samt andra externa aktörer och försäljare av ytterligare jobbannonser. Västra Götalandsregionen har upphandlade avtal."
      },
      "headline" : "Vi söker smärtläkare eller läkare med intresse för smärtbehandling",
      "driving_license" : null,
      "employer" : {
        "email" : null,
        "phone_number" : null,
        "organization_number" : "2321000131",
        "name" : "VÄSTRA GÖTALANDSREGIONEN",
        "url" : null,
        "workplace" : "Skaraborgs Sjukhus, Område Kirurgi, K6, Läkare An-Op-IVA, SkaS"
      },
      "removed_date" : null,
      "logo_url" : "https://www.arbetsformedlingen.se/rest/arbetsgivare/rest/af/v3/organisation/2321000131/logotyper/logo.png",
      "last_publication_date" : "2022-08-15T23:59:59",
      "number_of_vacancies" : 1,
      "occupation" : {
        "concept_id" : "oHyy_M2j_HUP",
        "label" : "Specialistläkare",
        "legacy_ams_taxonomy_id" : "7238"
      },
      "occupation_group" : {
        "concept_id" : "nu7c_QuB_KVQ",
        "label" : "Specialistläkare",
        "legacy_ams_taxonomy_id" : "2211"
      },
      "employment_type" : {
        "concept_id" : "PFZr_Syz_cUq",
        "label" : "Vanlig anställning",
        "legacy_ams_taxonomy_id" : "1"
      },
      "webpage_url" : "https://arbetsformedlingen.se/platsbanken/annonser/26280302",
      "driving_license_required" : false,
      "application_contacts" : [ {
        "description" : "Åsa Appelqvist, enhetschef",
        "email" : null,
        "telephone" : "0724639347",
        "name" : null,
        "contact_type" : null
      } ],
      "duration" : {
        "concept_id" : "a7uU_j21_mkL",
        "label" : "Tills vidare",
        "legacy_ams_taxonomy_id" : "1"
      },
      "nice_to_have" : {
        "education_level" : [ ],
        "work_experiences" : [ ],
        "skills" : [ ],
        "education" : [ ],
        "languages" : [ ]
      },
      "application_details" : {
        "via_af" : false,
        "email" : null,
        "other" : null,
        "reference" : "2022/5528",
        "url" : "https://vgregion.varbi.com/what:job/jobID:527049/type:job/where:1/apply:1",
        "information" : null
      },
      "source_type" : "VIA_PLATSBANKEN_DXA",
      "application_deadline" : "2022-08-15T23:59:59",
      "external_id" : "46-232100-0131-527049",
      "workplace_address" : {
        "coordinates" : [ 13.846121, 58.390278 ],
        "city" : null,
        "postcode" : null,
        "municipality" : "Skövde",
        "region_concept_id" : "zdoY_6u5_Krt",
        "region" : "Västra Götalands län",
        "country_code" : "199",
        "region_code" : "14",
        "municipality_concept_id" : "fqAy_4ji_Lz2",
        "country_concept_id" : "i46j_HmG_v64",
        "municipality_code" : "1496",
        "street_address" : null,
        "country" : "Sverige"
      },
      "id" : "26280302",
      "experience_required" : false,
      "working_hours_type" : {
        "concept_id" : "6YE1_gAC_R2G",
        "label" : "Heltid",
        "legacy_ams_taxonomy_id" : "1"
      },
      "access" : null,
      "timestamp" : 1656655539362,
      "must_have" : {
        "education_level" : [ ],
        "work_experiences" : [ ],
        "skills" : [ ],
        "education" : [ ],
        "languages" : [ ]
      },
      "occupation_field" : {
        "concept_id" : "NYW6_mP6_vwf",
        "label" : "Hälso- och sjukvård",
        "legacy_ams_taxonomy_id" : "8"
      },
      "scope_of_work" : {
        "min" : 100,
        "max" : 100
      },
      "salary_type" : {
        "concept_id" : "oG8G_9cW_nRf",
        "label" : "Fast månads- vecko- eller timlön",
        "legacy_ams_taxonomy_id" : "1"
      },
      "removed" : false,
      "salary_description" : "Fast lön",
      "access_to_own_car" : false,
      "publication_date" : "2022-07-01T08:05:39"
    },
    "name" : "Vi söker smärtläkare eller läkare med intresse för smärtbehandling",
    "user" : "hannes"
  },
  "sha1" : "dc77d2a23ca489298e748a3f9442a7567035dd4a",
  "annotations" : [ {
    "preferred-label" : "läkare",
    "sentiment" : "MUST_HAVE",
    "type" : "esco-occupation",
    "start-position" : 27,
    "end-position" : 33,
    "concept-id" : "snUT_QSf_LG9",
    "matched-string" : "läkare",
    "annotation-id" : 0
  }, {
    "preferred-label" : "Smärtbehandling",
    "sentiment" : "MUST_HAVE",
    "type" : "skill",
    "start-position" : 51,
    "end-position" : 66,
    "concept-id" : "F9MX_NWR_7CQ",
    "matched-string" : "smärtbehandling",
    "annotation-id" : 1
  }, {
    "preferred-label" : "Falköping",
    "type" : "municipality",
    "start-position" : 143,
    "end-position" : 152,
    "concept-id" : "ZySF_gif_zE4",
    "matched-string" : "Falköping",
    "annotation-id" : 18
  }, {
    "preferred-label" : "Lidköping",
    "type" : "municipality",
    "start-position" : 154,
    "end-position" : 163,
    "concept-id" : "FN1Y_asc_D8y",
    "matched-string" : "Lidköping",
    "annotation-id" : 19
  }, {
    "preferred-label" : "Mariestad",
    "type" : "municipality",
    "start-position" : 165,
    "end-position" : 174,
    "concept-id" : "Lzpu_thX_Wpa",
    "matched-string" : "Mariestad",
    "annotation-id" : 20
  }, {
    "preferred-label" : "Skövde",
    "type" : "municipality",
    "start-position" : 179,
    "end-position" : 185,
    "concept-id" : "fqAy_4ji_Lz2",
    "matched-string" : "Skövde",
    "annotation-id" : 21
  }, {
    "preferred-label" : "Hälsa",
    "sentiment" : "MUST_HAVE",
    "type" : "keyword",
    "start-position" : 286,
    "end-position" : 291,
    "concept-id" : "Abys_5p1_Cnq",
    "matched-string" : "hälsa",
    "annotation-id" : 2
  }, {
    "preferred-label" : "Smärtbehandling",
    "type" : "skill",
    "start-position" : 574,
    "end-position" : 591,
    "concept-id" : "F9MX_NWR_7CQ",
    "matched-string" : "Smärtmottagningen",
    "annotation-id" : 22
  }, {
    "preferred-label" : "Skövde",
    "type" : "municipality",
    "start-position" : 615,
    "end-position" : 621,
    "concept-id" : "fqAy_4ji_Lz2",
    "matched-string" : "Skövde",
    "annotation-id" : 23
  }, {
    "preferred-label" : "läkare",
    "sentiment" : "MUST_HAVE",
    "type" : "esco-occupation",
    "start-position" : 646,
    "end-position" : 652,
    "concept-id" : "snUT_QSf_LG9",
    "matched-string" : "läkare",
    "annotation-id" : 3
  }, {
    "preferred-label" : "Smärtlindring",
    "sentiment" : "MUST_HAVE",
    "type" : "skill",
    "start-position" : 682,
    "end-position" : 695,
    "concept-id" : "wwZR_EhP_hiA",
    "matched-string" : "smärtlindring",
    "annotation-id" : 4
  }, {
    "preferred-label" : "Smärtbehandling",
    "type" : "skill",
    "start-position" : 703,
    "end-position" : 720,
    "concept-id" : "F9MX_NWR_7CQ",
    "matched-string" : "smärtmottagningen",
    "annotation-id" : 24
  }, {
    "preferred-label" : "läkare",
    "sentiment" : "MUST_HAVE",
    "type" : "esco-occupation",
    "start-position" : 729,
    "end-position" : 735,
    "concept-id" : "snUT_QSf_LG9",
    "matched-string" : "läkare",
    "annotation-id" : 5
  }, {
    "preferred-label" : "Sjuksköterskor",
    "sentiment" : "MUST_HAVE",
    "type" : "ssyk-level-3",
    "start-position" : 737,
    "end-position" : 751,
    "concept-id" : "jzaN_Vqk_TP1",
    "matched-string" : "sjuksköterskor",
    "annotation-id" : 6
  }, {
    "preferred-label" : "Medicinska sekreterare, vårdadministratörer m.fl.",
    "type" : "ssyk-level-4",
    "start-position" : 756,
    "end-position" : 778,
    "concept-id" : "2kLc_pto_DpV",
    "matched-string" : "medicinska sekreterare",
    "annotation-id" : 25
  }, {
    "preferred-label" : "Tillsvidareanställning (inkl. eventuell provanställning)",
    "type" : "employment-type",
    "start-position" : 793,
    "end-position" : 815,
    "concept-id" : "kpPX_CNN_gDU",
    "matched-string" : "tillsvidareanställning",
    "annotation-id" : 26
  }, {
    "preferred-label" : "Deltid",
    "type" : "worktime-extent",
    "start-position" : 819,
    "end-position" : 825,
    "concept-id" : "947z_JGS_Uk2",
    "matched-string" : "deltid",
    "annotation-id" : 27
  }, {
    "preferred-label" : "Heltid",
    "type" : "worktime-extent",
    "start-position" : 826,
    "end-position" : 832,
    "concept-id" : "6YE1_gAC_R2G",
    "matched-string" : "heltid",
    "annotation-id" : 28
  }, {
    "preferred-label" : "Smärtsjuksköterska",
    "type" : "occupation-name",
    "start-position" : 1217,
    "end-position" : 1236,
    "concept-id" : "KzUS_aLa_Zsb",
    "matched-string" : "smärtsjuksköterskor",
    "annotation-id" : 29
  }, {
    "preferred-label" : "Allmänmedicin",
    "sentiment" : "MUST_HAVE",
    "type" : "skill",
    "start-position" : 1520,
    "end-position" : 1533,
    "concept-id" : "tCDB_MjS_nqc",
    "matched-string" : "allmänmedicin",
    "annotation-id" : 8
  }, {
    "preferred-label" : "Rehabiliteringsmedicin",
    "sentiment" : "MUST_HAVE",
    "type" : "skill",
    "start-position" : 1535,
    "end-position" : 1557,
    "concept-id" : "URMC_Sxh_Lta",
    "matched-string" : "rehabiliteringsmedicin",
    "annotation-id" : 9
  }, {
    "preferred-label" : "Psykiatri",
    "sentiment" : "MUST_HAVE",
    "type" : "skill",
    "start-position" : 1559,
    "end-position" : 1568,
    "concept-id" : "sXoR_gGY_ycN",
    "matched-string" : "psykiatri",
    "annotation-id" : 10
  }, {
    "preferred-label" : "internmedicin",
    "sentiment" : "MUST_HAVE",
    "type" : "esco-skill",
    "start-position" : 1575,
    "end-position" : 1588,
    "concept-id" : "cnCH_dtC_Rsn",
    "matched-string" : "internmedicin",
    "annotation-id" : 11
  }, {
    "preferred-label" : "läkare",
    "sentiment" : "MUST_HAVE",
    "type" : "esco-occupation",
    "start-position" : 1888,
    "end-position" : 1894,
    "concept-id" : "snUT_QSf_LG9",
    "matched-string" : "läkare",
    "annotation-id" : 12
  }, {
    "preferred-label" : "ST-läkare",
    "sentiment" : "MUST_HAVE",
    "type" : "ssyk-level-4",
    "start-position" : 2006,
    "end-position" : 2015,
    "concept-id" : "seu9_VoQ_VNo",
    "matched-string" : "st-läkare",
    "annotation-id" : 13
  }, {
    "preferred-label" : "Västra Götalands län",
    "type" : "region",
    "start-position" : 2294,
    "end-position" : 2318,
    "concept-id" : "zdoY_6u5_Krt",
    "matched-string" : "Västra Götalandsregionen",
    "annotation-id" : 30
  }, {
    "preferred-label" : "Västra Götalands län",
    "type" : "region",
    "start-position" : 2319,
    "end-position" : 2343,
    "concept-id" : "zdoY_6u5_Krt",
    "matched-string" : "Västra Götalandsregionen",
    "annotation-id" : 31
  }, {
    "preferred-label" : "Västra Götalands län",
    "type" : "region",
    "start-position" : 2373,
    "end-position" : 2388,
    "concept-id" : "zdoY_6u5_Krt",
    "matched-string" : "Västra Götaland",
    "annotation-id" : 33
  }, {
    "preferred-label" : "Hälso- och sjukvård",
    "type" : "sni-level-2",
    "start-position" : 2420,
    "end-position" : 2439,
    "concept-id" : "KhNL_Quq_Xjk",
    "matched-string" : "hälso- och sjukvård",
    "annotation-id" : 34
  }, {
    "preferred-label" : "Hållbar utveckling",
    "sentiment" : "MUST_HAVE",
    "type" : "keyword",
    "start-position" : 2468,
    "end-position" : 2486,
    "concept-id" : "RKw3_zWW_1pf",
    "matched-string" : "hållbar utveckling",
    "annotation-id" : 15
  }, {
    "preferred-label" : "folkhälsa",
    "sentiment" : "MUST_HAVE",
    "type" : "esco-skill",
    "start-position" : 2523,
    "end-position" : 2532,
    "concept-id" : "jEdA_1Fe_Jji",
    "matched-string" : "folkhälsa",
    "annotation-id" : 16
  }, {
    "preferred-label" : "Västra Götalands län",
    "type" : "region",
    "start-position" : 2585,
    "end-position" : 2600,
    "concept-id" : "zdoY_6u5_Krt",
    "matched-string" : "Västra Götaland",
    "annotation-id" : 35
  }, {
    "preferred-label" : "Västra Götalands län",
    "type" : "region",
    "start-position" : 2602,
    "end-position" : 2626,
    "concept-id" : "zdoY_6u5_Krt",
    "matched-string" : "Västra Götalandsregionen",
    "annotation-id" : 32
  }, {
    "preferred-label" : "Västra Götalands län",
    "type" : "region",
    "start-position" : 2977,
    "end-position" : 3001,
    "concept-id" : "zdoY_6u5_Krt",
    "matched-string" : "Västra Götalandsregionen",
    "annotation-id" : 36
  }, {
    "preferred-label" : "Västra Götalands län",
    "type" : "region",
    "start-position" : 3111,
    "end-position" : 3135,
    "concept-id" : "zdoY_6u5_Krt",
    "matched-string" : "Västra Götalandsregionen",
    "annotation-id" : 37
  }, {
    "preferred-label" : "Västra Götalands län",
    "type" : "region",
    "start-position" : 3672,
    "end-position" : 3696,
    "concept-id" : "zdoY_6u5_Krt",
    "matched-string" : "Västra Götalandsregionen",
    "annotation-id" : 38
  } ],
  "text" : "Vi söker smärtläkare eller läkare med intresse för smärtbehandling\nSkaraborgs Sjukhus (SkaS) har verksamhet på flera orter i Skaraborg bl.a. i Falköping, Lidköping, Mariestad och Skövde. Vi ger specialistsjukvård inom ett trettiotal specialiteter och arbetar tillsammans för patientens hälsa genom livet, där vi erbjuder en sammanhållen och trygg vård. Varje dag och varje timma gör våra medarbetare insatser som påverkar andra människors liv. Vi bryr oss om dig som gör skillnad för andra och tillsammans skapar vi framtidens arbetsplats.\n\n\r\n\r\nBeskrivning/arbetsuppgifter\n\nSmärtmottagningen på Skaraborgs Sjukhus, Skövde söker smärtläkare eller läkare med intresse för arbete inom smärtlindring.\r\n\r\nPå smärtmottagningen arbetar läkare, sjuksköterskor och medicinska sekreterare.\n\nVi erbjuder tillsvidareanställning på deltid/heltid med tillträde enligt överenskommelse. Du blir då en del av ett välfungerande team på enheten. Vi erbjuder smärtpatienter en välutvecklad kvalitativ poliklinisk bedömning och behandling omfattande såväl akut- som kronisk smärta, benign som malign.\n\nDu kommer delta i remissbedömningar i team, arbeta med ny- och återbesök samt följa upp smärtinsatser per distans i samråd med enhetens smärtsjuksköterskor. Möjlighet erbjudes även att delta i rehabverksamhet och extern utbildning av kollegor, vårdpersonal och patienter. Som konsulter är vi ej engagerade i sjukskrivnings- eller intygsärenden.\n\nKvalifikationer\n\nDu är smärtläkare, eller har någon annan grundspecialitet, som till exempel allmänmedicin, rehabiliteringsmedicin, psykiatri eller internmedicin. Har du intresse av att skaffa dig smärtläkarkompetens och arbeta med smärtpatienter är du välkommen att söka då vi har möjlighet att ordna med handledare och utbildning. Kravet är att du ska vara intresserad av att arbeta med patienter med långvarig smärta och dess konsekvenser för individen. Som läkare hos oss får du således möjlighet till en fortsatt god kompetensutveckling alternativt specialistutbildning som ST-läkare.\n\nFör att du ska trivas hos oss tror vi att du som person är självgående och har god samarbetsförmåga. Stor vikt kommer läggas på personlig lämplighet.\n\n \n\nFör mer information om tjänsten kan du kontakta enhetschef Åsa Appelqvist, 072 46 39 347.\n\nVälkommen med din ansökan!\n\nOm Västra Götalandsregionen\nVästra Götalandsregionen finns till för människorna i Västra Götaland. Vi ser till att det finns god hälso- och sjukvård för alla. Vi arbetar för en hållbar utveckling och tillväxt, bra miljö, förbättrad folkhälsa, ett rikt kulturliv och goda kommunikationer i hela Västra Götaland.\nVästra Götalandsregionen arbetar aktivt för att digitalisera fler arbetssätt. För att vara en del av den digitala omvandlingen har du med dig grundläggande färdigheter och kan använda digitala verktyg och tjänster. Du kan söka information, kommunicera, interagera digitalt, är riskmedveten och har motivation att delta i utvecklingen för att lära nytt.\n\n\nVill du veta mer om Västra Götalandsregionen kan du besöka vår introduktion till nya medarbetare på länken https://www.vgregion.se/introduktion\n\n\nAnsökan\nVästra Götalandsregionen ser helst att du registrerar din ansökan via rekryteringssystemet. Om du som sökande har frågor om den utannonserade tjänsten eller av särskilda och speciella skäl inte kan registrera dina uppgifter i ett offentligt system - kontakta kontaktperson för respektive annons.\n\n\nTill bemannings-, förmedlings- och rekryteringsföretag och till dig som är försäljare:\nVi undanber oss vänligen men bestämt direktkontakt med bemannings-, förmedlings- och rekryteringsföretag samt andra externa aktörer och försäljare av ytterligare jobbannonser. Västra Götalandsregionen har upphandlade avtal."
}