{
  "meta" : {
    "jobad" : {
      "description" : {
        "requirements" : null,
        "needs" : null,
        "company_information" : null,
        "text_formatted" : "<strong>Till vårt trevliga kundföretag Svenska Kyrkan och Huskvarna pastorat söker vi en Präst för arbete i Öxnehagakyrkan, </strong>en distriktskyrka som ligger i ett mångkulturellt område.<br><br>Hos oss får du en varm, genuin och personlig kontakt där vi alla värnar om det goda samtalet, både bland oss kollegor och med våra fantastiska medlemmar. Vi har ett naturligt fokus på diakoni och gudstjänster och söker dig som vill blir en del av vår församling, både idag och i framtiden!<br><br>Du blir en del av ett team som är engagerande, drivna och empatiska. Vi skapar en unik samvaro där ledarskapet är en viktig kulturbärare.<br><br>I rollen som Präst har du flera olika arbetsområden, bland annat:<br> <ul>\t<li>Diakoni och det goda samtalet</li>\t<li>Lokal närvaro och relationsskapande</li>\t<li>Ett varierat gudstjänstliv med angelägna gudstjänster</li>\t<li>Kontakt och samverkan med skolor, föreningar och myndigheter</li>\t<li>Utveckling av församlingsliv och det lokala närområdet</li></ul><br>Vill du arbeta och utvecklas tillsammans med oss? Vi ser fram emot att ta emot och introducera dig i vår församling och skall göra vårt yttersta för att ge dig de bästa förutsättningar att trivas hos oss!<br><br><strong>Din profil</strong><br>Du som söker rollen som Präst i vår församling är en karismatisk och engagerad ledare med ett öppet och välkomnande sätt. Du har flerårig erfarenhet av att jobba som Präst och har ett stort hjärta för människan. Med ett genuint intresse och engagemang för diakoni, relationer och lokal samverkan, tror vi att du skulle kunna trivas och mår bra i vår församling.<br><br>Som person är du idérik och samarbetsvillig, du gillar både traditionella prästerliga uppgifter men är även intresserad av utveckling och nyheter inom yrket. Du är väl förankrad och grundad i din egen tro och bjuder gärna in till samtal om tro och liv.<br><br>Hos oss är kommunikation och öppenhet för människors olikheter viktig, likaså att vi på ett fint och anpassat sätt kan möta våra olika generationer. I vår församling har vi en stark vision och drivkraft med ledstjärnan – Jesus Kristus är i centrum!<br><br>Vi lägger stor vikt vid personlig lämplighet och ser gärna att du har B-körkort.<br><br>Tjänsten är en direktanställning hos Huskvarna pastorat.<br><br>Vi rekryterar löpande och tjänsten kan komma att tillsättas innan ansökningstiden har gått ut.<br>Du är varmt välkommen med din ansökan redan idag!<br>Du ansöker direkt på <a href=\"http://www.empleo.se/\" style=\"color:#0563c1; text-decoration:underline\">www.empleo.se</a><br><br>Uppstart: Snarast eller enligt överenskommelse.<br>Ort/Placering: Huskvarna. <br>Omfattning: Heltid<br>Lön: Individuell lönesättning tillämpas.<br>Ansökningstid: Snarast möjligt.",
        "conditions" : null,
        "text" : "Till vårt trevliga kundföretag Svenska Kyrkan och Huskvarna pastorat söker vi en Präst för arbete i Öxnehagakyrkan, en distriktskyrka som ligger i ett mångkulturellt område.\n\nHos oss får du en varm, genuin och personlig kontakt där vi alla värnar om det goda samtalet, både bland oss kollegor och med våra fantastiska medlemmar. Vi har ett naturligt fokus på diakoni och gudstjänster och söker dig som vill blir en del av vår församling, både idag och i framtiden!\n\nDu blir en del av ett team som är engagerande, drivna och empatiska. Vi skapar en unik samvaro där ledarskapet är en viktig kulturbärare.\n\nI rollen som Präst har du flera olika arbetsområden, bland annat:\n  Diakoni och det goda samtalet\n Lokal närvaro och relationsskapande\n Ett varierat gudstjänstliv med angelägna gudstjänster\n Kontakt och samverkan med skolor, föreningar och myndigheter\n Utveckling av församlingsliv och det lokala närområdet\n\nVill du arbeta och utvecklas tillsammans med oss? Vi ser fram emot att ta emot och introducera dig i vår församling och skall göra vårt yttersta för att ge dig de bästa förutsättningar att trivas hos oss!\n\nDin profil\nDu som söker rollen som Präst i vår församling är en karismatisk och engagerad ledare med ett öppet och välkomnande sätt. Du har flerårig erfarenhet av att jobba som Präst och har ett stort hjärta för människan. Med ett genuint intresse och engagemang för diakoni, relationer och lokal samverkan, tror vi att du skulle kunna trivas och mår bra i vår församling.\n\nSom person är du idérik och samarbetsvillig, du gillar både traditionella prästerliga uppgifter men är även intresserad av utveckling och nyheter inom yrket. Du är väl förankrad och grundad i din egen tro och bjuder gärna in till samtal om tro och liv.\n\nHos oss är kommunikation och öppenhet för människors olikheter viktig, likaså att vi på ett fint och anpassat sätt kan möta våra olika generationer. I vår församling har vi en stark vision och drivkraft med ledstjärnan – Jesus Kristus är i centrum!\n\nVi lägger stor vikt vid personlig lämplighet och ser gärna att du har B-körkort.\n\nTjänsten är en direktanställning hos Huskvarna pastorat.\n\nVi rekryterar löpande och tjänsten kan komma att tillsättas innan ansökningstiden har gått ut.\nDu är varmt välkommen med din ansökan redan idag!\nDu ansöker direkt på www.empleo.se\n\nUppstart: Snarast eller enligt överenskommelse.\nOrt/Placering: Huskvarna. \nOmfattning: Heltid\nLön: Individuell lönesättning tillämpas.\nAnsökningstid: Snarast möjligt."
      },
      "headline" : "Präst till Svenska Kyrkan och Huskvarna pastorat",
      "driving_license" : null,
      "employer" : {
        "email" : null,
        "phone_number" : null,
        "organization_number" : "5568731425",
        "name" : "Empleo Växjö AB",
        "url" : "www.svenskakyrkan.se/huskvarna/oxnehaga_kyrkan",
        "workplace" : "Svenska kyrkan Huskvarna pastorat"
      },
      "removed_date" : null,
      "logo_url" : "https://www.arbetsformedlingen.se/rest/arbetsgivare/rest/af/v3/organisation/5568731425/logotyper/logo.png",
      "last_publication_date" : "2022-09-04T23:59:59",
      "number_of_vacancies" : 1,
      "occupation" : {
        "concept_id" : "PzLV_Vcy_RJG",
        "label" : "Präst, annat trossamfund",
        "legacy_ams_taxonomy_id" : "5829"
      },
      "occupation_group" : {
        "concept_id" : "2L2s_EU8_PzR",
        "label" : "Präster",
        "legacy_ams_taxonomy_id" : "2671"
      },
      "employment_type" : {
        "concept_id" : "PFZr_Syz_cUq",
        "label" : "Vanlig anställning",
        "legacy_ams_taxonomy_id" : "1"
      },
      "webpage_url" : "https://arbetsformedlingen.se/platsbanken/annonser/26356354",
      "driving_license_required" : false,
      "application_contacts" : [ {
        "description" : "Rebecca Moberg",
        "email" : "Rebecca.moberg@empleo.se",
        "telephone" : null,
        "name" : null,
        "contact_type" : null
      } ],
      "duration" : {
        "concept_id" : "a7uU_j21_mkL",
        "label" : "Tills vidare",
        "legacy_ams_taxonomy_id" : "1"
      },
      "nice_to_have" : {
        "education_level" : [ ],
        "work_experiences" : [ ],
        "skills" : [ ],
        "education" : [ ],
        "languages" : [ ]
      },
      "application_details" : {
        "via_af" : false,
        "email" : null,
        "other" : null,
        "reference" : null,
        "url" : "https://apply.recman.no/job_post.php?id=285801&path=ams&sub_id=452",
        "information" : null
      },
      "source_type" : "VIA_PLATSBANKEN_DXA",
      "application_deadline" : "2022-09-04T23:59:59",
      "external_id" : "46-556873-1425-28580162e0e4901d01c",
      "workplace_address" : {
        "coordinates" : [ 13.416667, 57.783333 ],
        "city" : null,
        "postcode" : null,
        "municipality" : "Ulricehamn",
        "region_concept_id" : "zdoY_6u5_Krt",
        "region" : "Västra Götalands län",
        "country_code" : "199",
        "region_code" : "14",
        "municipality_concept_id" : "an4a_8t2_Zpd",
        "country_concept_id" : "i46j_HmG_v64",
        "municipality_code" : "1491",
        "street_address" : null,
        "country" : "Sverige"
      },
      "id" : "26356354",
      "experience_required" : true,
      "working_hours_type" : {
        "concept_id" : "6YE1_gAC_R2G",
        "label" : "Heltid",
        "legacy_ams_taxonomy_id" : "1"
      },
      "access" : null,
      "timestamp" : 1658905754904,
      "must_have" : {
        "education_level" : [ ],
        "work_experiences" : [ {
          "concept_id" : "PzLV_Vcy_RJG",
          "weight" : 10,
          "label" : "Präst, annat trossamfund",
          "legacy_ams_taxonomy_id" : "5829"
        } ],
        "skills" : [ ],
        "education" : [ ],
        "languages" : [ ]
      },
      "occupation_field" : {
        "concept_id" : "GazW_2TU_kJw",
        "label" : "Yrken med social inriktning",
        "legacy_ams_taxonomy_id" : "16"
      },
      "scope_of_work" : {
        "min" : 100,
        "max" : 100
      },
      "salary_type" : {
        "concept_id" : "oG8G_9cW_nRf",
        "label" : "Fast månads- vecko- eller timlön",
        "legacy_ams_taxonomy_id" : "1"
      },
      "removed" : false,
      "salary_description" : null,
      "access_to_own_car" : false,
      "publication_date" : "2022-07-27T09:09:14"
    },
    "name" : "Präst till Svenska Kyrkan och Huskvarna pastorat",
    "user" : "hannes"
  },
  "sha1" : "4de44cacebb272cb416478c640f21d7e2e28ee9a",
  "annotations" : [ {
    "preferred-label" : "Präster",
    "type" : "ssyk-level-4",
    "start-position" : 0,
    "end-position" : 5,
    "concept-id" : "2L2s_EU8_PzR",
    "matched-string" : "Präst",
    "annotation-id" : 9
  }, {
    "preferred-label" : "Kyrkan",
    "sentiment" : "MUST_HAVE",
    "type" : "keyword",
    "start-position" : 19,
    "end-position" : 25,
    "concept-id" : "h4LF_GE3_FGu",
    "matched-string" : "kyrkan",
    "annotation-id" : 1
  }, {
    "preferred-label" : "Kyrkan",
    "sentiment" : "MUST_HAVE",
    "type" : "keyword",
    "start-position" : 88,
    "end-position" : 94,
    "concept-id" : "h4LF_GE3_FGu",
    "matched-string" : "kyrkan",
    "annotation-id" : 3
  }, {
    "preferred-label" : "Präster",
    "type" : "ssyk-level-4",
    "start-position" : 130,
    "end-position" : 135,
    "concept-id" : "2L2s_EU8_PzR",
    "matched-string" : "Präst",
    "annotation-id" : 10
  }, {
    "preferred-label" : "Församling",
    "sentiment" : "MUST_HAVE",
    "type" : "keyword",
    "start-position" : 475,
    "end-position" : 485,
    "concept-id" : "rfGv_wrD_n9x",
    "matched-string" : "församling",
    "annotation-id" : 4
  }, {
    "preferred-label" : "Präster",
    "type" : "ssyk-level-4",
    "start-position" : 667,
    "end-position" : 672,
    "concept-id" : "2L2s_EU8_PzR",
    "matched-string" : "Präst",
    "annotation-id" : 11
  }, {
    "preferred-label" : "Församling",
    "sentiment" : "MUST_HAVE",
    "type" : "keyword",
    "start-position" : 1068,
    "end-position" : 1078,
    "concept-id" : "rfGv_wrD_n9x",
    "matched-string" : "församling",
    "annotation-id" : 5
  }, {
    "preferred-label" : "Präster",
    "type" : "ssyk-level-4",
    "start-position" : 1204,
    "end-position" : 1209,
    "concept-id" : "2L2s_EU8_PzR",
    "matched-string" : "Präst",
    "annotation-id" : 12
  }, {
    "preferred-label" : "Församling",
    "sentiment" : "MUST_HAVE",
    "type" : "keyword",
    "start-position" : 1216,
    "end-position" : 1226,
    "concept-id" : "rfGv_wrD_n9x",
    "matched-string" : "församling",
    "annotation-id" : 6
  }, {
    "preferred-label" : "Präster",
    "type" : "ssyk-level-4",
    "start-position" : 1346,
    "end-position" : 1351,
    "concept-id" : "2L2s_EU8_PzR",
    "matched-string" : "Präst",
    "annotation-id" : 13
  }, {
    "preferred-label" : "Församling",
    "sentiment" : "MUST_HAVE",
    "type" : "keyword",
    "start-position" : 1530,
    "end-position" : 1540,
    "concept-id" : "rfGv_wrD_n9x",
    "matched-string" : "församling",
    "annotation-id" : 7
  }, {
    "preferred-label" : "Församling",
    "sentiment" : "MUST_HAVE",
    "type" : "keyword",
    "start-position" : 1952,
    "end-position" : 1962,
    "concept-id" : "rfGv_wrD_n9x",
    "matched-string" : "församling",
    "annotation-id" : 8
  }, {
    "preferred-label" : "B",
    "type" : "driving-licence",
    "start-position" : 2117,
    "end-position" : 2126,
    "concept-id" : "VTK8_WRx_GcM",
    "matched-string" : "B-körkort",
    "annotation-id" : 14
  }, {
    "preferred-label" : "Heltid",
    "type" : "worktime-extent",
    "start-position" : 2455,
    "end-position" : 2461,
    "concept-id" : "6YE1_gAC_R2G",
    "matched-string" : "Heltid",
    "annotation-id" : 15
  } ],
  "text" : "Präst till Svenska Kyrkan och Huskvarna pastorat\nTill vårt trevliga kundföretag Svenska Kyrkan och Huskvarna pastorat söker vi en Präst för arbete i Öxnehagakyrkan, en distriktskyrka som ligger i ett mångkulturellt område.\n\nHos oss får du en varm, genuin och personlig kontakt där vi alla värnar om det goda samtalet, både bland oss kollegor och med våra fantastiska medlemmar. Vi har ett naturligt fokus på diakoni och gudstjänster och söker dig som vill blir en del av vår församling, både idag och i framtiden!\n\nDu blir en del av ett team som är engagerande, drivna och empatiska. Vi skapar en unik samvaro där ledarskapet är en viktig kulturbärare.\n\nI rollen som Präst har du flera olika arbetsområden, bland annat:\n  Diakoni och det goda samtalet\n Lokal närvaro och relationsskapande\n Ett varierat gudstjänstliv med angelägna gudstjänster\n Kontakt och samverkan med skolor, föreningar och myndigheter\n Utveckling av församlingsliv och det lokala närområdet\n\nVill du arbeta och utvecklas tillsammans med oss? Vi ser fram emot att ta emot och introducera dig i vår församling och skall göra vårt yttersta för att ge dig de bästa förutsättningar att trivas hos oss!\n\nDin profil\nDu som söker rollen som Präst i vår församling är en karismatisk och engagerad ledare med ett öppet och välkomnande sätt. Du har flerårig erfarenhet av att jobba som Präst och har ett stort hjärta för människan. Med ett genuint intresse och engagemang för diakoni, relationer och lokal samverkan, tror vi att du skulle kunna trivas och mår bra i vår församling.\n\nSom person är du idérik och samarbetsvillig, du gillar både traditionella prästerliga uppgifter men är även intresserad av utveckling och nyheter inom yrket. Du är väl förankrad och grundad i din egen tro och bjuder gärna in till samtal om tro och liv.\n\nHos oss är kommunikation och öppenhet för människors olikheter viktig, likaså att vi på ett fint och anpassat sätt kan möta våra olika generationer. I vår församling har vi en stark vision och drivkraft med ledstjärnan – Jesus Kristus är i centrum!\n\nVi lägger stor vikt vid personlig lämplighet och ser gärna att du har B-körkort.\n\nTjänsten är en direktanställning hos Huskvarna pastorat.\n\nVi rekryterar löpande och tjänsten kan komma att tillsättas innan ansökningstiden har gått ut.\nDu är varmt välkommen med din ansökan redan idag!\nDu ansöker direkt på www.empleo.se\n\nUppstart: Snarast eller enligt överenskommelse.\nOrt/Placering: Huskvarna. \nOmfattning: Heltid\nLön: Individuell lönesättning tillämpas.\nAnsökningstid: Snarast möjligt."
}