{
  "meta" : {
    "jobad" : {
      "description" : {
        "requirements" : null,
        "needs" : null,
        "company_information" : null,
        "text_formatted" : "<p>Vi söker en ny kock till vårt team. Tjänsten är 100% och är både dagens lunch &amp; ala carte.</p><p>Du ska kunna laga både dagens rätt &amp; ala carte självständigt. Både dagtid, kvällar &amp; helger förekommer. </p><p>Har du intresse för att vara med och sätta menyer, göra beställningar mm så finns även den möjligheten. </p><p>Är du intresserad av matlagning och bara jobbat litegrann är även du välkommen att söka tjänsten. De viktigaste är att du älskar att laga mat. </p><p>Hotellet har 51 rum, restaurangen ca 60-70 sittplatser, vi erbjuder catering, afterwork, konferenser osv. </p><p>Välkommen med din ansökan.  </p><p><br></p><p><br></p>",
        "conditions" : null,
        "text" : "Vi söker en ny kock till vårt team. Tjänsten är 100% och är både dagens lunch & ala carte.\nDu ska kunna laga både dagens rätt & ala carte självständigt. Både dagtid, kvällar & helger förekommer. \nHar du intresse för att vara med och sätta menyer, göra beställningar mm så finns även den möjligheten. \nÄr du intresserad av matlagning och bara jobbat litegrann är även du välkommen att söka tjänsten. De viktigaste är att du älskar att laga mat. \nHotellet har 51 rum, restaurangen ca 60-70 sittplatser, vi erbjuder catering, afterwork, konferenser osv. \nVälkommen med din ansökan."
      },
      "headline" : "Kock ",
      "driving_license" : null,
      "employer" : {
        "email" : null,
        "phone_number" : null,
        "organization_number" : "5590344791",
        "name" : "Sankt Olof Hotell & Krog i Malung AB",
        "url" : null,
        "workplace" : "Sank-Olof Hotell & Krog"
      },
      "removed_date" : null,
      "logo_url" : null,
      "last_publication_date" : "2022-09-08T00:00:00",
      "number_of_vacancies" : 1,
      "occupation" : {
        "concept_id" : "JbJw_as4_S93",
        "label" : "Kock, à la carte",
        "legacy_ams_taxonomy_id" : "7663"
      },
      "occupation_group" : {
        "concept_id" : "BStc_SJh_DKG",
        "label" : "Kockar och kallskänkor",
        "legacy_ams_taxonomy_id" : "5120"
      },
      "employment_type" : {
        "concept_id" : "PFZr_Syz_cUq",
        "label" : "Vanlig anställning",
        "legacy_ams_taxonomy_id" : "1"
      },
      "webpage_url" : "https://arbetsformedlingen.se/platsbanken/annonser/26390139",
      "driving_license_required" : false,
      "application_contacts" : [ {
        "description" : null,
        "email" : "Johanna@sankt-olof.se",
        "telephone" : "0730291680",
        "name" : "Johanna  Larsson",
        "contact_type" : "VD "
      } ],
      "duration" : {
        "concept_id" : "a7uU_j21_mkL",
        "label" : "Tills vidare",
        "legacy_ams_taxonomy_id" : "1"
      },
      "nice_to_have" : {
        "education_level" : [ ],
        "work_experiences" : [ {
          "concept_id" : "JbJw_as4_S93",
          "weight" : 5,
          "label" : "Kock, à la carte",
          "legacy_ams_taxonomy_id" : "7663"
        } ],
        "skills" : [ ],
        "education" : [ ],
        "languages" : [ ]
      },
      "application_details" : {
        "via_af" : false,
        "email" : "Johanna@sankt-olof.se",
        "other" : null,
        "reference" : null,
        "url" : null,
        "information" : null
      },
      "source_type" : "VIA_ANNONSERA",
      "application_deadline" : "2022-09-08T00:00:00",
      "external_id" : null,
      "workplace_address" : {
        "coordinates" : [ 13.720397507975603, 60.685749065789 ],
        "city" : "Malung",
        "postcode" : "78231",
        "municipality" : "Malung-Sälen",
        "region_concept_id" : "oDpK_oZ2_WYt",
        "region" : "Dalarnas län",
        "country_code" : "199",
        "region_code" : "20",
        "municipality_concept_id" : "FPCd_poj_3tq",
        "country_concept_id" : "i46j_HmG_v64",
        "municipality_code" : "2023",
        "street_address" : "Moravägen 11 D",
        "country" : "Sverige"
      },
      "id" : "26390139",
      "experience_required" : true,
      "working_hours_type" : {
        "concept_id" : "6YE1_gAC_R2G",
        "label" : "Heltid",
        "legacy_ams_taxonomy_id" : "1"
      },
      "access" : null,
      "timestamp" : 1660032615362,
      "must_have" : {
        "education_level" : [ ],
        "work_experiences" : [ ],
        "skills" : [ ],
        "education" : [ ],
        "languages" : [ ]
      },
      "occupation_field" : {
        "concept_id" : "ScKy_FHB_7wT",
        "label" : "Hotell, restaurang, storhushåll",
        "legacy_ams_taxonomy_id" : "7"
      },
      "scope_of_work" : {
        "min" : 0,
        "max" : 100
      },
      "salary_type" : {
        "concept_id" : "oG8G_9cW_nRf",
        "label" : "Fast månads- vecko- eller timlön",
        "legacy_ams_taxonomy_id" : "1"
      },
      "removed" : false,
      "salary_description" : null,
      "access_to_own_car" : false,
      "publication_date" : "2022-08-09T10:10:15"
    },
    "name" : "Kock ",
    "user" : "hannes"
  },
  "sha1" : "6cedee79a4ea3f972400f81400b56473d889bd86",
  "annotations" : [ {
    "preferred-label" : "kock",
    "sentiment" : "MUST_HAVE",
    "type" : "esco-occupation",
    "start-position" : 0,
    "end-position" : 4,
    "concept-id" : "Ti2H_QoQ_EMX",
    "matched-string" : "kock",
    "annotation-id" : 0
  }, {
    "preferred-label" : "kock",
    "sentiment" : "MUST_HAVE",
    "type" : "esco-occupation",
    "start-position" : 21,
    "end-position" : 25,
    "concept-id" : "Ti2H_QoQ_EMX",
    "matched-string" : "kock",
    "annotation-id" : 1
  }, {
    "preferred-label" : "Heltid",
    "type" : "worktime-extent",
    "start-position" : 54,
    "end-position" : 58,
    "concept-id" : "6YE1_gAC_R2G",
    "matched-string" : "100%",
    "annotation-id" : 2
  }, {
    "preferred-label" : "A la carte",
    "type" : "skill",
    "start-position" : 134,
    "end-position" : 143,
    "concept-id" : "Bb4Q_Vou_pbq",
    "matched-string" : "ala carte",
    "annotation-id" : 3
  }, {
    "preferred-label" : "arbeta självständigt",
    "type" : "esco-skill",
    "start-position" : 144,
    "end-position" : 157,
    "concept-id" : "NyFu_HHd_zhz",
    "matched-string" : "självständigt",
    "annotation-id" : 4
  } ],
  "text" : "Kock \nVi söker en ny kock till vårt team. Tjänsten är 100% och är både dagens lunch & ala carte.\nDu ska kunna laga både dagens rätt & ala carte självständigt. Både dagtid, kvällar & helger förekommer. \nHar du intresse för att vara med och sätta menyer, göra beställningar mm så finns även den möjligheten. \nÄr du intresserad av matlagning och bara jobbat litegrann är även du välkommen att söka tjänsten. De viktigaste är att du älskar att laga mat. \nHotellet har 51 rum, restaurangen ca 60-70 sittplatser, vi erbjuder catering, afterwork, konferenser osv. \nVälkommen med din ansökan."
}