{
  "meta" : {
    "jobad" : {
      "description" : {
        "requirements" : null,
        "needs" : null,
        "company_information" : null,
        "text_formatted" : "Du vill något. Det vill vi med! Vi vill skapa värde och bidra till livskvalitet för våra invånare, företag, organisationer och besökare. Vi gör det genom att lyssna, hjälpas åt, testa, lära oss och sen testar vi igen. Här är allt möjligt för dig som vill skapa, förändra, vårda, bygga, vägleda, utvecklas och göra skillnad. För Helsingborg är staden för dig som vill något. Om arbetsplatsen\nPå vård- och omsorgsförvaltningen arbetar vi med människor. Riktiga människor. Människor som, precis som du, lever livet. Vi är cirka 3000 medarbetare - från undersköterskor, sjuksköterskor och arbetsterapeuter till ekonomer, utredare och biståndshandläggare som på olika sätt bidrar till att stadens äldre och personer med funktionsnedsättning ska kunna leva ett rikt och självständigt liv.\n\nTill Barn och ungas korttidsboende kommer barn och ungdomar, och i vissa fall vuxna, med funktionsnedsättningar för kortare vistelser. Syftet är att erbjuda ett miljöombyte, avkoppling, möjlighet att träffa andra eller fungera som en förberedelse inför vuxenlivet.\n\nNu söker vi två stödassistenter till vårt team!\n\nVill du vara med och göra skillnad? Välkommen med din ansökan redan idag!\n\nArbetsbeskrivning\nI arbetet ingår allt från att stödja, hjälpa och se till att utveckla färdigheter för att rusta våra barn och unga för framtiden. Du kommer att ingå i ett team där det krävs kunskap och erfarenhet av olika funktionshinder då behovet skiljer sig åt vad för slags hjälp och stöd de behöver. \n\nI arbetet ingår det att vara kreativ, lyhörd och kunnig inom olika funktionshinder samt att arbeta tydliggörande och strukturerat. Arbetet kan vara krävande men är också fantastiskt roligt! Du ska vara beredd på att vara ute mycket och hitta på olika aktiviteter eller bara ta det lugnt. Det är ungdomarnas behov som styr.\n\nVi arbetar med arbetstidsmodellen tvättstugeschema där man önskar arbetstid utifrån ett resursbehov. Arbetstiden är schemalagd över dagtid, helger och kvällar.\n\nVi erbjuder dig ett omväxlande, ansvarsfullt och stimulerande arbete med möjligheter till egen utveckling. Arbetsplatsen är rökfri och hälsomedveten. Som anställd får du ett friskvårdsbidrag på 3000 kronor per år. Vi tillämpar önskad sysselsättningsgrad, vilket innebär att du bestämmer hur många procent du vill arbeta. \n\nKvalifikationer\nVi söker dig som har ett genuint intresse för att arbeta med människor och möter varje individ utifrån individens behov och önskemål. Du är trygg i dig själv och bekväm med att arbeta med personer som är i stort behov av kontinuitet och struktur. Det är extra viktigt att du har ett pedagogiskt synsätt, ett starkt brukarperspektiv och förmågan att utveckla verksamheten utifrån individens behov.\n\nDu kommer att ingå i ett sammanhang där det ställs höga krav på samarbetsförmåga och ansvarstagande. Vi vill också att du som söker är en god kollega med ett positivt synsätt. \n\nFör att gå vidare i rekryteringsprocessen behöver du ha\n\n\n• läst vård- och omsorgsprogrammet enligt GY 11 med fördjupning inom funktionshinderområdet eller psykiatri eller\n\n\n• läst barn- och fritidsprogrammet enligt GY 11 med fördjupning inom funktionshinderområdet eller\n\n\n• läst motsvarande utbildning som arbetsgivaren bedömer som likvärdig\n\n\n• erfarenhet och kunskap av arbete med högfungerande autism samt ADHD\n\n\n• erfarenhet av liknande arbete.\n\nDet är meriterande om du har\n\n\n• erfarenhet av tydliggörande pedagogik\n\n\n• kunskap och utbildning i lågaffektivt bemötande\n\n\n• kunskap om högfungerande barn och ungdomar med neuropsykiatriska diagnoser\n\n\n• eller har haft delegering i sond och/eller insulin\n\n\n• erfarenhet av att arbeta inom LSS eller inom skola/fritids\n\n\n• erfarenhet av att arbeta med TAKK\n\n\n• B-körkort.\n\nStor vikt läggs vid personlig lämplighet. Rekryteringen sker löpande.\n\nÖvrig information\nSista ansökningsdag: 2022-08-31\n\nAnställningsform: Tillsvidareanställning\n\nOmfattning: Heltid\n\nTillträdesdatum: 2022-09-01 eller enligt överenskommelse\n\nAntal tjänster: 2\n\nHelsingborgs stad arbetar mot diskriminering och för främjande av alla människors lika rättigheter och möjligheter. Sökande oavsett bakgrund är välkomna att söka till Helsingborgs stad. För att kvalitetssäkra rekryteringsprocessen i Helsingborgs stad använder vi rekryteringsverktyget ReachMee. Därför ber vi dig att skicka in din ansökan via ReachMee genom att klicka på ansökningslänken i annonsen. \n\nInnan möjlig anställning kommer en bakgrundskontroll ske. I de fall där kontroll av utdrag ur belastningsregister är lagstadgat kommer även detta att genomföras. \n\nDu som söker jobb och har skyddade personuppgifter ska kontakta rekryterande chef i annonsen som kommer guida dig vidare för en säker ansökningsprocess. Du ska inte ansöka digitalt via ansökningslänken. \n\nFackliga företrädare https://intranat.helsingborg.se/hr/samverkan-och-delaktighet/fackliga-foretradare/ Då vi inför denna rekrytering redan tagit ställning till de rekryteringskanaler vi önskar använda undanber vi oss vänligen men bestämt att bli kontaktade för ytterligare erbjudanden om kompetensförmedling, annonserings- och rekryteringshjälp.",
        "conditions" : "Heltid/\r\nEj specificerat",
        "text" : "Du vill något. Det vill vi med! Vi vill skapa värde och bidra till livskvalitet för våra invånare, företag, organisationer och besökare. Vi gör det genom att lyssna, hjälpas åt, testa, lära oss och sen testar vi igen. Här är allt möjligt för dig som vill skapa, förändra, vårda, bygga, vägleda, utvecklas och göra skillnad. För Helsingborg är staden för dig som vill något. Om arbetsplatsen\nPå vård- och omsorgsförvaltningen arbetar vi med människor. Riktiga människor. Människor som, precis som du, lever livet. Vi är cirka 3000 medarbetare - från undersköterskor, sjuksköterskor och arbetsterapeuter till ekonomer, utredare och biståndshandläggare som på olika sätt bidrar till att stadens äldre och personer med funktionsnedsättning ska kunna leva ett rikt och självständigt liv.\n\nTill Barn och ungas korttidsboende kommer barn och ungdomar, och i vissa fall vuxna, med funktionsnedsättningar för kortare vistelser. Syftet är att erbjuda ett miljöombyte, avkoppling, möjlighet att träffa andra eller fungera som en förberedelse inför vuxenlivet.\n\nNu söker vi två stödassistenter till vårt team!\n\nVill du vara med och göra skillnad? Välkommen med din ansökan redan idag!\n\nArbetsbeskrivning\nI arbetet ingår allt från att stödja, hjälpa och se till att utveckla färdigheter för att rusta våra barn och unga för framtiden. Du kommer att ingå i ett team där det krävs kunskap och erfarenhet av olika funktionshinder då behovet skiljer sig åt vad för slags hjälp och stöd de behöver. \n\nI arbetet ingår det att vara kreativ, lyhörd och kunnig inom olika funktionshinder samt att arbeta tydliggörande och strukturerat. Arbetet kan vara krävande men är också fantastiskt roligt! Du ska vara beredd på att vara ute mycket och hitta på olika aktiviteter eller bara ta det lugnt. Det är ungdomarnas behov som styr.\n\nVi arbetar med arbetstidsmodellen tvättstugeschema där man önskar arbetstid utifrån ett resursbehov. Arbetstiden är schemalagd över dagtid, helger och kvällar.\n\nVi erbjuder dig ett omväxlande, ansvarsfullt och stimulerande arbete med möjligheter till egen utveckling. Arbetsplatsen är rökfri och hälsomedveten. Som anställd får du ett friskvårdsbidrag på 3000 kronor per år. Vi tillämpar önskad sysselsättningsgrad, vilket innebär att du bestämmer hur många procent du vill arbeta. \n\nKvalifikationer\nVi söker dig som har ett genuint intresse för att arbeta med människor och möter varje individ utifrån individens behov och önskemål. Du är trygg i dig själv och bekväm med att arbeta med personer som är i stort behov av kontinuitet och struktur. Det är extra viktigt att du har ett pedagogiskt synsätt, ett starkt brukarperspektiv och förmågan att utveckla verksamheten utifrån individens behov.\n\nDu kommer att ingå i ett sammanhang där det ställs höga krav på samarbetsförmåga och ansvarstagande. Vi vill också att du som söker är en god kollega med ett positivt synsätt. \n\nFör att gå vidare i rekryteringsprocessen behöver du ha\n\n\n• läst vård- och omsorgsprogrammet enligt GY 11 med fördjupning inom funktionshinderområdet eller psykiatri eller\n\n\n• läst barn- och fritidsprogrammet enligt GY 11 med fördjupning inom funktionshinderområdet eller\n\n\n• läst motsvarande utbildning som arbetsgivaren bedömer som likvärdig\n\n\n• erfarenhet och kunskap av arbete med högfungerande autism samt ADHD\n\n\n• erfarenhet av liknande arbete.\n\nDet är meriterande om du har\n\n\n• erfarenhet av tydliggörande pedagogik\n\n\n• kunskap och utbildning i lågaffektivt bemötande\n\n\n• kunskap om högfungerande barn och ungdomar med neuropsykiatriska diagnoser\n\n\n• eller har haft delegering i sond och/eller insulin\n\n\n• erfarenhet av att arbeta inom LSS eller inom skola/fritids\n\n\n• erfarenhet av att arbeta med TAKK\n\n\n• B-körkort.\n\nStor vikt läggs vid personlig lämplighet. Rekryteringen sker löpande.\n\nÖvrig information\nSista ansökningsdag: 2022-08-31\n\nAnställningsform: Tillsvidareanställning\n\nOmfattning: Heltid\n\nTillträdesdatum: 2022-09-01 eller enligt överenskommelse\n\nAntal tjänster: 2\n\nHelsingborgs stad arbetar mot diskriminering och för främjande av alla människors lika rättigheter och möjligheter. Sökande oavsett bakgrund är välkomna att söka till Helsingborgs stad. För att kvalitetssäkra rekryteringsprocessen i Helsingborgs stad använder vi rekryteringsverktyget ReachMee. Därför ber vi dig att skicka in din ansökan via ReachMee genom att klicka på ansökningslänken i annonsen. \n\nInnan möjlig anställning kommer en bakgrundskontroll ske. I de fall där kontroll av utdrag ur belastningsregister är lagstadgat kommer även detta att genomföras. \n\nDu som söker jobb och har skyddade personuppgifter ska kontakta rekryterande chef i annonsen som kommer guida dig vidare för en säker ansökningsprocess. Du ska inte ansöka digitalt via ansökningslänken. \n\nFackliga företrädare https://intranat.helsingborg.se/hr/samverkan-och-delaktighet/fackliga-foretradare/ Då vi inför denna rekrytering redan tagit ställning till de rekryteringskanaler vi önskar använda undanber vi oss vänligen men bestämt att bli kontaktade för ytterligare erbjudanden om kompetensförmedling, annonserings- och rekryteringshjälp."
      },
      "headline" : "Stödassistent till Skarans korttidsvistelse",
      "driving_license" : null,
      "employer" : {
        "email" : null,
        "phone_number" : null,
        "organization_number" : "2120001157",
        "name" : "Helsingborgs kommun",
        "url" : "https://helsingborg.se",
        "workplace" : "Helsingborgs stad"
      },
      "removed_date" : null,
      "logo_url" : "https://www.arbetsformedlingen.se/rest/arbetsgivare/rest/af/v3/organisation/2120001157/logotyper/logo.png",
      "last_publication_date" : "2022-08-31T23:59:59",
      "number_of_vacancies" : 2,
      "occupation" : {
        "concept_id" : "LxhG_of8_eMi",
        "label" : "Stödassistent",
        "legacy_ams_taxonomy_id" : "7669"
      },
      "occupation_group" : {
        "concept_id" : "7pz9_eY9_D2s",
        "label" : "Vårdare, boendestödjare",
        "legacy_ams_taxonomy_id" : "5342"
      },
      "employment_type" : {
        "concept_id" : "PFZr_Syz_cUq",
        "label" : "Vanlig anställning",
        "legacy_ams_taxonomy_id" : "1"
      },
      "webpage_url" : "https://arbetsformedlingen.se/platsbanken/annonser/26334400",
      "driving_license_required" : false,
      "application_contacts" : [ {
        "description" : "Josefin Jungbeck",
        "email" : null,
        "telephone" : "042-10 55 29",
        "name" : null,
        "contact_type" : "Enhetschef"
      }, {
        "description" : "Jessica Samuelsson",
        "email" : null,
        "telephone" : "042-10 66 23",
        "name" : null,
        "contact_type" : "Enhetschef"
      } ],
      "duration" : {
        "concept_id" : "a7uU_j21_mkL",
        "label" : "Tills vidare",
        "legacy_ams_taxonomy_id" : "1"
      },
      "nice_to_have" : {
        "education_level" : [ ],
        "work_experiences" : [ ],
        "skills" : [ ],
        "education" : [ ],
        "languages" : [ ]
      },
      "application_details" : {
        "via_af" : false,
        "email" : null,
        "other" : null,
        "reference" : null,
        "url" : "https://web103.reachmee.com/ext/I017/1118/main?site=9&validator=9ec24d855e37a090a5e232077f53c593&lang=SE&rmpage=job&rmjob=3105&ref=https%3A%2F%2Farbetsformedlingen.se%2Fplatsbanken%2F",
        "information" : null
      },
      "source_type" : "VIA_PLATSBANKEN_DXA",
      "application_deadline" : "2022-08-31T23:59:59",
      "external_id" : "46-212000-1157-3105",
      "workplace_address" : {
        "coordinates" : [ 12.694512, 56.046467 ],
        "city" : null,
        "postcode" : null,
        "municipality" : "Helsingborg",
        "region_concept_id" : "CaRE_1nn_cSU",
        "region" : "Skåne län",
        "country_code" : "199",
        "region_code" : "12",
        "municipality_concept_id" : "qj3q_oXH_MGR",
        "country_concept_id" : "i46j_HmG_v64",
        "municipality_code" : "1283",
        "street_address" : null,
        "country" : "Sverige"
      },
      "id" : "26334400",
      "experience_required" : true,
      "working_hours_type" : {
        "concept_id" : "6YE1_gAC_R2G",
        "label" : "Heltid",
        "legacy_ams_taxonomy_id" : "1"
      },
      "access" : null,
      "timestamp" : 1658130143865,
      "must_have" : {
        "education_level" : [ ],
        "work_experiences" : [ {
          "concept_id" : "LxhG_of8_eMi",
          "weight" : 10,
          "label" : "Stödassistent",
          "legacy_ams_taxonomy_id" : "7669"
        } ],
        "skills" : [ ],
        "education" : [ ],
        "languages" : [ ]
      },
      "occupation_field" : {
        "concept_id" : "GazW_2TU_kJw",
        "label" : "Yrken med social inriktning",
        "legacy_ams_taxonomy_id" : "16"
      },
      "scope_of_work" : {
        "min" : 100,
        "max" : 100
      },
      "salary_type" : {
        "concept_id" : "oG8G_9cW_nRf",
        "label" : "Fast månads- vecko- eller timlön",
        "legacy_ams_taxonomy_id" : "1"
      },
      "removed" : false,
      "salary_description" : "Lön enligt överenskommelse",
      "access_to_own_car" : false,
      "publication_date" : "2022-08-03T00:00:00"
    },
    "name" : "Stödassistent till Skarans korttidsvistelse",
    "user" : "kristof.fischer"
  },
  "sha1" : "ea430e9116bf0312c71c668752e77b0cafa67edd",
  "annotations" : [ {
    "preferred-label" : "Stödassistent",
    "sentiment" : "MUST_HAVE",
    "type" : "occupation-name",
    "start-position" : 0,
    "end-position" : 13,
    "concept-id" : "LxhG_of8_eMi",
    "matched-string" : "stödassistent",
    "annotation-id" : 0
  }, {
    "preferred-label" : "Undersköterska, hemtjänst, äldreboende och habilitering",
    "sentiment" : "MUST_HAVE",
    "type" : "occupation-name",
    "start-position" : 593,
    "end-position" : 608,
    "concept-id" : "Y3QA_5pk_uXd",
    "matched-string" : "undersköterskor",
    "annotation-id" : 1
  }, {
    "preferred-label" : "Sjuksköterska, grundutbildad",
    "sentiment" : "MUST_HAVE",
    "type" : "occupation-name",
    "start-position" : 610,
    "end-position" : 624,
    "concept-id" : "bXNH_MNX_dUR",
    "matched-string" : "sjuksköterskor",
    "annotation-id" : 2
  }, {
    "preferred-label" : "Arbetsterapeut",
    "sentiment" : "MUST_HAVE",
    "type" : "occupation-name",
    "start-position" : 629,
    "end-position" : 645,
    "concept-id" : "heGV_uHh_o8W",
    "matched-string" : "arbetsterapeuter",
    "annotation-id" : 3
  }, {
    "preferred-label" : "Övriga ekonomer",
    "type" : "ssyk-level-4",
    "start-position" : 651,
    "end-position" : 659,
    "concept-id" : "Y6yY_SuR_hVh",
    "matched-string" : "ekonomer",
    "annotation-id" : 7
  }, {
    "preferred-label" : "Handläggare, offentlig förvaltning/Utredare, offentlig förvaltning",
    "type" : "occupation-name",
    "start-position" : 661,
    "end-position" : 669,
    "concept-id" : "YG1s_tUg_jWJ",
    "matched-string" : "utredare",
    "annotation-id" : 8
  }, {
    "preferred-label" : "Biståndsbedömare/Biståndshandläggare",
    "sentiment" : "MUST_HAVE",
    "type" : "occupation-name",
    "start-position" : 674,
    "end-position" : 693,
    "concept-id" : "pYiF_Z6V_ULQ",
    "matched-string" : "biståndshandläggare",
    "annotation-id" : 4
  }, {
    "preferred-label" : "Pedagogiskt förhållningssätt",
    "sentiment" : "MUST_HAVE",
    "type" : "skill",
    "start-position" : 2634,
    "end-position" : 2653,
    "concept-id" : "qMfa_U8e_Lto",
    "matched-string" : "pedagogiskt synsätt",
    "annotation-id" : 9
  }, {
    "preferred-label" : "samarbeta med kolleger",
    "sentiment" : "MUST_HAVE",
    "type" : "esco-skill",
    "start-position" : 2813,
    "end-position" : 2829,
    "concept-id" : "X15R_797_q62",
    "matched-string" : "samarbetsförmåga",
    "annotation-id" : 10
  }, {
    "preferred-label" : "visa ansvarstagande",
    "sentiment" : "MUST_HAVE",
    "type" : "esco-skill",
    "start-position" : 2834,
    "end-position" : 2848,
    "concept-id" : "bcRp_hxV_f5G",
    "matched-string" : "ansvarstagande",
    "annotation-id" : 11
  }, {
    "preferred-label" : "Annan omvårdnadsutbildning, allmän vård och omsorg",
    "sentiment" : "MUST_HAVE",
    "type" : "sun-education-field-4",
    "start-position" : 2992,
    "end-position" : 3019,
    "concept-id" : "hLkE_Bx6_riR",
    "matched-string" : "vård- och omsorgsprogrammet",
    "annotation-id" : 12
  }, {
    "preferred-label" : "Fritidsverksamhet för barn och ungdom",
    "sentiment" : "MUST_HAVE",
    "type" : "sun-education-field-4",
    "start-position" : 3108,
    "end-position" : 3135,
    "concept-id" : "YDQ6_VYd_ow2",
    "matched-string" : "barn- och fritidsprogrammet",
    "annotation-id" : 13
  }, {
    "preferred-label" : "Neuropsykologisk funktionsnedsättning, omsorgserfarenhet",
    "sentiment" : "MUST_HAVE",
    "type" : "skill",
    "start-position" : 3275,
    "end-position" : 3342,
    "concept-id" : "tg1e_QpF_xdX",
    "matched-string" : "erfarenhet och kunskap av arbete med högfungerande autism samt ADHD",
    "annotation-id" : 14
  }, {
    "preferred-label" : "pedagogik",
    "sentiment" : "MUST_HAVE",
    "type" : "esco-skill",
    "start-position" : 3440,
    "end-position" : 3449,
    "concept-id" : "sJiS_Pvn_PZu",
    "matched-string" : "pedagogik",
    "annotation-id" : 6
  }, {
    "preferred-label" : "Neuropsykologisk funktionsnedsättning, omsorgserfarenhet",
    "sentiment" : "MUST_HAVE",
    "type" : "skill",
    "start-position" : 3553,
    "end-position" : 3580,
    "concept-id" : "tg1e_QpF_xdX",
    "matched-string" : "neuropsykiatriska diagnoser",
    "annotation-id" : 15
  }, {
    "preferred-label" : "Korttidshem/Korttidsboende, LSS",
    "sentiment" : "MUST_HAVE",
    "type" : "skill",
    "start-position" : 3670,
    "end-position" : 3673,
    "concept-id" : "Xqn7_nQQ_ovW",
    "matched-string" : "LSS",
    "annotation-id" : 16
  }, {
    "preferred-label" : "Teckenspråk",
    "sentiment" : "MUST_HAVE",
    "type" : "skill",
    "start-position" : 3732,
    "end-position" : 3736,
    "concept-id" : "a23r_imK_PY1",
    "matched-string" : "TAKK",
    "annotation-id" : 17
  }, {
    "preferred-label" : "B",
    "sentiment" : "MUST_HAVE",
    "type" : "driving-licence",
    "start-position" : 3741,
    "end-position" : 3750,
    "concept-id" : "VTK8_WRx_GcM",
    "matched-string" : "B-körkort",
    "annotation-id" : 18
  }, {
    "preferred-label" : "Tillsvidareanställning (inkl. eventuell provanställning)",
    "type" : "employment-type",
    "start-position" : 3893,
    "end-position" : 3915,
    "concept-id" : "kpPX_CNN_gDU",
    "matched-string" : "Tillsvidareanställning",
    "annotation-id" : 19
  }, {
    "preferred-label" : "Heltid",
    "type" : "worktime-extent",
    "start-position" : 3929,
    "end-position" : 3935,
    "concept-id" : "6YE1_gAC_R2G",
    "matched-string" : "Heltid",
    "annotation-id" : 20
  }, {
    "preferred-label" : "Helsingborg",
    "type" : "municipality",
    "start-position" : 4014,
    "end-position" : 4026,
    "concept-id" : "qj3q_oXH_MGR",
    "matched-string" : "Helsingborgs",
    "annotation-id" : 21
  }, {
    "preferred-label" : "Helsingborg",
    "type" : "municipality",
    "start-position" : 4247,
    "end-position" : 4259,
    "concept-id" : "qj3q_oXH_MGR",
    "matched-string" : "Helsingborgs",
    "annotation-id" : 22
  } ],
  "text" : "Stödassistent till Skarans korttidsvistelse\nDu vill något. Det vill vi med! Vi vill skapa värde och bidra till livskvalitet för våra invånare, företag, organisationer och besökare. Vi gör det genom att lyssna, hjälpas åt, testa, lära oss och sen testar vi igen. Här är allt möjligt för dig som vill skapa, förändra, vårda, bygga, vägleda, utvecklas och göra skillnad. För Helsingborg är staden för dig som vill något. Om arbetsplatsen\nPå vård- och omsorgsförvaltningen arbetar vi med människor. Riktiga människor. Människor som, precis som du, lever livet. Vi är cirka 3000 medarbetare - från undersköterskor, sjuksköterskor och arbetsterapeuter till ekonomer, utredare och biståndshandläggare som på olika sätt bidrar till att stadens äldre och personer med funktionsnedsättning ska kunna leva ett rikt och självständigt liv.\n\nTill Barn och ungas korttidsboende kommer barn och ungdomar, och i vissa fall vuxna, med funktionsnedsättningar för kortare vistelser. Syftet är att erbjuda ett miljöombyte, avkoppling, möjlighet att träffa andra eller fungera som en förberedelse inför vuxenlivet.\n\nNu söker vi två stödassistenter till vårt team!\n\nVill du vara med och göra skillnad? Välkommen med din ansökan redan idag!\n\nArbetsbeskrivning\nI arbetet ingår allt från att stödja, hjälpa och se till att utveckla färdigheter för att rusta våra barn och unga för framtiden. Du kommer att ingå i ett team där det krävs kunskap och erfarenhet av olika funktionshinder då behovet skiljer sig åt vad för slags hjälp och stöd de behöver. \n\nI arbetet ingår det att vara kreativ, lyhörd och kunnig inom olika funktionshinder samt att arbeta tydliggörande och strukturerat. Arbetet kan vara krävande men är också fantastiskt roligt! Du ska vara beredd på att vara ute mycket och hitta på olika aktiviteter eller bara ta det lugnt. Det är ungdomarnas behov som styr.\n\nVi arbetar med arbetstidsmodellen tvättstugeschema där man önskar arbetstid utifrån ett resursbehov. Arbetstiden är schemalagd över dagtid, helger och kvällar.\n\nVi erbjuder dig ett omväxlande, ansvarsfullt och stimulerande arbete med möjligheter till egen utveckling. Arbetsplatsen är rökfri och hälsomedveten. Som anställd får du ett friskvårdsbidrag på 3000 kronor per år. Vi tillämpar önskad sysselsättningsgrad, vilket innebär att du bestämmer hur många procent du vill arbeta. \n\nKvalifikationer\nVi söker dig som har ett genuint intresse för att arbeta med människor och möter varje individ utifrån individens behov och önskemål. Du är trygg i dig själv och bekväm med att arbeta med personer som är i stort behov av kontinuitet och struktur. Det är extra viktigt att du har ett pedagogiskt synsätt, ett starkt brukarperspektiv och förmågan att utveckla verksamheten utifrån individens behov.\n\nDu kommer att ingå i ett sammanhang där det ställs höga krav på samarbetsförmåga och ansvarstagande. Vi vill också att du som söker är en god kollega med ett positivt synsätt. \n\nFör att gå vidare i rekryteringsprocessen behöver du ha\n\n\n• läst vård- och omsorgsprogrammet enligt GY 11 med fördjupning inom funktionshinderområdet eller psykiatri eller\n\n\n• läst barn- och fritidsprogrammet enligt GY 11 med fördjupning inom funktionshinderområdet eller\n\n\n• läst motsvarande utbildning som arbetsgivaren bedömer som likvärdig\n\n\n• erfarenhet och kunskap av arbete med högfungerande autism samt ADHD\n\n\n• erfarenhet av liknande arbete.\n\nDet är meriterande om du har\n\n\n• erfarenhet av tydliggörande pedagogik\n\n\n• kunskap och utbildning i lågaffektivt bemötande\n\n\n• kunskap om högfungerande barn och ungdomar med neuropsykiatriska diagnoser\n\n\n• eller har haft delegering i sond och/eller insulin\n\n\n• erfarenhet av att arbeta inom LSS eller inom skola/fritids\n\n\n• erfarenhet av att arbeta med TAKK\n\n\n• B-körkort.\n\nStor vikt läggs vid personlig lämplighet. Rekryteringen sker löpande.\n\nÖvrig information\nSista ansökningsdag: 2022-08-31\n\nAnställningsform: Tillsvidareanställning\n\nOmfattning: Heltid\n\nTillträdesdatum: 2022-09-01 eller enligt överenskommelse\n\nAntal tjänster: 2\n\nHelsingborgs stad arbetar mot diskriminering och för främjande av alla människors lika rättigheter och möjligheter. Sökande oavsett bakgrund är välkomna att söka till Helsingborgs stad. För att kvalitetssäkra rekryteringsprocessen i Helsingborgs stad använder vi rekryteringsverktyget ReachMee. Därför ber vi dig att skicka in din ansökan via ReachMee genom att klicka på ansökningslänken i annonsen. \n\nInnan möjlig anställning kommer en bakgrundskontroll ske. I de fall där kontroll av utdrag ur belastningsregister är lagstadgat kommer även detta att genomföras. \n\nDu som söker jobb och har skyddade personuppgifter ska kontakta rekryterande chef i annonsen som kommer guida dig vidare för en säker ansökningsprocess. Du ska inte ansöka digitalt via ansökningslänken. \n\nFackliga företrädare https://intranat.helsingborg.se/hr/samverkan-och-delaktighet/fackliga-foretradare/ Då vi inför denna rekrytering redan tagit ställning till de rekryteringskanaler vi önskar använda undanber vi oss vänligen men bestämt att bli kontaktade för ytterligare erbjudanden om kompetensförmedling, annonserings- och rekryteringshjälp."
}