{
  "meta" : {
    "jobad" : {
      "description" : {
        "requirements" : null,
        "needs" : null,
        "company_information" : null,
        "text_formatted" : "<p>Erpato Europe AB ökar stadigt och söker för supportavdelningens räkning ytterligare en medarbetare. Arbetsuppgifterna innefattar support av kassasystemet ”ES Kassasystem” för våra befintliga kunder. Kundsupportens främsta verktyg är telefonen, men det förekommer mycket ofta arbete på plats hos kund för nyinstallationer, felsökningar, problemlösningar m.m.</p><p>Vid tillfällen förekommer även arbeten hos kunder utanför Stockholm - däribland i vissa fall även hotellövernattningar.</p><p>Erpato Europe AB är ett nytänkande och modernt företag. Vi jobbar enbart mot företag och är tydliga med vårt budskap – vi levererar det våra kunder vill ha. Vi sitter i ljusa lokaler i Tyresö och vi erbjuder dig en trygg arbetsplats med trevliga kollegor i en gemytlig arbetsmiljö. Som medarbetare har du stor möjlighet att påverka din egen framtid. Vi erbjuder dig även goda utvecklingsmöjligheter inom företaget. Vi är ett snabbt växande företag inom marknaden för kassasystem (Point of Sale) för butiker, kiosker, restauranger, livsmedel m.m. Vi är idag 18 medarbetare totalt i verksamheten som jobbar tätt tillsammans i en effektfull miljö. Hos oss får du utvecklas i en trygg organisation utan kompromisser. Vi uppmuntrar initiativtagande, idéer, tankar och förslag.</p><p>Vi mottager endast ansökningar via e-post - inte via telefon. Vi söker framförallt dig som har ett gediget intresse för IT, datorer och teknologi. Erpato Europe AB står i framkant av marknadens kassasystem och är ofta först ut med nya tekniska funktioner – varvid det är viktigt att du är snabblärd. För oss är det viktigt att du VILL arbeta, har mycket god arbetsmoral samt att du brinner för teknik i allmänhet.</p><p>Som person är du tekniskt nyfiken, ansvarsfull och initiativtagande. Det är viktigt för oss att du har goda sociala kunskaper. Vi har ständig kontakt med våra kunder och det är viktigt att de känner sig väl omhändertagna - såväl över telefon som på plats hos kunden. Du skall kunna arbeta i grupp såväl som självständigt. Det är viktigt att du är pedagogiskt lagd och har lätt för att förklara tämligen komplicerade tekniska problem för människor som har mindre teknisk kunskap.</p><p>Vi ser gärna att du har någon form utav erfarenhet av IT och/eller kundsupport. Det är viktigt att du har förståelse för Windows och dess funktioner samt har viss kunskap inom nätverk. </p><p>Körkort B är ett definitivt krav.</p><p>Vi ser fram emot din ansökan!</p>",
        "conditions" : null,
        "text" : "Erpato Europe AB ökar stadigt och söker för supportavdelningens räkning ytterligare en medarbetare. Arbetsuppgifterna innefattar support av kassasystemet ”ES Kassasystem” för våra befintliga kunder. Kundsupportens främsta verktyg är telefonen, men det förekommer mycket ofta arbete på plats hos kund för nyinstallationer, felsökningar, problemlösningar m.m.\nVid tillfällen förekommer även arbeten hos kunder utanför Stockholm - däribland i vissa fall även hotellövernattningar.\nErpato Europe AB är ett nytänkande och modernt företag. Vi jobbar enbart mot företag och är tydliga med vårt budskap – vi levererar det våra kunder vill ha. Vi sitter i ljusa lokaler i Tyresö och vi erbjuder dig en trygg arbetsplats med trevliga kollegor i en gemytlig arbetsmiljö. Som medarbetare har du stor möjlighet att påverka din egen framtid. Vi erbjuder dig även goda utvecklingsmöjligheter inom företaget. Vi är ett snabbt växande företag inom marknaden för kassasystem (Point of Sale) för butiker, kiosker, restauranger, livsmedel m.m. Vi är idag 18 medarbetare totalt i verksamheten som jobbar tätt tillsammans i en effektfull miljö. Hos oss får du utvecklas i en trygg organisation utan kompromisser. Vi uppmuntrar initiativtagande, idéer, tankar och förslag.\nVi mottager endast ansökningar via e-post - inte via telefon. Vi söker framförallt dig som har ett gediget intresse för IT, datorer och teknologi. Erpato Europe AB står i framkant av marknadens kassasystem och är ofta först ut med nya tekniska funktioner – varvid det är viktigt att du är snabblärd. För oss är det viktigt att du VILL arbeta, har mycket god arbetsmoral samt att du brinner för teknik i allmänhet.\nSom person är du tekniskt nyfiken, ansvarsfull och initiativtagande. Det är viktigt för oss att du har goda sociala kunskaper. Vi har ständig kontakt med våra kunder och det är viktigt att de känner sig väl omhändertagna - såväl över telefon som på plats hos kunden. Du skall kunna arbeta i grupp såväl som självständigt. Det är viktigt att du är pedagogiskt lagd och har lätt för att förklara tämligen komplicerade tekniska problem för människor som har mindre teknisk kunskap.\nVi ser gärna att du har någon form utav erfarenhet av IT och/eller kundsupport. Det är viktigt att du har förståelse för Windows och dess funktioner samt har viss kunskap inom nätverk. \nKörkort B är ett definitivt krav.\nVi ser fram emot din ansökan!"
      },
      "headline" : "Supporttekniker för kassasystem",
      "driving_license" : [ {
        "concept_id" : "VTK8_WRx_GcM",
        "label" : "B",
        "legacy_ams_taxonomy_id" : "3"
      } ],
      "employer" : {
        "email" : null,
        "phone_number" : null,
        "organization_number" : "5567382626",
        "name" : "Erpato Europe AB",
        "url" : "http://www.eskassa.se",
        "workplace" : "Erpato Europe AB"
      },
      "removed_date" : null,
      "logo_url" : "https://www.arbetsformedlingen.se/rest/arbetsgivare/rest/af/v3/arbetsplatser/85127527/logotyper/logo.png",
      "last_publication_date" : "2022-07-29T23:59:59",
      "number_of_vacancies" : 1,
      "occupation" : {
        "concept_id" : "KQty_E1u_cia",
        "label" : "Helpdesktekniker/Supporttekniker",
        "legacy_ams_taxonomy_id" : "7020"
      },
      "occupation_group" : {
        "concept_id" : "hmaC_cfi_UKg",
        "label" : "Supporttekniker, IT",
        "legacy_ams_taxonomy_id" : "3512"
      },
      "employment_type" : {
        "concept_id" : "PFZr_Syz_cUq",
        "label" : "Vanlig anställning",
        "legacy_ams_taxonomy_id" : "1"
      },
      "webpage_url" : "https://arbetsformedlingen.se/platsbanken/annonser/26269672",
      "driving_license_required" : true,
      "application_contacts" : [ {
        "description" : null,
        "email" : "ronenb@erpato.se",
        "telephone" : null,
        "name" : "Ronén Björkquist",
        "contact_type" : "Supportansvarig"
      } ],
      "duration" : {
        "concept_id" : "a7uU_j21_mkL",
        "label" : "Tills vidare",
        "legacy_ams_taxonomy_id" : "1"
      },
      "nice_to_have" : {
        "education_level" : [ ],
        "work_experiences" : [ {
          "concept_id" : "KQty_E1u_cia",
          "weight" : 5,
          "label" : "Helpdesktekniker/Supporttekniker",
          "legacy_ams_taxonomy_id" : "7020"
        } ],
        "skills" : [ {
          "concept_id" : "aMyW_hB7_TpU",
          "weight" : 5,
          "label" : "Kundtjänst",
          "legacy_ams_taxonomy_id" : "602039"
        }, {
          "concept_id" : "G4sF_xod_zoq",
          "weight" : 5,
          "label" : "Windows, operativsystem",
          "legacy_ams_taxonomy_id" : "6466"
        }, {
          "concept_id" : "voRm_aoU_cKB",
          "weight" : 5,
          "label" : "SQL-Server, databashanterare",
          "legacy_ams_taxonomy_id" : "605655"
        }, {
          "concept_id" : "TFQD_onf_Tid",
          "weight" : 5,
          "label" : "Användarsupport, mjukvara",
          "legacy_ams_taxonomy_id" : "605533"
        }, {
          "concept_id" : "9qgQ_QyK_VVh",
          "weight" : 5,
          "label" : "Användarsupport, hårdvara",
          "legacy_ams_taxonomy_id" : "605534"
        }, {
          "concept_id" : "hYpk_RYx_y3V",
          "weight" : 5,
          "label" : "Kassavana",
          "legacy_ams_taxonomy_id" : "2904"
        }, {
          "concept_id" : "EcuE_BY7_mc4",
          "weight" : 5,
          "label" : "Kassaredovisning",
          "legacy_ams_taxonomy_id" : "604248"
        }, {
          "concept_id" : "urLT_mLe_FHv",
          "weight" : 5,
          "label" : "PC-datorer, installation och underhåll",
          "legacy_ams_taxonomy_id" : "605743"
        }, {
          "concept_id" : "Bc4A_Z6e_Pq1",
          "weight" : 5,
          "label" : "Datorer och kringutrustning",
          "legacy_ams_taxonomy_id" : "602946"
        }, {
          "concept_id" : "ZDFR_2Mr_Hpn",
          "weight" : 5,
          "label" : "Router, installation och underhåll",
          "legacy_ams_taxonomy_id" : "605745"
        }, {
          "concept_id" : "Fiq4_siu_LXn",
          "weight" : 5,
          "label" : "Bokföringsvana",
          "legacy_ams_taxonomy_id" : "773"
        } ],
        "education" : [ ],
        "languages" : [ ]
      },
      "application_details" : {
        "via_af" : false,
        "email" : "info@erpato.se",
        "other" : null,
        "reference" : "Ansökan: supporttekniker",
        "url" : null,
        "information" : null
      },
      "source_type" : "VIA_ANNONSERA",
      "application_deadline" : "2022-07-29T23:59:59",
      "external_id" : null,
      "workplace_address" : {
        "coordinates" : [ 18.189763239878854, 59.239079131030714 ],
        "city" : "Stockholm",
        "postcode" : "13570",
        "municipality" : "Tyresö",
        "region_concept_id" : "CifL_Rzy_Mku",
        "region" : "Stockholms län",
        "country_code" : "199",
        "region_code" : "01",
        "municipality_concept_id" : "sTPc_k2B_SqV",
        "country_concept_id" : "i46j_HmG_v64",
        "municipality_code" : "0138",
        "street_address" : "Solkraftsvägen 33",
        "country" : "Sverige"
      },
      "id" : "26269672",
      "experience_required" : true,
      "working_hours_type" : {
        "concept_id" : "6YE1_gAC_R2G",
        "label" : "Heltid",
        "legacy_ams_taxonomy_id" : "1"
      },
      "access" : null,
      "timestamp" : 1656469030800,
      "must_have" : {
        "education_level" : [ ],
        "work_experiences" : [ ],
        "skills" : [ ],
        "education" : [ ],
        "languages" : [ {
          "concept_id" : "zSLA_vw2_FXN",
          "weight" : 10,
          "label" : "Svenska",
          "legacy_ams_taxonomy_id" : "502"
        }, {
          "concept_id" : "NVxJ_hLg_TYS",
          "weight" : 10,
          "label" : "Engelska",
          "legacy_ams_taxonomy_id" : "283"
        } ]
      },
      "occupation_field" : {
        "concept_id" : "apaJ_2ja_LuF",
        "label" : "Data/IT",
        "legacy_ams_taxonomy_id" : "3"
      },
      "scope_of_work" : {
        "min" : 0,
        "max" : 100
      },
      "salary_type" : {
        "concept_id" : "oG8G_9cW_nRf",
        "label" : "Fast månads- vecko- eller timlön",
        "legacy_ams_taxonomy_id" : "1"
      },
      "removed" : false,
      "salary_description" : null,
      "access_to_own_car" : false,
      "publication_date" : "2022-06-29T04:17:10"
    },
    "name" : "Supporttekniker för kassasystem",
    "user" : "hannes"
  },
  "sha1" : "6a5772ce31ca8e7a3dbd187cf32430867d33be27",
  "annotations" : [ {
    "preferred-label" : "Helpdesktekniker/Supporttekniker",
    "sentiment" : "MUST_HAVE",
    "type" : "occupation-name",
    "start-position" : 0,
    "end-position" : 15,
    "concept-id" : "KQty_E1u_cia",
    "matched-string" : "supporttekniker",
    "annotation-id" : 0
  }, {
    "preferred-label" : "IT-support",
    "type" : "keyword",
    "start-position" : 76,
    "end-position" : 95,
    "concept-id" : "1Nz1_z46_39V",
    "matched-string" : "supportavdelningens",
    "annotation-id" : 8
  }, {
    "preferred-label" : "göra felsökning",
    "type" : "esco-skill",
    "start-position" : 354,
    "end-position" : 366,
    "concept-id" : "HqC8_fVY_ACM",
    "matched-string" : "felsökningar",
    "annotation-id" : 9
  }, {
    "preferred-label" : "Stockholm",
    "type" : "municipality",
    "start-position" : 448,
    "end-position" : 457,
    "concept-id" : "AvNB_uwa_6n6",
    "matched-string" : "Stockholm",
    "annotation-id" : 10
  }, {
    "preferred-label" : "Tyresö",
    "type" : "municipality",
    "start-position" : 695,
    "end-position" : 701,
    "concept-id" : "sTPc_k2B_SqV",
    "matched-string" : "Tyresö",
    "annotation-id" : 11
  }, {
    "preferred-label" : "arbetsmiljö",
    "sentiment" : "MUST_HAVE",
    "type" : "esco-skill",
    "start-position" : 779,
    "end-position" : 790,
    "concept-id" : "zdQY_QJh_nUH",
    "matched-string" : "arbetsmiljö",
    "annotation-id" : 2
  }, {
    "preferred-label" : "Butik",
    "type" : "keyword",
    "start-position" : 1009,
    "end-position" : 1016,
    "concept-id" : "xLsd_zjY_5wr",
    "matched-string" : "butiker",
    "annotation-id" : 12
  }, {
    "preferred-label" : "Restaurang",
    "type" : "keyword",
    "start-position" : 1027,
    "end-position" : 1039,
    "concept-id" : "o2Cg_3Ap_qvK",
    "matched-string" : "restauranger",
    "annotation-id" : 13
  }, {
    "preferred-label" : "Livsmedel",
    "sentiment" : "MUST_HAVE",
    "type" : "skill",
    "start-position" : 1041,
    "end-position" : 1050,
    "concept-id" : "tdbu_fUL_MnC",
    "matched-string" : "livsmedel",
    "annotation-id" : 3
  }, {
    "preferred-label" : "Data/IT",
    "sentiment" : "MUST_HAVE",
    "type" : "occupation-field",
    "start-position" : 1402,
    "end-position" : 1404,
    "concept-id" : "apaJ_2ja_LuF",
    "matched-string" : "it",
    "annotation-id" : 4
  }, {
    "preferred-label" : "Teknologi",
    "sentiment" : "MUST_HAVE",
    "type" : "keyword",
    "start-position" : 1418,
    "end-position" : 1427,
    "concept-id" : "KQjv_TUZ_Hy9",
    "matched-string" : "teknologi",
    "annotation-id" : 5
  }, {
    "preferred-label" : "Data/IT",
    "sentiment" : "MUST_HAVE",
    "type" : "occupation-field",
    "start-position" : 2229,
    "end-position" : 2231,
    "concept-id" : "apaJ_2ja_LuF",
    "matched-string" : "it",
    "annotation-id" : 6
  }, {
    "preferred-label" : "Windows, operativsystem",
    "sentiment" : "MUST_HAVE",
    "type" : "skill",
    "start-position" : 2296,
    "end-position" : 2303,
    "concept-id" : "G4sF_xod_zoq",
    "matched-string" : "windows",
    "annotation-id" : 7
  }, {
    "preferred-label" : "B",
    "type" : "driving-licence",
    "start-position" : 2361,
    "end-position" : 2370,
    "concept-id" : "VTK8_WRx_GcM",
    "matched-string" : "Körkort B",
    "annotation-id" : 14
  } ],
  "text" : "Supporttekniker för kassasystem\nErpato Europe AB ökar stadigt och söker för supportavdelningens räkning ytterligare en medarbetare. Arbetsuppgifterna innefattar support av kassasystemet ”ES Kassasystem” för våra befintliga kunder. Kundsupportens främsta verktyg är telefonen, men det förekommer mycket ofta arbete på plats hos kund för nyinstallationer, felsökningar, problemlösningar m.m.\nVid tillfällen förekommer även arbeten hos kunder utanför Stockholm - däribland i vissa fall även hotellövernattningar.\nErpato Europe AB är ett nytänkande och modernt företag. Vi jobbar enbart mot företag och är tydliga med vårt budskap – vi levererar det våra kunder vill ha. Vi sitter i ljusa lokaler i Tyresö och vi erbjuder dig en trygg arbetsplats med trevliga kollegor i en gemytlig arbetsmiljö. Som medarbetare har du stor möjlighet att påverka din egen framtid. Vi erbjuder dig även goda utvecklingsmöjligheter inom företaget. Vi är ett snabbt växande företag inom marknaden för kassasystem (Point of Sale) för butiker, kiosker, restauranger, livsmedel m.m. Vi är idag 18 medarbetare totalt i verksamheten som jobbar tätt tillsammans i en effektfull miljö. Hos oss får du utvecklas i en trygg organisation utan kompromisser. Vi uppmuntrar initiativtagande, idéer, tankar och förslag.\nVi mottager endast ansökningar via e-post - inte via telefon. Vi söker framförallt dig som har ett gediget intresse för IT, datorer och teknologi. Erpato Europe AB står i framkant av marknadens kassasystem och är ofta först ut med nya tekniska funktioner – varvid det är viktigt att du är snabblärd. För oss är det viktigt att du VILL arbeta, har mycket god arbetsmoral samt att du brinner för teknik i allmänhet.\nSom person är du tekniskt nyfiken, ansvarsfull och initiativtagande. Det är viktigt för oss att du har goda sociala kunskaper. Vi har ständig kontakt med våra kunder och det är viktigt att de känner sig väl omhändertagna - såväl över telefon som på plats hos kunden. Du skall kunna arbeta i grupp såväl som självständigt. Det är viktigt att du är pedagogiskt lagd och har lätt för att förklara tämligen komplicerade tekniska problem för människor som har mindre teknisk kunskap.\nVi ser gärna att du har någon form utav erfarenhet av IT och/eller kundsupport. Det är viktigt att du har förståelse för Windows och dess funktioner samt har viss kunskap inom nätverk. \nKörkort B är ett definitivt krav.\nVi ser fram emot din ansökan!"
}