{
  "meta" : {
    "jobad" : {
      "description" : {
        "requirements" : null,
        "needs" : null,
        "company_information" : null,
        "text_formatted" : "<p>Vi söker just nu en pizzabagare och en diskare till restaurang Mythos belägen i centrala Mora.</p><p>Vi söker en pizzabagare med minst 1-2 års erfarenhet som är stresstålig och jobbar strukturerat. </p><p>Vi söker även en diskare, arbetsuppgifter innefattar att plocka disk, diska, sortera och hjälpa till med det som är relevant i köket. Erfarenhet är inget krav, men bara plus om du har. </p><p>Vi förutsätter att du delar våra värderingar: kunden i fokus, utmärkt kvalitet och samarbete.</p><p>Urval sker löpande, skicka därför in din ansökan så snart som möjligt. </p>",
        "conditions" : null,
        "text" : "Vi söker just nu en pizzabagare och en diskare till restaurang Mythos belägen i centrala Mora.\nVi söker en pizzabagare med minst 1-2 års erfarenhet som är stresstålig och jobbar strukturerat. \nVi söker även en diskare, arbetsuppgifter innefattar att plocka disk, diska, sortera och hjälpa till med det som är relevant i köket. Erfarenhet är inget krav, men bara plus om du har. \nVi förutsätter att du delar våra värderingar: kunden i fokus, utmärkt kvalitet och samarbete.\nUrval sker löpande, skicka därför in din ansökan så snart som möjligt."
      },
      "headline" : "Pizzabagare och diskare sökes till restaurang i Mora",
      "driving_license" : null,
      "employer" : {
        "email" : null,
        "phone_number" : null,
        "organization_number" : "9697840305",
        "name" : "Dewran 47 HB",
        "url" : null,
        "workplace" : "Dewran 47 HB"
      },
      "removed_date" : null,
      "logo_url" : null,
      "last_publication_date" : "2023-01-01T00:00:00",
      "number_of_vacancies" : 3,
      "occupation" : {
        "concept_id" : "9YaE_Syg_5ZB",
        "label" : "Pizzabagare",
        "legacy_ams_taxonomy_id" : "5505"
      },
      "occupation_group" : {
        "concept_id" : "a8gg_ktU_w8V",
        "label" : "Pizzabagare m.fl.",
        "legacy_ams_taxonomy_id" : "9411"
      },
      "employment_type" : {
        "concept_id" : "PFZr_Syz_cUq",
        "label" : "Vanlig anställning",
        "legacy_ams_taxonomy_id" : "1"
      },
      "webpage_url" : "https://arbetsformedlingen.se/platsbanken/annonser/26431498",
      "driving_license_required" : false,
      "application_contacts" : [ {
        "description" : null,
        "email" : "Sertan.ceken@hotmail.com",
        "telephone" : "0729471453",
        "name" : "Serkan Ceken",
        "contact_type" : null
      } ],
      "duration" : {
        "concept_id" : "a7uU_j21_mkL",
        "label" : "Tills vidare",
        "legacy_ams_taxonomy_id" : "1"
      },
      "nice_to_have" : {
        "education_level" : [ ],
        "work_experiences" : [ {
          "concept_id" : "9YaE_Syg_5ZB",
          "weight" : 5,
          "label" : "Pizzabagare",
          "legacy_ams_taxonomy_id" : "5505"
        } ],
        "skills" : [ ],
        "education" : [ ],
        "languages" : [ {
          "concept_id" : "zSLA_vw2_FXN",
          "weight" : 5,
          "label" : "Svenska",
          "legacy_ams_taxonomy_id" : "502"
        }, {
          "concept_id" : "NVxJ_hLg_TYS",
          "weight" : 5,
          "label" : "Engelska",
          "legacy_ams_taxonomy_id" : "283"
        }, {
          "concept_id" : "JxfJ_kyR_CQZ",
          "weight" : 5,
          "label" : "Kurdiska",
          "legacy_ams_taxonomy_id" : "352"
        }, {
          "concept_id" : "UaRX_FvG_rKF",
          "weight" : 5,
          "label" : "Turkiska",
          "legacy_ams_taxonomy_id" : "481"
        } ]
      },
      "application_details" : {
        "via_af" : false,
        "email" : "sertan.ceken@hotmail.com",
        "other" : "Vi tar emot sökningar via E-post och telefonsamtal",
        "reference" : "Ansökan: Mythos",
        "url" : null,
        "information" : null
      },
      "source_type" : "VIA_ANNONSERA",
      "application_deadline" : "2023-01-01T00:00:00",
      "external_id" : null,
      "workplace_address" : {
        "coordinates" : [ 14.538328870202601, 61.00474637471248 ],
        "city" : "Mora",
        "postcode" : "79230",
        "municipality" : "Mora",
        "region_concept_id" : "oDpK_oZ2_WYt",
        "region" : "Dalarnas län",
        "country_code" : "199",
        "region_code" : "20",
        "municipality_concept_id" : "UGcC_kYx_fTs",
        "country_concept_id" : "i46j_HmG_v64",
        "municipality_code" : "2062",
        "street_address" : "Kyrkogatan 19",
        "country" : "Sverige"
      },
      "id" : "26431498",
      "experience_required" : true,
      "working_hours_type" : {
        "concept_id" : "6YE1_gAC_R2G",
        "label" : "Heltid",
        "legacy_ams_taxonomy_id" : "1"
      },
      "access" : null,
      "timestamp" : 1660909090275,
      "must_have" : {
        "education_level" : [ ],
        "work_experiences" : [ ],
        "skills" : [ ],
        "education" : [ ],
        "languages" : [ ]
      },
      "occupation_field" : {
        "concept_id" : "ScKy_FHB_7wT",
        "label" : "Hotell, restaurang, storhushåll",
        "legacy_ams_taxonomy_id" : "7"
      },
      "scope_of_work" : {
        "min" : 0,
        "max" : 100
      },
      "salary_type" : {
        "concept_id" : "oG8G_9cW_nRf",
        "label" : "Fast månads- vecko- eller timlön",
        "legacy_ams_taxonomy_id" : "1"
      },
      "removed" : false,
      "salary_description" : null,
      "access_to_own_car" : false,
      "publication_date" : "2022-08-19T13:38:10"
    },
    "name" : "Pizzabagare och diskare sökes till restaurang i Mora",
    "user" : "hannes"
  },
  "sha1" : "dbab532f0759ce55b68905e2d4e45a374df693e0",
  "annotations" : [ {
    "preferred-label" : "Pizzabagare",
    "sentiment" : "MUST_HAVE",
    "type" : "occupation-name",
    "start-position" : 0,
    "end-position" : 11,
    "concept-id" : "9YaE_Syg_5ZB",
    "matched-string" : "pizzabagare",
    "annotation-id" : 0
  }, {
    "preferred-label" : "Diskare",
    "sentiment" : "MUST_HAVE",
    "type" : "occupation-name",
    "start-position" : 16,
    "end-position" : 23,
    "concept-id" : "pKTY_Kwu_sUw",
    "matched-string" : "diskare",
    "annotation-id" : 1
  }, {
    "preferred-label" : "Restaurang",
    "sentiment" : "NOT_RELEVANT",
    "type" : "keyword",
    "start-position" : 35,
    "end-position" : 45,
    "concept-id" : "o2Cg_3Ap_qvK",
    "matched-string" : "restaurang",
    "annotation-id" : 2
  }, {
    "preferred-label" : "Mora",
    "sentiment" : "NOT_RELEVANT",
    "type" : "municipality",
    "start-position" : 48,
    "end-position" : 52,
    "concept-id" : "UGcC_kYx_fTs",
    "matched-string" : "Mora",
    "annotation-id" : 8
  }, {
    "preferred-label" : "Pizzabagare",
    "sentiment" : "MUST_HAVE",
    "type" : "occupation-name",
    "start-position" : 73,
    "end-position" : 84,
    "concept-id" : "9YaE_Syg_5ZB",
    "matched-string" : "pizzabagare",
    "annotation-id" : 3
  }, {
    "preferred-label" : "Diskare",
    "sentiment" : "MUST_HAVE",
    "type" : "occupation-name",
    "start-position" : 92,
    "end-position" : 99,
    "concept-id" : "pKTY_Kwu_sUw",
    "matched-string" : "diskare",
    "annotation-id" : 4
  }, {
    "preferred-label" : "Restaurang",
    "sentiment" : "MUST_HAVE",
    "type" : "keyword",
    "start-position" : 105,
    "end-position" : 115,
    "concept-id" : "o2Cg_3Ap_qvK",
    "matched-string" : "restaurang",
    "annotation-id" : 5
  }, {
    "preferred-label" : "Mora",
    "sentiment" : "NOT_RELEVANT",
    "type" : "municipality",
    "start-position" : 142,
    "end-position" : 146,
    "concept-id" : "UGcC_kYx_fTs",
    "matched-string" : "Mora",
    "annotation-id" : 9
  }, {
    "preferred-label" : "Pizzabagare",
    "sentiment" : "MUST_HAVE",
    "type" : "occupation-name",
    "start-position" : 160,
    "end-position" : 171,
    "concept-id" : "9YaE_Syg_5ZB",
    "matched-string" : "pizzabagare",
    "annotation-id" : 6
  }, {
    "preferred-label" : "1-2 års erfarenhet",
    "sentiment" : "MUST_HAVE",
    "type" : "occupation-experience-year",
    "start-position" : 176,
    "end-position" : 200,
    "concept-id" : "LLnd_5GJ_4ju",
    "matched-string" : "minst 1-2 års erfarenhet",
    "annotation-id" : 10
  }, {
    "preferred-label" : "hantera stress",
    "sentiment" : "MUST_HAVE",
    "type" : "esco-skill",
    "start-position" : 208,
    "end-position" : 219,
    "concept-id" : "z5Zo_DVb_VEK",
    "matched-string" : "stresstålig",
    "annotation-id" : 11
  }, {
    "preferred-label" : "Diskare",
    "sentiment" : "MUST_HAVE",
    "type" : "occupation-name",
    "start-position" : 263,
    "end-position" : 270,
    "concept-id" : "pKTY_Kwu_sUw",
    "matched-string" : "diskare",
    "annotation-id" : 7
  }, {
    "preferred-label" : "diska",
    "sentiment" : "MUST_HAVE",
    "type" : "esco-skill",
    "start-position" : 316,
    "end-position" : 321,
    "concept-id" : "Hkh7_SuX_4k1",
    "matched-string" : "diska",
    "annotation-id" : 12
  } ],
  "text" : "Pizzabagare och diskare sökes till restaurang i Mora\nVi söker just nu en pizzabagare och en diskare till restaurang Mythos belägen i centrala Mora.\nVi söker en pizzabagare med minst 1-2 års erfarenhet som är stresstålig och jobbar strukturerat. \nVi söker även en diskare, arbetsuppgifter innefattar att plocka disk, diska, sortera och hjälpa till med det som är relevant i köket. Erfarenhet är inget krav, men bara plus om du har. \nVi förutsätter att du delar våra värderingar: kunden i fokus, utmärkt kvalitet och samarbete.\nUrval sker löpande, skicka därför in din ansökan så snart som möjligt."
}