{
  "meta" : {
    "jobad" : {
      "description" : {
        "requirements" : null,
        "needs" : null,
        "company_information" : null,
        "text_formatted" : "I Lysekils kommun arbetar ca 1400 medarbetare som har Sveriges viktigaste jobb – vi gör skillnad i människors vardag och bygger ett samhälle för alla. Det är med andra ord ett arbete att känna stolthet över.  Vårt jobb är att ge de 14 400 invånarna i Lysekils kommun service, stöd och hjälp. Tillsammans utvecklar vi verksamheterna.\n\n\nEtt liv i Lysekils kommun är ett liv nära havet och naturen – här finns möjlighet till både eftertanke och äventyr i en av Bohusläns vackra kustkommuner. På livetilysekil.se http://www.livetilysekil.se/ får du veta mer om hur ett liv i vår kommun kan se ut. \n\n\nVår vision: Lysekils kommun är en hållbar och attraktiv kommun året runt som kännetecknas av kreativitet och framtidstro. Lysekil är en självklar mötesplats och ledande inom maritima näringar.\n\n\n\r\n\r\nBeskrivning\n\n\nVår fritidsanläggning Gullmarsborg som inkluderar sim- och ishall är en central del av vårt totala anläggningsutbud i kommunen.\r\n\r\nI denna anläggning finns även kommunens fritidskontor, danslokaler och en fritidsgård. Vi söker nu en person till vår personalgrupp som skall arbeta med administration.\n\nVi är stolta över vår verksamhet och har en vilja att ständigt utvecklas och bli bättre. Vi är därför intresserade av vad du kan bidra med inom ramen för denna tjänst. Vårt arbete genomsyras av kommunens värdeord; Öppet, Enkelt, Värdigt.\n\n\nArbetsuppgifter\n\nTjänsten innebär att du arbetar med administrativa uppgifter såsom ansvar för bokning av vår fritidsanläggning, fakturahantering och receptionsansvar. Tjänsten innebär kundkontakt och olika typer av administrations- och faktureringsuppgifter samt beställningar av varor och kontakt med leverantörer.\nTjänsten innebär även att du arbetar utifrån vår simhallsreception, har städuppgifter i sim- och ishall samt angränsande lokaler. I simhallsreceptionen arbetar du för att alla våra gäster ska känna sig välkomna. Du ger ett gott bemötande och en god service till våra gäster och bemöter dem utifrån deras behov.  Badbevakning och simskoleverksamhet kan komma att ingå i arbetsuppgiften.\n\nKvalifikationer\n\nFör att lyckas i den här rollen krävs utbildning på gymnasial nivå inom området administration alternativt arbetslivserfarenhet som arbetsgivaren bedömer likvärdig. För att lyckas behöver du ha goda kunskaper inom klassiska receptionsuppgifter, ha servicekänsla och vi ser gärna erfarenhet från tidigare administrativt och receptionsarbete. Det är viktigt att du är flexibel, välorganiserad kan arbeta såväl effektivt som strategisk.\n\nVi söker dig som är säkerhetsmedveten, ansvarstagande, trygg och engagerad och står för värderingar som ömsesidig respekt, tolerans och öppenhet. Du ser möten med alla våra kunder som en spännande och givande uppgift. Du är van att arbeta målinriktat och självständigt och har goda kunskaper i Officepaketet.\n\nGod samarbetsförmåga och servicekänsla är för dig en självklarhet eftersom du kommer att arbeta i grupp tillsammans med dina kollegor i Gullmarsborg. Stor vikt läggs vid personlig lämplighet. Du blir ett ansikte utåt mot våra kunder.\n\nDet är meriterande om du har;\n\n - Simlärarutbildning eller poollivräddarutbildning.\n - Friskvårdsutbildning.\n - HLR-certifikat\n\nKörkortsinnehav är önskvärt. \n\nVillkor\n\nSchemalagd arbetstid (dag, kväll och helg) med omfattning motsvarande heltid.\nFör den som erbjuds tjänsten krävs enligt Lagen om registerkontroll utdrag från Rikspolisens belastningsregister. Beställ gärna detta i samband med ansökan, så att det finns tillgängligt ifall du blir aktuell för tjänsten. \n\nTjänsten tillsätts utifrån att erforderliga beslut fattas. Urval och intervjuer kan ske löpande så sök idag!\n\nVi arbetar aktivt med mångfald för att tillvarata de kvaliteter som sökande med olika bakgrund har. Till bemannings- och rekryteringsföretag och till dig som är försäljare: Vi undanber oss vänligen men bestämt direktkontakt med bemannings- och rekryteringsföretag samt försäljare av ytterligare jobbannonser.\n\n\n ",
        "conditions" : "100 %. Tillträde: Snarast eller enligt överenskommelse\r\nTillsvidareanställning",
        "text" : "I Lysekils kommun arbetar ca 1400 medarbetare som har Sveriges viktigaste jobb – vi gör skillnad i människors vardag och bygger ett samhälle för alla. Det är med andra ord ett arbete att känna stolthet över.  Vårt jobb är att ge de 14 400 invånarna i Lysekils kommun service, stöd och hjälp. Tillsammans utvecklar vi verksamheterna.\n\n\nEtt liv i Lysekils kommun är ett liv nära havet och naturen – här finns möjlighet till både eftertanke och äventyr i en av Bohusläns vackra kustkommuner. På livetilysekil.se http://www.livetilysekil.se/ får du veta mer om hur ett liv i vår kommun kan se ut. \n\n\nVår vision: Lysekils kommun är en hållbar och attraktiv kommun året runt som kännetecknas av kreativitet och framtidstro. Lysekil är en självklar mötesplats och ledande inom maritima näringar.\n\n\n\r\n\r\nBeskrivning\n\n\nVår fritidsanläggning Gullmarsborg som inkluderar sim- och ishall är en central del av vårt totala anläggningsutbud i kommunen.\r\n\r\nI denna anläggning finns även kommunens fritidskontor, danslokaler och en fritidsgård. Vi söker nu en person till vår personalgrupp som skall arbeta med administration.\n\nVi är stolta över vår verksamhet och har en vilja att ständigt utvecklas och bli bättre. Vi är därför intresserade av vad du kan bidra med inom ramen för denna tjänst. Vårt arbete genomsyras av kommunens värdeord; Öppet, Enkelt, Värdigt.\n\n\nArbetsuppgifter\n\nTjänsten innebär att du arbetar med administrativa uppgifter såsom ansvar för bokning av vår fritidsanläggning, fakturahantering och receptionsansvar. Tjänsten innebär kundkontakt och olika typer av administrations- och faktureringsuppgifter samt beställningar av varor och kontakt med leverantörer.\nTjänsten innebär även att du arbetar utifrån vår simhallsreception, har städuppgifter i sim- och ishall samt angränsande lokaler. I simhallsreceptionen arbetar du för att alla våra gäster ska känna sig välkomna. Du ger ett gott bemötande och en god service till våra gäster och bemöter dem utifrån deras behov.  Badbevakning och simskoleverksamhet kan komma att ingå i arbetsuppgiften.\n\nKvalifikationer\n\nFör att lyckas i den här rollen krävs utbildning på gymnasial nivå inom området administration alternativt arbetslivserfarenhet som arbetsgivaren bedömer likvärdig. För att lyckas behöver du ha goda kunskaper inom klassiska receptionsuppgifter, ha servicekänsla och vi ser gärna erfarenhet från tidigare administrativt och receptionsarbete. Det är viktigt att du är flexibel, välorganiserad kan arbeta såväl effektivt som strategisk.\n\nVi söker dig som är säkerhetsmedveten, ansvarstagande, trygg och engagerad och står för värderingar som ömsesidig respekt, tolerans och öppenhet. Du ser möten med alla våra kunder som en spännande och givande uppgift. Du är van att arbeta målinriktat och självständigt och har goda kunskaper i Officepaketet.\n\nGod samarbetsförmåga och servicekänsla är för dig en självklarhet eftersom du kommer att arbeta i grupp tillsammans med dina kollegor i Gullmarsborg. Stor vikt läggs vid personlig lämplighet. Du blir ett ansikte utåt mot våra kunder.\n\nDet är meriterande om du har;\n\n - Simlärarutbildning eller poollivräddarutbildning.\n - Friskvårdsutbildning.\n - HLR-certifikat\n\nKörkortsinnehav är önskvärt. \n\nVillkor\n\nSchemalagd arbetstid (dag, kväll och helg) med omfattning motsvarande heltid.\nFör den som erbjuds tjänsten krävs enligt Lagen om registerkontroll utdrag från Rikspolisens belastningsregister. Beställ gärna detta i samband med ansökan, så att det finns tillgängligt ifall du blir aktuell för tjänsten. \n\nTjänsten tillsätts utifrån att erforderliga beslut fattas. Urval och intervjuer kan ske löpande så sök idag!\n\nVi arbetar aktivt med mångfald för att tillvarata de kvaliteter som sökande med olika bakgrund har. Till bemannings- och rekryteringsföretag och till dig som är försäljare: Vi undanber oss vänligen men bestämt direktkontakt med bemannings- och rekryteringsföretag samt försäljare av ytterligare jobbannonser."
      },
      "headline" : "Administratör till Gullmarsborg",
      "driving_license" : null,
      "employer" : {
        "email" : null,
        "phone_number" : null,
        "organization_number" : "2120001389",
        "name" : "Lysekils kommun",
        "url" : null,
        "workplace" : "Utbildningsförvaltningen"
      },
      "removed_date" : null,
      "logo_url" : null,
      "last_publication_date" : "2022-09-11T23:59:59",
      "number_of_vacancies" : 1,
      "occupation" : {
        "concept_id" : "s5pR_WNm_R8W",
        "label" : "Administrativ assistent",
        "legacy_ams_taxonomy_id" : "2787"
      },
      "occupation_group" : {
        "concept_id" : "eQ4M_CNm_ozj",
        "label" : "Övriga kontorsassistenter och sekreterare",
        "legacy_ams_taxonomy_id" : "4119"
      },
      "employment_type" : {
        "concept_id" : "PFZr_Syz_cUq",
        "label" : "Vanlig anställning",
        "legacy_ams_taxonomy_id" : "1"
      },
      "webpage_url" : "https://arbetsformedlingen.se/platsbanken/annonser/26365316",
      "driving_license_required" : false,
      "application_contacts" : [ {
        "description" : "Mustafa Abdanabo",
        "email" : null,
        "telephone" : "0722-038080",
        "name" : null,
        "contact_type" : null
      } ],
      "duration" : {
        "concept_id" : "a7uU_j21_mkL",
        "label" : "Tills vidare",
        "legacy_ams_taxonomy_id" : "1"
      },
      "nice_to_have" : {
        "education_level" : [ ],
        "work_experiences" : [ ],
        "skills" : [ ],
        "education" : [ ],
        "languages" : [ ]
      },
      "application_details" : {
        "via_af" : false,
        "email" : null,
        "other" : null,
        "reference" : "2022/149",
        "url" : "https://lysekil.varbi.com/what:job/jobID:532200/type:job/where:1/apply:1",
        "information" : null
      },
      "source_type" : "VIA_PLATSBANKEN_DXA",
      "application_deadline" : "2022-09-11T23:59:59",
      "external_id" : "46-212000-1389-532200",
      "workplace_address" : {
        "coordinates" : [ 11.435558, 58.275574 ],
        "city" : null,
        "postcode" : null,
        "municipality" : "Lysekil",
        "region_concept_id" : "zdoY_6u5_Krt",
        "region" : "Västra Götalands län",
        "country_code" : "199",
        "region_code" : "14",
        "municipality_concept_id" : "z2cX_rjC_zFo",
        "country_concept_id" : "i46j_HmG_v64",
        "municipality_code" : "1484",
        "street_address" : null,
        "country" : "Sverige"
      },
      "id" : "26365316",
      "experience_required" : false,
      "working_hours_type" : {
        "concept_id" : "6YE1_gAC_R2G",
        "label" : "Heltid",
        "legacy_ams_taxonomy_id" : "1"
      },
      "access" : null,
      "timestamp" : 1659334415297,
      "must_have" : {
        "education_level" : [ ],
        "work_experiences" : [ ],
        "skills" : [ ],
        "education" : [ ],
        "languages" : [ ]
      },
      "occupation_field" : {
        "concept_id" : "X82t_awd_Qyc",
        "label" : "Administration, ekonomi, juridik",
        "legacy_ams_taxonomy_id" : "1"
      },
      "scope_of_work" : {
        "min" : 100,
        "max" : 100
      },
      "salary_type" : {
        "concept_id" : "oG8G_9cW_nRf",
        "label" : "Fast månads- vecko- eller timlön",
        "legacy_ams_taxonomy_id" : "1"
      },
      "removed" : false,
      "salary_description" : "Månadslön enligt avtal, individuell lönesättning",
      "access_to_own_car" : false,
      "publication_date" : "2022-08-01T08:13:35"
    },
    "name" : "Administratör till Gullmarsborg",
    "user" : "hannes"
  },
  "sha1" : "7edf1401417ab85f9584902f5b787c519a6aa592",
  "annotations" : [ {
    "preferred-label" : "Administratör/Administrativ assistent",
    "sentiment" : "MUST_HAVE",
    "type" : "occupation-name",
    "start-position" : 0,
    "end-position" : 13,
    "concept-id" : "s5pR_WNm_R8W",
    "matched-string" : "administratör",
    "annotation-id" : 0
  }, {
    "preferred-label" : "Lysekil",
    "type" : "municipality",
    "start-position" : 34,
    "end-position" : 49,
    "concept-id" : "z2cX_rjC_zFo",
    "matched-string" : "Lysekils kommun",
    "annotation-id" : 6
  }, {
    "preferred-label" : "Sverige",
    "type" : "country",
    "start-position" : 86,
    "end-position" : 94,
    "concept-id" : "i46j_HmG_v64",
    "matched-string" : "Sveriges",
    "annotation-id" : 5
  }, {
    "preferred-label" : "Lysekil",
    "type" : "municipality",
    "start-position" : 283,
    "end-position" : 298,
    "concept-id" : "z2cX_rjC_zFo",
    "matched-string" : "Lysekils kommun",
    "annotation-id" : 7
  }, {
    "preferred-label" : "Lysekil",
    "type" : "municipality",
    "start-position" : 377,
    "end-position" : 392,
    "concept-id" : "z2cX_rjC_zFo",
    "matched-string" : "Lysekils kommun",
    "annotation-id" : 8
  }, {
    "preferred-label" : "Lysekil",
    "type" : "municipality",
    "start-position" : 640,
    "end-position" : 655,
    "concept-id" : "z2cX_rjC_zFo",
    "matched-string" : "Lysekils kommun",
    "annotation-id" : 9
  }, {
    "preferred-label" : "Lysekil",
    "type" : "municipality",
    "start-position" : 750,
    "end-position" : 757,
    "concept-id" : "z2cX_rjC_zFo",
    "matched-string" : "Lysekil",
    "annotation-id" : 10
  }, {
    "preferred-label" : "Fritidsgård",
    "sentiment" : "MUST_HAVE",
    "type" : "skill",
    "start-position" : 1046,
    "end-position" : 1057,
    "concept-id" : "hLkC_wwg_kmg",
    "matched-string" : "fritidsgård",
    "annotation-id" : 1
  }, {
    "preferred-label" : "sköta administration",
    "type" : "esco-skill",
    "start-position" : 1114,
    "end-position" : 1139,
    "concept-id" : "NEWh_NMX_RCZ",
    "matched-string" : "arbeta med administration",
    "annotation-id" : 11
  }, {
    "preferred-label" : "utföra administrativt arbete",
    "type" : "esco-skill",
    "start-position" : 1423,
    "end-position" : 1459,
    "concept-id" : "2x13_sLi_EzG",
    "matched-string" : "arbetar med administrativa uppgifter",
    "annotation-id" : 12
  }, {
    "preferred-label" : "Bokningsansvarig",
    "type" : "keyword",
    "start-position" : 1466,
    "end-position" : 1484,
    "concept-id" : "mKSi_FXG_jnK",
    "matched-string" : "ansvar för bokning",
    "annotation-id" : 13
  }, {
    "preferred-label" : "övervaka fakturering",
    "type" : "esco-skill",
    "start-position" : 1511,
    "end-position" : 1527,
    "concept-id" : "Tct2_pLG_Xit",
    "matched-string" : "fakturahantering",
    "annotation-id" : 14
  }, {
    "preferred-label" : "sköta reception",
    "type" : "esco-skill",
    "start-position" : 1532,
    "end-position" : 1548,
    "concept-id" : "K6XL_6aL_AQ6",
    "matched-string" : "receptionsansvar",
    "annotation-id" : 15
  }, {
    "preferred-label" : "utföra administrativt arbete",
    "type" : "esco-skill",
    "start-position" : 1598,
    "end-position" : 1613,
    "concept-id" : "2x13_sLi_EzG",
    "matched-string" : "administrations",
    "annotation-id" : 16
  }, {
    "preferred-label" : "beställa varor",
    "type" : "esco-skill",
    "start-position" : 1646,
    "end-position" : 1668,
    "concept-id" : "xyZV_DTv_c7v",
    "matched-string" : "beställningar av varor",
    "annotation-id" : 17
  }, {
    "preferred-label" : "Reception",
    "type" : "keyword",
    "start-position" : 1748,
    "end-position" : 1765,
    "concept-id" : "zRKv_kwY_uw4",
    "matched-string" : "simhallsreception",
    "annotation-id" : 19
  }, {
    "preferred-label" : "utföra städuppgifter",
    "type" : "esco-skill",
    "start-position" : 1771,
    "end-position" : 1784,
    "concept-id" : "fcFF_i9N_xqx",
    "matched-string" : "städuppgifter",
    "annotation-id" : 18
  }, {
    "preferred-label" : "Reception",
    "type" : "keyword",
    "start-position" : 1831,
    "end-position" : 1850,
    "concept-id" : "zRKv_kwY_uw4",
    "matched-string" : "simhallsreceptionen",
    "annotation-id" : 20
  }, {
    "preferred-label" : "Gymnasial utbildning",
    "type" : "sni-level-3",
    "start-position" : 2141,
    "end-position" : 2169,
    "concept-id" : "t8bn_FTn_FiG",
    "matched-string" : "utbildning på gymnasial nivå",
    "annotation-id" : 21
  }, {
    "preferred-label" : "sköta reception",
    "type" : "esco-skill",
    "start-position" : 2327,
    "end-position" : 2346,
    "concept-id" : "K6XL_6aL_AQ6",
    "matched-string" : "receptionsuppgifter",
    "annotation-id" : 22
  }, {
    "preferred-label" : "visa ansvarstagande",
    "type" : "esco-skill",
    "start-position" : 2577,
    "end-position" : 2591,
    "concept-id" : "bcRp_hxV_f5G",
    "matched-string" : "ansvarstagande",
    "annotation-id" : 23
  }, {
    "preferred-label" : "arbeta självständigt",
    "type" : "esco-skill",
    "start-position" : 2793,
    "end-position" : 2806,
    "concept-id" : "NyFu_HHd_zhz",
    "matched-string" : "självständigt",
    "annotation-id" : 24
  }, {
    "preferred-label" : "MS Office",
    "sentiment" : "MUST_HAVE",
    "type" : "skill",
    "start-position" : 2832,
    "end-position" : 2845,
    "concept-id" : "w8bU_wHe_omF",
    "matched-string" : "officepaketet",
    "annotation-id" : 2
  }, {
    "preferred-label" : "samarbeta med kolleger",
    "type" : "esco-skill",
    "start-position" : 2852,
    "end-position" : 2868,
    "concept-id" : "X15R_797_q62",
    "matched-string" : "samarbetsförmåga",
    "annotation-id" : 25
  }, {
    "preferred-label" : "Simlärarutbildning",
    "sentiment" : "MUST_HAVE",
    "type" : "skill",
    "start-position" : 3117,
    "end-position" : 3135,
    "concept-id" : "g2dL_AqN_JFC",
    "matched-string" : "simlärarutbildning",
    "annotation-id" : 3
  }, {
    "preferred-label" : "Godkänd livräddare, SLS",
    "type" : "skill",
    "start-position" : 3142,
    "end-position" : 3165,
    "concept-id" : "GJho_f1V_YbF",
    "matched-string" : "poollivräddarutbildning",
    "annotation-id" : 26
  }, {
    "preferred-label" : "Första hjälpen - HLR-intyg",
    "type" : "skill",
    "start-position" : 3195,
    "end-position" : 3209,
    "concept-id" : "mwCM_MmB_6Ks",
    "matched-string" : "HLR-certifikat",
    "annotation-id" : 27
  }, {
    "preferred-label" : "körkort",
    "type" : "esco-skill",
    "start-position" : 3211,
    "end-position" : 3226,
    "concept-id" : "UvDr_eNo_HSQ",
    "matched-string" : "Körkortsinnehav",
    "annotation-id" : 28
  }, {
    "preferred-label" : "Heltid",
    "type" : "worktime-extent",
    "start-position" : 3321,
    "end-position" : 3327,
    "concept-id" : "6YE1_gAC_R2G",
    "matched-string" : "heltid",
    "annotation-id" : 29
  } ],
  "text" : "Administratör till Gullmarsborg\nI Lysekils kommun arbetar ca 1400 medarbetare som har Sveriges viktigaste jobb – vi gör skillnad i människors vardag och bygger ett samhälle för alla. Det är med andra ord ett arbete att känna stolthet över.  Vårt jobb är att ge de 14 400 invånarna i Lysekils kommun service, stöd och hjälp. Tillsammans utvecklar vi verksamheterna.\n\n\nEtt liv i Lysekils kommun är ett liv nära havet och naturen – här finns möjlighet till både eftertanke och äventyr i en av Bohusläns vackra kustkommuner. På livetilysekil.se http://www.livetilysekil.se/ får du veta mer om hur ett liv i vår kommun kan se ut. \n\n\nVår vision: Lysekils kommun är en hållbar och attraktiv kommun året runt som kännetecknas av kreativitet och framtidstro. Lysekil är en självklar mötesplats och ledande inom maritima näringar.\n\n\n\r\n\r\nBeskrivning\n\n\nVår fritidsanläggning Gullmarsborg som inkluderar sim- och ishall är en central del av vårt totala anläggningsutbud i kommunen.\r\n\r\nI denna anläggning finns även kommunens fritidskontor, danslokaler och en fritidsgård. Vi söker nu en person till vår personalgrupp som skall arbeta med administration.\n\nVi är stolta över vår verksamhet och har en vilja att ständigt utvecklas och bli bättre. Vi är därför intresserade av vad du kan bidra med inom ramen för denna tjänst. Vårt arbete genomsyras av kommunens värdeord; Öppet, Enkelt, Värdigt.\n\n\nArbetsuppgifter\n\nTjänsten innebär att du arbetar med administrativa uppgifter såsom ansvar för bokning av vår fritidsanläggning, fakturahantering och receptionsansvar. Tjänsten innebär kundkontakt och olika typer av administrations- och faktureringsuppgifter samt beställningar av varor och kontakt med leverantörer.\nTjänsten innebär även att du arbetar utifrån vår simhallsreception, har städuppgifter i sim- och ishall samt angränsande lokaler. I simhallsreceptionen arbetar du för att alla våra gäster ska känna sig välkomna. Du ger ett gott bemötande och en god service till våra gäster och bemöter dem utifrån deras behov.  Badbevakning och simskoleverksamhet kan komma att ingå i arbetsuppgiften.\n\nKvalifikationer\n\nFör att lyckas i den här rollen krävs utbildning på gymnasial nivå inom området administration alternativt arbetslivserfarenhet som arbetsgivaren bedömer likvärdig. För att lyckas behöver du ha goda kunskaper inom klassiska receptionsuppgifter, ha servicekänsla och vi ser gärna erfarenhet från tidigare administrativt och receptionsarbete. Det är viktigt att du är flexibel, välorganiserad kan arbeta såväl effektivt som strategisk.\n\nVi söker dig som är säkerhetsmedveten, ansvarstagande, trygg och engagerad och står för värderingar som ömsesidig respekt, tolerans och öppenhet. Du ser möten med alla våra kunder som en spännande och givande uppgift. Du är van att arbeta målinriktat och självständigt och har goda kunskaper i Officepaketet.\n\nGod samarbetsförmåga och servicekänsla är för dig en självklarhet eftersom du kommer att arbeta i grupp tillsammans med dina kollegor i Gullmarsborg. Stor vikt läggs vid personlig lämplighet. Du blir ett ansikte utåt mot våra kunder.\n\nDet är meriterande om du har;\n\n - Simlärarutbildning eller poollivräddarutbildning.\n - Friskvårdsutbildning.\n - HLR-certifikat\n\nKörkortsinnehav är önskvärt. \n\nVillkor\n\nSchemalagd arbetstid (dag, kväll och helg) med omfattning motsvarande heltid.\nFör den som erbjuds tjänsten krävs enligt Lagen om registerkontroll utdrag från Rikspolisens belastningsregister. Beställ gärna detta i samband med ansökan, så att det finns tillgängligt ifall du blir aktuell för tjänsten. \n\nTjänsten tillsätts utifrån att erforderliga beslut fattas. Urval och intervjuer kan ske löpande så sök idag!\n\nVi arbetar aktivt med mångfald för att tillvarata de kvaliteter som sökande med olika bakgrund har. Till bemannings- och rekryteringsföretag och till dig som är försäljare: Vi undanber oss vänligen men bestämt direktkontakt med bemannings- och rekryteringsföretag samt försäljare av ytterligare jobbannonser."
}