{
  "meta" : {
    "jobad" : {
      "description" : {
        "requirements" : null,
        "needs" : null,
        "company_information" : null,
        "text_formatted" : "<p>Dermani växer så det knakar och vi vi planerar därför att öppna en skönhetsklinik i Motala.</p><p>Vi söker dig som är öppen, social och som kan hålla ordning och reda samt har ett intresse för skönhet och de egenskaper som är av värde för kunderna.</p><p>Vi kommer kontinuerligt att vidareutbilda oss i takt med att vi tar in fler maskiner och nya protokoll så det är viktigt att du vill lära dig och utvecklas i din roll som nagelteknolog.</p><p>Just nu så söker vi dig som är erfaren nagelteknolog som kan ingå i vårt team. </p><p>Dermani erbjuder en professionell men också avslappnad arbetsmiljö med trevliga kollegor som alla har nära till skratt.</p><p>Vi önskar primärt en heltidsanställd nagelteknolog men tjänsten är anpassningsbar och du kan välja del- eller heltid i samråd med övriga Dermani-teamet.</p><p>Tycker du att det verkar intressant och vill veta mer? Skicka ett mail med CV, personligt brev henrik@dermani.se och märk mailet med \"Nagelteknolog Motala\". Tjänsterna startar Q4 så vi ber dig redan nu att ta en första kontakt.</p>",
        "conditions" : null,
        "text" : "Dermani växer så det knakar och vi vi planerar därför att öppna en skönhetsklinik i Motala.\nVi söker dig som är öppen, social och som kan hålla ordning och reda samt har ett intresse för skönhet och de egenskaper som är av värde för kunderna.\nVi kommer kontinuerligt att vidareutbilda oss i takt med att vi tar in fler maskiner och nya protokoll så det är viktigt att du vill lära dig och utvecklas i din roll som nagelteknolog.\nJust nu så söker vi dig som är erfaren nagelteknolog som kan ingå i vårt team. \nDermani erbjuder en professionell men också avslappnad arbetsmiljö med trevliga kollegor som alla har nära till skratt.\nVi önskar primärt en heltidsanställd nagelteknolog men tjänsten är anpassningsbar och du kan välja del- eller heltid i samråd med övriga Dermani-teamet.\nTycker du att det verkar intressant och vill veta mer? Skicka ett mail med CV, personligt brev henrik@dermani.se och märk mailet med \"Nagelteknolog Motala\". Tjänsterna startar Q4 så vi ber dig redan nu att ta en första kontakt."
      },
      "headline" : "Nagelteknolog Motala till avancerad skönhetsklinik",
      "driving_license" : null,
      "employer" : {
        "email" : null,
        "phone_number" : null,
        "organization_number" : "5592315088",
        "name" : "Derma klinik Sverige AB",
        "url" : null,
        "workplace" : "Derma klinik Sverige AB"
      },
      "removed_date" : null,
      "logo_url" : "https://www.arbetsformedlingen.se/rest/arbetsgivare/rest/af/v3/arbetsplatser/87418173/logotyper/logo.png",
      "last_publication_date" : "2022-08-14T23:59:59",
      "number_of_vacancies" : 1,
      "occupation" : {
        "concept_id" : "JjXV_QEg_EQ1",
        "label" : "Nagelterapeut/Nagelteknolog",
        "legacy_ams_taxonomy_id" : "5439"
      },
      "occupation_group" : {
        "concept_id" : "ezKk_kss_CiQ",
        "label" : "Övriga skönhets- och kroppsterapeuter",
        "legacy_ams_taxonomy_id" : "5149"
      },
      "employment_type" : {
        "concept_id" : "PFZr_Syz_cUq",
        "label" : "Vanlig anställning",
        "legacy_ams_taxonomy_id" : "1"
      },
      "webpage_url" : "https://arbetsformedlingen.se/platsbanken/annonser/26332486",
      "driving_license_required" : false,
      "application_contacts" : [ ],
      "duration" : {
        "concept_id" : "a7uU_j21_mkL",
        "label" : "Tills vidare",
        "legacy_ams_taxonomy_id" : "1"
      },
      "nice_to_have" : {
        "education_level" : [ ],
        "work_experiences" : [ ],
        "skills" : [ ],
        "education" : [ ],
        "languages" : [ ]
      },
      "application_details" : {
        "via_af" : false,
        "email" : "henrik@dermani.se",
        "other" : null,
        "reference" : null,
        "url" : null,
        "information" : null
      },
      "source_type" : "VIA_ANNONSERA",
      "application_deadline" : "2022-08-14T23:59:59",
      "external_id" : null,
      "workplace_address" : {
        "coordinates" : [ 15.030931018531719, 58.53440371904491 ],
        "city" : "MOTALA",
        "postcode" : "59130",
        "municipality" : "Motala",
        "region_concept_id" : "oLT3_Q9p_3nn",
        "region" : "Östergötlands län",
        "country_code" : "199",
        "region_code" : "05",
        "municipality_concept_id" : "E1MC_1uG_phm",
        "country_concept_id" : "i46j_HmG_v64",
        "municipality_code" : "0583",
        "street_address" : "Garnisionsvägen 37",
        "country" : "Sverige"
      },
      "id" : "26332486",
      "experience_required" : true,
      "working_hours_type" : {
        "concept_id" : "6YE1_gAC_R2G",
        "label" : "Heltid",
        "legacy_ams_taxonomy_id" : "1"
      },
      "access" : null,
      "timestamp" : 1657899280266,
      "must_have" : {
        "education_level" : [ ],
        "work_experiences" : [ ],
        "skills" : [ ],
        "education" : [ ],
        "languages" : [ ]
      },
      "occupation_field" : {
        "concept_id" : "Uuf1_GMh_Uvw",
        "label" : "Kropps- och skönhetsvård",
        "legacy_ams_taxonomy_id" : "4"
      },
      "scope_of_work" : {
        "min" : 0,
        "max" : 100
      },
      "salary_type" : {
        "concept_id" : "oG8G_9cW_nRf",
        "label" : "Fast månads- vecko- eller timlön",
        "legacy_ams_taxonomy_id" : "1"
      },
      "removed" : false,
      "salary_description" : null,
      "access_to_own_car" : false,
      "publication_date" : "2022-07-15T17:34:40"
    },
    "name" : "Nagelteknolog Motala till avancerad skönhetsklinik",
    "user" : "kristof.fischer"
  },
  "sha1" : "0e0a828683112cba6ba24685bb8b4906cd1eb4bd",
  "annotations" : [ {
    "preferred-label" : "Nagelterapeut/Nagelteknolog",
    "sentiment" : "MUST_HAVE",
    "type" : "occupation-name",
    "start-position" : 0,
    "end-position" : 13,
    "concept-id" : "JjXV_QEg_EQ1",
    "matched-string" : "nagelteknolog",
    "annotation-id" : 0
  }, {
    "preferred-label" : "Motala",
    "type" : "municipality",
    "start-position" : 14,
    "end-position" : 20,
    "concept-id" : "E1MC_1uG_phm",
    "matched-string" : "Motala",
    "annotation-id" : 6
  }, {
    "preferred-label" : "Motala",
    "type" : "municipality",
    "start-position" : 135,
    "end-position" : 141,
    "concept-id" : "E1MC_1uG_phm",
    "matched-string" : "Motala",
    "annotation-id" : 7
  }, {
    "preferred-label" : "Nagelterapeut/Nagelteknolog",
    "sentiment" : "MUST_HAVE",
    "type" : "occupation-name",
    "start-position" : 465,
    "end-position" : 478,
    "concept-id" : "JjXV_QEg_EQ1",
    "matched-string" : "nagelteknolog",
    "annotation-id" : 1
  }, {
    "preferred-label" : "Nagelterapeut/Nagelteknolog",
    "sentiment" : "MUST_HAVE",
    "type" : "occupation-name",
    "start-position" : 519,
    "end-position" : 532,
    "concept-id" : "JjXV_QEg_EQ1",
    "matched-string" : "nagelteknolog",
    "annotation-id" : 2
  }, {
    "preferred-label" : "Heltid",
    "type" : "worktime-extent",
    "start-position" : 701,
    "end-position" : 716,
    "concept-id" : "6YE1_gAC_R2G",
    "matched-string" : "heltidsanställd",
    "annotation-id" : 8
  }, {
    "preferred-label" : "Nagelterapeut/Nagelteknolog",
    "sentiment" : "MUST_HAVE",
    "type" : "occupation-name",
    "start-position" : 717,
    "end-position" : 730,
    "concept-id" : "JjXV_QEg_EQ1",
    "matched-string" : "nagelteknolog",
    "annotation-id" : 4
  }, {
    "preferred-label" : "Heltid/Deltid",
    "type" : "worktime-extent",
    "start-position" : 779,
    "end-position" : 796,
    "concept-id" : "hGCt_6Ni_XPz",
    "matched-string" : "del- eller heltid",
    "annotation-id" : 9
  }, {
    "preferred-label" : "Nagelterapeut/Nagelteknolog",
    "sentiment" : "MUST_HAVE",
    "type" : "occupation-name",
    "start-position" : 967,
    "end-position" : 980,
    "concept-id" : "JjXV_QEg_EQ1",
    "matched-string" : "nagelteknolog",
    "annotation-id" : 5
  }, {
    "preferred-label" : "Motala",
    "type" : "municipality",
    "start-position" : 981,
    "end-position" : 987,
    "concept-id" : "E1MC_1uG_phm",
    "matched-string" : "Motala",
    "annotation-id" : 10
  } ],
  "text" : "Nagelteknolog Motala till avancerad skönhetsklinik\nDermani växer så det knakar och vi vi planerar därför att öppna en skönhetsklinik i Motala.\nVi söker dig som är öppen, social och som kan hålla ordning och reda samt har ett intresse för skönhet och de egenskaper som är av värde för kunderna.\nVi kommer kontinuerligt att vidareutbilda oss i takt med att vi tar in fler maskiner och nya protokoll så det är viktigt att du vill lära dig och utvecklas i din roll som nagelteknolog.\nJust nu så söker vi dig som är erfaren nagelteknolog som kan ingå i vårt team. \nDermani erbjuder en professionell men också avslappnad arbetsmiljö med trevliga kollegor som alla har nära till skratt.\nVi önskar primärt en heltidsanställd nagelteknolog men tjänsten är anpassningsbar och du kan välja del- eller heltid i samråd med övriga Dermani-teamet.\nTycker du att det verkar intressant och vill veta mer? Skicka ett mail med CV, personligt brev henrik@dermani.se och märk mailet med \"Nagelteknolog Motala\". Tjänsterna startar Q4 så vi ber dig redan nu att ta en första kontakt."
}