{
  "meta" : {
    "jobad" : {
      "description" : {
        "requirements" : null,
        "needs" : null,
        "company_information" : null,
        "text_formatted" : "Har du erfarenhet som maskinoperatör inom produktion eller inom närliggande branscher? Är du en person som är både praktiskt och tekniskt lagd som vill utvecklas i sitt yrke? Då har vi den perfekta tjänsten för dig!\n\nNu söker vår kund en maskinoperatör med erfarenhet inom tillverkningsindustrin, stenindustrin eller en annan produktionsbaserad bransch till sin verksamhet i Lund.\n\nDina arbetsuppgifter kommer i första hand att bestå av att såga upp ämnen till bänkskivor och hantera råvarulagret av ämne för bänkskivor. Företaget arbetar med toppmoderna maskiner som till största del körs helautomatiskt men vissa maskiner körs även semiautomatiskt och via manuell hantering.\nAndra arbetsuppgifter i produktionen ingår så som kantpolering av sten, handpolering av sten och håltagning i sten samt emballering av färdiga produkter i sten. Även helt andra praktiska arbetsuppgifter ingår i arbetet vilka varierar beroende på behov. Tjänsten är på heltid och är en rekrytering till företaget.\n\n\nVår kund säljer, mäter, tillverkar och monterar bänkskivor i sten till kök och badrum gjorda av materialen Natursten, Silestone och Dekton.\nFöretaget importerar råmaterial från hela världen vilket förädlas i egen produktionen belägen i Lund. Montering av bänkskivor görs sedan i hela södra Sverige alternativt fraktas produkterna till hela landet.\nFörsäljning sker främst via återförsäljare, men också i egen butik och via webben.\nFöretaget är ett av de mest välkända företagen i branschen, man är störst i Skåne. Företaget står för hög kvalité och bästa tänkbara service.\r\n\r\nDin profil\nVi söker nu någon med arbetslivserfarenhet inom produktion, lagerhantering, CAD och CNC-programmering som är på jakt efter en ny spännande utmaning inom sitt yrkesliv! Vi ser gärna att du har tidigare erfarenhet av tillverkningsindustrin, stenindustrin eller en annan produktionsbaserad bransch. Vi söker nu dig som gillar ett fysiskt arbete och som inte har några problem med tunga lyft. Som person ska du vara oerhört noggrann, ha ett öga för kvalité och vara van vid ett högt arbetstempo.\n\nDet är meriterande ifall du har:\nTidigare erfarenheter av att tolka ritningar\nTidigare arbetat med CNC programmering\nErfarenheter av att rita i CAD\n\nFöljande körkort är meriterande men inte ett krav:\nTraverskort\nTruckkort\nB-körkort\n\nOm företaget\nMångfaldigt prisbelönta StudentConsulting är ett av Skandinaviens största och ledande rekryterings- och bemanningsföretag med fokus på studenter, akademiker och yrkesutbildade. Tack vare ett stort nätverk och lång erfarenhet har vi rekryterat över 11 000 personer det senaste året. Vi erbjuder intressanta och utmanande tjänster på både hel- och deltid inom områden som IT, teknik, ekonomi, administration, HR, marknadsföring, kundtjänst, försäljning, industri, produktion, logistik och transport. Hitta din framtid på www.studentconsulting.se",
        "conditions" : "Tillsvidareanställning\r\nTillsvidare",
        "text" : "Har du erfarenhet som maskinoperatör inom produktion eller inom närliggande branscher? Är du en person som är både praktiskt och tekniskt lagd som vill utvecklas i sitt yrke? Då har vi den perfekta tjänsten för dig!\n\nNu söker vår kund en maskinoperatör med erfarenhet inom tillverkningsindustrin, stenindustrin eller en annan produktionsbaserad bransch till sin verksamhet i Lund.\n\nDina arbetsuppgifter kommer i första hand att bestå av att såga upp ämnen till bänkskivor och hantera råvarulagret av ämne för bänkskivor. Företaget arbetar med toppmoderna maskiner som till största del körs helautomatiskt men vissa maskiner körs även semiautomatiskt och via manuell hantering.\nAndra arbetsuppgifter i produktionen ingår så som kantpolering av sten, handpolering av sten och håltagning i sten samt emballering av färdiga produkter i sten. Även helt andra praktiska arbetsuppgifter ingår i arbetet vilka varierar beroende på behov. Tjänsten är på heltid och är en rekrytering till företaget.\n\n\nVår kund säljer, mäter, tillverkar och monterar bänkskivor i sten till kök och badrum gjorda av materialen Natursten, Silestone och Dekton.\nFöretaget importerar råmaterial från hela världen vilket förädlas i egen produktionen belägen i Lund. Montering av bänkskivor görs sedan i hela södra Sverige alternativt fraktas produkterna till hela landet.\nFörsäljning sker främst via återförsäljare, men också i egen butik och via webben.\nFöretaget är ett av de mest välkända företagen i branschen, man är störst i Skåne. Företaget står för hög kvalité och bästa tänkbara service.\r\n\r\nDin profil\nVi söker nu någon med arbetslivserfarenhet inom produktion, lagerhantering, CAD och CNC-programmering som är på jakt efter en ny spännande utmaning inom sitt yrkesliv! Vi ser gärna att du har tidigare erfarenhet av tillverkningsindustrin, stenindustrin eller en annan produktionsbaserad bransch. Vi söker nu dig som gillar ett fysiskt arbete och som inte har några problem med tunga lyft. Som person ska du vara oerhört noggrann, ha ett öga för kvalité och vara van vid ett högt arbetstempo.\n\nDet är meriterande ifall du har:\nTidigare erfarenheter av att tolka ritningar\nTidigare arbetat med CNC programmering\nErfarenheter av att rita i CAD\n\nFöljande körkort är meriterande men inte ett krav:\nTraverskort\nTruckkort\nB-körkort\n\nOm företaget\nMångfaldigt prisbelönta StudentConsulting är ett av Skandinaviens största och ledande rekryterings- och bemanningsföretag med fokus på studenter, akademiker och yrkesutbildade. Tack vare ett stort nätverk och lång erfarenhet har vi rekryterat över 11 000 personer det senaste året. Vi erbjuder intressanta och utmanande tjänster på både hel- och deltid inom områden som IT, teknik, ekonomi, administration, HR, marknadsföring, kundtjänst, försäljning, industri, produktion, logistik och transport. Hitta din framtid på www.studentconsulting.se"
      },
      "headline" : "Maskinoperatör sökes till spännande företag i Lund!",
      "driving_license" : null,
      "employer" : {
        "email" : null,
        "phone_number" : null,
        "organization_number" : "5566747449",
        "name" : "Studentconsulting Sweden AB (Publ)",
        "url" : "www.studentconsulting.com",
        "workplace" : "StudentConsulting"
      },
      "removed_date" : null,
      "logo_url" : "https://www.arbetsformedlingen.se/rest/arbetsgivare/rest/af/v3/organisation/5566747449/logotyper/logo.png",
      "last_publication_date" : "2022-08-28T23:59:59",
      "number_of_vacancies" : 1,
      "occupation" : {
        "concept_id" : "EvmU_s9w_euP",
        "label" : "CNC-operatör/FMS-operatör",
        "legacy_ams_taxonomy_id" : "6004"
      },
      "occupation_group" : {
        "concept_id" : "vaEp_iBS_c5h",
        "label" : "Maskinställare och maskinoperatörer, metallarbete",
        "legacy_ams_taxonomy_id" : "7223"
      },
      "employment_type" : {
        "concept_id" : "PFZr_Syz_cUq",
        "label" : "Vanlig anställning",
        "legacy_ams_taxonomy_id" : "1"
      },
      "webpage_url" : "https://arbetsformedlingen.se/platsbanken/annonser/26361166",
      "driving_license_required" : false,
      "application_contacts" : [ {
        "description" : "Team Malmö Lager/Produktion",
        "email" : "malmo.lager.produktion@studentconsulting.com",
        "telephone" : null,
        "name" : null,
        "contact_type" : null
      } ],
      "duration" : {
        "concept_id" : "a7uU_j21_mkL",
        "label" : "Tills vidare",
        "legacy_ams_taxonomy_id" : "1"
      },
      "nice_to_have" : {
        "education_level" : [ ],
        "work_experiences" : [ ],
        "skills" : [ ],
        "education" : [ ],
        "languages" : [ ]
      },
      "application_details" : {
        "via_af" : false,
        "email" : null,
        "other" : null,
        "reference" : null,
        "url" : "http://www.studentconsulting.com/sv/jobs/lund/maskinoperator-sokes-till-spannande-foretag-i-lund/65549/?utm_source=af&utm_medium=sharedjob&utm_content=job65549",
        "information" : null
      },
      "source_type" : "VIA_PLATSBANKEN_DXA",
      "application_deadline" : "2022-08-28T23:59:59",
      "external_id" : "46-556674-7449-65549",
      "workplace_address" : {
        "coordinates" : [ 13.191008, 55.70466 ],
        "city" : null,
        "postcode" : null,
        "municipality" : "Lund",
        "region_concept_id" : "CaRE_1nn_cSU",
        "region" : "Skåne län",
        "country_code" : "199",
        "region_code" : "12",
        "municipality_concept_id" : "muSY_tsR_vDZ",
        "country_concept_id" : "i46j_HmG_v64",
        "municipality_code" : "1281",
        "street_address" : null,
        "country" : "Sverige"
      },
      "id" : "26361166",
      "experience_required" : true,
      "working_hours_type" : {
        "concept_id" : "6YE1_gAC_R2G",
        "label" : "Heltid",
        "legacy_ams_taxonomy_id" : "1"
      },
      "access" : null,
      "timestamp" : 1659020417109,
      "must_have" : {
        "education_level" : [ ],
        "work_experiences" : [ {
          "concept_id" : "EvmU_s9w_euP",
          "weight" : 10,
          "label" : "CNC-operatör/FMS-operatör",
          "legacy_ams_taxonomy_id" : "6004"
        } ],
        "skills" : [ ],
        "education" : [ ],
        "languages" : [ ]
      },
      "occupation_field" : {
        "concept_id" : "wTEr_CBC_bqh",
        "label" : "Industriell tillverkning",
        "legacy_ams_taxonomy_id" : "9"
      },
      "scope_of_work" : {
        "min" : 100,
        "max" : 100
      },
      "salary_type" : {
        "concept_id" : "oG8G_9cW_nRf",
        "label" : "Fast månads- vecko- eller timlön",
        "legacy_ams_taxonomy_id" : "1"
      },
      "removed" : false,
      "salary_description" : "Fast lön",
      "access_to_own_car" : false,
      "publication_date" : "2022-07-28T17:00:17"
    },
    "name" : "Maskinoperatör sökes till spännande företag i Lund!",
    "user" : "kristof.fischer"
  },
  "sha1" : "54e2013df51df8de3694581a169f9a41cec1de06",
  "annotations" : [ {
    "preferred-label" : "CNC-operatör/FMS-operatör",
    "type" : "occupation-name",
    "start-position" : 0,
    "end-position" : 14,
    "concept-id" : "EvmU_s9w_euP",
    "matched-string" : "Maskinoperatör",
    "annotation-id" : 8
  }, {
    "preferred-label" : "Lund",
    "type" : "municipality",
    "start-position" : 46,
    "end-position" : 50,
    "concept-id" : "muSY_tsR_vDZ",
    "matched-string" : "Lund",
    "annotation-id" : 9
  }, {
    "preferred-label" : "CNC-operatör/FMS-operatör",
    "type" : "occupation-name",
    "start-position" : 74,
    "end-position" : 88,
    "concept-id" : "EvmU_s9w_euP",
    "matched-string" : "maskinoperatör",
    "annotation-id" : 10
  }, {
    "preferred-label" : "CNC-operatör/FMS-operatör",
    "type" : "occupation-name",
    "start-position" : 290,
    "end-position" : 304,
    "concept-id" : "EvmU_s9w_euP",
    "matched-string" : "maskinoperatör",
    "annotation-id" : 11
  }, {
    "preferred-label" : "Lund",
    "type" : "municipality",
    "start-position" : 427,
    "end-position" : 431,
    "concept-id" : "muSY_tsR_vDZ",
    "matched-string" : "Lund",
    "annotation-id" : 12
  }, {
    "preferred-label" : "Heltid",
    "type" : "worktime-extent",
    "start-position" : 997,
    "end-position" : 1003,
    "concept-id" : "6YE1_gAC_R2G",
    "matched-string" : "heltid",
    "annotation-id" : 13
  }, {
    "preferred-label" : "Lund",
    "type" : "municipality",
    "start-position" : 1280,
    "end-position" : 1284,
    "concept-id" : "muSY_tsR_vDZ",
    "matched-string" : "Lund",
    "annotation-id" : 14
  }, {
    "preferred-label" : "Sverige",
    "type" : "country",
    "start-position" : 1334,
    "end-position" : 1341,
    "concept-id" : "i46j_HmG_v64",
    "matched-string" : "Sverige",
    "annotation-id" : 15
  }, {
    "preferred-label" : "Skåne län",
    "type" : "region",
    "start-position" : 1551,
    "end-position" : 1556,
    "concept-id" : "CaRE_1nn_cSU",
    "matched-string" : "Skåne",
    "annotation-id" : 16
  }, {
    "preferred-label" : "Produktionsteknik",
    "sentiment" : "MUST_HAVE",
    "type" : "skill",
    "start-position" : 1679,
    "end-position" : 1689,
    "concept-id" : "PuQP_aBK_nqJ",
    "matched-string" : "produktion",
    "annotation-id" : 17
  }, {
    "preferred-label" : "lagerverksamhet",
    "sentiment" : "MUST_HAVE",
    "type" : "esco-skill",
    "start-position" : 1691,
    "end-position" : 1705,
    "concept-id" : "67jr_CDK_TLA",
    "matched-string" : "lagerhantering",
    "annotation-id" : 18
  }, {
    "preferred-label" : "CAD-konstruktion/CAD-ritning",
    "sentiment" : "MUST_HAVE",
    "type" : "skill",
    "start-position" : 1707,
    "end-position" : 1710,
    "concept-id" : "oaiv_GsB_AFK",
    "matched-string" : "CAD",
    "annotation-id" : 19
  }, {
    "preferred-label" : "CNC-programmering",
    "sentiment" : "MUST_HAVE",
    "type" : "skill",
    "start-position" : 1715,
    "end-position" : 1732,
    "concept-id" : "JFDz_Uyg_Nmy",
    "matched-string" : "cnc-programmering",
    "annotation-id" : 1
  }, {
    "preferred-label" : "noggrannhet",
    "sentiment" : "MUST_HAVE",
    "type" : "esco-skill",
    "start-position" : 2051,
    "end-position" : 2059,
    "concept-id" : "mrsW_EkL_KRD",
    "matched-string" : "noggrann",
    "annotation-id" : 20
  }, {
    "preferred-label" : "Ritningsläsning",
    "sentiment" : "NICE_TO_HAVE",
    "type" : "skill",
    "start-position" : 2186,
    "end-position" : 2201,
    "concept-id" : "aHCV_VsV_LiD",
    "matched-string" : "tolka ritningar",
    "annotation-id" : 21
  }, {
    "preferred-label" : "CNC-programmering",
    "sentiment" : "NICE_TO_HAVE",
    "type" : "skill",
    "start-position" : 2223,
    "end-position" : 2240,
    "concept-id" : "JFDz_Uyg_Nmy",
    "matched-string" : "CNC programmering",
    "annotation-id" : 22
  }, {
    "preferred-label" : "CAD-ritning",
    "sentiment" : "NICE_TO_HAVE",
    "type" : "skill",
    "start-position" : 2261,
    "end-position" : 2271,
    "concept-id" : "AbDo_gbm_f46",
    "matched-string" : "rita i CAD",
    "annotation-id" : 23
  }, {
    "preferred-label" : "Traverskörning",
    "sentiment" : "NICE_TO_HAVE",
    "type" : "skill",
    "start-position" : 2324,
    "end-position" : 2335,
    "concept-id" : "LhvF_NZc_r6N",
    "matched-string" : "Traverskort",
    "annotation-id" : 24
  }, {
    "preferred-label" : "Truckvana",
    "sentiment" : "NICE_TO_HAVE",
    "type" : "skill",
    "start-position" : 2336,
    "end-position" : 2345,
    "concept-id" : "pGts_PKK_c8W",
    "matched-string" : "Truckkort",
    "annotation-id" : 25
  }, {
    "preferred-label" : "B",
    "sentiment" : "NICE_TO_HAVE",
    "type" : "driving-licence",
    "start-position" : 2346,
    "end-position" : 2355,
    "concept-id" : "VTK8_WRx_GcM",
    "matched-string" : "B-körkort",
    "annotation-id" : 26
  } ],
  "text" : "Maskinoperatör sökes till spännande företag i Lund!\nHar du erfarenhet som maskinoperatör inom produktion eller inom närliggande branscher? Är du en person som är både praktiskt och tekniskt lagd som vill utvecklas i sitt yrke? Då har vi den perfekta tjänsten för dig!\n\nNu söker vår kund en maskinoperatör med erfarenhet inom tillverkningsindustrin, stenindustrin eller en annan produktionsbaserad bransch till sin verksamhet i Lund.\n\nDina arbetsuppgifter kommer i första hand att bestå av att såga upp ämnen till bänkskivor och hantera råvarulagret av ämne för bänkskivor. Företaget arbetar med toppmoderna maskiner som till största del körs helautomatiskt men vissa maskiner körs även semiautomatiskt och via manuell hantering.\nAndra arbetsuppgifter i produktionen ingår så som kantpolering av sten, handpolering av sten och håltagning i sten samt emballering av färdiga produkter i sten. Även helt andra praktiska arbetsuppgifter ingår i arbetet vilka varierar beroende på behov. Tjänsten är på heltid och är en rekrytering till företaget.\n\n\nVår kund säljer, mäter, tillverkar och monterar bänkskivor i sten till kök och badrum gjorda av materialen Natursten, Silestone och Dekton.\nFöretaget importerar råmaterial från hela världen vilket förädlas i egen produktionen belägen i Lund. Montering av bänkskivor görs sedan i hela södra Sverige alternativt fraktas produkterna till hela landet.\nFörsäljning sker främst via återförsäljare, men också i egen butik och via webben.\nFöretaget är ett av de mest välkända företagen i branschen, man är störst i Skåne. Företaget står för hög kvalité och bästa tänkbara service.\r\n\r\nDin profil\nVi söker nu någon med arbetslivserfarenhet inom produktion, lagerhantering, CAD och CNC-programmering som är på jakt efter en ny spännande utmaning inom sitt yrkesliv! Vi ser gärna att du har tidigare erfarenhet av tillverkningsindustrin, stenindustrin eller en annan produktionsbaserad bransch. Vi söker nu dig som gillar ett fysiskt arbete och som inte har några problem med tunga lyft. Som person ska du vara oerhört noggrann, ha ett öga för kvalité och vara van vid ett högt arbetstempo.\n\nDet är meriterande ifall du har:\nTidigare erfarenheter av att tolka ritningar\nTidigare arbetat med CNC programmering\nErfarenheter av att rita i CAD\n\nFöljande körkort är meriterande men inte ett krav:\nTraverskort\nTruckkort\nB-körkort\n\nOm företaget\nMångfaldigt prisbelönta StudentConsulting är ett av Skandinaviens största och ledande rekryterings- och bemanningsföretag med fokus på studenter, akademiker och yrkesutbildade. Tack vare ett stort nätverk och lång erfarenhet har vi rekryterat över 11 000 personer det senaste året. Vi erbjuder intressanta och utmanande tjänster på både hel- och deltid inom områden som IT, teknik, ekonomi, administration, HR, marknadsföring, kundtjänst, försäljning, industri, produktion, logistik och transport. Hitta din framtid på www.studentconsulting.se"
}