{
  "meta" : {
    "jobad" : {
      "description" : {
        "requirements" : null,
        "needs" : null,
        "company_information" : null,
        "text_formatted" : "Är du sugen på nya utmaningar, en karriär inom restaurangbranschen och ett företag där det går snabbt att växa? Eller vill du bara ha ett extra jobb vid sidan av studierna? Då har du kommit rätt! Nu söker vi efter kökspersonal till vår enhet i Sala!\n\nVilka är Brödernas?\nBrödernas bedriver med framgång sin verksamhet i hela Sverige från Umeå i norr till Malmö i söder. Brödernas expanderar i en rasande takt med visionen att bli känt även utanför Sveriges gränser. Vår ambition är att Brödernas ska associeras med god kvalité och fantastisk service. Vi har idag över 80 öppnade enheter i Sverige och vi öppnar nya enheter varje månad.\n\nDet viktiga för oss är att oavsett vilket mål du har för framtiden så har vi garanterat en plats för dig. Hos oss är det dina egna ambitioner och resultat som avgör hur långt du kan gå.\n\nVad innebär jobbet som Kökspersonal hos oss?\nTjänsten innebär att du jobbar i köket och roterar mellan stationer som stekbord, fritering och sallad. Du ser till att det är rent i köket och att egenkontroller följs. Som kökspersonal på Brödernas arbetar du i team och det är därför viktigt att du är en lagspelare och förstår vikten av kommunikation och gruppsamverkan.\n\nVem är du?\nVi söker dig som gillar ett högt arbetstempo, är serviceinriktad och älskar att jobba med människor. Du tycker om att jobba med andra och vill ha en karriär i restaurangbranschen.\n\nVad erbjuder vi?\nVi erbjuder en fartfylld arbetsplats som är mitt under en stor expansion vilket innebär mycket goda möjligheter att utvecklas med företaget.\n\nRekryteringsprocessen\nNär du har sökt tjänsten så kommer du att få tillgång till en länk för en digital intervju med roboten Hubert som tar ca 20 - 30 minuter.\n\nSyftet med att Hubert-intervjun är vi vill ge alla kandidater möjligheten att berätta mer om sig själva samt för oss att säkerställa att alla kandidater blir bedömda på samma sätt, oavsett kön, ålder och etnicitet.\n\nVi ser gärna att du svarar på denna inom 48 - 72 timmar för att snabbt komma vidare i processen. Du kommer därefter bli kontaktad av en av våra rekryterare om du blir aktuell för en andra intervju.\n\nVi ser fram emot att höra från dig!\n\nIntervjuer sker löpande så tveka inte! Sök!\n\nAre you eager for new challenges, a career in the restaurant industry and a company where you can grow fast? Or do you just want an extra job alongside your studies? Then you have come to the right place!\n\nWho are the Brödernas?\n\nBrödernas successfully conducts its operations throughout Sweden from Umeå in the north to Malmö in the south. Brödernas are expanding at a rapid pace with the vision of becoming known even outside Sweden's borders. Our ambition is for Brödernas to be associated with good quality and fantastic service. We currently have over 80 opened units in Sweden and we open new units every month.\n\nThe important thing for us is that no matter what goal you have for the future, we have guaranteed a place for you. With us, it is your own ambitions and results that determine how far you can go.\n\nWhat does the job as a Kitchen staff with us mean?\n\nThe service means that you work in the kitchen and rotate between stations such as frying tables, frying and salad. You make sure that the kitchen is clean and that self-checks are followed. As a kitchen staff at Brödernas, you work in teams and it is therefore important that you are a team player and understand the importance of communication and group collaboration.\n\nWho are you?\n\nWe are looking for you who like a high work pace, are service-oriented and love working with people. You enjoy working with others and want a career in the restaurant industry.\n\nWhat do we offer?\n\nWe offer a fast-paced workplace that is in the middle of a major expansion, which means very good opportunities to develop with the company.\n\nThe recruitment process\n\nOnce you have applied for the job, you will have access to a link for a digital interview with the robot Hubert, which takes about 20-30 minutes.\n\nThe purpose of the Hubert interview is to give all candidates the opportunity to tell more about themselves and for us to ensure that all candidates are judged in the same way, regardless of gender, age and ethnicity.\n\nWe are happy to see that you respond to this within 48 - 72 hours to quickly move forward in the process. You will then be contacted by one of our recruiters if you become relevant for a second interview.\n\nWe look forward to hearing from you!\n\nInterviews are ongoing, so do not hesitate! Apply!",
        "conditions" : "Deltid\r\nHeltid, deltid, extra",
        "text" : "Är du sugen på nya utmaningar, en karriär inom restaurangbranschen och ett företag där det går snabbt att växa? Eller vill du bara ha ett extra jobb vid sidan av studierna? Då har du kommit rätt! Nu söker vi efter kökspersonal till vår enhet i Sala!\n\nVilka är Brödernas?\nBrödernas bedriver med framgång sin verksamhet i hela Sverige från Umeå i norr till Malmö i söder. Brödernas expanderar i en rasande takt med visionen att bli känt även utanför Sveriges gränser. Vår ambition är att Brödernas ska associeras med god kvalité och fantastisk service. Vi har idag över 80 öppnade enheter i Sverige och vi öppnar nya enheter varje månad.\n\nDet viktiga för oss är att oavsett vilket mål du har för framtiden så har vi garanterat en plats för dig. Hos oss är det dina egna ambitioner och resultat som avgör hur långt du kan gå.\n\nVad innebär jobbet som Kökspersonal hos oss?\nTjänsten innebär att du jobbar i köket och roterar mellan stationer som stekbord, fritering och sallad. Du ser till att det är rent i köket och att egenkontroller följs. Som kökspersonal på Brödernas arbetar du i team och det är därför viktigt att du är en lagspelare och förstår vikten av kommunikation och gruppsamverkan.\n\nVem är du?\nVi söker dig som gillar ett högt arbetstempo, är serviceinriktad och älskar att jobba med människor. Du tycker om att jobba med andra och vill ha en karriär i restaurangbranschen.\n\nVad erbjuder vi?\nVi erbjuder en fartfylld arbetsplats som är mitt under en stor expansion vilket innebär mycket goda möjligheter att utvecklas med företaget.\n\nRekryteringsprocessen\nNär du har sökt tjänsten så kommer du att få tillgång till en länk för en digital intervju med roboten Hubert som tar ca 20 - 30 minuter.\n\nSyftet med att Hubert-intervjun är vi vill ge alla kandidater möjligheten att berätta mer om sig själva samt för oss att säkerställa att alla kandidater blir bedömda på samma sätt, oavsett kön, ålder och etnicitet.\n\nVi ser gärna att du svarar på denna inom 48 - 72 timmar för att snabbt komma vidare i processen. Du kommer därefter bli kontaktad av en av våra rekryterare om du blir aktuell för en andra intervju.\n\nVi ser fram emot att höra från dig!\n\nIntervjuer sker löpande så tveka inte! Sök!\n\nAre you eager for new challenges, a career in the restaurant industry and a company where you can grow fast? Or do you just want an extra job alongside your studies? Then you have come to the right place!\n\nWho are the Brödernas?\n\nBrödernas successfully conducts its operations throughout Sweden from Umeå in the north to Malmö in the south. Brödernas are expanding at a rapid pace with the vision of becoming known even outside Sweden's borders. Our ambition is for Brödernas to be associated with good quality and fantastic service. We currently have over 80 opened units in Sweden and we open new units every month.\n\nThe important thing for us is that no matter what goal you have for the future, we have guaranteed a place for you. With us, it is your own ambitions and results that determine how far you can go.\n\nWhat does the job as a Kitchen staff with us mean?\n\nThe service means that you work in the kitchen and rotate between stations such as frying tables, frying and salad. You make sure that the kitchen is clean and that self-checks are followed. As a kitchen staff at Brödernas, you work in teams and it is therefore important that you are a team player and understand the importance of communication and group collaboration.\n\nWho are you?\n\nWe are looking for you who like a high work pace, are service-oriented and love working with people. You enjoy working with others and want a career in the restaurant industry.\n\nWhat do we offer?\n\nWe offer a fast-paced workplace that is in the middle of a major expansion, which means very good opportunities to develop with the company.\n\nThe recruitment process\n\nOnce you have applied for the job, you will have access to a link for a digital interview with the robot Hubert, which takes about 20-30 minutes.\n\nThe purpose of the Hubert interview is to give all candidates the opportunity to tell more about themselves and for us to ensure that all candidates are judged in the same way, regardless of gender, age and ethnicity.\n\nWe are happy to see that you respond to this within 48 - 72 hours to quickly move forward in the process. You will then be contacted by one of our recruiters if you become relevant for a second interview.\n\nWe look forward to hearing from you!\n\nInterviews are ongoing, so do not hesitate! Apply!"
      },
      "headline" : "Kökspersonal Brödernas Sala",
      "driving_license" : null,
      "employer" : {
        "email" : null,
        "phone_number" : null,
        "organization_number" : "5590838073",
        "name" : "Brödernas Group AB",
        "url" : null,
        "workplace" : "Brödernas Restauranger"
      },
      "removed_date" : null,
      "logo_url" : null,
      "last_publication_date" : "2022-12-24T23:59:59",
      "number_of_vacancies" : 1,
      "occupation" : {
        "concept_id" : "JbJw_as4_S93",
        "label" : "Kock, à la carte",
        "legacy_ams_taxonomy_id" : "7663"
      },
      "occupation_group" : {
        "concept_id" : "BStc_SJh_DKG",
        "label" : "Kockar och kallskänkor",
        "legacy_ams_taxonomy_id" : "5120"
      },
      "employment_type" : {
        "concept_id" : "PFZr_Syz_cUq",
        "label" : "Vanlig anställning",
        "legacy_ams_taxonomy_id" : "1"
      },
      "webpage_url" : "https://arbetsformedlingen.se/platsbanken/annonser/26305781",
      "driving_license_required" : false,
      "application_contacts" : [ {
        "description" : "Filip Petersson",
        "email" : "filiplarsrikard@gmail.com",
        "telephone" : null,
        "name" : null,
        "contact_type" : null
      } ],
      "duration" : {
        "concept_id" : "qQUd_4qe_NDT",
        "label" : "6 månader eller längre",
        "legacy_ams_taxonomy_id" : "2"
      },
      "nice_to_have" : {
        "education_level" : [ ],
        "work_experiences" : [ ],
        "skills" : [ ],
        "education" : [ ],
        "languages" : [ ]
      },
      "application_details" : {
        "via_af" : false,
        "email" : null,
        "other" : null,
        "reference" : null,
        "url" : "https://jobb.brodernas.nu/jobs/1908718-kokspersonal-brodernas-sala?promotion=445114-arbetsformedlingen",
        "information" : null
      },
      "source_type" : "VIA_PLATSBANKEN_DXA",
      "application_deadline" : "2022-12-24T23:59:59",
      "external_id" : "46-559083-8073-1908718-1",
      "workplace_address" : {
        "coordinates" : [ 16.606327, 59.92086 ],
        "city" : null,
        "postcode" : null,
        "municipality" : "Sala",
        "region_concept_id" : "G6DV_fKE_Viz",
        "region" : "Västmanlands län",
        "country_code" : "199",
        "region_code" : "19",
        "municipality_concept_id" : "dAen_yTK_tqz",
        "country_concept_id" : "i46j_HmG_v64",
        "municipality_code" : "1981",
        "street_address" : null,
        "country" : "Sverige"
      },
      "id" : "26305781",
      "experience_required" : false,
      "working_hours_type" : {
        "concept_id" : "947z_JGS_Uk2",
        "label" : "Deltid",
        "legacy_ams_taxonomy_id" : "2"
      },
      "access" : null,
      "timestamp" : 1657202472854,
      "must_have" : {
        "education_level" : [ ],
        "work_experiences" : [ ],
        "skills" : [ ],
        "education" : [ ],
        "languages" : [ ]
      },
      "occupation_field" : {
        "concept_id" : "ScKy_FHB_7wT",
        "label" : "Hotell, restaurang, storhushåll",
        "legacy_ams_taxonomy_id" : "7"
      },
      "scope_of_work" : {
        "min" : 0,
        "max" : 100
      },
      "salary_type" : {
        "concept_id" : "oG8G_9cW_nRf",
        "label" : "Fast månads- vecko- eller timlön",
        "legacy_ams_taxonomy_id" : "1"
      },
      "removed" : false,
      "salary_description" : "Lön enligt överenskommelse",
      "access_to_own_car" : false,
      "publication_date" : "2022-07-07T16:01:12"
    },
    "name" : "Kökspersonal Brödernas Sala",
    "user" : "hannes"
  },
  "sha1" : "3dc31fffa4bf3c48500c963243b673741b55df10",
  "annotations" : [ {
    "preferred-label" : "Kökspersonal",
    "sentiment" : "MUST_HAVE",
    "type" : "keyword",
    "start-position" : 0,
    "end-position" : 12,
    "concept-id" : "PDGg_WLr_WEw",
    "matched-string" : "kökspersonal",
    "annotation-id" : 0
  }, {
    "preferred-label" : "Sala",
    "type" : "municipality",
    "start-position" : 23,
    "end-position" : 27,
    "concept-id" : "dAen_yTK_tqz",
    "matched-string" : "Sala",
    "annotation-id" : 12
  }, {
    "preferred-label" : "Restaurang",
    "type" : "keyword",
    "start-position" : 75,
    "end-position" : 85,
    "concept-id" : "o2Cg_3Ap_qvK",
    "matched-string" : "restaurang",
    "annotation-id" : 13
  }, {
    "preferred-label" : "Kökspersonal",
    "sentiment" : "MUST_HAVE",
    "type" : "keyword",
    "start-position" : 242,
    "end-position" : 254,
    "concept-id" : "PDGg_WLr_WEw",
    "matched-string" : "kökspersonal",
    "annotation-id" : 1
  }, {
    "preferred-label" : "Sala",
    "type" : "municipality",
    "start-position" : 272,
    "end-position" : 276,
    "concept-id" : "dAen_yTK_tqz",
    "matched-string" : "Sala",
    "annotation-id" : 14
  }, {
    "preferred-label" : "Sverige",
    "type" : "country",
    "start-position" : 353,
    "end-position" : 360,
    "concept-id" : "i46j_HmG_v64",
    "matched-string" : "Sverige",
    "annotation-id" : 15
  }, {
    "preferred-label" : "Umeå",
    "type" : "municipality",
    "start-position" : 366,
    "end-position" : 370,
    "concept-id" : "QiGt_BLu_amP",
    "matched-string" : "Umeå",
    "annotation-id" : 16
  }, {
    "preferred-label" : "Malmö",
    "type" : "municipality",
    "start-position" : 383,
    "end-position" : 388,
    "concept-id" : "oYPt_yRA_Smm",
    "matched-string" : "Malmö",
    "annotation-id" : 17
  }, {
    "preferred-label" : "Sverige",
    "type" : "country",
    "start-position" : 476,
    "end-position" : 484,
    "concept-id" : "i46j_HmG_v64",
    "matched-string" : "Sveriges",
    "annotation-id" : 18
  }, {
    "preferred-label" : "Sverige",
    "type" : "country",
    "start-position" : 617,
    "end-position" : 624,
    "concept-id" : "i46j_HmG_v64",
    "matched-string" : "Sverige",
    "annotation-id" : 19
  }, {
    "preferred-label" : "Kökspersonal",
    "sentiment" : "MUST_HAVE",
    "type" : "keyword",
    "start-position" : 875,
    "end-position" : 887,
    "concept-id" : "PDGg_WLr_WEw",
    "matched-string" : "kökspersonal",
    "annotation-id" : 2
  }, {
    "preferred-label" : "Kökspersonal",
    "sentiment" : "MUST_HAVE",
    "type" : "keyword",
    "start-position" : 1071,
    "end-position" : 1083,
    "concept-id" : "PDGg_WLr_WEw",
    "matched-string" : "kökspersonal",
    "annotation-id" : 3
  }, {
    "preferred-label" : "Restaurang",
    "type" : "keyword",
    "start-position" : 1392,
    "end-position" : 1402,
    "concept-id" : "o2Cg_3Ap_qvK",
    "matched-string" : "restaurang",
    "annotation-id" : 20
  }, {
    "preferred-label" : "Rekryterare/Rekryteringskonsult",
    "sentiment" : "MUST_HAVE",
    "type" : "occupation-name",
    "start-position" : 2094,
    "end-position" : 2105,
    "concept-id" : "QaQC_ozP_Bme",
    "matched-string" : "rekryterare",
    "annotation-id" : 4
  }, {
    "preferred-label" : "CAN, kommunikationsprotokoll",
    "sentiment" : "MUST_HAVE",
    "type" : "skill",
    "start-position" : 2325,
    "end-position" : 2328,
    "concept-id" : "nTdr_FJz_ioy",
    "matched-string" : "can",
    "annotation-id" : 5
  }, {
    "preferred-label" : "ITS (internationell spedition)",
    "sentiment" : "MUST_HAVE",
    "type" : "skill",
    "start-position" : 2493,
    "end-position" : 2496,
    "concept-id" : "ePzH_pgt_BsZ",
    "matched-string" : "its",
    "annotation-id" : 6
  }, {
    "preferred-label" : "Data/IT",
    "sentiment" : "MUST_HAVE",
    "type" : "occupation-field",
    "start-position" : 2975,
    "end-position" : 2977,
    "concept-id" : "apaJ_2ja_LuF",
    "matched-string" : "it",
    "annotation-id" : 7
  }, {
    "preferred-label" : "FaR (Fysisk aktivitet på recept)",
    "sentiment" : "MUST_HAVE",
    "type" : "skill",
    "start-position" : 3031,
    "end-position" : 3034,
    "concept-id" : "mpL2_UvN_LnK",
    "matched-string" : "far",
    "annotation-id" : 8
  }, {
    "preferred-label" : "CAN, kommunikationsprotokoll",
    "sentiment" : "MUST_HAVE",
    "type" : "skill",
    "start-position" : 3039,
    "end-position" : 3042,
    "concept-id" : "nTdr_FJz_ioy",
    "matched-string" : "can",
    "annotation-id" : 9
  }, {
    "preferred-label" : "Data/IT",
    "sentiment" : "MUST_HAVE",
    "type" : "occupation-field",
    "start-position" : 3346,
    "end-position" : 3348,
    "concept-id" : "apaJ_2ja_LuF",
    "matched-string" : "it",
    "annotation-id" : 10
  }, {
    "preferred-label" : "Access, databashanterare",
    "sentiment" : "MUST_HAVE",
    "type" : "skill",
    "start-position" : 3899,
    "end-position" : 3905,
    "concept-id" : "aroP_kTr_WGc",
    "matched-string" : "access",
    "annotation-id" : 11
  } ],
  "text" : "Kökspersonal Brödernas Sala\nÄr du sugen på nya utmaningar, en karriär inom restaurangbranschen och ett företag där det går snabbt att växa? Eller vill du bara ha ett extra jobb vid sidan av studierna? Då har du kommit rätt! Nu söker vi efter kökspersonal till vår enhet i Sala!\n\nVilka är Brödernas?\nBrödernas bedriver med framgång sin verksamhet i hela Sverige från Umeå i norr till Malmö i söder. Brödernas expanderar i en rasande takt med visionen att bli känt även utanför Sveriges gränser. Vår ambition är att Brödernas ska associeras med god kvalité och fantastisk service. Vi har idag över 80 öppnade enheter i Sverige och vi öppnar nya enheter varje månad.\n\nDet viktiga för oss är att oavsett vilket mål du har för framtiden så har vi garanterat en plats för dig. Hos oss är det dina egna ambitioner och resultat som avgör hur långt du kan gå.\n\nVad innebär jobbet som Kökspersonal hos oss?\nTjänsten innebär att du jobbar i köket och roterar mellan stationer som stekbord, fritering och sallad. Du ser till att det är rent i köket och att egenkontroller följs. Som kökspersonal på Brödernas arbetar du i team och det är därför viktigt att du är en lagspelare och förstår vikten av kommunikation och gruppsamverkan.\n\nVem är du?\nVi söker dig som gillar ett högt arbetstempo, är serviceinriktad och älskar att jobba med människor. Du tycker om att jobba med andra och vill ha en karriär i restaurangbranschen.\n\nVad erbjuder vi?\nVi erbjuder en fartfylld arbetsplats som är mitt under en stor expansion vilket innebär mycket goda möjligheter att utvecklas med företaget.\n\nRekryteringsprocessen\nNär du har sökt tjänsten så kommer du att få tillgång till en länk för en digital intervju med roboten Hubert som tar ca 20 - 30 minuter.\n\nSyftet med att Hubert-intervjun är vi vill ge alla kandidater möjligheten att berätta mer om sig själva samt för oss att säkerställa att alla kandidater blir bedömda på samma sätt, oavsett kön, ålder och etnicitet.\n\nVi ser gärna att du svarar på denna inom 48 - 72 timmar för att snabbt komma vidare i processen. Du kommer därefter bli kontaktad av en av våra rekryterare om du blir aktuell för en andra intervju.\n\nVi ser fram emot att höra från dig!\n\nIntervjuer sker löpande så tveka inte! Sök!\n\nAre you eager for new challenges, a career in the restaurant industry and a company where you can grow fast? Or do you just want an extra job alongside your studies? Then you have come to the right place!\n\nWho are the Brödernas?\n\nBrödernas successfully conducts its operations throughout Sweden from Umeå in the north to Malmö in the south. Brödernas are expanding at a rapid pace with the vision of becoming known even outside Sweden's borders. Our ambition is for Brödernas to be associated with good quality and fantastic service. We currently have over 80 opened units in Sweden and we open new units every month.\n\nThe important thing for us is that no matter what goal you have for the future, we have guaranteed a place for you. With us, it is your own ambitions and results that determine how far you can go.\n\nWhat does the job as a Kitchen staff with us mean?\n\nThe service means that you work in the kitchen and rotate between stations such as frying tables, frying and salad. You make sure that the kitchen is clean and that self-checks are followed. As a kitchen staff at Brödernas, you work in teams and it is therefore important that you are a team player and understand the importance of communication and group collaboration.\n\nWho are you?\n\nWe are looking for you who like a high work pace, are service-oriented and love working with people. You enjoy working with others and want a career in the restaurant industry.\n\nWhat do we offer?\n\nWe offer a fast-paced workplace that is in the middle of a major expansion, which means very good opportunities to develop with the company.\n\nThe recruitment process\n\nOnce you have applied for the job, you will have access to a link for a digital interview with the robot Hubert, which takes about 20-30 minutes.\n\nThe purpose of the Hubert interview is to give all candidates the opportunity to tell more about themselves and for us to ensure that all candidates are judged in the same way, regardless of gender, age and ethnicity.\n\nWe are happy to see that you respond to this within 48 - 72 hours to quickly move forward in the process. You will then be contacted by one of our recruiters if you become relevant for a second interview.\n\nWe look forward to hearing from you!\n\nInterviews are ongoing, so do not hesitate! Apply!"
}