{
  "meta" : {
    "jobad" : {
      "description" : {
        "requirements" : null,
        "needs" : null,
        "company_information" : null,
        "text_formatted" : "Capio Psykiatri är en av Sveriges största privata vårdgivare inom psykiatrisk specialistvård, med verksamheter inom områdena allmänpsykiatri, specialiserad barn- och ungdomspsykiatrisk, beroendemedicin och ätstörningar. Vi finns i Stockholmsområdet, Östergötland, Örebro och Halland. Vi arbetar på uppdrag från regioner både på vårdavtal och vårdval. \n\nVi vänder oss till personer som är 18 år och äldre som lever i hemlöshet och är i behov av hälso- och sjukvårdsinsatser.\n\nMålgruppen är i första hand personer som tillhör situation 1 enligt Socialstyrelsens definition av hemlöshet; en person som är hänvisad till akutboende, härbärge, jourboende eller är uteliggare.\n\nI slutenvården är målgruppen personer folkbokförda i Stockholms län med somatiska sjukdomar och komplexa vårdbehov, oftast i kombination med beroende och/eller psykisk sjuklighet/funktionshinder. På vår vårdavdelning erbjuder vi medicinskt omhändertagande och omvårdnad till patienter som lever i hemlöshet. Avdelningen har 14 vårdplatser varav en är för patienter med palliativ vård.\n\n\n\n\r\n\r\nVälkommen till heldygnsvården för hemlösa\n\nHeldygnsvården för hemlösa är en slutenvårdsavdelning för patienter i hemlöshet.\r\n\r\nVi är belägna på Maria Sjukhus på Södermalm i Stockholm. På avdelningen arbetar undersköterskor, sjuksköterskor, läkare, vårdsamordnare, kurator, arbetsterapeut och fysioterapeut.\n\nPatienter remitteras hit från akutsjukhus, geriatrik, eller från Pelarbacken, öppenvården för hemlösa.\n\nVanliga diagnoser och vårdbehov är bensår, diabetes, hjärtsvikt, kol, infektioner, cancer med kurativ eller palliativ behandling, minnessvikt eller rehabilitering efter skador och akuta operationer. De somatiska sjukdomarna och vårdbehov är många gånger i kombination med psykisk ohälsa och/eller beroendeproblematik.\n\nVi arbetar personcentrerat, skapar tillit, motiverar och strävar efter att tillgodose patientens vård och stöd utifrån ett helhetsperspektiv, ofta i samverkan med socialtjänst och andra vårdgivare.\n\nKvalifikationer\nLegitimerad sjuksköterska med erfarenhet eller intresse av att arbeta med människor i utsatta situationer. \n\nVi lägger stor vikt vid personlig lämplighet och ser gärna att du är flexibel och lösningsinriktad. Du har ett gott bemötande, en positiv grundinställning och en god förmåga att arbeta både självständigt och i grupp.\n\nVi erbjuder:\n\nEtt givande arbete tillsammans med kollegor som är stolta över sitt arbete och den betydelse vår insats har för patienterna.\n\n- Individuellt planerad introduktion\n\n- Möjligheter att vara med och utveckla vården\n\n- Friskvårdsbidrag på 3000 kr\n\n- Ersättning för sjukvårdsbesök upp till högkostnadskort\n\n- Fredagsfrukost\n\n- Dubbelt nattob för sjuksköterskor\n\nÖvrig information\nDet finns möjlighet att hospitera.\n\nRekrytering och intervjuer sker löpande under pågående ansökningstid.\n\nI vår verksamhet är det svenska språket ett viktigt redskap i arbetet med våra patienter. Vi strävar efter en jämn könsfördelning och ser mångfald som en styrka och välkomnar därför sökande med olika bakgrund.\n\n \n\nVälkommen att söka tjänsten!\n\n \n\n \n\nCapio – Nordens största privata vårdgivare\nCapios vision är att förbättra hälsan för människor varje dag. Vi vill göra skillnad för våra patienter genom att se, lyssna och finnas här – idag och genom hela livet. Våra medarbetare är viktiga för oss och vi vill ge dem kraften att finnas där för våra patienter men också för att utveckla vården i stort. I vårt dagliga arbete jobbar vi utifrån våra värderingar: Quality, Empowerment, Innovation och Social responsibility. De hjälper oss att uppfylla vårt patientlöfte om att vara en pålitlig partner – närvarande och nytänkande. Tillsammans förbättrar vi folkhälsan – en individ i taget!\n\n\nCapio erbjuder ett brett och högkvalitativt vårdutbud genom våra sjukhus, specialistkliniker och vårdcentraler i Sverige, Norge och Danmark. Våra patienter kan även få hjälp via våra digitala tjänster. Capio är sedan 2018 en del av Ramsay Santé - en ledande vårdgivare med 36 000 medarbetare i sex länder. För mer information, besök https://capio.se/.\n\n\nVi undanber oss vänligt men bestämt all direktkontakt med bemannings- och rekryteringsföretag samt försäljare av jobbannonser.",
        "conditions" : "70,79. Tillträde: Enligt överenskommelse\r\nProvanställning t.o.m. ",
        "text" : "Capio Psykiatri är en av Sveriges största privata vårdgivare inom psykiatrisk specialistvård, med verksamheter inom områdena allmänpsykiatri, specialiserad barn- och ungdomspsykiatrisk, beroendemedicin och ätstörningar. Vi finns i Stockholmsområdet, Östergötland, Örebro och Halland. Vi arbetar på uppdrag från regioner både på vårdavtal och vårdval. \n\nVi vänder oss till personer som är 18 år och äldre som lever i hemlöshet och är i behov av hälso- och sjukvårdsinsatser.\n\nMålgruppen är i första hand personer som tillhör situation 1 enligt Socialstyrelsens definition av hemlöshet; en person som är hänvisad till akutboende, härbärge, jourboende eller är uteliggare.\n\nI slutenvården är målgruppen personer folkbokförda i Stockholms län med somatiska sjukdomar och komplexa vårdbehov, oftast i kombination med beroende och/eller psykisk sjuklighet/funktionshinder. På vår vårdavdelning erbjuder vi medicinskt omhändertagande och omvårdnad till patienter som lever i hemlöshet. Avdelningen har 14 vårdplatser varav en är för patienter med palliativ vård.\n\n\n\n\r\n\r\nVälkommen till heldygnsvården för hemlösa\n\nHeldygnsvården för hemlösa är en slutenvårdsavdelning för patienter i hemlöshet.\r\n\r\nVi är belägna på Maria Sjukhus på Södermalm i Stockholm. På avdelningen arbetar undersköterskor, sjuksköterskor, läkare, vårdsamordnare, kurator, arbetsterapeut och fysioterapeut.\n\nPatienter remitteras hit från akutsjukhus, geriatrik, eller från Pelarbacken, öppenvården för hemlösa.\n\nVanliga diagnoser och vårdbehov är bensår, diabetes, hjärtsvikt, kol, infektioner, cancer med kurativ eller palliativ behandling, minnessvikt eller rehabilitering efter skador och akuta operationer. De somatiska sjukdomarna och vårdbehov är många gånger i kombination med psykisk ohälsa och/eller beroendeproblematik.\n\nVi arbetar personcentrerat, skapar tillit, motiverar och strävar efter att tillgodose patientens vård och stöd utifrån ett helhetsperspektiv, ofta i samverkan med socialtjänst och andra vårdgivare.\n\nKvalifikationer\nLegitimerad sjuksköterska med erfarenhet eller intresse av att arbeta med människor i utsatta situationer. \n\nVi lägger stor vikt vid personlig lämplighet och ser gärna att du är flexibel och lösningsinriktad. Du har ett gott bemötande, en positiv grundinställning och en god förmåga att arbeta både självständigt och i grupp.\n\nVi erbjuder:\n\nEtt givande arbete tillsammans med kollegor som är stolta över sitt arbete och den betydelse vår insats har för patienterna.\n\n- Individuellt planerad introduktion\n\n- Möjligheter att vara med och utveckla vården\n\n- Friskvårdsbidrag på 3000 kr\n\n- Ersättning för sjukvårdsbesök upp till högkostnadskort\n\n- Fredagsfrukost\n\n- Dubbelt nattob för sjuksköterskor\n\nÖvrig information\nDet finns möjlighet att hospitera.\n\nRekrytering och intervjuer sker löpande under pågående ansökningstid.\n\nI vår verksamhet är det svenska språket ett viktigt redskap i arbetet med våra patienter. Vi strävar efter en jämn könsfördelning och ser mångfald som en styrka och välkomnar därför sökande med olika bakgrund.\n\n \n\nVälkommen att söka tjänsten!\n\n \n\n \n\nCapio – Nordens största privata vårdgivare\nCapios vision är att förbättra hälsan för människor varje dag. Vi vill göra skillnad för våra patienter genom att se, lyssna och finnas här – idag och genom hela livet. Våra medarbetare är viktiga för oss och vi vill ge dem kraften att finnas där för våra patienter men också för att utveckla vården i stort. I vårt dagliga arbete jobbar vi utifrån våra värderingar: Quality, Empowerment, Innovation och Social responsibility. De hjälper oss att uppfylla vårt patientlöfte om att vara en pålitlig partner – närvarande och nytänkande. Tillsammans förbättrar vi folkhälsan – en individ i taget!\n\n\nCapio erbjuder ett brett och högkvalitativt vårdutbud genom våra sjukhus, specialistkliniker och vårdcentraler i Sverige, Norge och Danmark. Våra patienter kan även få hjälp via våra digitala tjänster. Capio är sedan 2018 en del av Ramsay Santé - en ledande vårdgivare med 36 000 medarbetare i sex länder. För mer information, besök https://capio.se/.\n\n\nVi undanber oss vänligt men bestämt all direktkontakt med bemannings- och rekryteringsföretag samt försäljare av jobbannonser."
      },
      "headline" : "Sjuksköterska natt. Vårdavdelning för hemlösa.",
      "driving_license" : null,
      "employer" : {
        "email" : null,
        "phone_number" : null,
        "organization_number" : "5560625237",
        "name" : "Capio Sverige AB",
        "url" : null,
        "workplace" : "Capio Specialistkliniker, Capio Psykiatri, Capio Vård för Hemlösa "
      },
      "removed_date" : null,
      "logo_url" : null,
      "last_publication_date" : "2022-08-21T23:59:59",
      "number_of_vacancies" : 1,
      "occupation" : {
        "concept_id" : "bXNH_MNX_dUR",
        "label" : "Sjuksköterska, grundutbildad",
        "legacy_ams_taxonomy_id" : "7296"
      },
      "occupation_group" : {
        "concept_id" : "Z8ci_bBE_tmx",
        "label" : "Grundutbildade sjuksköterskor",
        "legacy_ams_taxonomy_id" : "2221"
      },
      "employment_type" : {
        "concept_id" : "PFZr_Syz_cUq",
        "label" : "Vanlig anställning",
        "legacy_ams_taxonomy_id" : "1"
      },
      "webpage_url" : "https://arbetsformedlingen.se/platsbanken/annonser/26369504",
      "driving_license_required" : false,
      "application_contacts" : [ {
        "description" : "Anette Wennerskog",
        "email" : null,
        "telephone" : "08-59834174",
        "name" : null,
        "contact_type" : null
      } ],
      "duration" : {
        "concept_id" : "qQUd_4qe_NDT",
        "label" : "6 månader eller längre",
        "legacy_ams_taxonomy_id" : "2"
      },
      "nice_to_have" : {
        "education_level" : [ ],
        "work_experiences" : [ ],
        "skills" : [ ],
        "education" : [ ],
        "languages" : [ ]
      },
      "application_details" : {
        "via_af" : false,
        "email" : null,
        "other" : null,
        "reference" : "2022/1274",
        "url" : "https://capio.varbi.com/what:job/jobID:532620/type:job/where:1/apply:1",
        "information" : null
      },
      "source_type" : "VIA_PLATSBANKEN_DXA",
      "application_deadline" : "2022-08-21T23:59:59",
      "external_id" : "46-556062-5237-532620",
      "workplace_address" : {
        "coordinates" : [ 18.06858, 59.329323 ],
        "city" : null,
        "postcode" : null,
        "municipality" : "Stockholm",
        "region_concept_id" : "CifL_Rzy_Mku",
        "region" : "Stockholms län",
        "country_code" : "199",
        "region_code" : "01",
        "municipality_concept_id" : "AvNB_uwa_6n6",
        "country_concept_id" : "i46j_HmG_v64",
        "municipality_code" : "0180",
        "street_address" : null,
        "country" : "Sverige"
      },
      "id" : "26369504",
      "experience_required" : true,
      "working_hours_type" : {
        "concept_id" : "947z_JGS_Uk2",
        "label" : "Deltid",
        "legacy_ams_taxonomy_id" : "2"
      },
      "access" : null,
      "timestamp" : 1659369973839,
      "must_have" : {
        "education_level" : [ ],
        "work_experiences" : [ {
          "concept_id" : "bXNH_MNX_dUR",
          "weight" : 10,
          "label" : "Sjuksköterska, grundutbildad",
          "legacy_ams_taxonomy_id" : "7296"
        } ],
        "skills" : [ ],
        "education" : [ ],
        "languages" : [ ]
      },
      "occupation_field" : {
        "concept_id" : "NYW6_mP6_vwf",
        "label" : "Hälso- och sjukvård",
        "legacy_ams_taxonomy_id" : "8"
      },
      "scope_of_work" : {
        "min" : 0,
        "max" : 100
      },
      "salary_type" : {
        "concept_id" : "oG8G_9cW_nRf",
        "label" : "Fast månads- vecko- eller timlön",
        "legacy_ams_taxonomy_id" : "1"
      },
      "removed" : false,
      "salary_description" : "månadslön",
      "access_to_own_car" : false,
      "publication_date" : "2022-08-01T18:06:13"
    },
    "name" : "Sjuksköterska natt. Vårdavdelning för hemlösa.",
    "user" : "hannes"
  },
  "sha1" : "ca3d6a197663d9321c4af180445a3832fdd9cb0d",
  "annotations" : [ {
    "preferred-label" : "Sjuksköterskor",
    "sentiment" : "MUST_HAVE",
    "type" : "ssyk-level-3",
    "start-position" : 0,
    "end-position" : 13,
    "concept-id" : "jzaN_Vqk_TP1",
    "matched-string" : "sjuksköterska",
    "annotation-id" : 0
  }, {
    "preferred-label" : "Vårdavdelning/Mottagning",
    "sentiment" : "MUST_HAVE",
    "type" : "skill",
    "start-position" : 20,
    "end-position" : 33,
    "concept-id" : "TuUX_3Jo_wyq",
    "matched-string" : "vårdavdelning",
    "annotation-id" : 1
  }, {
    "preferred-label" : "Psykiatri",
    "sentiment" : "MUST_HAVE",
    "type" : "skill",
    "start-position" : 53,
    "end-position" : 62,
    "concept-id" : "sXoR_gGY_ycN",
    "matched-string" : "psykiatri",
    "annotation-id" : 2
  }, {
    "preferred-label" : "Sverige",
    "type" : "country",
    "start-position" : 72,
    "end-position" : 80,
    "concept-id" : "i46j_HmG_v64",
    "matched-string" : "Sveriges",
    "annotation-id" : 19
  }, {
    "preferred-label" : "ätstörningar",
    "type" : "esco-skill",
    "start-position" : 253,
    "end-position" : 265,
    "concept-id" : "LKeT_vxf_bPp",
    "matched-string" : "ätstörningar",
    "annotation-id" : 20
  }, {
    "preferred-label" : "Hälso- och sjukvård",
    "type" : "sni-level-2",
    "start-position" : 491,
    "end-position" : 519,
    "concept-id" : "KhNL_Quq_Xjk",
    "matched-string" : "hälso- och sjukvårdsinsatser",
    "annotation-id" : 21
  }, {
    "preferred-label" : "Stockholms län",
    "type" : "region",
    "start-position" : 771,
    "end-position" : 785,
    "concept-id" : "CifL_Rzy_Mku",
    "matched-string" : "Stockholms län",
    "annotation-id" : 22
  }, {
    "preferred-label" : "Vårdavdelning/Mottagning",
    "sentiment" : "MUST_HAVE",
    "type" : "skill",
    "start-position" : 921,
    "end-position" : 934,
    "concept-id" : "TuUX_3Jo_wyq",
    "matched-string" : "vårdavdelning",
    "annotation-id" : 4
  }, {
    "preferred-label" : "Palliativ vård",
    "sentiment" : "MUST_HAVE",
    "type" : "skill",
    "start-position" : 1087,
    "end-position" : 1101,
    "concept-id" : "ryxY_Uwr_pkw",
    "matched-string" : "palliativ vård",
    "annotation-id" : 6
  }, {
    "preferred-label" : "Stockholm",
    "type" : "municipality",
    "start-position" : 1283,
    "end-position" : 1292,
    "concept-id" : "AvNB_uwa_6n6",
    "matched-string" : "Stockholm",
    "annotation-id" : 23
  }, {
    "preferred-label" : "Undersköterskor",
    "sentiment" : "MUST_HAVE",
    "type" : "ssyk-level-3",
    "start-position" : 1317,
    "end-position" : 1332,
    "concept-id" : "3EJj_WLs_kgD",
    "matched-string" : "undersköterskor",
    "annotation-id" : 7
  }, {
    "preferred-label" : "Sjuksköterskor",
    "sentiment" : "MUST_HAVE",
    "type" : "ssyk-level-3",
    "start-position" : 1334,
    "end-position" : 1348,
    "concept-id" : "jzaN_Vqk_TP1",
    "matched-string" : "sjuksköterskor",
    "annotation-id" : 8
  }, {
    "preferred-label" : "läkare",
    "sentiment" : "MUST_HAVE",
    "type" : "esco-occupation",
    "start-position" : 1350,
    "end-position" : 1356,
    "concept-id" : "snUT_QSf_LG9",
    "matched-string" : "läkare",
    "annotation-id" : 9
  }, {
    "preferred-label" : "Vårdsamordnare",
    "sentiment" : "MUST_HAVE",
    "type" : "keyword",
    "start-position" : 1358,
    "end-position" : 1372,
    "concept-id" : "1q9Y_LGj_Up6",
    "matched-string" : "vårdsamordnare",
    "annotation-id" : 10
  }, {
    "preferred-label" : "Kurator",
    "sentiment" : "MUST_HAVE",
    "type" : "occupation-name",
    "start-position" : 1374,
    "end-position" : 1381,
    "concept-id" : "YpRs_ybt_47a",
    "matched-string" : "kurator",
    "annotation-id" : 11
  }, {
    "preferred-label" : "Arbetsterapeut",
    "sentiment" : "MUST_HAVE",
    "type" : "occupation-name",
    "start-position" : 1383,
    "end-position" : 1397,
    "concept-id" : "heGV_uHh_o8W",
    "matched-string" : "arbetsterapeut",
    "annotation-id" : 12
  }, {
    "preferred-label" : "Fysioterapeut/Sjukgymnast",
    "sentiment" : "MUST_HAVE",
    "type" : "occupation-name",
    "start-position" : 1402,
    "end-position" : 1415,
    "concept-id" : "raVz_oTw_N3e",
    "matched-string" : "fysioterapeut",
    "annotation-id" : 13
  }, {
    "preferred-label" : "Geriatrik",
    "sentiment" : "MUST_HAVE",
    "type" : "skill",
    "start-position" : 1461,
    "end-position" : 1470,
    "concept-id" : "zi7e_S96_W9k",
    "matched-string" : "geriatrik",
    "annotation-id" : 14
  }, {
    "preferred-label" : "rehabilitering",
    "sentiment" : "MUST_HAVE",
    "type" : "esco-skill",
    "start-position" : 1670,
    "end-position" : 1684,
    "concept-id" : "ok5p_sUV_QKj",
    "matched-string" : "rehabilitering",
    "annotation-id" : 15
  }, {
    "preferred-label" : "Sjuksköterskor",
    "sentiment" : "MUST_HAVE",
    "type" : "ssyk-level-3",
    "start-position" : 2068,
    "end-position" : 2081,
    "concept-id" : "jzaN_Vqk_TP1",
    "matched-string" : "sjuksköterska",
    "annotation-id" : 16
  }, {
    "preferred-label" : "arbeta självständigt",
    "type" : "esco-skill",
    "start-position" : 2343,
    "end-position" : 2349,
    "concept-id" : "NyFu_HHd_zhz",
    "matched-string" : "arbeta",
    "annotation-id" : 25
  }, {
    "preferred-label" : "arbeta självständigt",
    "type" : "esco-skill",
    "start-position" : 2355,
    "end-position" : 2368,
    "concept-id" : "NyFu_HHd_zhz",
    "matched-string" : "självständigt",
    "annotation-id" : 24
  }, {
    "preferred-label" : "Sjuksköterskor",
    "sentiment" : "MUST_HAVE",
    "type" : "ssyk-level-3",
    "start-position" : 2737,
    "end-position" : 2751,
    "concept-id" : "jzaN_Vqk_TP1",
    "matched-string" : "sjuksköterskor",
    "annotation-id" : 17
  }, {
    "preferred-label" : "Svenska språket",
    "sentiment" : "MUST_HAVE",
    "type" : "keyword",
    "start-position" : 2902,
    "end-position" : 2917,
    "concept-id" : "BiGm_58D_SSn",
    "matched-string" : "svenska språket",
    "annotation-id" : 18
  } ],
  "text" : "Sjuksköterska natt. Vårdavdelning för hemlösa.\nCapio Psykiatri är en av Sveriges största privata vårdgivare inom psykiatrisk specialistvård, med verksamheter inom områdena allmänpsykiatri, specialiserad barn- och ungdomspsykiatrisk, beroendemedicin och ätstörningar. Vi finns i Stockholmsområdet, Östergötland, Örebro och Halland. Vi arbetar på uppdrag från regioner både på vårdavtal och vårdval. \n\nVi vänder oss till personer som är 18 år och äldre som lever i hemlöshet och är i behov av hälso- och sjukvårdsinsatser.\n\nMålgruppen är i första hand personer som tillhör situation 1 enligt Socialstyrelsens definition av hemlöshet; en person som är hänvisad till akutboende, härbärge, jourboende eller är uteliggare.\n\nI slutenvården är målgruppen personer folkbokförda i Stockholms län med somatiska sjukdomar och komplexa vårdbehov, oftast i kombination med beroende och/eller psykisk sjuklighet/funktionshinder. På vår vårdavdelning erbjuder vi medicinskt omhändertagande och omvårdnad till patienter som lever i hemlöshet. Avdelningen har 14 vårdplatser varav en är för patienter med palliativ vård.\n\n\n\n\r\n\r\nVälkommen till heldygnsvården för hemlösa\n\nHeldygnsvården för hemlösa är en slutenvårdsavdelning för patienter i hemlöshet.\r\n\r\nVi är belägna på Maria Sjukhus på Södermalm i Stockholm. På avdelningen arbetar undersköterskor, sjuksköterskor, läkare, vårdsamordnare, kurator, arbetsterapeut och fysioterapeut.\n\nPatienter remitteras hit från akutsjukhus, geriatrik, eller från Pelarbacken, öppenvården för hemlösa.\n\nVanliga diagnoser och vårdbehov är bensår, diabetes, hjärtsvikt, kol, infektioner, cancer med kurativ eller palliativ behandling, minnessvikt eller rehabilitering efter skador och akuta operationer. De somatiska sjukdomarna och vårdbehov är många gånger i kombination med psykisk ohälsa och/eller beroendeproblematik.\n\nVi arbetar personcentrerat, skapar tillit, motiverar och strävar efter att tillgodose patientens vård och stöd utifrån ett helhetsperspektiv, ofta i samverkan med socialtjänst och andra vårdgivare.\n\nKvalifikationer\nLegitimerad sjuksköterska med erfarenhet eller intresse av att arbeta med människor i utsatta situationer. \n\nVi lägger stor vikt vid personlig lämplighet och ser gärna att du är flexibel och lösningsinriktad. Du har ett gott bemötande, en positiv grundinställning och en god förmåga att arbeta både självständigt och i grupp.\n\nVi erbjuder:\n\nEtt givande arbete tillsammans med kollegor som är stolta över sitt arbete och den betydelse vår insats har för patienterna.\n\n- Individuellt planerad introduktion\n\n- Möjligheter att vara med och utveckla vården\n\n- Friskvårdsbidrag på 3000 kr\n\n- Ersättning för sjukvårdsbesök upp till högkostnadskort\n\n- Fredagsfrukost\n\n- Dubbelt nattob för sjuksköterskor\n\nÖvrig information\nDet finns möjlighet att hospitera.\n\nRekrytering och intervjuer sker löpande under pågående ansökningstid.\n\nI vår verksamhet är det svenska språket ett viktigt redskap i arbetet med våra patienter. Vi strävar efter en jämn könsfördelning och ser mångfald som en styrka och välkomnar därför sökande med olika bakgrund.\n\n \n\nVälkommen att söka tjänsten!\n\n \n\n \n\nCapio – Nordens största privata vårdgivare\nCapios vision är att förbättra hälsan för människor varje dag. Vi vill göra skillnad för våra patienter genom att se, lyssna och finnas här – idag och genom hela livet. Våra medarbetare är viktiga för oss och vi vill ge dem kraften att finnas där för våra patienter men också för att utveckla vården i stort. I vårt dagliga arbete jobbar vi utifrån våra värderingar: Quality, Empowerment, Innovation och Social responsibility. De hjälper oss att uppfylla vårt patientlöfte om att vara en pålitlig partner – närvarande och nytänkande. Tillsammans förbättrar vi folkhälsan – en individ i taget!\n\n\nCapio erbjuder ett brett och högkvalitativt vårdutbud genom våra sjukhus, specialistkliniker och vårdcentraler i Sverige, Norge och Danmark. Våra patienter kan även få hjälp via våra digitala tjänster. Capio är sedan 2018 en del av Ramsay Santé - en ledande vårdgivare med 36 000 medarbetare i sex länder. För mer information, besök https://capio.se/.\n\n\nVi undanber oss vänligt men bestämt all direktkontakt med bemannings- och rekryteringsföretag samt försäljare av jobbannonser."
}