{
  "meta" : {
    "jobad" : {
      "description" : {
        "requirements" : null,
        "needs" : null,
        "company_information" : null,
        "text_formatted" : "I Region Kronoberg kan du trivas, växa och påverka. Tillsammans arbetar vi för att nå visionen \"Ett gott liv i ett livskraftigt län\".\r\n\r\nARBETSUPPGIFTER\nSom sjuksköterska på KPE blir du involverad i ett flertal kliniska studier där du förväntas planera, genomföra och följa upp studieprocessen, enligt studiespecifika protokoll. Du arbetar i nära samarbete med mottagning och dagsjukvård och koordinerar kontakten med läkare, apotek, röntgen, patolog, lab med flera. Du är även kontaktsjuksköterska för forskningspersoner som deltar i studier. En stor del av arbetet innebär administrativa arbetsuppgifter, till exempel datainsamling, registrering i olika system och medverkan vid monitorering av studierna. Även blodprovstagning och att dela ut studieläkemedel till forskningspersoner förekommer. Du förväntas också att bidra till en kontinuerlig utveckling av arbetssätt och rutiner inom enheten.\r\n\r\nKVALIFIKATIONER\nDu som söker ska vara legitimerad sjuksköterska med klinisk erfarenhet, gärna inom onkologi. Du behöver också ha goda färdigheter i tal och skrift i svenska och engelska språket. Vi ser det som meriterande om du har erfarenhet av arbete med kliniska prövningar samt är van att använda Excel och andra Office-program.\n\nSom sjuksköterska vid KPE fungerar man som spindeln i nätet och som koordinator för kliniska studier. Du har en självständig och variationsrik roll med såväl forskningspersoner som interna och externa kontakter. Du ska ha lätt för att samarbeta och det är av stor betydelse att du är trygg med att arbeta självständigt. Rollen kräver stor noggrannhet och det är viktigt att du som person är lyhörd och har ett lösningsorienterat förhållningssätt. Stor vikt läggs vid personlig lämplighet.\n\nIntervjuer planeras hållas under vecka 37. \n\nVarmt välkommen med din ansökan!\r\n\nÖVRIGT\nFrågor om hur du ansöker och lägger in ditt CV ställer du direkt till Visma Recruit 0771-693 693.  \n\nFrågor om specifika jobb besvaras av den rekryterare eller kontaktperson som anges i annonsen. För att skicka in din ansökan, klicka på ansökningslänken i annonsen.\n\nVi undanber oss vänligt men bestämt erbjudanden om annonserings- och rekryteringstjänster i samband med den här annonsen.",
        "conditions" : "Heltid.  Dagtid.\r\nTillsvidareanställning, tillträde: Enligt överenskommelse.",
        "text" : "I Region Kronoberg kan du trivas, växa och påverka. Tillsammans arbetar vi för att nå visionen \"Ett gott liv i ett livskraftigt län\".\r\n\r\nARBETSUPPGIFTER\nSom sjuksköterska på KPE blir du involverad i ett flertal kliniska studier där du förväntas planera, genomföra och följa upp studieprocessen, enligt studiespecifika protokoll. Du arbetar i nära samarbete med mottagning och dagsjukvård och koordinerar kontakten med läkare, apotek, röntgen, patolog, lab med flera. Du är även kontaktsjuksköterska för forskningspersoner som deltar i studier. En stor del av arbetet innebär administrativa arbetsuppgifter, till exempel datainsamling, registrering i olika system och medverkan vid monitorering av studierna. Även blodprovstagning och att dela ut studieläkemedel till forskningspersoner förekommer. Du förväntas också att bidra till en kontinuerlig utveckling av arbetssätt och rutiner inom enheten.\r\n\r\nKVALIFIKATIONER\nDu som söker ska vara legitimerad sjuksköterska med klinisk erfarenhet, gärna inom onkologi. Du behöver också ha goda färdigheter i tal och skrift i svenska och engelska språket. Vi ser det som meriterande om du har erfarenhet av arbete med kliniska prövningar samt är van att använda Excel och andra Office-program.\n\nSom sjuksköterska vid KPE fungerar man som spindeln i nätet och som koordinator för kliniska studier. Du har en självständig och variationsrik roll med såväl forskningspersoner som interna och externa kontakter. Du ska ha lätt för att samarbeta och det är av stor betydelse att du är trygg med att arbeta självständigt. Rollen kräver stor noggrannhet och det är viktigt att du som person är lyhörd och har ett lösningsorienterat förhållningssätt. Stor vikt läggs vid personlig lämplighet.\n\nIntervjuer planeras hållas under vecka 37. \n\nVarmt välkommen med din ansökan!\r\n\nÖVRIGT\nFrågor om hur du ansöker och lägger in ditt CV ställer du direkt till Visma Recruit 0771-693 693.  \n\nFrågor om specifika jobb besvaras av den rekryterare eller kontaktperson som anges i annonsen. För att skicka in din ansökan, klicka på ansökningslänken i annonsen.\n\nVi undanber oss vänligt men bestämt erbjudanden om annonserings- och rekryteringstjänster i samband med den här annonsen."
      },
      "headline" : "Intresserad av forskning? Onkologen söker sjuksköterska till KPE!",
      "driving_license" : null,
      "employer" : {
        "email" : null,
        "phone_number" : null,
        "organization_number" : "2321000065",
        "name" : "REGION KRONOBERG",
        "url" : null,
        "workplace" : "Region Kronoberg, Sjukhusvård"
      },
      "removed_date" : null,
      "logo_url" : "https://www.arbetsformedlingen.se/rest/arbetsgivare/rest/af/v3/organisation/2321000065/logotyper/logo.png",
      "last_publication_date" : "2022-09-11T23:59:59",
      "number_of_vacancies" : 1,
      "occupation" : {
        "concept_id" : "bXNH_MNX_dUR",
        "label" : "Sjuksköterska, grundutbildad",
        "legacy_ams_taxonomy_id" : "7296"
      },
      "occupation_group" : {
        "concept_id" : "Z8ci_bBE_tmx",
        "label" : "Grundutbildade sjuksköterskor",
        "legacy_ams_taxonomy_id" : "2221"
      },
      "employment_type" : {
        "concept_id" : "PFZr_Syz_cUq",
        "label" : "Vanlig anställning",
        "legacy_ams_taxonomy_id" : "1"
      },
      "webpage_url" : "https://arbetsformedlingen.se/platsbanken/annonser/26420654",
      "driving_license_required" : false,
      "application_contacts" : [ {
        "description" : "Sofie Bång",
        "email" : "sofie.bang@kronoberg.se",
        "telephone" : "0470-58 35 39",
        "name" : null,
        "contact_type" : "HR-konsult"
      }, {
        "description" : "Maria Olofsson Wahlgren",
        "email" : null,
        "telephone" : "0470-58 79 39",
        "name" : null,
        "contact_type" : "Avdelningschef dagsjukvården"
      } ],
      "duration" : {
        "concept_id" : "a7uU_j21_mkL",
        "label" : "Tills vidare",
        "legacy_ams_taxonomy_id" : "1"
      },
      "nice_to_have" : {
        "education_level" : [ ],
        "work_experiences" : [ ],
        "skills" : [ ],
        "education" : [ ],
        "languages" : [ ]
      },
      "application_details" : {
        "via_af" : false,
        "email" : null,
        "other" : null,
        "reference" : "SHV 200/22",
        "url" : "https://recruit.visma.com/Public/Apply.aspx?guidAssignment=7cefff89-c05d-41be-9bde-38e90706d16f&publishCode=AMS&TK=e55e7c41-6134-4557-b568-58bf24097004",
        "information" : null
      },
      "source_type" : "VIA_PLATSBANKEN_DXA",
      "application_deadline" : "2022-09-11T23:59:59",
      "external_id" : "46-232100-0065-7CEFFF89C05D41BE9BDE38E90706D16F",
      "workplace_address" : {
        "coordinates" : [ 14.805852, 56.879005 ],
        "city" : null,
        "postcode" : null,
        "municipality" : "Växjö",
        "region_concept_id" : "tF3y_MF9_h5G",
        "region" : "Kronobergs län",
        "country_code" : "199",
        "region_code" : "07",
        "municipality_concept_id" : "mmot_H3A_auW",
        "country_concept_id" : "i46j_HmG_v64",
        "municipality_code" : "0780",
        "street_address" : null,
        "country" : "Sverige"
      },
      "id" : "26420654",
      "experience_required" : true,
      "working_hours_type" : {
        "concept_id" : "6YE1_gAC_R2G",
        "label" : "Heltid",
        "legacy_ams_taxonomy_id" : "1"
      },
      "access" : null,
      "timestamp" : 1660734612470,
      "must_have" : {
        "education_level" : [ ],
        "work_experiences" : [ {
          "concept_id" : "bXNH_MNX_dUR",
          "weight" : 10,
          "label" : "Sjuksköterska, grundutbildad",
          "legacy_ams_taxonomy_id" : "7296"
        } ],
        "skills" : [ ],
        "education" : [ ],
        "languages" : [ ]
      },
      "occupation_field" : {
        "concept_id" : "NYW6_mP6_vwf",
        "label" : "Hälso- och sjukvård",
        "legacy_ams_taxonomy_id" : "8"
      },
      "scope_of_work" : {
        "min" : 100,
        "max" : 100
      },
      "salary_type" : {
        "concept_id" : "oG8G_9cW_nRf",
        "label" : "Fast månads- vecko- eller timlön",
        "legacy_ams_taxonomy_id" : "1"
      },
      "removed" : false,
      "salary_description" : "Månadslön",
      "access_to_own_car" : false,
      "publication_date" : "2022-08-17T13:10:12"
    },
    "name" : "Intresserad av forskning? Onkologen söker sjuksköterska till KPE!",
    "user" : "hannes"
  },
  "sha1" : "aa4274109ac07bc63a80cd0ca09f77fac5da4aba",
  "annotations" : [ {
    "preferred-label" : "Sjuksköterska, grundutbildad",
    "sentiment" : "MUST_HAVE",
    "type" : "occupation-name",
    "start-position" : 42,
    "end-position" : 55,
    "concept-id" : "bXNH_MNX_dUR",
    "matched-string" : "sjuksköterska",
    "annotation-id" : 0
  }, {
    "preferred-label" : "Kronobergs län",
    "sentiment" : "NOT_RELEVANT",
    "type" : "region",
    "start-position" : 68,
    "end-position" : 84,
    "concept-id" : "tF3y_MF9_h5G",
    "matched-string" : "Region Kronoberg",
    "annotation-id" : 12
  }, {
    "preferred-label" : "Sjuksköterska, grundutbildad",
    "sentiment" : "MUST_HAVE",
    "type" : "occupation-name",
    "start-position" : 223,
    "end-position" : 236,
    "concept-id" : "bXNH_MNX_dUR",
    "matched-string" : "sjuksköterska",
    "annotation-id" : 1
  }, {
    "preferred-label" : "Vårdavdelning/Mottagning",
    "sentiment" : "NOT_RELEVANT",
    "type" : "skill",
    "start-position" : 427,
    "end-position" : 437,
    "concept-id" : "TuUX_3Jo_wyq",
    "matched-string" : "mottagning",
    "annotation-id" : 2
  }, {
    "preferred-label" : "läkare",
    "sentiment" : "NOT_RELEVANT",
    "type" : "esco-occupation",
    "start-position" : 484,
    "end-position" : 490,
    "concept-id" : "snUT_QSf_LG9",
    "matched-string" : "läkare",
    "annotation-id" : 3
  }, {
    "preferred-label" : "patologi",
    "sentiment" : "NOT_RELEVANT",
    "type" : "esco-skill",
    "start-position" : 509,
    "end-position" : 516,
    "concept-id" : "xLP8_EZG_6Bq",
    "matched-string" : "patolog",
    "annotation-id" : 13
  }, {
    "preferred-label" : "Kontaktsjuksköterska",
    "sentiment" : "NOT_RELEVANT",
    "type" : "occupation-name",
    "start-position" : 544,
    "end-position" : 564,
    "concept-id" : "P255_NB8_Aa7",
    "matched-string" : "kontaktsjuksköterska",
    "annotation-id" : 4
  }, {
    "preferred-label" : "Sjuksköterska, grundutbildad",
    "sentiment" : "MUST_HAVE",
    "type" : "occupation-name",
    "start-position" : 1018,
    "end-position" : 1031,
    "concept-id" : "bXNH_MNX_dUR",
    "matched-string" : "sjuksköterska",
    "annotation-id" : 5
  }, {
    "preferred-label" : "Onkologi",
    "sentiment" : "NICE_TO_HAVE",
    "type" : "skill",
    "start-position" : 1067,
    "end-position" : 1075,
    "concept-id" : "nKjx_3Qa_hrr",
    "matched-string" : "onkologi",
    "annotation-id" : 6
  }, {
    "preferred-label" : "Svenska",
    "sentiment" : "MUST_HAVE",
    "type" : "language",
    "start-position" : 1133,
    "end-position" : 1140,
    "concept-id" : "zSLA_vw2_FXN",
    "matched-string" : "svenska",
    "annotation-id" : 7
  }, {
    "preferred-label" : "Engelska",
    "sentiment" : "MUST_HAVE",
    "type" : "language",
    "start-position" : 1145,
    "end-position" : 1153,
    "concept-id" : "NVxJ_hLg_TYS",
    "matched-string" : "engelska",
    "annotation-id" : 8
  }, {
    "preferred-label" : "Klinisk prövning",
    "sentiment" : "NICE_TO_HAVE",
    "type" : "skill",
    "start-position" : 1225,
    "end-position" : 1244,
    "concept-id" : "PrA4_KwY_YcV",
    "matched-string" : "kliniska prövningar",
    "annotation-id" : 19
  }, {
    "preferred-label" : "MS Excel",
    "sentiment" : "NICE_TO_HAVE",
    "type" : "skill",
    "start-position" : 1269,
    "end-position" : 1274,
    "concept-id" : "5wab_aFK_gdL",
    "matched-string" : "Excel",
    "annotation-id" : 17
  }, {
    "preferred-label" : "MS Office",
    "sentiment" : "NICE_TO_HAVE",
    "type" : "skill",
    "start-position" : 1285,
    "end-position" : 1299,
    "concept-id" : "w8bU_wHe_omF",
    "matched-string" : "Office-program",
    "annotation-id" : 18
  }, {
    "preferred-label" : "Sjuksköterska, grundutbildad",
    "sentiment" : "MUST_HAVE",
    "type" : "occupation-name",
    "start-position" : 1306,
    "end-position" : 1319,
    "concept-id" : "bXNH_MNX_dUR",
    "matched-string" : "sjuksköterska",
    "annotation-id" : 9
  }, {
    "preferred-label" : "Koordinator",
    "sentiment" : "NOT_RELEVANT",
    "type" : "keyword",
    "start-position" : 1370,
    "end-position" : 1381,
    "concept-id" : "FfDD_gxA_Bsr",
    "matched-string" : "koordinator",
    "annotation-id" : 10
  }, {
    "preferred-label" : "arbeta självständigt",
    "sentiment" : "NOT_RELEVANT",
    "type" : "esco-skill",
    "start-position" : 1414,
    "end-position" : 1426,
    "concept-id" : "NyFu_HHd_zhz",
    "matched-string" : "självständig",
    "annotation-id" : 14
  }, {
    "preferred-label" : "arbeta självständigt",
    "sentiment" : "MUST_HAVE",
    "type" : "esco-skill",
    "start-position" : 1600,
    "end-position" : 1620,
    "concept-id" : "NyFu_HHd_zhz",
    "matched-string" : "arbeta självständigt",
    "annotation-id" : 15
  }, {
    "preferred-label" : "noggrannhet",
    "sentiment" : "MUST_HAVE",
    "type" : "esco-skill",
    "start-position" : 1641,
    "end-position" : 1652,
    "concept-id" : "mrsW_EkL_KRD",
    "matched-string" : "noggrannhet",
    "annotation-id" : 16
  }, {
    "preferred-label" : "Rekryterare/Rekryteringskonsult",
    "sentiment" : "NOT_RELEVANT",
    "type" : "occupation-name",
    "start-position" : 2021,
    "end-position" : 2032,
    "concept-id" : "QaQC_ozP_Bme",
    "matched-string" : "rekryterare",
    "annotation-id" : 11
  } ],
  "text" : "Intresserad av forskning? Onkologen söker sjuksköterska till KPE!\nI Region Kronoberg kan du trivas, växa och påverka. Tillsammans arbetar vi för att nå visionen \"Ett gott liv i ett livskraftigt län\".\r\n\r\nARBETSUPPGIFTER\nSom sjuksköterska på KPE blir du involverad i ett flertal kliniska studier där du förväntas planera, genomföra och följa upp studieprocessen, enligt studiespecifika protokoll. Du arbetar i nära samarbete med mottagning och dagsjukvård och koordinerar kontakten med läkare, apotek, röntgen, patolog, lab med flera. Du är även kontaktsjuksköterska för forskningspersoner som deltar i studier. En stor del av arbetet innebär administrativa arbetsuppgifter, till exempel datainsamling, registrering i olika system och medverkan vid monitorering av studierna. Även blodprovstagning och att dela ut studieläkemedel till forskningspersoner förekommer. Du förväntas också att bidra till en kontinuerlig utveckling av arbetssätt och rutiner inom enheten.\r\n\r\nKVALIFIKATIONER\nDu som söker ska vara legitimerad sjuksköterska med klinisk erfarenhet, gärna inom onkologi. Du behöver också ha goda färdigheter i tal och skrift i svenska och engelska språket. Vi ser det som meriterande om du har erfarenhet av arbete med kliniska prövningar samt är van att använda Excel och andra Office-program.\n\nSom sjuksköterska vid KPE fungerar man som spindeln i nätet och som koordinator för kliniska studier. Du har en självständig och variationsrik roll med såväl forskningspersoner som interna och externa kontakter. Du ska ha lätt för att samarbeta och det är av stor betydelse att du är trygg med att arbeta självständigt. Rollen kräver stor noggrannhet och det är viktigt att du som person är lyhörd och har ett lösningsorienterat förhållningssätt. Stor vikt läggs vid personlig lämplighet.\n\nIntervjuer planeras hållas under vecka 37. \n\nVarmt välkommen med din ansökan!\r\n\nÖVRIGT\nFrågor om hur du ansöker och lägger in ditt CV ställer du direkt till Visma Recruit 0771-693 693.  \n\nFrågor om specifika jobb besvaras av den rekryterare eller kontaktperson som anges i annonsen. För att skicka in din ansökan, klicka på ansökningslänken i annonsen.\n\nVi undanber oss vänligt men bestämt erbjudanden om annonserings- och rekryteringstjänster i samband med den här annonsen."
}