{
  "meta" : {
    "jobad" : {
      "description" : {
        "requirements" : null,
        "needs" : null,
        "company_information" : null,
        "text_formatted" : "Här får du plats att växa. Inom Lunds kommun sätter vi kunskapen i centrum och skapar möjligheter att utvecklas i arbetslivet. Vi erbjuder en inkluderande arbetsmiljö, och chans att påverka och göra skillnad. Vill du bli en av oss?\n\n\n\r\n\r\nOm oss\nMiljöförvaltningen är en myndighet som består av 35 medarbetare med en bred kompetens inom verksamhetens ansvarsområde.\r\n\r\nFörvaltningen arbetar under miljönämnden och med tillsyn bland annat inom områdena miljöskydd, hälsoskydd och livsmedelshantering.\n\nMiljöförvaltningen lägger avgörande vikt vid att vara en attraktiv arbetsgivare och sätter stort värde i att erbjuda medarbetarna möjligheter till individuell utveckling i yrkesrollen.\n\nVi söker nu en handläggare med inriktning miljöskydd.\n\nArbetsuppgifter\nAnställningen är tillsvidareanställning med början snarast efter överenskommelse.\n\nTjänsten innebär tillsyn och handläggning enligt miljöbalken inom området miljöskydd med särskild inriktning på A-, B- och C-verksamheter, bland annat inom energiområdet. Du kommer att ingå i ett team av ca 15 handläggare inom miljötillsynen. Även andra inom förvaltningen förekommande arbetsuppgifter kan bli aktuella.\n\nVi söker dig som\nFör tjänsten krävs miljö- och hälsoskyddsutbildning vid universitet/högskola eller annan akademisk utbildning som kan bedömas likvärdig. Arbetslivserfarenhet eller särskild kompetens inom området är meriterande. Till tjänsten söker vi en serviceinriktad, initiativrik och utåtriktad person som är bra på att kommunicera både muntligt och skriftligt och som tycker om att möta olika människor och kulturer. Du trivs med att arbeta såväl självständigt som i grupp.\nKörkort för bil erfordras.\n\n\n\n\n\n ",
        "conditions" : "100%. Tillträde: Snarast eller enligt överenskommelse\r\nTillsvidareanställning",
        "text" : "Här får du plats att växa. Inom Lunds kommun sätter vi kunskapen i centrum och skapar möjligheter att utvecklas i arbetslivet. Vi erbjuder en inkluderande arbetsmiljö, och chans att påverka och göra skillnad. Vill du bli en av oss?\n\n\n\r\n\r\nOm oss\nMiljöförvaltningen är en myndighet som består av 35 medarbetare med en bred kompetens inom verksamhetens ansvarsområde.\r\n\r\nFörvaltningen arbetar under miljönämnden och med tillsyn bland annat inom områdena miljöskydd, hälsoskydd och livsmedelshantering.\n\nMiljöförvaltningen lägger avgörande vikt vid att vara en attraktiv arbetsgivare och sätter stort värde i att erbjuda medarbetarna möjligheter till individuell utveckling i yrkesrollen.\n\nVi söker nu en handläggare med inriktning miljöskydd.\n\nArbetsuppgifter\nAnställningen är tillsvidareanställning med början snarast efter överenskommelse.\n\nTjänsten innebär tillsyn och handläggning enligt miljöbalken inom området miljöskydd med särskild inriktning på A-, B- och C-verksamheter, bland annat inom energiområdet. Du kommer att ingå i ett team av ca 15 handläggare inom miljötillsynen. Även andra inom förvaltningen förekommande arbetsuppgifter kan bli aktuella.\n\nVi söker dig som\nFör tjänsten krävs miljö- och hälsoskyddsutbildning vid universitet/högskola eller annan akademisk utbildning som kan bedömas likvärdig. Arbetslivserfarenhet eller särskild kompetens inom området är meriterande. Till tjänsten söker vi en serviceinriktad, initiativrik och utåtriktad person som är bra på att kommunicera både muntligt och skriftligt och som tycker om att möta olika människor och kulturer. Du trivs med att arbeta såväl självständigt som i grupp.\nKörkort för bil erfordras."
      },
      "headline" : "Miljöinspektör - inriktning miljöskydd",
      "driving_license" : null,
      "employer" : {
        "email" : null,
        "phone_number" : null,
        "organization_number" : "2120001132",
        "name" : "Lunds kommun",
        "url" : null,
        "workplace" : "Miljöförvaltningen"
      },
      "removed_date" : null,
      "logo_url" : "https://www.arbetsformedlingen.se/rest/arbetsgivare/rest/af/v3/organisation/2120001132/logotyper/logo.png",
      "last_publication_date" : "2022-08-28T23:59:59",
      "number_of_vacancies" : 1,
      "occupation" : {
        "concept_id" : "2gtP_DKV_nfQ",
        "label" : "Miljöinspektör",
        "legacy_ams_taxonomy_id" : "1921"
      },
      "occupation_group" : {
        "concept_id" : "rE1E_m3d_cx1",
        "label" : "Specialister inom miljöskydd och miljöteknik",
        "legacy_ams_taxonomy_id" : "2183"
      },
      "employment_type" : {
        "concept_id" : "PFZr_Syz_cUq",
        "label" : "Vanlig anställning",
        "legacy_ams_taxonomy_id" : "1"
      },
      "webpage_url" : "https://arbetsformedlingen.se/platsbanken/annonser/26351778",
      "driving_license_required" : false,
      "application_contacts" : [ {
        "description" : "Björn Berséus",
        "email" : null,
        "telephone" : "bjorn.berseus@lund.sealt046-3595260/0734-150774",
        "name" : null,
        "contact_type" : null
      } ],
      "duration" : {
        "concept_id" : "a7uU_j21_mkL",
        "label" : "Tills vidare",
        "legacy_ams_taxonomy_id" : "1"
      },
      "nice_to_have" : {
        "education_level" : [ ],
        "work_experiences" : [ ],
        "skills" : [ ],
        "education" : [ ],
        "languages" : [ ]
      },
      "application_details" : {
        "via_af" : false,
        "email" : null,
        "other" : null,
        "reference" : "2022/1038",
        "url" : "https://lund.varbi.com/what:job/jobID:531737/type:job/where:1/apply:1",
        "information" : null
      },
      "source_type" : "VIA_PLATSBANKEN_DXA",
      "application_deadline" : "2022-08-28T23:59:59",
      "external_id" : "46-212000-1132-531737",
      "workplace_address" : {
        "coordinates" : [ 13.191008, 55.70466 ],
        "city" : null,
        "postcode" : null,
        "municipality" : "Lund",
        "region_concept_id" : "CaRE_1nn_cSU",
        "region" : "Skåne län",
        "country_code" : "199",
        "region_code" : "12",
        "municipality_concept_id" : "muSY_tsR_vDZ",
        "country_concept_id" : "i46j_HmG_v64",
        "municipality_code" : "1281",
        "street_address" : null,
        "country" : "Sverige"
      },
      "id" : "26351778",
      "experience_required" : false,
      "working_hours_type" : {
        "concept_id" : "6YE1_gAC_R2G",
        "label" : "Heltid",
        "legacy_ams_taxonomy_id" : "1"
      },
      "access" : null,
      "timestamp" : 1658749807637,
      "must_have" : {
        "education_level" : [ ],
        "work_experiences" : [ ],
        "skills" : [ ],
        "education" : [ ],
        "languages" : [ ]
      },
      "occupation_field" : {
        "concept_id" : "kJeN_wmw_9wX",
        "label" : "Naturvetenskap",
        "legacy_ams_taxonomy_id" : "14"
      },
      "scope_of_work" : {
        "min" : 100,
        "max" : 100
      },
      "salary_type" : {
        "concept_id" : "oG8G_9cW_nRf",
        "label" : "Fast månads- vecko- eller timlön",
        "legacy_ams_taxonomy_id" : "1"
      },
      "removed" : false,
      "salary_description" : "Månadslön",
      "access_to_own_car" : false,
      "publication_date" : "2022-07-25T13:50:07"
    },
    "name" : "Miljöinspektör - inriktning miljöskydd",
    "user" : "hannes"
  },
  "sha1" : "704b59785b72e527439bbedd9f0287cfb7a74d43",
  "annotations" : [ {
    "preferred-label" : "miljöinspektör",
    "sentiment" : "MUST_HAVE",
    "type" : "esco-occupation",
    "start-position" : 0,
    "end-position" : 14,
    "concept-id" : "xYHb_aKs_Cky",
    "matched-string" : "miljöinspektör",
    "annotation-id" : 0
  }, {
    "preferred-label" : "Miljöskydd",
    "sentiment" : "MUST_HAVE",
    "type" : "skill",
    "start-position" : 28,
    "end-position" : 38,
    "concept-id" : "UXhY_wj1_QSW",
    "matched-string" : "miljöskydd",
    "annotation-id" : 1
  }, {
    "preferred-label" : "Lund",
    "type" : "municipality",
    "start-position" : 71,
    "end-position" : 83,
    "concept-id" : "muSY_tsR_vDZ",
    "matched-string" : "Lunds kommun",
    "annotation-id" : 7
  }, {
    "preferred-label" : "arbetsmiljö",
    "sentiment" : "MUST_HAVE",
    "type" : "esco-skill",
    "start-position" : 194,
    "end-position" : 205,
    "concept-id" : "zdQY_QJh_nUH",
    "matched-string" : "arbetsmiljö",
    "annotation-id" : 2
  }, {
    "preferred-label" : "Miljö- och hälsoskydd",
    "type" : "keyword",
    "start-position" : 490,
    "end-position" : 512,
    "concept-id" : "Jqei_k5E_u48",
    "matched-string" : "miljöskydd, hälsoskydd",
    "annotation-id" : 8
  }, {
    "preferred-label" : "Miljöskydd",
    "sentiment" : "MUST_HAVE",
    "type" : "skill",
    "start-position" : 767,
    "end-position" : 777,
    "concept-id" : "UXhY_wj1_QSW",
    "matched-string" : "miljöskydd",
    "annotation-id" : 4
  }, {
    "preferred-label" : "Tillsvidareanställning (inkl. eventuell provanställning)",
    "type" : "employment-type",
    "start-position" : 813,
    "end-position" : 835,
    "concept-id" : "kpPX_CNN_gDU",
    "matched-string" : "tillsvidareanställning",
    "annotation-id" : 9
  }, {
    "preferred-label" : "Miljöskydd",
    "sentiment" : "MUST_HAVE",
    "type" : "skill",
    "start-position" : 953,
    "end-position" : 963,
    "concept-id" : "UXhY_wj1_QSW",
    "matched-string" : "miljöskydd",
    "annotation-id" : 5
  }, {
    "preferred-label" : "Miljö- och hälsoskydd",
    "type" : "keyword",
    "start-position" : 1236,
    "end-position" : 1257,
    "concept-id" : "Jqei_k5E_u48",
    "matched-string" : "miljö- och hälsoskydd",
    "annotation-id" : 10
  }, {
    "preferred-label" : "Universitets- eller högskoleutbildning",
    "type" : "sni-level-5",
    "start-position" : 1258,
    "end-position" : 1293,
    "concept-id" : "4Hs1_pdH_C7k",
    "matched-string" : "utbildning vid universitet/högskola",
    "annotation-id" : 11
  }, {
    "preferred-label" : "arbeta självständigt",
    "type" : "esco-skill",
    "start-position" : 1640,
    "end-position" : 1646,
    "concept-id" : "NyFu_HHd_zhz",
    "matched-string" : "arbeta",
    "annotation-id" : 13
  }, {
    "preferred-label" : "arbeta självständigt",
    "type" : "esco-skill",
    "start-position" : 1653,
    "end-position" : 1666,
    "concept-id" : "NyFu_HHd_zhz",
    "matched-string" : "självständigt",
    "annotation-id" : 12
  } ],
  "text" : "Miljöinspektör - inriktning miljöskydd\nHär får du plats att växa. Inom Lunds kommun sätter vi kunskapen i centrum och skapar möjligheter att utvecklas i arbetslivet. Vi erbjuder en inkluderande arbetsmiljö, och chans att påverka och göra skillnad. Vill du bli en av oss?\n\n\n\r\n\r\nOm oss\nMiljöförvaltningen är en myndighet som består av 35 medarbetare med en bred kompetens inom verksamhetens ansvarsområde.\r\n\r\nFörvaltningen arbetar under miljönämnden och med tillsyn bland annat inom områdena miljöskydd, hälsoskydd och livsmedelshantering.\n\nMiljöförvaltningen lägger avgörande vikt vid att vara en attraktiv arbetsgivare och sätter stort värde i att erbjuda medarbetarna möjligheter till individuell utveckling i yrkesrollen.\n\nVi söker nu en handläggare med inriktning miljöskydd.\n\nArbetsuppgifter\nAnställningen är tillsvidareanställning med början snarast efter överenskommelse.\n\nTjänsten innebär tillsyn och handläggning enligt miljöbalken inom området miljöskydd med särskild inriktning på A-, B- och C-verksamheter, bland annat inom energiområdet. Du kommer att ingå i ett team av ca 15 handläggare inom miljötillsynen. Även andra inom förvaltningen förekommande arbetsuppgifter kan bli aktuella.\n\nVi söker dig som\nFör tjänsten krävs miljö- och hälsoskyddsutbildning vid universitet/högskola eller annan akademisk utbildning som kan bedömas likvärdig. Arbetslivserfarenhet eller särskild kompetens inom området är meriterande. Till tjänsten söker vi en serviceinriktad, initiativrik och utåtriktad person som är bra på att kommunicera både muntligt och skriftligt och som tycker om att möta olika människor och kulturer. Du trivs med att arbeta såväl självständigt som i grupp.\nKörkort för bil erfordras."
}