{
  "meta" : {
    "jobad" : {
      "description" : {
        "requirements" : null,
        "needs" : null,
        "company_information" : null,
        "text_formatted" : "Inledning\n\nArbetar du inom byggbranschen eller jobbar du kanske som arbetsledare i dagsläget och känner dig redo för nästa steg i karriären? Då är detta möjligheten för dig! Logistic Contractor växer i norr och söker nu arbetsledare som vill vara med på deras framgångsresa. Vill du vara med och utvecklas inom branschens mest nischade aktör inom industri- och logistikfastighetsbyggande - missa inte detta!\n\nInformation om tjänsten\n\nProfessionals Nord söker nu en arbetsledare för Logistic Contractors räkning. Det är en direktrekrytering vilket innebär att rekryteringsprocessen sker genom Professionals Nord och att du anställs direkt hos Logistic Contractor.\n\nWästbygg Gruppen är ett börsnoterat entreprenad- och projektutvecklingsbolag med verksamhet på de mest expansiva marknaderna i Sverige samt via koncernbolaget Logistic Contractor även i Danmark, Norge och Finland. Deras 500 medarbetare bygger och utvecklar bostäder, kommersiella byggnader, samhällsfastigheter samt logistik- och industrianläggningar – alltid med stort fokus på hållbarhet. I koncernen ingår Wästbygg AB, Rekab Entreprenad AB, Logistic Contractor AB och Inwita Fastigheter AB.\n\nLogistic Contractor (LC) är specialiserade på att bygga och utveckla nyckelfärdiga logistik- och industrianläggningar. I det svenska bolaget med ca 60 medarbetare byggs årligen ca 150 000 m2. Sedan starten 2004 har LC haft en gynnsam tillväxt. Ett av de pågående projekten är byggnation av batterifabriken i Skellefteå för Northvolts räkning. Med kommande stora industri- och anläggningsetableringar i Norr- och Västerbotten vill LC förstärka sin närvaro och möjlighet till ytterligare tillväxt genom att etablera sig fysiskt i Norrland.\n\nVi söker nu ambitiösa och drivna arbetsledare i norr, som vill bli en del av företagets framgångsrika team!\n\nDu erbjuds\n\nDu blir en självklar del i ett sammansvetsat team som lägger stort fokus på sin gemensamma värdegrund att agera klokt, kreativt och med stort hjärta. Hos Logistic Contractor arbetar alla under ett stort mått av eget ansvar. Utrymmet för egna idéer är generöst och det är kort väg till besluten. Du blir del av en grupp där teamkänsla och prestigelöshet värderas högt och där det finns ett driv att genomföra framgångsrika projekt. De erbjuder konkurrenskraftiga villkor, en bra arbetsmiljö och härliga kollegor.\n\nArbetsuppgifter\n\nSom arbetsledare ansvarar du för planering, ledning och fördelning av det dagliga arbetet för LC:s underentreprenörer i din del av byggprojektet. Du följer upp tidplaner och återkopplar till platschef och övriga medarbetare på byggarbetsplatsen.\n\nEn dag som arbetsledare innebär samordning av aktiviteter bland olika yrkesgrupper, uppföljning av utfört arbete, avstämningar mot våra kvalitets-, arbetsmiljö-, tids- och ekonomiska mål. Du har förståelse för slutprodukten och vad som är viktigt för kunden.\n\nVi söker dig som:\n\nHar erfarenheter från liknande arbetsuppgifter inom byggbranschen och erfarenhet från arbete i projektform. Du har kunskap om entreprenadjuridik och lagkrav. Har du en relevant akademisk examen är det meriterande men inget krav.\n\nDå projekten är runt om i landet söker vi dig som trivs i en omväxlande arbetsmiljö och har möjlighet att befinna dig på resande fot flera dagar per vecka, fokus kommer att vara projekt i norra Sverige. Du behöver ha B-körkort, behärska svenska i tal och skrift samt ha god datorvana då Logistic Contractor är ett digitaliserat företag.\n\nFör att lyckas och trivas i rollen behöver du ha lätt att kommunicera och samarbeta med andra, samt vara självgående och ha ett stort kvalitets- och säkerhetsfokus.\n\nEftersom LC arbetar för en jämn könsfördelning ser vi gärna kvinnliga sökande till den här tjänsten.\n\nSTART: Enligt överenskommelse\nOMFATTNING: Heltid\nREGION: Västerbotten och Norrbotten\nURVAL: Sker löpande\nKONTAKT: Hanna Degerhäll \n\nSök tjänsten genom att klicka på \"sök jobbet\" nedan. Vi går igenom urvalet löpande och kan därför ha gått vidare med kandidater innan annonsen stängs ner. Om du vill kan du även skapa en användare och ladda upp ditt CV och personliga brev. Vi tar tyvärr inte emot ansökningar via mail men har du frågor kring tjänsten är du välkommen att kontakta oss på info@pn.se",
        "conditions" : "Heltid\r\nTillsvidare",
        "text" : "Inledning\n\nArbetar du inom byggbranschen eller jobbar du kanske som arbetsledare i dagsläget och känner dig redo för nästa steg i karriären? Då är detta möjligheten för dig! Logistic Contractor växer i norr och söker nu arbetsledare som vill vara med på deras framgångsresa. Vill du vara med och utvecklas inom branschens mest nischade aktör inom industri- och logistikfastighetsbyggande - missa inte detta!\n\nInformation om tjänsten\n\nProfessionals Nord söker nu en arbetsledare för Logistic Contractors räkning. Det är en direktrekrytering vilket innebär att rekryteringsprocessen sker genom Professionals Nord och att du anställs direkt hos Logistic Contractor.\n\nWästbygg Gruppen är ett börsnoterat entreprenad- och projektutvecklingsbolag med verksamhet på de mest expansiva marknaderna i Sverige samt via koncernbolaget Logistic Contractor även i Danmark, Norge och Finland. Deras 500 medarbetare bygger och utvecklar bostäder, kommersiella byggnader, samhällsfastigheter samt logistik- och industrianläggningar – alltid med stort fokus på hållbarhet. I koncernen ingår Wästbygg AB, Rekab Entreprenad AB, Logistic Contractor AB och Inwita Fastigheter AB.\n\nLogistic Contractor (LC) är specialiserade på att bygga och utveckla nyckelfärdiga logistik- och industrianläggningar. I det svenska bolaget med ca 60 medarbetare byggs årligen ca 150 000 m2. Sedan starten 2004 har LC haft en gynnsam tillväxt. Ett av de pågående projekten är byggnation av batterifabriken i Skellefteå för Northvolts räkning. Med kommande stora industri- och anläggningsetableringar i Norr- och Västerbotten vill LC förstärka sin närvaro och möjlighet till ytterligare tillväxt genom att etablera sig fysiskt i Norrland.\n\nVi söker nu ambitiösa och drivna arbetsledare i norr, som vill bli en del av företagets framgångsrika team!\n\nDu erbjuds\n\nDu blir en självklar del i ett sammansvetsat team som lägger stort fokus på sin gemensamma värdegrund att agera klokt, kreativt och med stort hjärta. Hos Logistic Contractor arbetar alla under ett stort mått av eget ansvar. Utrymmet för egna idéer är generöst och det är kort väg till besluten. Du blir del av en grupp där teamkänsla och prestigelöshet värderas högt och där det finns ett driv att genomföra framgångsrika projekt. De erbjuder konkurrenskraftiga villkor, en bra arbetsmiljö och härliga kollegor.\n\nArbetsuppgifter\n\nSom arbetsledare ansvarar du för planering, ledning och fördelning av det dagliga arbetet för LC:s underentreprenörer i din del av byggprojektet. Du följer upp tidplaner och återkopplar till platschef och övriga medarbetare på byggarbetsplatsen.\n\nEn dag som arbetsledare innebär samordning av aktiviteter bland olika yrkesgrupper, uppföljning av utfört arbete, avstämningar mot våra kvalitets-, arbetsmiljö-, tids- och ekonomiska mål. Du har förståelse för slutprodukten och vad som är viktigt för kunden.\n\nVi söker dig som:\n\nHar erfarenheter från liknande arbetsuppgifter inom byggbranschen och erfarenhet från arbete i projektform. Du har kunskap om entreprenadjuridik och lagkrav. Har du en relevant akademisk examen är det meriterande men inget krav.\n\nDå projekten är runt om i landet söker vi dig som trivs i en omväxlande arbetsmiljö och har möjlighet att befinna dig på resande fot flera dagar per vecka, fokus kommer att vara projekt i norra Sverige. Du behöver ha B-körkort, behärska svenska i tal och skrift samt ha god datorvana då Logistic Contractor är ett digitaliserat företag.\n\nFör att lyckas och trivas i rollen behöver du ha lätt att kommunicera och samarbeta med andra, samt vara självgående och ha ett stort kvalitets- och säkerhetsfokus.\n\nEftersom LC arbetar för en jämn könsfördelning ser vi gärna kvinnliga sökande till den här tjänsten.\n\nSTART: Enligt överenskommelse\nOMFATTNING: Heltid\nREGION: Västerbotten och Norrbotten\nURVAL: Sker löpande\nKONTAKT: Hanna Degerhäll \n\nSök tjänsten genom att klicka på \"sök jobbet\" nedan. Vi går igenom urvalet löpande och kan därför ha gått vidare med kandidater innan annonsen stängs ner. Om du vill kan du även skapa en användare och ladda upp ditt CV och personliga brev. Vi tar tyvärr inte emot ansökningar via mail men har du frågor kring tjänsten är du välkommen att kontakta oss på info@pn.se"
      },
      "headline" : "Vill du utvecklas som arbetsledare? Se hit!",
      "driving_license" : null,
      "employer" : {
        "email" : null,
        "phone_number" : null,
        "organization_number" : "5569878399",
        "name" : "Professionals Nord Rekrytering AB",
        "url" : "https://pn.se/",
        "workplace" : "Professionals Nord Rekrytering AB"
      },
      "removed_date" : null,
      "logo_url" : "https://www.arbetsformedlingen.se/rest/arbetsgivare/rest/af/v3/organisation/5569878399/logotyper/logo.png",
      "last_publication_date" : "2022-08-20T23:59:59",
      "number_of_vacancies" : 1,
      "occupation" : {
        "concept_id" : "A6CQ_XVJ_iy4",
        "label" : "Arbetsledare, anläggning",
        "legacy_ams_taxonomy_id" : "4205"
      },
      "occupation_group" : {
        "concept_id" : "w6ud_quG_dgh",
        "label" : "Arbetsledare inom bygg, anläggning och gruva",
        "legacy_ams_taxonomy_id" : "3121"
      },
      "employment_type" : {
        "concept_id" : "PFZr_Syz_cUq",
        "label" : "Vanlig anställning",
        "legacy_ams_taxonomy_id" : "1"
      },
      "webpage_url" : "https://arbetsformedlingen.se/platsbanken/annonser/26287411",
      "driving_license_required" : false,
      "application_contacts" : [ {
        "description" : "Hanna Degerhäll",
        "email" : null,
        "telephone" : null,
        "name" : null,
        "contact_type" : "Konsultchef"
      } ],
      "duration" : {
        "concept_id" : "a7uU_j21_mkL",
        "label" : "Tills vidare",
        "legacy_ams_taxonomy_id" : "1"
      },
      "nice_to_have" : {
        "education_level" : [ ],
        "work_experiences" : [ ],
        "skills" : [ ],
        "education" : [ ],
        "languages" : [ ]
      },
      "application_details" : {
        "via_af" : false,
        "email" : null,
        "other" : null,
        "reference" : null,
        "url" : "https://pn.zerolime.se/show.aspx?src=AMS&id=BDAECC60-B362-4B21-B845-0514F76DC1E3",
        "information" : null
      },
      "source_type" : "VIA_PLATSBANKEN_DXA",
      "application_deadline" : "2022-08-20T23:59:59",
      "external_id" : "46-556987-8399-00000008458B9CC7D2",
      "workplace_address" : {
        "coordinates" : [ 21.480036, 65.316696 ],
        "city" : null,
        "postcode" : null,
        "municipality" : "Piteå",
        "region_concept_id" : "9hXe_F4g_eTG",
        "region" : "Norrbottens län",
        "country_code" : "199",
        "region_code" : "25",
        "municipality_concept_id" : "umej_bP2_PpK",
        "country_concept_id" : "i46j_HmG_v64",
        "municipality_code" : "2581",
        "street_address" : null,
        "country" : "Sverige"
      },
      "id" : "26287411",
      "experience_required" : true,
      "working_hours_type" : {
        "concept_id" : "6YE1_gAC_R2G",
        "label" : "Heltid",
        "legacy_ams_taxonomy_id" : "1"
      },
      "access" : null,
      "timestamp" : 1656915818175,
      "must_have" : {
        "education_level" : [ ],
        "work_experiences" : [ {
          "concept_id" : "A6CQ_XVJ_iy4",
          "weight" : 10,
          "label" : "Arbetsledare, anläggning",
          "legacy_ams_taxonomy_id" : "4205"
        } ],
        "skills" : [ ],
        "education" : [ ],
        "languages" : [ ]
      },
      "occupation_field" : {
        "concept_id" : "j7Cq_ZJe_GkT",
        "label" : "Bygg och anläggning",
        "legacy_ams_taxonomy_id" : "2"
      },
      "scope_of_work" : {
        "min" : 100,
        "max" : 100
      },
      "salary_type" : {
        "concept_id" : "oG8G_9cW_nRf",
        "label" : "Fast månads- vecko- eller timlön",
        "legacy_ams_taxonomy_id" : "1"
      },
      "removed" : false,
      "salary_description" : "Fast lön",
      "access_to_own_car" : false,
      "publication_date" : "2022-07-04T08:23:38"
    },
    "name" : "Vill du utvecklas som arbetsledare? Se hit!",
    "user" : "hannes"
  },
  "sha1" : "43d0130116636a39e78525978704629713bbedca",
  "annotations" : [ {
    "preferred-label" : "Arbetsledare inom bygg och anläggning",
    "type" : "isco-level-4",
    "start-position" : 22,
    "end-position" : 34,
    "concept-id" : "ya28_U3w_Rct",
    "matched-string" : "arbetsledare",
    "annotation-id" : 10
  }, {
    "preferred-label" : "byggbranschen",
    "type" : "esco-skill",
    "start-position" : 71,
    "end-position" : 84,
    "concept-id" : "Dq3z_72P_8Zy",
    "matched-string" : "byggbranschen",
    "annotation-id" : 11
  }, {
    "preferred-label" : "Arbetsledare inom bygg och anläggning",
    "type" : "isco-level-4",
    "start-position" : 112,
    "end-position" : 124,
    "concept-id" : "ya28_U3w_Rct",
    "matched-string" : "arbetsledare",
    "annotation-id" : 12
  }, {
    "preferred-label" : "Arbetsledare inom bygg och anläggning",
    "type" : "isco-level-4",
    "start-position" : 264,
    "end-position" : 276,
    "concept-id" : "ya28_U3w_Rct",
    "matched-string" : "arbetsledare",
    "annotation-id" : 13
  }, {
    "preferred-label" : "Sverige",
    "type" : "country",
    "start-position" : 835,
    "end-position" : 842,
    "concept-id" : "i46j_HmG_v64",
    "matched-string" : "Sverige",
    "annotation-id" : 14
  }, {
    "preferred-label" : "Danmark",
    "type" : "country",
    "start-position" : 894,
    "end-position" : 901,
    "concept-id" : "Co3h_1xq_Cwb",
    "matched-string" : "Danmark",
    "annotation-id" : 15
  }, {
    "preferred-label" : "Norge",
    "type" : "country",
    "start-position" : 903,
    "end-position" : 908,
    "concept-id" : "QJgN_Zge_BzJ",
    "matched-string" : "Norge",
    "annotation-id" : 16
  }, {
    "preferred-label" : "Finland",
    "type" : "country",
    "start-position" : 913,
    "end-position" : 920,
    "concept-id" : "WgbG_whJ_E7J",
    "matched-string" : "Finland",
    "annotation-id" : 17
  }, {
    "preferred-label" : "Byggande av bostadshus och andra byggnader",
    "type" : "sni-level-5",
    "start-position" : 944,
    "end-position" : 950,
    "concept-id" : "GLJP_J7o_Nmw",
    "matched-string" : "bygger",
    "annotation-id" : 19
  }, {
    "preferred-label" : "Byggande av bostadshus och andra byggnader",
    "type" : "sni-level-5",
    "start-position" : 965,
    "end-position" : 973,
    "concept-id" : "GLJP_J7o_Nmw",
    "matched-string" : "bostäder",
    "annotation-id" : 18
  }, {
    "preferred-label" : "Byggande av bostadshus och andra byggnader",
    "type" : "sni-level-5",
    "start-position" : 975,
    "end-position" : 997,
    "concept-id" : "GLJP_J7o_Nmw",
    "matched-string" : "kommersiella byggnader",
    "annotation-id" : 20
  }, {
    "preferred-label" : "Byggande av bostadshus och andra byggnader",
    "type" : "sni-level-5",
    "start-position" : 999,
    "end-position" : 1018,
    "concept-id" : "GLJP_J7o_Nmw",
    "matched-string" : "samhällsfastigheter",
    "annotation-id" : 21
  }, {
    "preferred-label" : "Logistik",
    "sentiment" : "MUST_HAVE",
    "type" : "skill",
    "start-position" : 1024,
    "end-position" : 1032,
    "concept-id" : "yXmf_iKi_7ci",
    "matched-string" : "logistik",
    "annotation-id" : 0
  }, {
    "preferred-label" : "Byggande av bostadshus och andra byggnader",
    "type" : "sni-level-5",
    "start-position" : 1253,
    "end-position" : 1258,
    "concept-id" : "GLJP_J7o_Nmw",
    "matched-string" : "bygga",
    "annotation-id" : 22
  }, {
    "preferred-label" : "Logistik",
    "sentiment" : "MUST_HAVE",
    "type" : "skill",
    "start-position" : 1286,
    "end-position" : 1294,
    "concept-id" : "yXmf_iKi_7ci",
    "matched-string" : "logistik",
    "annotation-id" : 1
  }, {
    "preferred-label" : "Svenska",
    "sentiment" : "MUST_HAVE",
    "type" : "keyword",
    "start-position" : 1328,
    "end-position" : 1335,
    "concept-id" : "gfhX_bqH_U4K",
    "matched-string" : "svenska",
    "annotation-id" : 2
  }, {
    "preferred-label" : "Byggande av bostadshus och andra byggnader",
    "type" : "sni-level-5",
    "start-position" : 1479,
    "end-position" : 1508,
    "concept-id" : "GLJP_J7o_Nmw",
    "matched-string" : "byggnation av batterifabriken",
    "annotation-id" : 23
  }, {
    "preferred-label" : "Skellefteå",
    "type" : "municipality",
    "start-position" : 1511,
    "end-position" : 1521,
    "concept-id" : "kicB_LgH_2Dk",
    "matched-string" : "Skellefteå",
    "annotation-id" : 24
  }, {
    "preferred-label" : "Norrbottens län",
    "type" : "region",
    "start-position" : 1605,
    "end-position" : 1609,
    "concept-id" : "9hXe_F4g_eTG",
    "matched-string" : "Norr",
    "annotation-id" : 26
  }, {
    "preferred-label" : "Västerbottens län",
    "type" : "region",
    "start-position" : 1615,
    "end-position" : 1627,
    "concept-id" : "g5Tt_CAV_zBd",
    "matched-string" : "Västerbotten",
    "annotation-id" : 25
  }, {
    "preferred-label" : "arbetsmiljö",
    "sentiment" : "MUST_HAVE",
    "type" : "esco-skill",
    "start-position" : 2341,
    "end-position" : 2352,
    "concept-id" : "zdQY_QJh_nUH",
    "matched-string" : "arbetsmiljö",
    "annotation-id" : 3
  }, {
    "preferred-label" : "Arbetsledare inom bygg och anläggning",
    "type" : "isco-level-4",
    "start-position" : 2397,
    "end-position" : 2409,
    "concept-id" : "ya28_U3w_Rct",
    "matched-string" : "arbetsledare",
    "annotation-id" : 27
  }, {
    "preferred-label" : "Platschef, bygg",
    "type" : "occupation-name",
    "start-position" : 2584,
    "end-position" : 2593,
    "concept-id" : "NZcr_uB1_6rX",
    "matched-string" : "platschef",
    "annotation-id" : 28
  }, {
    "preferred-label" : "Arbetsledare inom bygg och anläggning",
    "type" : "isco-level-4",
    "start-position" : 2651,
    "end-position" : 2663,
    "concept-id" : "ya28_U3w_Rct",
    "matched-string" : "arbetsledare",
    "annotation-id" : 29
  }, {
    "preferred-label" : "arbetsmiljö",
    "sentiment" : "MUST_HAVE",
    "type" : "esco-skill",
    "start-position" : 2788,
    "end-position" : 2799,
    "concept-id" : "zdQY_QJh_nUH",
    "matched-string" : "arbetsmiljö",
    "annotation-id" : 5
  }, {
    "preferred-label" : "Ekonomi",
    "type" : "keyword",
    "start-position" : 2812,
    "end-position" : 2822,
    "concept-id" : "PW4f_bmT_new",
    "matched-string" : "ekonomiska",
    "annotation-id" : 30
  }, {
    "preferred-label" : "Bygg och anläggning",
    "type" : "occupation-field",
    "start-position" : 2971,
    "end-position" : 2984,
    "concept-id" : "j7Cq_ZJe_GkT",
    "matched-string" : "byggbranschen",
    "annotation-id" : 31
  }, {
    "preferred-label" : "Entreprenadjuridik",
    "sentiment" : "MUST_HAVE",
    "type" : "skill",
    "start-position" : 3045,
    "end-position" : 3063,
    "concept-id" : "nF6J_MNc_ZxS",
    "matched-string" : "entreprenadjuridik",
    "annotation-id" : 6
  }, {
    "preferred-label" : "Yrkesbevis/examen",
    "sentiment" : "MUST_HAVE",
    "type" : "skill-headline",
    "start-position" : 3106,
    "end-position" : 3112,
    "concept-id" : "HjPN_99i_cFD",
    "matched-string" : "examen",
    "annotation-id" : 7
  }, {
    "preferred-label" : "arbetsmiljö",
    "sentiment" : "MUST_HAVE",
    "type" : "esco-skill",
    "start-position" : 3221,
    "end-position" : 3232,
    "concept-id" : "zdQY_QJh_nUH",
    "matched-string" : "arbetsmiljö",
    "annotation-id" : 8
  }, {
    "preferred-label" : "B",
    "type" : "driving-licence",
    "start-position" : 3366,
    "end-position" : 3375,
    "concept-id" : "VTK8_WRx_GcM",
    "matched-string" : "B-körkort",
    "annotation-id" : 32
  }, {
    "preferred-label" : "Svenska",
    "sentiment" : "MUST_HAVE",
    "type" : "language",
    "start-position" : 3386,
    "end-position" : 3393,
    "concept-id" : "zSLA_vw2_FXN",
    "matched-string" : "svenska",
    "annotation-id" : 9
  }, {
    "preferred-label" : "Heltid",
    "type" : "worktime-extent",
    "start-position" : 3797,
    "end-position" : 3803,
    "concept-id" : "6YE1_gAC_R2G",
    "matched-string" : "Heltid",
    "annotation-id" : 33
  }, {
    "preferred-label" : "Västerbottens län",
    "type" : "region",
    "start-position" : 3812,
    "end-position" : 3824,
    "concept-id" : "g5Tt_CAV_zBd",
    "matched-string" : "Västerbotten",
    "annotation-id" : 34
  }, {
    "preferred-label" : "Norrbottens län",
    "type" : "region",
    "start-position" : 3829,
    "end-position" : 3839,
    "concept-id" : "9hXe_F4g_eTG",
    "matched-string" : "Norrbotten",
    "annotation-id" : 35
  } ],
  "text" : "Vill du utvecklas som arbetsledare? Se hit!\nInledning\n\nArbetar du inom byggbranschen eller jobbar du kanske som arbetsledare i dagsläget och känner dig redo för nästa steg i karriären? Då är detta möjligheten för dig! Logistic Contractor växer i norr och söker nu arbetsledare som vill vara med på deras framgångsresa. Vill du vara med och utvecklas inom branschens mest nischade aktör inom industri- och logistikfastighetsbyggande - missa inte detta!\n\nInformation om tjänsten\n\nProfessionals Nord söker nu en arbetsledare för Logistic Contractors räkning. Det är en direktrekrytering vilket innebär att rekryteringsprocessen sker genom Professionals Nord och att du anställs direkt hos Logistic Contractor.\n\nWästbygg Gruppen är ett börsnoterat entreprenad- och projektutvecklingsbolag med verksamhet på de mest expansiva marknaderna i Sverige samt via koncernbolaget Logistic Contractor även i Danmark, Norge och Finland. Deras 500 medarbetare bygger och utvecklar bostäder, kommersiella byggnader, samhällsfastigheter samt logistik- och industrianläggningar – alltid med stort fokus på hållbarhet. I koncernen ingår Wästbygg AB, Rekab Entreprenad AB, Logistic Contractor AB och Inwita Fastigheter AB.\n\nLogistic Contractor (LC) är specialiserade på att bygga och utveckla nyckelfärdiga logistik- och industrianläggningar. I det svenska bolaget med ca 60 medarbetare byggs årligen ca 150 000 m2. Sedan starten 2004 har LC haft en gynnsam tillväxt. Ett av de pågående projekten är byggnation av batterifabriken i Skellefteå för Northvolts räkning. Med kommande stora industri- och anläggningsetableringar i Norr- och Västerbotten vill LC förstärka sin närvaro och möjlighet till ytterligare tillväxt genom att etablera sig fysiskt i Norrland.\n\nVi söker nu ambitiösa och drivna arbetsledare i norr, som vill bli en del av företagets framgångsrika team!\n\nDu erbjuds\n\nDu blir en självklar del i ett sammansvetsat team som lägger stort fokus på sin gemensamma värdegrund att agera klokt, kreativt och med stort hjärta. Hos Logistic Contractor arbetar alla under ett stort mått av eget ansvar. Utrymmet för egna idéer är generöst och det är kort väg till besluten. Du blir del av en grupp där teamkänsla och prestigelöshet värderas högt och där det finns ett driv att genomföra framgångsrika projekt. De erbjuder konkurrenskraftiga villkor, en bra arbetsmiljö och härliga kollegor.\n\nArbetsuppgifter\n\nSom arbetsledare ansvarar du för planering, ledning och fördelning av det dagliga arbetet för LC:s underentreprenörer i din del av byggprojektet. Du följer upp tidplaner och återkopplar till platschef och övriga medarbetare på byggarbetsplatsen.\n\nEn dag som arbetsledare innebär samordning av aktiviteter bland olika yrkesgrupper, uppföljning av utfört arbete, avstämningar mot våra kvalitets-, arbetsmiljö-, tids- och ekonomiska mål. Du har förståelse för slutprodukten och vad som är viktigt för kunden.\n\nVi söker dig som:\n\nHar erfarenheter från liknande arbetsuppgifter inom byggbranschen och erfarenhet från arbete i projektform. Du har kunskap om entreprenadjuridik och lagkrav. Har du en relevant akademisk examen är det meriterande men inget krav.\n\nDå projekten är runt om i landet söker vi dig som trivs i en omväxlande arbetsmiljö och har möjlighet att befinna dig på resande fot flera dagar per vecka, fokus kommer att vara projekt i norra Sverige. Du behöver ha B-körkort, behärska svenska i tal och skrift samt ha god datorvana då Logistic Contractor är ett digitaliserat företag.\n\nFör att lyckas och trivas i rollen behöver du ha lätt att kommunicera och samarbeta med andra, samt vara självgående och ha ett stort kvalitets- och säkerhetsfokus.\n\nEftersom LC arbetar för en jämn könsfördelning ser vi gärna kvinnliga sökande till den här tjänsten.\n\nSTART: Enligt överenskommelse\nOMFATTNING: Heltid\nREGION: Västerbotten och Norrbotten\nURVAL: Sker löpande\nKONTAKT: Hanna Degerhäll \n\nSök tjänsten genom att klicka på \"sök jobbet\" nedan. Vi går igenom urvalet löpande och kan därför ha gått vidare med kandidater innan annonsen stängs ner. Om du vill kan du även skapa en användare och ladda upp ditt CV och personliga brev. Vi tar tyvärr inte emot ansökningar via mail men har du frågor kring tjänsten är du välkommen att kontakta oss på info@pn.se"
}