{
  "meta" : {
    "jobad" : {
      "description" : {
        "requirements" : null,
        "needs" : null,
        "company_information" : null,
        "text_formatted" : "Är du vår nästa tandläkare som vill vara med och utveckla en personlig och framgångsrik klinik i Tyringe?\nOm arbetsgivaren\nHos Närtandvården i Tyringe arbetar en tandläkare, en tandhygienist och tre tandsköterskor. Kliniken består av fem behandlingsrum. Vi har ca 2500 patienter, varav 970 barnpatienter. Här finns OPG samt digital röntgen.\nVi har en god stämning och här finns goda möjligheter till egen utveckling.\n\nOm tjänsten\nDet här är en spännande och utvecklande tjänst för tandläkare. Utöver sedvanliga uppgifter med patientbehandlingar ingår i rollen även administrativa uppgifter såsom remisshantering, journalföring, behandlingsplanering, kostnadsförslag, etc. Vid kompetens och önskan finns det möjlighet för specialistbehandlingar på klinik (rum finns). Du har också möjligheten att nischa dig hos oss om intresse finns.\n\nKvalifikationer\n- Krav: God samarbetsförmåga med såväl patienter som kollegor\n- Krav: Utföra samtliga behandlingar som ingår i legitimation.\n- Krav: Patient i fokus\n- Önskemål: Ett par års erfarenhet är meriterande.\n- Önskemål: Flytande svenska i tal och skrift\n\n\nVarför ska du välja oss?\nVi är ett härligt gäng som har högt i tak och ställer upp för varandra. Vi erbjuder meningsfulla arbetsuppgifter och god möjlighet till egen utveckling. Vi tillämpar frihet under ansvar och har korta beslutsvägar. Dina ansvarsområden utformar vi utifrån dina behov och önskemål.\n\nYtterligare information\nOrt: Tyringe\nTillsvidareanställning\nOmfattning: Heltid, eller enligt överenskommelse\nTillträde: Omgående eller enligt överenskommelse\nFriskvårdsbidrag: 5000 kr/år\nJournalsystem: Frenda\nÖppettider: Mån - Fre\n\n\n\nDin ansökan ✅\nNärtandvården samarbetar i denna rekrytering med Tandfakta - dentalrekrytering för att säkerställa att du får bästa möjliga kandidatupplevelsen och en kompetensbaserad, fördomsfri och rättvis hantering av din ansökan.\n\nUrval och intervjuer sker löpande och tjänsten kan komma att bli tillsatt innan sista ansökningsdatum. Sök tjänsten med eller utan CV redan idag genom att svara på ett par snabba urvalsfrågor.\n\nKontaktperson\n\nLinus Zackrisson\n\nSenior rekryteringskonsult\nhej@tandfakta.se\n040 150 115\n\nVi värnar om din integritet\nMed hänsyn till GDPR och för att säkerställa en säker och rättvis rekryteringsprocess, tar vi endast emot ansökningar via www.tandfakta.se\n\nObs: Andra ansökningssätt, via mail eller skickat direkt till arbetsgivaren hanteras inte.\n\n\n\nOm Tandfakta - dentalrekrytering\nTandfakta är Sveriges ledande rekryteringsföretag inom tandvård med över 10.000 tandvårdspersonal i sitt eget nätverk. Tandfakta - dentalrekrytering är skapad och drivs av leg. tandvårdspersonal, för tandvården. Vi arbetar alltid i team bestående av leg. tandvårdspersonal och certifierade rekryterare med gedigen erfarenhet inom branschen. Connecta med oss på 👉🏼  (https://tandfakta.se/) för att hitta drömjobbet inom tandvård.\n\n Din profil och uppgifter hanteras i enlighet med GDPR, delas inte med tredje part och är helt osynlig för andra.",
        "conditions" : "Heltid\r\nAnställningstid enligt överenskommelse",
        "text" : "Är du vår nästa tandläkare som vill vara med och utveckla en personlig och framgångsrik klinik i Tyringe?\nOm arbetsgivaren\nHos Närtandvården i Tyringe arbetar en tandläkare, en tandhygienist och tre tandsköterskor. Kliniken består av fem behandlingsrum. Vi har ca 2500 patienter, varav 970 barnpatienter. Här finns OPG samt digital röntgen.\nVi har en god stämning och här finns goda möjligheter till egen utveckling.\n\nOm tjänsten\nDet här är en spännande och utvecklande tjänst för tandläkare. Utöver sedvanliga uppgifter med patientbehandlingar ingår i rollen även administrativa uppgifter såsom remisshantering, journalföring, behandlingsplanering, kostnadsförslag, etc. Vid kompetens och önskan finns det möjlighet för specialistbehandlingar på klinik (rum finns). Du har också möjligheten att nischa dig hos oss om intresse finns.\n\nKvalifikationer\n- Krav: God samarbetsförmåga med såväl patienter som kollegor\n- Krav: Utföra samtliga behandlingar som ingår i legitimation.\n- Krav: Patient i fokus\n- Önskemål: Ett par års erfarenhet är meriterande.\n- Önskemål: Flytande svenska i tal och skrift\n\n\nVarför ska du välja oss?\nVi är ett härligt gäng som har högt i tak och ställer upp för varandra. Vi erbjuder meningsfulla arbetsuppgifter och god möjlighet till egen utveckling. Vi tillämpar frihet under ansvar och har korta beslutsvägar. Dina ansvarsområden utformar vi utifrån dina behov och önskemål.\n\nYtterligare information\nOrt: Tyringe\nTillsvidareanställning\nOmfattning: Heltid, eller enligt överenskommelse\nTillträde: Omgående eller enligt överenskommelse\nFriskvårdsbidrag: 5000 kr/år\nJournalsystem: Frenda\nÖppettider: Mån - Fre\n\n\n\nDin ansökan ✅\nNärtandvården samarbetar i denna rekrytering med Tandfakta - dentalrekrytering för att säkerställa att du får bästa möjliga kandidatupplevelsen och en kompetensbaserad, fördomsfri och rättvis hantering av din ansökan.\n\nUrval och intervjuer sker löpande och tjänsten kan komma att bli tillsatt innan sista ansökningsdatum. Sök tjänsten med eller utan CV redan idag genom att svara på ett par snabba urvalsfrågor.\n\nKontaktperson\n\nLinus Zackrisson\n\nSenior rekryteringskonsult\nhej@tandfakta.se\n040 150 115\n\nVi värnar om din integritet\nMed hänsyn till GDPR och för att säkerställa en säker och rättvis rekryteringsprocess, tar vi endast emot ansökningar via www.tandfakta.se\n\nObs: Andra ansökningssätt, via mail eller skickat direkt till arbetsgivaren hanteras inte.\n\n\n\nOm Tandfakta - dentalrekrytering\nTandfakta är Sveriges ledande rekryteringsföretag inom tandvård med över 10.000 tandvårdspersonal i sitt eget nätverk. Tandfakta - dentalrekrytering är skapad och drivs av leg. tandvårdspersonal, för tandvården. Vi arbetar alltid i team bestående av leg. tandvårdspersonal och certifierade rekryterare med gedigen erfarenhet inom branschen. Connecta med oss på 👉🏼  (https://tandfakta.se/) för att hitta drömjobbet inom tandvård.\n\n Din profil och uppgifter hanteras i enlighet med GDPR, delas inte med tredje part och är helt osynlig för andra."
      },
      "headline" : "Tandläkare sökes till Närtandvården Tyringe i Skåne",
      "driving_license" : null,
      "employer" : {
        "email" : null,
        "phone_number" : null,
        "organization_number" : "5590401096",
        "name" : "Tandfakta JS AB",
        "url" : "https://tandfakta.se",
        "workplace" : "Tandfakta - dentalrekrytering"
      },
      "removed_date" : null,
      "logo_url" : "https://www.arbetsformedlingen.se/rest/arbetsgivare/rest/af/v3/organisation/5590401096/logotyper/logo.png",
      "last_publication_date" : "2022-07-31T23:59:59",
      "number_of_vacancies" : 1,
      "occupation" : {
        "concept_id" : "TdvW_S8R_CFH",
        "label" : "Tandläkare",
        "legacy_ams_taxonomy_id" : "5724"
      },
      "occupation_group" : {
        "concept_id" : "HPxT_fQJ_zwT",
        "label" : "Tandläkare",
        "legacy_ams_taxonomy_id" : "2260"
      },
      "employment_type" : {
        "concept_id" : "PFZr_Syz_cUq",
        "label" : "Vanlig anställning",
        "legacy_ams_taxonomy_id" : "1"
      },
      "webpage_url" : "https://arbetsformedlingen.se/platsbanken/annonser/26280370",
      "driving_license_required" : false,
      "application_contacts" : [ {
        "description" : "Linus Zackrisson",
        "email" : "linus@tandfakta.se",
        "telephone" : "0709220253",
        "name" : null,
        "contact_type" : null
      } ],
      "duration" : {
        "concept_id" : "a7uU_j21_mkL",
        "label" : "Tills vidare",
        "legacy_ams_taxonomy_id" : "1"
      },
      "nice_to_have" : {
        "education_level" : [ ],
        "work_experiences" : [ ],
        "skills" : [ ],
        "education" : [ ],
        "languages" : [ ]
      },
      "application_details" : {
        "via_af" : false,
        "email" : null,
        "other" : null,
        "reference" : null,
        "url" : "https://jobb.tandfakta.se/jobs/1468980-tandlakare-sokes-till-nartandvarden-tyringe-i-skane?promotion=319083-arbetsformedlingen",
        "information" : null
      },
      "source_type" : "VIA_PLATSBANKEN_DXA",
      "application_deadline" : "2022-07-31T23:59:59",
      "external_id" : "46-559040-1096-1468980-11",
      "workplace_address" : {
        "coordinates" : [ null, null ],
        "city" : null,
        "postcode" : null,
        "municipality" : null,
        "region_concept_id" : null,
        "region" : null,
        "country_code" : "199",
        "region_code" : null,
        "municipality_concept_id" : null,
        "country_concept_id" : "i46j_HmG_v64",
        "municipality_code" : null,
        "street_address" : null,
        "country" : "Sverige"
      },
      "id" : "26280370",
      "experience_required" : false,
      "working_hours_type" : {
        "concept_id" : "6YE1_gAC_R2G",
        "label" : "Heltid",
        "legacy_ams_taxonomy_id" : "1"
      },
      "access" : null,
      "timestamp" : 1656656161401,
      "must_have" : {
        "education_level" : [ ],
        "work_experiences" : [ ],
        "skills" : [ ],
        "education" : [ ],
        "languages" : [ ]
      },
      "occupation_field" : {
        "concept_id" : "NYW6_mP6_vwf",
        "label" : "Hälso- och sjukvård",
        "legacy_ams_taxonomy_id" : "8"
      },
      "scope_of_work" : {
        "min" : 100,
        "max" : 100
      },
      "salary_type" : {
        "concept_id" : "oG8G_9cW_nRf",
        "label" : "Fast månads- vecko- eller timlön",
        "legacy_ams_taxonomy_id" : "1"
      },
      "removed" : false,
      "salary_description" : "Lön enligt överenskommelse",
      "access_to_own_car" : false,
      "publication_date" : "2022-07-01T08:16:01"
    },
    "name" : "Tandläkare sökes till Närtandvården Tyringe i Skåne",
    "user" : "hannes"
  },
  "sha1" : "2a368736efe22049c6a29cab6308c9f8a0941fb0",
  "annotations" : [ {
    "preferred-label" : "tandläkare",
    "sentiment" : "MUST_HAVE",
    "type" : "esco-occupation",
    "start-position" : 0,
    "end-position" : 10,
    "concept-id" : "teYK_qML_UE3",
    "matched-string" : "tandläkare",
    "annotation-id" : 0
  }, {
    "preferred-label" : "Tandvård",
    "type" : "keyword",
    "start-position" : 25,
    "end-position" : 35,
    "concept-id" : "ba6n_RTw_PEr",
    "matched-string" : "tandvården",
    "annotation-id" : 11
  }, {
    "preferred-label" : "Skåne län",
    "type" : "region",
    "start-position" : 46,
    "end-position" : 51,
    "concept-id" : "CaRE_1nn_cSU",
    "matched-string" : "Skåne",
    "annotation-id" : 12
  }, {
    "preferred-label" : "tandläkare",
    "sentiment" : "MUST_HAVE",
    "type" : "esco-occupation",
    "start-position" : 68,
    "end-position" : 78,
    "concept-id" : "teYK_qML_UE3",
    "matched-string" : "tandläkare",
    "annotation-id" : 1
  }, {
    "preferred-label" : "Tandvård",
    "type" : "keyword",
    "start-position" : 182,
    "end-position" : 192,
    "concept-id" : "ba6n_RTw_PEr",
    "matched-string" : "tandvården",
    "annotation-id" : 13
  }, {
    "preferred-label" : "tandläkare",
    "sentiment" : "MUST_HAVE",
    "type" : "esco-occupation",
    "start-position" : 214,
    "end-position" : 224,
    "concept-id" : "teYK_qML_UE3",
    "matched-string" : "tandläkare",
    "annotation-id" : 2
  }, {
    "preferred-label" : "Tandhygienist",
    "sentiment" : "MUST_HAVE",
    "type" : "occupation-name",
    "start-position" : 229,
    "end-position" : 242,
    "concept-id" : "TPRY_Wze_q6x",
    "matched-string" : "tandhygienist",
    "annotation-id" : 3
  }, {
    "preferred-label" : "Tandsköterskor",
    "sentiment" : "MUST_HAVE",
    "type" : "forecast-occupation",
    "start-position" : 251,
    "end-position" : 265,
    "concept-id" : "cRLD_LWf_a8p",
    "matched-string" : "tandsköterskor",
    "annotation-id" : 4
  }, {
    "preferred-label" : "tandläkare",
    "sentiment" : "MUST_HAVE",
    "type" : "esco-occupation",
    "start-position" : 533,
    "end-position" : 543,
    "concept-id" : "teYK_qML_UE3",
    "matched-string" : "tandläkare",
    "annotation-id" : 5
  }, {
    "preferred-label" : "föra journal",
    "type" : "esco-skill",
    "start-position" : 665,
    "end-position" : 678,
    "concept-id" : "wc5w_aw2_KBh",
    "matched-string" : "journalföring",
    "annotation-id" : 14
  }, {
    "preferred-label" : "utforma en behandlingsplan",
    "type" : "esco-skill",
    "start-position" : 680,
    "end-position" : 700,
    "concept-id" : "b5Ux_1Dq_3MQ",
    "matched-string" : "behandlingsplanering",
    "annotation-id" : 15
  }, {
    "preferred-label" : "samarbeta med kolleger",
    "type" : "esco-skill",
    "start-position" : 915,
    "end-position" : 931,
    "concept-id" : "X15R_797_q62",
    "matched-string" : "samarbetsförmåga",
    "annotation-id" : 16
  }, {
    "preferred-label" : "samarbeta med kolleger",
    "type" : "esco-skill",
    "start-position" : 956,
    "end-position" : 964,
    "concept-id" : "X15R_797_q62",
    "matched-string" : "kollegor",
    "annotation-id" : 17
  }, {
    "preferred-label" : "Svenska",
    "sentiment" : "MUST_HAVE",
    "type" : "language",
    "start-position" : 1124,
    "end-position" : 1131,
    "concept-id" : "zSLA_vw2_FXN",
    "matched-string" : "svenska",
    "annotation-id" : 6
  }, {
    "preferred-label" : "Tillsvidareanställning (inkl. eventuell provanställning)",
    "type" : "employment-type",
    "start-position" : 1493,
    "end-position" : 1515,
    "concept-id" : "kpPX_CNN_gDU",
    "matched-string" : "Tillsvidareanställning",
    "annotation-id" : 18
  }, {
    "preferred-label" : "Heltid",
    "type" : "worktime-extent",
    "start-position" : 1528,
    "end-position" : 1534,
    "concept-id" : "6YE1_gAC_R2G",
    "matched-string" : "Heltid",
    "annotation-id" : 19
  }, {
    "preferred-label" : "Tandvård",
    "type" : "keyword",
    "start-position" : 1707,
    "end-position" : 1717,
    "concept-id" : "ba6n_RTw_PEr",
    "matched-string" : "tandvården",
    "annotation-id" : 20
  }, {
    "preferred-label" : "rekryteringskonsult",
    "sentiment" : "MUST_HAVE",
    "type" : "esco-occupation",
    "start-position" : 2157,
    "end-position" : 2176,
    "concept-id" : "tGyt_via_HNb",
    "matched-string" : "rekryteringskonsult",
    "annotation-id" : 7
  }, {
    "preferred-label" : "Tandvård",
    "sentiment" : "MUST_HAVE",
    "type" : "keyword",
    "start-position" : 2557,
    "end-position" : 2565,
    "concept-id" : "ba6n_RTw_PEr",
    "matched-string" : "tandvård",
    "annotation-id" : 8
  }, {
    "preferred-label" : "Tandvård",
    "type" : "keyword",
    "start-position" : 2582,
    "end-position" : 2590,
    "concept-id" : "ba6n_RTw_PEr",
    "matched-string" : "tandvård",
    "annotation-id" : 21
  }, {
    "preferred-label" : "Tandvård",
    "type" : "keyword",
    "start-position" : 2679,
    "end-position" : 2687,
    "concept-id" : "ba6n_RTw_PEr",
    "matched-string" : "tandvård",
    "annotation-id" : 22
  }, {
    "preferred-label" : "Tandvård",
    "type" : "keyword",
    "start-position" : 2702,
    "end-position" : 2712,
    "concept-id" : "ba6n_RTw_PEr",
    "matched-string" : "tandvården",
    "annotation-id" : 23
  }, {
    "preferred-label" : "Tandvård",
    "type" : "keyword",
    "start-position" : 2757,
    "end-position" : 2765,
    "concept-id" : "ba6n_RTw_PEr",
    "matched-string" : "tandvård",
    "annotation-id" : 24
  }, {
    "preferred-label" : "Rekryterare/Rekryteringskonsult",
    "sentiment" : "MUST_HAVE",
    "type" : "occupation-name",
    "start-position" : 2792,
    "end-position" : 2803,
    "concept-id" : "QaQC_ozP_Bme",
    "matched-string" : "rekryterare",
    "annotation-id" : 9
  }, {
    "preferred-label" : "Tandvård",
    "sentiment" : "MUST_HAVE",
    "type" : "keyword",
    "start-position" : 2923,
    "end-position" : 2931,
    "concept-id" : "ba6n_RTw_PEr",
    "matched-string" : "tandvård",
    "annotation-id" : 10
  } ],
  "text" : "Tandläkare sökes till Närtandvården Tyringe i Skåne\nÄr du vår nästa tandläkare som vill vara med och utveckla en personlig och framgångsrik klinik i Tyringe?\nOm arbetsgivaren\nHos Närtandvården i Tyringe arbetar en tandläkare, en tandhygienist och tre tandsköterskor. Kliniken består av fem behandlingsrum. Vi har ca 2500 patienter, varav 970 barnpatienter. Här finns OPG samt digital röntgen.\nVi har en god stämning och här finns goda möjligheter till egen utveckling.\n\nOm tjänsten\nDet här är en spännande och utvecklande tjänst för tandläkare. Utöver sedvanliga uppgifter med patientbehandlingar ingår i rollen även administrativa uppgifter såsom remisshantering, journalföring, behandlingsplanering, kostnadsförslag, etc. Vid kompetens och önskan finns det möjlighet för specialistbehandlingar på klinik (rum finns). Du har också möjligheten att nischa dig hos oss om intresse finns.\n\nKvalifikationer\n- Krav: God samarbetsförmåga med såväl patienter som kollegor\n- Krav: Utföra samtliga behandlingar som ingår i legitimation.\n- Krav: Patient i fokus\n- Önskemål: Ett par års erfarenhet är meriterande.\n- Önskemål: Flytande svenska i tal och skrift\n\n\nVarför ska du välja oss?\nVi är ett härligt gäng som har högt i tak och ställer upp för varandra. Vi erbjuder meningsfulla arbetsuppgifter och god möjlighet till egen utveckling. Vi tillämpar frihet under ansvar och har korta beslutsvägar. Dina ansvarsområden utformar vi utifrån dina behov och önskemål.\n\nYtterligare information\nOrt: Tyringe\nTillsvidareanställning\nOmfattning: Heltid, eller enligt överenskommelse\nTillträde: Omgående eller enligt överenskommelse\nFriskvårdsbidrag: 5000 kr/år\nJournalsystem: Frenda\nÖppettider: Mån - Fre\n\n\n\nDin ansökan ✅\nNärtandvården samarbetar i denna rekrytering med Tandfakta - dentalrekrytering för att säkerställa att du får bästa möjliga kandidatupplevelsen och en kompetensbaserad, fördomsfri och rättvis hantering av din ansökan.\n\nUrval och intervjuer sker löpande och tjänsten kan komma att bli tillsatt innan sista ansökningsdatum. Sök tjänsten med eller utan CV redan idag genom att svara på ett par snabba urvalsfrågor.\n\nKontaktperson\n\nLinus Zackrisson\n\nSenior rekryteringskonsult\nhej@tandfakta.se\n040 150 115\n\nVi värnar om din integritet\nMed hänsyn till GDPR och för att säkerställa en säker och rättvis rekryteringsprocess, tar vi endast emot ansökningar via www.tandfakta.se\n\nObs: Andra ansökningssätt, via mail eller skickat direkt till arbetsgivaren hanteras inte.\n\n\n\nOm Tandfakta - dentalrekrytering\nTandfakta är Sveriges ledande rekryteringsföretag inom tandvård med över 10.000 tandvårdspersonal i sitt eget nätverk. Tandfakta - dentalrekrytering är skapad och drivs av leg. tandvårdspersonal, för tandvården. Vi arbetar alltid i team bestående av leg. tandvårdspersonal och certifierade rekryterare med gedigen erfarenhet inom branschen. Connecta med oss på 👉🏼  (https://tandfakta.se/) för att hitta drömjobbet inom tandvård.\n\n Din profil och uppgifter hanteras i enlighet med GDPR, delas inte med tredje part och är helt osynlig för andra."
}