{
  "meta" : {
    "jobad" : {
      "description" : {
        "requirements" : null,
        "needs" : null,
        "company_information" : null,
        "text_formatted" : "<p>Vi utökar vårat team!</p><p>Café Charm söker en kompetent konditor till vårat bageri med start så snart som möjligt.</p><p>Vi har ett brett sortiment av klassiska bakverk som vi levererar till företag och våra egna butiker.</p><p>Vi söker dig som är konditor och har konditorutbildning eller annan utbildning/arbetserfarenhet som arbetsgivaren bedömer likvärdig.</p><p>Vi ser att du är glad, kreativ och arbetsam och att du vill vara med att delta i Café charms fortsatta utveckling.</p><p>Arbetstider: 03.30-11.30</p><p>Helgjobb förekommer</p><p>Provanställning tillämpas, Rekrytering sker löpande</p><p>Maila ditt cv &amp; övriga frågor</p>",
        "conditions" : null,
        "text" : "Vi utökar vårat team!\nCafé Charm söker en kompetent konditor till vårat bageri med start så snart som möjligt.\nVi har ett brett sortiment av klassiska bakverk som vi levererar till företag och våra egna butiker.\nVi söker dig som är konditor och har konditorutbildning eller annan utbildning/arbetserfarenhet som arbetsgivaren bedömer likvärdig.\nVi ser att du är glad, kreativ och arbetsam och att du vill vara med att delta i Café charms fortsatta utveckling.\nArbetstider: 03.30-11.30\nHelgjobb förekommer\nProvanställning tillämpas, Rekrytering sker löpande\nMaila ditt cv & övriga frågor"
      },
      "headline" : "Konditor sökes",
      "driving_license" : [ {
        "concept_id" : "VTK8_WRx_GcM",
        "label" : "B",
        "legacy_ams_taxonomy_id" : "3"
      } ],
      "employer" : {
        "email" : null,
        "phone_number" : null,
        "organization_number" : "5564999869",
        "name" : "Café Charm AB",
        "url" : null,
        "workplace" : "Bageriet"
      },
      "removed_date" : null,
      "logo_url" : "https://www.arbetsformedlingen.se/rest/arbetsgivare/rest/af/v3/arbetsplatser/87106892/logotyper/logo.png",
      "last_publication_date" : "2022-08-07T23:59:59",
      "number_of_vacancies" : 1,
      "occupation" : {
        "concept_id" : "XugJ_6hw_wVV",
        "label" : "Bagare/Konditor",
        "legacy_ams_taxonomy_id" : "5504"
      },
      "occupation_group" : {
        "concept_id" : "5qT8_z9d_8rw",
        "label" : "Bagare och konditorer",
        "legacy_ams_taxonomy_id" : "7612"
      },
      "employment_type" : {
        "concept_id" : "PFZr_Syz_cUq",
        "label" : "Vanlig anställning",
        "legacy_ams_taxonomy_id" : "1"
      },
      "webpage_url" : "https://arbetsformedlingen.se/platsbanken/annonser/26309526",
      "driving_license_required" : true,
      "application_contacts" : [ ],
      "duration" : {
        "concept_id" : "a7uU_j21_mkL",
        "label" : "Tills vidare",
        "legacy_ams_taxonomy_id" : "1"
      },
      "nice_to_have" : {
        "education_level" : [ ],
        "work_experiences" : [ ],
        "skills" : [ ],
        "education" : [ ],
        "languages" : [ ]
      },
      "application_details" : {
        "via_af" : false,
        "email" : "mattias@cafecharm.se",
        "other" : null,
        "reference" : "Konditor",
        "url" : null,
        "information" : null
      },
      "source_type" : "VIA_ANNONSERA",
      "application_deadline" : "2022-08-07T23:59:59",
      "external_id" : null,
      "workplace_address" : {
        "coordinates" : [ 17.347660670071736, 62.42555211827893 ],
        "city" : "Sundsvall",
        "postcode" : "85650",
        "municipality" : "Sundsvall",
        "region_concept_id" : "NvUF_SP1_1zo",
        "region" : "Västernorrlands län",
        "country_code" : "199",
        "region_code" : "22",
        "municipality_concept_id" : "dJbx_FWY_tK6",
        "country_concept_id" : "i46j_HmG_v64",
        "municipality_code" : "2281",
        "street_address" : "Norra Vägen 36",
        "country" : "Sverige"
      },
      "id" : "26309526",
      "experience_required" : true,
      "working_hours_type" : {
        "concept_id" : "947z_JGS_Uk2",
        "label" : "Deltid",
        "legacy_ams_taxonomy_id" : "2"
      },
      "access" : null,
      "timestamp" : 1657277540322,
      "must_have" : {
        "education_level" : [ ],
        "work_experiences" : [ {
          "concept_id" : "XugJ_6hw_wVV",
          "weight" : 10,
          "label" : "Bagare/Konditor",
          "legacy_ams_taxonomy_id" : "5504"
        } ],
        "skills" : [ {
          "concept_id" : "TPX3_gmd_fau",
          "weight" : 10,
          "label" : "Bröd, produktkunskap/Konditorivaror, produktkunskap",
          "legacy_ams_taxonomy_id" : "602930"
        } ],
        "education" : [ ],
        "languages" : [ ]
      },
      "occupation_field" : {
        "concept_id" : "PaxQ_o1G_wWH",
        "label" : "Hantverk",
        "legacy_ams_taxonomy_id" : "6"
      },
      "scope_of_work" : {
        "min" : 0,
        "max" : 100
      },
      "salary_type" : {
        "concept_id" : "oG8G_9cW_nRf",
        "label" : "Fast månads- vecko- eller timlön",
        "legacy_ams_taxonomy_id" : "1"
      },
      "removed" : false,
      "salary_description" : null,
      "access_to_own_car" : false,
      "publication_date" : "2022-07-08T12:52:20"
    },
    "name" : "Konditor sökes",
    "user" : "kristof.fischer"
  },
  "sha1" : "766468843e86aeb2620aeaec0af06e1b3d9f2412",
  "annotations" : [ {
    "preferred-label" : "Bagare/Konditor",
    "sentiment" : "MUST_HAVE",
    "type" : "occupation-name",
    "start-position" : 0,
    "end-position" : 8,
    "concept-id" : "XugJ_6hw_wVV",
    "matched-string" : "konditor",
    "annotation-id" : 0
  }, {
    "preferred-label" : "Bagare/Konditor",
    "sentiment" : "MUST_HAVE",
    "type" : "occupation-name",
    "start-position" : 67,
    "end-position" : 75,
    "concept-id" : "XugJ_6hw_wVV",
    "matched-string" : "konditor",
    "annotation-id" : 2
  }, {
    "preferred-label" : "Bagare/Konditor",
    "sentiment" : "MUST_HAVE",
    "type" : "occupation-name",
    "start-position" : 247,
    "end-position" : 255,
    "concept-id" : "XugJ_6hw_wVV",
    "matched-string" : "konditor",
    "annotation-id" : 3
  }, {
    "preferred-label" : "Bageri och konditori",
    "sentiment" : "MUST_HAVE",
    "type" : "sun-education-field-4",
    "start-position" : 264,
    "end-position" : 282,
    "concept-id" : "5drh_m2c_zQq",
    "matched-string" : "konditorutbildning",
    "annotation-id" : 5
  } ],
  "text" : "Konditor sökes\nVi utökar vårat team!\nCafé Charm söker en kompetent konditor till vårat bageri med start så snart som möjligt.\nVi har ett brett sortiment av klassiska bakverk som vi levererar till företag och våra egna butiker.\nVi söker dig som är konditor och har konditorutbildning eller annan utbildning/arbetserfarenhet som arbetsgivaren bedömer likvärdig.\nVi ser att du är glad, kreativ och arbetsam och att du vill vara med att delta i Café charms fortsatta utveckling.\nArbetstider: 03.30-11.30\nHelgjobb förekommer\nProvanställning tillämpas, Rekrytering sker löpande\nMaila ditt cv & övriga frågor"
}