{
  "meta" : {
    "jobad" : {
      "description" : {
        "requirements" : null,
        "needs" : null,
        "company_information" : null,
        "text_formatted" : "Just nu söker vi på Jobandtalent flertalet personer som vill ha ett jobb med goda utvecklingsmöjligheter till rollen som maskinoperatör/processoperatör hos vår kund Diab i Laholm. Vi söker framför allt dig som är lösningsfokuserad och har ett stort driv och mycket framåtanda. Välkommen med din ansökan till oss på Jobandtalent!\n\n\n\nOm jobbet som maskinoperatör\n\nSom processoperatör får du ett omväxlande arbete med systemövervakning, olika fysiska arbetsmoment, kvalitetstester, truckkörning och samt arbeta med att driva och utveckla förbättringsarbeten. I rollen som maskinoperatör ansvarar du för att kontrollera tillflöden av material i maskinerna samt ansvara för den dagliga driften på avdelningen. Du kommer att ingå i ett skiftlag där samarbetet är viktigt. Arbetstiden är skiftgång med 2-skift alt 5-skift.\n\n\n\nÄr du rätt för rollen som maskinoperatör?\n\nVi på Jobandtalent söker dig som har B-körkort och goda kunskaper i svenska i tal och skrift. Vidare har du erfarenhet av arbete som maskinoperatör och av industriproduktion.\n\nFör att lyckas i uppdraget är det viktigt att du har ett stort driv och att du fokuserar på att hitta lösningar. Det är också viktigt att du strävar efter att göra det lilla extra och att du har ett metodiskt tillvägagångssätt.\n\nVi tror att Du har några års erfarenhet av arbete inom process-/tillverkningsindustrin och har nyfikenheten och intresset av den samma, med goda referenser och hög arbetsmoral!\n\nVi tror att du som söker har:\n Goda IT-kunskaper\n Maskinkunskap\n Vana att hantera processteknik är meriterande\n Problemlösning, felsökning\n Truckkort för ledstaplare och motvikt är meriterande\n\nDet är ett krav att du behärskar svenska flytande i tal och skrift.\n\nFör anställning krävs uppvisande av utdrag ur belastningsregistret.\n\n\n\nIntresserad?\n\nFör att söka tjänsten skickar du in CV och personligt brev via länken. Vid frågor är du välkommen att kontakta rekryteringsansvarig Sandra via e-post: sandra.lindulf@jobandtalent.com eller telefonnummer: 0733-898799.\n\nVi arbetar med löpande urval och kan komma att tillsätta uppdraget så fort vi hittat rätt person. Skicka därför in din ansökan så snart som möjligt!\n\n\n\nVi ser fram emot din ansökan!\n\nÖvrigt\n\n\n\nPlaceringsort: Laholm\n\n\n\nTyp av anställning: allmän visstidsanställning\n\nTillsättning: så snart som möjligt\n\n\n\nLön: enligt kollektivavtal\n\nOm Jobandtalent\n\n\n\nSom konsult hos Jobandtalent arbetar du hos välkända företag i olika branscher, med fast lön och trygg anställning.",
        "conditions" : "Heltid\r\nVisstidsanställning",
        "text" : "Just nu söker vi på Jobandtalent flertalet personer som vill ha ett jobb med goda utvecklingsmöjligheter till rollen som maskinoperatör/processoperatör hos vår kund Diab i Laholm. Vi söker framför allt dig som är lösningsfokuserad och har ett stort driv och mycket framåtanda. Välkommen med din ansökan till oss på Jobandtalent!\n\n\n\nOm jobbet som maskinoperatör\n\nSom processoperatör får du ett omväxlande arbete med systemövervakning, olika fysiska arbetsmoment, kvalitetstester, truckkörning och samt arbeta med att driva och utveckla förbättringsarbeten. I rollen som maskinoperatör ansvarar du för att kontrollera tillflöden av material i maskinerna samt ansvara för den dagliga driften på avdelningen. Du kommer att ingå i ett skiftlag där samarbetet är viktigt. Arbetstiden är skiftgång med 2-skift alt 5-skift.\n\n\n\nÄr du rätt för rollen som maskinoperatör?\n\nVi på Jobandtalent söker dig som har B-körkort och goda kunskaper i svenska i tal och skrift. Vidare har du erfarenhet av arbete som maskinoperatör och av industriproduktion.\n\nFör att lyckas i uppdraget är det viktigt att du har ett stort driv och att du fokuserar på att hitta lösningar. Det är också viktigt att du strävar efter att göra det lilla extra och att du har ett metodiskt tillvägagångssätt.\n\nVi tror att Du har några års erfarenhet av arbete inom process-/tillverkningsindustrin och har nyfikenheten och intresset av den samma, med goda referenser och hög arbetsmoral!\n\nVi tror att du som söker har:\n Goda IT-kunskaper\n Maskinkunskap\n Vana att hantera processteknik är meriterande\n Problemlösning, felsökning\n Truckkort för ledstaplare och motvikt är meriterande\n\nDet är ett krav att du behärskar svenska flytande i tal och skrift.\n\nFör anställning krävs uppvisande av utdrag ur belastningsregistret.\n\n\n\nIntresserad?\n\nFör att söka tjänsten skickar du in CV och personligt brev via länken. Vid frågor är du välkommen att kontakta rekryteringsansvarig Sandra via e-post: sandra.lindulf@jobandtalent.com eller telefonnummer: 0733-898799.\n\nVi arbetar med löpande urval och kan komma att tillsätta uppdraget så fort vi hittat rätt person. Skicka därför in din ansökan så snart som möjligt!\n\n\n\nVi ser fram emot din ansökan!\n\nÖvrigt\n\n\n\nPlaceringsort: Laholm\n\n\n\nTyp av anställning: allmän visstidsanställning\n\nTillsättning: så snart som möjligt\n\n\n\nLön: enligt kollektivavtal\n\nOm Jobandtalent\n\n\n\nSom konsult hos Jobandtalent arbetar du hos välkända företag i olika branscher, med fast lön och trygg anställning."
      },
      "headline" : "Flertalet maskinoperatörer till Diab i Laholm",
      "driving_license" : null,
      "employer" : {
        "email" : null,
        "phone_number" : null,
        "organization_number" : "5565067591",
        "name" : "Jobandtalent People Sweden AB",
        "url" : "https://www.jobandtalent.se",
        "workplace" : "Jobandtalent"
      },
      "removed_date" : null,
      "logo_url" : "https://www.arbetsformedlingen.se/rest/arbetsgivare/rest/af/v3/organisation/5565067591/logotyper/logo.png",
      "last_publication_date" : "2022-09-04T23:59:59",
      "number_of_vacancies" : 1,
      "occupation" : {
        "concept_id" : "8Kvc_Fxt_Jei",
        "label" : "Plastmaskinoperatör",
        "legacy_ams_taxonomy_id" : "978"
      },
      "occupation_group" : {
        "concept_id" : "yPQ4_EaN_Dtj",
        "label" : "Maskinoperatörer, plastindustri",
        "legacy_ams_taxonomy_id" : "8142"
      },
      "employment_type" : {
        "concept_id" : "PFZr_Syz_cUq",
        "label" : "Vanlig anställning",
        "legacy_ams_taxonomy_id" : "1"
      },
      "webpage_url" : "https://arbetsformedlingen.se/platsbanken/annonser/26372862",
      "driving_license_required" : false,
      "application_contacts" : [ {
        "description" : "Sandra Lindulf",
        "email" : null,
        "telephone" : null,
        "name" : null,
        "contact_type" : null
      } ],
      "duration" : {
        "concept_id" : "a7uU_j21_mkL",
        "label" : "Tills vidare",
        "legacy_ams_taxonomy_id" : "1"
      },
      "nice_to_have" : {
        "education_level" : [ ],
        "work_experiences" : [ ],
        "skills" : [ ],
        "education" : [ ],
        "languages" : [ ]
      },
      "application_details" : {
        "via_af" : false,
        "email" : null,
        "other" : null,
        "reference" : null,
        "url" : "https://jobandtalent.teamtailor.com/jobs/1822766-flertalet-maskinoperatorer-till-diab-i-laholm?promotion=422898-arbetsformedlingen",
        "information" : null
      },
      "source_type" : "VIA_PLATSBANKEN_DXA",
      "application_deadline" : "2022-09-04T23:59:59",
      "external_id" : "46-556506-7591-1822766-7",
      "workplace_address" : {
        "coordinates" : [ 13.045605, 56.505756 ],
        "city" : null,
        "postcode" : null,
        "municipality" : "Laholm",
        "region_concept_id" : "wjee_qH2_yb6",
        "region" : "Hallands län",
        "country_code" : "199",
        "region_code" : "13",
        "municipality_concept_id" : "c1iL_rqh_Zja",
        "country_concept_id" : "i46j_HmG_v64",
        "municipality_code" : "1381",
        "street_address" : null,
        "country" : "Sverige"
      },
      "id" : "26372862",
      "experience_required" : false,
      "working_hours_type" : {
        "concept_id" : "6YE1_gAC_R2G",
        "label" : "Heltid",
        "legacy_ams_taxonomy_id" : "1"
      },
      "access" : null,
      "timestamp" : 1659459426697,
      "must_have" : {
        "education_level" : [ ],
        "work_experiences" : [ ],
        "skills" : [ ],
        "education" : [ ],
        "languages" : [ ]
      },
      "occupation_field" : {
        "concept_id" : "wTEr_CBC_bqh",
        "label" : "Industriell tillverkning",
        "legacy_ams_taxonomy_id" : "9"
      },
      "scope_of_work" : {
        "min" : 100,
        "max" : 100
      },
      "salary_type" : {
        "concept_id" : "oG8G_9cW_nRf",
        "label" : "Fast månads- vecko- eller timlön",
        "legacy_ams_taxonomy_id" : "1"
      },
      "removed" : false,
      "salary_description" : "Lön enligt överenskommelse",
      "access_to_own_car" : false,
      "publication_date" : "2022-08-02T18:57:06"
    },
    "name" : "Flertalet maskinoperatörer till Diab i Laholm",
    "user" : "hannes"
  },
  "sha1" : "89fbd5b29f4bdbe3603e9fff502254898a7f98d2",
  "annotations" : [ {
    "preferred-label" : "Övriga process- och maskinoperatörer",
    "type" : "ssyk-level-4",
    "start-position" : 10,
    "end-position" : 26,
    "concept-id" : "hxm6_xkr_dHm",
    "matched-string" : "maskinoperatörer",
    "annotation-id" : 8
  }, {
    "preferred-label" : "Laholm",
    "type" : "municipality",
    "start-position" : 39,
    "end-position" : 45,
    "concept-id" : "c1iL_rqh_Zja",
    "matched-string" : "Laholm",
    "annotation-id" : 7
  }, {
    "preferred-label" : "Övriga process- och maskinoperatörer",
    "type" : "ssyk-level-4",
    "start-position" : 167,
    "end-position" : 197,
    "concept-id" : "hxm6_xkr_dHm",
    "matched-string" : "maskinoperatör/processoperatör",
    "annotation-id" : 9
  }, {
    "preferred-label" : "Laholm",
    "type" : "municipality",
    "start-position" : 218,
    "end-position" : 224,
    "concept-id" : "c1iL_rqh_Zja",
    "matched-string" : "Laholm",
    "annotation-id" : 14
  }, {
    "preferred-label" : "Övriga process- och maskinoperatörer",
    "type" : "ssyk-level-4",
    "start-position" : 392,
    "end-position" : 406,
    "concept-id" : "hxm6_xkr_dHm",
    "matched-string" : "maskinoperatör",
    "annotation-id" : 12
  }, {
    "preferred-label" : "Övriga process- och maskinoperatörer",
    "type" : "ssyk-level-4",
    "start-position" : 412,
    "end-position" : 427,
    "concept-id" : "hxm6_xkr_dHm",
    "matched-string" : "processoperatör",
    "annotation-id" : 15
  }, {
    "preferred-label" : "Truck",
    "type" : "keyword",
    "start-position" : 525,
    "end-position" : 537,
    "concept-id" : "Wz82_4Xv_ZFr",
    "matched-string" : "truckkörning",
    "annotation-id" : 16
  }, {
    "preferred-label" : "Övriga process- och maskinoperatörer",
    "type" : "ssyk-level-4",
    "start-position" : 615,
    "end-position" : 629,
    "concept-id" : "hxm6_xkr_dHm",
    "matched-string" : "maskinoperatör",
    "annotation-id" : 10
  }, {
    "preferred-label" : "Övriga process- och maskinoperatörer",
    "type" : "ssyk-level-4",
    "start-position" : 891,
    "end-position" : 905,
    "concept-id" : "hxm6_xkr_dHm",
    "matched-string" : "maskinoperatör",
    "annotation-id" : 13
  }, {
    "preferred-label" : "B",
    "type" : "driving-licence",
    "start-position" : 945,
    "end-position" : 954,
    "concept-id" : "VTK8_WRx_GcM",
    "matched-string" : "B-körkort",
    "annotation-id" : 17
  }, {
    "preferred-label" : "Svenska",
    "sentiment" : "MUST_HAVE",
    "type" : "language",
    "start-position" : 976,
    "end-position" : 983,
    "concept-id" : "zSLA_vw2_FXN",
    "matched-string" : "svenska",
    "annotation-id" : 0
  }, {
    "preferred-label" : "Övriga process- och maskinoperatörer",
    "type" : "ssyk-level-4",
    "start-position" : 1041,
    "end-position" : 1055,
    "concept-id" : "hxm6_xkr_dHm",
    "matched-string" : "maskinoperatör",
    "annotation-id" : 11
  }, {
    "preferred-label" : "Data/IT",
    "sentiment" : "MUST_HAVE",
    "type" : "occupation-field",
    "start-position" : 1527,
    "end-position" : 1529,
    "concept-id" : "apaJ_2ja_LuF",
    "matched-string" : "it",
    "annotation-id" : 1
  }, {
    "preferred-label" : "Processteknik",
    "sentiment" : "MUST_HAVE",
    "type" : "skill",
    "start-position" : 1573,
    "end-position" : 1586,
    "concept-id" : "Jgmc_3hD_JEt",
    "matched-string" : "processteknik",
    "annotation-id" : 2
  }, {
    "preferred-label" : "göra felsökning",
    "type" : "esco-skill",
    "start-position" : 1619,
    "end-position" : 1629,
    "concept-id" : "HqC8_fVY_ACM",
    "matched-string" : "felsökning",
    "annotation-id" : 18
  }, {
    "preferred-label" : "Truck",
    "type" : "keyword",
    "start-position" : 1631,
    "end-position" : 1640,
    "concept-id" : "Wz82_4Xv_ZFr",
    "matched-string" : "Truckkort",
    "annotation-id" : 19
  }, {
    "preferred-label" : "Svenska",
    "sentiment" : "MUST_HAVE",
    "type" : "language",
    "start-position" : 1718,
    "end-position" : 1725,
    "concept-id" : "zSLA_vw2_FXN",
    "matched-string" : "svenska",
    "annotation-id" : 3
  }, {
    "preferred-label" : "Laholm",
    "type" : "municipality",
    "start-position" : 2265,
    "end-position" : 2271,
    "concept-id" : "c1iL_rqh_Zja",
    "matched-string" : "Laholm",
    "annotation-id" : 20
  }, {
    "preferred-label" : "Allmän visstidsanställning",
    "sentiment" : "MUST_HAVE",
    "type" : "keyword",
    "start-position" : 2295,
    "end-position" : 2321,
    "concept-id" : "hxfz_ayC_9Vd",
    "matched-string" : "allmän visstidsanställning",
    "annotation-id" : 5
  }, {
    "preferred-label" : "Kollektivavtal",
    "sentiment" : "MUST_HAVE",
    "type" : "skill",
    "start-position" : 2373,
    "end-position" : 2387,
    "concept-id" : "z7wE_9xb_3jX",
    "matched-string" : "kollektivavtal",
    "annotation-id" : 6
  } ],
  "text" : "Flertalet maskinoperatörer till Diab i Laholm\nJust nu söker vi på Jobandtalent flertalet personer som vill ha ett jobb med goda utvecklingsmöjligheter till rollen som maskinoperatör/processoperatör hos vår kund Diab i Laholm. Vi söker framför allt dig som är lösningsfokuserad och har ett stort driv och mycket framåtanda. Välkommen med din ansökan till oss på Jobandtalent!\n\n\n\nOm jobbet som maskinoperatör\n\nSom processoperatör får du ett omväxlande arbete med systemövervakning, olika fysiska arbetsmoment, kvalitetstester, truckkörning och samt arbeta med att driva och utveckla förbättringsarbeten. I rollen som maskinoperatör ansvarar du för att kontrollera tillflöden av material i maskinerna samt ansvara för den dagliga driften på avdelningen. Du kommer att ingå i ett skiftlag där samarbetet är viktigt. Arbetstiden är skiftgång med 2-skift alt 5-skift.\n\n\n\nÄr du rätt för rollen som maskinoperatör?\n\nVi på Jobandtalent söker dig som har B-körkort och goda kunskaper i svenska i tal och skrift. Vidare har du erfarenhet av arbete som maskinoperatör och av industriproduktion.\n\nFör att lyckas i uppdraget är det viktigt att du har ett stort driv och att du fokuserar på att hitta lösningar. Det är också viktigt att du strävar efter att göra det lilla extra och att du har ett metodiskt tillvägagångssätt.\n\nVi tror att Du har några års erfarenhet av arbete inom process-/tillverkningsindustrin och har nyfikenheten och intresset av den samma, med goda referenser och hög arbetsmoral!\n\nVi tror att du som söker har:\n Goda IT-kunskaper\n Maskinkunskap\n Vana att hantera processteknik är meriterande\n Problemlösning, felsökning\n Truckkort för ledstaplare och motvikt är meriterande\n\nDet är ett krav att du behärskar svenska flytande i tal och skrift.\n\nFör anställning krävs uppvisande av utdrag ur belastningsregistret.\n\n\n\nIntresserad?\n\nFör att söka tjänsten skickar du in CV och personligt brev via länken. Vid frågor är du välkommen att kontakta rekryteringsansvarig Sandra via e-post: sandra.lindulf@jobandtalent.com eller telefonnummer: 0733-898799.\n\nVi arbetar med löpande urval och kan komma att tillsätta uppdraget så fort vi hittat rätt person. Skicka därför in din ansökan så snart som möjligt!\n\n\n\nVi ser fram emot din ansökan!\n\nÖvrigt\n\n\n\nPlaceringsort: Laholm\n\n\n\nTyp av anställning: allmän visstidsanställning\n\nTillsättning: så snart som möjligt\n\n\n\nLön: enligt kollektivavtal\n\nOm Jobandtalent\n\n\n\nSom konsult hos Jobandtalent arbetar du hos välkända företag i olika branscher, med fast lön och trygg anställning."
}