{
  "meta" : {
    "jobad" : {
      "description" : {
        "requirements" : null,
        "needs" : null,
        "company_information" : null,
        "text_formatted" : "<p>hej vi söker en pizzabagare som är duktig trevligt mot kunder och arbetskompisar  kontakt nummer   0704138333  </p>",
        "conditions" : null,
        "text" : "hej vi söker en pizzabagare som är duktig trevligt mot kunder och arbetskompisar  kontakt nummer   0704138333"
      },
      "headline" : "italian slice söker köksbiträde",
      "driving_license" : null,
      "employer" : {
        "email" : null,
        "phone_number" : null,
        "organization_number" : "5591814495",
        "name" : "ICV Restaurang AB",
        "url" : null,
        "workplace" : "ICV Restaurang AB"
      },
      "removed_date" : null,
      "logo_url" : null,
      "last_publication_date" : "2022-08-25T00:00:00",
      "number_of_vacancies" : 1,
      "occupation" : {
        "concept_id" : "9YaE_Syg_5ZB",
        "label" : "Pizzabagare",
        "legacy_ams_taxonomy_id" : "5505"
      },
      "occupation_group" : {
        "concept_id" : "a8gg_ktU_w8V",
        "label" : "Pizzabagare m.fl.",
        "legacy_ams_taxonomy_id" : "9411"
      },
      "employment_type" : {
        "concept_id" : "PFZr_Syz_cUq",
        "label" : "Vanlig anställning",
        "legacy_ams_taxonomy_id" : "1"
      },
      "webpage_url" : "https://arbetsformedlingen.se/platsbanken/annonser/26356040",
      "driving_license_required" : false,
      "application_contacts" : [ ],
      "duration" : {
        "concept_id" : "a7uU_j21_mkL",
        "label" : "Tills vidare",
        "legacy_ams_taxonomy_id" : "1"
      },
      "nice_to_have" : {
        "education_level" : [ ],
        "work_experiences" : [ {
          "concept_id" : "9YaE_Syg_5ZB",
          "weight" : 5,
          "label" : "Pizzabagare",
          "legacy_ams_taxonomy_id" : "5505"
        } ],
        "skills" : [ ],
        "education" : [ ],
        "languages" : [ ]
      },
      "application_details" : {
        "via_af" : false,
        "email" : null,
        "other" : "bara telefon samtal 0704138333",
        "reference" : null,
        "url" : null,
        "information" : null
      },
      "source_type" : "VIA_ANNONSERA",
      "application_deadline" : "2022-08-25T00:00:00",
      "external_id" : null,
      "workplace_address" : {
        "coordinates" : [ 17.9045665277654, 59.520871123681175 ],
        "city" : "Upplands Väsby",
        "postcode" : "19476",
        "municipality" : "Upplands Väsby",
        "region_concept_id" : "CifL_Rzy_Mku",
        "region" : "Stockholms län",
        "country_code" : "199",
        "region_code" : "01",
        "municipality_concept_id" : "XWKY_c49_5nv",
        "country_concept_id" : "i46j_HmG_v64",
        "municipality_code" : "0114",
        "street_address" : "Centralvägen 6",
        "country" : "Sverige"
      },
      "id" : "26356040",
      "experience_required" : true,
      "working_hours_type" : {
        "concept_id" : "6YE1_gAC_R2G",
        "label" : "Heltid",
        "legacy_ams_taxonomy_id" : "1"
      },
      "access" : null,
      "timestamp" : 1658870410266,
      "must_have" : {
        "education_level" : [ ],
        "work_experiences" : [ ],
        "skills" : [ ],
        "education" : [ ],
        "languages" : [ ]
      },
      "occupation_field" : {
        "concept_id" : "ScKy_FHB_7wT",
        "label" : "Hotell, restaurang, storhushåll",
        "legacy_ams_taxonomy_id" : "7"
      },
      "scope_of_work" : {
        "min" : 0,
        "max" : 100
      },
      "salary_type" : {
        "concept_id" : "oG8G_9cW_nRf",
        "label" : "Fast månads- vecko- eller timlön",
        "legacy_ams_taxonomy_id" : "1"
      },
      "removed" : false,
      "salary_description" : null,
      "access_to_own_car" : false,
      "publication_date" : "2022-07-26T23:20:10"
    },
    "name" : "italian slice söker köksbiträde",
    "user" : "hannes"
  },
  "sha1" : "f038c2fe62605ebcf365cbd6f7661560155f3c5a",
  "annotations" : [ {
    "preferred-label" : "Köksbiträde",
    "sentiment" : "MUST_HAVE",
    "type" : "occupation-name",
    "start-position" : 20,
    "end-position" : 31,
    "concept-id" : "oRB5_b7i_Qzv",
    "matched-string" : "köksbiträde",
    "annotation-id" : 0
  }, {
    "preferred-label" : "Pizzabagare",
    "sentiment" : "MUST_HAVE",
    "type" : "forecast-occupation",
    "start-position" : 48,
    "end-position" : 59,
    "concept-id" : "SyvN_uBW_USt",
    "matched-string" : "pizzabagare",
    "annotation-id" : 1
  } ],
  "text" : "italian slice söker köksbiträde\nhej vi söker en pizzabagare som är duktig trevligt mot kunder och arbetskompisar  kontakt nummer   0704138333"
}