{
  "meta" : {
    "jobad" : {
      "description" : {
        "requirements" : null,
        "needs" : null,
        "company_information" : null,
        "text_formatted" : "<p>Vi söker dig som har organistutbildning och är väl förtrogen med Svenska kyrkans tro och liv. I tjänsten som organist kommer du att spela på gudstjänster, andakter och kyrkliga handlingar runt om i vår församling – både i Kalix kyrka och i byar (bönhus och kapell). Vi ser gärna att du vill jobba med en vuxenkör som kan medverka på gudstjänster och konserter. Vi lägger stor vikt vid personlig lämplighet och samarbetsförmåga. Vi arbetar aktivt för jämställdhet och vi välkomnar både kvinnliga och manliga sökanden.</p>",
        "conditions" : null,
        "text" : "Vi söker dig som har organistutbildning och är väl förtrogen med Svenska kyrkans tro och liv. I tjänsten som organist kommer du att spela på gudstjänster, andakter och kyrkliga handlingar runt om i vår församling – både i Kalix kyrka och i byar (bönhus och kapell). Vi ser gärna att du vill jobba med en vuxenkör som kan medverka på gudstjänster och konserter. Vi lägger stor vikt vid personlig lämplighet och samarbetsförmåga. Vi arbetar aktivt för jämställdhet och vi välkomnar både kvinnliga och manliga sökanden."
      },
      "headline" : "Organist",
      "driving_license" : [ {
        "concept_id" : "VTK8_WRx_GcM",
        "label" : "B",
        "legacy_ams_taxonomy_id" : "3"
      } ],
      "employer" : {
        "email" : null,
        "phone_number" : null,
        "organization_number" : "2520049111",
        "name" : "Kalix församling",
        "url" : "svenskakyrkan.se/kalix",
        "workplace" : "Kalix församling"
      },
      "removed_date" : null,
      "logo_url" : "https://www.arbetsformedlingen.se/rest/arbetsgivare/rest/af/v3/arbetsplatser/86528003/logotyper/logo.png",
      "last_publication_date" : "2022-09-05T00:00:00",
      "number_of_vacancies" : 1,
      "occupation" : {
        "concept_id" : "DNDp_1sY_ZrR",
        "label" : "Organist",
        "legacy_ams_taxonomy_id" : "7516"
      },
      "occupation_group" : {
        "concept_id" : "AWJF_wqZ_va9",
        "label" : "Musiker, sångare och kompositörer",
        "legacy_ams_taxonomy_id" : "2652"
      },
      "employment_type" : {
        "concept_id" : "PFZr_Syz_cUq",
        "label" : "Vanlig anställning",
        "legacy_ams_taxonomy_id" : "1"
      },
      "webpage_url" : "https://arbetsformedlingen.se/platsbanken/annonser/26364946",
      "driving_license_required" : true,
      "application_contacts" : [ {
        "description" : null,
        "email" : null,
        "telephone" : "0923-69810",
        "name" : "Hanna  Johnselius",
        "contact_type" : "Kyrkoherde"
      }, {
        "description" : null,
        "email" : null,
        "telephone" : "070-2086001",
        "name" : "Helena Laestadius",
        "contact_type" : "Kyrkorådets ordförande"
      } ],
      "duration" : {
        "concept_id" : "a7uU_j21_mkL",
        "label" : "Tills vidare",
        "legacy_ams_taxonomy_id" : "1"
      },
      "nice_to_have" : {
        "education_level" : [ ],
        "work_experiences" : [ ],
        "skills" : [ ],
        "education" : [ ],
        "languages" : [ ]
      },
      "application_details" : {
        "via_af" : false,
        "email" : "kalix.forsamling@svenskakyrkan.se",
        "other" : null,
        "reference" : "Ansökan organist",
        "url" : null,
        "information" : null
      },
      "source_type" : "VIA_ANNONSERA",
      "application_deadline" : "2022-09-05T00:00:00",
      "external_id" : null,
      "workplace_address" : {
        "coordinates" : [ 23.131015563356183, 65.85472611269724 ],
        "city" : "KALIX",
        "postcode" : "95234",
        "municipality" : "Kalix",
        "region_concept_id" : "9hXe_F4g_eTG",
        "region" : "Norrbottens län",
        "country_code" : "199",
        "region_code" : "25",
        "municipality_concept_id" : "cUyN_C9V_HLU",
        "country_concept_id" : "i46j_HmG_v64",
        "municipality_code" : "2514",
        "street_address" : "Kyrkogatan 1",
        "country" : "Sverige"
      },
      "id" : "26364946",
      "experience_required" : true,
      "working_hours_type" : {
        "concept_id" : "6YE1_gAC_R2G",
        "label" : "Heltid",
        "legacy_ams_taxonomy_id" : "1"
      },
      "access" : null,
      "timestamp" : 1659277985302,
      "must_have" : {
        "education_level" : [ ],
        "work_experiences" : [ ],
        "skills" : [ ],
        "education" : [ ],
        "languages" : [ ]
      },
      "occupation_field" : {
        "concept_id" : "9puE_nYg_crq",
        "label" : "Kultur, media, design",
        "legacy_ams_taxonomy_id" : "11"
      },
      "scope_of_work" : {
        "min" : 0,
        "max" : 100
      },
      "salary_type" : {
        "concept_id" : "oG8G_9cW_nRf",
        "label" : "Fast månads- vecko- eller timlön",
        "legacy_ams_taxonomy_id" : "1"
      },
      "removed" : false,
      "salary_description" : null,
      "access_to_own_car" : false,
      "publication_date" : "2022-08-04T00:00:00"
    },
    "name" : "Organist",
    "user" : "hannes"
  },
  "sha1" : "b35871cfc42cf53a9e67db142cd79a7e341f0de6",
  "annotations" : [ {
    "preferred-label" : "Organist",
    "sentiment" : "MUST_HAVE",
    "type" : "occupation-name",
    "start-position" : 0,
    "end-position" : 8,
    "concept-id" : "DNDp_1sY_ZrR",
    "matched-string" : "organist",
    "annotation-id" : 0
  }, {
    "preferred-label" : "Organistutbildning",
    "sentiment" : "MUST_HAVE",
    "type" : "keyword",
    "start-position" : 30,
    "end-position" : 48,
    "concept-id" : "eESF_8Qa_pBs",
    "matched-string" : "organistutbildning",
    "annotation-id" : 1
  }, {
    "preferred-label" : "Kyrkan",
    "type" : "keyword",
    "start-position" : 82,
    "end-position" : 89,
    "concept-id" : "h4LF_GE3_FGu",
    "matched-string" : "kyrkans",
    "annotation-id" : 6
  }, {
    "preferred-label" : "Organist",
    "sentiment" : "MUST_HAVE",
    "type" : "occupation-name",
    "start-position" : 118,
    "end-position" : 126,
    "concept-id" : "DNDp_1sY_ZrR",
    "matched-string" : "organist",
    "annotation-id" : 3
  }, {
    "preferred-label" : "Församling",
    "sentiment" : "MUST_HAVE",
    "type" : "keyword",
    "start-position" : 211,
    "end-position" : 221,
    "concept-id" : "rfGv_wrD_n9x",
    "matched-string" : "församling",
    "annotation-id" : 4
  }, {
    "preferred-label" : "Kalix",
    "type" : "municipality",
    "start-position" : 231,
    "end-position" : 236,
    "concept-id" : "cUyN_C9V_HLU",
    "matched-string" : "Kalix",
    "annotation-id" : 7
  }, {
    "preferred-label" : "Jämställdhet",
    "sentiment" : "MUST_HAVE",
    "type" : "keyword",
    "start-position" : 459,
    "end-position" : 471,
    "concept-id" : "WgGj_zNt_Pzz",
    "matched-string" : "jämställdhet",
    "annotation-id" : 5
  } ],
  "text" : "Organist\nVi söker dig som har organistutbildning och är väl förtrogen med Svenska kyrkans tro och liv. I tjänsten som organist kommer du att spela på gudstjänster, andakter och kyrkliga handlingar runt om i vår församling – både i Kalix kyrka och i byar (bönhus och kapell). Vi ser gärna att du vill jobba med en vuxenkör som kan medverka på gudstjänster och konserter. Vi lägger stor vikt vid personlig lämplighet och samarbetsförmåga. Vi arbetar aktivt för jämställdhet och vi välkomnar både kvinnliga och manliga sökanden."
}