{
  "meta" : {
    "jobad" : {
      "description" : {
        "requirements" : null,
        "needs" : null,
        "company_information" : null,
        "text_formatted" : "<p>Vi behöver nu en snickare med minst 5 års erfarenhet. Arbetsplatsen ligger i Stockholm</p><p>Pågående och kommande stora projekt med tillträde är omgående.</p><p>Tjänsten innebär att du självgående skall kunna arbeta med traditionellt förekommande snickeriarbeten inom nyproduktion, renovering.</p><p><br></p><p>Vi samarbetar enbart med stora aktörer inom byggnads som tänker på kvalité och miljö, samt som ger fina villkor och utvecklingsmöjlighet för de anställda.</p>",
        "conditions" : null,
        "text" : "Vi behöver nu en snickare med minst 5 års erfarenhet. Arbetsplatsen ligger i Stockholm\nPågående och kommande stora projekt med tillträde är omgående.\nTjänsten innebär att du självgående skall kunna arbeta med traditionellt förekommande snickeriarbeten inom nyproduktion, renovering.\n\n\nVi samarbetar enbart med stora aktörer inom byggnads som tänker på kvalité och miljö, samt som ger fina villkor och utvecklingsmöjlighet för de anställda."
      },
      "headline" : "Snickare",
      "driving_license" : null,
      "employer" : {
        "email" : null,
        "phone_number" : null,
        "organization_number" : "5592083793",
        "name" : "NESSIX AB",
        "url" : null,
        "workplace" : "NESSIX AB"
      },
      "removed_date" : null,
      "logo_url" : "https://www.arbetsformedlingen.se/rest/arbetsgivare/rest/af/v3/arbetsplatser/88026511/logotyper/logo.png",
      "last_publication_date" : "2022-08-27T23:59:59",
      "number_of_vacancies" : 1,
      "occupation" : {
        "concept_id" : "4Z7F_oBG_vMG",
        "label" : "Träarbetare/Snickare",
        "legacy_ams_taxonomy_id" : "6581"
      },
      "occupation_group" : {
        "concept_id" : "9mJN_VwW_Xjg",
        "label" : "Träarbetare, snickare m.fl.",
        "legacy_ams_taxonomy_id" : "7111"
      },
      "employment_type" : {
        "concept_id" : "PFZr_Syz_cUq",
        "label" : "Vanlig anställning",
        "legacy_ams_taxonomy_id" : "1"
      },
      "webpage_url" : "https://arbetsformedlingen.se/platsbanken/annonser/26361310",
      "driving_license_required" : false,
      "application_contacts" : [ ],
      "duration" : {
        "concept_id" : "a7uU_j21_mkL",
        "label" : "Tills vidare",
        "legacy_ams_taxonomy_id" : "1"
      },
      "nice_to_have" : {
        "education_level" : [ ],
        "work_experiences" : [ ],
        "skills" : [ ],
        "education" : [ ],
        "languages" : [ {
          "concept_id" : "zSLA_vw2_FXN",
          "weight" : 5,
          "label" : "Svenska",
          "legacy_ams_taxonomy_id" : "502"
        }, {
          "concept_id" : "NVxJ_hLg_TYS",
          "weight" : 5,
          "label" : "Engelska",
          "legacy_ams_taxonomy_id" : "283"
        } ]
      },
      "application_details" : {
        "via_af" : false,
        "email" : "n6bygg@gmail.com",
        "other" : null,
        "reference" : null,
        "url" : null,
        "information" : null
      },
      "source_type" : "VIA_ANNONSERA",
      "application_deadline" : "2022-08-27T23:59:59",
      "external_id" : null,
      "workplace_address" : {
        "coordinates" : [ null, null ],
        "city" : null,
        "postcode" : null,
        "municipality" : null,
        "region_concept_id" : null,
        "region" : null,
        "country_code" : "199",
        "region_code" : null,
        "municipality_concept_id" : null,
        "country_concept_id" : "i46j_HmG_v64",
        "municipality_code" : null,
        "street_address" : null,
        "country" : "Sverige"
      },
      "id" : "26361310",
      "experience_required" : true,
      "working_hours_type" : {
        "concept_id" : "6YE1_gAC_R2G",
        "label" : "Heltid",
        "legacy_ams_taxonomy_id" : "1"
      },
      "access" : null,
      "timestamp" : 1659034290284,
      "must_have" : {
        "education_level" : [ ],
        "work_experiences" : [ {
          "concept_id" : "4Z7F_oBG_vMG",
          "weight" : 10,
          "label" : "Träarbetare/Snickare",
          "legacy_ams_taxonomy_id" : "6581"
        } ],
        "skills" : [ ],
        "education" : [ ],
        "languages" : [ ]
      },
      "occupation_field" : {
        "concept_id" : "j7Cq_ZJe_GkT",
        "label" : "Bygg och anläggning",
        "legacy_ams_taxonomy_id" : "2"
      },
      "scope_of_work" : {
        "min" : 0,
        "max" : 100
      },
      "salary_type" : {
        "concept_id" : "oG8G_9cW_nRf",
        "label" : "Fast månads- vecko- eller timlön",
        "legacy_ams_taxonomy_id" : "1"
      },
      "removed" : false,
      "salary_description" : null,
      "access_to_own_car" : false,
      "publication_date" : "2022-07-28T20:51:30"
    },
    "name" : "Snickare",
    "user" : "hannes"
  },
  "sha1" : "13c665cd4e7816144f22b251fa5cc74cb8b29e21",
  "annotations" : [ {
    "preferred-label" : "snickare",
    "sentiment" : "MUST_HAVE",
    "type" : "esco-occupation",
    "start-position" : 0,
    "end-position" : 8,
    "concept-id" : "qhAJ_Euo_tNx",
    "matched-string" : "snickare",
    "annotation-id" : 0
  }, {
    "preferred-label" : "snickare",
    "sentiment" : "MUST_HAVE",
    "type" : "esco-occupation",
    "start-position" : 26,
    "end-position" : 34,
    "concept-id" : "qhAJ_Euo_tNx",
    "matched-string" : "snickare",
    "annotation-id" : 1
  }, {
    "preferred-label" : "5 års erfarenhet eller mer",
    "type" : "occupation-experience-year",
    "start-position" : 45,
    "end-position" : 61,
    "concept-id" : "8CVf_zRX_aZj",
    "matched-string" : "5 års erfarenhet",
    "annotation-id" : 2
  }, {
    "preferred-label" : "Stockholm",
    "type" : "municipality",
    "start-position" : 86,
    "end-position" : 95,
    "concept-id" : "AvNB_uwa_6n6",
    "matched-string" : "Stockholm",
    "annotation-id" : 3
  } ],
  "text" : "Snickare\nVi behöver nu en snickare med minst 5 års erfarenhet. Arbetsplatsen ligger i Stockholm\nPågående och kommande stora projekt med tillträde är omgående.\nTjänsten innebär att du självgående skall kunna arbeta med traditionellt förekommande snickeriarbeten inom nyproduktion, renovering.\n\n\nVi samarbetar enbart med stora aktörer inom byggnads som tänker på kvalité och miljö, samt som ger fina villkor och utvecklingsmöjlighet för de anställda."
}