{
  "meta" : {
    "jobad" : {
      "description" : {
        "requirements" : null,
        "needs" : null,
        "company_information" : null,
        "text_formatted" : "<p>Serviceminded frisör sökes!</p><p>Gideonsberg salong söker frisör med stor erfarenhet av alla typer av hår.</p><p>Du behöver kunna hantera både sax &amp; maskin. </p><p>Vi värdesätter hög arbetsmoral, en positiv personlighet och att du är serviceminded. </p><p>Vi arbetar för att leverera högklassiga klippningar samt hög service till våra kunder.</p><p><br></p><p>Om salongen -</p><p>Gideonsberg salong öppnade upp i Gideonsberg december 2021 med ett avstånd om ca 2 km från centrum.</p><p>Gideonsberg salong har byggt upp en trogen kundkrets som Vi arbetar för att utöka och bibehålla.</p><p><br></p><p><br></p><p>Välkommen med din ansökan till</p><p>Sajjad Saleh</p>",
        "conditions" : null,
        "text" : "Serviceminded frisör sökes!\nGideonsberg salong söker frisör med stor erfarenhet av alla typer av hår.\nDu behöver kunna hantera både sax & maskin. \nVi värdesätter hög arbetsmoral, en positiv personlighet och att du är serviceminded. \nVi arbetar för att leverera högklassiga klippningar samt hög service till våra kunder.\n\n\nOm salongen -\nGideonsberg salong öppnade upp i Gideonsberg december 2021 med ett avstånd om ca 2 km från centrum.\nGideonsberg salong har byggt upp en trogen kundkrets som Vi arbetar för att utöka och bibehålla.\n\n\n\n\nVälkommen med din ansökan till\nSajjad Saleh"
      },
      "headline" : "Frisör",
      "driving_license" : null,
      "employer" : {
        "email" : null,
        "phone_number" : null,
        "organization_number" : null,
        "name" : "Gideonsberg Salong",
        "url" : null,
        "workplace" : "Gideonsberg Salong"
      },
      "removed_date" : null,
      "logo_url" : null,
      "last_publication_date" : "2022-09-30T00:00:00",
      "number_of_vacancies" : 1,
      "occupation" : {
        "concept_id" : "tuoE_9Nj_fAS",
        "label" : "Frisör",
        "legacy_ams_taxonomy_id" : "5491"
      },
      "occupation_group" : {
        "concept_id" : "LyBp_bY6_bZK",
        "label" : "Frisörer",
        "legacy_ams_taxonomy_id" : "5141"
      },
      "employment_type" : {
        "concept_id" : "PFZr_Syz_cUq",
        "label" : "Vanlig anställning",
        "legacy_ams_taxonomy_id" : "1"
      },
      "webpage_url" : "https://arbetsformedlingen.se/platsbanken/annonser/26333563",
      "driving_license_required" : false,
      "application_contacts" : [ {
        "description" : null,
        "email" : "sirsajjads28@gmail.com",
        "telephone" : "0735934465",
        "name" : "Sajjad Saleh",
        "contact_type" : null
      } ],
      "duration" : {
        "concept_id" : "a7uU_j21_mkL",
        "label" : "Tills vidare",
        "legacy_ams_taxonomy_id" : "1"
      },
      "nice_to_have" : {
        "education_level" : [ ],
        "work_experiences" : [ {
          "concept_id" : "tuoE_9Nj_fAS",
          "weight" : 5,
          "label" : "Frisör",
          "legacy_ams_taxonomy_id" : "5491"
        } ],
        "skills" : [ ],
        "education" : [ ],
        "languages" : [ ]
      },
      "application_details" : {
        "via_af" : false,
        "email" : "Sirsajjads28@gmail.com",
        "other" : null,
        "reference" : null,
        "url" : null,
        "information" : null
      },
      "source_type" : "VIA_ANNONSERA",
      "application_deadline" : "2022-09-30T00:00:00",
      "external_id" : null,
      "workplace_address" : {
        "coordinates" : [ 16.55958979622758, 59.63119016829104 ],
        "city" : "Västerås",
        "postcode" : "72225",
        "municipality" : "Västerås",
        "region_concept_id" : "G6DV_fKE_Viz",
        "region" : "Västmanlands län",
        "country_code" : "199",
        "region_code" : "19",
        "municipality_concept_id" : "8deT_FRF_2SP",
        "country_concept_id" : "i46j_HmG_v64",
        "municipality_code" : "1980",
        "street_address" : "Gideonsbergs Gatan 4",
        "country" : "Sverige"
      },
      "id" : "26333563",
      "experience_required" : true,
      "working_hours_type" : {
        "concept_id" : "6YE1_gAC_R2G",
        "label" : "Heltid",
        "legacy_ams_taxonomy_id" : "1"
      },
      "access" : null,
      "timestamp" : 1658085090270,
      "must_have" : {
        "education_level" : [ ],
        "work_experiences" : [ ],
        "skills" : [ ],
        "education" : [ ],
        "languages" : [ ]
      },
      "occupation_field" : {
        "concept_id" : "Uuf1_GMh_Uvw",
        "label" : "Kropps- och skönhetsvård",
        "legacy_ams_taxonomy_id" : "4"
      },
      "scope_of_work" : {
        "min" : 0,
        "max" : 100
      },
      "salary_type" : {
        "concept_id" : "oG8G_9cW_nRf",
        "label" : "Fast månads- vecko- eller timlön",
        "legacy_ams_taxonomy_id" : "1"
      },
      "removed" : false,
      "salary_description" : null,
      "access_to_own_car" : false,
      "publication_date" : "2022-07-17T21:11:30"
    },
    "name" : "Frisör",
    "user" : "kristof.fischer"
  },
  "sha1" : "f9e9384248043ba8ded15d4aa6e8b87a8f8b003c",
  "annotations" : [ {
    "preferred-label" : "Frisör",
    "sentiment" : "MUST_HAVE",
    "type" : "occupation-name",
    "start-position" : 0,
    "end-position" : 6,
    "concept-id" : "tuoE_9Nj_fAS",
    "matched-string" : "frisör",
    "annotation-id" : 0
  }, {
    "preferred-label" : "Frisör",
    "sentiment" : "MUST_HAVE",
    "type" : "occupation-name",
    "start-position" : 21,
    "end-position" : 27,
    "concept-id" : "tuoE_9Nj_fAS",
    "matched-string" : "frisör",
    "annotation-id" : 1
  }, {
    "preferred-label" : "Frisör",
    "sentiment" : "MUST_HAVE",
    "type" : "occupation-name",
    "start-position" : 60,
    "end-position" : 66,
    "concept-id" : "tuoE_9Nj_fAS",
    "matched-string" : "frisör",
    "annotation-id" : 2
  }, {
    "preferred-label" : "hårklippningstekniker",
    "sentiment" : "MUST_HAVE",
    "type" : "esco-skill",
    "start-position" : 126,
    "end-position" : 151,
    "concept-id" : "ctoB_kAr_kEo",
    "matched-string" : "hantera både sax & maskin",
    "annotation-id" : 3
  } ],
  "text" : "Frisör\nServiceminded frisör sökes!\nGideonsberg salong söker frisör med stor erfarenhet av alla typer av hår.\nDu behöver kunna hantera både sax & maskin. \nVi värdesätter hög arbetsmoral, en positiv personlighet och att du är serviceminded. \nVi arbetar för att leverera högklassiga klippningar samt hög service till våra kunder.\n\n\nOm salongen -\nGideonsberg salong öppnade upp i Gideonsberg december 2021 med ett avstånd om ca 2 km från centrum.\nGideonsberg salong har byggt upp en trogen kundkrets som Vi arbetar för att utöka och bibehålla.\n\n\n\n\nVälkommen med din ansökan till\nSajjad Saleh"
}