{
  "meta" : {
    "jobad" : {
      "description" : {
        "requirements" : null,
        "needs" : null,
        "company_information" : null,
        "text_formatted" : "Om Bravura:\n\nBravura är ett bemannings- och rekryteringsföretag för organisationer som vill hitta Next Gen Professionals. Hos oss finns massor av jobbmöjligheter, framförallt för dig i början av karriären med 0-8 års erfarenhet. Via oss kan du jobba som konsult eller bli rekryterad. Hitta ditt drömjobb - vi hjälper dig att lyckas!\r\n\r\nOm tjänsten:\n\nDet här är ett konsultuppdrag med goda möjligheter till överrekrytering. I den här rollen får du initialt en anställning hos Bravura, och det är uttalat att företaget har för avsikt att erbjuda dig anställning hos dem på sikt. Detta ger både dig och företaget en bra möjlighet att lära känna varandra samt utvärdera hur ni trivs med ert samarbete.\n\nOm företaget:\n\nFöretaget är ett världsledande bolag inom sin bransch med över 700 anställda. Tjänsten som onsite-tekniker är belägen på huvudkontoret mitt i centrala Malmö och du rapporterar till Local IT Manager. Du får mer information om företaget vid en intervju!\r\n\r\nArbetsuppgifter:\n\nSom onsite-tekniker arbetar du med varierade IT-relaterade uppgifter av enklare slag utifrån användarnas behov. Arbetsuppgifterna innefattar allt från användarsupport till installation av arbetsplatser och arbete av praktisk karaktär så som byte och installation av hårdvara. Vidare säkerställer du, tillsammans med övriga i teamet, att rapportera beställningsbehov av IT-artiklar. Arbetsuppgifterna kan även breddas utifrån din tekniska erfarenhet och kunskap.\n\n• Användarsupport och instrallation av arbetsplatser\n• Byta och instrallera hårdvara\n• Rapportera beställningsbehov av IT-artiklar\r\n\r\nUtbildning, Erfarenhet och personliga egenskaper:\n\n• Utbildning inom IT/teknik, alternativt ett tekniskt intresse\n• Goda kunskaper i svenska och engelska, tal och skrift\n• Meriterande om du har erfarenhet av arbete som supporttekniker \n• Meriterande om du har erfarenhet av arbete i ticket-system\n\nI denna roll kommer stor vikt läggas vid dina personliga egenskaper. För att trivas i rollen tror vi att du motiveras av att lösa andras problem och har ett intresse för att dela med dig av din kunskap till andra men även att våga be om hjälp vid behov. Därtill motiveras du av att ge förstklassig service och anstränger dig för att leverera lösningar som underlättar för andra. Vidare tar du stort ägandeskap för dina uppgifter, är noggrann och har förmågan att strukturera och prioritera rätt saker.\n\nÖvrig information:\n\nStart: I slutet av Augusti\nPlats: Malmö\nLön: Fast lön enligt överenskommelse\n\nFunderingar kring Bravuras rekryteringsprocess? Du finner svar på de vanligast förekommande frågorna <a href='https://www.bravura.se/fragor-och-svar'>här</a>\n\nÄr du nyfiken på hur vår rekryteringsprocess är upplagd? Du hittar mer information <a href='https://www.bravura.se/karriar/'>här</a>\n\nHar du frågor om tjänsten eller kring din registrering är du välkommen att kontakta vår kandidatsupport på vår chatt, <a href='mailto:info@bravura.se'>info@bravura.se</a> eller 08-400 240 50 så hjälper vi dig. Ange vilken tjänst det gäller.\n\nVi rekommenderar att du skickar in din ansökan omgående då vi gör ett löpande urval. Välkommen med din ansökan!\n\nSökord: onsite-tekniker, IT-tekniker, systemtekniker, nätverkstekniker, tekniker, IT, windows 10, hårdvara, mjukvara",
        "conditions" : "Heltid\r\nTillsvidare",
        "text" : "Om Bravura:\n\nBravura är ett bemannings- och rekryteringsföretag för organisationer som vill hitta Next Gen Professionals. Hos oss finns massor av jobbmöjligheter, framförallt för dig i början av karriären med 0-8 års erfarenhet. Via oss kan du jobba som konsult eller bli rekryterad. Hitta ditt drömjobb - vi hjälper dig att lyckas!\r\n\r\nOm tjänsten:\n\nDet här är ett konsultuppdrag med goda möjligheter till överrekrytering. I den här rollen får du initialt en anställning hos Bravura, och det är uttalat att företaget har för avsikt att erbjuda dig anställning hos dem på sikt. Detta ger både dig och företaget en bra möjlighet att lära känna varandra samt utvärdera hur ni trivs med ert samarbete.\n\nOm företaget:\n\nFöretaget är ett världsledande bolag inom sin bransch med över 700 anställda. Tjänsten som onsite-tekniker är belägen på huvudkontoret mitt i centrala Malmö och du rapporterar till Local IT Manager. Du får mer information om företaget vid en intervju!\r\n\r\nArbetsuppgifter:\n\nSom onsite-tekniker arbetar du med varierade IT-relaterade uppgifter av enklare slag utifrån användarnas behov. Arbetsuppgifterna innefattar allt från användarsupport till installation av arbetsplatser och arbete av praktisk karaktär så som byte och installation av hårdvara. Vidare säkerställer du, tillsammans med övriga i teamet, att rapportera beställningsbehov av IT-artiklar. Arbetsuppgifterna kan även breddas utifrån din tekniska erfarenhet och kunskap.\n\n• Användarsupport och instrallation av arbetsplatser\n• Byta och instrallera hårdvara\n• Rapportera beställningsbehov av IT-artiklar\r\n\r\nUtbildning, Erfarenhet och personliga egenskaper:\n\n• Utbildning inom IT/teknik, alternativt ett tekniskt intresse\n• Goda kunskaper i svenska och engelska, tal och skrift\n• Meriterande om du har erfarenhet av arbete som supporttekniker \n• Meriterande om du har erfarenhet av arbete i ticket-system\n\nI denna roll kommer stor vikt läggas vid dina personliga egenskaper. För att trivas i rollen tror vi att du motiveras av att lösa andras problem och har ett intresse för att dela med dig av din kunskap till andra men även att våga be om hjälp vid behov. Därtill motiveras du av att ge förstklassig service och anstränger dig för att leverera lösningar som underlättar för andra. Vidare tar du stort ägandeskap för dina uppgifter, är noggrann och har förmågan att strukturera och prioritera rätt saker.\n\nÖvrig information:\n\nStart: I slutet av Augusti\nPlats: Malmö\nLön: Fast lön enligt överenskommelse\n\nFunderingar kring Bravuras rekryteringsprocess? Du finner svar på de vanligast förekommande frågorna här\n\nÄr du nyfiken på hur vår rekryteringsprocess är upplagd? Du hittar mer information här\n\nHar du frågor om tjänsten eller kring din registrering är du välkommen att kontakta vår kandidatsupport på vår chatt, info@bravura.se eller 08-400 240 50 så hjälper vi dig. Ange vilken tjänst det gäller.\n\nVi rekommenderar att du skickar in din ansökan omgående då vi gör ett löpande urval. Välkommen med din ansökan!\n\nSökord: onsite-tekniker, IT-tekniker, systemtekniker, nätverkstekniker, tekniker, IT, windows 10, hårdvara, mjukvara"
      },
      "headline" : "Junior onsitetekniker",
      "driving_license" : null,
      "employer" : {
        "email" : null,
        "phone_number" : null,
        "organization_number" : "5567520803",
        "name" : "Bravura Sverige AB",
        "url" : "www.bravura.se",
        "workplace" : "Bravura"
      },
      "removed_date" : null,
      "logo_url" : "https://www.arbetsformedlingen.se/rest/arbetsgivare/rest/af/v3/organisation/5567520803/logotyper/logo.png",
      "last_publication_date" : "2022-07-31T23:59:59",
      "number_of_vacancies" : 1,
      "occupation" : {
        "concept_id" : "KQty_E1u_cia",
        "label" : "Helpdesktekniker/Supporttekniker",
        "legacy_ams_taxonomy_id" : "7020"
      },
      "occupation_group" : {
        "concept_id" : "hmaC_cfi_UKg",
        "label" : "Supporttekniker, IT",
        "legacy_ams_taxonomy_id" : "3512"
      },
      "employment_type" : {
        "concept_id" : "PFZr_Syz_cUq",
        "label" : "Vanlig anställning",
        "legacy_ams_taxonomy_id" : "1"
      },
      "webpage_url" : "https://arbetsformedlingen.se/platsbanken/annonser/26325576",
      "driving_license_required" : false,
      "application_contacts" : [ {
        "description" : "Caroline Christensson",
        "email" : "caroline.christensson@bravura.se",
        "telephone" : "08-40024050",
        "name" : null,
        "contact_type" : null
      } ],
      "duration" : {
        "concept_id" : "a7uU_j21_mkL",
        "label" : "Tills vidare",
        "legacy_ams_taxonomy_id" : "1"
      },
      "nice_to_have" : {
        "education_level" : [ ],
        "work_experiences" : [ ],
        "skills" : [ ],
        "education" : [ ],
        "languages" : [ ]
      },
      "application_details" : {
        "via_af" : false,
        "email" : null,
        "other" : null,
        "reference" : null,
        "url" : "https://jobb.bravura.se/lediga-jobb/junior-onsitetekniker-4094901/",
        "information" : null
      },
      "source_type" : "VIA_PLATSBANKEN_DXA",
      "application_deadline" : "2022-07-31T23:59:59",
      "external_id" : "46-556752-0803-35042",
      "workplace_address" : {
        "coordinates" : [ 13.003822, 55.60498 ],
        "city" : null,
        "postcode" : null,
        "municipality" : "Malmö",
        "region_concept_id" : "CaRE_1nn_cSU",
        "region" : "Skåne län",
        "country_code" : "199",
        "region_code" : "12",
        "municipality_concept_id" : "oYPt_yRA_Smm",
        "country_concept_id" : "i46j_HmG_v64",
        "municipality_code" : "1280",
        "street_address" : null,
        "country" : "Sverige"
      },
      "id" : "26325576",
      "experience_required" : true,
      "working_hours_type" : {
        "concept_id" : "6YE1_gAC_R2G",
        "label" : "Heltid",
        "legacy_ams_taxonomy_id" : "1"
      },
      "access" : null,
      "timestamp" : 1657780148064,
      "must_have" : {
        "education_level" : [ ],
        "work_experiences" : [ {
          "concept_id" : "KQty_E1u_cia",
          "weight" : 10,
          "label" : "Helpdesktekniker/Supporttekniker",
          "legacy_ams_taxonomy_id" : "7020"
        } ],
        "skills" : [ ],
        "education" : [ ],
        "languages" : [ ]
      },
      "occupation_field" : {
        "concept_id" : "apaJ_2ja_LuF",
        "label" : "Data/IT",
        "legacy_ams_taxonomy_id" : "3"
      },
      "scope_of_work" : {
        "min" : 100,
        "max" : 100
      },
      "salary_type" : {
        "concept_id" : "oG8G_9cW_nRf",
        "label" : "Fast månads- vecko- eller timlön",
        "legacy_ams_taxonomy_id" : "1"
      },
      "removed" : false,
      "salary_description" : "Enligt överenskommelse.",
      "access_to_own_car" : false,
      "publication_date" : "2022-07-14T08:29:08"
    },
    "name" : "Junior onsitetekniker",
    "user" : "hannes"
  },
  "sha1" : "c66dabcfb3b128e02eedcfd4de2b88d6b7c52d32",
  "annotations" : [ {
    "preferred-label" : "Malmö",
    "type" : "municipality",
    "start-position" : 887,
    "end-position" : 892,
    "concept-id" : "oYPt_yRA_Smm",
    "matched-string" : "Malmö",
    "annotation-id" : 16
  }, {
    "preferred-label" : "Data/IT",
    "sentiment" : "MUST_HAVE",
    "type" : "occupation-field",
    "start-position" : 923,
    "end-position" : 925,
    "concept-id" : "apaJ_2ja_LuF",
    "matched-string" : "it",
    "annotation-id" : 0
  }, {
    "preferred-label" : "Manager",
    "sentiment" : "MUST_HAVE",
    "type" : "occupation-name",
    "start-position" : 926,
    "end-position" : 933,
    "concept-id" : "X9jv_K2b_m48",
    "matched-string" : "manager",
    "annotation-id" : 1
  }, {
    "preferred-label" : "Data/IT",
    "sentiment" : "MUST_HAVE",
    "type" : "occupation-field",
    "start-position" : 1054,
    "end-position" : 1056,
    "concept-id" : "apaJ_2ja_LuF",
    "matched-string" : "it",
    "annotation-id" : 2
  }, {
    "preferred-label" : "Hårdvara",
    "sentiment" : "MUST_HAVE",
    "type" : "skill-headline",
    "start-position" : 1275,
    "end-position" : 1283,
    "concept-id" : "22jK_Hje_3Ec",
    "matched-string" : "hårdvara",
    "annotation-id" : 3
  }, {
    "preferred-label" : "Data/IT",
    "type" : "occupation-field",
    "start-position" : 1378,
    "end-position" : 1380,
    "concept-id" : "apaJ_2ja_LuF",
    "matched-string" : "IT",
    "annotation-id" : 17
  }, {
    "preferred-label" : "Hårdvara",
    "sentiment" : "MUST_HAVE",
    "type" : "skill-headline",
    "start-position" : 1548,
    "end-position" : 1556,
    "concept-id" : "22jK_Hje_3Ec",
    "matched-string" : "hårdvara",
    "annotation-id" : 5
  }, {
    "preferred-label" : "Data/IT",
    "sentiment" : "MUST_HAVE",
    "type" : "occupation-field",
    "start-position" : 1591,
    "end-position" : 1593,
    "concept-id" : "apaJ_2ja_LuF",
    "matched-string" : "it",
    "annotation-id" : 6
  }, {
    "preferred-label" : "Data/IT",
    "type" : "occupation-field",
    "start-position" : 1675,
    "end-position" : 1677,
    "concept-id" : "apaJ_2ja_LuF",
    "matched-string" : "IT",
    "annotation-id" : 18
  }, {
    "preferred-label" : "Svenska",
    "sentiment" : "MUST_HAVE",
    "type" : "language",
    "start-position" : 1739,
    "end-position" : 1746,
    "concept-id" : "zSLA_vw2_FXN",
    "matched-string" : "svenska",
    "annotation-id" : 8
  }, {
    "preferred-label" : "Engelska",
    "sentiment" : "MUST_HAVE",
    "type" : "language",
    "start-position" : 1751,
    "end-position" : 1759,
    "concept-id" : "NVxJ_hLg_TYS",
    "matched-string" : "engelska",
    "annotation-id" : 9
  }, {
    "preferred-label" : "Helpdesktekniker/Supporttekniker",
    "sentiment" : "MUST_HAVE",
    "type" : "occupation-name",
    "start-position" : 1825,
    "end-position" : 1840,
    "concept-id" : "KQty_E1u_cia",
    "matched-string" : "supporttekniker",
    "annotation-id" : 10
  }, {
    "preferred-label" : "noggrannhet",
    "type" : "esco-skill",
    "start-position" : 2337,
    "end-position" : 2345,
    "concept-id" : "mrsW_EkL_KRD",
    "matched-string" : "noggrann",
    "annotation-id" : 19
  }, {
    "preferred-label" : "Malmö",
    "type" : "municipality",
    "start-position" : 2461,
    "end-position" : 2466,
    "concept-id" : "oYPt_yRA_Smm",
    "matched-string" : "Malmö",
    "annotation-id" : 20
  }, {
    "preferred-label" : "it-tekniker",
    "type" : "esco-occupation",
    "start-position" : 3042,
    "end-position" : 3053,
    "concept-id" : "ybqU_Mu2_Eti",
    "matched-string" : "IT-tekniker",
    "annotation-id" : 21
  }, {
    "preferred-label" : "Nätverks- och systemtekniker m.fl.",
    "type" : "ssyk-level-4",
    "start-position" : 3055,
    "end-position" : 3069,
    "concept-id" : "VCpu_5EN_bBt",
    "matched-string" : "systemtekniker",
    "annotation-id" : 22
  }, {
    "preferred-label" : "nätverkstekniker",
    "sentiment" : "MUST_HAVE",
    "type" : "esco-occupation",
    "start-position" : 3071,
    "end-position" : 3087,
    "concept-id" : "gsaM_vT7_oJu",
    "matched-string" : "nätverkstekniker",
    "annotation-id" : 12
  }, {
    "preferred-label" : "Data/IT",
    "sentiment" : "MUST_HAVE",
    "type" : "occupation-field",
    "start-position" : 3099,
    "end-position" : 3101,
    "concept-id" : "apaJ_2ja_LuF",
    "matched-string" : "it",
    "annotation-id" : 13
  }, {
    "preferred-label" : "Windows, operativsystem",
    "sentiment" : "MUST_HAVE",
    "type" : "skill",
    "start-position" : 3103,
    "end-position" : 3110,
    "concept-id" : "G4sF_xod_zoq",
    "matched-string" : "windows",
    "annotation-id" : 14
  }, {
    "preferred-label" : "Hårdvara",
    "sentiment" : "MUST_HAVE",
    "type" : "skill-headline",
    "start-position" : 3115,
    "end-position" : 3123,
    "concept-id" : "22jK_Hje_3Ec",
    "matched-string" : "hårdvara",
    "annotation-id" : 15
  } ],
  "text" : "Junior onsitetekniker\nOm Bravura:\n\nBravura är ett bemannings- och rekryteringsföretag för organisationer som vill hitta Next Gen Professionals. Hos oss finns massor av jobbmöjligheter, framförallt för dig i början av karriären med 0-8 års erfarenhet. Via oss kan du jobba som konsult eller bli rekryterad. Hitta ditt drömjobb - vi hjälper dig att lyckas!\r\n\r\nOm tjänsten:\n\nDet här är ett konsultuppdrag med goda möjligheter till överrekrytering. I den här rollen får du initialt en anställning hos Bravura, och det är uttalat att företaget har för avsikt att erbjuda dig anställning hos dem på sikt. Detta ger både dig och företaget en bra möjlighet att lära känna varandra samt utvärdera hur ni trivs med ert samarbete.\n\nOm företaget:\n\nFöretaget är ett världsledande bolag inom sin bransch med över 700 anställda. Tjänsten som onsite-tekniker är belägen på huvudkontoret mitt i centrala Malmö och du rapporterar till Local IT Manager. Du får mer information om företaget vid en intervju!\r\n\r\nArbetsuppgifter:\n\nSom onsite-tekniker arbetar du med varierade IT-relaterade uppgifter av enklare slag utifrån användarnas behov. Arbetsuppgifterna innefattar allt från användarsupport till installation av arbetsplatser och arbete av praktisk karaktär så som byte och installation av hårdvara. Vidare säkerställer du, tillsammans med övriga i teamet, att rapportera beställningsbehov av IT-artiklar. Arbetsuppgifterna kan även breddas utifrån din tekniska erfarenhet och kunskap.\n\n• Användarsupport och instrallation av arbetsplatser\n• Byta och instrallera hårdvara\n• Rapportera beställningsbehov av IT-artiklar\r\n\r\nUtbildning, Erfarenhet och personliga egenskaper:\n\n• Utbildning inom IT/teknik, alternativt ett tekniskt intresse\n• Goda kunskaper i svenska och engelska, tal och skrift\n• Meriterande om du har erfarenhet av arbete som supporttekniker \n• Meriterande om du har erfarenhet av arbete i ticket-system\n\nI denna roll kommer stor vikt läggas vid dina personliga egenskaper. För att trivas i rollen tror vi att du motiveras av att lösa andras problem och har ett intresse för att dela med dig av din kunskap till andra men även att våga be om hjälp vid behov. Därtill motiveras du av att ge förstklassig service och anstränger dig för att leverera lösningar som underlättar för andra. Vidare tar du stort ägandeskap för dina uppgifter, är noggrann och har förmågan att strukturera och prioritera rätt saker.\n\nÖvrig information:\n\nStart: I slutet av Augusti\nPlats: Malmö\nLön: Fast lön enligt överenskommelse\n\nFunderingar kring Bravuras rekryteringsprocess? Du finner svar på de vanligast förekommande frågorna här\n\nÄr du nyfiken på hur vår rekryteringsprocess är upplagd? Du hittar mer information här\n\nHar du frågor om tjänsten eller kring din registrering är du välkommen att kontakta vår kandidatsupport på vår chatt, info@bravura.se eller 08-400 240 50 så hjälper vi dig. Ange vilken tjänst det gäller.\n\nVi rekommenderar att du skickar in din ansökan omgående då vi gör ett löpande urval. Välkommen med din ansökan!\n\nSökord: onsite-tekniker, IT-tekniker, systemtekniker, nätverkstekniker, tekniker, IT, windows 10, hårdvara, mjukvara"
}