{
  "meta" : {
    "jobad" : {
      "description" : {
        "requirements" : null,
        "needs" : null,
        "company_information" : null,
        "text_formatted" : "<p>Söker 2 anläggningsarbetare som kan utföra stensättning ,kantsten , och olika diverse mindre jobb inom mur och betongarbete.</p><p id=\"oppenforalla\">Öppen för alla\nVi fokuserar på din kompetens, inte dina övriga förutsättningar. Vi är öppna för att anpassa rollen eller arbetsplatsen efter dina behov.</p>",
        "conditions" : null,
        "text" : "Söker 2 anläggningsarbetare som kan utföra stensättning ,kantsten , och olika diverse mindre jobb inom mur och betongarbete.\nÖppen för alla\nVi fokuserar på din kompetens, inte dina övriga förutsättningar. Vi är öppna för att anpassa rollen eller arbetsplatsen efter dina behov."
      },
      "headline" : "Bygg markarbetare",
      "driving_license" : [ {
        "concept_id" : "VTK8_WRx_GcM",
        "label" : "B",
        "legacy_ams_taxonomy_id" : "3"
      } ],
      "employer" : {
        "email" : null,
        "phone_number" : null,
        "organization_number" : null,
        "name" : "Vrenezi, Remzi",
        "url" : null,
        "workplace" : "Munkebäck Sten & Anläggning"
      },
      "removed_date" : null,
      "logo_url" : null,
      "last_publication_date" : "2022-08-28T00:00:00",
      "number_of_vacancies" : 2,
      "occupation" : {
        "concept_id" : "Xkw4_BSP_dad",
        "label" : "Stensättare",
        "legacy_ams_taxonomy_id" : "5868"
      },
      "occupation_group" : {
        "concept_id" : "bZ4J_riZ_zK6",
        "label" : "Anläggningsarbetare",
        "legacy_ams_taxonomy_id" : "7114"
      },
      "employment_type" : {
        "concept_id" : "PFZr_Syz_cUq",
        "label" : "Vanlig anställning",
        "legacy_ams_taxonomy_id" : "1"
      },
      "webpage_url" : "https://arbetsformedlingen.se/platsbanken/annonser/26362975",
      "driving_license_required" : true,
      "application_contacts" : [ {
        "description" : null,
        "email" : "munkeback.stenanlaggning@gmail.com",
        "telephone" : "0709921136",
        "name" : "Remzi Vrenezi",
        "contact_type" : "0709921136"
      } ],
      "duration" : {
        "concept_id" : "a7uU_j21_mkL",
        "label" : "Tills vidare",
        "legacy_ams_taxonomy_id" : "1"
      },
      "nice_to_have" : {
        "education_level" : [ {
          "concept_id" : "asZm_TEQ_Srk",
          "weight" : 5,
          "label" : "Eftergymnasial utbildning två år eller längre",
          "legacy_ams_taxonomy_id" : "6"
        } ],
        "work_experiences" : [ {
          "concept_id" : "Xkw4_BSP_dad",
          "weight" : 5,
          "label" : "Stensättare",
          "legacy_ams_taxonomy_id" : "5868"
        } ],
        "skills" : [ ],
        "education" : [ {
          "concept_id" : "TVjf_K43_Tom",
          "weight" : 5,
          "label" : "Samhällsbyggnad och byggnadsteknik",
          "legacy_ams_taxonomy_id" : "17"
        } ],
        "languages" : [ {
          "concept_id" : "zSLA_vw2_FXN",
          "weight" : 5,
          "label" : "Svenska",
          "legacy_ams_taxonomy_id" : "502"
        } ]
      },
      "application_details" : {
        "via_af" : false,
        "email" : "munkeback.stenanlaggning@gmail.com",
        "other" : null,
        "reference" : "Markarbetare",
        "url" : null,
        "information" : null
      },
      "source_type" : "VIA_ANNONSERA",
      "application_deadline" : "2022-08-28T00:00:00",
      "external_id" : null,
      "workplace_address" : {
        "coordinates" : [ null, null ],
        "city" : null,
        "postcode" : null,
        "municipality" : null,
        "region_concept_id" : null,
        "region" : null,
        "country_code" : "199",
        "region_code" : null,
        "municipality_concept_id" : null,
        "country_concept_id" : "i46j_HmG_v64",
        "municipality_code" : null,
        "street_address" : null,
        "country" : "Sverige"
      },
      "id" : "26362975",
      "experience_required" : true,
      "working_hours_type" : {
        "concept_id" : "6YE1_gAC_R2G",
        "label" : "Heltid",
        "legacy_ams_taxonomy_id" : "1"
      },
      "access" : null,
      "timestamp" : 1659088620286,
      "must_have" : {
        "education_level" : [ ],
        "work_experiences" : [ ],
        "skills" : [ ],
        "education" : [ ],
        "languages" : [ ]
      },
      "occupation_field" : {
        "concept_id" : "j7Cq_ZJe_GkT",
        "label" : "Bygg och anläggning",
        "legacy_ams_taxonomy_id" : "2"
      },
      "scope_of_work" : {
        "min" : 0,
        "max" : 100
      },
      "salary_type" : {
        "concept_id" : "oG8G_9cW_nRf",
        "label" : "Fast månads- vecko- eller timlön",
        "legacy_ams_taxonomy_id" : "1"
      },
      "removed" : false,
      "salary_description" : null,
      "access_to_own_car" : false,
      "publication_date" : "2022-07-29T11:57:00"
    },
    "name" : "Bygg markarbetare",
    "user" : "hannes"
  },
  "sha1" : "ca02aab7ce9aa69dff0ba1bf69aaa80fa3ac7ca6",
  "annotations" : [ {
    "preferred-label" : "Anläggningsarbetare",
    "sentiment" : "MUST_HAVE",
    "type" : "ssyk-level-4",
    "start-position" : 26,
    "end-position" : 45,
    "concept-id" : "bZ4J_riZ_zK6",
    "matched-string" : "anläggningsarbetare",
    "annotation-id" : 0
  }, {
    "preferred-label" : "Stensättning",
    "sentiment" : "MUST_HAVE",
    "type" : "skill",
    "start-position" : 61,
    "end-position" : 73,
    "concept-id" : "njeW_wb3_Zry",
    "matched-string" : "stensättning",
    "annotation-id" : 1
  }, {
    "preferred-label" : "Betongarbete",
    "sentiment" : "MUST_HAVE",
    "type" : "skill",
    "start-position" : 129,
    "end-position" : 141,
    "concept-id" : "GnKk_qZt_CJv",
    "matched-string" : "betongarbete",
    "annotation-id" : 2
  } ],
  "text" : "Bygg markarbetare\nSöker 2 anläggningsarbetare som kan utföra stensättning ,kantsten , och olika diverse mindre jobb inom mur och betongarbete.\nÖppen för alla\nVi fokuserar på din kompetens, inte dina övriga förutsättningar. Vi är öppna för att anpassa rollen eller arbetsplatsen efter dina behov."
}