{
  "meta" : {
    "jobad" : {
      "description" : {
        "requirements" : null,
        "needs" : null,
        "company_information" : null,
        "text_formatted" : "<p><strong>Hej, </strong></p><p><strong> Tony Olsson här! En konditormästare &amp; sockerbagare i sina bästa dar. Det är jag som är produktionsansvarig på Thelins Konditori. Jag älskar att leka runt med råvaror och recept för att hitta nya smakkombinationer att överraska våra kunder med. Nu behöver jag och mina kollegor nya nyfikna och talangfulla stjärnor i vårt team så att vi kan bli ännu bättre. </strong></p><p><strong> </strong></p><p><strong>Vi arbetar tillsammans i vårat bageri i Gröndal där vi bakar en mängd godsaker, 7 dagar i veckan, dag som natt. Vi har butiker som ligger runt om i Stockholm samt en filial i Uppsala. Så en och annan fikaturné försöker vi ibland att hinna med för att träffa våra kollegor som arbetar ute i butikerna. </strong></p><p><strong> </strong></p><p><strong>Vi tycker om att skratta och ha roligt tillsammans samtidigt som vi försöker utmana oss själva i vårat arbete. För att passa in i vårat team krävs det därför att du är en person med både vilja och nyfikenhet. Vi vill också att du har erfarenhet inom yrket men är törstig på nya utmaningar. </strong></p><p><strong> </strong></p><p><strong>Då vi ständigt vill utveckla vårt sortiment och produkter önskar vi att du är en person som tycker att utveckling och kunskap är viktigt. Du bjuder ofta på ett glatt humör och är öppen för nya idéer och arbetssätt. Du är inte rädd för att ta dig an en utmaning och du trivs med att arbeta effektivt under ett högt tempo i en arbetsmiljö där det finns många bollar i luften. </strong></p><p><strong> </strong></p><p><strong>Om du känner dig taggad på att arbeta med oss kommer du få vara del av ett växande företag där vi har roligt på jobbet samtidigt som vi skapar lönsamhet. Vi arbetar både självständigt och i lag och tar väl vara på vår yrkeskunskap genom att dagligen baka produkterna förhand. </strong></p><p><strong> </strong></p><p> </p><p> </p><p><strong>BAGARE – DAGSARBETE</strong> </p><p> </p><p> Som dagbagare kommer ditt fokus att ligga på produktion av matbröd, frallor samt kaffebröd av högsta kvalité. </p><p><br></p><p> Vi ställer krav på att du ska vara utbildad som bagare eller konditor samt ha erfarenhet av yrket sedan tidigare. Vi håller ett högt arbetstempo i vårat bageri. Här utmanas vi med att baka stora volymer med bra råvaror, nästan uteslutande med händerna, för att alltid uppnå ett gediget slutresultat.</p><p><br></p><p>I arbete som dagbagare förläggs ordinarie arbete måndag – söndag. Inför storhelger går vi alla i produktionen gemensamt in och förbereder även på helger.</p><p><br></p><p><strong>Låter detta som något för dig?  Vill du bli en del utav vårat arbetslag? </strong></p><p><strong> </strong></p><p><strong>Varmt vvälkommen att söka till oss.</strong></p><p><strong> </strong></p><p><strong>Jag ser fram emot att komma i kontakt med dig på </strong></p><p><strong>tony@thelinskonditori.se</strong></p><p><strong> </strong></p><p><strong>Och du, kört hårt!! </strong></p><p><strong> </strong></p><p><strong>/Tony Olsson med team </strong></p>",
        "conditions" : null,
        "text" : "Hej, \n Tony Olsson här! En konditormästare & sockerbagare i sina bästa dar. Det är jag som är produktionsansvarig på Thelins Konditori. Jag älskar att leka runt med råvaror och recept för att hitta nya smakkombinationer att överraska våra kunder med. Nu behöver jag och mina kollegor nya nyfikna och talangfulla stjärnor i vårt team så att vi kan bli ännu bättre. \n \nVi arbetar tillsammans i vårat bageri i Gröndal där vi bakar en mängd godsaker, 7 dagar i veckan, dag som natt. Vi har butiker som ligger runt om i Stockholm samt en filial i Uppsala. Så en och annan fikaturné försöker vi ibland att hinna med för att träffa våra kollegor som arbetar ute i butikerna. \n \nVi tycker om att skratta och ha roligt tillsammans samtidigt som vi försöker utmana oss själva i vårat arbete. För att passa in i vårat team krävs det därför att du är en person med både vilja och nyfikenhet. Vi vill också att du har erfarenhet inom yrket men är törstig på nya utmaningar. \n \nDå vi ständigt vill utveckla vårt sortiment och produkter önskar vi att du är en person som tycker att utveckling och kunskap är viktigt. Du bjuder ofta på ett glatt humör och är öppen för nya idéer och arbetssätt. Du är inte rädd för att ta dig an en utmaning och du trivs med att arbeta effektivt under ett högt tempo i en arbetsmiljö där det finns många bollar i luften. \n \nOm du känner dig taggad på att arbeta med oss kommer du få vara del av ett växande företag där vi har roligt på jobbet samtidigt som vi skapar lönsamhet. Vi arbetar både självständigt och i lag och tar väl vara på vår yrkeskunskap genom att dagligen baka produkterna förhand. \n \n \n \nBAGARE – DAGSARBETE \n \n Som dagbagare kommer ditt fokus att ligga på produktion av matbröd, frallor samt kaffebröd av högsta kvalité. \n\n\n Vi ställer krav på att du ska vara utbildad som bagare eller konditor samt ha erfarenhet av yrket sedan tidigare. Vi håller ett högt arbetstempo i vårat bageri. Här utmanas vi med att baka stora volymer med bra råvaror, nästan uteslutande med händerna, för att alltid uppnå ett gediget slutresultat.\n\n\nI arbete som dagbagare förläggs ordinarie arbete måndag – söndag. Inför storhelger går vi alla i produktionen gemensamt in och förbereder även på helger.\n\n\nLåter detta som något för dig?  Vill du bli en del utav vårat arbetslag? \n \nVarmt vvälkommen att söka till oss.\n \nJag ser fram emot att komma i kontakt med dig på \ntony@thelinskonditori.se\n \nOch du, kört hårt!! \n \n/Tony Olsson med team"
      },
      "headline" : "BAGARE",
      "driving_license" : null,
      "employer" : {
        "email" : null,
        "phone_number" : null,
        "organization_number" : "5566574777",
        "name" : "D & E Konditori AB",
        "url" : null,
        "workplace" : "D & E Konditori AB / Thelins Konditori"
      },
      "removed_date" : null,
      "logo_url" : "https://www.arbetsformedlingen.se/rest/arbetsgivare/rest/af/v3/arbetsplatser/81033724/logotyper/logo.png",
      "last_publication_date" : "2022-09-02T23:59:59",
      "number_of_vacancies" : 1,
      "occupation" : {
        "concept_id" : "XugJ_6hw_wVV",
        "label" : "Bagare/Konditor",
        "legacy_ams_taxonomy_id" : "5504"
      },
      "occupation_group" : {
        "concept_id" : "5qT8_z9d_8rw",
        "label" : "Bagare och konditorer",
        "legacy_ams_taxonomy_id" : "7612"
      },
      "employment_type" : {
        "concept_id" : "PFZr_Syz_cUq",
        "label" : "Vanlig anställning",
        "legacy_ams_taxonomy_id" : "1"
      },
      "webpage_url" : "https://arbetsformedlingen.se/platsbanken/annonser/26376197",
      "driving_license_required" : false,
      "application_contacts" : [ ],
      "duration" : {
        "concept_id" : "a7uU_j21_mkL",
        "label" : "Tills vidare",
        "legacy_ams_taxonomy_id" : "1"
      },
      "nice_to_have" : {
        "education_level" : [ ],
        "work_experiences" : [ {
          "concept_id" : "XugJ_6hw_wVV",
          "weight" : 5,
          "label" : "Bagare/Konditor",
          "legacy_ams_taxonomy_id" : "5504"
        } ],
        "skills" : [ ],
        "education" : [ ],
        "languages" : [ ]
      },
      "application_details" : {
        "via_af" : false,
        "email" : "tony@thelinskonditori.se",
        "other" : null,
        "reference" : null,
        "url" : null,
        "information" : null
      },
      "source_type" : "VIA_ANNONSERA",
      "application_deadline" : "2022-09-02T23:59:59",
      "external_id" : null,
      "workplace_address" : {
        "coordinates" : [ 18.02704451604158, 59.33099011443293 ],
        "city" : "Stockholm",
        "postcode" : "10420",
        "municipality" : "Stockholm",
        "region_concept_id" : "CifL_Rzy_Mku",
        "region" : "Stockholms län",
        "country_code" : "199",
        "region_code" : "01",
        "municipality_concept_id" : "AvNB_uwa_6n6",
        "country_concept_id" : "i46j_HmG_v64",
        "municipality_code" : "0180",
        "street_address" : "Sankt Eriksgatan 43",
        "country" : "Sverige"
      },
      "id" : "26376197",
      "experience_required" : true,
      "working_hours_type" : {
        "concept_id" : "6YE1_gAC_R2G",
        "label" : "Heltid",
        "legacy_ams_taxonomy_id" : "1"
      },
      "access" : null,
      "timestamp" : 1659561590285,
      "must_have" : {
        "education_level" : [ ],
        "work_experiences" : [ ],
        "skills" : [ ],
        "education" : [ ],
        "languages" : [ ]
      },
      "occupation_field" : {
        "concept_id" : "PaxQ_o1G_wWH",
        "label" : "Hantverk",
        "legacy_ams_taxonomy_id" : "6"
      },
      "scope_of_work" : {
        "min" : 0,
        "max" : 100
      },
      "salary_type" : {
        "concept_id" : "oG8G_9cW_nRf",
        "label" : "Fast månads- vecko- eller timlön",
        "legacy_ams_taxonomy_id" : "1"
      },
      "removed" : false,
      "salary_description" : null,
      "access_to_own_car" : false,
      "publication_date" : "2022-08-03T23:19:50"
    },
    "name" : "BAGARE",
    "user" : "hannes"
  },
  "sha1" : "6957f17d0a9960e0cd6936dd664499b19bd51383",
  "annotations" : [ {
    "preferred-label" : "bagare",
    "sentiment" : "MUST_HAVE",
    "type" : "esco-occupation",
    "start-position" : 0,
    "end-position" : 6,
    "concept-id" : "Zo8A_5ML_j3t",
    "matched-string" : "bagare",
    "annotation-id" : 0
  }, {
    "preferred-label" : "Sockerbagare",
    "sentiment" : "MUST_HAVE",
    "type" : "keyword",
    "start-position" : 52,
    "end-position" : 64,
    "concept-id" : "hAQC_UgX_Shf",
    "matched-string" : "sockerbagare",
    "annotation-id" : 1
  }, {
    "preferred-label" : "Stockholm",
    "type" : "municipality",
    "start-position" : 522,
    "end-position" : 531,
    "concept-id" : "AvNB_uwa_6n6",
    "matched-string" : "Stockholm",
    "annotation-id" : 7
  }, {
    "preferred-label" : "Uppsala",
    "type" : "municipality",
    "start-position" : 549,
    "end-position" : 556,
    "concept-id" : "otaF_bQY_4ZD",
    "matched-string" : "Uppsala",
    "annotation-id" : 8
  }, {
    "preferred-label" : "arbetsmiljö",
    "sentiment" : "MUST_HAVE",
    "type" : "esco-skill",
    "start-position" : 1296,
    "end-position" : 1307,
    "concept-id" : "zdQY_QJh_nUH",
    "matched-string" : "arbetsmiljö",
    "annotation-id" : 2
  }, {
    "preferred-label" : "bagare",
    "sentiment" : "MUST_HAVE",
    "type" : "esco-occupation",
    "start-position" : 1631,
    "end-position" : 1637,
    "concept-id" : "Zo8A_5ML_j3t",
    "matched-string" : "bagare",
    "annotation-id" : 3
  }, {
    "preferred-label" : "Matbröd",
    "sentiment" : "MUST_HAVE",
    "type" : "skill",
    "start-position" : 1714,
    "end-position" : 1721,
    "concept-id" : "gzxa_drN_Uud",
    "matched-string" : "matbröd",
    "annotation-id" : 4
  }, {
    "preferred-label" : "bagare",
    "sentiment" : "MUST_HAVE",
    "type" : "esco-occupation",
    "start-position" : 1817,
    "end-position" : 1823,
    "concept-id" : "Zo8A_5ML_j3t",
    "matched-string" : "bagare",
    "annotation-id" : 5
  }, {
    "preferred-label" : "Bagare/Konditor",
    "sentiment" : "MUST_HAVE",
    "type" : "occupation-name",
    "start-position" : 1830,
    "end-position" : 1838,
    "concept-id" : "XugJ_6hw_wVV",
    "matched-string" : "konditor",
    "annotation-id" : 6
  } ],
  "text" : "BAGARE\nHej, \n Tony Olsson här! En konditormästare & sockerbagare i sina bästa dar. Det är jag som är produktionsansvarig på Thelins Konditori. Jag älskar att leka runt med råvaror och recept för att hitta nya smakkombinationer att överraska våra kunder med. Nu behöver jag och mina kollegor nya nyfikna och talangfulla stjärnor i vårt team så att vi kan bli ännu bättre. \n \nVi arbetar tillsammans i vårat bageri i Gröndal där vi bakar en mängd godsaker, 7 dagar i veckan, dag som natt. Vi har butiker som ligger runt om i Stockholm samt en filial i Uppsala. Så en och annan fikaturné försöker vi ibland att hinna med för att träffa våra kollegor som arbetar ute i butikerna. \n \nVi tycker om att skratta och ha roligt tillsammans samtidigt som vi försöker utmana oss själva i vårat arbete. För att passa in i vårat team krävs det därför att du är en person med både vilja och nyfikenhet. Vi vill också att du har erfarenhet inom yrket men är törstig på nya utmaningar. \n \nDå vi ständigt vill utveckla vårt sortiment och produkter önskar vi att du är en person som tycker att utveckling och kunskap är viktigt. Du bjuder ofta på ett glatt humör och är öppen för nya idéer och arbetssätt. Du är inte rädd för att ta dig an en utmaning och du trivs med att arbeta effektivt under ett högt tempo i en arbetsmiljö där det finns många bollar i luften. \n \nOm du känner dig taggad på att arbeta med oss kommer du få vara del av ett växande företag där vi har roligt på jobbet samtidigt som vi skapar lönsamhet. Vi arbetar både självständigt och i lag och tar väl vara på vår yrkeskunskap genom att dagligen baka produkterna förhand. \n \n \n \nBAGARE – DAGSARBETE \n \n Som dagbagare kommer ditt fokus att ligga på produktion av matbröd, frallor samt kaffebröd av högsta kvalité. \n\n\n Vi ställer krav på att du ska vara utbildad som bagare eller konditor samt ha erfarenhet av yrket sedan tidigare. Vi håller ett högt arbetstempo i vårat bageri. Här utmanas vi med att baka stora volymer med bra råvaror, nästan uteslutande med händerna, för att alltid uppnå ett gediget slutresultat.\n\n\nI arbete som dagbagare förläggs ordinarie arbete måndag – söndag. Inför storhelger går vi alla i produktionen gemensamt in och förbereder även på helger.\n\n\nLåter detta som något för dig?  Vill du bli en del utav vårat arbetslag? \n \nVarmt vvälkommen att söka till oss.\n \nJag ser fram emot att komma i kontakt med dig på \ntony@thelinskonditori.se\n \nOch du, kört hårt!! \n \n/Tony Olsson med team"
}