{
  "meta" : {
    "jobad" : {
      "description" : {
        "requirements" : null,
        "needs" : null,
        "company_information" : null,
        "text_formatted" : "CHiÔi är en modern vietnamesisk restaurang som ligger oss varmt om hjärtat. Relativt nyöppnad restaurang mitt i city, Mäster Samuelsgatan 39. Med äkta vietnamesisk mat med ett modernt / skandinaviskt upplägg, i en modern, cool miljö. Vi är ett glatt och drivet team som gillar mat och matens historia.\n\nSom servis ser vi att:\n\nDu bör ha erfarenhet med bordservering. Vara social och gilla att prata och att ge service på hög nivå är inga konstigheter för dig. Gilla att jobba i högt tempo. Du har ett intresse för mat och dryck är ett plus.\n\nVad kan vi erbjuda dig?\n\nDu kommer att få delta i ett väldigt familjärt team. Vi är fortfarande en relativt ny restaurang där vi ständigt jobbar på att utveckla CHiÔi och där ser vi gärna att personalen är delaktig.\n\nÄr du vår nya stjärna? Skicka in din ansökan så berättar jag mer!",
        "conditions" : "Deltid\r\nProvanställning 6 månader",
        "text" : "CHiÔi är en modern vietnamesisk restaurang som ligger oss varmt om hjärtat. Relativt nyöppnad restaurang mitt i city, Mäster Samuelsgatan 39. Med äkta vietnamesisk mat med ett modernt / skandinaviskt upplägg, i en modern, cool miljö. Vi är ett glatt och drivet team som gillar mat och matens historia.\n\nSom servis ser vi att:\n\nDu bör ha erfarenhet med bordservering. Vara social och gilla att prata och att ge service på hög nivå är inga konstigheter för dig. Gilla att jobba i högt tempo. Du har ett intresse för mat och dryck är ett plus.\n\nVad kan vi erbjuda dig?\n\nDu kommer att få delta i ett väldigt familjärt team. Vi är fortfarande en relativt ny restaurang där vi ständigt jobbar på att utveckla CHiÔi och där ser vi gärna att personalen är delaktig.\n\nÄr du vår nya stjärna? Skicka in din ansökan så berättar jag mer!"
      },
      "headline" : "Extraservis på CHiÔi kväll och helg",
      "driving_license" : null,
      "employer" : {
        "email" : null,
        "phone_number" : null,
        "organization_number" : "5569970113",
        "name" : "Se ngroup AB",
        "url" : "http://www.example.com",
        "workplace" : "SENGROUP"
      },
      "removed_date" : null,
      "logo_url" : "https://www.arbetsformedlingen.se/rest/arbetsgivare/rest/af/v3/organisation/5569970113/logotyper/logo.png",
      "last_publication_date" : "2022-09-30T23:59:59",
      "number_of_vacancies" : 1,
      "occupation" : {
        "concept_id" : "rGGf_KLs_To7",
        "label" : "Servitör/Servitris",
        "legacy_ams_taxonomy_id" : "5487"
      },
      "occupation_group" : {
        "concept_id" : "UjoW_meY_Zwt",
        "label" : "Hovmästare och servitörer",
        "legacy_ams_taxonomy_id" : "5131"
      },
      "employment_type" : {
        "concept_id" : "PFZr_Syz_cUq",
        "label" : "Vanlig anställning",
        "legacy_ams_taxonomy_id" : "1"
      },
      "webpage_url" : "https://arbetsformedlingen.se/platsbanken/annonser/26390244",
      "driving_license_required" : false,
      "application_contacts" : [ {
        "description" : "Ida Fjellström",
        "email" : null,
        "telephone" : null,
        "name" : null,
        "contact_type" : null
      } ],
      "duration" : {
        "concept_id" : "Xj7x_7yZ_jEn",
        "label" : "3 månader – upp till 6 månader",
        "legacy_ams_taxonomy_id" : "3"
      },
      "nice_to_have" : {
        "education_level" : [ ],
        "work_experiences" : [ ],
        "skills" : [ ],
        "education" : [ ],
        "languages" : [ ]
      },
      "application_details" : {
        "via_af" : false,
        "email" : null,
        "other" : null,
        "reference" : null,
        "url" : "https://jobs.sengroup.se/jobs/1719924-extraservis-pa-chioi-kvall-och-helg?promotion=395710-arbetsformedlingen",
        "information" : null
      },
      "source_type" : "VIA_PLATSBANKEN_DXA",
      "application_deadline" : "2022-09-30T23:59:59",
      "external_id" : "46-556997-0113-1719924-21",
      "workplace_address" : {
        "coordinates" : [ 18.06858, 59.329323 ],
        "city" : null,
        "postcode" : null,
        "municipality" : "Stockholm",
        "region_concept_id" : "CifL_Rzy_Mku",
        "region" : "Stockholms län",
        "country_code" : "199",
        "region_code" : "01",
        "municipality_concept_id" : "AvNB_uwa_6n6",
        "country_concept_id" : "i46j_HmG_v64",
        "municipality_code" : "0180",
        "street_address" : null,
        "country" : "Sverige"
      },
      "id" : "26390244",
      "experience_required" : false,
      "working_hours_type" : {
        "concept_id" : "947z_JGS_Uk2",
        "label" : "Deltid",
        "legacy_ams_taxonomy_id" : "2"
      },
      "access" : null,
      "timestamp" : 1660033096988,
      "must_have" : {
        "education_level" : [ ],
        "work_experiences" : [ ],
        "skills" : [ ],
        "education" : [ ],
        "languages" : [ ]
      },
      "occupation_field" : {
        "concept_id" : "ScKy_FHB_7wT",
        "label" : "Hotell, restaurang, storhushåll",
        "legacy_ams_taxonomy_id" : "7"
      },
      "scope_of_work" : {
        "min" : 0,
        "max" : 100
      },
      "salary_type" : {
        "concept_id" : "oG8G_9cW_nRf",
        "label" : "Fast månads- vecko- eller timlön",
        "legacy_ams_taxonomy_id" : "1"
      },
      "removed" : false,
      "salary_description" : "Lön enligt överenskommelse",
      "access_to_own_car" : false,
      "publication_date" : "2022-08-09T10:18:16"
    },
    "name" : "Extraservis på CHiÔi kväll och helg",
    "user" : "hannes"
  },
  "sha1" : "e7feb638d2d1a69121d5584fd2d6209dca3f0f9f",
  "annotations" : [ {
    "preferred-label" : "Restaurang",
    "sentiment" : "MUST_HAVE",
    "type" : "keyword",
    "start-position" : 68,
    "end-position" : 78,
    "concept-id" : "o2Cg_3Ap_qvK",
    "matched-string" : "restaurang",
    "annotation-id" : 0
  }, {
    "preferred-label" : "Restaurang",
    "sentiment" : "MUST_HAVE",
    "type" : "keyword",
    "start-position" : 130,
    "end-position" : 140,
    "concept-id" : "o2Cg_3Ap_qvK",
    "matched-string" : "restaurang",
    "annotation-id" : 1
  }, {
    "preferred-label" : "Servis",
    "sentiment" : "MUST_HAVE",
    "type" : "keyword",
    "start-position" : 343,
    "end-position" : 349,
    "concept-id" : "7coY_HT4_rJc",
    "matched-string" : "servis",
    "annotation-id" : 3
  }, {
    "preferred-label" : "Restaurang",
    "sentiment" : "MUST_HAVE",
    "type" : "keyword",
    "start-position" : 689,
    "end-position" : 699,
    "concept-id" : "o2Cg_3Ap_qvK",
    "matched-string" : "restaurang",
    "annotation-id" : 4
  } ],
  "text" : "Extraservis på CHiÔi kväll och helg\nCHiÔi är en modern vietnamesisk restaurang som ligger oss varmt om hjärtat. Relativt nyöppnad restaurang mitt i city, Mäster Samuelsgatan 39. Med äkta vietnamesisk mat med ett modernt / skandinaviskt upplägg, i en modern, cool miljö. Vi är ett glatt och drivet team som gillar mat och matens historia.\n\nSom servis ser vi att:\n\nDu bör ha erfarenhet med bordservering. Vara social och gilla att prata och att ge service på hög nivå är inga konstigheter för dig. Gilla att jobba i högt tempo. Du har ett intresse för mat och dryck är ett plus.\n\nVad kan vi erbjuda dig?\n\nDu kommer att få delta i ett väldigt familjärt team. Vi är fortfarande en relativt ny restaurang där vi ständigt jobbar på att utveckla CHiÔi och där ser vi gärna att personalen är delaktig.\n\nÄr du vår nya stjärna? Skicka in din ansökan så berättar jag mer!"
}