{
  "meta" : {
    "jobad" : {
      "description" : {
        "requirements" : null,
        "needs" : null,
        "company_information" : null,
        "text_formatted" : "<p>Vi söker efter dig som verkligen brinner för ditt hantverk. Vi har byggt upp en trogen kundkrets och välkomnar varje dag nya som gamla kunder. Din service känsla är viktig för oss men viktigast av allt att du kan ta till dig vår anda och leverera klippningar och skäggvård med högklass! Våra kunder är både svenska och internationella så du behöver behärska svenska eller engelska. </p><p>Om du tror att du är den vi söker så är du välkommen att boka in ett möte, skicka ett CV till oss.</p>",
        "conditions" : null,
        "text" : "Vi söker efter dig som verkligen brinner för ditt hantverk. Vi har byggt upp en trogen kundkrets och välkomnar varje dag nya som gamla kunder. Din service känsla är viktig för oss men viktigast av allt att du kan ta till dig vår anda och leverera klippningar och skäggvård med högklass! Våra kunder är både svenska och internationella så du behöver behärska svenska eller engelska. \nOm du tror att du är den vi söker så är du välkommen att boka in ett möte, skicka ett CV till oss."
      },
      "headline" : "Herrfrisör/Barberare",
      "driving_license" : null,
      "employer" : {
        "email" : null,
        "phone_number" : null,
        "organization_number" : "5568628365",
        "name" : "Pinchers Barber Shop AB",
        "url" : "www.pinchersbarbershop.com",
        "workplace" : "Pinchers Barber Shop AB"
      },
      "removed_date" : null,
      "logo_url" : "https://www.arbetsformedlingen.se/rest/arbetsgivare/rest/af/v3/arbetsplatser/86032311/logotyper/logo.png",
      "last_publication_date" : "2022-08-24T23:59:59",
      "number_of_vacancies" : 1,
      "occupation" : {
        "concept_id" : "84wd_wvd_zH8",
        "label" : "Herrfrisör",
        "legacy_ams_taxonomy_id" : "241"
      },
      "occupation_group" : {
        "concept_id" : "LyBp_bY6_bZK",
        "label" : "Frisörer",
        "legacy_ams_taxonomy_id" : "5141"
      },
      "employment_type" : {
        "concept_id" : "PFZr_Syz_cUq",
        "label" : "Vanlig anställning",
        "legacy_ams_taxonomy_id" : "1"
      },
      "webpage_url" : "https://arbetsformedlingen.se/platsbanken/annonser/23178662",
      "driving_license_required" : false,
      "application_contacts" : [ ],
      "duration" : {
        "concept_id" : "a7uU_j21_mkL",
        "label" : "Tills vidare",
        "legacy_ams_taxonomy_id" : "1"
      },
      "nice_to_have" : {
        "education_level" : [ ],
        "work_experiences" : [ {
          "concept_id" : "84wd_wvd_zH8",
          "weight" : 5,
          "label" : "Herrfrisör",
          "legacy_ams_taxonomy_id" : "241"
        } ],
        "skills" : [ ],
        "education" : [ ],
        "languages" : [ ]
      },
      "application_details" : {
        "via_af" : false,
        "email" : "pinchers1@hotmail.com",
        "other" : null,
        "reference" : "Barberare",
        "url" : null,
        "information" : null
      },
      "source_type" : "VIA_ANNONSERA",
      "application_deadline" : "2022-08-24T23:59:59",
      "external_id" : null,
      "workplace_address" : {
        "coordinates" : [ 11.950216034301375, 57.699270053791665 ],
        "city" : "Göteborg",
        "postcode" : "41303",
        "municipality" : "Göteborg",
        "region_concept_id" : "zdoY_6u5_Krt",
        "region" : "Västra Götalands län",
        "country_code" : "199",
        "region_code" : "14",
        "municipality_concept_id" : "PVZL_BQT_XtL",
        "country_concept_id" : "i46j_HmG_v64",
        "municipality_code" : "1480",
        "street_address" : "Andra Långgatan 8",
        "country" : "Sverige"
      },
      "id" : "23178662",
      "experience_required" : true,
      "working_hours_type" : {
        "concept_id" : "6YE1_gAC_R2G",
        "label" : "Heltid",
        "legacy_ams_taxonomy_id" : "1"
      },
      "access" : null,
      "timestamp" : 1658757700290,
      "must_have" : {
        "education_level" : [ ],
        "work_experiences" : [ ],
        "skills" : [ ],
        "education" : [ ],
        "languages" : [ ]
      },
      "occupation_field" : {
        "concept_id" : "Uuf1_GMh_Uvw",
        "label" : "Kropps- och skönhetsvård",
        "legacy_ams_taxonomy_id" : "4"
      },
      "scope_of_work" : {
        "min" : 0,
        "max" : 100
      },
      "salary_type" : {
        "concept_id" : "oG8G_9cW_nRf",
        "label" : "Fast månads- vecko- eller timlön",
        "legacy_ams_taxonomy_id" : "1"
      },
      "removed" : false,
      "salary_description" : null,
      "access_to_own_car" : false,
      "publication_date" : "2022-07-25T16:01:40"
    },
    "name" : "Herrfrisör/Barberare",
    "user" : "kristof.fischer"
  },
  "sha1" : "fcc3dd33f46ef884e0a1dfe4f2af36b55d9ab9b6",
  "annotations" : [ {
    "preferred-label" : "Herrfrisör",
    "sentiment" : "MUST_HAVE",
    "type" : "occupation-name",
    "start-position" : 0,
    "end-position" : 10,
    "concept-id" : "84wd_wvd_zH8",
    "matched-string" : "herrfrisör",
    "annotation-id" : 0
  }, {
    "preferred-label" : "Barberare",
    "sentiment" : "MUST_HAVE",
    "type" : "occupation-name",
    "start-position" : 11,
    "end-position" : 20,
    "concept-id" : "hDzC_BF5_Wz2",
    "matched-string" : "barberare",
    "annotation-id" : 1
  }, {
    "preferred-label" : "hårklippningstekniker",
    "sentiment" : "MUST_HAVE",
    "type" : "esco-skill",
    "start-position" : 268,
    "end-position" : 279,
    "concept-id" : "ctoB_kAr_kEo",
    "matched-string" : "klippningar",
    "annotation-id" : 6
  }, {
    "preferred-label" : "behandla skägg och mustascher",
    "sentiment" : "MUST_HAVE",
    "type" : "esco-skill",
    "start-position" : 284,
    "end-position" : 293,
    "concept-id" : "TD6B_28Q_wDn",
    "matched-string" : "skäggvård",
    "annotation-id" : 7
  }, {
    "preferred-label" : "Svenska",
    "sentiment" : "MUST_HAVE",
    "type" : "language",
    "start-position" : 379,
    "end-position" : 386,
    "concept-id" : "zSLA_vw2_FXN",
    "matched-string" : "svenska",
    "annotation-id" : 4
  }, {
    "preferred-label" : "Engelska",
    "sentiment" : "MUST_HAVE",
    "type" : "language",
    "start-position" : 393,
    "end-position" : 401,
    "concept-id" : "NVxJ_hLg_TYS",
    "matched-string" : "engelska",
    "annotation-id" : 5
  } ],
  "text" : "Herrfrisör/Barberare\nVi söker efter dig som verkligen brinner för ditt hantverk. Vi har byggt upp en trogen kundkrets och välkomnar varje dag nya som gamla kunder. Din service känsla är viktig för oss men viktigast av allt att du kan ta till dig vår anda och leverera klippningar och skäggvård med högklass! Våra kunder är både svenska och internationella så du behöver behärska svenska eller engelska. \nOm du tror att du är den vi söker så är du välkommen att boka in ett möte, skicka ett CV till oss."
}