{
  "meta" : {
    "dataset-id" : "myh-spreadsheet-2021",
    "type" : "education-description",
    "dataset-document-id" : "YH01533",
    "user" : "kristof.fischer"
  },
  "sha1" : "3c51ba1cc3698a769c1e76092c57659228f07f84",
  "annotations" : [ {
    "preferred-label" : "Dataingenjör",
    "sentiment" : "OFFERED",
    "type" : "occupation-name",
    "start-position" : 0,
    "end-position" : 14,
    "concept-id" : "9U5Y_9Ji_uJq",
    "matched-string" : "Systemingenjör",
    "annotation-id" : 9
  }, {
    "preferred-label" : "Dataingenjör",
    "sentiment" : "OFFERED",
    "type" : "occupation-name",
    "start-position" : 40,
    "end-position" : 54,
    "concept-id" : "9U5Y_9Ji_uJq",
    "matched-string" : "systemingenjör",
    "annotation-id" : 10
  }, {
    "preferred-label" : "Data/IT",
    "sentiment" : "OFFERED",
    "type" : "occupation-field",
    "start-position" : 97,
    "end-position" : 99,
    "concept-id" : "apaJ_2ja_LuF",
    "matched-string" : "it",
    "annotation-id" : 2
  }, {
    "preferred-label" : "arbeta självständigt",
    "sentiment" : "OFFERED",
    "type" : "esco-skill",
    "start-position" : 563,
    "end-position" : 609,
    "concept-id" : "NyFu_HHd_zhz",
    "matched-string" : "självständigt fungera i en projektorganisation",
    "annotation-id" : 11
  }, {
    "preferred-label" : "granska projektbestämmelser",
    "sentiment" : "OFFERED",
    "type" : "esco-skill",
    "start-position" : 634,
    "end-position" : 641,
    "concept-id" : "gr89_XTH_tY2",
    "matched-string" : "granska",
    "annotation-id" : 13
  }, {
    "preferred-label" : "föreslå ändringar",
    "sentiment" : "OFFERED",
    "type" : "esco-skill",
    "start-position" : 646,
    "end-position" : 666,
    "concept-id" : "YJUz_D2k_VFb",
    "matched-string" : "föreslå förändringar",
    "annotation-id" : 12
  }, {
    "preferred-label" : "Dataingenjör",
    "sentiment" : "OFFERED",
    "type" : "occupation-name",
    "start-position" : 754,
    "end-position" : 768,
    "concept-id" : "9U5Y_9Ji_uJq",
    "matched-string" : "systemingenjör",
    "annotation-id" : 4
  }, {
    "preferred-label" : "Drifttekniker, IT",
    "sentiment" : "OFFERED",
    "type" : "ssyk-level-4",
    "start-position" : 770,
    "end-position" : 783,
    "concept-id" : "13md_uyV_BNG",
    "matched-string" : "Driftoperatör",
    "annotation-id" : 15
  }, {
    "preferred-label" : "Drifttekniker, IT",
    "sentiment" : "OFFERED",
    "type" : "ssyk-level-4",
    "start-position" : 785,
    "end-position" : 797,
    "concept-id" : "13md_uyV_BNG",
    "matched-string" : "Driftsättare",
    "annotation-id" : 14
  }, {
    "preferred-label" : "Nätverkstekniker",
    "sentiment" : "OFFERED",
    "type" : "occupation-name",
    "start-position" : 799,
    "end-position" : 815,
    "concept-id" : "Nkbd_wa9_TZF",
    "matched-string" : "nätverkstekniker",
    "annotation-id" : 5
  }, {
    "preferred-label" : "Helpdesktekniker/Supporttekniker",
    "sentiment" : "OFFERED",
    "type" : "occupation-name",
    "start-position" : 817,
    "end-position" : 832,
    "concept-id" : "KQty_E1u_cia",
    "matched-string" : "supporttekniker",
    "annotation-id" : 6
  }, {
    "preferred-label" : "Projektledare, IT",
    "sentiment" : "OFFERED",
    "type" : "occupation-name",
    "start-position" : 837,
    "end-position" : 858,
    "concept-id" : "z5AM_ayf_WcL",
    "matched-string" : "teknisk projektledare",
    "annotation-id" : 16
  }, {
    "preferred-label" : null,
    "sentiment" : "MUST_HAVE",
    "type" : "skill",
    "start-position" : 1113,
    "end-position" : 1157,
    "concept-id" : null,
    "matched-string" : "Grundläggande behörighet till yrkeshögskolan",
    "annotation-id" : 17
  }, {
    "preferred-label" : "Annan utbildning i elektronik, datateknik och automation",
    "sentiment" : "MUST_HAVE",
    "type" : "sun-education-field-4",
    "start-position" : 1203,
    "end-position" : 1227,
    "concept-id" : "3tq2_f1E_Lyh",
    "matched-string" : "Data- och nätverksteknik",
    "annotation-id" : 18
  } ],
  "text" : "Systemingenjör -bli klar om 2 år    Som systemingenjör kommer dina arbetsuppgifter att vara inom IT. Beroende på vilket företag du arbetar på kan arbetsuppgifterna variera stort. Arbetsmarknaden är mycket god för systemingenjörer och många stora arbetsgivare ser stor brist på arbetskraft.      Du kommer efter utbildningen att ha kunskaper inom på marknaden förekommande nätverks- och transmissionstekniker. Olika IT-säkerhetslösningar och kommunikations stödtjänster, Visualiseringsplattformar och praktiskt och teoretisk felsökning. Du får kompetenser för att självständigt fungera i en projektorganisation samt att kritiskt kunna granska och föreslå förändringar inom och utanför projektet.     Efter utbildningen kommer du att kunna söka arbete som Systemingenjör, Driftoperatör, Driftsättare, Nätverkstekniker, Supporttekniker och teknisk projektledare.      I utbildningen ingår 100 poäng LIA, vilket gör dig väl förberedd för arbetsmarknaden.     Våra samarbetspartners i utbildningen är:  SAAB, Försvarsmakten, Semcon, E-on, FMV, Comitech, Teracom, Netropolis, Arboga Kommun, Telliq     Förkunskapskrav  Grundläggande behörighet till yrkeshögskolan, samt särskild behörighet - godkänt i kursen Data- och nätverksteknik eller motsvarande.  "
}