{
  "meta" : {
    "jobad" : {
      "description" : {
        "requirements" : null,
        "needs" : null,
        "company_information" : null,
        "text_formatted" : "Vill du värna om Sverige och vår rätt att leva som vi själva väljer i en digitaliserad värld?Världen över så ökar antalet attacker över internet mot datorer och servrar, vilket kan få stora konsekvenser för samhällsviktiga funktioner och kritiska it-system. Försvarsmakten utvecklas och anpassar sig för att stärka Sveriges cyberförmåga ytterligare.\n\nFörsvarsmaktens cyberförsvar söker nu systemadministratörer. Vi söker dig som har erfarenhet av systemadministration och som vill utvecklas i en stimulerande och unik miljö.\n\nOm befattningen\n\nI befattningen kommer du att arbeta med design, installation, konfiguration, härdning, och övervakning av servrar och klienter. Målet är att säkerställa att alla inom verksamheten har en tillförlitlig och säker it-miljö att arbeta i. Du kommer att få ta ansvar för verksamhetskritiska system med höga säkerhetskrav med hjälp av moderna verktyg och tekniker.\n\nDina huvudsakliga arbetsuppgifter är:\n\n* Installera, konfigurera och övervaka hårdvara, tjänster och applikationer.\n\n* Ta fram design av nya tjänster och applikationer eller uppdatera befintliga.\n\n* Ta fram specifikationer för hårdvara som krävs för att kunna köra befintliga eller planerade tjänster och applikationer på.\n\n* Delta i att ha en fungerande process för säkerhetskopiering och återställning.\n\nKvalifikationer\n\n* Minst två års erfarenhet av arbete som systemadministratör.\n\n* Dokumenterad erfarenhet av Linux och Windows.\n\n* Goda kunskaper inom it- och nätverksteknik.\n\n* Kunskaper inom automatisering och skriptning (Ansible, Python, Bash, Powershell, m m).\n\n* Eftergymnasial utbildning eller kunskaper förvärvade genom relevant arbetslivserfarenhet.\n\n* God förmåga att uttrycka dig i tal och skrift på svenska och engelska.\n\nMeriterande\n\n* Erfarenhet av Active Directory/Samba.\n\n* Erfarenhet av Public Key Infrastructure (PKI).\n\n* Erfarenhet av infrastruktur som kod.\n\n* Certifieringar inom Linux och Windows.\n\n* IT-säkerhetsrelaterade certifieringar.\n\nPersonliga kvalifikationer\n\nVi lägger stor vikt vid dina personliga egenskaper, du behöver vara analytisk och noggrann. Du vågar ta initiativ i ditt dagliga arbete och har viljan att fortsätta utvecklas i din yrkesroll. Du har en god förmåga att samarbeta med andra men kan också arbeta självständigt. För att trivas hos oss behöver du ha ett högt säkerhetsmedvetande och tillämpa ett kritiskt och sakligt förhållningssätt.\n\nÖvrigt\n\nDu bör inte berätta att du sökt tjänst hos Försvarsmakten för andra personer än dina närmast berörda. Anledningen till att vi ber dig vara återhållsam med informationen är att det finns tjänster inom området som omfattas av sekretess. Arbete på annan ort samt beredskap och skiftarbete kan förekomma.Resor i tjänsten kan förekomma både nationellt och internationellt. Anställningsform, tillsvidareanställning, 6 månaders provanställning tillämpas om du inte är anställd inom Försvarsmakten. Placeringsort, Stockholm.Tillträde enligt överenskommelse. Frågor om tjänsten mejlas till cyberintresse@mil.se\n\nDin ansökan vill vi ha senast den 2022-08-21, ansökan med meritförteckning skickas till cyberintresse@mil.se ange referens 803342 eller via brev till Försvarsmakten Högkvarteret/LEDS CIO Cyberförsvar, Lidingövägen 24, 115 57 Stockholm, märk kuvertet ”Ansökan” och ange annonsens referens.\n\n\n--------------------------------------------------------\nInformation om Försvarsmakten och det rekryterande förbandet:\n\nI Högkvarteret (HKV) finns överbefälhavaren (ÖB) och generaldirektören (GD), vilka för närvarande har ungefär 1 000 medarbetare – både yrkesofficerare och civila experter. Högkvarteret  utgörs av ledningsstaben, produktionsledningen, insatsledningen och militära underrättelse- och säkerhetstjänsten. I ledningsstaben ingår bland annat ekonomidirektören, personaldirektören, kommunikationsdirektören och chefsjuristen.\n\nVarje dag och varje timme gör våra medarbetare insatser som påverkar andra människors liv, både i stort och smått, och både på hemmaplan och runt om i världen.\n\nFörsvarsmakten ger dig möjlighet att utvecklas som människa och växa i din professionella roll. Vi är en ansvarstagande arbetsgivare och har en öppen organisation där vi ställer upp för varandra. \n\nI Försvarsmakten finns en stark värdegrund som bygger på öppenhet, resultat och ansvar. Professionell utveckling och personlig hälsa värdesätts och uppmuntras. Det finns goda förutsättningar för intern karriärrörlighet, friskvård och bra balans mellan arbete och privatliv.\n\nFörsvarsmakten tillvaratar de kvaliteter som mångfald och jämn könsfördelning tillför verksamheten. Vi välkomnar därför sökanden med olika bakgrund och erfarenheter i våra rekryteringar. \n\nEn anställning hos oss innebär placering i säkerhetsklass. Vanligtvis krävs svenskt medborgarskap.\nSäkerhetsprövning med registerkontroll kommer att genomföras före anställning enligt 3 kap i säkerhetsskyddslagen. Med anställning följer en skyldighet att krigsplaceras. I anställningen ingår även en skyldighet att tjänstgöra utomlands. Innebörden av detta varierar beroende på typ av befattning.\n\nTill ansökan om anställning ska CV och personligt brev bifogas. Om du går vidare i anställningsprocessen ska alltid vidimerade kopior av betyg och intyg uppvisas.\n\nSamtal från externa rekryteringsföretag och säljare undanbedes.",
        "conditions" : "Heltid/\r\nEj specificerat",
        "text" : "Vill du värna om Sverige och vår rätt att leva som vi själva väljer i en digitaliserad värld?Världen över så ökar antalet attacker över internet mot datorer och servrar, vilket kan få stora konsekvenser för samhällsviktiga funktioner och kritiska it-system. Försvarsmakten utvecklas och anpassar sig för att stärka Sveriges cyberförmåga ytterligare.\n\nFörsvarsmaktens cyberförsvar söker nu systemadministratörer. Vi söker dig som har erfarenhet av systemadministration och som vill utvecklas i en stimulerande och unik miljö.\n\nOm befattningen\n\nI befattningen kommer du att arbeta med design, installation, konfiguration, härdning, och övervakning av servrar och klienter. Målet är att säkerställa att alla inom verksamheten har en tillförlitlig och säker it-miljö att arbeta i. Du kommer att få ta ansvar för verksamhetskritiska system med höga säkerhetskrav med hjälp av moderna verktyg och tekniker.\n\nDina huvudsakliga arbetsuppgifter är:\n\n* Installera, konfigurera och övervaka hårdvara, tjänster och applikationer.\n\n* Ta fram design av nya tjänster och applikationer eller uppdatera befintliga.\n\n* Ta fram specifikationer för hårdvara som krävs för att kunna köra befintliga eller planerade tjänster och applikationer på.\n\n* Delta i att ha en fungerande process för säkerhetskopiering och återställning.\n\nKvalifikationer\n\n* Minst två års erfarenhet av arbete som systemadministratör.\n\n* Dokumenterad erfarenhet av Linux och Windows.\n\n* Goda kunskaper inom it- och nätverksteknik.\n\n* Kunskaper inom automatisering och skriptning (Ansible, Python, Bash, Powershell, m m).\n\n* Eftergymnasial utbildning eller kunskaper förvärvade genom relevant arbetslivserfarenhet.\n\n* God förmåga att uttrycka dig i tal och skrift på svenska och engelska.\n\nMeriterande\n\n* Erfarenhet av Active Directory/Samba.\n\n* Erfarenhet av Public Key Infrastructure (PKI).\n\n* Erfarenhet av infrastruktur som kod.\n\n* Certifieringar inom Linux och Windows.\n\n* IT-säkerhetsrelaterade certifieringar.\n\nPersonliga kvalifikationer\n\nVi lägger stor vikt vid dina personliga egenskaper, du behöver vara analytisk och noggrann. Du vågar ta initiativ i ditt dagliga arbete och har viljan att fortsätta utvecklas i din yrkesroll. Du har en god förmåga att samarbeta med andra men kan också arbeta självständigt. För att trivas hos oss behöver du ha ett högt säkerhetsmedvetande och tillämpa ett kritiskt och sakligt förhållningssätt.\n\nÖvrigt\n\nDu bör inte berätta att du sökt tjänst hos Försvarsmakten för andra personer än dina närmast berörda. Anledningen till att vi ber dig vara återhållsam med informationen är att det finns tjänster inom området som omfattas av sekretess. Arbete på annan ort samt beredskap och skiftarbete kan förekomma.Resor i tjänsten kan förekomma både nationellt och internationellt. Anställningsform, tillsvidareanställning, 6 månaders provanställning tillämpas om du inte är anställd inom Försvarsmakten. Placeringsort, Stockholm.Tillträde enligt överenskommelse. Frågor om tjänsten mejlas till cyberintresse@mil.se\n\nDin ansökan vill vi ha senast den 2022-08-21, ansökan med meritförteckning skickas till cyberintresse@mil.se ange referens 803342 eller via brev till Försvarsmakten Högkvarteret/LEDS CIO Cyberförsvar, Lidingövägen 24, 115 57 Stockholm, märk kuvertet ”Ansökan” och ange annonsens referens.\n\n\n--------------------------------------------------------\nInformation om Försvarsmakten och det rekryterande förbandet:\n\nI Högkvarteret (HKV) finns överbefälhavaren (ÖB) och generaldirektören (GD), vilka för närvarande har ungefär 1 000 medarbetare – både yrkesofficerare och civila experter. Högkvarteret  utgörs av ledningsstaben, produktionsledningen, insatsledningen och militära underrättelse- och säkerhetstjänsten. I ledningsstaben ingår bland annat ekonomidirektören, personaldirektören, kommunikationsdirektören och chefsjuristen.\n\nVarje dag och varje timme gör våra medarbetare insatser som påverkar andra människors liv, både i stort och smått, och både på hemmaplan och runt om i världen.\n\nFörsvarsmakten ger dig möjlighet att utvecklas som människa och växa i din professionella roll. Vi är en ansvarstagande arbetsgivare och har en öppen organisation där vi ställer upp för varandra. \n\nI Försvarsmakten finns en stark värdegrund som bygger på öppenhet, resultat och ansvar. Professionell utveckling och personlig hälsa värdesätts och uppmuntras. Det finns goda förutsättningar för intern karriärrörlighet, friskvård och bra balans mellan arbete och privatliv.\n\nFörsvarsmakten tillvaratar de kvaliteter som mångfald och jämn könsfördelning tillför verksamheten. Vi välkomnar därför sökanden med olika bakgrund och erfarenheter i våra rekryteringar. \n\nEn anställning hos oss innebär placering i säkerhetsklass. Vanligtvis krävs svenskt medborgarskap.\nSäkerhetsprövning med registerkontroll kommer att genomföras före anställning enligt 3 kap i säkerhetsskyddslagen. Med anställning följer en skyldighet att krigsplaceras. I anställningen ingår även en skyldighet att tjänstgöra utomlands. Innebörden av detta varierar beroende på typ av befattning.\n\nTill ansökan om anställning ska CV och personligt brev bifogas. Om du går vidare i anställningsprocessen ska alltid vidimerade kopior av betyg och intyg uppvisas.\n\nSamtal från externa rekryteringsföretag och säljare undanbedes."
      },
      "headline" : "Systemadministratörer till Försvarsmaktens Cyberförsvar i Stockholm",
      "driving_license" : null,
      "employer" : {
        "email" : null,
        "phone_number" : null,
        "organization_number" : "2021004615",
        "name" : "Försvarsmakten",
        "url" : "http://www.forsvarsmakten.se/sv/",
        "workplace" : "Försvarsmakten"
      },
      "removed_date" : null,
      "logo_url" : "https://www.arbetsformedlingen.se/rest/arbetsgivare/rest/af/v3/organisation/2021004615/logotyper/logo.png",
      "last_publication_date" : "2022-08-21T23:59:59",
      "number_of_vacancies" : 1,
      "occupation" : {
        "concept_id" : "Lxas_8K9_W1o",
        "label" : "Systemadministratör",
        "legacy_ams_taxonomy_id" : "2918"
      },
      "occupation_group" : {
        "concept_id" : "MYAz_x9m_2LJ",
        "label" : "Systemadministratörer",
        "legacy_ams_taxonomy_id" : "3513"
      },
      "employment_type" : {
        "concept_id" : "PFZr_Syz_cUq",
        "label" : "Vanlig anställning",
        "legacy_ams_taxonomy_id" : "1"
      },
      "webpage_url" : "https://arbetsformedlingen.se/platsbanken/annonser/26322732",
      "driving_license_required" : false,
      "application_contacts" : [ ],
      "duration" : {
        "concept_id" : "a7uU_j21_mkL",
        "label" : "Tills vidare",
        "legacy_ams_taxonomy_id" : "1"
      },
      "nice_to_have" : {
        "education_level" : [ ],
        "work_experiences" : [ ],
        "skills" : [ ],
        "education" : [ ],
        "languages" : [ ]
      },
      "application_details" : {
        "via_af" : false,
        "email" : null,
        "other" : null,
        "reference" : null,
        "url" : "https://web103.reachmee.com/ext/I005/333/main?site=2&validator=a75fbd88f1b2a3a49de2af9c8b7bc228&lang=SE&rmpage=job&rmjob=30196",
        "information" : null
      },
      "source_type" : "VIA_PLATSBANKEN_DXA",
      "application_deadline" : "2022-08-21T23:59:59",
      "external_id" : "46-202100-4615-30196",
      "workplace_address" : {
        "coordinates" : [ 18.06858, 59.329323 ],
        "city" : null,
        "postcode" : null,
        "municipality" : "Stockholm",
        "region_concept_id" : "CifL_Rzy_Mku",
        "region" : "Stockholms län",
        "country_code" : "199",
        "region_code" : "01",
        "municipality_concept_id" : "AvNB_uwa_6n6",
        "country_concept_id" : "i46j_HmG_v64",
        "municipality_code" : "0180",
        "street_address" : null,
        "country" : "Sverige"
      },
      "id" : "26322732",
      "experience_required" : true,
      "working_hours_type" : {
        "concept_id" : "6YE1_gAC_R2G",
        "label" : "Heltid",
        "legacy_ams_taxonomy_id" : "1"
      },
      "access" : null,
      "timestamp" : 1657701348105,
      "must_have" : {
        "education_level" : [ ],
        "work_experiences" : [ {
          "concept_id" : "Lxas_8K9_W1o",
          "weight" : 10,
          "label" : "Systemadministratör",
          "legacy_ams_taxonomy_id" : "2918"
        } ],
        "skills" : [ ],
        "education" : [ ],
        "languages" : [ ]
      },
      "occupation_field" : {
        "concept_id" : "apaJ_2ja_LuF",
        "label" : "Data/IT",
        "legacy_ams_taxonomy_id" : "3"
      },
      "scope_of_work" : {
        "min" : 100,
        "max" : 100
      },
      "salary_type" : {
        "concept_id" : "oG8G_9cW_nRf",
        "label" : "Fast månads- vecko- eller timlön",
        "legacy_ams_taxonomy_id" : "1"
      },
      "removed" : false,
      "salary_description" : "Individuellt",
      "access_to_own_car" : false,
      "publication_date" : "2022-07-25T00:00:00"
    },
    "name" : "Systemadministratörer till Försvarsmaktens Cyberförsvar i Stockholm",
    "user" : "hannes"
  },
  "sha1" : "f824ceee6acdf64ec2b4dede2050a8ad77a9b615",
  "annotations" : [ {
    "preferred-label" : "Systemadministratörer",
    "sentiment" : "MUST_HAVE",
    "type" : "ssyk-level-4",
    "start-position" : 0,
    "end-position" : 21,
    "concept-id" : "MYAz_x9m_2LJ",
    "matched-string" : "systemadministratörer",
    "annotation-id" : 0
  }, {
    "preferred-label" : "Försvarsmakten",
    "type" : "keyword",
    "start-position" : 27,
    "end-position" : 42,
    "concept-id" : "GSC3_yU4_K5V",
    "matched-string" : "Försvarsmaktens",
    "annotation-id" : 37
  }, {
    "preferred-label" : "Stockholm",
    "type" : "municipality",
    "start-position" : 58,
    "end-position" : 67,
    "concept-id" : "AvNB_uwa_6n6",
    "matched-string" : "Stockholm",
    "annotation-id" : 36
  }, {
    "preferred-label" : "Sverige",
    "type" : "country",
    "start-position" : 85,
    "end-position" : 92,
    "concept-id" : "i46j_HmG_v64",
    "matched-string" : "Sverige",
    "annotation-id" : 38
  }, {
    "preferred-label" : "Data/IT",
    "type" : "occupation-field",
    "start-position" : 315,
    "end-position" : 317,
    "concept-id" : "apaJ_2ja_LuF",
    "matched-string" : "it",
    "annotation-id" : 39
  }, {
    "preferred-label" : "Försvarsmakten",
    "sentiment" : "MUST_HAVE",
    "type" : "keyword",
    "start-position" : 326,
    "end-position" : 340,
    "concept-id" : "GSC3_yU4_K5V",
    "matched-string" : "försvarsmakten",
    "annotation-id" : 2
  }, {
    "preferred-label" : "Sverige",
    "type" : "country",
    "start-position" : 383,
    "end-position" : 391,
    "concept-id" : "i46j_HmG_v64",
    "matched-string" : "Sveriges",
    "annotation-id" : 40
  }, {
    "preferred-label" : "Försvarsmakten",
    "type" : "keyword",
    "start-position" : 419,
    "end-position" : 434,
    "concept-id" : "GSC3_yU4_K5V",
    "matched-string" : "Försvarsmaktens",
    "annotation-id" : 41
  }, {
    "preferred-label" : "Systemadministratörer",
    "sentiment" : "MUST_HAVE",
    "type" : "ssyk-level-4",
    "start-position" : 457,
    "end-position" : 478,
    "concept-id" : "MYAz_x9m_2LJ",
    "matched-string" : "systemadministratörer",
    "annotation-id" : 3
  }, {
    "preferred-label" : "Installation, drift, underhåll",
    "type" : "occupation-field",
    "start-position" : 659,
    "end-position" : 671,
    "concept-id" : "yhCP_AqT_tns",
    "matched-string" : "installation",
    "annotation-id" : 42
  }, {
    "preferred-label" : "Nätverk, övervakning",
    "type" : "skill",
    "start-position" : 702,
    "end-position" : 713,
    "concept-id" : "C4Ev_voX_wwz",
    "matched-string" : "övervakning",
    "annotation-id" : 43
  }, {
    "preferred-label" : "Data/IT",
    "sentiment" : "MUST_HAVE",
    "type" : "occupation-field",
    "start-position" : 822,
    "end-position" : 824,
    "concept-id" : "apaJ_2ja_LuF",
    "matched-string" : "it",
    "annotation-id" : 4
  }, {
    "preferred-label" : "Verktyg",
    "sentiment" : "MUST_HAVE",
    "type" : "skill",
    "start-position" : 947,
    "end-position" : 954,
    "concept-id" : "KG9j_WxP_ym2",
    "matched-string" : "verktyg",
    "annotation-id" : 5
  }, {
    "preferred-label" : "Hårdvara",
    "sentiment" : "MUST_HAVE",
    "type" : "skill-headline",
    "start-position" : 1048,
    "end-position" : 1056,
    "concept-id" : "22jK_Hje_3Ec",
    "matched-string" : "hårdvara",
    "annotation-id" : 6
  }, {
    "preferred-label" : "Hårdvara",
    "sentiment" : "MUST_HAVE",
    "type" : "skill-headline",
    "start-position" : 1197,
    "end-position" : 1205,
    "concept-id" : "22jK_Hje_3Ec",
    "matched-string" : "hårdvara",
    "annotation-id" : 7
  }, {
    "preferred-label" : "2-4 års erfarenhet",
    "type" : "occupation-experience-year",
    "start-position" : 1395,
    "end-position" : 1419,
    "concept-id" : "RWA2_uu6_udD",
    "matched-string" : "Minst två års erfarenhet",
    "annotation-id" : 44
  }, {
    "preferred-label" : "Systemadministratörer",
    "sentiment" : "MUST_HAVE",
    "type" : "ssyk-level-4",
    "start-position" : 1434,
    "end-position" : 1453,
    "concept-id" : "MYAz_x9m_2LJ",
    "matched-string" : "systemadministratör",
    "annotation-id" : 8
  }, {
    "preferred-label" : "Linux, operativsystem",
    "sentiment" : "MUST_HAVE",
    "type" : "skill",
    "start-position" : 1485,
    "end-position" : 1490,
    "concept-id" : "z52H_f4y_4ZA",
    "matched-string" : "linux",
    "annotation-id" : 9
  }, {
    "preferred-label" : "Windows, operativsystem",
    "sentiment" : "MUST_HAVE",
    "type" : "skill",
    "start-position" : 1495,
    "end-position" : 1502,
    "concept-id" : "G4sF_xod_zoq",
    "matched-string" : "windows",
    "annotation-id" : 10
  }, {
    "preferred-label" : "Data/IT",
    "sentiment" : "MUST_HAVE",
    "type" : "occupation-field",
    "start-position" : 1527,
    "end-position" : 1529,
    "concept-id" : "apaJ_2ja_LuF",
    "matched-string" : "it",
    "annotation-id" : 11
  }, {
    "preferred-label" : "nätverkstekniker",
    "type" : "esco-occupation",
    "start-position" : 1535,
    "end-position" : 1549,
    "concept-id" : "gsaM_vT7_oJu",
    "matched-string" : "nätverksteknik",
    "annotation-id" : 45
  }, {
    "preferred-label" : "Ansible",
    "type" : "esco-skill",
    "start-position" : 1600,
    "end-position" : 1607,
    "concept-id" : "CH2a_ozf_gR9",
    "matched-string" : "Ansible",
    "annotation-id" : 46
  }, {
    "preferred-label" : "Python, programmeringsspråk",
    "sentiment" : "MUST_HAVE",
    "type" : "skill",
    "start-position" : 1609,
    "end-position" : 1615,
    "concept-id" : "qfkh_ZRK_w4W",
    "matched-string" : "python",
    "annotation-id" : 12
  }, {
    "preferred-label" : "Bash, programmeringsspråk",
    "sentiment" : "MUST_HAVE",
    "type" : "skill",
    "start-position" : 1617,
    "end-position" : 1621,
    "concept-id" : "prGD_TDJ_e8U",
    "matched-string" : "bash",
    "annotation-id" : 13
  }, {
    "preferred-label" : "Windows Powershell, systemutvecklingsverktyg",
    "type" : "skill",
    "start-position" : 1623,
    "end-position" : 1633,
    "concept-id" : "SnKF_v7d_qUH",
    "matched-string" : "Powershell",
    "annotation-id" : 47
  }, {
    "preferred-label" : "Eftergymnasial utbildning",
    "sentiment" : "MUST_HAVE",
    "type" : "sni-level-3",
    "start-position" : 1644,
    "end-position" : 1669,
    "concept-id" : "bg6r_KVf_KNN",
    "matched-string" : "eftergymnasial utbildning",
    "annotation-id" : 14
  }, {
    "preferred-label" : "Svenska",
    "sentiment" : "MUST_HAVE",
    "type" : "language",
    "start-position" : 1786,
    "end-position" : 1793,
    "concept-id" : "zSLA_vw2_FXN",
    "matched-string" : "svenska",
    "annotation-id" : 15
  }, {
    "preferred-label" : "Engelska",
    "sentiment" : "MUST_HAVE",
    "type" : "language",
    "start-position" : 1798,
    "end-position" : 1806,
    "concept-id" : "NVxJ_hLg_TYS",
    "matched-string" : "engelska",
    "annotation-id" : 16
  }, {
    "preferred-label" : "Active Directory, programmeringsverktyg",
    "sentiment" : "MUST_HAVE",
    "type" : "skill",
    "start-position" : 1838,
    "end-position" : 1854,
    "concept-id" : "xGPG_PpL_zWN",
    "matched-string" : "active directory",
    "annotation-id" : 17
  }, {
    "preferred-label" : "Samba",
    "sentiment" : "MUST_HAVE",
    "type" : "skill",
    "start-position" : 1855,
    "end-position" : 1860,
    "concept-id" : "FTPA_sDR_wrH",
    "matched-string" : "samba",
    "annotation-id" : 18
  }, {
    "preferred-label" : "Linux, operativsystem",
    "sentiment" : "MUST_HAVE",
    "type" : "skill",
    "start-position" : 1975,
    "end-position" : 1980,
    "concept-id" : "z52H_f4y_4ZA",
    "matched-string" : "linux",
    "annotation-id" : 19
  }, {
    "preferred-label" : "Windows, operativsystem",
    "sentiment" : "MUST_HAVE",
    "type" : "skill",
    "start-position" : 1985,
    "end-position" : 1992,
    "concept-id" : "G4sF_xod_zoq",
    "matched-string" : "windows",
    "annotation-id" : 20
  }, {
    "preferred-label" : "IT-säkerhet",
    "type" : "keyword",
    "start-position" : 1997,
    "end-position" : 2008,
    "concept-id" : "KF7V_H1U_vHv",
    "matched-string" : "IT-säkerhet",
    "annotation-id" : 48
  }, {
    "preferred-label" : "noggrannhet",
    "type" : "esco-skill",
    "start-position" : 2147,
    "end-position" : 2155,
    "concept-id" : "mrsW_EkL_KRD",
    "matched-string" : "noggrann",
    "annotation-id" : 49
  }, {
    "preferred-label" : "arbeta självständigt",
    "type" : "esco-skill",
    "start-position" : 2317,
    "end-position" : 2337,
    "concept-id" : "NyFu_HHd_zhz",
    "matched-string" : "arbeta självständigt",
    "annotation-id" : 50
  }, {
    "preferred-label" : "Försvarsmakten",
    "sentiment" : "MUST_HAVE",
    "type" : "keyword",
    "start-position" : 2513,
    "end-position" : 2527,
    "concept-id" : "GSC3_yU4_K5V",
    "matched-string" : "försvarsmakten",
    "annotation-id" : 22
  }, {
    "preferred-label" : "Resor i arbetet förekommer",
    "type" : "work-place-environment",
    "start-position" : 2770,
    "end-position" : 2800,
    "concept-id" : "oaM2_JTK_muh",
    "matched-string" : "Resor i tjänsten kan förekomma",
    "annotation-id" : 51
  }, {
    "preferred-label" : "Tillsvidareanställning (inkl. eventuell provanställning)",
    "type" : "employment-type",
    "start-position" : 2856,
    "end-position" : 2906,
    "concept-id" : "kpPX_CNN_gDU",
    "matched-string" : "tillsvidareanställning, 6 månaders provanställning",
    "annotation-id" : 52
  }, {
    "preferred-label" : "Försvarsmakten",
    "sentiment" : "MUST_HAVE",
    "type" : "keyword",
    "start-position" : 2945,
    "end-position" : 2959,
    "concept-id" : "GSC3_yU4_K5V",
    "matched-string" : "försvarsmakten",
    "annotation-id" : 24
  }, {
    "preferred-label" : "Stockholm",
    "type" : "municipality",
    "start-position" : 2976,
    "end-position" : 2985,
    "concept-id" : "AvNB_uwa_6n6",
    "matched-string" : "Stockholm",
    "annotation-id" : 53
  }, {
    "preferred-label" : "Försvarsmakten",
    "sentiment" : "MUST_HAVE",
    "type" : "keyword",
    "start-position" : 3223,
    "end-position" : 3237,
    "concept-id" : "GSC3_yU4_K5V",
    "matched-string" : "försvarsmakten",
    "annotation-id" : 25
  }, {
    "preferred-label" : "Chief Information Officer/CIO/IT-chef",
    "sentiment" : "MUST_HAVE",
    "type" : "occupation-name",
    "start-position" : 3256,
    "end-position" : 3259,
    "concept-id" : "cEY1_Bh8_URP",
    "matched-string" : "cio",
    "annotation-id" : 26
  }, {
    "preferred-label" : "Stockholm",
    "type" : "municipality",
    "start-position" : 3298,
    "end-position" : 3307,
    "concept-id" : "AvNB_uwa_6n6",
    "matched-string" : "Stockholm",
    "annotation-id" : 54
  }, {
    "preferred-label" : "Försvarsmakten",
    "sentiment" : "MUST_HAVE",
    "type" : "keyword",
    "start-position" : 3436,
    "end-position" : 3450,
    "concept-id" : "GSC3_yU4_K5V",
    "matched-string" : "försvarsmakten",
    "annotation-id" : 27
  }, {
    "preferred-label" : "Försvarsmakten",
    "sentiment" : "MUST_HAVE",
    "type" : "keyword",
    "start-position" : 4065,
    "end-position" : 4079,
    "concept-id" : "GSC3_yU4_K5V",
    "matched-string" : "försvarsmakten",
    "annotation-id" : 28
  }, {
    "preferred-label" : "Försvarsmakten",
    "sentiment" : "MUST_HAVE",
    "type" : "keyword",
    "start-position" : 4265,
    "end-position" : 4279,
    "concept-id" : "GSC3_yU4_K5V",
    "matched-string" : "försvarsmakten",
    "annotation-id" : 29
  }, {
    "preferred-label" : "Hälsa",
    "sentiment" : "MUST_HAVE",
    "type" : "keyword",
    "start-position" : 4390,
    "end-position" : 4395,
    "concept-id" : "Abys_5p1_Cnq",
    "matched-string" : "hälsa",
    "annotation-id" : 30
  }, {
    "preferred-label" : "Försvarsmakten",
    "sentiment" : "MUST_HAVE",
    "type" : "keyword",
    "start-position" : 4538,
    "end-position" : 4552,
    "concept-id" : "GSC3_yU4_K5V",
    "matched-string" : "försvarsmakten",
    "annotation-id" : 33
  }, {
    "preferred-label" : "Svenskt medborgarskap",
    "sentiment" : "MUST_HAVE",
    "type" : "skill",
    "start-position" : 4803,
    "end-position" : 4824,
    "concept-id" : "chKz_HpD_XL5",
    "matched-string" : "svenskt medborgarskap",
    "annotation-id" : 34
  } ],
  "text" : "Systemadministratörer till Försvarsmaktens Cyberförsvar i Stockholm\nVill du värna om Sverige och vår rätt att leva som vi själva väljer i en digitaliserad värld?Världen över så ökar antalet attacker över internet mot datorer och servrar, vilket kan få stora konsekvenser för samhällsviktiga funktioner och kritiska it-system. Försvarsmakten utvecklas och anpassar sig för att stärka Sveriges cyberförmåga ytterligare.\n\nFörsvarsmaktens cyberförsvar söker nu systemadministratörer. Vi söker dig som har erfarenhet av systemadministration och som vill utvecklas i en stimulerande och unik miljö.\n\nOm befattningen\n\nI befattningen kommer du att arbeta med design, installation, konfiguration, härdning, och övervakning av servrar och klienter. Målet är att säkerställa att alla inom verksamheten har en tillförlitlig och säker it-miljö att arbeta i. Du kommer att få ta ansvar för verksamhetskritiska system med höga säkerhetskrav med hjälp av moderna verktyg och tekniker.\n\nDina huvudsakliga arbetsuppgifter är:\n\n* Installera, konfigurera och övervaka hårdvara, tjänster och applikationer.\n\n* Ta fram design av nya tjänster och applikationer eller uppdatera befintliga.\n\n* Ta fram specifikationer för hårdvara som krävs för att kunna köra befintliga eller planerade tjänster och applikationer på.\n\n* Delta i att ha en fungerande process för säkerhetskopiering och återställning.\n\nKvalifikationer\n\n* Minst två års erfarenhet av arbete som systemadministratör.\n\n* Dokumenterad erfarenhet av Linux och Windows.\n\n* Goda kunskaper inom it- och nätverksteknik.\n\n* Kunskaper inom automatisering och skriptning (Ansible, Python, Bash, Powershell, m m).\n\n* Eftergymnasial utbildning eller kunskaper förvärvade genom relevant arbetslivserfarenhet.\n\n* God förmåga att uttrycka dig i tal och skrift på svenska och engelska.\n\nMeriterande\n\n* Erfarenhet av Active Directory/Samba.\n\n* Erfarenhet av Public Key Infrastructure (PKI).\n\n* Erfarenhet av infrastruktur som kod.\n\n* Certifieringar inom Linux och Windows.\n\n* IT-säkerhetsrelaterade certifieringar.\n\nPersonliga kvalifikationer\n\nVi lägger stor vikt vid dina personliga egenskaper, du behöver vara analytisk och noggrann. Du vågar ta initiativ i ditt dagliga arbete och har viljan att fortsätta utvecklas i din yrkesroll. Du har en god förmåga att samarbeta med andra men kan också arbeta självständigt. För att trivas hos oss behöver du ha ett högt säkerhetsmedvetande och tillämpa ett kritiskt och sakligt förhållningssätt.\n\nÖvrigt\n\nDu bör inte berätta att du sökt tjänst hos Försvarsmakten för andra personer än dina närmast berörda. Anledningen till att vi ber dig vara återhållsam med informationen är att det finns tjänster inom området som omfattas av sekretess. Arbete på annan ort samt beredskap och skiftarbete kan förekomma.Resor i tjänsten kan förekomma både nationellt och internationellt. Anställningsform, tillsvidareanställning, 6 månaders provanställning tillämpas om du inte är anställd inom Försvarsmakten. Placeringsort, Stockholm.Tillträde enligt överenskommelse. Frågor om tjänsten mejlas till cyberintresse@mil.se\n\nDin ansökan vill vi ha senast den 2022-08-21, ansökan med meritförteckning skickas till cyberintresse@mil.se ange referens 803342 eller via brev till Försvarsmakten Högkvarteret/LEDS CIO Cyberförsvar, Lidingövägen 24, 115 57 Stockholm, märk kuvertet ”Ansökan” och ange annonsens referens.\n\n\n--------------------------------------------------------\nInformation om Försvarsmakten och det rekryterande förbandet:\n\nI Högkvarteret (HKV) finns överbefälhavaren (ÖB) och generaldirektören (GD), vilka för närvarande har ungefär 1 000 medarbetare – både yrkesofficerare och civila experter. Högkvarteret  utgörs av ledningsstaben, produktionsledningen, insatsledningen och militära underrättelse- och säkerhetstjänsten. I ledningsstaben ingår bland annat ekonomidirektören, personaldirektören, kommunikationsdirektören och chefsjuristen.\n\nVarje dag och varje timme gör våra medarbetare insatser som påverkar andra människors liv, både i stort och smått, och både på hemmaplan och runt om i världen.\n\nFörsvarsmakten ger dig möjlighet att utvecklas som människa och växa i din professionella roll. Vi är en ansvarstagande arbetsgivare och har en öppen organisation där vi ställer upp för varandra. \n\nI Försvarsmakten finns en stark värdegrund som bygger på öppenhet, resultat och ansvar. Professionell utveckling och personlig hälsa värdesätts och uppmuntras. Det finns goda förutsättningar för intern karriärrörlighet, friskvård och bra balans mellan arbete och privatliv.\n\nFörsvarsmakten tillvaratar de kvaliteter som mångfald och jämn könsfördelning tillför verksamheten. Vi välkomnar därför sökanden med olika bakgrund och erfarenheter i våra rekryteringar. \n\nEn anställning hos oss innebär placering i säkerhetsklass. Vanligtvis krävs svenskt medborgarskap.\nSäkerhetsprövning med registerkontroll kommer att genomföras före anställning enligt 3 kap i säkerhetsskyddslagen. Med anställning följer en skyldighet att krigsplaceras. I anställningen ingår även en skyldighet att tjänstgöra utomlands. Innebörden av detta varierar beroende på typ av befattning.\n\nTill ansökan om anställning ska CV och personligt brev bifogas. Om du går vidare i anställningsprocessen ska alltid vidimerade kopior av betyg och intyg uppvisas.\n\nSamtal från externa rekryteringsföretag och säljare undanbedes."
}