{
  "meta" : {
    "jobad" : {
      "description" : {
        "requirements" : null,
        "needs" : null,
        "company_information" : null,
        "text_formatted" : "<p>Just nu söker vi förstärkning till vårt matsalsteam!</p><p>Rice är en familjär restaurang belägen på en av Stockholms mest attraktiva och centrala adresser. Här är en mötesplats med en avslappnad och varm känsla där gäster kan avnjuta en unik, utsökt och oförglömlig asiatisk upplevelse. Vår meny med inspiration från olika delar av Asien såsom Kina, Japan, Thailand och Vietnam återspeglar århundraden av matlagning. Så hos oss är det väldigt viktigt att man som anställd har ett genuint intresse av att vilja förstå och lära sig mycket om den asiatiska matkulturen.</p><p>Rice är en av Stockholm äldsta asiatiska restauranger. Alla som jobbar här är en del av familjen Rice, så tanken är att arbetsplatsen ska kännas som ett andra hem för oss som jobbar här och det är väldigt viktigt för oss att vi hjälper varandra och visar varandra respekt och välvilja.</p><p>Älskar du att träffa nya människor och precis som vi blir lyckliga av att få ge gästerna en förstklassig service och en upplevelse som gör de lyckliga? Är du utåtriktad och positiv? Kan hålla ett högt tempo? För vi har hög beläggning så hos oss går det undan.</p><p>Passar du in på beskrivningen? Kul! Sök direkt.</p><p>Vi ser fram emot att läsa din ansökan.</p>",
        "conditions" : null,
        "text" : "Just nu söker vi förstärkning till vårt matsalsteam!\nRice är en familjär restaurang belägen på en av Stockholms mest attraktiva och centrala adresser. Här är en mötesplats med en avslappnad och varm känsla där gäster kan avnjuta en unik, utsökt och oförglömlig asiatisk upplevelse. Vår meny med inspiration från olika delar av Asien såsom Kina, Japan, Thailand och Vietnam återspeglar århundraden av matlagning. Så hos oss är det väldigt viktigt att man som anställd har ett genuint intresse av att vilja förstå och lära sig mycket om den asiatiska matkulturen.\nRice är en av Stockholm äldsta asiatiska restauranger. Alla som jobbar här är en del av familjen Rice, så tanken är att arbetsplatsen ska kännas som ett andra hem för oss som jobbar här och det är väldigt viktigt för oss att vi hjälper varandra och visar varandra respekt och välvilja.\nÄlskar du att träffa nya människor och precis som vi blir lyckliga av att få ge gästerna en förstklassig service och en upplevelse som gör de lyckliga? Är du utåtriktad och positiv? Kan hålla ett högt tempo? För vi har hög beläggning så hos oss går det undan.\nPassar du in på beskrivningen? Kul! Sök direkt.\nVi ser fram emot att läsa din ansökan."
      },
      "headline" : "Servitör/Servitris sökes",
      "driving_license" : null,
      "employer" : {
        "email" : null,
        "phone_number" : null,
        "organization_number" : "5563536332",
        "name" : "Rice Three Bowl AB",
        "url" : null,
        "workplace" : "Restaurang Rice"
      },
      "removed_date" : null,
      "logo_url" : null,
      "last_publication_date" : "2022-08-24T23:59:59",
      "number_of_vacancies" : 1,
      "occupation" : {
        "concept_id" : "rGGf_KLs_To7",
        "label" : "Servitör/Servitris",
        "legacy_ams_taxonomy_id" : "5487"
      },
      "occupation_group" : {
        "concept_id" : "UjoW_meY_Zwt",
        "label" : "Hovmästare och servitörer",
        "legacy_ams_taxonomy_id" : "5131"
      },
      "employment_type" : {
        "concept_id" : "PFZr_Syz_cUq",
        "label" : "Vanlig anställning",
        "legacy_ams_taxonomy_id" : "1"
      },
      "webpage_url" : "https://arbetsformedlingen.se/platsbanken/annonser/26349530",
      "driving_license_required" : false,
      "application_contacts" : [ ],
      "duration" : {
        "concept_id" : "a7uU_j21_mkL",
        "label" : "Tills vidare",
        "legacy_ams_taxonomy_id" : "1"
      },
      "nice_to_have" : {
        "education_level" : [ ],
        "work_experiences" : [ ],
        "skills" : [ ],
        "education" : [ ],
        "languages" : [ ]
      },
      "application_details" : {
        "via_af" : false,
        "email" : "info@rice.se",
        "other" : null,
        "reference" : null,
        "url" : null,
        "information" : null
      },
      "source_type" : "VIA_ANNONSERA",
      "application_deadline" : "2022-08-24T23:59:59",
      "external_id" : null,
      "workplace_address" : {
        "coordinates" : [ 18.077579874943837, 59.334771972061986 ],
        "city" : "Stockholm",
        "postcode" : "11439",
        "municipality" : "Stockholm",
        "region_concept_id" : "CifL_Rzy_Mku",
        "region" : "Stockholms län",
        "country_code" : "199",
        "region_code" : "01",
        "municipality_concept_id" : "AvNB_uwa_6n6",
        "country_concept_id" : "i46j_HmG_v64",
        "municipality_code" : "0180",
        "street_address" : "Nybrogatan 16",
        "country" : "Sverige"
      },
      "id" : "26349530",
      "experience_required" : true,
      "working_hours_type" : {
        "concept_id" : "6YE1_gAC_R2G",
        "label" : "Heltid",
        "legacy_ams_taxonomy_id" : "1"
      },
      "access" : null,
      "timestamp" : 1658705655296,
      "must_have" : {
        "education_level" : [ ],
        "work_experiences" : [ {
          "concept_id" : "rGGf_KLs_To7",
          "weight" : 10,
          "label" : "Servitör/Servitris",
          "legacy_ams_taxonomy_id" : "5487"
        } ],
        "skills" : [ ],
        "education" : [ ],
        "languages" : [ {
          "concept_id" : "zSLA_vw2_FXN",
          "weight" : 10,
          "label" : "Svenska",
          "legacy_ams_taxonomy_id" : "502"
        } ]
      },
      "occupation_field" : {
        "concept_id" : "ScKy_FHB_7wT",
        "label" : "Hotell, restaurang, storhushåll",
        "legacy_ams_taxonomy_id" : "7"
      },
      "scope_of_work" : {
        "min" : 0,
        "max" : 100
      },
      "salary_type" : {
        "concept_id" : "asrX_9Df_ukn",
        "label" : "Fast och rörlig lön",
        "legacy_ams_taxonomy_id" : "7"
      },
      "removed" : false,
      "salary_description" : null,
      "access_to_own_car" : false,
      "publication_date" : "2022-07-25T01:34:15"
    },
    "name" : "Servitör/Servitris sökes",
    "user" : "hannes"
  },
  "sha1" : "9f9956fb8779768c6e3d5d5d91841c8d0f2cf196",
  "annotations" : [ {
    "preferred-label" : "Servitör/Servitris",
    "sentiment" : "MUST_HAVE",
    "type" : "occupation-name",
    "start-position" : 0,
    "end-position" : 18,
    "concept-id" : "rGGf_KLs_To7",
    "matched-string" : "servitör/servitris",
    "annotation-id" : 0
  }, {
    "preferred-label" : "Restaurang",
    "sentiment" : "MUST_HAVE",
    "type" : "keyword",
    "start-position" : 98,
    "end-position" : 108,
    "concept-id" : "o2Cg_3Ap_qvK",
    "matched-string" : "restaurang",
    "annotation-id" : 1
  }, {
    "preferred-label" : "Stockholm",
    "type" : "municipality",
    "start-position" : 126,
    "end-position" : 136,
    "concept-id" : "AvNB_uwa_6n6",
    "matched-string" : "Stockholms",
    "annotation-id" : 2
  }, {
    "preferred-label" : "Kinesiskt kök",
    "type" : "skill",
    "start-position" : 364,
    "end-position" : 368,
    "concept-id" : "ZMdB_i8G_L77",
    "matched-string" : "Kina",
    "annotation-id" : 3
  }, {
    "preferred-label" : "Japanskt kök",
    "type" : "skill",
    "start-position" : 370,
    "end-position" : 375,
    "concept-id" : "EvAm_oco_RcM",
    "matched-string" : "Japan",
    "annotation-id" : 4
  }, {
    "preferred-label" : "Thailändskt kök",
    "type" : "skill",
    "start-position" : 377,
    "end-position" : 385,
    "concept-id" : "zJFj_sZ8_z4E",
    "matched-string" : "Thailand",
    "annotation-id" : 5
  }, {
    "preferred-label" : "Vietnam",
    "type" : "country",
    "start-position" : 390,
    "end-position" : 397,
    "concept-id" : "7RXF_Wx9_mfY",
    "matched-string" : "Vietnam",
    "annotation-id" : 6
  }, {
    "preferred-label" : "Stockholm",
    "type" : "municipality",
    "start-position" : 601,
    "end-position" : 610,
    "concept-id" : "AvNB_uwa_6n6",
    "matched-string" : "Stockholm",
    "annotation-id" : 7
  }, {
    "preferred-label" : "Restaurang",
    "type" : "keyword",
    "start-position" : 628,
    "end-position" : 640,
    "concept-id" : "o2Cg_3Ap_qvK",
    "matched-string" : "restauranger",
    "annotation-id" : 8
  } ],
  "text" : "Servitör/Servitris sökes\nJust nu söker vi förstärkning till vårt matsalsteam!\nRice är en familjär restaurang belägen på en av Stockholms mest attraktiva och centrala adresser. Här är en mötesplats med en avslappnad och varm känsla där gäster kan avnjuta en unik, utsökt och oförglömlig asiatisk upplevelse. Vår meny med inspiration från olika delar av Asien såsom Kina, Japan, Thailand och Vietnam återspeglar århundraden av matlagning. Så hos oss är det väldigt viktigt att man som anställd har ett genuint intresse av att vilja förstå och lära sig mycket om den asiatiska matkulturen.\nRice är en av Stockholm äldsta asiatiska restauranger. Alla som jobbar här är en del av familjen Rice, så tanken är att arbetsplatsen ska kännas som ett andra hem för oss som jobbar här och det är väldigt viktigt för oss att vi hjälper varandra och visar varandra respekt och välvilja.\nÄlskar du att träffa nya människor och precis som vi blir lyckliga av att få ge gästerna en förstklassig service och en upplevelse som gör de lyckliga? Är du utåtriktad och positiv? Kan hålla ett högt tempo? För vi har hög beläggning så hos oss går det undan.\nPassar du in på beskrivningen? Kul! Sök direkt.\nVi ser fram emot att läsa din ansökan."
}