{
  "meta" : {
    "jobad" : {
      "description" : {
        "requirements" : null,
        "needs" : null,
        "company_information" : null,
        "text_formatted" : "<p>Haga Bygg och Fastigheter AB, har expanderat under det gångna året och behöver nu fler självgående kollegor in i företaget. Vi är ett mindre företag som tar in vitt skilda uppdrag, vilket kräver att vi har bred kompetens.</p><p>Haga Bygg levererar arbete utfört med känsla och kvalité och därför är det viktigt för oss att du har ett genuint intresse för jobbet. För att bli anställd hos oss ska du ha flerårig erfarenhet av bygg- och snickeriarbeten. Det är meriterande om du arbetat med ROT-arbeten. Du ska tycka att det är kul med omväxling och inte vara rädd för att göra något nytt. VI tror att du är lösningsorienterad som person och bra på att fatta egna beslut när det behövs. Utöver det, värdesätter vi att du är lyhörd och kan lyssna till kunder och kollegor för att på bästa sätt anpassa dig efter läget.</p><p>Om du jobbar hårt för oss, kommer vi att jobba hårt för dig. Som mindre företag är en familjär känsla av stor vikt och vi värdesätter allas trivsel. Hos oss kan vi garantera att ingen går obemärkt förbi.</p><p>Du behöver behärska svenska flytande i tal och skrift eftersom våra projekt läggs upp i system som kräver grundläggande språkkunskaper. För att bli aktuell för intervju ska du uppfylla de ställda kraven i annonsen. </p><p>Är du den vi söker? Välkommen med din ansökan! </p><p>Vi besvarar endast per mejl, telefon undanbedes- denna behöver vi hålla öppen för kunder.</p>",
        "conditions" : null,
        "text" : "Haga Bygg och Fastigheter AB, har expanderat under det gångna året och behöver nu fler självgående kollegor in i företaget. Vi är ett mindre företag som tar in vitt skilda uppdrag, vilket kräver att vi har bred kompetens.\nHaga Bygg levererar arbete utfört med känsla och kvalité och därför är det viktigt för oss att du har ett genuint intresse för jobbet. För att bli anställd hos oss ska du ha flerårig erfarenhet av bygg- och snickeriarbeten. Det är meriterande om du arbetat med ROT-arbeten. Du ska tycka att det är kul med omväxling och inte vara rädd för att göra något nytt. VI tror att du är lösningsorienterad som person och bra på att fatta egna beslut när det behövs. Utöver det, värdesätter vi att du är lyhörd och kan lyssna till kunder och kollegor för att på bästa sätt anpassa dig efter läget.\nOm du jobbar hårt för oss, kommer vi att jobba hårt för dig. Som mindre företag är en familjär känsla av stor vikt och vi värdesätter allas trivsel. Hos oss kan vi garantera att ingen går obemärkt förbi.\nDu behöver behärska svenska flytande i tal och skrift eftersom våra projekt läggs upp i system som kräver grundläggande språkkunskaper. För att bli aktuell för intervju ska du uppfylla de ställda kraven i annonsen. \nÄr du den vi söker? Välkommen med din ansökan! \nVi besvarar endast per mejl, telefon undanbedes- denna behöver vi hålla öppen för kunder."
      },
      "headline" : "Träarbetare/ Snickare",
      "driving_license" : [ {
        "concept_id" : "VTK8_WRx_GcM",
        "label" : "B",
        "legacy_ams_taxonomy_id" : "3"
      } ],
      "employer" : {
        "email" : null,
        "phone_number" : null,
        "organization_number" : "5591699532",
        "name" : "Haga Bygg & Fastigheter AB",
        "url" : "www.hagabygg.nu",
        "workplace" : "Haga Bygg & Fastigheter AB"
      },
      "removed_date" : null,
      "logo_url" : "https://www.arbetsformedlingen.se/rest/arbetsgivare/rest/af/v3/arbetsplatser/87208493/logotyper/logo.png",
      "last_publication_date" : "2022-08-27T23:59:59",
      "number_of_vacancies" : 2,
      "occupation" : {
        "concept_id" : "4Z7F_oBG_vMG",
        "label" : "Träarbetare/Snickare",
        "legacy_ams_taxonomy_id" : "6581"
      },
      "occupation_group" : {
        "concept_id" : "9mJN_VwW_Xjg",
        "label" : "Träarbetare, snickare m.fl.",
        "legacy_ams_taxonomy_id" : "7111"
      },
      "employment_type" : {
        "concept_id" : "PFZr_Syz_cUq",
        "label" : "Vanlig anställning",
        "legacy_ams_taxonomy_id" : "1"
      },
      "webpage_url" : "https://arbetsformedlingen.se/platsbanken/annonser/26361308",
      "driving_license_required" : true,
      "application_contacts" : [ ],
      "duration" : {
        "concept_id" : "qQUd_4qe_NDT",
        "label" : "6 månader eller längre",
        "legacy_ams_taxonomy_id" : "2"
      },
      "nice_to_have" : {
        "education_level" : [ ],
        "work_experiences" : [ ],
        "skills" : [ ],
        "education" : [ ],
        "languages" : [ ]
      },
      "application_details" : {
        "via_af" : false,
        "email" : "jobbansokan@hagabygg.nu",
        "other" : null,
        "reference" : null,
        "url" : null,
        "information" : null
      },
      "source_type" : "VIA_ANNONSERA",
      "application_deadline" : "2022-08-27T23:59:59",
      "external_id" : null,
      "workplace_address" : {
        "coordinates" : [ 20.144879067538525, 63.85338663913387 ],
        "city" : "Umeå",
        "postcode" : "90137",
        "municipality" : "Umeå",
        "region_concept_id" : "g5Tt_CAV_zBd",
        "region" : "Västerbottens län",
        "country_code" : "199",
        "region_code" : "24",
        "municipality_concept_id" : "QiGt_BLu_amP",
        "country_concept_id" : "i46j_HmG_v64",
        "municipality_code" : "2480",
        "street_address" : "Kummelvägen 14",
        "country" : "Sverige"
      },
      "id" : "26361308",
      "experience_required" : true,
      "working_hours_type" : {
        "concept_id" : "6YE1_gAC_R2G",
        "label" : "Heltid",
        "legacy_ams_taxonomy_id" : "1"
      },
      "access" : null,
      "timestamp" : 1659032825292,
      "must_have" : {
        "education_level" : [ ],
        "work_experiences" : [ {
          "concept_id" : "4Z7F_oBG_vMG",
          "weight" : 10,
          "label" : "Träarbetare/Snickare",
          "legacy_ams_taxonomy_id" : "6581"
        } ],
        "skills" : [ ],
        "education" : [ ],
        "languages" : [ ]
      },
      "occupation_field" : {
        "concept_id" : "j7Cq_ZJe_GkT",
        "label" : "Bygg och anläggning",
        "legacy_ams_taxonomy_id" : "2"
      },
      "scope_of_work" : {
        "min" : 0,
        "max" : 100
      },
      "salary_type" : {
        "concept_id" : "oG8G_9cW_nRf",
        "label" : "Fast månads- vecko- eller timlön",
        "legacy_ams_taxonomy_id" : "1"
      },
      "removed" : false,
      "salary_description" : null,
      "access_to_own_car" : false,
      "publication_date" : "2022-07-28T20:27:05"
    },
    "name" : "Träarbetare/ Snickare",
    "user" : "hannes"
  },
  "sha1" : "4d2e94ef022333c87f2c8b729646ebb41523e844",
  "annotations" : [ {
    "preferred-label" : "träarbetare",
    "sentiment" : "MUST_HAVE",
    "type" : "esco-occupation",
    "start-position" : 0,
    "end-position" : 11,
    "concept-id" : "FmH5_Pqk_6k3",
    "matched-string" : "träarbetare",
    "annotation-id" : 0
  }, {
    "preferred-label" : "snickare",
    "sentiment" : "MUST_HAVE",
    "type" : "esco-occupation",
    "start-position" : 13,
    "end-position" : 21,
    "concept-id" : "qhAJ_Euo_tNx",
    "matched-string" : "snickare",
    "annotation-id" : 1
  }, {
    "preferred-label" : "Bygg",
    "type" : "occupation-collection",
    "start-position" : 441,
    "end-position" : 445,
    "concept-id" : "ja7J_P8X_YC9",
    "matched-string" : "bygg",
    "annotation-id" : 3
  }, {
    "preferred-label" : "Snickeriarbetare",
    "type" : "keyword",
    "start-position" : 451,
    "end-position" : 466,
    "concept-id" : "jB4B_uED_vQh",
    "matched-string" : "snickeriarbeten",
    "annotation-id" : 4
  }, {
    "preferred-label" : "ROT-jobb",
    "type" : "skill",
    "start-position" : 505,
    "end-position" : 516,
    "concept-id" : "U1ud_XV7_Z8o",
    "matched-string" : "ROT-arbeten",
    "annotation-id" : 5
  }, {
    "preferred-label" : "Svenska",
    "sentiment" : "MUST_HAVE",
    "type" : "language",
    "start-position" : 1056,
    "end-position" : 1063,
    "concept-id" : "zSLA_vw2_FXN",
    "matched-string" : "svenska",
    "annotation-id" : 2
  } ],
  "text" : "Träarbetare/ Snickare\nHaga Bygg och Fastigheter AB, har expanderat under det gångna året och behöver nu fler självgående kollegor in i företaget. Vi är ett mindre företag som tar in vitt skilda uppdrag, vilket kräver att vi har bred kompetens.\nHaga Bygg levererar arbete utfört med känsla och kvalité och därför är det viktigt för oss att du har ett genuint intresse för jobbet. För att bli anställd hos oss ska du ha flerårig erfarenhet av bygg- och snickeriarbeten. Det är meriterande om du arbetat med ROT-arbeten. Du ska tycka att det är kul med omväxling och inte vara rädd för att göra något nytt. VI tror att du är lösningsorienterad som person och bra på att fatta egna beslut när det behövs. Utöver det, värdesätter vi att du är lyhörd och kan lyssna till kunder och kollegor för att på bästa sätt anpassa dig efter läget.\nOm du jobbar hårt för oss, kommer vi att jobba hårt för dig. Som mindre företag är en familjär känsla av stor vikt och vi värdesätter allas trivsel. Hos oss kan vi garantera att ingen går obemärkt förbi.\nDu behöver behärska svenska flytande i tal och skrift eftersom våra projekt läggs upp i system som kräver grundläggande språkkunskaper. För att bli aktuell för intervju ska du uppfylla de ställda kraven i annonsen. \nÄr du den vi söker? Välkommen med din ansökan! \nVi besvarar endast per mejl, telefon undanbedes- denna behöver vi hålla öppen för kunder."
}