{
  "meta" : {
    "jobad" : {
      "description" : {
        "requirements" : null,
        "needs" : null,
        "company_information" : null,
        "text_formatted" : "Pizza Hut rekryterar: Skiftledare med servicekänsla\n\r\n\r\n1958 grundade Bröderna Frank och Dan Carney från Kansas Pizza Hut. De lånade 600 dollar av sin mamma och de slog upp dörrarna till sin första restaurang i Wichita. Det blev succé. Idag finns vi, Pizza Hut, i över 100 länder. Ett starkt varumärke, känt för sina spännande smaker och unika deg, som inte serveras någon annanstans. Vill du vara med och fortsätta succén och lära dig att tillaga en äkta Pan Pizza?\n\nVi söker en skiftledare som älskar service. Du söker en arbetsplats med med härliga och glada kollegor, ett varumärke som klingar kvalitet och unika kunderbjudanden som våra pizzor. Helt enkelt en arbetsplats att trivas på och längta till.&nbsp;\n\nVi behöver dig som är en naturlig ledare som kan ge medarbetarna feedback och coachning. Din positiva attityd skapar en god atmosfär både hos gäster och medarbetare. Du är noggrann och gillar att arbeta mot uppsatta mål som går att mäta. Med ett leende och högt tempo genomför du dina arbetsuppgifter med kvalitet, lär dig nya saker och tar hela tiden initiativ att göra det lilla extra som gör skillnad. Det som skapade och utvecklar succén.\n\nAtt arbeta som skiftledare på Pizza Hut innebär att du&nbsp;ansvarar för restaurangen under dina arbetspass,\nansvarar för inköp, personal- och varukostnader,&nbsp;&nbsp;leder, motiverar och coachar dina medarbetarna,&nbsp;\nhar fokus på detaljer och arbetar aktivt mot restaurangens uppsatta försäljningsmål\n\nVi utbildar dig internt så behöver du ingen tidigare erfarenhet eller utbildning.&nbsp;Vi erbjuder en trevlig arbetsplats med härliga kollegor, givande utbildningar och mycket goda utvecklingsmöjligheter. Förutom lön enligt HRF gröna avtal, erbjuder vi friskvårdsbidrag till våra medarbetare.\n\nVälkommen att göra din ansökan redan idag!\n\n[youtube LzQocnMEXZU]\n\nPå Pizza Hut bakar vi äkta Pan Pizza, det berömda originalet och vår stolthet från 1958. Som pizzaexperter serverar vi naturligtvis också tunn surdeg, San Fransisco Style pizza och världens ostigaste Cheesy crust\n\nVarje vardag vid lunch dukar vi upp vår populära pizza- och gröna sköna salladsbuffé. Resten av dagen och kvällen erbjuder vi även en välsmakande meny med godsaker som pasta, vitlöksbröd, härliga sides, läckra desserter och vår uppskattade mjukglassbar. Givetvis har vi även fullständiga rättigheter med öl och vin. Pizza lovers eller inte, våra restauranger erbjuder något för alla.\n\nVarmt välkommen - familj, vänner eller i eget sällskap!",
        "conditions" : "Deltid\r\nTillsvidare",
        "text" : "Pizza Hut rekryterar: Skiftledare med servicekänsla\n\r\n\r\n1958 grundade Bröderna Frank och Dan Carney från Kansas Pizza Hut. De lånade 600 dollar av sin mamma och de slog upp dörrarna till sin första restaurang i Wichita. Det blev succé. Idag finns vi, Pizza Hut, i över 100 länder. Ett starkt varumärke, känt för sina spännande smaker och unika deg, som inte serveras någon annanstans. Vill du vara med och fortsätta succén och lära dig att tillaga en äkta Pan Pizza?\n\nVi söker en skiftledare som älskar service. Du söker en arbetsplats med med härliga och glada kollegor, ett varumärke som klingar kvalitet och unika kunderbjudanden som våra pizzor. Helt enkelt en arbetsplats att trivas på och längta till. \n\nVi behöver dig som är en naturlig ledare som kan ge medarbetarna feedback och coachning. Din positiva attityd skapar en god atmosfär både hos gäster och medarbetare. Du är noggrann och gillar att arbeta mot uppsatta mål som går att mäta. Med ett leende och högt tempo genomför du dina arbetsuppgifter med kvalitet, lär dig nya saker och tar hela tiden initiativ att göra det lilla extra som gör skillnad. Det som skapade och utvecklar succén.\n\nAtt arbeta som skiftledare på Pizza Hut innebär att du ansvarar för restaurangen under dina arbetspass,\nansvarar för inköp, personal- och varukostnader,  leder, motiverar och coachar dina medarbetarna, \nhar fokus på detaljer och arbetar aktivt mot restaurangens uppsatta försäljningsmål\n\nVi utbildar dig internt så behöver du ingen tidigare erfarenhet eller utbildning. Vi erbjuder en trevlig arbetsplats med härliga kollegor, givande utbildningar och mycket goda utvecklingsmöjligheter. Förutom lön enligt HRF gröna avtal, erbjuder vi friskvårdsbidrag till våra medarbetare.\n\nVälkommen att göra din ansökan redan idag!\n\n[youtube LzQocnMEXZU]\n\nPå Pizza Hut bakar vi äkta Pan Pizza, det berömda originalet och vår stolthet från 1958. Som pizzaexperter serverar vi naturligtvis också tunn surdeg, San Fransisco Style pizza och världens ostigaste Cheesy crust\n\nVarje vardag vid lunch dukar vi upp vår populära pizza- och gröna sköna salladsbuffé. Resten av dagen och kvällen erbjuder vi även en välsmakande meny med godsaker som pasta, vitlöksbröd, härliga sides, läckra desserter och vår uppskattade mjukglassbar. Givetvis har vi även fullständiga rättigheter med öl och vin. Pizza lovers eller inte, våra restauranger erbjuder något för alla.\n\nVarmt välkommen - familj, vänner eller i eget sällskap!"
      },
      "headline" : "Skiftledare med servicekänsla på Pizza Hut",
      "driving_license" : null,
      "employer" : {
        "email" : null,
        "phone_number" : null,
        "organization_number" : "5569715963",
        "name" : "Happyr AB",
        "url" : "http://www.pizzahut.se",
        "workplace" : "Pizza Hut"
      },
      "removed_date" : null,
      "logo_url" : "https://www.arbetsformedlingen.se/rest/arbetsgivare/rest/af/v3/organisation/5569715963/logotyper/logo.png",
      "last_publication_date" : "2022-09-09T23:59:59",
      "number_of_vacancies" : 1,
      "occupation" : {
        "concept_id" : "yXRQ_Ad9_E8V",
        "label" : "Restaurangbiträde",
        "legacy_ams_taxonomy_id" : "5555"
      },
      "occupation_group" : {
        "concept_id" : "tPox_ie4_X9X",
        "label" : "Restaurang- och köksbiträden m.fl.",
        "legacy_ams_taxonomy_id" : "9412"
      },
      "employment_type" : {
        "concept_id" : "PFZr_Syz_cUq",
        "label" : "Vanlig anställning",
        "legacy_ams_taxonomy_id" : "1"
      },
      "webpage_url" : "https://arbetsformedlingen.se/platsbanken/annonser/26400433",
      "driving_license_required" : false,
      "application_contacts" : [ {
        "description" : "Pizza Hut",
        "email" : null,
        "telephone" : null,
        "name" : null,
        "contact_type" : null
      } ],
      "duration" : {
        "concept_id" : "a7uU_j21_mkL",
        "label" : "Tills vidare",
        "legacy_ams_taxonomy_id" : "1"
      },
      "nice_to_have" : {
        "education_level" : [ ],
        "work_experiences" : [ ],
        "skills" : [ ],
        "education" : [ ],
        "languages" : [ ]
      },
      "application_details" : {
        "via_af" : false,
        "email" : null,
        "other" : null,
        "reference" : null,
        "url" : "https://fairrecruiting.se/pizza-hut/job/26955-skiftledare-med-servicekansla_orebro?ref=arbetsformedlingen.se",
        "information" : null
      },
      "source_type" : "VIA_PLATSBANKEN_DXA",
      "application_deadline" : "2022-09-09T23:59:59",
      "external_id" : "46-556971-5963-26955",
      "workplace_address" : {
        "coordinates" : [ 15.21341, 59.27526 ],
        "city" : null,
        "postcode" : null,
        "municipality" : "Örebro",
        "region_concept_id" : "xTCk_nT5_Zjm",
        "region" : "Örebro län",
        "country_code" : "199",
        "region_code" : "18",
        "municipality_concept_id" : "kuMn_feU_hXx",
        "country_concept_id" : "i46j_HmG_v64",
        "municipality_code" : "1880",
        "street_address" : null,
        "country" : "Sverige"
      },
      "id" : "26400433",
      "experience_required" : true,
      "working_hours_type" : {
        "concept_id" : "947z_JGS_Uk2",
        "label" : "Deltid",
        "legacy_ams_taxonomy_id" : "2"
      },
      "access" : null,
      "timestamp" : 1660219583822,
      "must_have" : {
        "education_level" : [ ],
        "work_experiences" : [ {
          "concept_id" : "yXRQ_Ad9_E8V",
          "weight" : 10,
          "label" : "Restaurangbiträde",
          "legacy_ams_taxonomy_id" : "5555"
        } ],
        "skills" : [ ],
        "education" : [ ],
        "languages" : [ ]
      },
      "occupation_field" : {
        "concept_id" : "ScKy_FHB_7wT",
        "label" : "Hotell, restaurang, storhushåll",
        "legacy_ams_taxonomy_id" : "7"
      },
      "scope_of_work" : {
        "min" : 0,
        "max" : 100
      },
      "salary_type" : {
        "concept_id" : "oG8G_9cW_nRf",
        "label" : "Fast månads- vecko- eller timlön",
        "legacy_ams_taxonomy_id" : "1"
      },
      "removed" : false,
      "salary_description" : "Månadslön",
      "access_to_own_car" : false,
      "publication_date" : "2022-08-11T14:06:23"
    },
    "name" : "Skiftledare med servicekänsla på Pizza Hut",
    "user" : "hannes"
  },
  "sha1" : "aab1529be4c1772f4ad7d3b98dc798ccf6a13e1d",
  "annotations" : [ {
    "preferred-label" : "Pizza",
    "sentiment" : "MUST_HAVE",
    "type" : "keyword",
    "start-position" : 33,
    "end-position" : 38,
    "concept-id" : "aoCa_BaF_g6Z",
    "matched-string" : "pizza",
    "annotation-id" : 0
  }, {
    "preferred-label" : "Pizza",
    "sentiment" : "MUST_HAVE",
    "type" : "keyword",
    "start-position" : 43,
    "end-position" : 48,
    "concept-id" : "aoCa_BaF_g6Z",
    "matched-string" : "pizza",
    "annotation-id" : 1
  }, {
    "preferred-label" : "Pizza",
    "sentiment" : "MUST_HAVE",
    "type" : "keyword",
    "start-position" : 155,
    "end-position" : 160,
    "concept-id" : "aoCa_BaF_g6Z",
    "matched-string" : "pizza",
    "annotation-id" : 2
  }, {
    "preferred-label" : "Restaurang",
    "sentiment" : "MUST_HAVE",
    "type" : "keyword",
    "start-position" : 241,
    "end-position" : 251,
    "concept-id" : "o2Cg_3Ap_qvK",
    "matched-string" : "restaurang",
    "annotation-id" : 3
  }, {
    "preferred-label" : "Pizza",
    "sentiment" : "MUST_HAVE",
    "type" : "keyword",
    "start-position" : 294,
    "end-position" : 299,
    "concept-id" : "aoCa_BaF_g6Z",
    "matched-string" : "pizza",
    "annotation-id" : 4
  }, {
    "preferred-label" : "Pizza",
    "sentiment" : "MUST_HAVE",
    "type" : "keyword",
    "start-position" : 503,
    "end-position" : 508,
    "concept-id" : "aoCa_BaF_g6Z",
    "matched-string" : "pizza",
    "annotation-id" : 5
  }, {
    "preferred-label" : "Coaching/Coachning",
    "sentiment" : "MUST_HAVE",
    "type" : "skill",
    "start-position" : 831,
    "end-position" : 840,
    "concept-id" : "91Ef_58Y_jX4",
    "matched-string" : "coachning",
    "annotation-id" : 6
  }, {
    "preferred-label" : "noggrannhet",
    "sentiment" : "MUST_HAVE",
    "type" : "esco-skill",
    "start-position" : 925,
    "end-position" : 933,
    "concept-id" : "mrsW_EkL_KRD",
    "matched-string" : "noggrann",
    "annotation-id" : 15
  }, {
    "preferred-label" : "Pizza",
    "sentiment" : "MUST_HAVE",
    "type" : "keyword",
    "start-position" : 1227,
    "end-position" : 1232,
    "concept-id" : "aoCa_BaF_g6Z",
    "matched-string" : "pizza",
    "annotation-id" : 7
  }, {
    "preferred-label" : "Restaurang",
    "type" : "keyword",
    "start-position" : 1265,
    "end-position" : 1277,
    "concept-id" : "o2Cg_3Ap_qvK",
    "matched-string" : "restaurangen",
    "annotation-id" : 16
  }, {
    "preferred-label" : "Inköpsansvar",
    "sentiment" : "MUST_HAVE",
    "type" : "skill",
    "start-position" : 1314,
    "end-position" : 1319,
    "concept-id" : "xqBL_5Lz_21K",
    "matched-string" : "inköp",
    "annotation-id" : 17
  }, {
    "preferred-label" : "Personalansvar",
    "sentiment" : "MUST_HAVE",
    "type" : "skill",
    "start-position" : 1321,
    "end-position" : 1329,
    "concept-id" : "ZzN5_m7B_5CY",
    "matched-string" : "personal",
    "annotation-id" : 8
  }, {
    "preferred-label" : "Restaurang",
    "type" : "keyword",
    "start-position" : 1445,
    "end-position" : 1458,
    "concept-id" : "o2Cg_3Ap_qvK",
    "matched-string" : "restaurangens",
    "annotation-id" : 18
  }, {
    "preferred-label" : "Kollektivavtal",
    "sentiment" : "OFFERED",
    "type" : "skill",
    "start-position" : 1714,
    "end-position" : 1719,
    "concept-id" : "z7wE_9xb_3jX",
    "matched-string" : "avtal",
    "annotation-id" : 20
  }, {
    "preferred-label" : "Friskvård",
    "sentiment" : "OFFERED",
    "type" : "keyword",
    "start-position" : 1733,
    "end-position" : 1749,
    "concept-id" : "yoHe_xjK_qjH",
    "matched-string" : "friskvårdsbidrag",
    "annotation-id" : 19
  }, {
    "preferred-label" : "Pizza",
    "sentiment" : "MUST_HAVE",
    "type" : "keyword",
    "start-position" : 1844,
    "end-position" : 1849,
    "concept-id" : "aoCa_BaF_g6Z",
    "matched-string" : "pizza",
    "annotation-id" : 9
  }, {
    "preferred-label" : "Pizza",
    "sentiment" : "MUST_HAVE",
    "type" : "keyword",
    "start-position" : 1872,
    "end-position" : 1877,
    "concept-id" : "aoCa_BaF_g6Z",
    "matched-string" : "pizza",
    "annotation-id" : 10
  }, {
    "preferred-label" : "Pizza",
    "sentiment" : "MUST_HAVE",
    "type" : "keyword",
    "start-position" : 2012,
    "end-position" : 2017,
    "concept-id" : "aoCa_BaF_g6Z",
    "matched-string" : "pizza",
    "annotation-id" : 11
  }, {
    "preferred-label" : "Pizza",
    "sentiment" : "MUST_HAVE",
    "type" : "keyword",
    "start-position" : 2104,
    "end-position" : 2109,
    "concept-id" : "aoCa_BaF_g6Z",
    "matched-string" : "pizza",
    "annotation-id" : 12
  }, {
    "preferred-label" : "Sprit/Vin",
    "sentiment" : "MUST_HAVE",
    "type" : "skill",
    "start-position" : 2366,
    "end-position" : 2369,
    "concept-id" : "S4vL_AVu_s6q",
    "matched-string" : "vin",
    "annotation-id" : 13
  }, {
    "preferred-label" : "Pizza",
    "sentiment" : "MUST_HAVE",
    "type" : "keyword",
    "start-position" : 2371,
    "end-position" : 2376,
    "concept-id" : "aoCa_BaF_g6Z",
    "matched-string" : "pizza",
    "annotation-id" : 14
  } ],
  "text" : "Skiftledare med servicekänsla på Pizza Hut\nPizza Hut rekryterar: Skiftledare med servicekänsla\n\r\n\r\n1958 grundade Bröderna Frank och Dan Carney från Kansas Pizza Hut. De lånade 600 dollar av sin mamma och de slog upp dörrarna till sin första restaurang i Wichita. Det blev succé. Idag finns vi, Pizza Hut, i över 100 länder. Ett starkt varumärke, känt för sina spännande smaker och unika deg, som inte serveras någon annanstans. Vill du vara med och fortsätta succén och lära dig att tillaga en äkta Pan Pizza?\n\nVi söker en skiftledare som älskar service. Du söker en arbetsplats med med härliga och glada kollegor, ett varumärke som klingar kvalitet och unika kunderbjudanden som våra pizzor. Helt enkelt en arbetsplats att trivas på och längta till. \n\nVi behöver dig som är en naturlig ledare som kan ge medarbetarna feedback och coachning. Din positiva attityd skapar en god atmosfär både hos gäster och medarbetare. Du är noggrann och gillar att arbeta mot uppsatta mål som går att mäta. Med ett leende och högt tempo genomför du dina arbetsuppgifter med kvalitet, lär dig nya saker och tar hela tiden initiativ att göra det lilla extra som gör skillnad. Det som skapade och utvecklar succén.\n\nAtt arbeta som skiftledare på Pizza Hut innebär att du ansvarar för restaurangen under dina arbetspass,\nansvarar för inköp, personal- och varukostnader,  leder, motiverar och coachar dina medarbetarna, \nhar fokus på detaljer och arbetar aktivt mot restaurangens uppsatta försäljningsmål\n\nVi utbildar dig internt så behöver du ingen tidigare erfarenhet eller utbildning. Vi erbjuder en trevlig arbetsplats med härliga kollegor, givande utbildningar och mycket goda utvecklingsmöjligheter. Förutom lön enligt HRF gröna avtal, erbjuder vi friskvårdsbidrag till våra medarbetare.\n\nVälkommen att göra din ansökan redan idag!\n\n[youtube LzQocnMEXZU]\n\nPå Pizza Hut bakar vi äkta Pan Pizza, det berömda originalet och vår stolthet från 1958. Som pizzaexperter serverar vi naturligtvis också tunn surdeg, San Fransisco Style pizza och världens ostigaste Cheesy crust\n\nVarje vardag vid lunch dukar vi upp vår populära pizza- och gröna sköna salladsbuffé. Resten av dagen och kvällen erbjuder vi även en välsmakande meny med godsaker som pasta, vitlöksbröd, härliga sides, läckra desserter och vår uppskattade mjukglassbar. Givetvis har vi även fullständiga rättigheter med öl och vin. Pizza lovers eller inte, våra restauranger erbjuder något för alla.\n\nVarmt välkommen - familj, vänner eller i eget sällskap!"
}