{
  "meta" : {
    "jobad" : {
      "description" : {
        "requirements" : null,
        "needs" : null,
        "company_information" : null,
        "text_formatted" : "<p><strong>Till vår kund i Markaryd söker vi nu en operatör inom industrin</strong><br><br>Som industriarbetare hos vår kund i Markaryd erbjuder vi dig ett bra jobb där skift förekommer. <br>Vi vill gärna komma i kontakt med dig som trivs inom industrin eller som vill byta jobb. <br><br><br><strong>Din profil</strong><br>Du som söker den här tjänsten har troligen någon form av praktisk utbildning eller motsvarande arbetslivserfarenhet som mekaniker på arbetsmaskiner inom industrin.<br>Det är viktigt att du är en mycket bra lagspelare som har lätt för att samarbeta, att hålla tiderna och göra ett bra jobb, du är även praktiskt lagd med positiv inställning och hög arbetsmoral.<br>Vi lägger även stor vikt på att jobbet görs med hög noggrannhet och bra kvalitet. <br><br>Har du truckkort är detta klart meriterande.<br>Svenska språket i tal och skrift är ett krav.</p><p>Vi erbjuder dig ett stimulerande industriarbete med glada och kompetenta medarbetare och ledare.</p><p>Du ansöker direkt på <a href=\"http://www.empleo.se/\">www.empleo.se</a><br> </p><p>Du är välkommen med din ansökan redan idag!  Vi rekryterar löpande och tjänsterna kan komma att tillsättas innan ansökningstiden har gått ut. </p><p>Uppstart: Enligt överenskommelse <br>Ort/Placering: Markaryd<br>Omfattning: Heltid, skift<br>Lön: Enligt gällande kollektivavtal<br>Ansökningstid: Senast den 3 augusti </p><p> </p>",
        "conditions" : null,
        "text" : "Till vår kund i Markaryd söker vi nu en operatör inom industrin\n\nSom industriarbetare hos vår kund i Markaryd erbjuder vi dig ett bra jobb där skift förekommer. \nVi vill gärna komma i kontakt med dig som trivs inom industrin eller som vill byta jobb. \n\n\nDin profil\nDu som söker den här tjänsten har troligen någon form av praktisk utbildning eller motsvarande arbetslivserfarenhet som mekaniker på arbetsmaskiner inom industrin.\nDet är viktigt att du är en mycket bra lagspelare som har lätt för att samarbeta, att hålla tiderna och göra ett bra jobb, du är även praktiskt lagd med positiv inställning och hög arbetsmoral.\nVi lägger även stor vikt på att jobbet görs med hög noggrannhet och bra kvalitet. \n\nHar du truckkort är detta klart meriterande.\nSvenska språket i tal och skrift är ett krav.\nVi erbjuder dig ett stimulerande industriarbete med glada och kompetenta medarbetare och ledare.\nDu ansöker direkt på www.empleo.se\n \nDu är välkommen med din ansökan redan idag!  Vi rekryterar löpande och tjänsterna kan komma att tillsättas innan ansökningstiden har gått ut. \nUppstart: Enligt överenskommelse \nOrt/Placering: Markaryd\nOmfattning: Heltid, skift\nLön: Enligt gällande kollektivavtal\nAnsökningstid: Senast den 3 augusti"
      },
      "headline" : "Vi söker industrimedarbetare till vår kund i Markaryd",
      "driving_license" : null,
      "employer" : {
        "email" : null,
        "phone_number" : null,
        "organization_number" : "5591248710",
        "name" : "Empleo Ljungby AB",
        "url" : null,
        "workplace" : "Empleo Ljungby AB"
      },
      "removed_date" : null,
      "logo_url" : "https://www.arbetsformedlingen.se/rest/arbetsgivare/rest/af/v3/organisation/5591248710/logotyper/logo.png",
      "last_publication_date" : "2022-08-03T23:59:59",
      "number_of_vacancies" : 1,
      "occupation" : {
        "concept_id" : "AUYy_tH3_nkA",
        "label" : "Montör, papp- och textilprodukter",
        "legacy_ams_taxonomy_id" : "5513"
      },
      "occupation_group" : {
        "concept_id" : "HXzD_qvt_HV6",
        "label" : "Övriga montörer",
        "legacy_ams_taxonomy_id" : "8219"
      },
      "employment_type" : {
        "concept_id" : "PFZr_Syz_cUq",
        "label" : "Vanlig anställning",
        "legacy_ams_taxonomy_id" : "1"
      },
      "webpage_url" : "https://arbetsformedlingen.se/platsbanken/annonser/26293294",
      "driving_license_required" : false,
      "application_contacts" : [ {
        "description" : "Peter Johansson",
        "email" : "peter.johansson@empleo.se",
        "telephone" : null,
        "name" : null,
        "contact_type" : null
      } ],
      "duration" : {
        "concept_id" : "a7uU_j21_mkL",
        "label" : "Tills vidare",
        "legacy_ams_taxonomy_id" : "1"
      },
      "nice_to_have" : {
        "education_level" : [ ],
        "work_experiences" : [ ],
        "skills" : [ ],
        "education" : [ ],
        "languages" : [ ]
      },
      "application_details" : {
        "via_af" : false,
        "email" : null,
        "other" : null,
        "reference" : null,
        "url" : "https://apply.recman.no/job_post.php?id=284182&path=ams&sub_id=452",
        "information" : null
      },
      "source_type" : "VIA_PLATSBANKEN_DXA",
      "application_deadline" : "2022-08-03T23:59:59",
      "external_id" : "46-559124-8710-28418262c3e9123ad77",
      "workplace_address" : {
        "coordinates" : [ 13.766766, 56.158913 ],
        "city" : null,
        "postcode" : null,
        "municipality" : "Hässleholm",
        "region_concept_id" : "CaRE_1nn_cSU",
        "region" : "Skåne län",
        "country_code" : "199",
        "region_code" : "12",
        "municipality_concept_id" : "bP5q_53x_aqJ",
        "country_concept_id" : "i46j_HmG_v64",
        "municipality_code" : "1293",
        "street_address" : null,
        "country" : "Sverige"
      },
      "id" : "26293294",
      "experience_required" : true,
      "working_hours_type" : {
        "concept_id" : "6YE1_gAC_R2G",
        "label" : "Heltid",
        "legacy_ams_taxonomy_id" : "1"
      },
      "access" : null,
      "timestamp" : 1657006362009,
      "must_have" : {
        "education_level" : [ ],
        "work_experiences" : [ {
          "concept_id" : "AUYy_tH3_nkA",
          "weight" : 10,
          "label" : "Montör, papp- och textilprodukter",
          "legacy_ams_taxonomy_id" : "5513"
        } ],
        "skills" : [ ],
        "education" : [ ],
        "languages" : [ ]
      },
      "occupation_field" : {
        "concept_id" : "wTEr_CBC_bqh",
        "label" : "Industriell tillverkning",
        "legacy_ams_taxonomy_id" : "9"
      },
      "scope_of_work" : {
        "min" : 100,
        "max" : 100
      },
      "salary_type" : {
        "concept_id" : "oG8G_9cW_nRf",
        "label" : "Fast månads- vecko- eller timlön",
        "legacy_ams_taxonomy_id" : "1"
      },
      "removed" : false,
      "salary_description" : null,
      "access_to_own_car" : false,
      "publication_date" : "2022-07-05T09:32:42"
    },
    "name" : "Vi söker industrimedarbetare till vår kund i Markaryd",
    "user" : "hannes"
  },
  "sha1" : "b63194946d2cc858a5192d617d23201de37efd86",
  "annotations" : [ {
    "preferred-label" : "Markaryd",
    "type" : "municipality",
    "start-position" : 45,
    "end-position" : 53,
    "concept-id" : "ZhVf_yL5_Q5g",
    "matched-string" : "Markaryd",
    "annotation-id" : 3
  }, {
    "preferred-label" : "Markaryd",
    "type" : "municipality",
    "start-position" : 70,
    "end-position" : 78,
    "concept-id" : "ZhVf_yL5_Q5g",
    "matched-string" : "Markaryd",
    "annotation-id" : 4
  }, {
    "preferred-label" : "Industrioperatör",
    "type" : "keyword",
    "start-position" : 94,
    "end-position" : 117,
    "concept-id" : "zHcv_XHC_Q2H",
    "matched-string" : "operatör inom industrin",
    "annotation-id" : 5
  }, {
    "preferred-label" : "Markaryd",
    "type" : "municipality",
    "start-position" : 155,
    "end-position" : 163,
    "concept-id" : "ZhVf_yL5_Q5g",
    "matched-string" : "Markaryd",
    "annotation-id" : 6
  }, {
    "preferred-label" : "Industrimekaniker",
    "type" : "keyword",
    "start-position" : 439,
    "end-position" : 448,
    "concept-id" : "AiKj_1DA_gWi",
    "matched-string" : "mekaniker",
    "annotation-id" : 7
  }, {
    "preferred-label" : "Industrimekaniker",
    "type" : "keyword",
    "start-position" : 472,
    "end-position" : 481,
    "concept-id" : "AiKj_1DA_gWi",
    "matched-string" : "industrin",
    "annotation-id" : 8
  }, {
    "preferred-label" : "samarbeta med kolleger",
    "type" : "esco-skill",
    "start-position" : 554,
    "end-position" : 563,
    "concept-id" : "X15R_797_q62",
    "matched-string" : "samarbeta",
    "annotation-id" : 9
  }, {
    "preferred-label" : "noggrannhet",
    "type" : "esco-skill",
    "start-position" : 729,
    "end-position" : 740,
    "concept-id" : "mrsW_EkL_KRD",
    "matched-string" : "noggrannhet",
    "annotation-id" : 10
  }, {
    "preferred-label" : "Svenska språket",
    "sentiment" : "MUST_HAVE",
    "type" : "keyword",
    "start-position" : 806,
    "end-position" : 821,
    "concept-id" : "BiGm_58D_SSn",
    "matched-string" : "svenska språket",
    "annotation-id" : 0
  }, {
    "preferred-label" : "Industriarbete",
    "sentiment" : "MUST_HAVE",
    "type" : "keyword",
    "start-position" : 885,
    "end-position" : 899,
    "concept-id" : "fpA8_XFc_122",
    "matched-string" : "industriarbete",
    "annotation-id" : 1
  }, {
    "preferred-label" : "Markaryd",
    "type" : "municipality",
    "start-position" : 1178,
    "end-position" : 1186,
    "concept-id" : "ZhVf_yL5_Q5g",
    "matched-string" : "Markaryd",
    "annotation-id" : 11
  }, {
    "preferred-label" : "Heltid",
    "type" : "worktime-extent",
    "start-position" : 1199,
    "end-position" : 1205,
    "concept-id" : "6YE1_gAC_R2G",
    "matched-string" : "Heltid",
    "annotation-id" : 12
  }, {
    "preferred-label" : "Kollektivavtal",
    "sentiment" : "MUST_HAVE",
    "type" : "skill",
    "start-position" : 1234,
    "end-position" : 1248,
    "concept-id" : "z7wE_9xb_3jX",
    "matched-string" : "kollektivavtal",
    "annotation-id" : 2
  } ],
  "text" : "Vi söker industrimedarbetare till vår kund i Markaryd\nTill vår kund i Markaryd söker vi nu en operatör inom industrin\n\nSom industriarbetare hos vår kund i Markaryd erbjuder vi dig ett bra jobb där skift förekommer. \nVi vill gärna komma i kontakt med dig som trivs inom industrin eller som vill byta jobb. \n\n\nDin profil\nDu som söker den här tjänsten har troligen någon form av praktisk utbildning eller motsvarande arbetslivserfarenhet som mekaniker på arbetsmaskiner inom industrin.\nDet är viktigt att du är en mycket bra lagspelare som har lätt för att samarbeta, att hålla tiderna och göra ett bra jobb, du är även praktiskt lagd med positiv inställning och hög arbetsmoral.\nVi lägger även stor vikt på att jobbet görs med hög noggrannhet och bra kvalitet. \n\nHar du truckkort är detta klart meriterande.\nSvenska språket i tal och skrift är ett krav.\nVi erbjuder dig ett stimulerande industriarbete med glada och kompetenta medarbetare och ledare.\nDu ansöker direkt på www.empleo.se\n \nDu är välkommen med din ansökan redan idag!  Vi rekryterar löpande och tjänsterna kan komma att tillsättas innan ansökningstiden har gått ut. \nUppstart: Enligt överenskommelse \nOrt/Placering: Markaryd\nOmfattning: Heltid, skift\nLön: Enligt gällande kollektivavtal\nAnsökningstid: Senast den 3 augusti"
}