{
  "meta" : {
    "jobad" : {
      "description" : {
        "requirements" : null,
        "needs" : null,
        "company_information" : null,
        "text_formatted" : "<p>Lundgren Reklam &amp; Design i Ystad söker dig som är grafisk formgivare med känsla för färg, form och budskap. Vi jobbar med varierande kunder inom olika branscher och med olika behov av marknadsföring. Arbetet omfattar såväl trycksaker och webbdesign som social media och film. Därför är det bra om du har ett flexibelt formspråk och i ditt sätt att jobba. Vi ser gärna att du är självgående men med en god samarbetsförmåga och social kompetens. </p><p>Dina arbetsuppgifter kommer bland annat att bestå av att:</p><p>- Producera, formge och uppdatera broschyrer och kataloger.</p><p>- Bygga och underhålla webbsidor.</p><p>- Ta fram företagsprofiler och logotyper.</p><p>- Underhålla och uppdatera sociala kanaler.</p><p>- Redigera film, foto och rörlig grafik.</p><p>Som person är du noggrann, kreativ och ambitiös med ordning och reda i ditt arbete. Du har bra driv, är prestigelös och det är viktigt för dig att uppnå resultat. Vi förutsätter att du är branschintresserad och följer trender inom grafisk design, webb och sociala medier samt generellt håller dig uppdaterad inom yrket.</p><p>Goda kunskaper i InDesign, Illustrator, Photoshop och Office-programmen är ett krav för att klara arbetsuppgifterna såsom kunskaper inom webbdesign, html, css och gärna i Wordpress. Övriga program som After Effects och Premiere Pro är meriterande.</p><p>Du får gärna ha erfarenhet av film/foto och redigering och ett plus är om du även har möjlighet att ta fram rörligt material så som mindre animationer.</p><p>Förutom personligt brev och CV som vi vill ha så snart som möjligt, önskar vi även se en portfolio med olika typer av arbeten (helst webbaserad).</p><p>Omfattning: Heltid (6 månaders provanställning tillämpas)</p><p>Kontakt: Marcus Lundgren</p><p>info@lundgrenreklam.se </p>",
        "conditions" : null,
        "text" : "Lundgren Reklam & Design i Ystad söker dig som är grafisk formgivare med känsla för färg, form och budskap. Vi jobbar med varierande kunder inom olika branscher och med olika behov av marknadsföring. Arbetet omfattar såväl trycksaker och webbdesign som social media och film. Därför är det bra om du har ett flexibelt formspråk och i ditt sätt att jobba. Vi ser gärna att du är självgående men med en god samarbetsförmåga och social kompetens. \nDina arbetsuppgifter kommer bland annat att bestå av att:\n- Producera, formge och uppdatera broschyrer och kataloger.\n- Bygga och underhålla webbsidor.\n- Ta fram företagsprofiler och logotyper.\n- Underhålla och uppdatera sociala kanaler.\n- Redigera film, foto och rörlig grafik.\nSom person är du noggrann, kreativ och ambitiös med ordning och reda i ditt arbete. Du har bra driv, är prestigelös och det är viktigt för dig att uppnå resultat. Vi förutsätter att du är branschintresserad och följer trender inom grafisk design, webb och sociala medier samt generellt håller dig uppdaterad inom yrket.\nGoda kunskaper i InDesign, Illustrator, Photoshop och Office-programmen är ett krav för att klara arbetsuppgifterna såsom kunskaper inom webbdesign, html, css och gärna i Wordpress. Övriga program som After Effects och Premiere Pro är meriterande.\nDu får gärna ha erfarenhet av film/foto och redigering och ett plus är om du även har möjlighet att ta fram rörligt material så som mindre animationer.\nFörutom personligt brev och CV som vi vill ha så snart som möjligt, önskar vi även se en portfolio med olika typer av arbeten (helst webbaserad).\nOmfattning: Heltid (6 månaders provanställning tillämpas)\nKontakt: Marcus Lundgren\ninfo@lundgrenreklam.se"
      },
      "headline" : "Grafisk formgivare sökes",
      "driving_license" : [ {
        "concept_id" : "VTK8_WRx_GcM",
        "label" : "B",
        "legacy_ams_taxonomy_id" : "3"
      } ],
      "employer" : {
        "email" : null,
        "phone_number" : null,
        "organization_number" : "5567796726",
        "name" : "Lundgren Reklam & Design AB",
        "url" : "www.lundgrenreklam.se",
        "workplace" : "Lundgren Reklam & Design AB"
      },
      "removed_date" : null,
      "logo_url" : "https://www.arbetsformedlingen.se/rest/arbetsgivare/rest/af/v3/arbetsplatser/86204080/logotyper/logo.png",
      "last_publication_date" : "2022-08-14T23:59:59",
      "number_of_vacancies" : 1,
      "occupation" : {
        "concept_id" : "VpYo_k5f_N9R",
        "label" : "Grafisk formgivare",
        "legacy_ams_taxonomy_id" : "4039"
      },
      "occupation_group" : {
        "concept_id" : "8Bmh_vtM_zts",
        "label" : "Grafisk formgivare m.fl.",
        "legacy_ams_taxonomy_id" : "2172"
      },
      "employment_type" : {
        "concept_id" : "PFZr_Syz_cUq",
        "label" : "Vanlig anställning",
        "legacy_ams_taxonomy_id" : "1"
      },
      "webpage_url" : "https://arbetsformedlingen.se/platsbanken/annonser/26328960",
      "driving_license_required" : true,
      "application_contacts" : [ ],
      "duration" : {
        "concept_id" : "a7uU_j21_mkL",
        "label" : "Tills vidare",
        "legacy_ams_taxonomy_id" : "1"
      },
      "nice_to_have" : {
        "education_level" : [ ],
        "work_experiences" : [ {
          "concept_id" : "VpYo_k5f_N9R",
          "weight" : 5,
          "label" : "Grafisk formgivare",
          "legacy_ams_taxonomy_id" : "4039"
        } ],
        "skills" : [ ],
        "education" : [ ],
        "languages" : [ ]
      },
      "application_details" : {
        "via_af" : false,
        "email" : "info@lundgrenreklam.se",
        "other" : null,
        "reference" : "Grafisk formgivare",
        "url" : null,
        "information" : null
      },
      "source_type" : "VIA_ANNONSERA",
      "application_deadline" : "2022-08-14T23:59:59",
      "external_id" : null,
      "workplace_address" : {
        "coordinates" : [ 13.843060647902208, 55.447622735132384 ],
        "city" : "Ystad",
        "postcode" : "27139",
        "municipality" : "Ystad",
        "region_concept_id" : "CaRE_1nn_cSU",
        "region" : "Skåne län",
        "country_code" : "199",
        "region_code" : "12",
        "municipality_concept_id" : "hdYk_hnP_uju",
        "country_concept_id" : "i46j_HmG_v64",
        "municipality_code" : "1286",
        "street_address" : "Mässingsgatan 13",
        "country" : "Sverige"
      },
      "id" : "26328960",
      "experience_required" : true,
      "working_hours_type" : {
        "concept_id" : "6YE1_gAC_R2G",
        "label" : "Heltid",
        "legacy_ams_taxonomy_id" : "1"
      },
      "access" : null,
      "timestamp" : 1657865490300,
      "must_have" : {
        "education_level" : [ {
          "concept_id" : "asZm_TEQ_Srk",
          "weight" : 10,
          "label" : "Eftergymnasial utbildning två år eller längre",
          "legacy_ams_taxonomy_id" : "6"
        } ],
        "work_experiences" : [ ],
        "skills" : [ ],
        "education" : [ {
          "concept_id" : "u2a1_mAW_vt1",
          "weight" : 10,
          "label" : "Konst och media",
          "legacy_ams_taxonomy_id" : "5"
        } ],
        "languages" : [ ]
      },
      "occupation_field" : {
        "concept_id" : "9puE_nYg_crq",
        "label" : "Kultur, media, design",
        "legacy_ams_taxonomy_id" : "11"
      },
      "scope_of_work" : {
        "min" : 0,
        "max" : 100
      },
      "salary_type" : {
        "concept_id" : "oG8G_9cW_nRf",
        "label" : "Fast månads- vecko- eller timlön",
        "legacy_ams_taxonomy_id" : "1"
      },
      "removed" : false,
      "salary_description" : null,
      "access_to_own_car" : false,
      "publication_date" : "2022-07-15T08:06:15"
    },
    "name" : "Grafisk formgivare sökes",
    "user" : "hannes"
  },
  "sha1" : "4a15a7af22ee8cecc0d168a5c31bbe071cc134f0",
  "annotations" : [ {
    "preferred-label" : "grafisk formgivare",
    "sentiment" : "MUST_HAVE",
    "type" : "esco-occupation",
    "start-position" : 0,
    "end-position" : 18,
    "concept-id" : "pkdv_NLH_jhK",
    "matched-string" : "grafisk formgivare",
    "annotation-id" : 0
  }, {
    "preferred-label" : "Ystad",
    "type" : "municipality",
    "start-position" : 52,
    "end-position" : 57,
    "concept-id" : "hdYk_hnP_uju",
    "matched-string" : "Ystad",
    "annotation-id" : 12
  }, {
    "preferred-label" : "grafisk formgivare",
    "sentiment" : "MUST_HAVE",
    "type" : "esco-occupation",
    "start-position" : 75,
    "end-position" : 93,
    "concept-id" : "pkdv_NLH_jhK",
    "matched-string" : "grafisk formgivare",
    "annotation-id" : 1
  }, {
    "preferred-label" : "Färg/Kemikalieprodukter/Tapeter",
    "sentiment" : "MUST_HAVE",
    "type" : "skill",
    "start-position" : 109,
    "end-position" : 113,
    "concept-id" : "fyJi_1k3_CdV",
    "matched-string" : "färg",
    "annotation-id" : 2
  }, {
    "preferred-label" : "marknadsföring",
    "sentiment" : "MUST_HAVE",
    "type" : "esco-skill",
    "start-position" : 209,
    "end-position" : 223,
    "concept-id" : "UXRx_guv_ZGc",
    "matched-string" : "marknadsföring",
    "annotation-id" : 3
  }, {
    "preferred-label" : "Webbdesign",
    "sentiment" : "MUST_HAVE",
    "type" : "skill",
    "start-position" : 263,
    "end-position" : 273,
    "concept-id" : "YNXq_yH4_fhK",
    "matched-string" : "webbdesign",
    "annotation-id" : 4
  }, {
    "preferred-label" : "Film",
    "type" : "skill",
    "start-position" : 295,
    "end-position" : 299,
    "concept-id" : "Lu8w_Lrd_n1y",
    "matched-string" : "film",
    "annotation-id" : 13
  }, {
    "preferred-label" : "uppvisa social kompetens",
    "type" : "esco-skill",
    "start-position" : 451,
    "end-position" : 467,
    "concept-id" : "5AbQ_a6i_H1T",
    "matched-string" : "social kompetens",
    "annotation-id" : 14
  }, {
    "preferred-label" : "noggrannhet",
    "type" : "esco-skill",
    "start-position" : 766,
    "end-position" : 774,
    "concept-id" : "mrsW_EkL_KRD",
    "matched-string" : "noggrann",
    "annotation-id" : 15
  }, {
    "preferred-label" : "Grafisk design",
    "sentiment" : "MUST_HAVE",
    "type" : "skill",
    "start-position" : 980,
    "end-position" : 994,
    "concept-id" : "dTK5_R7G_p56",
    "matched-string" : "grafisk design",
    "annotation-id" : 5
  }, {
    "preferred-label" : "Webb",
    "sentiment" : "MUST_HAVE",
    "type" : "skill",
    "start-position" : 996,
    "end-position" : 1000,
    "concept-id" : "KKQV_aGF_bWq",
    "matched-string" : "webb",
    "annotation-id" : 6
  }, {
    "preferred-label" : "Layout-Adobe InDesign",
    "type" : "skill",
    "start-position" : 1086,
    "end-position" : 1094,
    "concept-id" : "Y2t4_aS8_tGo",
    "matched-string" : "InDesign",
    "annotation-id" : 16
  }, {
    "preferred-label" : "Adobe Illustrator",
    "type" : "esco-skill",
    "start-position" : 1096,
    "end-position" : 1107,
    "concept-id" : "bGA6_xqh_Cvv",
    "matched-string" : "Illustrator",
    "annotation-id" : 17
  }, {
    "preferred-label" : "Adobe Photoshop",
    "type" : "esco-skill",
    "start-position" : 1109,
    "end-position" : 1118,
    "concept-id" : "87jf_fNQ_UrH",
    "matched-string" : "Photoshop",
    "annotation-id" : 18
  }, {
    "preferred-label" : "MS Office",
    "type" : "skill",
    "start-position" : 1123,
    "end-position" : 1140,
    "concept-id" : "w8bU_wHe_omF",
    "matched-string" : "Office-programmen",
    "annotation-id" : 19
  }, {
    "preferred-label" : "Webbdesign",
    "sentiment" : "MUST_HAVE",
    "type" : "skill",
    "start-position" : 1206,
    "end-position" : 1216,
    "concept-id" : "YNXq_yH4_fhK",
    "matched-string" : "webbdesign",
    "annotation-id" : 7
  }, {
    "preferred-label" : "HTML, programmeringsspråk",
    "sentiment" : "MUST_HAVE",
    "type" : "skill",
    "start-position" : 1218,
    "end-position" : 1222,
    "concept-id" : "K8eq_sEz_eXV",
    "matched-string" : "html",
    "annotation-id" : 8
  }, {
    "preferred-label" : "CSS",
    "sentiment" : "MUST_HAVE",
    "type" : "esco-skill",
    "start-position" : 1224,
    "end-position" : 1227,
    "concept-id" : "g5MZ_uTz_89a",
    "matched-string" : "css",
    "annotation-id" : 9
  }, {
    "preferred-label" : "WordPress",
    "sentiment" : "MUST_HAVE",
    "type" : "esco-skill",
    "start-position" : 1240,
    "end-position" : 1249,
    "concept-id" : "N7bn_VwH_iPS",
    "matched-string" : "wordpress",
    "annotation-id" : 10
  }, {
    "preferred-label" : "After effects",
    "sentiment" : "MUST_HAVE",
    "type" : "skill",
    "start-position" : 1270,
    "end-position" : 1283,
    "concept-id" : "9v6p_GF1_74U",
    "matched-string" : "after effects",
    "annotation-id" : 11
  }, {
    "preferred-label" : "Film/redigering-Adobe Premiere",
    "type" : "skill",
    "start-position" : 1288,
    "end-position" : 1300,
    "concept-id" : "GCMj_xLD_mj6",
    "matched-string" : "Premiere Pro",
    "annotation-id" : 20
  }, {
    "preferred-label" : "Film",
    "type" : "skill",
    "start-position" : 1347,
    "end-position" : 1351,
    "concept-id" : "Lu8w_Lrd_n1y",
    "matched-string" : "film",
    "annotation-id" : 21
  }, {
    "preferred-label" : "Fotografer",
    "type" : "ssyk-level-4",
    "start-position" : 1352,
    "end-position" : 1356,
    "concept-id" : "3J38_DNz_YKK",
    "matched-string" : "foto",
    "annotation-id" : 22
  }, {
    "preferred-label" : "Heltid",
    "type" : "worktime-extent",
    "start-position" : 1627,
    "end-position" : 1633,
    "concept-id" : "6YE1_gAC_R2G",
    "matched-string" : "Heltid",
    "annotation-id" : 23
  } ],
  "text" : "Grafisk formgivare sökes\nLundgren Reklam & Design i Ystad söker dig som är grafisk formgivare med känsla för färg, form och budskap. Vi jobbar med varierande kunder inom olika branscher och med olika behov av marknadsföring. Arbetet omfattar såväl trycksaker och webbdesign som social media och film. Därför är det bra om du har ett flexibelt formspråk och i ditt sätt att jobba. Vi ser gärna att du är självgående men med en god samarbetsförmåga och social kompetens. \nDina arbetsuppgifter kommer bland annat att bestå av att:\n- Producera, formge och uppdatera broschyrer och kataloger.\n- Bygga och underhålla webbsidor.\n- Ta fram företagsprofiler och logotyper.\n- Underhålla och uppdatera sociala kanaler.\n- Redigera film, foto och rörlig grafik.\nSom person är du noggrann, kreativ och ambitiös med ordning och reda i ditt arbete. Du har bra driv, är prestigelös och det är viktigt för dig att uppnå resultat. Vi förutsätter att du är branschintresserad och följer trender inom grafisk design, webb och sociala medier samt generellt håller dig uppdaterad inom yrket.\nGoda kunskaper i InDesign, Illustrator, Photoshop och Office-programmen är ett krav för att klara arbetsuppgifterna såsom kunskaper inom webbdesign, html, css och gärna i Wordpress. Övriga program som After Effects och Premiere Pro är meriterande.\nDu får gärna ha erfarenhet av film/foto och redigering och ett plus är om du även har möjlighet att ta fram rörligt material så som mindre animationer.\nFörutom personligt brev och CV som vi vill ha så snart som möjligt, önskar vi även se en portfolio med olika typer av arbeten (helst webbaserad).\nOmfattning: Heltid (6 månaders provanställning tillämpas)\nKontakt: Marcus Lundgren\ninfo@lundgrenreklam.se"
}