{
  "meta" : {
    "jobad" : {
      "description" : {
        "requirements" : null,
        "needs" : null,
        "company_information" : null,
        "text_formatted" : "Är du en person som värdesätter utveckling, engagemang och omtänksamhet i ditt arbetsliv? Då skulle vi passa bra ihop – för det gör vi också. \n\nGenom att jobba hos oss är du med och bidrar till en bättre vardag för tusentals människor i Marks kommun. Inte minst din egen. Hos oss får du möjlighet att växa – både som person men också i din yrkesroll, samtidigt som det du jobbar med får ett helt samhälle att växa. Oavsett vad dina arbetsuppgifter är så kommer du göra livet för alla de som bor och verkar här lite enklare. Och det är något vi värdesätter högt. Vår vision är att vara en nära kommun med människan i fokus. Nära varandra, vår omvärld och framtiden. Vi vill vara ett närvarande samhälle som med lugn och värme står bakom ryggen och tar emot våra 35 000 invånare, 3 500 medarbetare och hundratals företagare. Då blir varenda medarbetare hos oss betydelsefull. Tillsammans ser vi till att ett helt samhälle fungerar. \n\r\n\r\nARBETSUPPGIFTER\nStomsåker är ett mindre äldreboende med en somatisk och en demensavdelning med 8 boende vardera.\n\nVi söker dig som är undersköterska och som brinner för våra äldre, deras behov och intressen. \n\nÄr du kanske pusselbiten som saknas i vårt team med extra intresse för rörelse, gymnastik och gruppträning?\n\nDu är en person som vill skapa guldkant och trygghet på höstens dagar genom engagemang och stort ansvarstagande. Du är en person som är både handlingskraftig och framåt men som också ser värdet i ett lugnt samtal och närvaro som en av huvuduppgifterna. Du gillar utmaningar och att utvecklas och samtidigt uppskattar kraften i ett gott team-arbete.\n\nArbetstid sker i form av dag-, kväll-, helgtjänstgöring.\n\r\n\r\nKVALIFIKATIONER\nVi ser att du har undersköterskeutbildning eller annan utbildning med inriktning mot vård och omsorg. Det är meriterande om du besitter tidigare erfarenheter inom demensvården. Vi söker dig som har ett starkt engagemang och intresse för målgruppen. Du har en positiv grundsyn och är professionell i din yrkesroll. Du är ansvarstagande och tar egna initiativ när det krävs. Du planerar dina arbetsuppgifter samt följer lagar och rutiner.\n\nAtt kommunicera och ge service är en mycket viktig del i arbetet och du behöver därför ha både muntliga och skriftliga färdigheter i svenska språket samt god datavana.\n\nVi lägger stor vikt vid personlig lämplighet\n\nIntervjuer kommer att ske löpande.\n\r\n\nÖVRIGT\nVi som jobbar inom Marks kommun utvecklar gemensamt vår tillsammanskultur genom att vi är engagerade, omtänksamma och utvecklande, till långsiktig nytta för individ och samhälle.\n\nSom arbetsgivare främjar vi lika rättigheter, skyldigheter och möjligheter för alla medarbetare och värdesätter de kvaliteter som mångfald och en jämn könsfördelning kan tillföra verksamheten.\n\nMarks kommun erbjuder olika personalförmåner såsom ex. attraktivt friskvårdsbidrag, rabatterat årskort på Västtrafik, hyrcykel, pensions- och semesterväxling samt i förekommande fall flexibel arbetstid. Vi har också bra kommunikationer mellan ex Göteborg, Borås, Varberg och det är lätt att parkera om du kör bil.\n\n\nVi undanber oss vänligen men bestämt kontakt med bemannings- och rekryteringsföretag samt försäljare av ytterligare jobbannonser.",
        "conditions" : "Heltid. \r\nTillsvidareanställning, tillträde: Enligt efter överenskommelse.",
        "text" : "Är du en person som värdesätter utveckling, engagemang och omtänksamhet i ditt arbetsliv? Då skulle vi passa bra ihop – för det gör vi också. \n\nGenom att jobba hos oss är du med och bidrar till en bättre vardag för tusentals människor i Marks kommun. Inte minst din egen. Hos oss får du möjlighet att växa – både som person men också i din yrkesroll, samtidigt som det du jobbar med får ett helt samhälle att växa. Oavsett vad dina arbetsuppgifter är så kommer du göra livet för alla de som bor och verkar här lite enklare. Och det är något vi värdesätter högt. Vår vision är att vara en nära kommun med människan i fokus. Nära varandra, vår omvärld och framtiden. Vi vill vara ett närvarande samhälle som med lugn och värme står bakom ryggen och tar emot våra 35 000 invånare, 3 500 medarbetare och hundratals företagare. Då blir varenda medarbetare hos oss betydelsefull. Tillsammans ser vi till att ett helt samhälle fungerar. \n\r\n\r\nARBETSUPPGIFTER\nStomsåker är ett mindre äldreboende med en somatisk och en demensavdelning med 8 boende vardera.\n\nVi söker dig som är undersköterska och som brinner för våra äldre, deras behov och intressen. \n\nÄr du kanske pusselbiten som saknas i vårt team med extra intresse för rörelse, gymnastik och gruppträning?\n\nDu är en person som vill skapa guldkant och trygghet på höstens dagar genom engagemang och stort ansvarstagande. Du är en person som är både handlingskraftig och framåt men som också ser värdet i ett lugnt samtal och närvaro som en av huvuduppgifterna. Du gillar utmaningar och att utvecklas och samtidigt uppskattar kraften i ett gott team-arbete.\n\nArbetstid sker i form av dag-, kväll-, helgtjänstgöring.\n\r\n\r\nKVALIFIKATIONER\nVi ser att du har undersköterskeutbildning eller annan utbildning med inriktning mot vård och omsorg. Det är meriterande om du besitter tidigare erfarenheter inom demensvården. Vi söker dig som har ett starkt engagemang och intresse för målgruppen. Du har en positiv grundsyn och är professionell i din yrkesroll. Du är ansvarstagande och tar egna initiativ när det krävs. Du planerar dina arbetsuppgifter samt följer lagar och rutiner.\n\nAtt kommunicera och ge service är en mycket viktig del i arbetet och du behöver därför ha både muntliga och skriftliga färdigheter i svenska språket samt god datavana.\n\nVi lägger stor vikt vid personlig lämplighet\n\nIntervjuer kommer att ske löpande.\n\r\n\nÖVRIGT\nVi som jobbar inom Marks kommun utvecklar gemensamt vår tillsammanskultur genom att vi är engagerade, omtänksamma och utvecklande, till långsiktig nytta för individ och samhälle.\n\nSom arbetsgivare främjar vi lika rättigheter, skyldigheter och möjligheter för alla medarbetare och värdesätter de kvaliteter som mångfald och en jämn könsfördelning kan tillföra verksamheten.\n\nMarks kommun erbjuder olika personalförmåner såsom ex. attraktivt friskvårdsbidrag, rabatterat årskort på Västtrafik, hyrcykel, pensions- och semesterväxling samt i förekommande fall flexibel arbetstid. Vi har också bra kommunikationer mellan ex Göteborg, Borås, Varberg och det är lätt att parkera om du kör bil.\n\n\nVi undanber oss vänligen men bestämt kontakt med bemannings- och rekryteringsföretag samt försäljare av ytterligare jobbannonser."
      },
      "headline" : "Undersköterska till Stomsåker i Hyssna",
      "driving_license" : null,
      "employer" : {
        "email" : null,
        "phone_number" : null,
        "organization_number" : "2120001504",
        "name" : "Marks kommun",
        "url" : null,
        "workplace" : "Marks Kommun"
      },
      "removed_date" : null,
      "logo_url" : null,
      "last_publication_date" : "2022-09-08T23:59:59",
      "number_of_vacancies" : 3,
      "occupation" : {
        "concept_id" : "Y3QA_5pk_uXd",
        "label" : "Undersköterska, hemtjänst och äldreboende",
        "legacy_ams_taxonomy_id" : "7586"
      },
      "occupation_group" : {
        "concept_id" : "jY19_knH_MJp",
        "label" : "Undersköterskor, hemtjänst, hemsjukvård, äldreboende och habilitering",
        "legacy_ams_taxonomy_id" : "5321"
      },
      "employment_type" : {
        "concept_id" : "PFZr_Syz_cUq",
        "label" : "Vanlig anställning",
        "legacy_ams_taxonomy_id" : "1"
      },
      "webpage_url" : "https://arbetsformedlingen.se/platsbanken/annonser/26426278",
      "driving_license_required" : false,
      "application_contacts" : [ {
        "description" : "Emili Gabriel",
        "email" : "emili.gabriel@mark.se",
        "telephone" : "0320-217942",
        "name" : null,
        "contact_type" : "Rekryterare"
      }, {
        "description" : "Ulrika Lillieroth",
        "email" : "ulrika.lillieroth@mark.se",
        "telephone" : "0320-217211",
        "name" : null,
        "contact_type" : "Rekryterare"
      } ],
      "duration" : {
        "concept_id" : "a7uU_j21_mkL",
        "label" : "Tills vidare",
        "legacy_ams_taxonomy_id" : "1"
      },
      "nice_to_have" : {
        "education_level" : [ ],
        "work_experiences" : [ ],
        "skills" : [ ],
        "education" : [ ],
        "languages" : [ ]
      },
      "application_details" : {
        "via_af" : false,
        "email" : null,
        "other" : null,
        "reference" : "C98954",
        "url" : "https://recruit.visma.com/Public/Apply.aspx?guidAssignment=16b7f08c-dc0e-4398-b408-3b9e62c28f6d&publishCode=AMS&TK=9c8ba1ad-8130-4544-b51f-9d8611e6b5a1",
        "information" : null
      },
      "source_type" : "VIA_PLATSBANKEN_DXA",
      "application_deadline" : "2022-09-08T23:59:59",
      "external_id" : "46-212000-1504-16B7F08CDC0E4398B4083B9E62C28F6D",
      "workplace_address" : {
        "coordinates" : [ 12.610494, 57.469826 ],
        "city" : null,
        "postcode" : null,
        "municipality" : "Mark",
        "region_concept_id" : "zdoY_6u5_Krt",
        "region" : "Västra Götalands län",
        "country_code" : "199",
        "region_code" : "14",
        "municipality_concept_id" : "7HAb_9or_eFM",
        "country_concept_id" : "i46j_HmG_v64",
        "municipality_code" : "1463",
        "street_address" : null,
        "country" : "Sverige"
      },
      "id" : "26426278",
      "experience_required" : true,
      "working_hours_type" : {
        "concept_id" : "6YE1_gAC_R2G",
        "label" : "Heltid",
        "legacy_ams_taxonomy_id" : "1"
      },
      "access" : null,
      "timestamp" : 1660824016518,
      "must_have" : {
        "education_level" : [ ],
        "work_experiences" : [ {
          "concept_id" : "Y3QA_5pk_uXd",
          "weight" : 10,
          "label" : "Undersköterska, hemtjänst, äldreboende och habilitering",
          "legacy_ams_taxonomy_id" : "7586"
        } ],
        "skills" : [ ],
        "education" : [ ],
        "languages" : [ ]
      },
      "occupation_field" : {
        "concept_id" : "NYW6_mP6_vwf",
        "label" : "Hälso- och sjukvård",
        "legacy_ams_taxonomy_id" : "8"
      },
      "scope_of_work" : {
        "min" : 100,
        "max" : 100
      },
      "salary_type" : {
        "concept_id" : "oG8G_9cW_nRf",
        "label" : "Fast månads- vecko- eller timlön",
        "legacy_ams_taxonomy_id" : "1"
      },
      "removed" : false,
      "salary_description" : "Enligt avtal.",
      "access_to_own_car" : false,
      "publication_date" : "2022-08-18T14:00:16"
    },
    "name" : "Undersköterska till Stomsåker i Hyssna",
    "user" : "hannes"
  },
  "sha1" : "be3e7fb968e1201274da7706bd020a0bb545297f",
  "annotations" : [ {
    "preferred-label" : "Undersköterska, hemtjänst, äldreboende och habilitering",
    "sentiment" : "MUST_HAVE",
    "type" : "occupation-name",
    "start-position" : 0,
    "end-position" : 14,
    "concept-id" : "Y3QA_5pk_uXd",
    "matched-string" : "Undersköterska",
    "annotation-id" : 2
  }, {
    "preferred-label" : "Mark",
    "sentiment" : "NOT_RELEVANT",
    "type" : "municipality",
    "start-position" : 276,
    "end-position" : 288,
    "concept-id" : "7HAb_9or_eFM",
    "matched-string" : "Marks kommun",
    "annotation-id" : 3
  }, {
    "preferred-label" : "Äldreboende",
    "sentiment" : "NOT_RELEVANT",
    "type" : "skill",
    "start-position" : 1014,
    "end-position" : 1025,
    "concept-id" : "tykJ_BZQ_Wer",
    "matched-string" : "äldreboende",
    "annotation-id" : 6
  }, {
    "preferred-label" : "Undersköterska, hemtjänst, äldreboende och habilitering",
    "sentiment" : "NOT_RELEVANT",
    "type" : "occupation-name",
    "start-position" : 1108,
    "end-position" : 1122,
    "concept-id" : "Y3QA_5pk_uXd",
    "matched-string" : "undersköterska",
    "annotation-id" : 7
  }, {
    "preferred-label" : "visa ansvarstagande",
    "sentiment" : "MUST_HAVE",
    "type" : "esco-skill",
    "start-position" : 1390,
    "end-position" : 1404,
    "concept-id" : "bcRp_hxV_f5G",
    "matched-string" : "ansvarstagande",
    "annotation-id" : 8
  }, {
    "preferred-label" : "Undersköterskor",
    "sentiment" : "MUST_HAVE",
    "type" : "ssyk-level-3",
    "start-position" : 1738,
    "end-position" : 1762,
    "concept-id" : "3EJj_WLs_kgD",
    "matched-string" : "undersköterskeutbildning",
    "annotation-id" : 9
  }, {
    "preferred-label" : "Demensvård",
    "sentiment" : "NICE_TO_HAVE",
    "type" : "skill",
    "start-position" : 1883,
    "end-position" : 1895,
    "concept-id" : "hqYJ_jyZ_Ks8",
    "matched-string" : "demensvården",
    "annotation-id" : 10
  }, {
    "preferred-label" : "visa ansvarstagande",
    "sentiment" : "MUST_HAVE",
    "type" : "esco-skill",
    "start-position" : 2040,
    "end-position" : 2054,
    "concept-id" : "bcRp_hxV_f5G",
    "matched-string" : "ansvarstagande",
    "annotation-id" : 11
  }, {
    "preferred-label" : "Svenska",
    "sentiment" : "MUST_HAVE",
    "type" : "language",
    "start-position" : 2291,
    "end-position" : 2306,
    "concept-id" : "zSLA_vw2_FXN",
    "matched-string" : "svenska språket",
    "annotation-id" : 1
  }, {
    "preferred-label" : "Mark",
    "sentiment" : "NOT_RELEVANT",
    "type" : "municipality",
    "start-position" : 2437,
    "end-position" : 2449,
    "concept-id" : "7HAb_9or_eFM",
    "matched-string" : "Marks kommun",
    "annotation-id" : 4
  }, {
    "preferred-label" : "Mark",
    "sentiment" : "NOT_RELEVANT",
    "type" : "municipality",
    "start-position" : 2792,
    "end-position" : 2804,
    "concept-id" : "7HAb_9or_eFM",
    "matched-string" : "Marks kommun",
    "annotation-id" : 5
  } ],
  "text" : "Undersköterska till Stomsåker i Hyssna\nÄr du en person som värdesätter utveckling, engagemang och omtänksamhet i ditt arbetsliv? Då skulle vi passa bra ihop – för det gör vi också. \n\nGenom att jobba hos oss är du med och bidrar till en bättre vardag för tusentals människor i Marks kommun. Inte minst din egen. Hos oss får du möjlighet att växa – både som person men också i din yrkesroll, samtidigt som det du jobbar med får ett helt samhälle att växa. Oavsett vad dina arbetsuppgifter är så kommer du göra livet för alla de som bor och verkar här lite enklare. Och det är något vi värdesätter högt. Vår vision är att vara en nära kommun med människan i fokus. Nära varandra, vår omvärld och framtiden. Vi vill vara ett närvarande samhälle som med lugn och värme står bakom ryggen och tar emot våra 35 000 invånare, 3 500 medarbetare och hundratals företagare. Då blir varenda medarbetare hos oss betydelsefull. Tillsammans ser vi till att ett helt samhälle fungerar. \n\r\n\r\nARBETSUPPGIFTER\nStomsåker är ett mindre äldreboende med en somatisk och en demensavdelning med 8 boende vardera.\n\nVi söker dig som är undersköterska och som brinner för våra äldre, deras behov och intressen. \n\nÄr du kanske pusselbiten som saknas i vårt team med extra intresse för rörelse, gymnastik och gruppträning?\n\nDu är en person som vill skapa guldkant och trygghet på höstens dagar genom engagemang och stort ansvarstagande. Du är en person som är både handlingskraftig och framåt men som också ser värdet i ett lugnt samtal och närvaro som en av huvuduppgifterna. Du gillar utmaningar och att utvecklas och samtidigt uppskattar kraften i ett gott team-arbete.\n\nArbetstid sker i form av dag-, kväll-, helgtjänstgöring.\n\r\n\r\nKVALIFIKATIONER\nVi ser att du har undersköterskeutbildning eller annan utbildning med inriktning mot vård och omsorg. Det är meriterande om du besitter tidigare erfarenheter inom demensvården. Vi söker dig som har ett starkt engagemang och intresse för målgruppen. Du har en positiv grundsyn och är professionell i din yrkesroll. Du är ansvarstagande och tar egna initiativ när det krävs. Du planerar dina arbetsuppgifter samt följer lagar och rutiner.\n\nAtt kommunicera och ge service är en mycket viktig del i arbetet och du behöver därför ha både muntliga och skriftliga färdigheter i svenska språket samt god datavana.\n\nVi lägger stor vikt vid personlig lämplighet\n\nIntervjuer kommer att ske löpande.\n\r\n\nÖVRIGT\nVi som jobbar inom Marks kommun utvecklar gemensamt vår tillsammanskultur genom att vi är engagerade, omtänksamma och utvecklande, till långsiktig nytta för individ och samhälle.\n\nSom arbetsgivare främjar vi lika rättigheter, skyldigheter och möjligheter för alla medarbetare och värdesätter de kvaliteter som mångfald och en jämn könsfördelning kan tillföra verksamheten.\n\nMarks kommun erbjuder olika personalförmåner såsom ex. attraktivt friskvårdsbidrag, rabatterat årskort på Västtrafik, hyrcykel, pensions- och semesterväxling samt i förekommande fall flexibel arbetstid. Vi har också bra kommunikationer mellan ex Göteborg, Borås, Varberg och det är lätt att parkera om du kör bil.\n\n\nVi undanber oss vänligen men bestämt kontakt med bemannings- och rekryteringsföretag samt försäljare av ytterligare jobbannonser."
}