{
  "meta" : {
    "jobad" : {
      "description" : {
        "requirements" : null,
        "needs" : null,
        "company_information" : null,
        "text_formatted" : "Receptionist till Hesselby Slott\n\nTycker du som vi att musik är livet? Tysta rum är inget för dig, nej det ska var musik, liv och rörelse. Nu söker vi dig som vill vara med och skapa gästupplevelser som både hörs och som det svänger om på Hesselby Slott, Sveriges musikslott. Hesselby Slott är en samlingspunkt för musiker, artister och alla som gillar musik – hoppas du också vill vara här! \n\nPå Hesselby Slott står musiken i centrum, här finns hotellrum inredda av svenska musikartister och en miljö som är inspirerad av musikhistorien. Här finns 70 hotellrum, 14 mötesrum, restaurang och ett orangeri. Hos oss är också våra fyrbenta vänner välkomna. \n\nDin profil\n\nVi söker dig som är expert på gästservice, du har en känsla för detaljer och du drivs av att prata med människor. Vi söker dig som har erfarenhet att jobba i reception och är van att arbeta i en miljö som ställer höga krav. Vi söker dig som är nyfiken, energisk och har en genuin utstrålning.\n\nSom hotellreceptionist kommer du att arbeta i hotellets hjärta och bli gästens första intryck. Det är viktigt att du har hög känsla för service och att du har ambition att ge varje gäst en minnesvärd upplevelse.\n\nSom person ser vi gärna att du är energisk, självgående samt har lätt att anpassa dig till olika situationer med ödmjukhet och initiativförmåga. Du brinner för god service, är ansvarsfull och har inga problem med att jobba mellan avdelningsgränserna. \n\nDu behärskar svenska och engelska obehindrat i både tal och skrift. Erfarenhet av hotellsystemet Protel är meriterande. Vi ser att du har minst ett års dokumenterad vana av arbete i hotellreception.\n\nOm tjänsten\n\nVi på, Stockholm Meeting Selection, bjuder våra gäster på livets goda, varje dag – med ett bemötande och en miljö som stimulerar till glädje, inspiration och utveckling. Vi tror på att om du trivs med dina kollegor och på din arbetsplats så får våra gäster ta del av inspirerande och energisk service. Din glädje avspeglas i vår höga ambition om kvalité och omtanke gentemot våra gäster och deras upplevelse.\n\nDina arbetsuppgifter är bland annat följande:\n• In- och utcheckning av gäster – ta emot gäster vid ankomst och avresa.\n• Bemanna hotellets telefonväxel och hantering av hotellets mailkorg\n• Bidra till mer försäljning\n• Svara på frågor från våra gäster\n• Ta emot bokningar och hantera fakturor\n• Arbeta med kassahantering\n\nVad kan vi erbjuda dig? \n\nVi är en liten familjär organisation med en verksamhet som ger dig stora möjligheter. Här får du vara med och utveckla produkten i ett företag som vill erbjuda våra gäster upplevelser som är allt annat än standard. Vi är stolta över våra unika mötesplatser. Vi bryr oss om våra medarbetare och vi tror att det mesta går att lösa om man vill.\n\nTjänsten är en tills vidare anställning, på heltid. Arbetstiden är efter rullande schema och lönen är enligt avtal med 6 månaders provanställning. \n\nLåter detta intressant? Välkommen med din ansökan snarast. Urval sker löpande så vänta inte med din ansökan. \n\nVi ser fram emot att välkomna dig till vår familj – vi ser fram emot din ansökan.",
        "conditions" : "-\r\n-",
        "text" : "Receptionist till Hesselby Slott\n\nTycker du som vi att musik är livet? Tysta rum är inget för dig, nej det ska var musik, liv och rörelse. Nu söker vi dig som vill vara med och skapa gästupplevelser som både hörs och som det svänger om på Hesselby Slott, Sveriges musikslott. Hesselby Slott är en samlingspunkt för musiker, artister och alla som gillar musik – hoppas du också vill vara här! \n\nPå Hesselby Slott står musiken i centrum, här finns hotellrum inredda av svenska musikartister och en miljö som är inspirerad av musikhistorien. Här finns 70 hotellrum, 14 mötesrum, restaurang och ett orangeri. Hos oss är också våra fyrbenta vänner välkomna. \n\nDin profil\n\nVi söker dig som är expert på gästservice, du har en känsla för detaljer och du drivs av att prata med människor. Vi söker dig som har erfarenhet att jobba i reception och är van att arbeta i en miljö som ställer höga krav. Vi söker dig som är nyfiken, energisk och har en genuin utstrålning.\n\nSom hotellreceptionist kommer du att arbeta i hotellets hjärta och bli gästens första intryck. Det är viktigt att du har hög känsla för service och att du har ambition att ge varje gäst en minnesvärd upplevelse.\n\nSom person ser vi gärna att du är energisk, självgående samt har lätt att anpassa dig till olika situationer med ödmjukhet och initiativförmåga. Du brinner för god service, är ansvarsfull och har inga problem med att jobba mellan avdelningsgränserna. \n\nDu behärskar svenska och engelska obehindrat i både tal och skrift. Erfarenhet av hotellsystemet Protel är meriterande. Vi ser att du har minst ett års dokumenterad vana av arbete i hotellreception.\n\nOm tjänsten\n\nVi på, Stockholm Meeting Selection, bjuder våra gäster på livets goda, varje dag – med ett bemötande och en miljö som stimulerar till glädje, inspiration och utveckling. Vi tror på att om du trivs med dina kollegor och på din arbetsplats så får våra gäster ta del av inspirerande och energisk service. Din glädje avspeglas i vår höga ambition om kvalité och omtanke gentemot våra gäster och deras upplevelse.\n\nDina arbetsuppgifter är bland annat följande:\n• In- och utcheckning av gäster – ta emot gäster vid ankomst och avresa.\n• Bemanna hotellets telefonväxel och hantering av hotellets mailkorg\n• Bidra till mer försäljning\n• Svara på frågor från våra gäster\n• Ta emot bokningar och hantera fakturor\n• Arbeta med kassahantering\n\nVad kan vi erbjuda dig? \n\nVi är en liten familjär organisation med en verksamhet som ger dig stora möjligheter. Här får du vara med och utveckla produkten i ett företag som vill erbjuda våra gäster upplevelser som är allt annat än standard. Vi är stolta över våra unika mötesplatser. Vi bryr oss om våra medarbetare och vi tror att det mesta går att lösa om man vill.\n\nTjänsten är en tills vidare anställning, på heltid. Arbetstiden är efter rullande schema och lönen är enligt avtal med 6 månaders provanställning. \n\nLåter detta intressant? Välkommen med din ansökan snarast. Urval sker löpande så vänta inte med din ansökan. \n\nVi ser fram emot att välkomna dig till vår familj – vi ser fram emot din ansökan."
      },
      "headline" : "Receptionist till Hesselby Slott",
      "driving_license" : null,
      "employer" : {
        "email" : null,
        "phone_number" : null,
        "organization_number" : "5568179799",
        "name" : "Stockholm Meeting Selection AB",
        "url" : null,
        "workplace" : "Stockholm Meeting Selection AB"
      },
      "removed_date" : null,
      "logo_url" : "https://www.arbetsformedlingen.se/rest/arbetsgivare/rest/af/v3/organisation/5568179799/logotyper/logo.png",
      "last_publication_date" : "2022-09-09T23:59:59",
      "number_of_vacancies" : 1,
      "occupation" : {
        "concept_id" : "3kFW_XLk_v9H",
        "label" : "Hotellreceptionist",
        "legacy_ams_taxonomy_id" : "5596"
      },
      "occupation_group" : {
        "concept_id" : "bYde_Frc_xcB",
        "label" : "Hotellreceptionister m.fl.",
        "legacy_ams_taxonomy_id" : "4224"
      },
      "employment_type" : {
        "concept_id" : "PFZr_Syz_cUq",
        "label" : "Vanlig anställning",
        "legacy_ams_taxonomy_id" : "1"
      },
      "webpage_url" : "https://arbetsformedlingen.se/platsbanken/annonser/26389911",
      "driving_license_required" : false,
      "application_contacts" : [ ],
      "duration" : {
        "concept_id" : "a7uU_j21_mkL",
        "label" : "Tills vidare",
        "legacy_ams_taxonomy_id" : "1"
      },
      "nice_to_have" : {
        "education_level" : [ ],
        "work_experiences" : [ ],
        "skills" : [ ],
        "education" : [ ],
        "languages" : [ ]
      },
      "application_details" : {
        "via_af" : false,
        "email" : null,
        "other" : null,
        "reference" : null,
        "url" : "https://www.meetingselection.se/om-sms/lediga-tjanster/?jobid=211935&ref=platsbanken",
        "information" : null
      },
      "source_type" : "VIA_PLATSBANKEN_DXA",
      "application_deadline" : "2022-09-09T23:59:59",
      "external_id" : "46-556817-9799-wb-211935",
      "workplace_address" : {
        "coordinates" : [ 18.06858, 59.329323 ],
        "city" : null,
        "postcode" : null,
        "municipality" : "Stockholm",
        "region_concept_id" : "CifL_Rzy_Mku",
        "region" : "Stockholms län",
        "country_code" : "199",
        "region_code" : "01",
        "municipality_concept_id" : "AvNB_uwa_6n6",
        "country_concept_id" : "i46j_HmG_v64",
        "municipality_code" : "0180",
        "street_address" : null,
        "country" : "Sverige"
      },
      "id" : "26389911",
      "experience_required" : true,
      "working_hours_type" : {
        "concept_id" : "6YE1_gAC_R2G",
        "label" : "Heltid",
        "legacy_ams_taxonomy_id" : "1"
      },
      "access" : null,
      "timestamp" : 1660031323601,
      "must_have" : {
        "education_level" : [ ],
        "work_experiences" : [ {
          "concept_id" : "3kFW_XLk_v9H",
          "weight" : 10,
          "label" : "Hotellreceptionist",
          "legacy_ams_taxonomy_id" : "5596"
        } ],
        "skills" : [ ],
        "education" : [ ],
        "languages" : [ ]
      },
      "occupation_field" : {
        "concept_id" : "ScKy_FHB_7wT",
        "label" : "Hotell, restaurang, storhushåll",
        "legacy_ams_taxonomy_id" : "7"
      },
      "scope_of_work" : {
        "min" : 100,
        "max" : 100
      },
      "salary_type" : {
        "concept_id" : "oG8G_9cW_nRf",
        "label" : "Fast månads- vecko- eller timlön",
        "legacy_ams_taxonomy_id" : "1"
      },
      "removed" : false,
      "salary_description" : "Enligt överenskommelse",
      "access_to_own_car" : false,
      "publication_date" : "2022-08-09T09:48:43"
    },
    "name" : "Receptionist till Hesselby Slott",
    "user" : "hannes"
  },
  "sha1" : "a3634ea3560083f21b4d9382d68f6c739c2d042c",
  "annotations" : [ {
    "preferred-label" : "Receptionist",
    "sentiment" : "MUST_HAVE",
    "type" : "keyword",
    "start-position" : 0,
    "end-position" : 12,
    "concept-id" : "gAAz_Lo5_WRR",
    "matched-string" : "receptionist",
    "annotation-id" : 0
  }, {
    "preferred-label" : "Receptionist",
    "sentiment" : "MUST_HAVE",
    "type" : "keyword",
    "start-position" : 33,
    "end-position" : 45,
    "concept-id" : "gAAz_Lo5_WRR",
    "matched-string" : "receptionist",
    "annotation-id" : 1
  }, {
    "preferred-label" : "Musik",
    "sentiment" : "MUST_HAVE",
    "type" : "skill",
    "start-position" : 88,
    "end-position" : 93,
    "concept-id" : "Tgsx_o7B_Tpo",
    "matched-string" : "musik",
    "annotation-id" : 2
  }, {
    "preferred-label" : "Musik",
    "sentiment" : "MUST_HAVE",
    "type" : "skill",
    "start-position" : 148,
    "end-position" : 153,
    "concept-id" : "Tgsx_o7B_Tpo",
    "matched-string" : "musik",
    "annotation-id" : 3
  }, {
    "preferred-label" : "musiker",
    "sentiment" : "MUST_HAVE",
    "type" : "esco-occupation",
    "start-position" : 348,
    "end-position" : 355,
    "concept-id" : "okbH_FXa_yFz",
    "matched-string" : "musiker",
    "annotation-id" : 4
  }, {
    "preferred-label" : "Musik",
    "sentiment" : "MUST_HAVE",
    "type" : "skill",
    "start-position" : 386,
    "end-position" : 391,
    "concept-id" : "Tgsx_o7B_Tpo",
    "matched-string" : "musik",
    "annotation-id" : 5
  }, {
    "preferred-label" : "Musik",
    "type" : "skill",
    "start-position" : 450,
    "end-position" : 457,
    "concept-id" : "Tgsx_o7B_Tpo",
    "matched-string" : "musiken",
    "annotation-id" : 13
  }, {
    "preferred-label" : "Svenska",
    "sentiment" : "MUST_HAVE",
    "type" : "language",
    "start-position" : 500,
    "end-position" : 507,
    "concept-id" : "zSLA_vw2_FXN",
    "matched-string" : "svenska",
    "annotation-id" : 6
  }, {
    "preferred-label" : "Restaurang",
    "sentiment" : "MUST_HAVE",
    "type" : "keyword",
    "start-position" : 609,
    "end-position" : 619,
    "concept-id" : "o2Cg_3Ap_qvK",
    "matched-string" : "restaurang",
    "annotation-id" : 7
  }, {
    "preferred-label" : "Gästservice",
    "sentiment" : "MUST_HAVE",
    "type" : "keyword",
    "start-position" : 730,
    "end-position" : 741,
    "concept-id" : "XrMa_Z8K_K2N",
    "matched-string" : "gästservice",
    "annotation-id" : 8
  }, {
    "preferred-label" : "Reception",
    "sentiment" : "MUST_HAVE",
    "type" : "keyword",
    "start-position" : 858,
    "end-position" : 867,
    "concept-id" : "zRKv_kwY_uw4",
    "matched-string" : "reception",
    "annotation-id" : 9
  }, {
    "preferred-label" : "Hotellreceptionist",
    "sentiment" : "MUST_HAVE",
    "type" : "occupation-name",
    "start-position" : 998,
    "end-position" : 1016,
    "concept-id" : "3kFW_XLk_v9H",
    "matched-string" : "hotellreceptionist",
    "annotation-id" : 10
  }, {
    "preferred-label" : "Hotell",
    "type" : "keyword",
    "start-position" : 1040,
    "end-position" : 1049,
    "concept-id" : "Jrrg_iiS_2yp",
    "matched-string" : "hotellets",
    "annotation-id" : 14
  }, {
    "preferred-label" : "Svenska",
    "sentiment" : "MUST_HAVE",
    "type" : "language",
    "start-position" : 1473,
    "end-position" : 1480,
    "concept-id" : "zSLA_vw2_FXN",
    "matched-string" : "svenska",
    "annotation-id" : 11
  }, {
    "preferred-label" : "Engelska",
    "sentiment" : "MUST_HAVE",
    "type" : "language",
    "start-position" : 1485,
    "end-position" : 1493,
    "concept-id" : "NVxJ_hLg_TYS",
    "matched-string" : "engelska",
    "annotation-id" : 12
  }, {
    "preferred-label" : "sköta en kassa",
    "type" : "esco-skill",
    "start-position" : 2389,
    "end-position" : 2403,
    "concept-id" : "USNU_LMY_prY",
    "matched-string" : "kassahantering",
    "annotation-id" : 15
  } ],
  "text" : "Receptionist till Hesselby Slott\nReceptionist till Hesselby Slott\n\nTycker du som vi att musik är livet? Tysta rum är inget för dig, nej det ska var musik, liv och rörelse. Nu söker vi dig som vill vara med och skapa gästupplevelser som både hörs och som det svänger om på Hesselby Slott, Sveriges musikslott. Hesselby Slott är en samlingspunkt för musiker, artister och alla som gillar musik – hoppas du också vill vara här! \n\nPå Hesselby Slott står musiken i centrum, här finns hotellrum inredda av svenska musikartister och en miljö som är inspirerad av musikhistorien. Här finns 70 hotellrum, 14 mötesrum, restaurang och ett orangeri. Hos oss är också våra fyrbenta vänner välkomna. \n\nDin profil\n\nVi söker dig som är expert på gästservice, du har en känsla för detaljer och du drivs av att prata med människor. Vi söker dig som har erfarenhet att jobba i reception och är van att arbeta i en miljö som ställer höga krav. Vi söker dig som är nyfiken, energisk och har en genuin utstrålning.\n\nSom hotellreceptionist kommer du att arbeta i hotellets hjärta och bli gästens första intryck. Det är viktigt att du har hög känsla för service och att du har ambition att ge varje gäst en minnesvärd upplevelse.\n\nSom person ser vi gärna att du är energisk, självgående samt har lätt att anpassa dig till olika situationer med ödmjukhet och initiativförmåga. Du brinner för god service, är ansvarsfull och har inga problem med att jobba mellan avdelningsgränserna. \n\nDu behärskar svenska och engelska obehindrat i både tal och skrift. Erfarenhet av hotellsystemet Protel är meriterande. Vi ser att du har minst ett års dokumenterad vana av arbete i hotellreception.\n\nOm tjänsten\n\nVi på, Stockholm Meeting Selection, bjuder våra gäster på livets goda, varje dag – med ett bemötande och en miljö som stimulerar till glädje, inspiration och utveckling. Vi tror på att om du trivs med dina kollegor och på din arbetsplats så får våra gäster ta del av inspirerande och energisk service. Din glädje avspeglas i vår höga ambition om kvalité och omtanke gentemot våra gäster och deras upplevelse.\n\nDina arbetsuppgifter är bland annat följande:\n• In- och utcheckning av gäster – ta emot gäster vid ankomst och avresa.\n• Bemanna hotellets telefonväxel och hantering av hotellets mailkorg\n• Bidra till mer försäljning\n• Svara på frågor från våra gäster\n• Ta emot bokningar och hantera fakturor\n• Arbeta med kassahantering\n\nVad kan vi erbjuda dig? \n\nVi är en liten familjär organisation med en verksamhet som ger dig stora möjligheter. Här får du vara med och utveckla produkten i ett företag som vill erbjuda våra gäster upplevelser som är allt annat än standard. Vi är stolta över våra unika mötesplatser. Vi bryr oss om våra medarbetare och vi tror att det mesta går att lösa om man vill.\n\nTjänsten är en tills vidare anställning, på heltid. Arbetstiden är efter rullande schema och lönen är enligt avtal med 6 månaders provanställning. \n\nLåter detta intressant? Välkommen med din ansökan snarast. Urval sker löpande så vänta inte med din ansökan. \n\nVi ser fram emot att välkomna dig till vår familj – vi ser fram emot din ansökan."
}