{
  "meta" : {
    "jobad" : {
      "description" : {
        "requirements" : null,
        "needs" : null,
        "company_information" : null,
        "text_formatted" : "<p>Express-Bild söker nu en skicklig fotograf för arbete under kommande skolfotoperiod (augusti-oktober) med möjlighet till eventuell förlängning. </p><p><br></p><p>ARBETSUPPGIFTER:</p><p>Arbetsuppgifterna består av att under hösten åka ut till inbokade skolor och fotografera elevporträttbilder och klassbilder i studiomiljö.  En del administrativt kringarbete tillkommer. Arbetsplatsen är hela regionen/mellan Sverige. Innan du tillträder din tjänst som fotograf på Express-Bild får du genomgå en internutbildning. Arbetet innebär en hel del resor och i enstaka fall övernattningar.</p><p>Det finns även möjlighet till förlängning av tjänsten.</p><p><br></p><p>KRAVPROFIL:</p><p>Vi vill att du som söker har mycket goda fotokunskaper och har foto som ett av dina största intressen. Kanske arbetar du redan som fotograf eller är en skicklig amatörfotograf. Tidigare arbete som skolfotograf och/eller idrottsfotograf är mycket meriterande. Utöver detta vill vi att du som söker är ansvarstagande och ordningsam. Det är också viktigt att du har en stor social kompetens och är serviceminded. Du blir vår ambassadör på fältet varför vi lägger stor vikt vid personlig lämplighet och utstrålning.</p><p>Då vi arbetar i ett högt tempo och har många bollar i luften samtidigt är det också viktigt att du är stresstålig och välorganiserad. Då merparten av ditt arbete sker med hjälp av datorn är en mycket god datorvana ett krav. Att du tycker om att arbeta med barn och ungdomar ser vi som en självklarhet. Ett starkt önskemål är att du har tillgång till en egen professionell systemkamera med lämpligt objektiv samt blixt. Du har B körkort och tillgång till egen bil att kunna bruka i tjänsten mot milersättning. I de fall du övernattar på annan ort erhålles lagstadgat traktamente. Ytterligare ett krav är att du hanterar det svenska språket obehindrat i både tal och skrift.</p><p><br></p><p>OM OSS:</p><p>Express-Bild AB är ett nordiskt skol- och idrottsfotoföretag med över 35 års erfarenhet av branschen. Företaget fotograferar varje år ett mycket stort antal skolelever och idrottsutövare runt om i Sverige och i övriga delar av norden. Som medarbetare hos oss på Express-Bild kommer du att vara med om en spännande resa och du blir en viktig länk i vår kedja. Vi på Express-Bild ser personalen som vår viktigaste resurs och är måna om att våra medarbetare skall trivas hos oss. Vi är övertygade om att när våra medarbetare trivs blir vi mer lyckosamma som företag.</p><p><br></p><p>OM ANSÖKAN:</p><p>Då urvalet sker löpande vill vi ha in din ansökan redan idag. Tjänsten kan komma att tillsättas innan sista ansökningsdag. Bifoga CV samt personligt brev. Bifoga gärna en bild på dig själv. Ange \"FOTOGRAF\" samt din region som referens i mailet när du ansöker. Ansökan skickas till e-postadress: rekrytering@expressbild.se</p><p><br></p><p>ÖVRIGT:</p><p>Under skolfotosäsongen är arbetstiden förlagd till dagtid måndag till fredag (heltid 100 %).</p><p>Utöver timlön finns möjlighet att fakturera genom det egna fotoföretaget.</p><p>Innan du anställs kommer du få uppvisa ett utdrag ur belastningsregistret.</p><p>Vi undanber oss alla erbjudanden om annonserings- och rekryteringshjälp i samband med denna annons.</p><p>Välkommen med din ansökan!</p>",
        "conditions" : null,
        "text" : "Express-Bild söker nu en skicklig fotograf för arbete under kommande skolfotoperiod (augusti-oktober) med möjlighet till eventuell förlängning. \n\n\nARBETSUPPGIFTER:\nArbetsuppgifterna består av att under hösten åka ut till inbokade skolor och fotografera elevporträttbilder och klassbilder i studiomiljö.  En del administrativt kringarbete tillkommer. Arbetsplatsen är hela regionen/mellan Sverige. Innan du tillträder din tjänst som fotograf på Express-Bild får du genomgå en internutbildning. Arbetet innebär en hel del resor och i enstaka fall övernattningar.\nDet finns även möjlighet till förlängning av tjänsten.\n\n\nKRAVPROFIL:\nVi vill att du som söker har mycket goda fotokunskaper och har foto som ett av dina största intressen. Kanske arbetar du redan som fotograf eller är en skicklig amatörfotograf. Tidigare arbete som skolfotograf och/eller idrottsfotograf är mycket meriterande. Utöver detta vill vi att du som söker är ansvarstagande och ordningsam. Det är också viktigt att du har en stor social kompetens och är serviceminded. Du blir vår ambassadör på fältet varför vi lägger stor vikt vid personlig lämplighet och utstrålning.\nDå vi arbetar i ett högt tempo och har många bollar i luften samtidigt är det också viktigt att du är stresstålig och välorganiserad. Då merparten av ditt arbete sker med hjälp av datorn är en mycket god datorvana ett krav. Att du tycker om att arbeta med barn och ungdomar ser vi som en självklarhet. Ett starkt önskemål är att du har tillgång till en egen professionell systemkamera med lämpligt objektiv samt blixt. Du har B körkort och tillgång till egen bil att kunna bruka i tjänsten mot milersättning. I de fall du övernattar på annan ort erhålles lagstadgat traktamente. Ytterligare ett krav är att du hanterar det svenska språket obehindrat i både tal och skrift.\n\n\nOM OSS:\nExpress-Bild AB är ett nordiskt skol- och idrottsfotoföretag med över 35 års erfarenhet av branschen. Företaget fotograferar varje år ett mycket stort antal skolelever och idrottsutövare runt om i Sverige och i övriga delar av norden. Som medarbetare hos oss på Express-Bild kommer du att vara med om en spännande resa och du blir en viktig länk i vår kedja. Vi på Express-Bild ser personalen som vår viktigaste resurs och är måna om att våra medarbetare skall trivas hos oss. Vi är övertygade om att när våra medarbetare trivs blir vi mer lyckosamma som företag.\n\n\nOM ANSÖKAN:\nDå urvalet sker löpande vill vi ha in din ansökan redan idag. Tjänsten kan komma att tillsättas innan sista ansökningsdag. Bifoga CV samt personligt brev. Bifoga gärna en bild på dig själv. Ange \"FOTOGRAF\" samt din region som referens i mailet när du ansöker. Ansökan skickas till e-postadress: rekrytering@expressbild.se\n\n\nÖVRIGT:\nUnder skolfotosäsongen är arbetstiden förlagd till dagtid måndag till fredag (heltid 100 %).\nUtöver timlön finns möjlighet att fakturera genom det egna fotoföretaget.\nInnan du anställs kommer du få uppvisa ett utdrag ur belastningsregistret.\nVi undanber oss alla erbjudanden om annonserings- och rekryteringshjälp i samband med denna annons.\nVälkommen med din ansökan!"
      },
      "headline" : "Skolfotograf sökes",
      "driving_license" : [ {
        "concept_id" : "VTK8_WRx_GcM",
        "label" : "B",
        "legacy_ams_taxonomy_id" : "3"
      } ],
      "employer" : {
        "email" : null,
        "phone_number" : null,
        "organization_number" : "5562905579",
        "name" : "Express-Bild i Västerås AB",
        "url" : "http://expressbild.se",
        "workplace" : "Express Bild AB"
      },
      "removed_date" : null,
      "logo_url" : "https://www.arbetsformedlingen.se/rest/arbetsgivare/rest/af/v3/arbetsplatser/83529725/logotyper/logo.png",
      "last_publication_date" : "2022-07-23T23:59:59",
      "number_of_vacancies" : 1,
      "occupation" : {
        "concept_id" : "1N2U_6xW_Tdx",
        "label" : "Fotograf",
        "legacy_ams_taxonomy_id" : "4790"
      },
      "occupation_group" : {
        "concept_id" : "3J38_DNz_YKK",
        "label" : "Fotografer",
        "legacy_ams_taxonomy_id" : "3431"
      },
      "employment_type" : {
        "concept_id" : "Jh8f_q9J_pbJ",
        "label" : "Sommarjobb / feriejobb",
        "legacy_ams_taxonomy_id" : "2"
      },
      "webpage_url" : "https://arbetsformedlingen.se/platsbanken/annonser/26251392",
      "driving_license_required" : true,
      "application_contacts" : [ {
        "description" : null,
        "email" : "per.bodlund@expressbild.se",
        "telephone" : null,
        "name" : "Per Bodlund",
        "contact_type" : "HR-Chef"
      } ],
      "duration" : {
        "concept_id" : "Sy9J_aRd_ALx",
        "label" : "11 dagar - upp till 3 månader",
        "legacy_ams_taxonomy_id" : "7"
      },
      "nice_to_have" : {
        "education_level" : [ ],
        "work_experiences" : [ ],
        "skills" : [ ],
        "education" : [ ],
        "languages" : [ ]
      },
      "application_details" : {
        "via_af" : false,
        "email" : "rekrytering@expressbild.se",
        "other" : null,
        "reference" : "\"FOTOGRAF\" ",
        "url" : null,
        "information" : null
      },
      "source_type" : "VIA_ANNONSERA",
      "application_deadline" : "2022-07-23T23:59:59",
      "external_id" : null,
      "workplace_address" : {
        "coordinates" : [ 16.523979310389002, 59.3651989232891 ],
        "city" : "ESKILSTUNA",
        "postcode" : "63003",
        "municipality" : "Eskilstuna",
        "region_concept_id" : "s93u_BEb_sx2",
        "region" : "Södermanlands län",
        "country_code" : "199",
        "region_code" : "04",
        "municipality_concept_id" : "kMxr_NiX_YrU",
        "country_concept_id" : "i46j_HmG_v64",
        "municipality_code" : "0484",
        "street_address" : null,
        "country" : "Sverige"
      },
      "id" : "26251392",
      "experience_required" : true,
      "working_hours_type" : {
        "concept_id" : "6YE1_gAC_R2G",
        "label" : "Heltid",
        "legacy_ams_taxonomy_id" : "1"
      },
      "access" : null,
      "timestamp" : 1655964115796,
      "must_have" : {
        "education_level" : [ ],
        "work_experiences" : [ {
          "concept_id" : "1N2U_6xW_Tdx",
          "weight" : 10,
          "label" : "Fotograf",
          "legacy_ams_taxonomy_id" : "4790"
        } ],
        "skills" : [ {
          "concept_id" : "zpaf_mDu_foK",
          "weight" : 10,
          "label" : "Fotografering",
          "legacy_ams_taxonomy_id" : "607475"
        }, {
          "concept_id" : "UdXV_fqG_jWu",
          "weight" : 10,
          "label" : "Fotografering, digitalkamera",
          "legacy_ams_taxonomy_id" : "606876"
        } ],
        "education" : [ ],
        "languages" : [ {
          "concept_id" : "zSLA_vw2_FXN",
          "weight" : 10,
          "label" : "Svenska",
          "legacy_ams_taxonomy_id" : "502"
        } ]
      },
      "occupation_field" : {
        "concept_id" : "9puE_nYg_crq",
        "label" : "Kultur, media, design",
        "legacy_ams_taxonomy_id" : "11"
      },
      "scope_of_work" : {
        "min" : 0,
        "max" : 100
      },
      "salary_type" : {
        "concept_id" : "oG8G_9cW_nRf",
        "label" : "Fast månads- vecko- eller timlön",
        "legacy_ams_taxonomy_id" : "1"
      },
      "removed" : false,
      "salary_description" : null,
      "access_to_own_car" : true,
      "publication_date" : "2022-06-23T08:01:55"
    },
    "name" : "Skolfotograf sökes",
    "user" : "kristof.fischer"
  },
  "sha1" : "74aaed0d5dbff507f9f52ee8831026b154eb1ea3",
  "annotations" : [ {
    "preferred-label" : "Skolfotograf",
    "sentiment" : "MUST_HAVE",
    "type" : "keyword",
    "start-position" : 0,
    "end-position" : 12,
    "concept-id" : "rzAi_Xnm_r9g",
    "matched-string" : "skolfotograf",
    "annotation-id" : 0
  }, {
    "preferred-label" : "Fotograf",
    "type" : "occupation-name",
    "start-position" : 53,
    "end-position" : 61,
    "concept-id" : "1N2U_6xW_Tdx",
    "matched-string" : "fotograf",
    "annotation-id" : 9
  }, {
    "preferred-label" : "Fotograf",
    "type" : "occupation-name",
    "start-position" : 451,
    "end-position" : 459,
    "concept-id" : "1N2U_6xW_Tdx",
    "matched-string" : "fotograf",
    "annotation-id" : 10
  }, {
    "preferred-label" : "Fotografering",
    "sentiment" : "MUST_HAVE",
    "type" : "skill",
    "start-position" : 678,
    "end-position" : 703,
    "concept-id" : "zpaf_mDu_foK",
    "matched-string" : "mycket goda fotokunskaper",
    "annotation-id" : 11
  }, {
    "preferred-label" : "Fotograf",
    "type" : "occupation-name",
    "start-position" : 780,
    "end-position" : 788,
    "concept-id" : "1N2U_6xW_Tdx",
    "matched-string" : "fotograf",
    "annotation-id" : 12
  }, {
    "preferred-label" : "Fotograf",
    "sentiment" : "NICE_TO_HAVE",
    "type" : "occupation-name",
    "start-position" : 846,
    "comment" : "Skolfotograf finns bara som keyword",
    "end-position" : 858,
    "concept-id" : "1N2U_6xW_Tdx",
    "matched-string" : "skolfotograf",
    "annotation-id" : 13
  }, {
    "preferred-label" : "Fotograf",
    "sentiment" : "NICE_TO_HAVE",
    "type" : "occupation-name",
    "start-position" : 869,
    "end-position" : 884,
    "concept-id" : "1N2U_6xW_Tdx",
    "matched-string" : "idrottsfotograf",
    "annotation-id" : 14
  }, {
    "preferred-label" : "visa professionellt ansvarstagande",
    "sentiment" : "MUST_HAVE",
    "type" : "esco-skill",
    "start-position" : 949,
    "end-position" : 963,
    "concept-id" : "DRjM_LSF_w8x",
    "matched-string" : "ansvarstagande",
    "annotation-id" : 15
  }, {
    "preferred-label" : "noggrannhet",
    "sentiment" : "MUST_HAVE",
    "type" : "esco-skill",
    "start-position" : 968,
    "end-position" : 978,
    "concept-id" : "mrsW_EkL_KRD",
    "matched-string" : "ordningsam",
    "annotation-id" : 16
  }, {
    "preferred-label" : "uppvisa social kompetens",
    "sentiment" : "MUST_HAVE",
    "type" : "esco-skill",
    "start-position" : 1020,
    "end-position" : 1036,
    "concept-id" : "5AbQ_a6i_H1T",
    "matched-string" : "social kompetens",
    "annotation-id" : 17
  }, {
    "preferred-label" : null,
    "type" : "skill",
    "start-position" : 1044,
    "comment" : "\"serviceinriktad\" finns för specifika yrken, fast inte för fotografer",
    "end-position" : 1057,
    "concept-id" : null,
    "matched-string" : "serviceminded",
    "annotation-id" : 18
  }, {
    "preferred-label" : "använda dator",
    "sentiment" : "MUST_HAVE",
    "type" : "esco-skill",
    "start-position" : 1365,
    "end-position" : 1374,
    "concept-id" : "HEbR_xrb_MpT",
    "matched-string" : "datorvana",
    "annotation-id" : 19
  }, {
    "preferred-label" : "B",
    "sentiment" : "MUST_HAVE",
    "type" : "driving-licence",
    "start-position" : 1587,
    "end-position" : 1596,
    "concept-id" : "VTK8_WRx_GcM",
    "matched-string" : "B körkort",
    "annotation-id" : 20
  }, {
    "preferred-label" : "Svenska",
    "sentiment" : "MUST_HAVE",
    "type" : "language",
    "start-position" : 1784,
    "end-position" : 1799,
    "concept-id" : "zSLA_vw2_FXN",
    "matched-string" : "svenska språket",
    "annotation-id" : 7
  } ],
  "text" : "Skolfotograf sökes\nExpress-Bild söker nu en skicklig fotograf för arbete under kommande skolfotoperiod (augusti-oktober) med möjlighet till eventuell förlängning. \n\n\nARBETSUPPGIFTER:\nArbetsuppgifterna består av att under hösten åka ut till inbokade skolor och fotografera elevporträttbilder och klassbilder i studiomiljö.  En del administrativt kringarbete tillkommer. Arbetsplatsen är hela regionen/mellan Sverige. Innan du tillträder din tjänst som fotograf på Express-Bild får du genomgå en internutbildning. Arbetet innebär en hel del resor och i enstaka fall övernattningar.\nDet finns även möjlighet till förlängning av tjänsten.\n\n\nKRAVPROFIL:\nVi vill att du som söker har mycket goda fotokunskaper och har foto som ett av dina största intressen. Kanske arbetar du redan som fotograf eller är en skicklig amatörfotograf. Tidigare arbete som skolfotograf och/eller idrottsfotograf är mycket meriterande. Utöver detta vill vi att du som söker är ansvarstagande och ordningsam. Det är också viktigt att du har en stor social kompetens och är serviceminded. Du blir vår ambassadör på fältet varför vi lägger stor vikt vid personlig lämplighet och utstrålning.\nDå vi arbetar i ett högt tempo och har många bollar i luften samtidigt är det också viktigt att du är stresstålig och välorganiserad. Då merparten av ditt arbete sker med hjälp av datorn är en mycket god datorvana ett krav. Att du tycker om att arbeta med barn och ungdomar ser vi som en självklarhet. Ett starkt önskemål är att du har tillgång till en egen professionell systemkamera med lämpligt objektiv samt blixt. Du har B körkort och tillgång till egen bil att kunna bruka i tjänsten mot milersättning. I de fall du övernattar på annan ort erhålles lagstadgat traktamente. Ytterligare ett krav är att du hanterar det svenska språket obehindrat i både tal och skrift.\n\n\nOM OSS:\nExpress-Bild AB är ett nordiskt skol- och idrottsfotoföretag med över 35 års erfarenhet av branschen. Företaget fotograferar varje år ett mycket stort antal skolelever och idrottsutövare runt om i Sverige och i övriga delar av norden. Som medarbetare hos oss på Express-Bild kommer du att vara med om en spännande resa och du blir en viktig länk i vår kedja. Vi på Express-Bild ser personalen som vår viktigaste resurs och är måna om att våra medarbetare skall trivas hos oss. Vi är övertygade om att när våra medarbetare trivs blir vi mer lyckosamma som företag.\n\n\nOM ANSÖKAN:\nDå urvalet sker löpande vill vi ha in din ansökan redan idag. Tjänsten kan komma att tillsättas innan sista ansökningsdag. Bifoga CV samt personligt brev. Bifoga gärna en bild på dig själv. Ange \"FOTOGRAF\" samt din region som referens i mailet när du ansöker. Ansökan skickas till e-postadress: rekrytering@expressbild.se\n\n\nÖVRIGT:\nUnder skolfotosäsongen är arbetstiden förlagd till dagtid måndag till fredag (heltid 100 %).\nUtöver timlön finns möjlighet att fakturera genom det egna fotoföretaget.\nInnan du anställs kommer du få uppvisa ett utdrag ur belastningsregistret.\nVi undanber oss alla erbjudanden om annonserings- och rekryteringshjälp i samband med denna annons.\nVälkommen med din ansökan!"
}