{
  "meta" : {
    "jobad" : {
      "description" : {
        "requirements" : null,
        "needs" : null,
        "company_information" : null,
        "text_formatted" : "I våra rum sover du skönt i sängar från svenska Carpe Diem. I badrummet kan du njuta av en rain shower-dusch, och alla rum är utrustade med AC. Hotellen är dessutom ritade av kända arkitekter och för den djärva invändiga designen har vi anlitat den populära formgivaren Lisa Bengtsson, som bland annat är känd för sina illustrationer och mönster.\n\n\r\n\r\nBeskrivning\n\nBli en del av Motel L i Hammarbysjöstad, det prisvärda designhotellet perfekt beläget centralt i Hammarby Sjöstad nära Avicii arena samt Eriksdalsbadet.\r\n\r\nHär finner du en trevlig lobbybar och 226 hotellrum där vi alltid levererar gästupplevelser av hög kvalitet.\n\nNu söker vi en sprudlande servicestjärna till reception. Du är en passionerad person som älskar att jobba med service och personliga bemötandet. För att trivas hos oss krävs engagemang och kärlek till yrket, flexibilitet och ansvarstagande.\n\nArbetsuppgifter\n\nSedvanliga receptionsuppgifter så som in- och utcheckning, bokning, försäljning, bar, samt andra hotell och service uppgifter. Du blir en viktig pusselbit i ett litet team och ser till att våra gäster blir personligt bemötta med bästa tänkbara service.\n\nAnställningen är 80%  och arbetstiderna är förlagda mellan 07:00-23:00 ibland till 01:00, vardagar samt varannan helg. Lön enligt kollektivavtal med HRF. Vi tillämpar 6 månaders provanställning.\n\nKvalifikationer\n\n- Tidigare arbete i hotellreception minst 1 år.\n- Behärskar ett eller flera hotell bokningssystem.\n- Flytande i både svenska och engelska, tal och skrift.\n- För att söka denna tjänst måste du ha fyllt 20år då vi hanterar alkohol.\n\nLigula Hospitality Group är moderbolag i en privatägd koncern i stark tillväxt. Vi äger, förvaltar och utvecklar varumärken och koncept inom hotell- och restaurangnäringen. Sedan 2015 har vi mer än fördubblat antalet hotell och expansionen fortsätter. Koncernen består i dag av 45 hotell i Sverige, Danmark och Tyskland som drivs under varumärkena ProfilHotels, Apartments by Ligula, Motel L, Good Morning Hotels och Collection by Ligula. Genom franchiseavtal driver vi även fyra Park Inn by Radisson och ett Radisson Blu. Vi sysselsätter normalt ca 800 årsanställda och omsätter över 1 400 MSEK.",
        "conditions" : "Heltid/Deltid. 80% eller enligt ö.k. Tillträde: Omgående enligt ö.k\r\nTillsvidareanställning",
        "text" : "I våra rum sover du skönt i sängar från svenska Carpe Diem. I badrummet kan du njuta av en rain shower-dusch, och alla rum är utrustade med AC. Hotellen är dessutom ritade av kända arkitekter och för den djärva invändiga designen har vi anlitat den populära formgivaren Lisa Bengtsson, som bland annat är känd för sina illustrationer och mönster.\n\n\r\n\r\nBeskrivning\n\nBli en del av Motel L i Hammarbysjöstad, det prisvärda designhotellet perfekt beläget centralt i Hammarby Sjöstad nära Avicii arena samt Eriksdalsbadet.\r\n\r\nHär finner du en trevlig lobbybar och 226 hotellrum där vi alltid levererar gästupplevelser av hög kvalitet.\n\nNu söker vi en sprudlande servicestjärna till reception. Du är en passionerad person som älskar att jobba med service och personliga bemötandet. För att trivas hos oss krävs engagemang och kärlek till yrket, flexibilitet och ansvarstagande.\n\nArbetsuppgifter\n\nSedvanliga receptionsuppgifter så som in- och utcheckning, bokning, försäljning, bar, samt andra hotell och service uppgifter. Du blir en viktig pusselbit i ett litet team och ser till att våra gäster blir personligt bemötta med bästa tänkbara service.\n\nAnställningen är 80%  och arbetstiderna är förlagda mellan 07:00-23:00 ibland till 01:00, vardagar samt varannan helg. Lön enligt kollektivavtal med HRF. Vi tillämpar 6 månaders provanställning.\n\nKvalifikationer\n\n- Tidigare arbete i hotellreception minst 1 år.\n- Behärskar ett eller flera hotell bokningssystem.\n- Flytande i både svenska och engelska, tal och skrift.\n- För att söka denna tjänst måste du ha fyllt 20år då vi hanterar alkohol.\n\nLigula Hospitality Group är moderbolag i en privatägd koncern i stark tillväxt. Vi äger, förvaltar och utvecklar varumärken och koncept inom hotell- och restaurangnäringen. Sedan 2015 har vi mer än fördubblat antalet hotell och expansionen fortsätter. Koncernen består i dag av 45 hotell i Sverige, Danmark och Tyskland som drivs under varumärkena ProfilHotels, Apartments by Ligula, Motel L, Good Morning Hotels och Collection by Ligula. Genom franchiseavtal driver vi även fyra Park Inn by Radisson och ett Radisson Blu. Vi sysselsätter normalt ca 800 årsanställda och omsätter över 1 400 MSEK."
      },
      "headline" : "Motel L Hammarby söker Receptionist för omgående anställning på 80%",
      "driving_license" : null,
      "employer" : {
        "email" : null,
        "phone_number" : null,
        "organization_number" : "5567926497",
        "name" : "Ligula Hospitality Group AB",
        "url" : null,
        "workplace" : "Parcere AB, Motel L Hammarby Sjöstad"
      },
      "removed_date" : null,
      "logo_url" : null,
      "last_publication_date" : "2022-08-31T23:59:59",
      "number_of_vacancies" : 1,
      "occupation" : {
        "concept_id" : "3kFW_XLk_v9H",
        "label" : "Hotellreceptionist",
        "legacy_ams_taxonomy_id" : "5596"
      },
      "occupation_group" : {
        "concept_id" : "bYde_Frc_xcB",
        "label" : "Hotellreceptionister m.fl.",
        "legacy_ams_taxonomy_id" : "4224"
      },
      "employment_type" : {
        "concept_id" : "PFZr_Syz_cUq",
        "label" : "Vanlig anställning",
        "legacy_ams_taxonomy_id" : "1"
      },
      "webpage_url" : "https://arbetsformedlingen.se/platsbanken/annonser/26390057",
      "driving_license_required" : false,
      "application_contacts" : [ ],
      "duration" : {
        "concept_id" : "a7uU_j21_mkL",
        "label" : "Tills vidare",
        "legacy_ams_taxonomy_id" : "1"
      },
      "nice_to_have" : {
        "education_level" : [ ],
        "work_experiences" : [ ],
        "skills" : [ ],
        "education" : [ ],
        "languages" : [ ]
      },
      "application_details" : {
        "via_af" : false,
        "email" : null,
        "other" : null,
        "reference" : "2022/216",
        "url" : "https://ligula.varbi.com/what:job/jobID:533831/type:job/where:1/apply:1",
        "information" : null
      },
      "source_type" : "VIA_PLATSBANKEN_DXA",
      "application_deadline" : "2022-08-31T23:59:59",
      "external_id" : "46-556792-6497-533831",
      "workplace_address" : {
        "coordinates" : [ 18.06858, 59.329323 ],
        "city" : null,
        "postcode" : null,
        "municipality" : "Stockholm",
        "region_concept_id" : "CifL_Rzy_Mku",
        "region" : "Stockholms län",
        "country_code" : "199",
        "region_code" : "01",
        "municipality_concept_id" : "AvNB_uwa_6n6",
        "country_concept_id" : "i46j_HmG_v64",
        "municipality_code" : "0180",
        "street_address" : null,
        "country" : "Sverige"
      },
      "id" : "26390057",
      "experience_required" : true,
      "working_hours_type" : {
        "concept_id" : "947z_JGS_Uk2",
        "label" : "Deltid",
        "legacy_ams_taxonomy_id" : "2"
      },
      "access" : null,
      "timestamp" : 1660032214944,
      "must_have" : {
        "education_level" : [ ],
        "work_experiences" : [ {
          "concept_id" : "3kFW_XLk_v9H",
          "weight" : 10,
          "label" : "Hotellreceptionist",
          "legacy_ams_taxonomy_id" : "5596"
        } ],
        "skills" : [ ],
        "education" : [ ],
        "languages" : [ ]
      },
      "occupation_field" : {
        "concept_id" : "ScKy_FHB_7wT",
        "label" : "Hotell, restaurang, storhushåll",
        "legacy_ams_taxonomy_id" : "7"
      },
      "scope_of_work" : {
        "min" : 80,
        "max" : 100
      },
      "salary_type" : {
        "concept_id" : "oG8G_9cW_nRf",
        "label" : "Fast månads- vecko- eller timlön",
        "legacy_ams_taxonomy_id" : "1"
      },
      "removed" : false,
      "salary_description" : "Timlön enligt avtal",
      "access_to_own_car" : false,
      "publication_date" : "2022-08-09T10:03:34"
    },
    "name" : "Motel L Hammarby söker Receptionist för omgående anställning på 80%",
    "user" : "hannes"
  },
  "sha1" : "35d2765879cd764523e48666c48e3f0a5490a23a",
  "annotations" : [ {
    "preferred-label" : "Receptionist",
    "sentiment" : "MUST_HAVE",
    "type" : "keyword",
    "start-position" : 23,
    "end-position" : 35,
    "concept-id" : "gAAz_Lo5_WRR",
    "matched-string" : "receptionist",
    "annotation-id" : 0
  }, {
    "preferred-label" : "Deltid",
    "type" : "worktime-extent",
    "start-position" : 64,
    "end-position" : 67,
    "concept-id" : "947z_JGS_Uk2",
    "matched-string" : "80%",
    "annotation-id" : 12
  }, {
    "preferred-label" : "Svenska",
    "sentiment" : "MUST_HAVE",
    "type" : "language",
    "start-position" : 108,
    "end-position" : 115,
    "concept-id" : "zSLA_vw2_FXN",
    "matched-string" : "svenska",
    "annotation-id" : 1
  }, {
    "preferred-label" : "Reception",
    "sentiment" : "MUST_HAVE",
    "type" : "keyword",
    "start-position" : 745,
    "end-position" : 754,
    "concept-id" : "zRKv_kwY_uw4",
    "matched-string" : "reception",
    "annotation-id" : 2
  }, {
    "preferred-label" : "visa ansvarstagande",
    "type" : "esco-skill",
    "start-position" : 924,
    "end-position" : 938,
    "concept-id" : "bcRp_hxV_f5G",
    "matched-string" : "ansvarstagande",
    "annotation-id" : 13
  }, {
    "preferred-label" : "Hotell",
    "sentiment" : "MUST_HAVE",
    "type" : "keyword",
    "start-position" : 1055,
    "end-position" : 1061,
    "concept-id" : "Jrrg_iiS_2yp",
    "matched-string" : "hotell",
    "annotation-id" : 3
  }, {
    "preferred-label" : "Deltid",
    "type" : "worktime-extent",
    "start-position" : 1229,
    "end-position" : 1233,
    "concept-id" : "947z_JGS_Uk2",
    "matched-string" : "80% ",
    "annotation-id" : 14
  }, {
    "preferred-label" : "Kollektivavtal",
    "sentiment" : "MUST_HAVE",
    "type" : "skill",
    "start-position" : 1342,
    "end-position" : 1356,
    "concept-id" : "z7wE_9xb_3jX",
    "matched-string" : "kollektivavtal",
    "annotation-id" : 4
  }, {
    "preferred-label" : "Hotell",
    "sentiment" : "MUST_HAVE",
    "type" : "keyword",
    "start-position" : 1501,
    "end-position" : 1507,
    "concept-id" : "Jrrg_iiS_2yp",
    "matched-string" : "hotell",
    "annotation-id" : 5
  }, {
    "preferred-label" : "Bokningssystem",
    "sentiment" : "MUST_HAVE",
    "type" : "skill-headline",
    "start-position" : 1508,
    "end-position" : 1522,
    "concept-id" : "kRoQ_fPR_8oK",
    "matched-string" : "bokningssystem",
    "annotation-id" : 6
  }, {
    "preferred-label" : "Svenska",
    "sentiment" : "MUST_HAVE",
    "type" : "language",
    "start-position" : 1542,
    "end-position" : 1549,
    "concept-id" : "zSLA_vw2_FXN",
    "matched-string" : "svenska",
    "annotation-id" : 7
  }, {
    "preferred-label" : "Engelska",
    "sentiment" : "MUST_HAVE",
    "type" : "language",
    "start-position" : 1554,
    "end-position" : 1562,
    "concept-id" : "NVxJ_hLg_TYS",
    "matched-string" : "engelska",
    "annotation-id" : 8
  }, {
    "preferred-label" : "Hotell",
    "sentiment" : "MUST_HAVE",
    "type" : "keyword",
    "start-position" : 1797,
    "end-position" : 1803,
    "concept-id" : "Jrrg_iiS_2yp",
    "matched-string" : "hotell",
    "annotation-id" : 9
  }, {
    "preferred-label" : "Hotell",
    "sentiment" : "MUST_HAVE",
    "type" : "keyword",
    "start-position" : 1873,
    "end-position" : 1879,
    "concept-id" : "Jrrg_iiS_2yp",
    "matched-string" : "hotell",
    "annotation-id" : 10
  }, {
    "preferred-label" : "Hotell",
    "sentiment" : "MUST_HAVE",
    "type" : "keyword",
    "start-position" : 1937,
    "end-position" : 1943,
    "concept-id" : "Jrrg_iiS_2yp",
    "matched-string" : "hotell",
    "annotation-id" : 11
  } ],
  "text" : "Motel L Hammarby söker Receptionist för omgående anställning på 80%\nI våra rum sover du skönt i sängar från svenska Carpe Diem. I badrummet kan du njuta av en rain shower-dusch, och alla rum är utrustade med AC. Hotellen är dessutom ritade av kända arkitekter och för den djärva invändiga designen har vi anlitat den populära formgivaren Lisa Bengtsson, som bland annat är känd för sina illustrationer och mönster.\n\n\r\n\r\nBeskrivning\n\nBli en del av Motel L i Hammarbysjöstad, det prisvärda designhotellet perfekt beläget centralt i Hammarby Sjöstad nära Avicii arena samt Eriksdalsbadet.\r\n\r\nHär finner du en trevlig lobbybar och 226 hotellrum där vi alltid levererar gästupplevelser av hög kvalitet.\n\nNu söker vi en sprudlande servicestjärna till reception. Du är en passionerad person som älskar att jobba med service och personliga bemötandet. För att trivas hos oss krävs engagemang och kärlek till yrket, flexibilitet och ansvarstagande.\n\nArbetsuppgifter\n\nSedvanliga receptionsuppgifter så som in- och utcheckning, bokning, försäljning, bar, samt andra hotell och service uppgifter. Du blir en viktig pusselbit i ett litet team och ser till att våra gäster blir personligt bemötta med bästa tänkbara service.\n\nAnställningen är 80%  och arbetstiderna är förlagda mellan 07:00-23:00 ibland till 01:00, vardagar samt varannan helg. Lön enligt kollektivavtal med HRF. Vi tillämpar 6 månaders provanställning.\n\nKvalifikationer\n\n- Tidigare arbete i hotellreception minst 1 år.\n- Behärskar ett eller flera hotell bokningssystem.\n- Flytande i både svenska och engelska, tal och skrift.\n- För att söka denna tjänst måste du ha fyllt 20år då vi hanterar alkohol.\n\nLigula Hospitality Group är moderbolag i en privatägd koncern i stark tillväxt. Vi äger, förvaltar och utvecklar varumärken och koncept inom hotell- och restaurangnäringen. Sedan 2015 har vi mer än fördubblat antalet hotell och expansionen fortsätter. Koncernen består i dag av 45 hotell i Sverige, Danmark och Tyskland som drivs under varumärkena ProfilHotels, Apartments by Ligula, Motel L, Good Morning Hotels och Collection by Ligula. Genom franchiseavtal driver vi även fyra Park Inn by Radisson och ett Radisson Blu. Vi sysselsätter normalt ca 800 årsanställda och omsätter över 1 400 MSEK."
}