{
  "meta" : {
    "dataset-id" : "myh-spreadsheet-2021",
    "type" : "education-description",
    "dataset-document-id" : "YH01183",
    "user" : "kristof.fischer"
  },
  "sha1" : "1900f652a9f6b2a0b631686058eaa028ae9b25f7",
  "annotations" : [ {
    "preferred-label" : "UX-designer",
    "type" : "occupation-name",
    "start-position" : 56,
    "end-position" : 75,
    "concept-id" : "iwJU_gW4_SxT",
    "matched-string" : "Experience Designer",
    "annotation-id" : 15
  }, {
    "preferred-label" : "UX-designer",
    "type" : "occupation-name",
    "start-position" : 176,
    "end-position" : 195,
    "concept-id" : "iwJU_gW4_SxT",
    "matched-string" : "Experience Designer",
    "annotation-id" : 14
  }, {
    "preferred-label" : "User experience",
    "type" : "skill",
    "start-position" : 197,
    "end-position" : 199,
    "concept-id" : "AdgQ_txR_S3M",
    "matched-string" : "UX",
    "annotation-id" : 16
  }, {
    "preferred-label" : "Grafiska gränssnitt/GUI",
    "sentiment" : "OFFERED",
    "type" : "skill",
    "start-position" : 200,
    "end-position" : 203,
    "concept-id" : "5Vk5_FW2_ceH",
    "matched-string" : "gui",
    "annotation-id" : 2
  }, {
    "preferred-label" : "utveckla professionella nätverk",
    "sentiment" : "OFFERED",
    "type" : "esco-skill",
    "start-position" : 1092,
    "end-position" : 1111,
    "concept-id" : "fS7r_bUJ_kF3",
    "matched-string" : "bygger ditt nätverk",
    "annotation-id" : 17
  }, {
    "preferred-label" : "upprätthålla arbetsmässiga relationer",
    "sentiment" : "OFFERED",
    "type" : "esco-skill",
    "start-position" : 1116,
    "end-position" : 1159,
    "concept-id" : "FSSe_5dD_kXc",
    "matched-string" : "skapar relationer med framtida arbetsgivare",
    "annotation-id" : 18
  }, {
    "preferred-label" : "UX-designer",
    "sentiment" : "OFFERED",
    "type" : "occupation-name",
    "start-position" : 1280,
    "end-position" : 1300,
    "concept-id" : "iwJU_gW4_SxT",
    "matched-string" : "Experience Designers",
    "annotation-id" : 19
  }, {
    "preferred-label" : "Högskoleutbildning, yrkesinriktad, 2 år",
    "sentiment" : "OFFERED",
    "type" : "sun-education-level-3",
    "start-position" : 1620,
    "end-position" : 1639,
    "concept-id" : "zdKB_pTL_HMS",
    "matched-string" : "yrkeshögskoleexamen",
    "annotation-id" : 20
  }, {
    "preferred-label" : "UX-designer",
    "sentiment" : "OFFERED",
    "type" : "occupation-name",
    "start-position" : 2073,
    "end-position" : 2092,
    "concept-id" : "iwJU_gW4_SxT",
    "matched-string" : "Experience Designer",
    "annotation-id" : 21
  }, {
    "preferred-label" : "UX-designer",
    "sentiment" : "OFFERED",
    "type" : "occupation-name",
    "start-position" : 2543,
    "end-position" : 2562,
    "concept-id" : "iwJU_gW4_SxT",
    "matched-string" : "Experience Designer",
    "annotation-id" : 22
  }, {
    "preferred-label" : "UX-designer",
    "sentiment" : "OFFERED",
    "type" : "occupation-name",
    "start-position" : 2566,
    "end-position" : 2577,
    "concept-id" : "iwJU_gW4_SxT",
    "matched-string" : "ux designer",
    "annotation-id" : 12
  }, {
    "preferred-label" : null,
    "sentiment" : "OFFERED",
    "type" : "occupation-name",
    "start-position" : 2581,
    "end-position" : 2596,
    "concept-id" : null,
    "matched-string" : "User Researcher",
    "annotation-id" : 23
  }, {
    "preferred-label" : "Game designer/Speldesigner",
    "sentiment" : "OFFERED",
    "type" : "occupation-name",
    "start-position" : 2600,
    "end-position" : 2621,
    "concept-id" : "ytrP_JCv_bwH",
    "matched-string" : "Gamification Designer",
    "annotation-id" : 24
  }, {
    "preferred-label" : null,
    "sentiment" : "OFFERED",
    "type" : "occupation-name",
    "start-position" : 2625,
    "end-position" : 2632,
    "concept-id" : null,
    "matched-string" : "Planner",
    "annotation-id" : 25
  } ],
  "text" : "Digitaliseringen står högst upp på företagens agendor. ”Experience Designer” lär dig UX, spelifiering, kloka kundresor och digitala innovationer.    Efterfrågan på yrkesrollen Experience Designer (UX/GUI) ökar starkt i hela samhället. Användarupplevelser, hållbara affärsmodeller och digital innovation står i centrum för utvecklingen. Idag har vi enorma möjligheter att skapa upplevelser med ny teknik, inte minst genom VR/AR och AI. Företagen jobbar med ständig förbättring av kundupplevelser. Utöver det blir digitala upplevelser och konversationsbaserad UX allt viktigare.    Digitaliseringen och kundernas upplevelsekrav gör att Experience Designers anställs i alla samhällets företag och organisationer ,och främst inom Data/IT, Telekom och digitala bolag, samt hos alla stora bolag/koncerner och inom offentlig verksamhet.    25% LIA (praktik)  Som en del av utbildningen gör du LIA (Lärande i arbete, praktik, internship) hos ledande branschföretag. LIAn fördjupar och breddar ditt lärande och du får arbetserfarenheter som krävs för att utveckla dagens och morgondagens e-handel. Du bygger ditt nätverk och skapar relationer med framtida arbetsgivare redan under studietiden.    Vi samarbetar med en rad företag och organisationer som alla uttrycker ett växande behov av Experience Designers. Vi har samlat några av branschens mest kunniga utvecklare och föreläsare under ett och samma tak. Du får möjlighet att utbilda dig till framtidens vassaste och bredaste Experience Designers. Du sätter själv ribban för hur långt du vill nå under dina två år hos oss.    Efter avslutade och godkända studier erhåller du yrkeshögskoleexamen om totalt 400 yh-poäng, vilket motsvarar två års heltidsstudier. Din utbildningsplan godkänns och övervakas av Myndigheten för Yrkeshögskolan (MYH) som har höga krav på kvalitet och lärprocesser. Changemaker Educations ansvarar för planering, genomförande och utveckling av din utbildning. Du som studerar har en utbildningsledare som koordinerar din utbildning och fungerar som din kontaktperson under studietiden.    Att jobba som Experience Designer är en nyckelroll och en samordningsroll mellan upplevelser, kunder, team och verksamheter. Du sammanflätar och bygger broar mellan digitala och fysiska världar. Du förbättrar och utvecklar kundupplevelser och därigenom kundnytta och affärsnytta. Utbildningen ger dig verktyg för att förstå upplevelser, kunder, behov och utbud på dagens marknader. Du får lära dig att skapa digitala miljöer med kundupplevelsen i fokus.    Exempel på yrkesroller:  - Experience Designer  - UX Designer  - User Researcher  - Gamification Designer  - Planner"
}