{
  "meta" : {
    "jobad" : {
      "description" : {
        "requirements" : null,
        "needs" : null,
        "company_information" : null,
        "text_formatted" : "<em>Meva Energy är ett högteknologiskt företag inom förnybar energi som använder termokemisk omvandling av biomassarester. Vi har tecknat avtal med möbeltillverkaren IKEA Industry och mjukpapperstillverkaren Sofidel. I båda dessa fall kommer Meva att bygga förgasningsanläggningar vid deras fabriker. På Sofidel kommer den förnybara gasen som produceras att ersätta deras fossilgasförbrukning för mjukpapperstorkningen vid pappersbruket i Kisa och på IKEA Industry kommer den förnybara gasen att omvandlas till förnybar kraftvärme genom generatorer och användas på plats.</em><br><br><em>Till vår nybyggda anläggning i Kisa söker vi nu en processoperatör som vill vara med på vår spännande resa. Här erbjuds du en bred roll där du varje dag kommer att stå inför nya utmaningar och på så vis får möjlighet att ständigt lära dig nytt och utvecklas. Är det dig vi letar efter?</em><br><br><strong>ARBETSUPPGIFTER</strong><br>Som processoperatör kommer du ha en viktig roll, dels i den inledande fasen då anläggningen ska sättas i drift, dels när anläggningen är i drift för att då säkerställa en så störningsfri process som möjligt. Inledningsvis kommer du att arbeta med diverse kontroller av såväl utrustning som funktioner/larm i olika system samt provkörning av maskiner och pumpar. Du arbetar som inne- och uteoperatör och övervakar och optimerar fabriken samt säkerställer att driften sker på ett säkert sätt. Du kommer bland annat att hantera lossning och lastning av råvara, byta filter, driva felsökningar och arbeta med ständigt förbättringsarbete. I rollen ingår även att arbeta med visst underhåll samt göra riskanalyser av driften i anläggningen. Du kommer också ha chans att bygga upp och förbättra rutiner och arbetssätt på siten.<br><br>Då anläggningen är ny går det inte att förutse alla arbetsuppgifter varpå ovan nämnda uppgifter ska ses som en liten del i vad rollen faktiskt innebär.<br><br><strong>PERSONLIGA EGENSKAPER OCH KVALIFIKATIONER</strong><br>Vi söker dig som är utbildad driftoperatör eller har tidigare arbetslivserfarenhet från liknande arbete. Som person är du nyfiken, noggrann, driftig och har lätt för att samarbeta med andra. Du trivs i en roll med mycket eget ansvar där din flexibla och lösningsorienterade personlighet får komma fram. Vi ser det som mycket meriterande om du har genomfört någon eller några av följande utbildningar: Heta arbeten, Fallskydd, HLR, Säkra lyft/Travers. Du innehar truckkort och körkort behörighet B.<br><br><strong>OM TJÄNSTEN</strong><br>Tjänsten som Processoperatör är en direktrekrytering där du blir anställd av oss på Meva Energy AB. I denna rekrytering samarbetar vi med Eterni Sweden och alla eventuella frågor kring tjänsten hänvisar vi till Eterni Sweden.<br><br><strong>ÖVRIG INFORMATION</strong><br>Vi arbetar med löpande urval så vänta inte med att skicka in din ansökan. Dina frågor angående rekryteringsprocessen svarar Michael Gross på via 070-340 83 66 eller michael.gross@eterni.se.<br><br><strong>Om du vill vara en del av framtiden kan detta vara rätt utmaning för dig.<br>Vi ser fram emot din ansökan!</strong><br><br> ",
        "conditions" : null,
        "text" : "Meva Energy är ett högteknologiskt företag inom förnybar energi som använder termokemisk omvandling av biomassarester. Vi har tecknat avtal med möbeltillverkaren IKEA Industry och mjukpapperstillverkaren Sofidel. I båda dessa fall kommer Meva att bygga förgasningsanläggningar vid deras fabriker. På Sofidel kommer den förnybara gasen som produceras att ersätta deras fossilgasförbrukning för mjukpapperstorkningen vid pappersbruket i Kisa och på IKEA Industry kommer den förnybara gasen att omvandlas till förnybar kraftvärme genom generatorer och användas på plats.\n\nTill vår nybyggda anläggning i Kisa söker vi nu en processoperatör som vill vara med på vår spännande resa. Här erbjuds du en bred roll där du varje dag kommer att stå inför nya utmaningar och på så vis får möjlighet att ständigt lära dig nytt och utvecklas. Är det dig vi letar efter?\n\nARBETSUPPGIFTER\nSom processoperatör kommer du ha en viktig roll, dels i den inledande fasen då anläggningen ska sättas i drift, dels när anläggningen är i drift för att då säkerställa en så störningsfri process som möjligt. Inledningsvis kommer du att arbeta med diverse kontroller av såväl utrustning som funktioner/larm i olika system samt provkörning av maskiner och pumpar. Du arbetar som inne- och uteoperatör och övervakar och optimerar fabriken samt säkerställer att driften sker på ett säkert sätt. Du kommer bland annat att hantera lossning och lastning av råvara, byta filter, driva felsökningar och arbeta med ständigt förbättringsarbete. I rollen ingår även att arbeta med visst underhåll samt göra riskanalyser av driften i anläggningen. Du kommer också ha chans att bygga upp och förbättra rutiner och arbetssätt på siten.\n\nDå anläggningen är ny går det inte att förutse alla arbetsuppgifter varpå ovan nämnda uppgifter ska ses som en liten del i vad rollen faktiskt innebär.\n\nPERSONLIGA EGENSKAPER OCH KVALIFIKATIONER\nVi söker dig som är utbildad driftoperatör eller har tidigare arbetslivserfarenhet från liknande arbete. Som person är du nyfiken, noggrann, driftig och har lätt för att samarbeta med andra. Du trivs i en roll med mycket eget ansvar där din flexibla och lösningsorienterade personlighet får komma fram. Vi ser det som mycket meriterande om du har genomfört någon eller några av följande utbildningar: Heta arbeten, Fallskydd, HLR, Säkra lyft/Travers. Du innehar truckkort och körkort behörighet B.\n\nOM TJÄNSTEN\nTjänsten som Processoperatör är en direktrekrytering där du blir anställd av oss på Meva Energy AB. I denna rekrytering samarbetar vi med Eterni Sweden och alla eventuella frågor kring tjänsten hänvisar vi till Eterni Sweden.\n\nÖVRIG INFORMATION\nVi arbetar med löpande urval så vänta inte med att skicka in din ansökan. Dina frågor angående rekryteringsprocessen svarar Michael Gross på via 070-340 83 66 eller michael.gross@eterni.se.\n\nOm du vill vara en del av framtiden kan detta vara rätt utmaning för dig.\nVi ser fram emot din ansökan!"
      },
      "headline" : "Processoperatör till Meva Energy i Kisa",
      "driving_license" : null,
      "employer" : {
        "email" : null,
        "phone_number" : null,
        "organization_number" : "5568637283",
        "name" : "Eterni Sweden AB",
        "url" : "https://mevaenergy.com",
        "workplace" : "Meva Energy AB"
      },
      "removed_date" : null,
      "logo_url" : "https://www.arbetsformedlingen.se/rest/arbetsgivare/rest/af/v3/organisation/5568637283/logotyper/logo.png",
      "last_publication_date" : "2022-08-31T23:59:59",
      "number_of_vacancies" : 5,
      "occupation" : {
        "concept_id" : "xhPp_qTB_poK",
        "label" : "Processoperatör, kemisk industri",
        "legacy_ams_taxonomy_id" : "5626"
      },
      "occupation_group" : {
        "concept_id" : "QEBd_qHu_vGr",
        "label" : "Processövervakare, kemisk industri",
        "legacy_ams_taxonomy_id" : "8192"
      },
      "employment_type" : {
        "concept_id" : "PFZr_Syz_cUq",
        "label" : "Vanlig anställning",
        "legacy_ams_taxonomy_id" : "1"
      },
      "webpage_url" : "https://arbetsformedlingen.se/platsbanken/annonser/26356621",
      "driving_license_required" : false,
      "application_contacts" : [ {
        "description" : "Michael J Gross",
        "email" : "michael.gross@eterni.se",
        "telephone" : null,
        "name" : null,
        "contact_type" : null
      } ],
      "duration" : {
        "concept_id" : "a7uU_j21_mkL",
        "label" : "Tills vidare",
        "legacy_ams_taxonomy_id" : "1"
      },
      "nice_to_have" : {
        "education_level" : [ ],
        "work_experiences" : [ ],
        "skills" : [ ],
        "education" : [ ],
        "languages" : [ ]
      },
      "application_details" : {
        "via_af" : false,
        "email" : null,
        "other" : null,
        "reference" : null,
        "url" : "https://apply.recman.no/job_post.php?id=279857&path=ams&sub_id=138",
        "information" : null
      },
      "source_type" : "VIA_PLATSBANKEN_DXA",
      "application_deadline" : "2022-08-31T23:59:59",
      "external_id" : "46-556863-7283-2798576295bb9ecc8c2",
      "workplace_address" : {
        "coordinates" : [ 15.847963, 57.95358 ],
        "city" : null,
        "postcode" : null,
        "municipality" : "Kinda",
        "region_concept_id" : "oLT3_Q9p_3nn",
        "region" : "Östergötlands län",
        "country_code" : "199",
        "region_code" : "05",
        "municipality_concept_id" : "U4XJ_hYF_FBA",
        "country_concept_id" : "i46j_HmG_v64",
        "municipality_code" : "0513",
        "street_address" : null,
        "country" : "Sverige"
      },
      "id" : "26356621",
      "experience_required" : true,
      "working_hours_type" : {
        "concept_id" : "6YE1_gAC_R2G",
        "label" : "Heltid",
        "legacy_ams_taxonomy_id" : "1"
      },
      "access" : null,
      "timestamp" : 1658907733673,
      "must_have" : {
        "education_level" : [ ],
        "work_experiences" : [ {
          "concept_id" : "xhPp_qTB_poK",
          "weight" : 10,
          "label" : "Processoperatör, kemisk industri",
          "legacy_ams_taxonomy_id" : "5626"
        } ],
        "skills" : [ ],
        "education" : [ ],
        "languages" : [ ]
      },
      "occupation_field" : {
        "concept_id" : "yhCP_AqT_tns",
        "label" : "Installation, drift, underhåll",
        "legacy_ams_taxonomy_id" : "10"
      },
      "scope_of_work" : {
        "min" : 100,
        "max" : 100
      },
      "salary_type" : {
        "concept_id" : "oG8G_9cW_nRf",
        "label" : "Fast månads- vecko- eller timlön",
        "legacy_ams_taxonomy_id" : "1"
      },
      "removed" : false,
      "salary_description" : null,
      "access_to_own_car" : false,
      "publication_date" : "2022-07-27T09:42:13"
    },
    "name" : "Processoperatör till Meva Energy i Kisa",
    "user" : "kristof.fischer"
  },
  "sha1" : "54f3fd6e10124105dab5f2f59f8936298c96aca0",
  "annotations" : [ {
    "preferred-label" : "Processoperatör, kemisk industri",
    "type" : "occupation-name",
    "start-position" : 0,
    "end-position" : 15,
    "concept-id" : "xhPp_qTB_poK",
    "matched-string" : "Processoperatör",
    "annotation-id" : 2
  }, {
    "preferred-label" : "Processoperatör, kemisk industri",
    "type" : "occupation-name",
    "start-position" : 660,
    "end-position" : 675,
    "concept-id" : "xhPp_qTB_poK",
    "matched-string" : "processoperatör",
    "annotation-id" : 3
  }, {
    "preferred-label" : "Processoperatör, kemisk industri",
    "type" : "occupation-name",
    "start-position" : 916,
    "end-position" : 931,
    "concept-id" : "xhPp_qTB_poK",
    "matched-string" : "processoperatör",
    "annotation-id" : 4
  }, {
    "preferred-label" : "hantera provkörningar",
    "type" : "esco-skill",
    "start-position" : 1238,
    "end-position" : 1272,
    "concept-id" : "cwZC_VRz_yeS",
    "matched-string" : "provkörning av maskiner och pumpar",
    "annotation-id" : 5
  }, {
    "preferred-label" : "Processoperatör, kemisk industri",
    "type" : "occupation-name",
    "start-position" : 1958,
    "end-position" : 1971,
    "concept-id" : "xhPp_qTB_poK",
    "matched-string" : "driftoperatör",
    "annotation-id" : 6
  }, {
    "preferred-label" : "noggrannhet",
    "sentiment" : "MUST_HAVE",
    "type" : "esco-skill",
    "start-position" : 2060,
    "end-position" : 2068,
    "concept-id" : "mrsW_EkL_KRD",
    "matched-string" : "noggrann",
    "annotation-id" : 7
  }, {
    "preferred-label" : "samarbeta med kolleger",
    "sentiment" : "MUST_HAVE",
    "type" : "esco-skill",
    "start-position" : 2099,
    "end-position" : 2108,
    "concept-id" : "X15R_797_q62",
    "matched-string" : "samarbeta",
    "annotation-id" : 8
  }, {
    "preferred-label" : "hitta lösningar på problem",
    "sentiment" : "MUST_HAVE",
    "type" : "esco-skill",
    "start-position" : 2183,
    "end-position" : 2215,
    "concept-id" : "WFSY_Bwt_QWE",
    "matched-string" : "lösningsorienterade personlighet",
    "annotation-id" : 9
  }, {
    "preferred-label" : "Certifikat, heta arbeten",
    "sentiment" : "NICE_TO_HAVE",
    "type" : "skill",
    "start-position" : 2330,
    "end-position" : 2342,
    "concept-id" : "Q7eC_B7g_QiU",
    "matched-string" : "Heta arbeten",
    "annotation-id" : 10
  }, {
    "preferred-label" : "Utbildningsbevis, fallskydd",
    "sentiment" : "NICE_TO_HAVE",
    "type" : "skill",
    "start-position" : 2344,
    "end-position" : 2353,
    "concept-id" : "WLAi_BDr_5fW",
    "matched-string" : "Fallskydd",
    "annotation-id" : 11
  }, {
    "preferred-label" : "Första hjälpen - HLR-intyg",
    "sentiment" : "NICE_TO_HAVE",
    "type" : "skill",
    "start-position" : 2355,
    "end-position" : 2358,
    "concept-id" : "mwCM_MmB_6Ks",
    "matched-string" : "HLR",
    "annotation-id" : 12
  }, {
    "preferred-label" : "Utbildningsbevis, säkra lyft",
    "sentiment" : "NICE_TO_HAVE",
    "type" : "skill",
    "start-position" : 2360,
    "end-position" : 2370,
    "concept-id" : "ynWd_oCo_o61",
    "matched-string" : "Säkra lyft",
    "annotation-id" : 13
  }, {
    "preferred-label" : "Travers/Lyftanordningar",
    "sentiment" : "MUST_HAVE",
    "type" : "skill",
    "start-position" : 2371,
    "end-position" : 2378,
    "concept-id" : "R6ZK_FGC_ovb",
    "matched-string" : "travers",
    "annotation-id" : 1
  }, {
    "preferred-label" : "Truckvana",
    "sentiment" : "MUST_HAVE",
    "type" : "skill",
    "start-position" : 2391,
    "end-position" : 2400,
    "concept-id" : "pGts_PKK_c8W",
    "matched-string" : "truckkort",
    "annotation-id" : 14
  }, {
    "preferred-label" : "B",
    "sentiment" : "MUST_HAVE",
    "type" : "driving-licence",
    "start-position" : 2405,
    "end-position" : 2425,
    "concept-id" : "VTK8_WRx_GcM",
    "matched-string" : "körkort behörighet B",
    "annotation-id" : 15
  } ],
  "text" : "Processoperatör till Meva Energy i Kisa\nMeva Energy är ett högteknologiskt företag inom förnybar energi som använder termokemisk omvandling av biomassarester. Vi har tecknat avtal med möbeltillverkaren IKEA Industry och mjukpapperstillverkaren Sofidel. I båda dessa fall kommer Meva att bygga förgasningsanläggningar vid deras fabriker. På Sofidel kommer den förnybara gasen som produceras att ersätta deras fossilgasförbrukning för mjukpapperstorkningen vid pappersbruket i Kisa och på IKEA Industry kommer den förnybara gasen att omvandlas till förnybar kraftvärme genom generatorer och användas på plats.\n\nTill vår nybyggda anläggning i Kisa söker vi nu en processoperatör som vill vara med på vår spännande resa. Här erbjuds du en bred roll där du varje dag kommer att stå inför nya utmaningar och på så vis får möjlighet att ständigt lära dig nytt och utvecklas. Är det dig vi letar efter?\n\nARBETSUPPGIFTER\nSom processoperatör kommer du ha en viktig roll, dels i den inledande fasen då anläggningen ska sättas i drift, dels när anläggningen är i drift för att då säkerställa en så störningsfri process som möjligt. Inledningsvis kommer du att arbeta med diverse kontroller av såväl utrustning som funktioner/larm i olika system samt provkörning av maskiner och pumpar. Du arbetar som inne- och uteoperatör och övervakar och optimerar fabriken samt säkerställer att driften sker på ett säkert sätt. Du kommer bland annat att hantera lossning och lastning av råvara, byta filter, driva felsökningar och arbeta med ständigt förbättringsarbete. I rollen ingår även att arbeta med visst underhåll samt göra riskanalyser av driften i anläggningen. Du kommer också ha chans att bygga upp och förbättra rutiner och arbetssätt på siten.\n\nDå anläggningen är ny går det inte att förutse alla arbetsuppgifter varpå ovan nämnda uppgifter ska ses som en liten del i vad rollen faktiskt innebär.\n\nPERSONLIGA EGENSKAPER OCH KVALIFIKATIONER\nVi söker dig som är utbildad driftoperatör eller har tidigare arbetslivserfarenhet från liknande arbete. Som person är du nyfiken, noggrann, driftig och har lätt för att samarbeta med andra. Du trivs i en roll med mycket eget ansvar där din flexibla och lösningsorienterade personlighet får komma fram. Vi ser det som mycket meriterande om du har genomfört någon eller några av följande utbildningar: Heta arbeten, Fallskydd, HLR, Säkra lyft/Travers. Du innehar truckkort och körkort behörighet B.\n\nOM TJÄNSTEN\nTjänsten som Processoperatör är en direktrekrytering där du blir anställd av oss på Meva Energy AB. I denna rekrytering samarbetar vi med Eterni Sweden och alla eventuella frågor kring tjänsten hänvisar vi till Eterni Sweden.\n\nÖVRIG INFORMATION\nVi arbetar med löpande urval så vänta inte med att skicka in din ansökan. Dina frågor angående rekryteringsprocessen svarar Michael Gross på via 070-340 83 66 eller michael.gross@eterni.se.\n\nOm du vill vara en del av framtiden kan detta vara rätt utmaning för dig.\nVi ser fram emot din ansökan!"
}