{
  "meta" : {
    "jobad" : {
      "description" : {
        "requirements" : null,
        "needs" : null,
        "company_information" : null,
        "text_formatted" : "Just nu söker vi efter fler stjärnor som vill jobba med våra fantastiska säljare!\n\nIngen tidigare erfarenhet inom försäljning krävs. Vi utbildar samtliga nyanställda inom en säljstruktur som gynnar säljaren hos oss likväl som i framtiden inom andra yrken eller områden.\n\nHar du kanske framtidsplaner på att starta eget? Bli entreprenör? Lär dig allt inom försäljning från grunden hos oss!\n\nDenna annons är inte endast riktad mot Stockholm, utan vi anställer nya människor från hela Sverige.\n\nOm tjänsten\n\nHär erbjuds en heltidstjänst där du besöker kunderna i olika städer inom Sveriges gränser. Under besöken säljer du olika typer av tjänster från välkända varumärken från en av våra uppdragsgivare.\n\nVi står för samtliga resor samt boendekostnader till alla våra säljare!\n\nKontraktstyp\n\n- Heltid.\n- Arbetstider mån-fre kl 13:00-21:00 & fre 14:00-20:00.\n- Provanställning 6 mån, därefter tillsvidare.\n\n\n\n\nVi söker dig som:\n\n- Motiveras av personlig utveckling och resultat.\n- Är målmedveten och tävlingsinriktad.\n- Är utåtriktad med en positiv inställning och har ett stort engagemang.\n\n\nVi erbjuder:\n\n- Generös provision (utan tak).\n- Utvecklingsmöjligheter inom vårt snabbväxande företag.\n- Teoretisk samt praktisk utbildning inom sälj.\n- Varierande arbetsuppgifter med givande och starka varumärken.\n- Löpande coachning och utbildning.\n- Säljtävlingar, resor och festligheter!\n\n\n\nMeriterande\n\n- B-körkort (inget krav).\n\n\nÄr det dig vi söker? Skicka din ansökan idag! https://jobb.valuesales.se/\n\nOm oss\n\nValue Sales är ett ungt och snabbväxande företag som arbetar inom fält- och eventförsäljning samt telemarketing.\n\nVi samarbetar med väletablerade affärspartners och hjälper organisationer att utveckla sitt viktigaste element - vi säljer!\n\nVårt huvudkontor är beläget i Kista, Stockholm.\n\nHemsida: www.valuesales.se\n\nFölj vår resa på sociala medier:\n\nInstagram: @valuesalesab / TikTok: @valuesales",
        "conditions" : "Heltid\r\nAnställningstid enligt överenskommelse",
        "text" : "Just nu söker vi efter fler stjärnor som vill jobba med våra fantastiska säljare!\n\nIngen tidigare erfarenhet inom försäljning krävs. Vi utbildar samtliga nyanställda inom en säljstruktur som gynnar säljaren hos oss likväl som i framtiden inom andra yrken eller områden.\n\nHar du kanske framtidsplaner på att starta eget? Bli entreprenör? Lär dig allt inom försäljning från grunden hos oss!\n\nDenna annons är inte endast riktad mot Stockholm, utan vi anställer nya människor från hela Sverige.\n\nOm tjänsten\n\nHär erbjuds en heltidstjänst där du besöker kunderna i olika städer inom Sveriges gränser. Under besöken säljer du olika typer av tjänster från välkända varumärken från en av våra uppdragsgivare.\n\nVi står för samtliga resor samt boendekostnader till alla våra säljare!\n\nKontraktstyp\n\n- Heltid.\n- Arbetstider mån-fre kl 13:00-21:00 & fre 14:00-20:00.\n- Provanställning 6 mån, därefter tillsvidare.\n\n\n\n\nVi söker dig som:\n\n- Motiveras av personlig utveckling och resultat.\n- Är målmedveten och tävlingsinriktad.\n- Är utåtriktad med en positiv inställning och har ett stort engagemang.\n\n\nVi erbjuder:\n\n- Generös provision (utan tak).\n- Utvecklingsmöjligheter inom vårt snabbväxande företag.\n- Teoretisk samt praktisk utbildning inom sälj.\n- Varierande arbetsuppgifter med givande och starka varumärken.\n- Löpande coachning och utbildning.\n- Säljtävlingar, resor och festligheter!\n\n\n\nMeriterande\n\n- B-körkort (inget krav).\n\n\nÄr det dig vi söker? Skicka din ansökan idag! https://jobb.valuesales.se/\n\nOm oss\n\nValue Sales är ett ungt och snabbväxande företag som arbetar inom fält- och eventförsäljning samt telemarketing.\n\nVi samarbetar med väletablerade affärspartners och hjälper organisationer att utveckla sitt viktigaste element - vi säljer!\n\nVårt huvudkontor är beläget i Kista, Stockholm.\n\nHemsida: www.valuesales.se\n\nFölj vår resa på sociala medier:\n\nInstagram: @valuesalesab / TikTok: @valuesales"
      },
      "headline" : "Säljutbildning + höga provisioner!",
      "driving_license" : null,
      "employer" : {
        "email" : null,
        "phone_number" : null,
        "organization_number" : "5592512866",
        "name" : "Value Sales Sweden AB",
        "url" : "https://www.valuesales.se/",
        "workplace" : "Value Sales"
      },
      "removed_date" : null,
      "logo_url" : "https://www.arbetsformedlingen.se/rest/arbetsgivare/rest/af/v3/organisation/5592512866/logotyper/logo.png",
      "last_publication_date" : "2023-01-20T23:59:59",
      "number_of_vacancies" : 1,
      "occupation" : {
        "concept_id" : "Fcpk_WQT_4hS",
        "label" : "Eventsäljare/Eventförsäljare",
        "legacy_ams_taxonomy_id" : "7535"
      },
      "occupation_group" : {
        "concept_id" : "NCeZ_rSk_B4D",
        "label" : "Eventsäljare och butiksdemonstratörer m.fl.",
        "legacy_ams_taxonomy_id" : "5241"
      },
      "employment_type" : {
        "concept_id" : "PFZr_Syz_cUq",
        "label" : "Vanlig anställning",
        "legacy_ams_taxonomy_id" : "1"
      },
      "webpage_url" : "https://arbetsformedlingen.se/platsbanken/annonser/26375157",
      "driving_license_required" : false,
      "application_contacts" : [ {
        "description" : "Ellen Carlsson",
        "email" : "ellen@valuesales.se",
        "telephone" : "072-377 46 63",
        "name" : null,
        "contact_type" : null
      } ],
      "duration" : {
        "concept_id" : "a7uU_j21_mkL",
        "label" : "Tills vidare",
        "legacy_ams_taxonomy_id" : "1"
      },
      "nice_to_have" : {
        "education_level" : [ ],
        "work_experiences" : [ ],
        "skills" : [ ],
        "education" : [ ],
        "languages" : [ ]
      },
      "application_details" : {
        "via_af" : false,
        "email" : null,
        "other" : null,
        "reference" : null,
        "url" : "https://jobb.valuesales.se/jobs/1953173-saljutbildning-hoga-provisioner?promotion=458016-arbetsformedlingen",
        "information" : null
      },
      "source_type" : "VIA_PLATSBANKEN_DXA",
      "application_deadline" : "2023-01-20T23:59:59",
      "external_id" : "46-559251-2866-1953173-1",
      "workplace_address" : {
        "coordinates" : [ 17.427816, 59.178177 ],
        "city" : null,
        "postcode" : null,
        "municipality" : "Nykvarn",
        "region_concept_id" : "CifL_Rzy_Mku",
        "region" : "Stockholms län",
        "country_code" : "199",
        "region_code" : "01",
        "municipality_concept_id" : "mBKv_q3B_SK8",
        "country_concept_id" : "i46j_HmG_v64",
        "municipality_code" : "0140",
        "street_address" : null,
        "country" : "Sverige"
      },
      "id" : "26375157",
      "experience_required" : false,
      "working_hours_type" : {
        "concept_id" : "6YE1_gAC_R2G",
        "label" : "Heltid",
        "legacy_ams_taxonomy_id" : "1"
      },
      "access" : null,
      "timestamp" : 1659527547866,
      "must_have" : {
        "education_level" : [ ],
        "work_experiences" : [ ],
        "skills" : [ ],
        "education" : [ ],
        "languages" : [ ]
      },
      "occupation_field" : {
        "concept_id" : "RPTn_bxG_ExZ",
        "label" : "Försäljning, inköp, marknadsföring",
        "legacy_ams_taxonomy_id" : "5"
      },
      "scope_of_work" : {
        "min" : 100,
        "max" : 100
      },
      "salary_type" : {
        "concept_id" : "oG8G_9cW_nRf",
        "label" : "Fast månads- vecko- eller timlön",
        "legacy_ams_taxonomy_id" : "1"
      },
      "removed" : false,
      "salary_description" : "Lön enligt överenskommelse",
      "access_to_own_car" : false,
      "publication_date" : "2022-08-03T13:52:27"
    },
    "name" : "Säljutbildning + höga provisioner!",
    "user" : "hannes"
  },
  "sha1" : "c3942c74bfd7370c072e32be856639bdb04caff8",
  "annotations" : [ {
    "preferred-label" : "Säljare",
    "sentiment" : "MUST_HAVE",
    "type" : "keyword",
    "start-position" : 108,
    "end-position" : 115,
    "concept-id" : "rDcj_Tao_TJJ",
    "matched-string" : "säljare",
    "annotation-id" : 0
  }, {
    "preferred-label" : "Försäljning, inköp, marknadsföring",
    "type" : "occupation-field",
    "start-position" : 149,
    "end-position" : 160,
    "concept-id" : "RPTn_bxG_ExZ",
    "matched-string" : "försäljning",
    "annotation-id" : 8
  }, {
    "preferred-label" : "Stockholm",
    "type" : "municipality",
    "start-position" : 464,
    "end-position" : 473,
    "concept-id" : "AvNB_uwa_6n6",
    "matched-string" : "Stockholm",
    "annotation-id" : 10
  }, {
    "preferred-label" : "Sverige",
    "type" : "country",
    "start-position" : 517,
    "end-position" : 524,
    "concept-id" : "i46j_HmG_v64",
    "matched-string" : "Sverige",
    "annotation-id" : 11
  }, {
    "preferred-label" : "Heltid",
    "type" : "worktime-extent",
    "start-position" : 555,
    "end-position" : 568,
    "concept-id" : "6YE1_gAC_R2G",
    "matched-string" : "heltidstjänst",
    "annotation-id" : 9
  }, {
    "preferred-label" : "Sverige",
    "type" : "country",
    "start-position" : 613,
    "end-position" : 621,
    "concept-id" : "i46j_HmG_v64",
    "matched-string" : "Sveriges",
    "annotation-id" : 12
  }, {
    "preferred-label" : "Resor i arbetet förekommer",
    "sentiment" : "MUST_HAVE",
    "type" : "work-place-environment",
    "start-position" : 758,
    "end-position" : 763,
    "concept-id" : "oaM2_JTK_muh",
    "matched-string" : "resor",
    "annotation-id" : 1
  }, {
    "preferred-label" : "Säljare",
    "sentiment" : "MUST_HAVE",
    "type" : "keyword",
    "start-position" : 800,
    "end-position" : 807,
    "concept-id" : "rDcj_Tao_TJJ",
    "matched-string" : "säljare",
    "annotation-id" : 2
  }, {
    "preferred-label" : "Heltid",
    "type" : "worktime-extent",
    "start-position" : 826,
    "end-position" : 832,
    "concept-id" : "6YE1_gAC_R2G",
    "matched-string" : "Heltid",
    "annotation-id" : 13
  }, {
    "preferred-label" : "Tillsvidareanställning (inkl. eventuell provanställning)",
    "type" : "employment-type",
    "start-position" : 890,
    "end-position" : 936,
    "concept-id" : "kpPX_CNN_gDU",
    "matched-string" : "- Provanställning 6 mån, därefter tillsvidare.",
    "annotation-id" : 14
  }, {
    "preferred-label" : "personlig utveckling",
    "sentiment" : "MUST_HAVE",
    "type" : "esco-skill",
    "start-position" : 975,
    "end-position" : 995,
    "concept-id" : "wkQj_Dah_2GD",
    "matched-string" : "personlig utveckling",
    "annotation-id" : 3
  }, {
    "preferred-label" : "Rörlig ackords- eller provisionslön",
    "type" : "wage-type",
    "start-position" : 1148,
    "end-position" : 1157,
    "concept-id" : "vVtj_qm6_GQu",
    "matched-string" : "provision",
    "annotation-id" : 15
  }, {
    "preferred-label" : "Sälj",
    "sentiment" : "MUST_HAVE",
    "type" : "keyword",
    "start-position" : 1269,
    "end-position" : 1273,
    "concept-id" : "QaXB_Zd5_gmh",
    "matched-string" : "sälj",
    "annotation-id" : 4
  }, {
    "preferred-label" : "Coaching/Coachning",
    "sentiment" : "MUST_HAVE",
    "type" : "skill",
    "start-position" : 1349,
    "end-position" : 1358,
    "concept-id" : "91Ef_58Y_jX4",
    "matched-string" : "coachning",
    "annotation-id" : 5
  }, {
    "preferred-label" : "Resor",
    "sentiment" : "MUST_HAVE",
    "type" : "keyword",
    "start-position" : 1392,
    "end-position" : 1397,
    "concept-id" : "mj44_gFW_1X5",
    "matched-string" : "resor",
    "annotation-id" : 6
  }, {
    "preferred-label" : "B",
    "type" : "driving-licence",
    "start-position" : 1434,
    "end-position" : 1443,
    "concept-id" : "VTK8_WRx_GcM",
    "matched-string" : "B-körkort",
    "annotation-id" : 16
  }, {
    "preferred-label" : "Stockholm",
    "type" : "municipality",
    "start-position" : 1819,
    "end-position" : 1828,
    "concept-id" : "AvNB_uwa_6n6",
    "matched-string" : "Stockholm",
    "annotation-id" : 17
  } ],
  "text" : "Säljutbildning + höga provisioner!\nJust nu söker vi efter fler stjärnor som vill jobba med våra fantastiska säljare!\n\nIngen tidigare erfarenhet inom försäljning krävs. Vi utbildar samtliga nyanställda inom en säljstruktur som gynnar säljaren hos oss likväl som i framtiden inom andra yrken eller områden.\n\nHar du kanske framtidsplaner på att starta eget? Bli entreprenör? Lär dig allt inom försäljning från grunden hos oss!\n\nDenna annons är inte endast riktad mot Stockholm, utan vi anställer nya människor från hela Sverige.\n\nOm tjänsten\n\nHär erbjuds en heltidstjänst där du besöker kunderna i olika städer inom Sveriges gränser. Under besöken säljer du olika typer av tjänster från välkända varumärken från en av våra uppdragsgivare.\n\nVi står för samtliga resor samt boendekostnader till alla våra säljare!\n\nKontraktstyp\n\n- Heltid.\n- Arbetstider mån-fre kl 13:00-21:00 & fre 14:00-20:00.\n- Provanställning 6 mån, därefter tillsvidare.\n\n\n\n\nVi söker dig som:\n\n- Motiveras av personlig utveckling och resultat.\n- Är målmedveten och tävlingsinriktad.\n- Är utåtriktad med en positiv inställning och har ett stort engagemang.\n\n\nVi erbjuder:\n\n- Generös provision (utan tak).\n- Utvecklingsmöjligheter inom vårt snabbväxande företag.\n- Teoretisk samt praktisk utbildning inom sälj.\n- Varierande arbetsuppgifter med givande och starka varumärken.\n- Löpande coachning och utbildning.\n- Säljtävlingar, resor och festligheter!\n\n\n\nMeriterande\n\n- B-körkort (inget krav).\n\n\nÄr det dig vi söker? Skicka din ansökan idag! https://jobb.valuesales.se/\n\nOm oss\n\nValue Sales är ett ungt och snabbväxande företag som arbetar inom fält- och eventförsäljning samt telemarketing.\n\nVi samarbetar med väletablerade affärspartners och hjälper organisationer att utveckla sitt viktigaste element - vi säljer!\n\nVårt huvudkontor är beläget i Kista, Stockholm.\n\nHemsida: www.valuesales.se\n\nFölj vår resa på sociala medier:\n\nInstagram: @valuesalesab / TikTok: @valuesales"
}