{
  "meta" : {
    "jobad" : {
      "description" : {
        "requirements" : null,
        "needs" : null,
        "company_information" : null,
        "text_formatted" : "<p>Om tjänsten</p><p>Vi söker nu trevliga samt arbetsvilliga personer för</p><p>expressarbeten i Stockholm. Du väljer själv vilka</p><p>dagar/tider som passar just dig.</p><p>Vi utför transporter, flyttar samt monteringar.</p><p>Vi är alltid minst 2 personer vid varje arbetspass och</p><p>vårt arbetsredskap är lätta lastbilar.</p><p>Arbetstiden samt arbetsplatserna varierar, vi jobbar i</p><p>hela Stockholmsområdet. Våra kunder är primärt</p><p>privatpersoner, men även företag och organisationer.</p><p>Vi ser gärna att du är i fysiskt god kondition samt att du</p><p>är social och serviceinriktad. Ett stort plus är om du har B-körkort.</p><p><br></p><p><br></p>",
        "conditions" : null,
        "text" : "Om tjänsten\nVi söker nu trevliga samt arbetsvilliga personer för\nexpressarbeten i Stockholm. Du väljer själv vilka\ndagar/tider som passar just dig.\nVi utför transporter, flyttar samt monteringar.\nVi är alltid minst 2 personer vid varje arbetspass och\nvårt arbetsredskap är lätta lastbilar.\nArbetstiden samt arbetsplatserna varierar, vi jobbar i\nhela Stockholmsområdet. Våra kunder är primärt\nprivatpersoner, men även företag och organisationer.\nVi ser gärna att du är i fysiskt god kondition samt att du\när social och serviceinriktad. Ett stort plus är om du har B-körkort."
      },
      "headline" : "Expressarbetare till Pipers AB",
      "driving_license" : [ {
        "concept_id" : "VTK8_WRx_GcM",
        "label" : "B",
        "legacy_ams_taxonomy_id" : "3"
      } ],
      "employer" : {
        "email" : null,
        "phone_number" : null,
        "organization_number" : "5590664834",
        "name" : "PIPERS AB",
        "url" : "http://www.pipers.se",
        "workplace" : "Pipers AB"
      },
      "removed_date" : null,
      "logo_url" : "https://www.arbetsformedlingen.se/rest/arbetsgivare/rest/af/v3/arbetsplatser/85869863/logotyper/logo.png",
      "last_publication_date" : "2022-09-02T23:59:59",
      "number_of_vacancies" : 4,
      "occupation" : {
        "concept_id" : "bhsT_kjt_muu",
        "label" : "Flyttkarl/Stadsbud",
        "legacy_ams_taxonomy_id" : "5278"
      },
      "occupation_group" : {
        "concept_id" : "bwnk_nv2_1cR",
        "label" : "Ramppersonal, flyttkarlar och varupåfyllare m.fl.",
        "legacy_ams_taxonomy_id" : "9332"
      },
      "employment_type" : {
        "concept_id" : "1paU_aCR_nGn",
        "label" : "Behovsanställning",
        "legacy_ams_taxonomy_id" : "4"
      },
      "webpage_url" : "https://arbetsformedlingen.se/platsbanken/annonser/26376180",
      "driving_license_required" : true,
      "application_contacts" : [ ],
      "duration" : {
        "concept_id" : null,
        "label" : null,
        "legacy_ams_taxonomy_id" : null
      },
      "nice_to_have" : {
        "education_level" : [ ],
        "work_experiences" : [ ],
        "skills" : [ ],
        "education" : [ ],
        "languages" : [ ]
      },
      "application_details" : {
        "via_af" : false,
        "email" : "info@pipers.se",
        "other" : null,
        "reference" : null,
        "url" : null,
        "information" : null
      },
      "source_type" : "VIA_ANNONSERA",
      "application_deadline" : "2022-09-02T23:59:59",
      "external_id" : null,
      "workplace_address" : {
        "coordinates" : [ 18.044886522808415, 59.32915406934293 ],
        "city" : "Stockholm",
        "postcode" : "11224",
        "municipality" : "Stockholm",
        "region_concept_id" : "CifL_Rzy_Mku",
        "region" : "Stockholms län",
        "country_code" : "199",
        "region_code" : "01",
        "municipality_concept_id" : "AvNB_uwa_6n6",
        "country_concept_id" : "i46j_HmG_v64",
        "municipality_code" : "0180",
        "street_address" : "Pipersgatan 3",
        "country" : "Sverige"
      },
      "id" : "26376180",
      "experience_required" : false,
      "working_hours_type" : {
        "concept_id" : null,
        "label" : null,
        "legacy_ams_taxonomy_id" : null
      },
      "access" : null,
      "timestamp" : 1659559905277,
      "must_have" : {
        "education_level" : [ ],
        "work_experiences" : [ ],
        "skills" : [ ],
        "education" : [ ],
        "languages" : [ ]
      },
      "occupation_field" : {
        "concept_id" : "ASGV_zcE_bWf",
        "label" : "Transport, distribution, lager",
        "legacy_ams_taxonomy_id" : "19"
      },
      "scope_of_work" : {
        "min" : 0,
        "max" : null
      },
      "salary_type" : {
        "concept_id" : "oG8G_9cW_nRf",
        "label" : "Fast månads- vecko- eller timlön",
        "legacy_ams_taxonomy_id" : "1"
      },
      "removed" : false,
      "salary_description" : null,
      "access_to_own_car" : false,
      "publication_date" : "2022-08-03T22:51:45"
    },
    "name" : "Expressarbetare till Pipers AB",
    "user" : "kristof.fischer"
  },
  "sha1" : "c97561e6148826a1cda3f6179b1611ee48d0b1b0",
  "annotations" : [ {
    "preferred-label" : "Expressarbetare/Flyttkarl/Stadsbud",
    "sentiment" : "MUST_HAVE",
    "type" : "occupation-name",
    "start-position" : 0,
    "end-position" : 15,
    "concept-id" : "bhsT_kjt_muu",
    "matched-string" : "expressarbetare",
    "annotation-id" : 0
  }, {
    "preferred-label" : "Stockholm",
    "type" : "municipality",
    "start-position" : 113,
    "end-position" : 122,
    "concept-id" : "AvNB_uwa_6n6",
    "matched-string" : "Stockholm",
    "annotation-id" : 1
  }, {
    "preferred-label" : "Stockholm",
    "type" : "municipality",
    "start-position" : 381,
    "end-position" : 398,
    "concept-id" : "AvNB_uwa_6n6",
    "matched-string" : "Stockholmsområdet",
    "annotation-id" : 2
  }, {
    "preferred-label" : "God fysik (tunga lyft)",
    "sentiment" : "MUST_HAVE",
    "type" : "skill",
    "start-position" : 501,
    "end-position" : 522,
    "concept-id" : "rwir_xvu_443",
    "matched-string" : "fysiskt god kondition",
    "annotation-id" : 3
  }, {
    "preferred-label" : "B",
    "sentiment" : "NICE_TO_HAVE",
    "type" : "driving-licence",
    "start-position" : 594,
    "end-position" : 603,
    "concept-id" : "VTK8_WRx_GcM",
    "matched-string" : "B-körkort",
    "annotation-id" : 4
  } ],
  "text" : "Expressarbetare till Pipers AB\nOm tjänsten\nVi söker nu trevliga samt arbetsvilliga personer för\nexpressarbeten i Stockholm. Du väljer själv vilka\ndagar/tider som passar just dig.\nVi utför transporter, flyttar samt monteringar.\nVi är alltid minst 2 personer vid varje arbetspass och\nvårt arbetsredskap är lätta lastbilar.\nArbetstiden samt arbetsplatserna varierar, vi jobbar i\nhela Stockholmsområdet. Våra kunder är primärt\nprivatpersoner, men även företag och organisationer.\nVi ser gärna att du är i fysiskt god kondition samt att du\när social och serviceinriktad. Ett stort plus är om du har B-körkort."
}