{
  "meta" : {
    "jobad" : {
      "description" : {
        "requirements" : null,
        "needs" : null,
        "company_information" : null,
        "text_formatted" : "<p><strong>Om oss:</strong></p><p>The Brand Concept är en fullservicebyrå inom produktmarknadsföring. Vårt fokus är att stärka våra kunders varumärke med hjälp av produktmedia, fysisk print samt distribution. Med 31 års erfarenhet och kunskap inom företagsprofilering med relationsbyggande reklamprodukter blir vi en stark samarbetspartner.</p><p>LIA ”Praktikplats” - Digital Marknadsförare - Content Manager</p><p>Vi har en ledig plats som praktikant.</p><p>Vi tror att du studerar E-Commerce manager / Content manager eller liknade. </p><p>Du kommer att arbeta tillsammans med VD och planera våra aktiviteter, det är dock du som ensam skapar och genomför våra aktiviteter online. Du hanterar och ansvarar för nyhetsbrev, sociala medier, uppdatering av bilder/banners, produkter, texter på hemsidor. Du gör även kundförslag i form av designförslag. <strong>Vi anpassar arbetsuppgifterna efter din kunskap</strong>.</p><p> Huvudsakliga arbetsuppgifter:</p><p>·       Ansvara för vår digitala närvaro i sociala medier</p><p>·       Enklare SEO-optimering samt Google Adwords</p><p>·       Fota produkter till vår sociala närvaro</p><p>·       Skapa nyhetsbrev</p><p>·       Content hemsida</p><p>·       Produktion och utformning av trycksaker, banners och annonser (om du har dessa skills är det ett plus men ej krav)</p><p>·       Korrekturhantering</p><p> Du kommer ha stora möjligheter att vara kreativ och komma på nya lösningar för att i den digitala miljön nå de uppsatta målen.</p><p> <strong>För att lyckas i rollen ser vi att du:</strong></p><p><strong> </strong>Studerar eller har nyligen studerat till E-Commerce manager / Content manager eller liknade</p><p> </p><p><strong>Personliga egenskaper som vi söker: </strong></p><p>* Driven</p><p>* Noggrann</p><p>* Engagerad</p><p> </p><p><strong>Vi attraherar dig för att: </strong></p><p>* Du får möjlighet att utvecklas parallellt med företagets expansion</p><p>* Du får arbeta på ett centralt beläget kontor med bra kommunikationer, en bit från Stureplan</p><p><strong> </strong></p><p><strong>Våra verksamheter</strong></p><p><strong> </strong>www.thebrandconcept.se</p><p>www.thebrandconceptprofil.se</p><p>www.pinsfactory.se</p><p>www.logocykel.se</p>",
        "conditions" : null,
        "text" : "Om oss:\nThe Brand Concept är en fullservicebyrå inom produktmarknadsföring. Vårt fokus är att stärka våra kunders varumärke med hjälp av produktmedia, fysisk print samt distribution. Med 31 års erfarenhet och kunskap inom företagsprofilering med relationsbyggande reklamprodukter blir vi en stark samarbetspartner.\nLIA ”Praktikplats” - Digital Marknadsförare - Content Manager\nVi har en ledig plats som praktikant.\nVi tror att du studerar E-Commerce manager / Content manager eller liknade. \nDu kommer att arbeta tillsammans med VD och planera våra aktiviteter, det är dock du som ensam skapar och genomför våra aktiviteter online. Du hanterar och ansvarar för nyhetsbrev, sociala medier, uppdatering av bilder/banners, produkter, texter på hemsidor. Du gör även kundförslag i form av designförslag. Vi anpassar arbetsuppgifterna efter din kunskap.\n Huvudsakliga arbetsuppgifter:\n·       Ansvara för vår digitala närvaro i sociala medier\n·       Enklare SEO-optimering samt Google Adwords\n·       Fota produkter till vår sociala närvaro\n·       Skapa nyhetsbrev\n·       Content hemsida\n·       Produktion och utformning av trycksaker, banners och annonser (om du har dessa skills är det ett plus men ej krav)\n·       Korrekturhantering\n Du kommer ha stora möjligheter att vara kreativ och komma på nya lösningar för att i den digitala miljön nå de uppsatta målen.\n För att lyckas i rollen ser vi att du:\n Studerar eller har nyligen studerat till E-Commerce manager / Content manager eller liknade\n \nPersonliga egenskaper som vi söker: \n* Driven\n* Noggrann\n* Engagerad\n \nVi attraherar dig för att: \n* Du får möjlighet att utvecklas parallellt med företagets expansion\n* Du får arbeta på ett centralt beläget kontor med bra kommunikationer, en bit från Stureplan\n \nVåra verksamheter\n www.thebrandconcept.se\nwww.thebrandconceptprofil.se\nwww.pinsfactory.se\nwww.logocykel.se"
      },
      "headline" : "Praktikplats (LIA) Digital Marknadsförare - Content Manager",
      "driving_license" : null,
      "employer" : {
        "email" : null,
        "phone_number" : null,
        "organization_number" : "5564485471",
        "name" : "Pins Factory AB",
        "url" : "www.thebrandconcept.se",
        "workplace" : "The Brand Concept Sweden"
      },
      "removed_date" : null,
      "logo_url" : "https://www.arbetsformedlingen.se/rest/arbetsgivare/rest/af/v3/arbetsplatser/83413179/logotyper/logo.png",
      "last_publication_date" : "2022-08-10T23:59:59",
      "number_of_vacancies" : 1,
      "occupation" : {
        "concept_id" : "DznH_rkD_dyj",
        "label" : "Designassistent",
        "legacy_ams_taxonomy_id" : "7630"
      },
      "occupation_group" : {
        "concept_id" : "PF4H_kQD_zpL",
        "label" : "Övriga designer och formgivare",
        "legacy_ams_taxonomy_id" : "2179"
      },
      "employment_type" : {
        "concept_id" : "Jh8f_q9J_pbJ",
        "label" : "Sommarjobb / feriejobb",
        "legacy_ams_taxonomy_id" : "2"
      },
      "webpage_url" : "https://arbetsformedlingen.se/platsbanken/annonser/26315273",
      "driving_license_required" : false,
      "application_contacts" : [ ],
      "duration" : {
        "concept_id" : "Xj7x_7yZ_jEn",
        "label" : "3 månader – upp till 6 månader",
        "legacy_ams_taxonomy_id" : "3"
      },
      "nice_to_have" : {
        "education_level" : [ ],
        "work_experiences" : [ {
          "concept_id" : "DznH_rkD_dyj",
          "weight" : 5,
          "label" : "Designassistent",
          "legacy_ams_taxonomy_id" : "7630"
        } ],
        "skills" : [ ],
        "education" : [ ],
        "languages" : [ ]
      },
      "application_details" : {
        "via_af" : false,
        "email" : "info@thebrandconcept.se",
        "other" : null,
        "reference" : "Junior- Digital Marknadsförare",
        "url" : null,
        "information" : null
      },
      "source_type" : "VIA_ANNONSERA",
      "application_deadline" : "2022-08-10T23:59:59",
      "external_id" : null,
      "workplace_address" : {
        "coordinates" : [ 18.086239513163775, 59.33355125802982 ],
        "city" : "Stockholm",
        "postcode" : "11454",
        "municipality" : "Stockholm",
        "region_concept_id" : "CifL_Rzy_Mku",
        "region" : "Stockholms län",
        "country_code" : "199",
        "region_code" : "01",
        "municipality_concept_id" : "AvNB_uwa_6n6",
        "country_concept_id" : "i46j_HmG_v64",
        "municipality_code" : "0180",
        "street_address" : "Styrmansgatan 16",
        "country" : "Sverige"
      },
      "id" : "26315273",
      "experience_required" : true,
      "working_hours_type" : {
        "concept_id" : "6YE1_gAC_R2G",
        "label" : "Heltid",
        "legacy_ams_taxonomy_id" : "1"
      },
      "access" : null,
      "timestamp" : 1657538115291,
      "must_have" : {
        "education_level" : [ ],
        "work_experiences" : [ ],
        "skills" : [ ],
        "education" : [ ],
        "languages" : [ {
          "concept_id" : "zSLA_vw2_FXN",
          "weight" : 10,
          "label" : "Svenska",
          "legacy_ams_taxonomy_id" : "502"
        }, {
          "concept_id" : "NVxJ_hLg_TYS",
          "weight" : 10,
          "label" : "Engelska",
          "legacy_ams_taxonomy_id" : "283"
        } ]
      },
      "occupation_field" : {
        "concept_id" : "9puE_nYg_crq",
        "label" : "Kultur, media, design",
        "legacy_ams_taxonomy_id" : "11"
      },
      "scope_of_work" : {
        "min" : 0,
        "max" : 100
      },
      "salary_type" : {
        "concept_id" : "oG8G_9cW_nRf",
        "label" : "Fast månads- vecko- eller timlön",
        "legacy_ams_taxonomy_id" : "1"
      },
      "removed" : false,
      "salary_description" : null,
      "access_to_own_car" : false,
      "publication_date" : "2022-07-18T00:00:00"
    },
    "name" : "Praktikplats (LIA) Digital Marknadsförare - Content Manager",
    "user" : "hannes"
  },
  "sha1" : "fa9411142f1625a37312f586cb41d6f96b921cbd",
  "annotations" : [ {
    "preferred-label" : "Marknadsförare",
    "sentiment" : "MUST_HAVE",
    "type" : "occupation-name",
    "start-position" : 27,
    "end-position" : 41,
    "concept-id" : "WCma_2oa_gyZ",
    "matched-string" : "marknadsförare",
    "annotation-id" : 0
  }, {
    "preferred-label" : "Content manager",
    "sentiment" : "MUST_HAVE",
    "type" : "keyword",
    "start-position" : 44,
    "end-position" : 59,
    "concept-id" : "yDfK_MAc_L1d",
    "matched-string" : "content manager",
    "annotation-id" : 1
  }, {
    "preferred-label" : "marknadsföring",
    "type" : "esco-skill",
    "start-position" : 120,
    "end-position" : 134,
    "concept-id" : "UXRx_guv_ZGc",
    "matched-string" : "marknadsföring",
    "annotation-id" : 10
  }, {
    "preferred-label" : "Marknadsförare",
    "sentiment" : "MUST_HAVE",
    "type" : "occupation-name",
    "start-position" : 404,
    "end-position" : 418,
    "concept-id" : "WCma_2oa_gyZ",
    "matched-string" : "marknadsförare",
    "annotation-id" : 2
  }, {
    "preferred-label" : "Content manager",
    "sentiment" : "MUST_HAVE",
    "type" : "keyword",
    "start-position" : 421,
    "end-position" : 436,
    "concept-id" : "yDfK_MAc_L1d",
    "matched-string" : "content manager",
    "annotation-id" : 3
  }, {
    "preferred-label" : "E-commerce manager",
    "sentiment" : "MUST_HAVE",
    "type" : "occupation-name",
    "start-position" : 499,
    "end-position" : 517,
    "concept-id" : "PtwA_N8T_GTo",
    "matched-string" : "e-commerce manager",
    "annotation-id" : 4
  }, {
    "preferred-label" : "Content manager",
    "sentiment" : "MUST_HAVE",
    "type" : "keyword",
    "start-position" : 520,
    "end-position" : 535,
    "concept-id" : "yDfK_MAc_L1d",
    "matched-string" : "content manager",
    "annotation-id" : 5
  }, {
    "preferred-label" : "VD",
    "type" : "keyword",
    "start-position" : 589,
    "end-position" : 591,
    "concept-id" : "a4KX_762_t2D",
    "matched-string" : "VD",
    "annotation-id" : 11
  }, {
    "preferred-label" : "hantering av sociala medier",
    "type" : "esco-skill",
    "start-position" : 708,
    "end-position" : 716,
    "concept-id" : "MgRt_szJ_YYJ",
    "matched-string" : "ansvarar",
    "annotation-id" : 13
  }, {
    "preferred-label" : "hantering av sociala medier",
    "type" : "esco-skill",
    "start-position" : 733,
    "end-position" : 747,
    "concept-id" : "MgRt_szJ_YYJ",
    "matched-string" : "sociala medier",
    "annotation-id" : 12
  }, {
    "preferred-label" : "Sökordsoptimering/SEO",
    "sentiment" : "MUST_HAVE",
    "type" : "skill",
    "start-position" : 1014,
    "end-position" : 1017,
    "concept-id" : "zYHW_Mtu_jqq",
    "matched-string" : "seo",
    "annotation-id" : 6
  }, {
    "preferred-label" : "E-commerce manager",
    "sentiment" : "MUST_HAVE",
    "type" : "occupation-name",
    "start-position" : 1506,
    "end-position" : 1524,
    "concept-id" : "PtwA_N8T_GTo",
    "matched-string" : "e-commerce manager",
    "annotation-id" : 7
  }, {
    "preferred-label" : "Content manager",
    "sentiment" : "MUST_HAVE",
    "type" : "keyword",
    "start-position" : 1527,
    "end-position" : 1542,
    "concept-id" : "yDfK_MAc_L1d",
    "matched-string" : "content manager",
    "annotation-id" : 8
  }, {
    "preferred-label" : "noggrannhet",
    "type" : "esco-skill",
    "start-position" : 1607,
    "end-position" : 1615,
    "concept-id" : "mrsW_EkL_KRD",
    "matched-string" : "Noggrann",
    "annotation-id" : 14
  } ],
  "text" : "Praktikplats (LIA) Digital Marknadsförare - Content Manager\nOm oss:\nThe Brand Concept är en fullservicebyrå inom produktmarknadsföring. Vårt fokus är att stärka våra kunders varumärke med hjälp av produktmedia, fysisk print samt distribution. Med 31 års erfarenhet och kunskap inom företagsprofilering med relationsbyggande reklamprodukter blir vi en stark samarbetspartner.\nLIA ”Praktikplats” - Digital Marknadsförare - Content Manager\nVi har en ledig plats som praktikant.\nVi tror att du studerar E-Commerce manager / Content manager eller liknade. \nDu kommer att arbeta tillsammans med VD och planera våra aktiviteter, det är dock du som ensam skapar och genomför våra aktiviteter online. Du hanterar och ansvarar för nyhetsbrev, sociala medier, uppdatering av bilder/banners, produkter, texter på hemsidor. Du gör även kundförslag i form av designförslag. Vi anpassar arbetsuppgifterna efter din kunskap.\n Huvudsakliga arbetsuppgifter:\n·       Ansvara för vår digitala närvaro i sociala medier\n·       Enklare SEO-optimering samt Google Adwords\n·       Fota produkter till vår sociala närvaro\n·       Skapa nyhetsbrev\n·       Content hemsida\n·       Produktion och utformning av trycksaker, banners och annonser (om du har dessa skills är det ett plus men ej krav)\n·       Korrekturhantering\n Du kommer ha stora möjligheter att vara kreativ och komma på nya lösningar för att i den digitala miljön nå de uppsatta målen.\n För att lyckas i rollen ser vi att du:\n Studerar eller har nyligen studerat till E-Commerce manager / Content manager eller liknade\n \nPersonliga egenskaper som vi söker: \n* Driven\n* Noggrann\n* Engagerad\n \nVi attraherar dig för att: \n* Du får möjlighet att utvecklas parallellt med företagets expansion\n* Du får arbeta på ett centralt beläget kontor med bra kommunikationer, en bit från Stureplan\n \nVåra verksamheter\n www.thebrandconcept.se\nwww.thebrandconceptprofil.se\nwww.pinsfactory.se\nwww.logocykel.se"
}