{
  "meta" : {
    "jobad" : {
      "description" : {
        "requirements" : null,
        "needs" : null,
        "company_information" : null,
        "text_formatted" : "<p>Nu har du möjligheten att söka jobbet som servitris till vår restaurang. Arbetstiderna är varierande det innebär att du kommer att jobba fre-söndag kvällar o helger.</p><p>. Vi ser gärna att du som person är socialt utåtriktad, Har ett stort intresse för andra människor. Du som söker ska kunna flytande Svenska ha fyllt 18 år och vara intresserad av service du ska vara stresstålig och självgående. Om du är den personen vi söker så är du välkommen att söka tjänsten.</p><p>Du kan söka tjänsten via e-post eller komma in och lämna det till oss i restaurangen</p>",
        "conditions" : null,
        "text" : "Nu har du möjligheten att söka jobbet som servitris till vår restaurang. Arbetstiderna är varierande det innebär att du kommer att jobba fre-söndag kvällar o helger.\n. Vi ser gärna att du som person är socialt utåtriktad, Har ett stort intresse för andra människor. Du som söker ska kunna flytande Svenska ha fyllt 18 år och vara intresserad av service du ska vara stresstålig och självgående. Om du är den personen vi söker så är du välkommen att söka tjänsten.\nDu kan söka tjänsten via e-post eller komma in och lämna det till oss i restaurangen"
      },
      "headline" : "Servitör/Servitris Åhus",
      "driving_license" : null,
      "employer" : {
        "email" : null,
        "phone_number" : null,
        "organization_number" : "5593672420",
        "name" : "Lamarina Åhus AB",
        "url" : "http://res-marina.se",
        "workplace" : "La Marina Restaurant"
      },
      "removed_date" : null,
      "logo_url" : null,
      "last_publication_date" : "2022-09-04T23:59:59",
      "number_of_vacancies" : 1,
      "occupation" : {
        "concept_id" : "rGGf_KLs_To7",
        "label" : "Servitör/Servitris",
        "legacy_ams_taxonomy_id" : "5487"
      },
      "occupation_group" : {
        "concept_id" : "UjoW_meY_Zwt",
        "label" : "Hovmästare och servitörer",
        "legacy_ams_taxonomy_id" : "5131"
      },
      "employment_type" : {
        "concept_id" : "1paU_aCR_nGn",
        "label" : "Behovsanställning",
        "legacy_ams_taxonomy_id" : "4"
      },
      "webpage_url" : "https://arbetsformedlingen.se/platsbanken/annonser/26379434",
      "driving_license_required" : false,
      "application_contacts" : [ ],
      "duration" : {
        "concept_id" : null,
        "label" : null,
        "legacy_ams_taxonomy_id" : null
      },
      "nice_to_have" : {
        "education_level" : [ ],
        "work_experiences" : [ ],
        "skills" : [ ],
        "education" : [ ],
        "languages" : [ ]
      },
      "application_details" : {
        "via_af" : false,
        "email" : "info@res-marina.se",
        "other" : null,
        "reference" : "Servitris",
        "url" : null,
        "information" : null
      },
      "source_type" : "VIA_ANNONSERA",
      "application_deadline" : "2022-09-04T23:59:59",
      "external_id" : null,
      "workplace_address" : {
        "coordinates" : [ 14.291126713737512, 55.930095958489865 ],
        "city" : "Åhus",
        "postcode" : "29632",
        "municipality" : "Kristianstad",
        "region_concept_id" : "CaRE_1nn_cSU",
        "region" : "Skåne län",
        "country_code" : "199",
        "region_code" : "12",
        "municipality_concept_id" : "vrvW_sr8_1en",
        "country_concept_id" : "i46j_HmG_v64",
        "municipality_code" : "1290",
        "street_address" : "Nordanvägen 1",
        "country" : "Sverige"
      },
      "id" : "26379434",
      "experience_required" : true,
      "working_hours_type" : {
        "concept_id" : null,
        "label" : null,
        "legacy_ams_taxonomy_id" : null
      },
      "access" : null,
      "timestamp" : 1659680865274,
      "must_have" : {
        "education_level" : [ ],
        "work_experiences" : [ ],
        "skills" : [ ],
        "education" : [ ],
        "languages" : [ {
          "concept_id" : "zSLA_vw2_FXN",
          "weight" : 10,
          "label" : "Svenska",
          "legacy_ams_taxonomy_id" : "502"
        }, {
          "concept_id" : "NVxJ_hLg_TYS",
          "weight" : 10,
          "label" : "Engelska",
          "legacy_ams_taxonomy_id" : "283"
        } ]
      },
      "occupation_field" : {
        "concept_id" : "ScKy_FHB_7wT",
        "label" : "Hotell, restaurang, storhushåll",
        "legacy_ams_taxonomy_id" : "7"
      },
      "scope_of_work" : {
        "min" : 0,
        "max" : null
      },
      "salary_type" : {
        "concept_id" : "oG8G_9cW_nRf",
        "label" : "Fast månads- vecko- eller timlön",
        "legacy_ams_taxonomy_id" : "1"
      },
      "removed" : false,
      "salary_description" : null,
      "access_to_own_car" : false,
      "publication_date" : "2022-08-05T08:27:45"
    },
    "name" : "Servitör/Servitris Åhus",
    "user" : "hannes"
  },
  "sha1" : "20301384318d83499d8148e830478bab885dc701",
  "annotations" : [ {
    "preferred-label" : "Servitör/Servitris",
    "sentiment" : "MUST_HAVE",
    "type" : "occupation-name",
    "start-position" : 0,
    "end-position" : 18,
    "concept-id" : "rGGf_KLs_To7",
    "matched-string" : "servitör/servitris",
    "annotation-id" : 0
  }, {
    "preferred-label" : "Servitör/Servitris",
    "sentiment" : "MUST_HAVE",
    "type" : "occupation-name",
    "start-position" : 66,
    "end-position" : 75,
    "concept-id" : "rGGf_KLs_To7",
    "matched-string" : "servitris",
    "annotation-id" : 1
  }, {
    "preferred-label" : "Restaurang",
    "sentiment" : "MUST_HAVE",
    "type" : "keyword",
    "start-position" : 85,
    "end-position" : 95,
    "concept-id" : "o2Cg_3Ap_qvK",
    "matched-string" : "restaurang",
    "annotation-id" : 2
  }, {
    "preferred-label" : "Svenska",
    "sentiment" : "MUST_HAVE",
    "type" : "language",
    "start-position" : 322,
    "end-position" : 329,
    "concept-id" : "zSLA_vw2_FXN",
    "matched-string" : "svenska",
    "annotation-id" : 3
  }, {
    "preferred-label" : "hantera stress",
    "type" : "esco-skill",
    "start-position" : 389,
    "end-position" : 400,
    "concept-id" : "z5Zo_DVb_VEK",
    "matched-string" : "stresstålig",
    "annotation-id" : 4
  } ],
  "text" : "Servitör/Servitris Åhus\nNu har du möjligheten att söka jobbet som servitris till vår restaurang. Arbetstiderna är varierande det innebär att du kommer att jobba fre-söndag kvällar o helger.\n. Vi ser gärna att du som person är socialt utåtriktad, Har ett stort intresse för andra människor. Du som söker ska kunna flytande Svenska ha fyllt 18 år och vara intresserad av service du ska vara stresstålig och självgående. Om du är den personen vi söker så är du välkommen att söka tjänsten.\nDu kan söka tjänsten via e-post eller komma in och lämna det till oss i restaurangen"
}