{
  "meta" : {
    "dataset-id" : "myh-spreadsheet-2021",
    "type" : "education-description",
    "dataset-document-id" : "YH00466",
    "user" : "hannes"
  },
  "sha1" : "aaaa8e9a02e26b1cb09376af2487f07038c6e501",
  "annotations" : [ {
    "preferred-label" : "3D",
    "type" : "keyword",
    "start-position" : 44,
    "end-position" : 53,
    "concept-id" : "hL9a_dxf_fBN",
    "matched-string" : "3D-bilder",
    "annotation-id" : 8
  }, {
    "preferred-label" : "Högskoleutbildning två år, yrkesinriktad",
    "sentiment" : "OFFERED",
    "type" : "sun-education-level-3",
    "start-position" : 111,
    "end-position" : 132,
    "concept-id" : "HPb7_EY8_1y1",
    "matched-string" : "tvååriga utbildningen",
    "annotation-id" : 9
  }, {
    "preferred-label" : "Yrkesbevis/examen",
    "sentiment" : "OFFERED",
    "type" : "skill-headline",
    "start-position" : 221,
    "end-position" : 227,
    "concept-id" : "HjPN_99i_cFD",
    "matched-string" : "examen",
    "annotation-id" : 0
  }, {
    "preferred-label" : "Sverige",
    "sentiment" : "NOT_RELEVANT",
    "type" : "country",
    "start-position" : 299,
    "end-position" : 306,
    "concept-id" : "i46j_HmG_v64",
    "matched-string" : "Sverige",
    "annotation-id" : 10
  }, {
    "preferred-label" : "CAD-program",
    "sentiment" : "NOT_RELEVANT",
    "type" : "esco-skill",
    "start-position" : 499,
    "end-position" : 509,
    "concept-id" : "3SAB_gMy_c9b",
    "matched-string" : "CAD-system",
    "annotation-id" : 11
  }, {
    "preferred-label" : "3D-modellering",
    "sentiment" : "NOT_RELEVANT",
    "type" : "skill",
    "start-position" : 524,
    "end-position" : 535,
    "concept-id" : "yQcc_fTn_JL5",
    "matched-string" : "3D-modeller",
    "annotation-id" : 12
  }, {
    "preferred-label" : "Yrkesbevis/examen",
    "sentiment" : "OFFERED",
    "type" : "skill-headline",
    "start-position" : 992,
    "end-position" : 998,
    "concept-id" : "HjPN_99i_cFD",
    "matched-string" : "examen",
    "annotation-id" : 3
  }, {
    "preferred-label" : "Designer",
    "sentiment" : "NOT_RELEVANT",
    "type" : "occupation-name",
    "start-position" : 1185,
    "end-position" : 1193,
    "concept-id" : "42SW_cUg_uq2",
    "matched-string" : "designer",
    "annotation-id" : 4
  }, {
    "preferred-label" : "marknadsföring",
    "sentiment" : "NOT_RELEVANT",
    "type" : "esco-skill",
    "start-position" : 1298,
    "end-position" : 1312,
    "concept-id" : "UXRx_guv_ZGc",
    "matched-string" : "marknadsföring",
    "annotation-id" : 5
  }, {
    "preferred-label" : "3d-visualiserare",
    "sentiment" : "OFFERED",
    "type" : "keyword",
    "start-position" : 1691,
    "end-position" : 1707,
    "concept-id" : "dwck_5Tf_yYy",
    "matched-string" : "3d-visualiserare",
    "annotation-id" : 6
  }, {
    "preferred-label" : "3D artist/3D-grafiker",
    "sentiment" : "OFFERED",
    "type" : "occupation-name",
    "start-position" : 1709,
    "end-position" : 1720,
    "concept-id" : "eDCK_B3K_cqW",
    "matched-string" : "3d-grafiker",
    "annotation-id" : 7
  }, {
    "preferred-label" : "3D-modellör",
    "sentiment" : "OFFERED",
    "type" : "esco-occupation",
    "start-position" : 1727,
    "end-position" : 1738,
    "concept-id" : "9oDx_7ex_ar2",
    "matched-string" : "3D-modellör",
    "annotation-id" : 13
  }, {
    "preferred-label" : "Sverige",
    "sentiment" : "NOT_RELEVANT",
    "type" : "country",
    "start-position" : 1845,
    "end-position" : 1852,
    "concept-id" : "i46j_HmG_v64",
    "matched-string" : "Sverige",
    "annotation-id" : 14
  } ],
  "text" : "Vill du jobba med att skapa fotorealistiska 3D-bilder av byggnader, inomhus- och utomhusmiljöer? Under den här tvååriga utbildningen lär du dig hantera olika program för visualisering, bildbehandling och animation. Efter examen kan du jobba som visualiserare på arkitektkontor eller byggföretag – i Sverige eller internationellt.    OM UTBILDNINGEN  Under utbildningen lär du dig bland annat att  • arbeta i marknadsledande visualiseringsprogram  • efterbearbeta i bildbehandlingsprogram  • hantera CAD-system, BIM-data och 3D-modeller för interaktiv visualisering  • skapa kreativ bildkommunikation, fotorealistiska bilder, animationer och interaktiva miljöer  • arbeta i skarpa projekt tillsammans med olika roller och kompetenser.    INNEHÅLLER EN STOR DEL LIA (PRAKTIK)  En stor del av utbildningen består av LIA (lärande i arbete), vilket är yrkeshögskolans version av praktik. Under LIA:n får du träning i yrkesrollen och kontakter i arbetslivet som mycket väl kan leda till jobb efter examen.    ATT ARBETA SOM VISUALISERARE  Som visualiserare inom arkitektur skapar du fotorealistiska tredimensionella bilder av byggnader och miljöer, vilket gör att arkitekter, ingenjörer och designer kan kommunicera idéer snabbare och lättare. Bilderna används vid skiss, planering och design och även i marknadsföring.  Visualisering gör att man kan se exakt hur en designidé kommer se ut i verkligheten och bilderna innehåller ofta detaljer såsom belysning, möblering, akustik och skuggor. De kan också vara interaktiva, vilket gör det möjligt att ”vandra runt” i en miljö och uppleva den från olika vinklar.    TÄNKBARA YRKESROLLER OCH ARBETSPLATSER  Efter avslutad utbildning kan du jobba som 3D-visualiserare, 3D-grafiker eller 3D-modellör. Din framtida arbetsplats kan vara på arkitektkontor, bygg- eller mäklarföretag. Du kan välja att jobba i Sverige eller internationellt.    KURSER  • Arkitektonisk visualisering 1, 85 p  • Arkitektonisk visualisering 2, 60 p  • Arkitektonisk visualisering 3, 35 p  • Arkitektur- och byggkunskap, 20 p  • CAD – Bygg, 20 p  • Examensarbete, 10 p  • Interaktiv grafik och animation, 40 p  • LIA, Lärande i arbete 1, 65 p  • LIA, Lärande i arbete 2, 65 p    \n"
}