{
  "meta" : {
    "jobad" : {
      "description" : {
        "requirements" : null,
        "needs" : null,
        "company_information" : null,
        "text_formatted" : "Om Boxflow\n\nBoxflow grundades 2018 och har verksamhet i Halmstad, Göteborg, Stockholm, Helsingborg, Malmö och Kristianstad. Boxflow erbjuder tjänster inom Tredjepartslogistik, Consulting inom logistik samt uthyrning av personal inom logistik och industri. Boxflow har haft en stadig tillväxt sedan start och beräknas omsätta över 300 miljoner 2022 med fler än 1000 anställda.\n\nOm tjänsten\n\nVi söker nu en truckförare på heltid som kan köra skjutstativ (B3) till en kund i Helsingborg. Kunden är ett ledande logistikföretag inom livsmedel. Arbetstiderna är förlagda 15:45-00:45 under måndag till fredag. Arbetet förekommer i kyl- och frysmiljö.\n\nArbetsuppgifter\n\nArbetsuppgifterna är allmänt lagerarbete.\n\n- Orderplock\n- Truckkörning (A och B)\n- Förberedda produkter för utleverans\n- Andra arbetsuppgifter som kan tillkomma.\n\n\nProfil & bakgrund\n\nVi letar efter dig som har erfarenhet sedan tidigare att köra skjutstativstruck (B3). För att lyckas i rollen behöver du vara fokuserad, driven och självgående. Du behöver trivas att arbete i ett högt tempo och vara flexibel för utmaningar som kan komma. Vi letar efter dig som är vänlig och ödmjuk. Du behöver klara av att arbete i en tuff miljö (kyl och frys).\n\nKrav\n\n- Truckkort A1-4 och B1-4\n- Erfarenhet av B3\n- Tidigare erfarenhet av lager\n\n\nUrval sker löpande! Skicka iväg din ansökan redan nu.",
        "conditions" : "Heltid\r\nAnställningstid enligt överenskommelse",
        "text" : "Om Boxflow\n\nBoxflow grundades 2018 och har verksamhet i Halmstad, Göteborg, Stockholm, Helsingborg, Malmö och Kristianstad. Boxflow erbjuder tjänster inom Tredjepartslogistik, Consulting inom logistik samt uthyrning av personal inom logistik och industri. Boxflow har haft en stadig tillväxt sedan start och beräknas omsätta över 300 miljoner 2022 med fler än 1000 anställda.\n\nOm tjänsten\n\nVi söker nu en truckförare på heltid som kan köra skjutstativ (B3) till en kund i Helsingborg. Kunden är ett ledande logistikföretag inom livsmedel. Arbetstiderna är förlagda 15:45-00:45 under måndag till fredag. Arbetet förekommer i kyl- och frysmiljö.\n\nArbetsuppgifter\n\nArbetsuppgifterna är allmänt lagerarbete.\n\n- Orderplock\n- Truckkörning (A och B)\n- Förberedda produkter för utleverans\n- Andra arbetsuppgifter som kan tillkomma.\n\n\nProfil & bakgrund\n\nVi letar efter dig som har erfarenhet sedan tidigare att köra skjutstativstruck (B3). För att lyckas i rollen behöver du vara fokuserad, driven och självgående. Du behöver trivas att arbete i ett högt tempo och vara flexibel för utmaningar som kan komma. Vi letar efter dig som är vänlig och ödmjuk. Du behöver klara av att arbete i en tuff miljö (kyl och frys).\n\nKrav\n\n- Truckkort A1-4 och B1-4\n- Erfarenhet av B3\n- Tidigare erfarenhet av lager\n\n\nUrval sker löpande! Skicka iväg din ansökan redan nu."
      },
      "headline" : "Skjutstativsförare till kvällsskift - Helsingborg",
      "driving_license" : null,
      "employer" : {
        "email" : null,
        "phone_number" : null,
        "organization_number" : "5591962211",
        "name" : "Boxflow Staffing Syd AB",
        "url" : "https://www.boxflow.nu/",
        "workplace" : "Boxflow"
      },
      "removed_date" : null,
      "logo_url" : "https://www.arbetsformedlingen.se/rest/arbetsgivare/rest/af/v3/organisation/5591962211/logotyper/logo.png",
      "last_publication_date" : "2022-08-08T23:59:59",
      "number_of_vacancies" : 1,
      "occupation" : {
        "concept_id" : "GQSf_fnq_kjF",
        "label" : "Truckförare",
        "legacy_ams_taxonomy_id" : "5687"
      },
      "occupation_group" : {
        "concept_id" : "MrcX_RDn_N53",
        "label" : "Truckförare",
        "legacy_ams_taxonomy_id" : "8344"
      },
      "employment_type" : {
        "concept_id" : "PFZr_Syz_cUq",
        "label" : "Vanlig anställning",
        "legacy_ams_taxonomy_id" : "1"
      },
      "webpage_url" : "https://arbetsformedlingen.se/platsbanken/annonser/26375954",
      "driving_license_required" : false,
      "application_contacts" : [ {
        "description" : "Jonna Lindberg",
        "email" : null,
        "telephone" : null,
        "name" : null,
        "contact_type" : null
      } ],
      "duration" : {
        "concept_id" : "qQUd_4qe_NDT",
        "label" : "6 månader eller längre",
        "legacy_ams_taxonomy_id" : "2"
      },
      "nice_to_have" : {
        "education_level" : [ ],
        "work_experiences" : [ ],
        "skills" : [ ],
        "education" : [ ],
        "languages" : [ ]
      },
      "application_details" : {
        "via_af" : false,
        "email" : null,
        "other" : null,
        "reference" : null,
        "url" : "https://boxflow.teamtailor.com/jobs/1853378-skjutstativsforare-till-kvallsskift-helsingborg?promotion=431107-arbetsformedlingen",
        "information" : null
      },
      "source_type" : "VIA_PLATSBANKEN_DXA",
      "application_deadline" : "2022-08-08T23:59:59",
      "external_id" : "46-559196-2211-1853378-13",
      "workplace_address" : {
        "coordinates" : [ 12.694512, 56.046467 ],
        "city" : null,
        "postcode" : null,
        "municipality" : "Helsingborg",
        "region_concept_id" : "CaRE_1nn_cSU",
        "region" : "Skåne län",
        "country_code" : "199",
        "region_code" : "12",
        "municipality_concept_id" : "qj3q_oXH_MGR",
        "country_concept_id" : "i46j_HmG_v64",
        "municipality_code" : "1283",
        "street_address" : null,
        "country" : "Sverige"
      },
      "id" : "26375954",
      "experience_required" : true,
      "working_hours_type" : {
        "concept_id" : "6YE1_gAC_R2G",
        "label" : "Heltid",
        "legacy_ams_taxonomy_id" : "1"
      },
      "access" : null,
      "timestamp" : 1659539375086,
      "must_have" : {
        "education_level" : [ ],
        "work_experiences" : [ {
          "concept_id" : "GQSf_fnq_kjF",
          "weight" : 10,
          "label" : "Truckförare",
          "legacy_ams_taxonomy_id" : "5687"
        } ],
        "skills" : [ ],
        "education" : [ ],
        "languages" : [ ]
      },
      "occupation_field" : {
        "concept_id" : "ASGV_zcE_bWf",
        "label" : "Transport, distribution, lager",
        "legacy_ams_taxonomy_id" : "19"
      },
      "scope_of_work" : {
        "min" : 100,
        "max" : 100
      },
      "salary_type" : {
        "concept_id" : "oG8G_9cW_nRf",
        "label" : "Fast månads- vecko- eller timlön",
        "legacy_ams_taxonomy_id" : "1"
      },
      "removed" : false,
      "salary_description" : "Lön enligt överenskommelse",
      "access_to_own_car" : false,
      "publication_date" : "2022-08-03T17:09:35"
    },
    "name" : "Skjutstativsförare till kvällsskift - Helsingborg",
    "user" : "kristof.fischer"
  },
  "sha1" : "65080a1a671a6994413a951f29303938d8e92d8a",
  "annotations" : [ {
    "preferred-label" : "Truckförare",
    "type" : "occupation-name",
    "start-position" : 0,
    "end-position" : 18,
    "concept-id" : "GQSf_fnq_kjF",
    "matched-string" : "Skjutstativsförare",
    "annotation-id" : 6
  }, {
    "preferred-label" : "Helsingborg",
    "type" : "municipality",
    "start-position" : 38,
    "end-position" : 49,
    "concept-id" : "qj3q_oXH_MGR",
    "matched-string" : "Helsingborg",
    "annotation-id" : 7
  }, {
    "preferred-label" : "Halmstad",
    "type" : "municipality",
    "start-position" : 106,
    "end-position" : 114,
    "concept-id" : "kUQB_KdK_kAh",
    "matched-string" : "Halmstad",
    "annotation-id" : 8
  }, {
    "preferred-label" : "Göteborg",
    "type" : "municipality",
    "start-position" : 116,
    "end-position" : 124,
    "concept-id" : "PVZL_BQT_XtL",
    "matched-string" : "Göteborg",
    "annotation-id" : 9
  }, {
    "preferred-label" : "Stockholm",
    "type" : "municipality",
    "start-position" : 126,
    "end-position" : 135,
    "concept-id" : "AvNB_uwa_6n6",
    "matched-string" : "Stockholm",
    "annotation-id" : 10
  }, {
    "preferred-label" : "Helsingborg",
    "type" : "municipality",
    "start-position" : 137,
    "end-position" : 148,
    "concept-id" : "qj3q_oXH_MGR",
    "matched-string" : "Helsingborg",
    "annotation-id" : 11
  }, {
    "preferred-label" : "Malmö",
    "type" : "municipality",
    "start-position" : 150,
    "end-position" : 155,
    "concept-id" : "oYPt_yRA_Smm",
    "matched-string" : "Malmö",
    "annotation-id" : 12
  }, {
    "preferred-label" : "Kristianstad",
    "type" : "municipality",
    "start-position" : 160,
    "end-position" : 172,
    "concept-id" : "vrvW_sr8_1en",
    "matched-string" : "Kristianstad",
    "annotation-id" : 13
  }, {
    "preferred-label" : "Truckförare",
    "sentiment" : "MUST_HAVE",
    "type" : "occupation-name",
    "start-position" : 455,
    "end-position" : 466,
    "concept-id" : "GQSf_fnq_kjF",
    "matched-string" : "truckförare",
    "annotation-id" : 3
  }, {
    "preferred-label" : "Heltid",
    "type" : "worktime-extent",
    "start-position" : 470,
    "end-position" : 476,
    "concept-id" : "6YE1_gAC_R2G",
    "matched-string" : "heltid",
    "annotation-id" : 14
  }, {
    "preferred-label" : null,
    "sentiment" : "MUST_HAVE",
    "type" : "skill",
    "start-position" : 490,
    "end-position" : 506,
    "concept-id" : null,
    "matched-string" : "skjutstativ (B3)",
    "annotation-id" : 15
  }, {
    "preferred-label" : "Helsingborg",
    "type" : "municipality",
    "start-position" : 522,
    "end-position" : 533,
    "concept-id" : "qj3q_oXH_MGR",
    "matched-string" : "Helsingborg",
    "annotation-id" : 16
  }, {
    "preferred-label" : "plocka order för leverans",
    "sentiment" : "MUST_HAVE",
    "type" : "esco-skill",
    "start-position" : 757,
    "end-position" : 767,
    "concept-id" : "ZUh3_Nof_FF9",
    "matched-string" : "Orderplock",
    "annotation-id" : 17
  }, {
    "preferred-label" : "A-truckar",
    "sentiment" : "MUST_HAVE",
    "type" : "skill",
    "start-position" : 784,
    "end-position" : 785,
    "concept-id" : "Zk4h_jP4_e85",
    "matched-string" : "A",
    "annotation-id" : 18
  }, {
    "preferred-label" : "B-truckar",
    "sentiment" : "MUST_HAVE",
    "type" : "skill",
    "start-position" : 790,
    "end-position" : 791,
    "concept-id" : "HeXq_amc_ABd",
    "matched-string" : "B",
    "annotation-id" : 19
  }, {
    "preferred-label" : "förbereda produkter",
    "sentiment" : "MUST_HAVE",
    "type" : "esco-skill",
    "start-position" : 795,
    "end-position" : 830,
    "concept-id" : "oVNx_p1M_TEd",
    "matched-string" : "Förberedda produkter för utleverans",
    "annotation-id" : 20
  }, {
    "preferred-label" : null,
    "sentiment" : "MUST_HAVE",
    "type" : "skill",
    "start-position" : 952,
    "end-position" : 979,
    "concept-id" : null,
    "matched-string" : "köra skjutstativstruck (B3)",
    "annotation-id" : 21
  }, {
    "preferred-label" : "arbeta självständigt",
    "sentiment" : "MUST_HAVE",
    "type" : "esco-skill",
    "start-position" : 1043,
    "end-position" : 1054,
    "concept-id" : "NyFu_HHd_zhz",
    "matched-string" : "självgående",
    "annotation-id" : 22
  }, {
    "preferred-label" : "A-truckar",
    "sentiment" : "MUST_HAVE",
    "type" : "skill",
    "start-position" : 1267,
    "end-position" : 1281,
    "concept-id" : "Zk4h_jP4_e85",
    "matched-string" : "Truckkort A1-4",
    "annotation-id" : 23
  }, {
    "preferred-label" : "B-truckar",
    "sentiment" : "MUST_HAVE",
    "type" : "skill",
    "start-position" : 1286,
    "end-position" : 1290,
    "concept-id" : "HeXq_amc_ABd",
    "matched-string" : "B1-4",
    "annotation-id" : 24
  }, {
    "preferred-label" : null,
    "sentiment" : "MUST_HAVE",
    "type" : "skill",
    "start-position" : 1293,
    "end-position" : 1309,
    "concept-id" : null,
    "matched-string" : "Erfarenhet av B3",
    "annotation-id" : 25
  }, {
    "preferred-label" : "Terminal- och lagerarbete",
    "sentiment" : "MUST_HAVE",
    "type" : "skill",
    "start-position" : 1335,
    "end-position" : 1340,
    "concept-id" : "ijHY_aHk_ADE",
    "matched-string" : "lager",
    "annotation-id" : 5
  } ],
  "text" : "Skjutstativsförare till kvällsskift - Helsingborg\nOm Boxflow\n\nBoxflow grundades 2018 och har verksamhet i Halmstad, Göteborg, Stockholm, Helsingborg, Malmö och Kristianstad. Boxflow erbjuder tjänster inom Tredjepartslogistik, Consulting inom logistik samt uthyrning av personal inom logistik och industri. Boxflow har haft en stadig tillväxt sedan start och beräknas omsätta över 300 miljoner 2022 med fler än 1000 anställda.\n\nOm tjänsten\n\nVi söker nu en truckförare på heltid som kan köra skjutstativ (B3) till en kund i Helsingborg. Kunden är ett ledande logistikföretag inom livsmedel. Arbetstiderna är förlagda 15:45-00:45 under måndag till fredag. Arbetet förekommer i kyl- och frysmiljö.\n\nArbetsuppgifter\n\nArbetsuppgifterna är allmänt lagerarbete.\n\n- Orderplock\n- Truckkörning (A och B)\n- Förberedda produkter för utleverans\n- Andra arbetsuppgifter som kan tillkomma.\n\n\nProfil & bakgrund\n\nVi letar efter dig som har erfarenhet sedan tidigare att köra skjutstativstruck (B3). För att lyckas i rollen behöver du vara fokuserad, driven och självgående. Du behöver trivas att arbete i ett högt tempo och vara flexibel för utmaningar som kan komma. Vi letar efter dig som är vänlig och ödmjuk. Du behöver klara av att arbete i en tuff miljö (kyl och frys).\n\nKrav\n\n- Truckkort A1-4 och B1-4\n- Erfarenhet av B3\n- Tidigare erfarenhet av lager\n\n\nUrval sker löpande! Skicka iväg din ansökan redan nu."
}