{
  "meta" : {
    "jobad" : {
      "description" : {
        "requirements" : null,
        "needs" : null,
        "company_information" : null,
        "text_formatted" : "E.ON är ett internationellt privatägt energiföretag. 70.000 medarbetare i 15 länder arbetar dagligen för utvecklingen av tekniska innovationer och användarvänliga kundlösningar för den nya energivärlden. Vi är det första stora energibolaget som verkligen fokuserar på framtidens energilösningar genom våra affärsområden för smarta nät och kundlösningar.\r\n\r\nE.ON har en avgörande roll i energiomställningen och det ställer nya och utökade krav på att vi har väl fungerande kommunikationslösningar för vårt elnät. För att förverkliga detta behöver vi bli betydligt flera kollegor som tillsammans arbetar för en hållbar tillväxt och en säker elförsörjning.  Tillsammans skapar vi superkrafter!\n\nOm avdelningen och rollerna\nTeknisk Kommunikation arbetar inom området Operational Technology (OT) och har som syfte att leverera, designa och förvalta ett pålitligt kommunikationsnät för att kunna styra, övervaka och drifta våra stationer och vårt elnät. Vi är just nu i en expansiv och utvecklande fas och söker därför ytterligare en Kommunikationsingenjör till vårt team i Malmö eller Norrköping.\n\nSom Kommunikationsingenjör får du möjlighet att arbeta med design, uppsättning och förvaltning av vår IP kommunikationsinfrastruktur med komponenter som switchar, routrar och brandväggar. Du arbetar med integrationer och kommunikationslösningar för diverse OT-tillämpningar som är en viktig del i vår tekniska utveckling.\n\nExempel på arbetsuppgifter:\n\n  *  Konventionell switchning och routing med IS-IS/OSPF/BGP och MPLS-teknik\n  *  Vara delaktig i det arkitekturella arbetet\n  *  Optisk transmission och radio-teknik\nIT- och nätverk i operativa och industriella sammanhang\n\nVem hoppas vi på vill ansluta till oss?\nFör att trivas i rollen har du ett intresse för drift-och övervakning av kommunikationsinfrastruktur och dess uppbyggnad och vi ser gärna att du har en utbildning inom datavetenskap eller tele- och datakommunikation eller liknande. Vi jobbar i Linux, FreeBSD och Windows och därför är det fördelaktigt erfarenhet inom det. Det är även meriterande om du har vana av Cisco, Fortinet, Mikrotik, VyOS eller JunOS.\nVi har en komplex och segmenterad miljö hos oss med varierande behov av säkerhets- och tillgänglighetskrav och därför hoppas på att du är en lösningsorienterad och nyfiken person med ett högt säkerhetstänk.  \n\nVi söker som vill arbeta inom en samhällsviktig bransch där hållbarhet och långsiktighet är högt på agendan. Oavsett om du är nyexaminerad och på jakt efter ditt första jobb, eller har lång erfarenhet med dig, så är vi nyfikna på dig om du tycker detta låter intressant. Hos oss finns många kunniga och hjälpsamma kollegor som ser fram emot att både dela med sig och få ta del av dina idéer och synsätt.\n\nChristian Wickman, chef för Teknisk Kommunikation, har ett inkluderande och öppet ledarskap och kommer tillsammans med teamet stötta dig för att du ska trivas hos oss Christian har stor tillit till sina medarbetare och uppmuntrar till ett öppet och vänligt klimat där alla frågor är välkomna. \n\nVälkommen att söka och var med oss på vägen mot ett hållbart samhälle! Sista ansökningsdatum är den 22:e augusti.\n\nTjänsterna är säkerhetsklassade vilket innebär att en säkerhetsprövning kommer att genomföras innan anställning. \n\nFör frågor om tjänsten, vänligen kontakta rekryterande chef \nChristian Wickman +46 703 244386\n\nFör fackliga frågor, vänligen kontakta: \nPer Carlsson, Unionen, +46 070 603  54 25 \nMichael Andersson, Ledarna, +46 705 250129 \nMats Lundberg, SEKO, +46 730 499778",
        "conditions" : "Tillsvidare\r\nPermanent",
        "text" : "E.ON är ett internationellt privatägt energiföretag. 70.000 medarbetare i 15 länder arbetar dagligen för utvecklingen av tekniska innovationer och användarvänliga kundlösningar för den nya energivärlden. Vi är det första stora energibolaget som verkligen fokuserar på framtidens energilösningar genom våra affärsområden för smarta nät och kundlösningar.\r\n\r\nE.ON har en avgörande roll i energiomställningen och det ställer nya och utökade krav på att vi har väl fungerande kommunikationslösningar för vårt elnät. För att förverkliga detta behöver vi bli betydligt flera kollegor som tillsammans arbetar för en hållbar tillväxt och en säker elförsörjning.  Tillsammans skapar vi superkrafter!\n\nOm avdelningen och rollerna\nTeknisk Kommunikation arbetar inom området Operational Technology (OT) och har som syfte att leverera, designa och förvalta ett pålitligt kommunikationsnät för att kunna styra, övervaka och drifta våra stationer och vårt elnät. Vi är just nu i en expansiv och utvecklande fas och söker därför ytterligare en Kommunikationsingenjör till vårt team i Malmö eller Norrköping.\n\nSom Kommunikationsingenjör får du möjlighet att arbeta med design, uppsättning och förvaltning av vår IP kommunikationsinfrastruktur med komponenter som switchar, routrar och brandväggar. Du arbetar med integrationer och kommunikationslösningar för diverse OT-tillämpningar som är en viktig del i vår tekniska utveckling.\n\nExempel på arbetsuppgifter:\n\n  *  Konventionell switchning och routing med IS-IS/OSPF/BGP och MPLS-teknik\n  *  Vara delaktig i det arkitekturella arbetet\n  *  Optisk transmission och radio-teknik\nIT- och nätverk i operativa och industriella sammanhang\n\nVem hoppas vi på vill ansluta till oss?\nFör att trivas i rollen har du ett intresse för drift-och övervakning av kommunikationsinfrastruktur och dess uppbyggnad och vi ser gärna att du har en utbildning inom datavetenskap eller tele- och datakommunikation eller liknande. Vi jobbar i Linux, FreeBSD och Windows och därför är det fördelaktigt erfarenhet inom det. Det är även meriterande om du har vana av Cisco, Fortinet, Mikrotik, VyOS eller JunOS.\nVi har en komplex och segmenterad miljö hos oss med varierande behov av säkerhets- och tillgänglighetskrav och därför hoppas på att du är en lösningsorienterad och nyfiken person med ett högt säkerhetstänk.  \n\nVi söker som vill arbeta inom en samhällsviktig bransch där hållbarhet och långsiktighet är högt på agendan. Oavsett om du är nyexaminerad och på jakt efter ditt första jobb, eller har lång erfarenhet med dig, så är vi nyfikna på dig om du tycker detta låter intressant. Hos oss finns många kunniga och hjälpsamma kollegor som ser fram emot att både dela med sig och få ta del av dina idéer och synsätt.\n\nChristian Wickman, chef för Teknisk Kommunikation, har ett inkluderande och öppet ledarskap och kommer tillsammans med teamet stötta dig för att du ska trivas hos oss Christian har stor tillit till sina medarbetare och uppmuntrar till ett öppet och vänligt klimat där alla frågor är välkomna. \n\nVälkommen att söka och var med oss på vägen mot ett hållbart samhälle! Sista ansökningsdatum är den 22:e augusti.\n\nTjänsterna är säkerhetsklassade vilket innebär att en säkerhetsprövning kommer att genomföras innan anställning. \n\nFör frågor om tjänsten, vänligen kontakta rekryterande chef \nChristian Wickman +46 703 244386\n\nFör fackliga frågor, vänligen kontakta: \nPer Carlsson, Unionen, +46 070 603  54 25 \nMichael Andersson, Ledarna, +46 705 250129 \nMats Lundberg, SEKO, +46 730 499778"
      },
      "headline" : "Kommunikationsingenjör",
      "driving_license" : null,
      "employer" : {
        "email" : null,
        "phone_number" : null,
        "organization_number" : "5560068420",
        "name" : "E.On Sverige AB",
        "url" : "http://www.eon.com",
        "workplace" : "E.ON Energidistribution AB"
      },
      "removed_date" : null,
      "logo_url" : "https://www.arbetsformedlingen.se/rest/arbetsgivare/rest/af/v3/organisation/5560068420/logotyper/logo.png",
      "last_publication_date" : "2022-08-22T23:59:59",
      "number_of_vacancies" : 1,
      "occupation" : {
        "concept_id" : "quwX_j6m_b4v",
        "label" : "Kommunikationstekniker",
        "legacy_ams_taxonomy_id" : "2514"
      },
      "occupation_group" : {
        "concept_id" : "VCpu_5EN_bBt",
        "label" : "Nätverks- och systemtekniker m.fl.",
        "legacy_ams_taxonomy_id" : "3514"
      },
      "employment_type" : {
        "concept_id" : "PFZr_Syz_cUq",
        "label" : "Vanlig anställning",
        "legacy_ams_taxonomy_id" : "1"
      },
      "webpage_url" : "https://arbetsformedlingen.se/platsbanken/annonser/26385519",
      "driving_license_required" : false,
      "application_contacts" : [ {
        "description" : null,
        "email" : null,
        "telephone" : "+46 703 244386",
        "name" : "Christian Wickman",
        "contact_type" : null
      } ],
      "duration" : {
        "concept_id" : "a7uU_j21_mkL",
        "label" : "Tills vidare",
        "legacy_ams_taxonomy_id" : "1"
      },
      "nice_to_have" : {
        "education_level" : [ ],
        "work_experiences" : [ ],
        "skills" : [ ],
        "education" : [ ],
        "languages" : [ ]
      },
      "application_details" : {
        "via_af" : false,
        "email" : null,
        "other" : null,
        "reference" : "188022-40238140",
        "url" : "https://eon-business.contactrh.com/jobs/9669/40238140",
        "information" : "Ansökan skickas till: Carl Gustafs väg 1, Malmö, SE"
      },
      "source_type" : "VIA_PLATSBANKEN_DXA",
      "application_deadline" : "2022-08-22T23:59:59",
      "external_id" : "46-556006-8420-40238140",
      "workplace_address" : {
        "coordinates" : [ 13.003822, 55.60498 ],
        "city" : null,
        "postcode" : null,
        "municipality" : "Malmö",
        "region_concept_id" : "CaRE_1nn_cSU",
        "region" : "Skåne län",
        "country_code" : "199",
        "region_code" : "12",
        "municipality_concept_id" : "oYPt_yRA_Smm",
        "country_concept_id" : "i46j_HmG_v64",
        "municipality_code" : "1280",
        "street_address" : null,
        "country" : "Sverige"
      },
      "id" : "26385519",
      "experience_required" : true,
      "working_hours_type" : {
        "concept_id" : "6YE1_gAC_R2G",
        "label" : "Heltid",
        "legacy_ams_taxonomy_id" : "1"
      },
      "access" : null,
      "timestamp" : 1659950723723,
      "must_have" : {
        "education_level" : [ ],
        "work_experiences" : [ {
          "concept_id" : "quwX_j6m_b4v",
          "weight" : 10,
          "label" : "Kommunikationstekniker",
          "legacy_ams_taxonomy_id" : "2514"
        } ],
        "skills" : [ ],
        "education" : [ ],
        "languages" : [ ]
      },
      "occupation_field" : {
        "concept_id" : "apaJ_2ja_LuF",
        "label" : "Data/IT",
        "legacy_ams_taxonomy_id" : "3"
      },
      "scope_of_work" : {
        "min" : 100,
        "max" : 100
      },
      "salary_type" : {
        "concept_id" : "oG8G_9cW_nRf",
        "label" : "Fast månads- vecko- eller timlön",
        "legacy_ams_taxonomy_id" : "1"
      },
      "removed" : false,
      "salary_description" : "Undefined",
      "access_to_own_car" : false,
      "publication_date" : "2022-08-08T11:25:23"
    },
    "name" : "Kommunikationsingenjör",
    "user" : "hannes"
  },
  "sha1" : "2b7aa34205b9614d4c5948abaff78f031db28205",
  "annotations" : [ {
    "preferred-label" : "Ingenjörer och tekniker",
    "type" : "ssyk-level-3",
    "start-position" : 14,
    "end-position" : 22,
    "concept-id" : "DhEP_m8M_qoi",
    "matched-string" : "ingenjör",
    "annotation-id" : 9
  }, {
    "preferred-label" : "Malmö",
    "type" : "municipality",
    "start-position" : 1091,
    "end-position" : 1096,
    "concept-id" : "oYPt_yRA_Smm",
    "matched-string" : "Malmö",
    "annotation-id" : 7
  }, {
    "preferred-label" : "Norrköping",
    "type" : "municipality",
    "start-position" : 1103,
    "end-position" : 1113,
    "concept-id" : "SYty_Yho_JAF",
    "matched-string" : "Norrköping",
    "annotation-id" : 8
  }, {
    "preferred-label" : "Ingenjörer och tekniker",
    "type" : "ssyk-level-3",
    "start-position" : 1134,
    "end-position" : 1142,
    "concept-id" : "DhEP_m8M_qoi",
    "matched-string" : "ingenjör",
    "annotation-id" : 10
  }, {
    "preferred-label" : "Switchar, installation och underhåll",
    "type" : "skill",
    "start-position" : 1269,
    "end-position" : 1277,
    "concept-id" : "4qaY_nGh_gq1",
    "matched-string" : "switchar",
    "annotation-id" : 11
  }, {
    "preferred-label" : "Brandväggar",
    "sentiment" : "MUST_HAVE",
    "type" : "skill",
    "start-position" : 1291,
    "end-position" : 1302,
    "concept-id" : "iXzD_6DF_sL4",
    "matched-string" : "brandväggar",
    "annotation-id" : 0
  }, {
    "preferred-label" : "Radio",
    "sentiment" : "MUST_HAVE",
    "type" : "skill",
    "start-position" : 1622,
    "end-position" : 1627,
    "concept-id" : "5T5g_ij5_JUC",
    "matched-string" : "radio",
    "annotation-id" : 1
  }, {
    "preferred-label" : "Data/IT",
    "sentiment" : "MUST_HAVE",
    "type" : "occupation-field",
    "start-position" : 1635,
    "end-position" : 1637,
    "concept-id" : "apaJ_2ja_LuF",
    "matched-string" : "it",
    "annotation-id" : 2
  }, {
    "preferred-label" : "datavetenskap",
    "sentiment" : "MUST_HAVE",
    "type" : "esco-skill",
    "start-position" : 1900,
    "end-position" : 1913,
    "concept-id" : "VxiM_uBZ_V4d",
    "matched-string" : "datavetenskap",
    "annotation-id" : 3
  }, {
    "preferred-label" : "Datakommunikation",
    "sentiment" : "MUST_HAVE",
    "type" : "skill",
    "start-position" : 1930,
    "end-position" : 1947,
    "concept-id" : "2CvB_ZB6_6Kk",
    "matched-string" : "datakommunikation",
    "annotation-id" : 4
  }, {
    "preferred-label" : "Linux, operativsystem",
    "sentiment" : "MUST_HAVE",
    "type" : "skill",
    "start-position" : 1976,
    "end-position" : 1981,
    "concept-id" : "z52H_f4y_4ZA",
    "matched-string" : "linux",
    "annotation-id" : 5
  }, {
    "preferred-label" : "Windows, operativsystem",
    "sentiment" : "MUST_HAVE",
    "type" : "skill",
    "start-position" : 1995,
    "end-position" : 2002,
    "concept-id" : "G4sF_xod_zoq",
    "matched-string" : "windows",
    "annotation-id" : 6
  } ],
  "text" : "Kommunikationsingenjör\nE.ON är ett internationellt privatägt energiföretag. 70.000 medarbetare i 15 länder arbetar dagligen för utvecklingen av tekniska innovationer och användarvänliga kundlösningar för den nya energivärlden. Vi är det första stora energibolaget som verkligen fokuserar på framtidens energilösningar genom våra affärsområden för smarta nät och kundlösningar.\r\n\r\nE.ON har en avgörande roll i energiomställningen och det ställer nya och utökade krav på att vi har väl fungerande kommunikationslösningar för vårt elnät. För att förverkliga detta behöver vi bli betydligt flera kollegor som tillsammans arbetar för en hållbar tillväxt och en säker elförsörjning.  Tillsammans skapar vi superkrafter!\n\nOm avdelningen och rollerna\nTeknisk Kommunikation arbetar inom området Operational Technology (OT) och har som syfte att leverera, designa och förvalta ett pålitligt kommunikationsnät för att kunna styra, övervaka och drifta våra stationer och vårt elnät. Vi är just nu i en expansiv och utvecklande fas och söker därför ytterligare en Kommunikationsingenjör till vårt team i Malmö eller Norrköping.\n\nSom Kommunikationsingenjör får du möjlighet att arbeta med design, uppsättning och förvaltning av vår IP kommunikationsinfrastruktur med komponenter som switchar, routrar och brandväggar. Du arbetar med integrationer och kommunikationslösningar för diverse OT-tillämpningar som är en viktig del i vår tekniska utveckling.\n\nExempel på arbetsuppgifter:\n\n  *  Konventionell switchning och routing med IS-IS/OSPF/BGP och MPLS-teknik\n  *  Vara delaktig i det arkitekturella arbetet\n  *  Optisk transmission och radio-teknik\nIT- och nätverk i operativa och industriella sammanhang\n\nVem hoppas vi på vill ansluta till oss?\nFör att trivas i rollen har du ett intresse för drift-och övervakning av kommunikationsinfrastruktur och dess uppbyggnad och vi ser gärna att du har en utbildning inom datavetenskap eller tele- och datakommunikation eller liknande. Vi jobbar i Linux, FreeBSD och Windows och därför är det fördelaktigt erfarenhet inom det. Det är även meriterande om du har vana av Cisco, Fortinet, Mikrotik, VyOS eller JunOS.\nVi har en komplex och segmenterad miljö hos oss med varierande behov av säkerhets- och tillgänglighetskrav och därför hoppas på att du är en lösningsorienterad och nyfiken person med ett högt säkerhetstänk.  \n\nVi söker som vill arbeta inom en samhällsviktig bransch där hållbarhet och långsiktighet är högt på agendan. Oavsett om du är nyexaminerad och på jakt efter ditt första jobb, eller har lång erfarenhet med dig, så är vi nyfikna på dig om du tycker detta låter intressant. Hos oss finns många kunniga och hjälpsamma kollegor som ser fram emot att både dela med sig och få ta del av dina idéer och synsätt.\n\nChristian Wickman, chef för Teknisk Kommunikation, har ett inkluderande och öppet ledarskap och kommer tillsammans med teamet stötta dig för att du ska trivas hos oss Christian har stor tillit till sina medarbetare och uppmuntrar till ett öppet och vänligt klimat där alla frågor är välkomna. \n\nVälkommen att söka och var med oss på vägen mot ett hållbart samhälle! Sista ansökningsdatum är den 22:e augusti.\n\nTjänsterna är säkerhetsklassade vilket innebär att en säkerhetsprövning kommer att genomföras innan anställning. \n\nFör frågor om tjänsten, vänligen kontakta rekryterande chef \nChristian Wickman +46 703 244386\n\nFör fackliga frågor, vänligen kontakta: \nPer Carlsson, Unionen, +46 070 603  54 25 \nMichael Andersson, Ledarna, +46 705 250129 \nMats Lundberg, SEKO, +46 730 499778"
}