{
  "meta" : {
    "jobad" : {
      "description" : {
        "requirements" : null,
        "needs" : null,
        "company_information" : null,
        "text_formatted" : "<p>Orminge Salongen har funnits i över 40 år och har ett mycket bra kundunderlag. Vår kundkrets är stor i blandade åldrar och vi arbetar med allt inom hårvård. Vi utför professionellt frisörjobb med bra kundservice för att nå vår mål med 100% nöjda kunder.</p><p><br></p><p>Salongen ligger i Orminge Centrum, 15 min från Slussen. I centrum finns många små och stora butiker, både privata och från de stora kedjorna. Det är väldigt bra kommunikationer med bussar och det finns gott om parkeringsplatser.</p><p><br></p><p>Du ska vara en kunnig frisör som arbetat inom yrket i minst 1 år efter utbildning och behärskar allt inom yrket. Om du är obehörig frisör vill vi att du har minst 3 års arbetserfarenhet och har en svensk frisörutbildning som grund. Du ska även vara serviceinriktad, kreativ och trivas med att arbeta och samarbeta med dina kollegor för att skapa en trivsam arbetsmiljö och vara lojal mot din arbetsplats. Vi på Orminge Salongen söker en duktig och trevlig frisör för anställning enligt kollektivavtalet.</p><p><br></p><p>#jobbjustnu</p>",
        "conditions" : null,
        "text" : "Orminge Salongen har funnits i över 40 år och har ett mycket bra kundunderlag. Vår kundkrets är stor i blandade åldrar och vi arbetar med allt inom hårvård. Vi utför professionellt frisörjobb med bra kundservice för att nå vår mål med 100% nöjda kunder.\n\n\nSalongen ligger i Orminge Centrum, 15 min från Slussen. I centrum finns många små och stora butiker, både privata och från de stora kedjorna. Det är väldigt bra kommunikationer med bussar och det finns gott om parkeringsplatser.\n\n\nDu ska vara en kunnig frisör som arbetat inom yrket i minst 1 år efter utbildning och behärskar allt inom yrket. Om du är obehörig frisör vill vi att du har minst 3 års arbetserfarenhet och har en svensk frisörutbildning som grund. Du ska även vara serviceinriktad, kreativ och trivas med att arbeta och samarbeta med dina kollegor för att skapa en trivsam arbetsmiljö och vara lojal mot din arbetsplats. Vi på Orminge Salongen söker en duktig och trevlig frisör för anställning enligt kollektivavtalet.\n\n\n#jobbjustnu"
      },
      "headline" : "Heltid på salong med kollektivavtal #jobbajustnu",
      "driving_license" : null,
      "employer" : {
        "email" : null,
        "phone_number" : null,
        "organization_number" : null,
        "name" : "Mahi's Hårdesign",
        "url" : "http://www.ormingesalongen.se",
        "workplace" : "Mahi's Hårdesign"
      },
      "removed_date" : null,
      "logo_url" : null,
      "last_publication_date" : "2022-08-12T23:59:59",
      "number_of_vacancies" : 1,
      "occupation" : {
        "concept_id" : "tuoE_9Nj_fAS",
        "label" : "Frisör",
        "legacy_ams_taxonomy_id" : "5491"
      },
      "occupation_group" : {
        "concept_id" : "LyBp_bY6_bZK",
        "label" : "Frisörer",
        "legacy_ams_taxonomy_id" : "5141"
      },
      "employment_type" : {
        "concept_id" : "PFZr_Syz_cUq",
        "label" : "Vanlig anställning",
        "legacy_ams_taxonomy_id" : "1"
      },
      "webpage_url" : "https://arbetsformedlingen.se/platsbanken/annonser/26322444",
      "driving_license_required" : false,
      "application_contacts" : [ {
        "description" : null,
        "email" : "info@ormingesalongen.se",
        "telephone" : "0735308889",
        "name" : "Maria Gerogan",
        "contact_type" : null
      } ],
      "duration" : {
        "concept_id" : "qQUd_4qe_NDT",
        "label" : "6 månader eller längre",
        "legacy_ams_taxonomy_id" : "2"
      },
      "nice_to_have" : {
        "education_level" : [ ],
        "work_experiences" : [ ],
        "skills" : [ ],
        "education" : [ ],
        "languages" : [ ]
      },
      "application_details" : {
        "via_af" : false,
        "email" : "info@ormingesalongen.se",
        "other" : null,
        "reference" : "Frisör",
        "url" : null,
        "information" : null
      },
      "source_type" : "VIA_ANNONSERA",
      "application_deadline" : "2022-08-12T23:59:59",
      "external_id" : null,
      "workplace_address" : {
        "coordinates" : [ 18.256545465515863, 59.326468880459366 ],
        "city" : "Saltsjö-Boo",
        "postcode" : "13230",
        "municipality" : "Nacka",
        "region_concept_id" : "CifL_Rzy_Mku",
        "region" : "Stockholms län",
        "country_code" : "199",
        "region_code" : "01",
        "municipality_concept_id" : "aYA7_PpG_BqP",
        "country_concept_id" : "i46j_HmG_v64",
        "municipality_code" : "0182",
        "street_address" : "Orminge Salongen, Orminge Centrum",
        "country" : "Sverige"
      },
      "id" : "26322444",
      "experience_required" : true,
      "working_hours_type" : {
        "concept_id" : "6YE1_gAC_R2G",
        "label" : "Heltid",
        "legacy_ams_taxonomy_id" : "1"
      },
      "access" : null,
      "timestamp" : 1657698970279,
      "must_have" : {
        "education_level" : [ ],
        "work_experiences" : [ {
          "concept_id" : "tuoE_9Nj_fAS",
          "weight" : 10,
          "label" : "Frisör",
          "legacy_ams_taxonomy_id" : "5491"
        } ],
        "skills" : [ {
          "concept_id" : "YcrR_5QB_3XL",
          "weight" : 10,
          "label" : "Gesällbrev, frisör",
          "legacy_ams_taxonomy_id" : "601067"
        } ],
        "education" : [ ],
        "languages" : [ {
          "concept_id" : "zSLA_vw2_FXN",
          "weight" : 10,
          "label" : "Svenska",
          "legacy_ams_taxonomy_id" : "502"
        } ]
      },
      "occupation_field" : {
        "concept_id" : "Uuf1_GMh_Uvw",
        "label" : "Kropps- och skönhetsvård",
        "legacy_ams_taxonomy_id" : "4"
      },
      "scope_of_work" : {
        "min" : 0,
        "max" : 100
      },
      "salary_type" : {
        "concept_id" : "asrX_9Df_ukn",
        "label" : "Fast och rörlig lön",
        "legacy_ams_taxonomy_id" : "7"
      },
      "removed" : false,
      "salary_description" : null,
      "access_to_own_car" : false,
      "publication_date" : "2022-07-13T09:56:10"
    },
    "name" : "Heltid på salong med kollektivavtal #jobbajustnu",
    "user" : "kristof.fischer"
  },
  "sha1" : "4f7fef8c6a4079c49e06c6fddf72b5d2a7f66d33",
  "annotations" : [ {
    "preferred-label" : "Heltid",
    "type" : "worktime-extent",
    "start-position" : 0,
    "end-position" : 6,
    "concept-id" : "6YE1_gAC_R2G",
    "matched-string" : "Heltid",
    "annotation-id" : 8
  }, {
    "preferred-label" : "Frisör",
    "sentiment" : "MUST_HAVE",
    "type" : "occupation-name",
    "start-position" : 558,
    "end-position" : 564,
    "concept-id" : "tuoE_9Nj_fAS",
    "matched-string" : "frisör",
    "annotation-id" : 3
  }, {
    "preferred-label" : "1-2 års erfarenhet",
    "sentiment" : "MUST_HAVE",
    "type" : "occupation-experience-year",
    "start-position" : 590,
    "end-position" : 600,
    "concept-id" : "LLnd_5GJ_4ju",
    "matched-string" : "minst 1 år",
    "annotation-id" : 9
  }, {
    "preferred-label" : "Frisör",
    "sentiment" : "MUST_HAVE",
    "type" : "occupation-name",
    "start-position" : 667,
    "end-position" : 673,
    "concept-id" : "tuoE_9Nj_fAS",
    "matched-string" : "frisör",
    "annotation-id" : 4
  }, {
    "preferred-label" : "2-4 års erfarenhet",
    "sentiment" : "MUST_HAVE",
    "type" : "occupation-experience-year",
    "start-position" : 693,
    "end-position" : 721,
    "concept-id" : "RWA2_uu6_udD",
    "matched-string" : "minst 3 års arbetserfarenhet",
    "annotation-id" : 10
  }, {
    "preferred-label" : "Frisörutbildning",
    "sentiment" : "MUST_HAVE",
    "type" : "keyword",
    "start-position" : 740,
    "end-position" : 756,
    "concept-id" : "GHMC_yJq_RLu",
    "matched-string" : "frisörutbildning",
    "annotation-id" : 5
  }, {
    "preferred-label" : "samarbeta med kolleger",
    "sentiment" : "MUST_HAVE",
    "type" : "esco-skill",
    "start-position" : 840,
    "end-position" : 867,
    "concept-id" : "X15R_797_q62",
    "matched-string" : "samarbeta med dina kollegor",
    "annotation-id" : 11
  }, {
    "preferred-label" : "Frisör",
    "sentiment" : "MUST_HAVE",
    "type" : "occupation-name",
    "start-position" : 992,
    "end-position" : 998,
    "concept-id" : "tuoE_9Nj_fAS",
    "matched-string" : "frisör",
    "annotation-id" : 7
  } ],
  "text" : "Heltid på salong med kollektivavtal #jobbajustnu\nOrminge Salongen har funnits i över 40 år och har ett mycket bra kundunderlag. Vår kundkrets är stor i blandade åldrar och vi arbetar med allt inom hårvård. Vi utför professionellt frisörjobb med bra kundservice för att nå vår mål med 100% nöjda kunder.\n\n\nSalongen ligger i Orminge Centrum, 15 min från Slussen. I centrum finns många små och stora butiker, både privata och från de stora kedjorna. Det är väldigt bra kommunikationer med bussar och det finns gott om parkeringsplatser.\n\n\nDu ska vara en kunnig frisör som arbetat inom yrket i minst 1 år efter utbildning och behärskar allt inom yrket. Om du är obehörig frisör vill vi att du har minst 3 års arbetserfarenhet och har en svensk frisörutbildning som grund. Du ska även vara serviceinriktad, kreativ och trivas med att arbeta och samarbeta med dina kollegor för att skapa en trivsam arbetsmiljö och vara lojal mot din arbetsplats. Vi på Orminge Salongen söker en duktig och trevlig frisör för anställning enligt kollektivavtalet.\n\n\n#jobbjustnu"
}