{
  "meta" : {
    "jobad" : {
      "description" : {
        "requirements" : null,
        "needs" : null,
        "company_information" : null,
        "text_formatted" : "<p>Vi söker nu en industrielektriker med elsäkerhetsansvar till våra produktionsenheter. Som industrielektriker hos oss utgör du en viktig länk i det löpande och proaktiva arbetet med att säkerställa tillgängligheten på produktionsenheterna.</p><p>Arbetsuppgifter</p><p>I rollen arbetar du främst med att:</p><ul><li>Upprätthålla elsäkerhetsansvaret på våra produktionsanläggningar</li><li>Felsöka, installera, ge service och underhåll på våra produktionsanläggningar</li><li>Samarbeta med våra tekniker, ingenjörer och externa leverantörer för att förstå, lösa problem och kommunicera kommande och genomförda förbättringar.</li><li>Planera, bereda och genomföra samt dokumentera dina arbeten.</li><li>Bidra med tekniska kunskaper vid inköp av elteknisk utrustning.</li><li>Ha kontakt med externa leverantörer för att säkerställa tillgängligheten på anläggningarna</li><li>Utbilda andra i underhållsspecifika uppgifter inom ditt teknikområde</li></ul><p>Beredskap kan komma att ingå i tjänsten.</p><p><strong>Din profil</strong></p><p>Vi söker dig med en fullgjord gymnasial utbildning inom el/energi/automation eller liknande och minst någon form av praktisk erfarenhet som industrielektriker, serviceelektriker eller motsvarande. Vidare har du förmågan att läsa ritningar och utföra ändringar i elscheman. Det är meriterande om du är auktoriserad elinstallatör och van att arbeta självständigt.</p><p>Som person är du nyfiken, noggrann och driven samt har förmågan att arbeta systematiskt. Du har ett genuint intresse för industrin och att arbeta lösningsorienterat. Självklart är du allmänt tekniskt lagd och en god lagkamrat.</p><p><br></p><p>Du har goda kunskaper i svenska i tal och skrift samt vana i MS Office. Körkort minst klass B är ett krav.</p><p>Ditt erbjudande</p><p>Du blir del i en liten härlig arbetsgrupp på 6 medarbetare och en chef. Du tillhör också en mellanstor organisation om 135 anställda med tryggheten med kommunen i ryggen. Arbetet är fritt under ansvar och du kommer ha stora möjligheter att påverka din vardag mot givna, uppsatta mål. Vi erbjuder motionstimme, friskvårdsbidrag och gemensamma arbetsplatsträffar flera gånger under året. </p><p><strong>Är du intresserad?</strong></p><p>Sista ansökningsdatumet är 7 augusti. Ansökan sker genom att du fyller i webbformuläret nedan!</p><p>Tjänsten är en tillsvidaretjänst på heltid placerad i Örnsköldsvik.</p><p><strong>Kontaktuppgifter:</strong></p><ul><li> <strong>Urban Näslin </strong>Chef                         produktionsunderhåll 070- 692 29 36</li><li>Helen Eriksson, personalutvecklare  072-542 89 04</li></ul><p><strong>Fackliga kontakter</strong></p><ul><li>Vision: Anna Sjölander 073-274 14 26</li><li>Ledarna: Stefan Fällström 070-680 34 46</li><li>Seko: Tapani Pohjola 070-347 50 85</li></ul>",
        "conditions" : null,
        "text" : "Vi söker nu en industrielektriker med elsäkerhetsansvar till våra produktionsenheter. Som industrielektriker hos oss utgör du en viktig länk i det löpande och proaktiva arbetet med att säkerställa tillgängligheten på produktionsenheterna.\nArbetsuppgifter\nI rollen arbetar du främst med att:\nUpprätthålla elsäkerhetsansvaret på våra produktionsanläggningar\nFelsöka, installera, ge service och underhåll på våra produktionsanläggningar\nSamarbeta med våra tekniker, ingenjörer och externa leverantörer för att förstå, lösa problem och kommunicera kommande och genomförda förbättringar.\nPlanera, bereda och genomföra samt dokumentera dina arbeten.\nBidra med tekniska kunskaper vid inköp av elteknisk utrustning.\nHa kontakt med externa leverantörer för att säkerställa tillgängligheten på anläggningarna\nUtbilda andra i underhållsspecifika uppgifter inom ditt teknikområde\n\nBeredskap kan komma att ingå i tjänsten.\nDin profil\nVi söker dig med en fullgjord gymnasial utbildning inom el/energi/automation eller liknande och minst någon form av praktisk erfarenhet som industrielektriker, serviceelektriker eller motsvarande. Vidare har du förmågan att läsa ritningar och utföra ändringar i elscheman. Det är meriterande om du är auktoriserad elinstallatör och van att arbeta självständigt.\nSom person är du nyfiken, noggrann och driven samt har förmågan att arbeta systematiskt. Du har ett genuint intresse för industrin och att arbeta lösningsorienterat. Självklart är du allmänt tekniskt lagd och en god lagkamrat.\n\n\nDu har goda kunskaper i svenska i tal och skrift samt vana i MS Office. Körkort minst klass B är ett krav.\nDitt erbjudande\nDu blir del i en liten härlig arbetsgrupp på 6 medarbetare och en chef. Du tillhör också en mellanstor organisation om 135 anställda med tryggheten med kommunen i ryggen. Arbetet är fritt under ansvar och du kommer ha stora möjligheter att påverka din vardag mot givna, uppsatta mål. Vi erbjuder motionstimme, friskvårdsbidrag och gemensamma arbetsplatsträffar flera gånger under året. \nÄr du intresserad?\nSista ansökningsdatumet är 7 augusti. Ansökan sker genom att du fyller i webbformuläret nedan!\nTjänsten är en tillsvidaretjänst på heltid placerad i Örnsköldsvik.\nKontaktuppgifter:\n Urban Näslin Chef                         produktionsunderhåll 070- 692 29 36\nHelen Eriksson, personalutvecklare  072-542 89 04\n\nFackliga kontakter\nVision: Anna Sjölander 073-274 14 26\nLedarna: Stefan Fällström 070-680 34 46\nSeko: Tapani Pohjola 070-347 50 85"
      },
      "headline" : "Industrielektriker",
      "driving_license" : null,
      "employer" : {
        "email" : null,
        "phone_number" : null,
        "organization_number" : "5560191750",
        "name" : "Övik Energi AB",
        "url" : null,
        "workplace" : "Övik Energi AB"
      },
      "removed_date" : null,
      "logo_url" : "https://www.arbetsformedlingen.se/rest/arbetsgivare/rest/af/v3/arbetsplatser/86569517/logotyper/logo.png",
      "last_publication_date" : "2022-08-07T23:59:59",
      "number_of_vacancies" : 1,
      "occupation" : {
        "concept_id" : "uZU6_oxo_Dpd",
        "label" : "Industrielektriker",
        "legacy_ams_taxonomy_id" : "5607"
      },
      "occupation_group" : {
        "concept_id" : "a75S_eLg_JWH",
        "label" : "Industrielektriker",
        "legacy_ams_taxonomy_id" : "7412"
      },
      "employment_type" : {
        "concept_id" : "PFZr_Syz_cUq",
        "label" : "Vanlig anställning",
        "legacy_ams_taxonomy_id" : "1"
      },
      "webpage_url" : "https://arbetsformedlingen.se/platsbanken/annonser/26287317",
      "driving_license_required" : false,
      "application_contacts" : [ ],
      "duration" : {
        "concept_id" : "a7uU_j21_mkL",
        "label" : "Tills vidare",
        "legacy_ams_taxonomy_id" : "1"
      },
      "nice_to_have" : {
        "education_level" : [ {
          "concept_id" : "DeBt_ahh_bkx",
          "weight" : 5,
          "label" : "Gymnasial utbildning",
          "legacy_ams_taxonomy_id" : "4"
        } ],
        "work_experiences" : [ {
          "concept_id" : "uZU6_oxo_Dpd",
          "weight" : 5,
          "label" : "Industrielektriker",
          "legacy_ams_taxonomy_id" : "5607"
        } ],
        "skills" : [ ],
        "education" : [ {
          "concept_id" : "WFCz_teU_KFf",
          "weight" : 5,
          "label" : "Teknik och teknisk industri",
          "legacy_ams_taxonomy_id" : "15"
        } ],
        "languages" : [ ]
      },
      "application_details" : {
        "via_af" : false,
        "email" : null,
        "other" : null,
        "reference" : "Industrielektriker",
        "url" : "http://ovikenergi.se/jobba-hos-oss",
        "information" : null
      },
      "source_type" : "VIA_ANNONSERA",
      "application_deadline" : "2022-08-07T23:59:59",
      "external_id" : null,
      "workplace_address" : {
        "coordinates" : [ 18.707888034328047, 63.273326934417206 ],
        "city" : "Domsjö",
        "postcode" : "89250",
        "municipality" : "Örnsköldsvik",
        "region_concept_id" : "NvUF_SP1_1zo",
        "region" : "Västernorrlands län",
        "country_code" : "199",
        "region_code" : "22",
        "municipality_concept_id" : "zBmE_n6s_MnQ",
        "country_concept_id" : "i46j_HmG_v64",
        "municipality_code" : "2284",
        "street_address" : "Hörneborgsvägen 7",
        "country" : "Sverige"
      },
      "id" : "26287317",
      "experience_required" : true,
      "working_hours_type" : {
        "concept_id" : "6YE1_gAC_R2G",
        "label" : "Heltid",
        "legacy_ams_taxonomy_id" : "1"
      },
      "access" : null,
      "timestamp" : 1656915415808,
      "must_have" : {
        "education_level" : [ ],
        "work_experiences" : [ ],
        "skills" : [ {
          "concept_id" : "wJuu_o2B_q7L",
          "weight" : 10,
          "label" : "Elektriker - industri",
          "legacy_ams_taxonomy_id" : "607734"
        } ],
        "education" : [ ],
        "languages" : [ ]
      },
      "occupation_field" : {
        "concept_id" : "yhCP_AqT_tns",
        "label" : "Installation, drift, underhåll",
        "legacy_ams_taxonomy_id" : "10"
      },
      "scope_of_work" : {
        "min" : 0,
        "max" : 100
      },
      "salary_type" : {
        "concept_id" : "oG8G_9cW_nRf",
        "label" : "Fast månads- vecko- eller timlön",
        "legacy_ams_taxonomy_id" : "1"
      },
      "removed" : false,
      "salary_description" : null,
      "access_to_own_car" : false,
      "publication_date" : "2022-07-04T08:15:15"
    },
    "name" : "Industrielektriker",
    "reviewer" : "norda",
    "user" : "kristof.fischer"
  },
  "sha1" : "00387de8b686f4fdd4d67be7bcd849c5f114e94e",
  "annotations" : [ {
    "preferred-label" : "Industrielektriker",
    "sentiment" : "OFFERED",
    "type" : "occupation-name",
    "start-position" : 0,
    "end-position" : 18,
    "concept-id" : "uZU6_oxo_Dpd",
    "matched-string" : "industrielektriker",
    "annotation-id" : 0
  }, {
    "preferred-label" : "Industrielektriker",
    "sentiment" : "OFFERED",
    "type" : "occupation-name",
    "start-position" : 34,
    "end-position" : 52,
    "concept-id" : "uZU6_oxo_Dpd",
    "matched-string" : "industrielektriker",
    "annotation-id" : 1
  }, {
    "preferred-label" : "Industrielektriker",
    "sentiment" : "OFFERED",
    "type" : "occupation-name",
    "start-position" : 109,
    "end-position" : 127,
    "concept-id" : "uZU6_oxo_Dpd",
    "matched-string" : "industrielektriker",
    "annotation-id" : 2
  }, {
    "preferred-label" : null,
    "sentiment" : "OFFERED",
    "type" : "skill",
    "start-position" : 204,
    "comment" : "Inte nödvändigtvis en kompetens, men sparas som sådan i brist på annat.",
    "end-position" : 256,
    "concept-id" : null,
    "matched-string" : "säkerställa tillgängligheten på produktionsenheterna",
    "annotation-id" : 27
  }, {
    "preferred-label" : "Elsäkerhetsverkets föreskrifter",
    "sentiment" : "OFFERED",
    "type" : "skill",
    "start-position" : 310,
    "end-position" : 342,
    "concept-id" : "FqWP_6FQ_Wz5",
    "matched-string" : "Upprätthålla elsäkerhetsansvaret",
    "annotation-id" : 11
  }, {
    "preferred-label" : "Drift och underhåll av elanläggningar",
    "sentiment" : "OFFERED",
    "type" : "skill",
    "start-position" : 375,
    "end-position" : 420,
    "concept-id" : "caWZ_HUm_yNp",
    "matched-string" : "Felsöka, installera, ge service och underhåll",
    "annotation-id" : 12
  }, {
    "preferred-label" : "samarbeta med kolleger",
    "sentiment" : "OFFERED",
    "type" : "esco-skill",
    "start-position" : 453,
    "end-position" : 462,
    "concept-id" : "X15R_797_q62",
    "matched-string" : "Samarbeta",
    "annotation-id" : 13
  }, {
    "preferred-label" : "lösa tekniska problem",
    "sentiment" : "OFFERED",
    "type" : "esco-skill",
    "start-position" : 534,
    "end-position" : 546,
    "concept-id" : "TQmP_PWA_GGu",
    "matched-string" : "lösa problem",
    "annotation-id" : 14
  }, {
    "preferred-label" : "kommunikation",
    "sentiment" : "OFFERED",
    "type" : "esco-skill",
    "start-position" : 551,
    "end-position" : 562,
    "concept-id" : "ahPU_HgE_Jeb",
    "matched-string" : "kommunicera",
    "annotation-id" : 15
  }, {
    "preferred-label" : "Dokumentation",
    "sentiment" : "OFFERED",
    "type" : "skill",
    "start-position" : 637,
    "end-position" : 648,
    "concept-id" : "GWNh_Qjt_vK8",
    "matched-string" : "dokumentera",
    "annotation-id" : 28
  }, {
    "preferred-label" : "Inköp inom bygg",
    "sentiment" : "OFFERED",
    "type" : "skill",
    "start-position" : 696,
    "end-position" : 701,
    "concept-id" : "QB7Z_7mE_fx2",
    "matched-string" : "inköp",
    "annotation-id" : 29
  }, {
    "preferred-label" : "Gymnasial utbildning",
    "sentiment" : "MUST_HAVE",
    "type" : "sun-education-level-1",
    "start-position" : 970,
    "end-position" : 990,
    "concept-id" : "wyLL_K3a_HRC",
    "matched-string" : "gymnasial utbildning",
    "annotation-id" : 3
  }, {
    "preferred-label" : "Elektrisk installation och elmekanik",
    "sentiment" : "MUST_HAVE",
    "type" : "sun-education-field-4",
    "start-position" : 996,
    "end-position" : 998,
    "concept-id" : "nho3_Hf1_MFo",
    "matched-string" : "el",
    "annotation-id" : 17
  }, {
    "preferred-label" : "Energi- och elektroteknik",
    "sentiment" : "MUST_HAVE",
    "type" : "sun-education-field-3",
    "start-position" : 999,
    "end-position" : 1005,
    "concept-id" : "wuXX_ZG5_31i",
    "matched-string" : "energi",
    "annotation-id" : 16
  }, {
    "preferred-label" : "Automation",
    "sentiment" : "MUST_HAVE",
    "type" : "sun-education-field-4",
    "start-position" : 1006,
    "end-position" : 1016,
    "concept-id" : "tDxT_7oT_NyU",
    "matched-string" : "automation",
    "annotation-id" : 4
  }, {
    "preferred-label" : "Industrielektriker",
    "sentiment" : "MUST_HAVE",
    "type" : "occupation-name",
    "start-position" : 1080,
    "end-position" : 1098,
    "concept-id" : "uZU6_oxo_Dpd",
    "matched-string" : "industrielektriker",
    "annotation-id" : 5
  }, {
    "preferred-label" : "Installations- och serviceelektriker",
    "sentiment" : "MUST_HAVE",
    "type" : "ssyk-level-4",
    "start-position" : 1100,
    "end-position" : 1117,
    "concept-id" : "yyF7_jsW_EeP",
    "matched-string" : "serviceelektriker",
    "annotation-id" : 6
  }, {
    "preferred-label" : "Ritningsläsning",
    "sentiment" : "MUST_HAVE",
    "type" : "skill",
    "start-position" : 1164,
    "end-position" : 1178,
    "concept-id" : "aHCV_VsV_LiD",
    "matched-string" : "läsa ritningar",
    "annotation-id" : 18
  }, {
    "preferred-label" : "elscheman",
    "sentiment" : "MUST_HAVE",
    "type" : "esco-skill",
    "start-position" : 1202,
    "end-position" : 1211,
    "concept-id" : "RHj8_SEc_nez",
    "matched-string" : "elscheman",
    "annotation-id" : 19
  }, {
    "preferred-label" : "Elinstallationer",
    "sentiment" : "NICE_TO_HAVE",
    "type" : "sni-level-4",
    "start-position" : 1254,
    "end-position" : 1267,
    "concept-id" : "5Cty_GV5_HCT",
    "matched-string" : "elinstallatör",
    "annotation-id" : 20
  }, {
    "preferred-label" : "arbeta självständigt",
    "sentiment" : "NICE_TO_HAVE",
    "type" : "esco-skill",
    "start-position" : 1280,
    "end-position" : 1300,
    "concept-id" : "NyFu_HHd_zhz",
    "matched-string" : "arbeta självständigt",
    "annotation-id" : 21
  }, {
    "preferred-label" : "noggrannhet",
    "sentiment" : "MUST_HAVE",
    "type" : "esco-skill",
    "start-position" : 1328,
    "end-position" : 1336,
    "concept-id" : "mrsW_EkL_KRD",
    "matched-string" : "noggrann",
    "annotation-id" : 22
  }, {
    "preferred-label" : "Svenska",
    "sentiment" : "MUST_HAVE",
    "type" : "language",
    "start-position" : 1555,
    "end-position" : 1562,
    "concept-id" : "zSLA_vw2_FXN",
    "matched-string" : "svenska",
    "annotation-id" : 8
  }, {
    "preferred-label" : "MS Office",
    "sentiment" : "MUST_HAVE",
    "type" : "skill",
    "start-position" : 1592,
    "end-position" : 1601,
    "concept-id" : "w8bU_wHe_omF",
    "matched-string" : "ms office",
    "annotation-id" : 9
  }, {
    "preferred-label" : "B",
    "sentiment" : "MUST_HAVE",
    "type" : "driving-licence",
    "start-position" : 1603,
    "end-position" : 1610,
    "concept-id" : "VTK8_WRx_GcM",
    "matched-string" : "Körkort",
    "annotation-id" : 23
  }, {
    "preferred-label" : "Tillsvidareanställning (inkl. eventuell provanställning)",
    "sentiment" : "NICE_TO_HAVE",
    "type" : "employment-type",
    "start-position" : 2170,
    "end-position" : 2187,
    "concept-id" : "kpPX_CNN_gDU",
    "matched-string" : "tillsvidaretjänst",
    "annotation-id" : 24
  }, {
    "preferred-label" : "Heltid",
    "type" : "worktime-extent",
    "start-position" : 2191,
    "end-position" : 2197,
    "concept-id" : "6YE1_gAC_R2G",
    "matched-string" : "heltid",
    "annotation-id" : 25
  }, {
    "preferred-label" : "Örnsköldsvik",
    "type" : "municipality",
    "start-position" : 2209,
    "end-position" : 2221,
    "concept-id" : "zBmE_n6s_MnQ",
    "matched-string" : "Örnsköldsvik",
    "annotation-id" : 26
  } ],
  "text" : "Industrielektriker\nVi söker nu en industrielektriker med elsäkerhetsansvar till våra produktionsenheter. Som industrielektriker hos oss utgör du en viktig länk i det löpande och proaktiva arbetet med att säkerställa tillgängligheten på produktionsenheterna.\nArbetsuppgifter\nI rollen arbetar du främst med att:\nUpprätthålla elsäkerhetsansvaret på våra produktionsanläggningar\nFelsöka, installera, ge service och underhåll på våra produktionsanläggningar\nSamarbeta med våra tekniker, ingenjörer och externa leverantörer för att förstå, lösa problem och kommunicera kommande och genomförda förbättringar.\nPlanera, bereda och genomföra samt dokumentera dina arbeten.\nBidra med tekniska kunskaper vid inköp av elteknisk utrustning.\nHa kontakt med externa leverantörer för att säkerställa tillgängligheten på anläggningarna\nUtbilda andra i underhållsspecifika uppgifter inom ditt teknikområde\n\nBeredskap kan komma att ingå i tjänsten.\nDin profil\nVi söker dig med en fullgjord gymnasial utbildning inom el/energi/automation eller liknande och minst någon form av praktisk erfarenhet som industrielektriker, serviceelektriker eller motsvarande. Vidare har du förmågan att läsa ritningar och utföra ändringar i elscheman. Det är meriterande om du är auktoriserad elinstallatör och van att arbeta självständigt.\nSom person är du nyfiken, noggrann och driven samt har förmågan att arbeta systematiskt. Du har ett genuint intresse för industrin och att arbeta lösningsorienterat. Självklart är du allmänt tekniskt lagd och en god lagkamrat.\n\n\nDu har goda kunskaper i svenska i tal och skrift samt vana i MS Office. Körkort minst klass B är ett krav.\nDitt erbjudande\nDu blir del i en liten härlig arbetsgrupp på 6 medarbetare och en chef. Du tillhör också en mellanstor organisation om 135 anställda med tryggheten med kommunen i ryggen. Arbetet är fritt under ansvar och du kommer ha stora möjligheter att påverka din vardag mot givna, uppsatta mål. Vi erbjuder motionstimme, friskvårdsbidrag och gemensamma arbetsplatsträffar flera gånger under året. \nÄr du intresserad?\nSista ansökningsdatumet är 7 augusti. Ansökan sker genom att du fyller i webbformuläret nedan!\nTjänsten är en tillsvidaretjänst på heltid placerad i Örnsköldsvik.\nKontaktuppgifter:\n Urban Näslin Chef                         produktionsunderhåll 070- 692 29 36\nHelen Eriksson, personalutvecklare  072-542 89 04\n\nFackliga kontakter\nVision: Anna Sjölander 073-274 14 26\nLedarna: Stefan Fällström 070-680 34 46\nSeko: Tapani Pohjola 070-347 50 85"
}