{
  "meta" : {
    "jobad" : {
      "description" : {
        "requirements" : null,
        "needs" : null,
        "company_information" : null,
        "text_formatted" : "<p>ChopChop Asian Express är Europas första asiatiska DriveThru restaurang.</p><p>Vårt mål är att ha nöjda kunder där vi serverar god asiatisk mat med högkvalitativa råvaror. Vi ska vara ett alternativ till de traditionella snabbmatsrestaurangerna.</p><p><em>Vi söker nu kockar.</em></p><p><em>Dina huvudsakliga arbetsuppgifter kommer att bestå avatt bereda och tillaga asiatiska maträtter. Även renhållning av köket ingår i arbetsuppgifterna.</em></p><p>Vi ser dig som söker har:</p><p><em>En god samarbetsförmåga, vi på ChopChop sätter stor vikt på laganda och teamwork. Rätt inställning, vi ser denna egenskap som det absolut viktigaste, med det rätta engagemanget och viljan att ta för sig i arbetet kan man komma långt på en arbetsplats oavsett vad man kan och inte kan.</em></p><p>Tidigare erfarenhet inom restaurangbranschen inom wok är krav.</p>",
        "conditions" : null,
        "text" : "ChopChop Asian Express är Europas första asiatiska DriveThru restaurang.\nVårt mål är att ha nöjda kunder där vi serverar god asiatisk mat med högkvalitativa råvaror. Vi ska vara ett alternativ till de traditionella snabbmatsrestaurangerna.\nVi söker nu kockar.\nDina huvudsakliga arbetsuppgifter kommer att bestå avatt bereda och tillaga asiatiska maträtter. Även renhållning av köket ingår i arbetsuppgifterna.\nVi ser dig som söker har:\nEn god samarbetsförmåga, vi på ChopChop sätter stor vikt på laganda och teamwork. Rätt inställning, vi ser denna egenskap som det absolut viktigaste, med det rätta engagemanget och viljan att ta för sig i arbetet kan man komma långt på en arbetsplats oavsett vad man kan och inte kan.\nTidigare erfarenhet inom restaurangbranschen inom wok är krav."
      },
      "headline" : "ChopChop 2 AB söker Wok Kock",
      "driving_license" : null,
      "employer" : {
        "email" : null,
        "phone_number" : null,
        "organization_number" : "5590089214",
        "name" : "ChopChop AB",
        "url" : "www.chopchop.se",
        "workplace" : "ChopChop 2 AB"
      },
      "removed_date" : null,
      "logo_url" : "https://www.arbetsformedlingen.se/rest/arbetsgivare/rest/af/v3/arbetsplatser/86015612/logotyper/logo.png",
      "last_publication_date" : "2022-09-08T23:59:59",
      "number_of_vacancies" : 3,
      "occupation" : {
        "concept_id" : "YKhj_n5P_g4P",
        "label" : "Specialkock",
        "legacy_ams_taxonomy_id" : "5483"
      },
      "occupation_group" : {
        "concept_id" : "BStc_SJh_DKG",
        "label" : "Kockar och kallskänkor",
        "legacy_ams_taxonomy_id" : "5120"
      },
      "employment_type" : {
        "concept_id" : "PFZr_Syz_cUq",
        "label" : "Vanlig anställning",
        "legacy_ams_taxonomy_id" : "1"
      },
      "webpage_url" : "https://arbetsformedlingen.se/platsbanken/annonser/26390461",
      "driving_license_required" : false,
      "application_contacts" : [ ],
      "duration" : {
        "concept_id" : "a7uU_j21_mkL",
        "label" : "Tills vidare",
        "legacy_ams_taxonomy_id" : "1"
      },
      "nice_to_have" : {
        "education_level" : [ ],
        "work_experiences" : [ ],
        "skills" : [ ],
        "education" : [ ],
        "languages" : [ ]
      },
      "application_details" : {
        "via_af" : false,
        "email" : "Jobb@chopchop.se",
        "other" : null,
        "reference" : "Wok Kock",
        "url" : null,
        "information" : null
      },
      "source_type" : "VIA_ANNONSERA",
      "application_deadline" : "2022-09-08T23:59:59",
      "external_id" : null,
      "workplace_address" : {
        "coordinates" : [ 12.06061885027862, 57.47348884265761 ],
        "city" : "KUNGSBACKA",
        "postcode" : "43491",
        "municipality" : "Kungsbacka",
        "region_concept_id" : "wjee_qH2_yb6",
        "region" : "Hallands län",
        "country_code" : "199",
        "region_code" : "13",
        "municipality_concept_id" : "3JKV_KSK_x6z",
        "country_concept_id" : "i46j_HmG_v64",
        "municipality_code" : "1384",
        "street_address" : "Kollavarvsvägen 26",
        "country" : "Sverige"
      },
      "id" : "26390461",
      "experience_required" : true,
      "working_hours_type" : {
        "concept_id" : "6YE1_gAC_R2G",
        "label" : "Heltid",
        "legacy_ams_taxonomy_id" : "1"
      },
      "access" : null,
      "timestamp" : 1660034440290,
      "must_have" : {
        "education_level" : [ ],
        "work_experiences" : [ ],
        "skills" : [ ],
        "education" : [ ],
        "languages" : [ ]
      },
      "occupation_field" : {
        "concept_id" : "ScKy_FHB_7wT",
        "label" : "Hotell, restaurang, storhushåll",
        "legacy_ams_taxonomy_id" : "7"
      },
      "scope_of_work" : {
        "min" : 0,
        "max" : 100
      },
      "salary_type" : {
        "concept_id" : "oG8G_9cW_nRf",
        "label" : "Fast månads- vecko- eller timlön",
        "legacy_ams_taxonomy_id" : "1"
      },
      "removed" : false,
      "salary_description" : null,
      "access_to_own_car" : false,
      "publication_date" : "2022-08-09T10:40:40"
    },
    "name" : "ChopChop 2 AB söker Wok Kock",
    "user" : "hannes"
  },
  "sha1" : "d25a4d8439f1d0bf05efa1cc3b8e2612fd60fff3",
  "annotations" : [ {
    "preferred-label" : "kock",
    "sentiment" : "MUST_HAVE",
    "type" : "esco-occupation",
    "start-position" : 24,
    "end-position" : 28,
    "concept-id" : "Ti2H_QoQ_EMX",
    "matched-string" : "kock",
    "annotation-id" : 0
  }, {
    "preferred-label" : "Restaurang",
    "sentiment" : "MUST_HAVE",
    "type" : "keyword",
    "start-position" : 90,
    "end-position" : 100,
    "concept-id" : "o2Cg_3Ap_qvK",
    "matched-string" : "restaurang",
    "annotation-id" : 1
  }, {
    "preferred-label" : "Renhållning",
    "sentiment" : "MUST_HAVE",
    "type" : "keyword",
    "start-position" : 391,
    "end-position" : 402,
    "concept-id" : "1eVm_yZa_9yi",
    "matched-string" : "renhållning",
    "annotation-id" : 2
  }, {
    "preferred-label" : "Restaurang",
    "type" : "keyword",
    "start-position" : 775,
    "end-position" : 794,
    "concept-id" : "o2Cg_3Ap_qvK",
    "matched-string" : "restaurangbranschen",
    "annotation-id" : 3
  } ],
  "text" : "ChopChop 2 AB söker Wok Kock\nChopChop Asian Express är Europas första asiatiska DriveThru restaurang.\nVårt mål är att ha nöjda kunder där vi serverar god asiatisk mat med högkvalitativa råvaror. Vi ska vara ett alternativ till de traditionella snabbmatsrestaurangerna.\nVi söker nu kockar.\nDina huvudsakliga arbetsuppgifter kommer att bestå avatt bereda och tillaga asiatiska maträtter. Även renhållning av köket ingår i arbetsuppgifterna.\nVi ser dig som söker har:\nEn god samarbetsförmåga, vi på ChopChop sätter stor vikt på laganda och teamwork. Rätt inställning, vi ser denna egenskap som det absolut viktigaste, med det rätta engagemanget och viljan att ta för sig i arbetet kan man komma långt på en arbetsplats oavsett vad man kan och inte kan.\nTidigare erfarenhet inom restaurangbranschen inom wok är krav."
}