{
  "meta" : {
    "jobad" : {
      "description" : {
        "requirements" : null,
        "needs" : null,
        "company_information" : null,
        "text_formatted" : "<p>Nu söker vi fler medarbetare för heltid/deltid samt för extra vid behov.</p><p>Är du intresserad av och kunnig inom mat och dryck? Och vill leverera en minnesvärd upplevelse för våra gäster? Skicka in er ansökan till oss. </p><p>Vi söker dig som är kunnig, engagerad och en lagspelare, som har passion för service, mat och dryck.</p><p>Huvudsakliga arbetsuppgifter servering av a la carte och gruppmiddagar under lunch och middag. förberedelser och återställande utav restaurangen. Dryckeskunskap är meriterande.</p><p>Vi kan erbjuda en tillsvidareanställning eller deltidstjänst samt extra. Arbetstiderna är varierande, både i tid, dagar, kvällar och helger. Krav: körkort och svenska i tal och skrift.</p><p><strong>Är du intresserad?</strong> Tveka inte att höra av dig till oss! Skicka in din ansökan redan idag. Rekryteringsarbetet sker löpande under ansökningstiden.</p><p> Varmt välkommen med din ansökan!</p><p> #jobbjustnu</p>",
        "conditions" : null,
        "text" : "Nu söker vi fler medarbetare för heltid/deltid samt för extra vid behov.\nÄr du intresserad av och kunnig inom mat och dryck? Och vill leverera en minnesvärd upplevelse för våra gäster? Skicka in er ansökan till oss. \nVi söker dig som är kunnig, engagerad och en lagspelare, som har passion för service, mat och dryck.\nHuvudsakliga arbetsuppgifter servering av a la carte och gruppmiddagar under lunch och middag. förberedelser och återställande utav restaurangen. Dryckeskunskap är meriterande.\nVi kan erbjuda en tillsvidareanställning eller deltidstjänst samt extra. Arbetstiderna är varierande, både i tid, dagar, kvällar och helger. Krav: körkort och svenska i tal och skrift.\nÄr du intresserad? Tveka inte att höra av dig till oss! Skicka in din ansökan redan idag. Rekryteringsarbetet sker löpande under ansökningstiden.\n Varmt välkommen med din ansökan!\n #jobbjustnu"
      },
      "headline" : "Servitris/Servitör",
      "driving_license" : [ {
        "concept_id" : "VTK8_WRx_GcM",
        "label" : "B",
        "legacy_ams_taxonomy_id" : "3"
      } ],
      "employer" : {
        "email" : null,
        "phone_number" : null,
        "organization_number" : "5591878474",
        "name" : "TG Drift AB",
        "url" : "http://www.tallbergsgarden.se",
        "workplace" : "Tällbergsgårdens Hotell"
      },
      "removed_date" : null,
      "logo_url" : "https://www.arbetsformedlingen.se/rest/arbetsgivare/rest/af/v3/arbetsplatser/88086267/logotyper/logo.png",
      "last_publication_date" : "2022-10-31T23:59:59",
      "number_of_vacancies" : 2,
      "occupation" : {
        "concept_id" : "rGGf_KLs_To7",
        "label" : "Servitör/Servitris",
        "legacy_ams_taxonomy_id" : "5487"
      },
      "occupation_group" : {
        "concept_id" : "UjoW_meY_Zwt",
        "label" : "Hovmästare och servitörer",
        "legacy_ams_taxonomy_id" : "5131"
      },
      "employment_type" : {
        "concept_id" : "PFZr_Syz_cUq",
        "label" : "Vanlig anställning",
        "legacy_ams_taxonomy_id" : "1"
      },
      "webpage_url" : "https://arbetsformedlingen.se/platsbanken/annonser/26427727",
      "driving_license_required" : true,
      "application_contacts" : [ ],
      "duration" : {
        "concept_id" : "a7uU_j21_mkL",
        "label" : "Tills vidare",
        "legacy_ams_taxonomy_id" : "1"
      },
      "nice_to_have" : {
        "education_level" : [ ],
        "work_experiences" : [ {
          "concept_id" : "rGGf_KLs_To7",
          "weight" : 5,
          "label" : "Servitör/Servitris",
          "legacy_ams_taxonomy_id" : "5487"
        } ],
        "skills" : [ ],
        "education" : [ ],
        "languages" : [ {
          "concept_id" : "NVxJ_hLg_TYS",
          "weight" : 5,
          "label" : "Engelska",
          "legacy_ams_taxonomy_id" : "283"
        } ]
      },
      "application_details" : {
        "via_af" : false,
        "email" : "rekrytering@tallbergsgarden.se",
        "other" : null,
        "reference" : "Servitris eller Servitör",
        "url" : null,
        "information" : null
      },
      "source_type" : "VIA_ANNONSERA",
      "application_deadline" : "2022-10-31T23:59:59",
      "external_id" : null,
      "workplace_address" : {
        "coordinates" : [ 14.994302925176825, 60.8235266764623 ],
        "city" : "Tällberg",
        "postcode" : "79370",
        "municipality" : "Leksand",
        "region_concept_id" : "oDpK_oZ2_WYt",
        "region" : "Dalarnas län",
        "country_code" : "199",
        "region_code" : "20",
        "municipality_concept_id" : "7Zsu_ant_gcn",
        "country_concept_id" : "i46j_HmG_v64",
        "municipality_code" : "2029",
        "street_address" : "Holgattu 1",
        "country" : "Sverige"
      },
      "id" : "26427727",
      "experience_required" : true,
      "working_hours_type" : {
        "concept_id" : "947z_JGS_Uk2",
        "label" : "Deltid",
        "legacy_ams_taxonomy_id" : "2"
      },
      "access" : null,
      "timestamp" : 1660834240273,
      "must_have" : {
        "education_level" : [ ],
        "work_experiences" : [ ],
        "skills" : [ ],
        "education" : [ ],
        "languages" : [ {
          "concept_id" : "zSLA_vw2_FXN",
          "weight" : 10,
          "label" : "Svenska",
          "legacy_ams_taxonomy_id" : "502"
        } ]
      },
      "occupation_field" : {
        "concept_id" : "ScKy_FHB_7wT",
        "label" : "Hotell, restaurang, storhushåll",
        "legacy_ams_taxonomy_id" : "7"
      },
      "scope_of_work" : {
        "min" : 0,
        "max" : 100
      },
      "salary_type" : {
        "concept_id" : "oG8G_9cW_nRf",
        "label" : "Fast månads- vecko- eller timlön",
        "legacy_ams_taxonomy_id" : "1"
      },
      "removed" : false,
      "salary_description" : null,
      "access_to_own_car" : true,
      "publication_date" : "2022-08-18T16:50:40"
    },
    "name" : "Servitris/Servitör",
    "user" : "hannes"
  },
  "sha1" : "e0b651a529aae104064c248c00c49b30bc5b2cff",
  "annotations" : [ {
    "preferred-label" : "Servitör/Servitris",
    "sentiment" : "MUST_HAVE",
    "type" : "occupation-name",
    "start-position" : 0,
    "end-position" : 18,
    "concept-id" : "rGGf_KLs_To7",
    "matched-string" : "Servitris/Servitör",
    "annotation-id" : 4
  }, {
    "preferred-label" : "Heltid/Deltid",
    "sentiment" : "OFFERED",
    "type" : "worktime-extent",
    "start-position" : 52,
    "end-position" : 65,
    "concept-id" : "hGCt_6Ni_XPz",
    "matched-string" : "heltid/deltid",
    "annotation-id" : 5
  }, {
    "preferred-label" : "A la carte",
    "sentiment" : "NOT_RELEVANT",
    "type" : "skill",
    "start-position" : 379,
    "end-position" : 389,
    "concept-id" : "Bb4Q_Vou_pbq",
    "matched-string" : "a la carte",
    "annotation-id" : 2
  }, {
    "preferred-label" : "Tillsvidareanställning (inkl. eventuell provanställning)",
    "sentiment" : "OFFERED",
    "type" : "employment-type",
    "start-position" : 532,
    "end-position" : 554,
    "concept-id" : "kpPX_CNN_gDU",
    "matched-string" : "tillsvidareanställning",
    "annotation-id" : 7
  }, {
    "preferred-label" : "körkort",
    "sentiment" : "MUST_HAVE",
    "type" : "esco-skill",
    "start-position" : 661,
    "end-position" : 668,
    "concept-id" : "UvDr_eNo_HSQ",
    "matched-string" : "körkort",
    "annotation-id" : 6
  }, {
    "preferred-label" : "Svenska",
    "sentiment" : "MUST_HAVE",
    "type" : "language",
    "start-position" : 673,
    "end-position" : 680,
    "concept-id" : "zSLA_vw2_FXN",
    "matched-string" : "svenska",
    "annotation-id" : 3
  } ],
  "text" : "Servitris/Servitör\nNu söker vi fler medarbetare för heltid/deltid samt för extra vid behov.\nÄr du intresserad av och kunnig inom mat och dryck? Och vill leverera en minnesvärd upplevelse för våra gäster? Skicka in er ansökan till oss. \nVi söker dig som är kunnig, engagerad och en lagspelare, som har passion för service, mat och dryck.\nHuvudsakliga arbetsuppgifter servering av a la carte och gruppmiddagar under lunch och middag. förberedelser och återställande utav restaurangen. Dryckeskunskap är meriterande.\nVi kan erbjuda en tillsvidareanställning eller deltidstjänst samt extra. Arbetstiderna är varierande, både i tid, dagar, kvällar och helger. Krav: körkort och svenska i tal och skrift.\nÄr du intresserad? Tveka inte att höra av dig till oss! Skicka in din ansökan redan idag. Rekryteringsarbetet sker löpande under ansökningstiden.\n Varmt välkommen med din ansökan!\n #jobbjustnu"
}