{
  "meta" : {
    "dataset-id" : "myh-spreadsheet-2021",
    "type" : "education-description",
    "dataset-document-id" : "YH01209",
    "user" : "kristof.fischer"
  },
  "sha1" : "8f519ded8b7bea6024ba15a11029d59fe3b5add4",
  "annotations" : [ {
    "preferred-label" : "ingenjör, elektronik, integrerade kretsar",
    "sentiment" : "OFFERED",
    "type" : "esco-occupation",
    "start-position" : 148,
    "end-position" : 193,
    "concept-id" : "RoZr_6dx_RCE",
    "matched-string" : "arbeta yrkesmässigt med avancerad FPGA-teknik",
    "annotation-id" : 11
  }, {
    "preferred-label" : "Systemutvecklare/Programmerare",
    "sentiment" : "OFFERED",
    "type" : "occupation-name",
    "start-position" : 240,
    "end-position" : 261,
    "concept-id" : "fg7B_yov_smw",
    "matched-string" : "FPGA-systemutvecklare",
    "annotation-id" : 8
  }, {
    "preferred-label" : "Inbyggda system/Embedded system",
    "sentiment" : "OFFERED",
    "type" : "skill",
    "start-position" : 281,
    "end-position" : 296,
    "concept-id" : "XThy_HCH_FFc",
    "matched-string" : "inbyggda system",
    "annotation-id" : 9
  }, {
    "preferred-label" : "Annan utbildning i elektronik, datateknik och automation",
    "sentiment" : "OFFERED",
    "type" : "sun-education-field-4",
    "start-position" : 595,
    "end-position" : 617,
    "concept-id" : "3tq2_f1E_Lyh",
    "matched-string" : "Introduktion till FPGA",
    "annotation-id" : 10
  }, {
    "preferred-label" : "VHDL, programmeringsspråk",
    "sentiment" : "OFFERED",
    "type" : "skill",
    "start-position" : 622,
    "end-position" : 626,
    "concept-id" : "4fWV_khE_jfp",
    "matched-string" : "vhdl",
    "annotation-id" : 3
  }, {
    "preferred-label" : "Programmering",
    "sentiment" : "OFFERED",
    "type" : "skill",
    "start-position" : 627,
    "end-position" : 640,
    "concept-id" : "iUew_moc_BRk",
    "matched-string" : "programmering",
    "annotation-id" : 4
  }, {
    "preferred-label" : "Annan utbildning i elektronik, datateknik och automation",
    "sentiment" : "OFFERED",
    "type" : "sun-education-field-4",
    "start-position" : 643,
    "comment" : "FPGA finns som keyword bara",
    "end-position" : 691,
    "concept-id" : "3tq2_f1E_Lyh",
    "matched-string" : "Programmering av mikrokontroller och FPGA-system",
    "annotation-id" : 12
  }, {
    "preferred-label" : "Systemutveckling och programmering",
    "sentiment" : "OFFERED",
    "type" : "sun-education-field-4",
    "start-position" : 693,
    "end-position" : 716,
    "concept-id" : "3Jc3_Ppa_YeJ",
    "matched-string" : "FPGA Systemkonstruktion",
    "annotation-id" : 13
  }, {
    "preferred-label" : "Systemutveckling och programmering",
    "sentiment" : "OFFERED",
    "type" : "sun-education-field-4",
    "start-position" : 719,
    "end-position" : 766,
    "concept-id" : "3Jc3_Ppa_YeJ",
    "matched-string" : "Avancerad HW/SW-Systemkonstruktion för FPGA SoC",
    "annotation-id" : 14
  }, {
    "preferred-label" : "Annan utbildning i elektronik, datateknik och automation",
    "sentiment" : "OFFERED",
    "type" : "sun-education-field-4",
    "start-position" : 768,
    "end-position" : 815,
    "concept-id" : "3tq2_f1E_Lyh",
    "matched-string" : "Applikationsspecifika plattformar i FPGA SoC 20",
    "annotation-id" : 15
  }, {
    "preferred-label" : "Annan utbildning i elektronik, datateknik och automation",
    "sentiment" : "OFFERED",
    "type" : "sun-education-field-4",
    "start-position" : 817,
    "end-position" : 852,
    "concept-id" : "3tq2_f1E_Lyh",
    "matched-string" : "Modellbaserad konstruktion för FPGA",
    "annotation-id" : 16
  }, {
    "preferred-label" : "Annan utbildning i elektronik, datateknik och automation",
    "sentiment" : "OFFERED",
    "type" : "sun-education-field-4",
    "start-position" : 855,
    "end-position" : 883,
    "concept-id" : "3tq2_f1E_Lyh",
    "matched-string" : "Högnivåsyntes med C för FPGA",
    "annotation-id" : 17
  }, {
    "preferred-label" : "Annan utbildning i elektronik, datateknik och automation",
    "sentiment" : "OFFERED",
    "type" : "sun-education-field-4",
    "start-position" : 886,
    "end-position" : 932,
    "concept-id" : "3tq2_f1E_Lyh",
    "matched-string" : "Konstruktionsmetodik och teknisk dokumentation",
    "annotation-id" : 18
  }, {
    "preferred-label" : "Annan utbildning i elektronik, datateknik och automation",
    "sentiment" : "OFFERED",
    "type" : "sun-education-field-4",
    "start-position" : 934,
    "end-position" : 952,
    "concept-id" : "3tq2_f1E_Lyh",
    "matched-string" : "Examensarbete FPGA",
    "annotation-id" : 19
  } ],
  "text" : "Utbildningen är utformad som kompetensutveckling och/eller karriärväxling för yrkesverksamma ingenjörer. Målsättningen är att efter en examen kunna arbeta yrkesmässigt med avancerad FPGA-teknik. Det finns ett stort behov av fler avancerade FPGA-systemutvecklare inom branschen för inbyggda system. Genom att utbildningen går på distans på halvfart fungerar det att arbeta samtidigt. Skolan har en stark ledningsgrupp förankrad inom branschen. Kurserna är mycket praktiska och genomförs på ett industrinära sätt från kravspecifikation till kundleverans via verifiering och validering.   Kurser:  Introduktion till FPGA och VHDL-programmering   Programmering av mikrokontroller och FPGA-system  FPGA Systemkonstruktion   Avancerad HW/SW-Systemkonstruktion för FPGA SoC  Applikationsspecifika plattformar i FPGA SoC 20  Modellbaserad konstruktion för FPGA   Högnivåsyntes med C för FPGA   Konstruktionsmetodik och teknisk dokumentation  Examensarbete FPGA     "
}