{
  "meta" : {
    "jobad" : {
      "description" : {
        "requirements" : null,
        "needs" : null,
        "company_information" : null,
        "text_formatted" : "Vimmerby är den lilla kommunen i Småland som har mycket att erbjuda; förutom det gedigna kulturarvet från Astrid Lindgren kännetecknas kommunen också av ett mångsidigt näringsliv, stort lokalt engagemang, aktivt föreningsliv, vacker natur och rogivande miljö.\n\nVi söker nu en speciallärare, eller erfaren grundskollärare, till Vimarskolan F-6\n\nVill du ha ett roligt, varierande och meningsfullt arbete, där du kan göra skillnad för andra människor? Då är du välkommen att söka jobb hos oss! Vi arbetar tillsammans för att våra barn och ungdomar ska få de bästa förutsättningarna att möta framtiden och utvecklas till kreativa, nyfikna och trygga individer. Barn- och utbildningsförvaltningen omfattar alla pedagogiska verksamheter från förskola till högskola och ansvarar även för sfi.\n\nDitt nya jobb\n\nSom speciallärare på vårt resurscentrum ligger ditt fokus på undervisning, utredning och utveckling. Genom undervisning av elever enskilt, i grupp eller i klass bidrar du till att elever når så hög måluppfyllelse som möjligt utifrån dennes kapacitet. Speciallärare är lärarna behjälpliga i genomförandet av screening samt analyserar resultaten i samarbete med specialpedagog. Som speciallärare bidrar du till ökad undervisningskvalitet genom handledning av personal. Du identifierar risker som kan leda till svårigheter för elevens lärande och kunskapsutveckling, samt utformar förebyggande och främjande åtgärder. Du är lärarna behjälplig i arbetet med pedagogiska utredningar. Tillsammans med kollegorna på resurscentrum analyserar du elevernas kunskapsutveckling och ger lärare förslag på åtgärder och förändringar. Din uppgift är att skapa de bästa möjligheterna för att elever, vårdnadshavare och kollegor ska trivas, känna sig trygga och därtill ge en bra utbildning efter de behov eleven har. \n\nProfil\n\n\n• Du har lärarlegitimation\n• Du har speciallärarexamen eller annan examen som bedöms som likvärdig\n• Du är väl insatt i skolans läroplan\n• Du har erfarenhet av att stötta lärare vid bedömning och betygsättning\n• Vi ser gärna att du har erfarenhet av specialpecialläraruppdraget\n\nSom person är du kreativ och lyhörd, du har en positiv inställning och en god förmåga att inspirera och motivera eleverna till lärande. Du har stor vana att skriva pedagogiska utredningar och åtgärdsprogram. Du har även vana att sitta med på elevhälsosamtal samt att ha kontakt med vårdnadshavare i specifika elevärenden. Det är viktigt att du har en god samarbetsförmåga. Vid urvalet kommer vi att lägga stor vikt vid personliga egenskaper och intresse för tjänsten. Vi värdesätter de kvaliteter som mångfald och jämn könsfördelning tillför verksamheten och ser därför gärna sökande med olika bakgrund och livserfarenhet till tjänsten.\n\nTjänsten omfattas av registerkontroll. Du som sökande måste uppvisa utdrag från polisens belastningsregister innan anställning sker.\n\nAnställningens omfattning\n\nAnställningsform: tillvidare\nSysselsättningsgrad:  100% \nTillträde: Snarast   \n\nAnsökan\n\nSista ansökningsdatum: 2022-08-14\nIntervjuer sker fortlöpande och rekrytering kan komma att ske före ansökningstidens utgång. \n\nVi tar emot ansökningar via vårt rekryteringssystem där du bifogar CV och personligt brev.\n\nVimmerby kommun som arbetsgivare\n\nAnsvar, mod och fantasi – det är våra värdeord när vi tillsammans arbetar för att ge bästa tänkbara service och omsorg till Vimmerby kommuns ca 15 700 invånare, våra företag och för alla som besöker oss. Vi är cirka 1 300 anställda i 170 olika yrkesroller. Vi erbjuder dig en arbetsplats som uppmuntrar till delaktighet och strävar efter en god balans mellan arbete och fritid. \n\nBarn- och utbildningsförvaltningen\n\nBarn- och utbildningsförvaltningen ansvarar för alla pedagogiska verksamheter, från förskola till högskola, och ansvarar även för svenska för invandrare (sfi) och samhällsorientering för nyanlända. Vårt gemensamma mål är att Vimmerby kommuns barn och ungdomar ska få de bästa förutsättningarna att möta framtiden och utvecklas till kreativa, nyfikna och trygga individer. Vår vision är \"Vi gör vårt bästa, vi lyckas, vi lär oss massor och tillsammans når vi toppen!\"  Vi tycker det är viktigt med ett öppet klimat där vi lär oss av varandra i vardagen genom att ge och ta feedback, diskutera erfarenheter och prova nya idéer. Läs mer om oss och om Vimmerby kommun som arbetsgivare på vår hemsida: www.vimmerby.se\n\nÖvrigt\n\nInför rekryteringsarbetet har vi tagit ställning till annonskanaler och marknadsföring. Vi undanber oss därför ytterligare kontakt med media-/annonsförsäljare, rekryteringssajter och liknande.\n\nFackliga representanter nås via kommunens växel 0492-76 90 00.\n\nVarmt välkommen med din ansökan!\n\n \n\n \n\n ",
        "conditions" : "Heltid/\r\nEj specificerat",
        "text" : "Vimmerby är den lilla kommunen i Småland som har mycket att erbjuda; förutom det gedigna kulturarvet från Astrid Lindgren kännetecknas kommunen också av ett mångsidigt näringsliv, stort lokalt engagemang, aktivt föreningsliv, vacker natur och rogivande miljö.\n\nVi söker nu en speciallärare, eller erfaren grundskollärare, till Vimarskolan F-6\n\nVill du ha ett roligt, varierande och meningsfullt arbete, där du kan göra skillnad för andra människor? Då är du välkommen att söka jobb hos oss! Vi arbetar tillsammans för att våra barn och ungdomar ska få de bästa förutsättningarna att möta framtiden och utvecklas till kreativa, nyfikna och trygga individer. Barn- och utbildningsförvaltningen omfattar alla pedagogiska verksamheter från förskola till högskola och ansvarar även för sfi.\n\nDitt nya jobb\n\nSom speciallärare på vårt resurscentrum ligger ditt fokus på undervisning, utredning och utveckling. Genom undervisning av elever enskilt, i grupp eller i klass bidrar du till att elever når så hög måluppfyllelse som möjligt utifrån dennes kapacitet. Speciallärare är lärarna behjälpliga i genomförandet av screening samt analyserar resultaten i samarbete med specialpedagog. Som speciallärare bidrar du till ökad undervisningskvalitet genom handledning av personal. Du identifierar risker som kan leda till svårigheter för elevens lärande och kunskapsutveckling, samt utformar förebyggande och främjande åtgärder. Du är lärarna behjälplig i arbetet med pedagogiska utredningar. Tillsammans med kollegorna på resurscentrum analyserar du elevernas kunskapsutveckling och ger lärare förslag på åtgärder och förändringar. Din uppgift är att skapa de bästa möjligheterna för att elever, vårdnadshavare och kollegor ska trivas, känna sig trygga och därtill ge en bra utbildning efter de behov eleven har. \n\nProfil\n\n\n• Du har lärarlegitimation\n• Du har speciallärarexamen eller annan examen som bedöms som likvärdig\n• Du är väl insatt i skolans läroplan\n• Du har erfarenhet av att stötta lärare vid bedömning och betygsättning\n• Vi ser gärna att du har erfarenhet av specialpecialläraruppdraget\n\nSom person är du kreativ och lyhörd, du har en positiv inställning och en god förmåga att inspirera och motivera eleverna till lärande. Du har stor vana att skriva pedagogiska utredningar och åtgärdsprogram. Du har även vana att sitta med på elevhälsosamtal samt att ha kontakt med vårdnadshavare i specifika elevärenden. Det är viktigt att du har en god samarbetsförmåga. Vid urvalet kommer vi att lägga stor vikt vid personliga egenskaper och intresse för tjänsten. Vi värdesätter de kvaliteter som mångfald och jämn könsfördelning tillför verksamheten och ser därför gärna sökande med olika bakgrund och livserfarenhet till tjänsten.\n\nTjänsten omfattas av registerkontroll. Du som sökande måste uppvisa utdrag från polisens belastningsregister innan anställning sker.\n\nAnställningens omfattning\n\nAnställningsform: tillvidare\nSysselsättningsgrad:  100% \nTillträde: Snarast   \n\nAnsökan\n\nSista ansökningsdatum: 2022-08-14\nIntervjuer sker fortlöpande och rekrytering kan komma att ske före ansökningstidens utgång. \n\nVi tar emot ansökningar via vårt rekryteringssystem där du bifogar CV och personligt brev.\n\nVimmerby kommun som arbetsgivare\n\nAnsvar, mod och fantasi – det är våra värdeord när vi tillsammans arbetar för att ge bästa tänkbara service och omsorg till Vimmerby kommuns ca 15 700 invånare, våra företag och för alla som besöker oss. Vi är cirka 1 300 anställda i 170 olika yrkesroller. Vi erbjuder dig en arbetsplats som uppmuntrar till delaktighet och strävar efter en god balans mellan arbete och fritid. \n\nBarn- och utbildningsförvaltningen\n\nBarn- och utbildningsförvaltningen ansvarar för alla pedagogiska verksamheter, från förskola till högskola, och ansvarar även för svenska för invandrare (sfi) och samhällsorientering för nyanlända. Vårt gemensamma mål är att Vimmerby kommuns barn och ungdomar ska få de bästa förutsättningarna att möta framtiden och utvecklas till kreativa, nyfikna och trygga individer. Vår vision är \"Vi gör vårt bästa, vi lyckas, vi lär oss massor och tillsammans når vi toppen!\"  Vi tycker det är viktigt med ett öppet klimat där vi lär oss av varandra i vardagen genom att ge och ta feedback, diskutera erfarenheter och prova nya idéer. Läs mer om oss och om Vimmerby kommun som arbetsgivare på vår hemsida: www.vimmerby.se\n\nÖvrigt\n\nInför rekryteringsarbetet har vi tagit ställning till annonskanaler och marknadsföring. Vi undanber oss därför ytterligare kontakt med media-/annonsförsäljare, rekryteringssajter och liknande.\n\nFackliga representanter nås via kommunens växel 0492-76 90 00.\n\nVarmt välkommen med din ansökan!"
      },
      "headline" : "Speciallärare Vimarskolan F-6",
      "driving_license" : null,
      "employer" : {
        "email" : null,
        "phone_number" : null,
        "organization_number" : "2120000787",
        "name" : "Vimmerby kommun",
        "url" : "http://www.vimmerby.se",
        "workplace" : "Vimmerby Kommun"
      },
      "removed_date" : null,
      "logo_url" : "https://www.arbetsformedlingen.se/rest/arbetsgivare/rest/af/v3/organisation/2120000787/logotyper/logo.png",
      "last_publication_date" : "2022-08-14T23:59:59",
      "number_of_vacancies" : 1,
      "occupation" : {
        "concept_id" : "dhXy_7Te_Tzb",
        "label" : "Speciallärare",
        "legacy_ams_taxonomy_id" : "7403"
      },
      "occupation_group" : {
        "concept_id" : "3FP7_4Eg_x8P",
        "label" : "Speciallärare och specialpedagoger m.fl.",
        "legacy_ams_taxonomy_id" : "2351"
      },
      "employment_type" : {
        "concept_id" : "PFZr_Syz_cUq",
        "label" : "Vanlig anställning",
        "legacy_ams_taxonomy_id" : "1"
      },
      "webpage_url" : "https://arbetsformedlingen.se/platsbanken/annonser/26350368",
      "driving_license_required" : false,
      "application_contacts" : [ {
        "description" : "Eva Grudemo,",
        "email" : "eva.grudemo@vimmerby.se",
        "telephone" : null,
        "name" : null,
        "contact_type" : null
      } ],
      "duration" : {
        "concept_id" : "a7uU_j21_mkL",
        "label" : "Tills vidare",
        "legacy_ams_taxonomy_id" : "1"
      },
      "nice_to_have" : {
        "education_level" : [ ],
        "work_experiences" : [ ],
        "skills" : [ ],
        "education" : [ ],
        "languages" : [ ]
      },
      "application_details" : {
        "via_af" : false,
        "email" : null,
        "other" : null,
        "reference" : null,
        "url" : "http://www.vimmerby.se/naringslivocharbete/arbetsmarknad/ledigajobbikommunen.4.3007f0e915c15cbcef5f0ea7.html?rmpage=job&rmjob=2924",
        "information" : null
      },
      "source_type" : "VIA_PLATSBANKEN_DXA",
      "application_deadline" : "2022-08-14T23:59:59",
      "external_id" : "46-212000-0787-2924",
      "workplace_address" : {
        "coordinates" : [ 15.858857, 57.669033 ],
        "city" : null,
        "postcode" : null,
        "municipality" : "Vimmerby",
        "region_concept_id" : "9QUH_2bb_6Np",
        "region" : "Kalmar län",
        "country_code" : "199",
        "region_code" : "08",
        "municipality_concept_id" : "a7hJ_zwv_2FR",
        "country_concept_id" : "i46j_HmG_v64",
        "municipality_code" : "0884",
        "street_address" : null,
        "country" : "Sverige"
      },
      "id" : "26350368",
      "experience_required" : true,
      "working_hours_type" : {
        "concept_id" : "6YE1_gAC_R2G",
        "label" : "Heltid",
        "legacy_ams_taxonomy_id" : "1"
      },
      "access" : null,
      "timestamp" : 1658737293962,
      "must_have" : {
        "education_level" : [ ],
        "work_experiences" : [ {
          "concept_id" : "dhXy_7Te_Tzb",
          "weight" : 10,
          "label" : "Speciallärare",
          "legacy_ams_taxonomy_id" : "7403"
        } ],
        "skills" : [ ],
        "education" : [ ],
        "languages" : [ ]
      },
      "occupation_field" : {
        "concept_id" : "MVqp_eS8_kDZ",
        "label" : "Pedagogik",
        "legacy_ams_taxonomy_id" : "15"
      },
      "scope_of_work" : {
        "min" : 100,
        "max" : 100
      },
      "salary_type" : {
        "concept_id" : "oG8G_9cW_nRf",
        "label" : "Fast månads- vecko- eller timlön",
        "legacy_ams_taxonomy_id" : "1"
      },
      "removed" : false,
      "salary_description" : "Månadslön",
      "access_to_own_car" : false,
      "publication_date" : "2022-07-25T10:21:33"
    },
    "name" : "Speciallärare Vimarskolan F-6",
    "user" : "kristof.fischer"
  },
  "sha1" : "2ba617fa67c27bfd4feaba35d81eb618e15ee5e3",
  "annotations" : [ {
    "preferred-label" : "Speciallärare",
    "sentiment" : "MUST_HAVE",
    "type" : "occupation-name",
    "start-position" : 0,
    "end-position" : 13,
    "concept-id" : "dhXy_7Te_Tzb",
    "matched-string" : "speciallärare",
    "annotation-id" : 0
  }, {
    "preferred-label" : "Vimmerby",
    "type" : "municipality",
    "start-position" : 30,
    "end-position" : 38,
    "concept-id" : "a7hJ_zwv_2FR",
    "matched-string" : "Vimmerby",
    "annotation-id" : 20
  }, {
    "preferred-label" : "Speciallärare",
    "sentiment" : "MUST_HAVE",
    "type" : "occupation-name",
    "start-position" : 306,
    "end-position" : 319,
    "concept-id" : "dhXy_7Te_Tzb",
    "matched-string" : "speciallärare",
    "annotation-id" : 1
  }, {
    "preferred-label" : "grundskollärare",
    "sentiment" : "MUST_HAVE",
    "type" : "esco-occupation",
    "start-position" : 335,
    "end-position" : 350,
    "concept-id" : "Kcc6_bWM_owG",
    "matched-string" : "grundskollärare",
    "annotation-id" : 2
  }, {
    "preferred-label" : "Förskola",
    "sentiment" : "MUST_HAVE",
    "type" : "sun-education-level-3",
    "start-position" : 766,
    "end-position" : 774,
    "concept-id" : "p3Nu_zzc_L7T",
    "matched-string" : "förskola",
    "annotation-id" : 3
  }, {
    "preferred-label" : "Speciallärare",
    "sentiment" : "MUST_HAVE",
    "type" : "occupation-name",
    "start-position" : 836,
    "end-position" : 849,
    "concept-id" : "dhXy_7Te_Tzb",
    "matched-string" : "speciallärare",
    "annotation-id" : 4
  }, {
    "preferred-label" : "Speciallärare",
    "sentiment" : "MUST_HAVE",
    "type" : "occupation-name",
    "start-position" : 1083,
    "end-position" : 1096,
    "concept-id" : "dhXy_7Te_Tzb",
    "matched-string" : "speciallärare",
    "annotation-id" : 7
  }, {
    "preferred-label" : "Specialpedagog",
    "sentiment" : "MUST_HAVE",
    "type" : "occupation-name",
    "start-position" : 1192,
    "end-position" : 1206,
    "concept-id" : "f1zq_tpA_QtN",
    "matched-string" : "specialpedagog",
    "annotation-id" : 8
  }, {
    "preferred-label" : "Speciallärare",
    "sentiment" : "MUST_HAVE",
    "type" : "occupation-name",
    "start-position" : 1212,
    "end-position" : 1225,
    "concept-id" : "dhXy_7Te_Tzb",
    "matched-string" : "speciallärare",
    "annotation-id" : 9
  }, {
    "preferred-label" : "bedömning av risker och hot",
    "sentiment" : "MUST_HAVE",
    "type" : "esco-skill",
    "start-position" : 1302,
    "end-position" : 1321,
    "concept-id" : "GkJS_cwi_Awd",
    "matched-string" : "identifierar risker",
    "annotation-id" : 23
  }, {
    "preferred-label" : "Pedagogiska utredningar",
    "sentiment" : "MUST_HAVE",
    "type" : "skill",
    "start-position" : 1486,
    "end-position" : 1509,
    "concept-id" : "GvLd_9eG_A23",
    "matched-string" : "pedagogiska utredningar",
    "annotation-id" : 11
  }, {
    "preferred-label" : "observera elevers framsteg",
    "sentiment" : "MUST_HAVE",
    "type" : "esco-skill",
    "start-position" : 1569,
    "end-position" : 1597,
    "concept-id" : "cwjn_FgC_Khw",
    "matched-string" : "elevernas kunskapsutveckling",
    "annotation-id" : 21
  }, {
    "preferred-label" : "ge råd till andra",
    "sentiment" : "MUST_HAVE",
    "type" : "esco-skill",
    "start-position" : 1602,
    "end-position" : 1620,
    "concept-id" : "mQW5_94o_M3N",
    "matched-string" : "ger lärare förslag",
    "annotation-id" : 22
  }, {
    "preferred-label" : "Lärarlegitimation",
    "sentiment" : "MUST_HAVE",
    "type" : "skill",
    "start-position" : 1852,
    "end-position" : 1869,
    "concept-id" : "yKnk_W7X_Zvk",
    "matched-string" : "lärarlegitimation",
    "annotation-id" : 12
  }, {
    "preferred-label" : "Speciallärarexamen",
    "sentiment" : "MUST_HAVE",
    "type" : "skill",
    "start-position" : 1879,
    "end-position" : 1897,
    "concept-id" : "VNRs_wiA_RqV",
    "matched-string" : "speciallärarexamen",
    "annotation-id" : 13
  }, {
    "preferred-label" : "stödja kolleger",
    "sentiment" : "MUST_HAVE",
    "type" : "esco-skill",
    "start-position" : 2007,
    "end-position" : 2020,
    "concept-id" : "RdK1_yPB_JiW",
    "matched-string" : "stötta lärare",
    "annotation-id" : 24
  }, {
    "preferred-label" : "Pedagogiska utredningar",
    "sentiment" : "MUST_HAVE",
    "type" : "skill",
    "start-position" : 2286,
    "end-position" : 2309,
    "concept-id" : "GvLd_9eG_A23",
    "matched-string" : "pedagogiska utredningar",
    "annotation-id" : 15
  }, {
    "preferred-label" : "Elevhälsa",
    "sentiment" : "MUST_HAVE",
    "type" : "skill",
    "start-position" : 2364,
    "end-position" : 2379,
    "concept-id" : "Sj2n_Kcr_3hm",
    "matched-string" : "elevhälsosamtal",
    "annotation-id" : 25
  }, {
    "preferred-label" : "Vårdnadsutredningar",
    "sentiment" : "MUST_HAVE",
    "type" : "skill",
    "start-position" : 2392,
    "end-position" : 2418,
    "concept-id" : "79ET_nqi_vBf",
    "matched-string" : "kontakt med vårdnadshavare",
    "annotation-id" : 26
  }, {
    "preferred-label" : "samarbeta med kolleger",
    "sentiment" : "MUST_HAVE",
    "type" : "esco-skill",
    "start-position" : 2477,
    "end-position" : 2493,
    "concept-id" : "X15R_797_q62",
    "matched-string" : "samarbetsförmåga",
    "annotation-id" : 27
  }, {
    "preferred-label" : "Tillsvidareanställning (inkl. eventuell provanställning)",
    "type" : "employment-type",
    "start-position" : 2939,
    "end-position" : 2949,
    "concept-id" : "kpPX_CNN_gDU",
    "matched-string" : "tillvidare",
    "annotation-id" : 28
  }, {
    "preferred-label" : "Heltid",
    "type" : "worktime-extent",
    "start-position" : 2972,
    "end-position" : 2977,
    "concept-id" : "6YE1_gAC_R2G",
    "matched-string" : "100% ",
    "annotation-id" : 29
  }, {
    "preferred-label" : "Förskola",
    "sentiment" : "MUST_HAVE",
    "type" : "sun-education-level-3",
    "start-position" : 3764,
    "end-position" : 3772,
    "concept-id" : "p3Nu_zzc_L7T",
    "matched-string" : "förskola",
    "annotation-id" : 17
  } ],
  "text" : "Speciallärare Vimarskolan F-6\nVimmerby är den lilla kommunen i Småland som har mycket att erbjuda; förutom det gedigna kulturarvet från Astrid Lindgren kännetecknas kommunen också av ett mångsidigt näringsliv, stort lokalt engagemang, aktivt föreningsliv, vacker natur och rogivande miljö.\n\nVi söker nu en speciallärare, eller erfaren grundskollärare, till Vimarskolan F-6\n\nVill du ha ett roligt, varierande och meningsfullt arbete, där du kan göra skillnad för andra människor? Då är du välkommen att söka jobb hos oss! Vi arbetar tillsammans för att våra barn och ungdomar ska få de bästa förutsättningarna att möta framtiden och utvecklas till kreativa, nyfikna och trygga individer. Barn- och utbildningsförvaltningen omfattar alla pedagogiska verksamheter från förskola till högskola och ansvarar även för sfi.\n\nDitt nya jobb\n\nSom speciallärare på vårt resurscentrum ligger ditt fokus på undervisning, utredning och utveckling. Genom undervisning av elever enskilt, i grupp eller i klass bidrar du till att elever når så hög måluppfyllelse som möjligt utifrån dennes kapacitet. Speciallärare är lärarna behjälpliga i genomförandet av screening samt analyserar resultaten i samarbete med specialpedagog. Som speciallärare bidrar du till ökad undervisningskvalitet genom handledning av personal. Du identifierar risker som kan leda till svårigheter för elevens lärande och kunskapsutveckling, samt utformar förebyggande och främjande åtgärder. Du är lärarna behjälplig i arbetet med pedagogiska utredningar. Tillsammans med kollegorna på resurscentrum analyserar du elevernas kunskapsutveckling och ger lärare förslag på åtgärder och förändringar. Din uppgift är att skapa de bästa möjligheterna för att elever, vårdnadshavare och kollegor ska trivas, känna sig trygga och därtill ge en bra utbildning efter de behov eleven har. \n\nProfil\n\n\n• Du har lärarlegitimation\n• Du har speciallärarexamen eller annan examen som bedöms som likvärdig\n• Du är väl insatt i skolans läroplan\n• Du har erfarenhet av att stötta lärare vid bedömning och betygsättning\n• Vi ser gärna att du har erfarenhet av specialpecialläraruppdraget\n\nSom person är du kreativ och lyhörd, du har en positiv inställning och en god förmåga att inspirera och motivera eleverna till lärande. Du har stor vana att skriva pedagogiska utredningar och åtgärdsprogram. Du har även vana att sitta med på elevhälsosamtal samt att ha kontakt med vårdnadshavare i specifika elevärenden. Det är viktigt att du har en god samarbetsförmåga. Vid urvalet kommer vi att lägga stor vikt vid personliga egenskaper och intresse för tjänsten. Vi värdesätter de kvaliteter som mångfald och jämn könsfördelning tillför verksamheten och ser därför gärna sökande med olika bakgrund och livserfarenhet till tjänsten.\n\nTjänsten omfattas av registerkontroll. Du som sökande måste uppvisa utdrag från polisens belastningsregister innan anställning sker.\n\nAnställningens omfattning\n\nAnställningsform: tillvidare\nSysselsättningsgrad:  100% \nTillträde: Snarast   \n\nAnsökan\n\nSista ansökningsdatum: 2022-08-14\nIntervjuer sker fortlöpande och rekrytering kan komma att ske före ansökningstidens utgång. \n\nVi tar emot ansökningar via vårt rekryteringssystem där du bifogar CV och personligt brev.\n\nVimmerby kommun som arbetsgivare\n\nAnsvar, mod och fantasi – det är våra värdeord när vi tillsammans arbetar för att ge bästa tänkbara service och omsorg till Vimmerby kommuns ca 15 700 invånare, våra företag och för alla som besöker oss. Vi är cirka 1 300 anställda i 170 olika yrkesroller. Vi erbjuder dig en arbetsplats som uppmuntrar till delaktighet och strävar efter en god balans mellan arbete och fritid. \n\nBarn- och utbildningsförvaltningen\n\nBarn- och utbildningsförvaltningen ansvarar för alla pedagogiska verksamheter, från förskola till högskola, och ansvarar även för svenska för invandrare (sfi) och samhällsorientering för nyanlända. Vårt gemensamma mål är att Vimmerby kommuns barn och ungdomar ska få de bästa förutsättningarna att möta framtiden och utvecklas till kreativa, nyfikna och trygga individer. Vår vision är \"Vi gör vårt bästa, vi lyckas, vi lär oss massor och tillsammans når vi toppen!\"  Vi tycker det är viktigt med ett öppet klimat där vi lär oss av varandra i vardagen genom att ge och ta feedback, diskutera erfarenheter och prova nya idéer. Läs mer om oss och om Vimmerby kommun som arbetsgivare på vår hemsida: www.vimmerby.se\n\nÖvrigt\n\nInför rekryteringsarbetet har vi tagit ställning till annonskanaler och marknadsföring. Vi undanber oss därför ytterligare kontakt med media-/annonsförsäljare, rekryteringssajter och liknande.\n\nFackliga representanter nås via kommunens växel 0492-76 90 00.\n\nVarmt välkommen med din ansökan!"
}