{
  "meta" : {
    "jobad" : {
      "description" : {
        "requirements" : null,
        "needs" : null,
        "company_information" : null,
        "text_formatted" : "<p><em>Vill du jobba i ett internationellt företag under tillväxt? Nu utökar vi och söker en gruppchef inom landskapsarkitektur!</em></p><p><strong>Om jobbet</strong></p><p>Som gruppchef kommer du att ha personalansvar för två landskapsarkitekter i Stockholm, en grupp du kommer att vara med och utöka.</p><p>Tillsammans med regionchef och i samarbete med dina gruppchefskollegor inom väg &amp; gata och miljö kommer du att fortsätta utveckla och bygga upp verksamheten. Som alla våra chefer kommer du också att arbeta i uppdrag inom ditt område.</p><p>Att leda och utveckla din personal är viktiga delar i ditt arbete såväl som att utveckla verksamheten framåt. Som gruppchef kommer du att ansvara för:</p><ul><li>resursplanering</li><li>marknad och anbud inom ditt område</li><li>rekrytering och utveckling av dina medarbetare.</li></ul><p>Du kommer ha ett nära samarbete med våra övriga kontor och resor i tjänsten förekommer emellanåt.</p><p><strong>Om dig</strong></p><p>Vi söker dig som trivs med ett arbete där du får möjlighet att utveckla arbetet och verksamheten framåt.</p><p>Genom ditt ledarskap får du andra att utvecklas. Du är inspirerande och bidrar till nytänkande och förändring. Ditt sätt att möta människor med värme, energi och respekt skapar entusiasm och arbetsglädje hos dina medarbetare, kollegor och kunder.</p><p>Vi söker dig som har goda kunskaper inom landskapsarkitektur gärna med fokus på transportinfrastruktur. Vi tror att du har en eftergymnasial utbildning inom landskapsarkitektur och att du har arbetat minst fem år inom området. Vi ser gärna att du haft en ledande roll och har du arbetet som chef är det en merit.</p><p>Du arbetar bra tillsammans med andra samtidigt som du har förmåga att arbeta självständigt. Du trivs i en roll där du får dela med dig av din kunskap och fungera som coach åt andra.</p><p><strong>Vårt erbjudande</strong></p><p>Vi erbjuder en möjlighet att vara med och utveckla verksamheten inom landskapsarkitektur i både Stockholm och resten av Sverige. Vi är ett kraftigt expanderande internationellt företag. Du blir en viktig del av vår verksamhet, vi är öppna för nya idéer och du har stora möjligheter att påverka utvecklingen framåt. Du kommer att få möjlighet att jobba med kollegor i hela Sverige såväl som i andra länder. Du utgår från vårt kontor i Kista science Tower där vi sitter tillsammans med kollegor både inom det egna och övriga affärsområden.</p><p>Hos oss är du med och utvecklar innovativa och hållbara lösningar. På SYSTRA deltar du i skapandet av ett hållbart samhälle genom att arbeta i en organisation som tar ansvar för miljön, projekten, medarbetarna och som skapar verklighet av sina visioner.</p><p>På SYSTRA vet vi att det är medarbetarnas olikheter som får organisationen att växa. Vi lägger därför stor vikt vid dina personliga egenskaper och eftersträvar en mångfald på arbetsplatsen.</p><p><strong>Om SYSTRA</strong></p><p>SYSTRA är ett internationellt företag med 9 000 anställda runtom i världen. Vi är en av världens ledande aktörer inom infrastrukturlösningar inom transportinfrastruktur så som höghastighetsjärnväg, tunnelbana, spårväg, väg &amp; trafik. Vi har bland annat designat 50 procent av världens byggda och planerade höghastighetsjärnvägar, automatiserade metro och tunnelbanor.</p><p>SYSTRA AB har funnits i sin nuvarande form sedan 2018 och har under den perioden vuxit från 50 till 250 medarbetare, en expansion vi ser kommer att fortsätta de närmaste åren. Vi är idag 8 medarbetare inom området landskapsarkitektur i Sverige. Läs gärna mer om oss på vår hemsida www.systra.se.</p><p><strong>Ansökan</strong></p><p>Varmt välkommen med din ansökan. Urval kan komma att ske löpande. Du ansöker om jobbet här: https://jobs.systra.com/job/Stockholm-Gruppchef-inom-Landskapsarkitektur-till-Stockholm/814117301/</p><p><strong>Välkommen att höra av dig om du är intresserad och vill veta mer</strong></p><p>Regionchef Civil Öst &amp; Mitt Mattias Källander</p><p>070-395 69 36</p><p>mkallander@systra.com</p><p><em>Inför rekryteringsarbetet har SYSTRA noggrant tagit ställning till rekryteringskanaler och marknadsföring. Vi undanber oss därför bestämt kontakt med mediesäljare, rekryteringssajter eller liknande.</em></p><p><br></p>",
        "conditions" : null,
        "text" : "Vill du jobba i ett internationellt företag under tillväxt? Nu utökar vi och söker en gruppchef inom landskapsarkitektur!\nOm jobbet\nSom gruppchef kommer du att ha personalansvar för två landskapsarkitekter i Stockholm, en grupp du kommer att vara med och utöka.\nTillsammans med regionchef och i samarbete med dina gruppchefskollegor inom väg & gata och miljö kommer du att fortsätta utveckla och bygga upp verksamheten. Som alla våra chefer kommer du också att arbeta i uppdrag inom ditt område.\nAtt leda och utveckla din personal är viktiga delar i ditt arbete såväl som att utveckla verksamheten framåt. Som gruppchef kommer du att ansvara för:\nresursplanering\nmarknad och anbud inom ditt område\nrekrytering och utveckling av dina medarbetare.\n\nDu kommer ha ett nära samarbete med våra övriga kontor och resor i tjänsten förekommer emellanåt.\nOm dig\nVi söker dig som trivs med ett arbete där du får möjlighet att utveckla arbetet och verksamheten framåt.\nGenom ditt ledarskap får du andra att utvecklas. Du är inspirerande och bidrar till nytänkande och förändring. Ditt sätt att möta människor med värme, energi och respekt skapar entusiasm och arbetsglädje hos dina medarbetare, kollegor och kunder.\nVi söker dig som har goda kunskaper inom landskapsarkitektur gärna med fokus på transportinfrastruktur. Vi tror att du har en eftergymnasial utbildning inom landskapsarkitektur och att du har arbetat minst fem år inom området. Vi ser gärna att du haft en ledande roll och har du arbetet som chef är det en merit.\nDu arbetar bra tillsammans med andra samtidigt som du har förmåga att arbeta självständigt. Du trivs i en roll där du får dela med dig av din kunskap och fungera som coach åt andra.\nVårt erbjudande\nVi erbjuder en möjlighet att vara med och utveckla verksamheten inom landskapsarkitektur i både Stockholm och resten av Sverige. Vi är ett kraftigt expanderande internationellt företag. Du blir en viktig del av vår verksamhet, vi är öppna för nya idéer och du har stora möjligheter att påverka utvecklingen framåt. Du kommer att få möjlighet att jobba med kollegor i hela Sverige såväl som i andra länder. Du utgår från vårt kontor i Kista science Tower där vi sitter tillsammans med kollegor både inom det egna och övriga affärsområden.\nHos oss är du med och utvecklar innovativa och hållbara lösningar. På SYSTRA deltar du i skapandet av ett hållbart samhälle genom att arbeta i en organisation som tar ansvar för miljön, projekten, medarbetarna och som skapar verklighet av sina visioner.\nPå SYSTRA vet vi att det är medarbetarnas olikheter som får organisationen att växa. Vi lägger därför stor vikt vid dina personliga egenskaper och eftersträvar en mångfald på arbetsplatsen.\nOm SYSTRA\nSYSTRA är ett internationellt företag med 9 000 anställda runtom i världen. Vi är en av världens ledande aktörer inom infrastrukturlösningar inom transportinfrastruktur så som höghastighetsjärnväg, tunnelbana, spårväg, väg & trafik. Vi har bland annat designat 50 procent av världens byggda och planerade höghastighetsjärnvägar, automatiserade metro och tunnelbanor.\nSYSTRA AB har funnits i sin nuvarande form sedan 2018 och har under den perioden vuxit från 50 till 250 medarbetare, en expansion vi ser kommer att fortsätta de närmaste åren. Vi är idag 8 medarbetare inom området landskapsarkitektur i Sverige. Läs gärna mer om oss på vår hemsida www.systra.se.\nAnsökan\nVarmt välkommen med din ansökan. Urval kan komma att ske löpande. Du ansöker om jobbet här: https://jobs.systra.com/job/Stockholm-Gruppchef-inom-Landskapsarkitektur-till-Stockholm/814117301/\nVälkommen att höra av dig om du är intresserad och vill veta mer\nRegionchef Civil Öst & Mitt Mattias Källander\n070-395 69 36\nmkallander@systra.com\nInför rekryteringsarbetet har SYSTRA noggrant tagit ställning till rekryteringskanaler och marknadsföring. Vi undanber oss därför bestämt kontakt med mediesäljare, rekryteringssajter eller liknande."
      },
      "headline" : "Gruppchef inom Landskapsarkitektur till Stockholm",
      "driving_license" : null,
      "employer" : {
        "email" : null,
        "phone_number" : null,
        "organization_number" : "5565400677",
        "name" : "SYSTRA AB",
        "url" : "www.systra.se",
        "workplace" : "SYSTRA AB Kista"
      },
      "removed_date" : null,
      "logo_url" : "https://www.arbetsformedlingen.se/rest/arbetsgivare/rest/af/v3/arbetsplatser/87185227/logotyper/logo.png",
      "last_publication_date" : "2022-08-31T23:59:59",
      "number_of_vacancies" : 1,
      "occupation" : {
        "concept_id" : "SXAF_LMk_j4S",
        "label" : "Landskapsarkitekt",
        "legacy_ams_taxonomy_id" : "5447"
      },
      "occupation_group" : {
        "concept_id" : "ETAR_ggZ_Wuw",
        "label" : "Landskapsarkitekter",
        "legacy_ams_taxonomy_id" : "2162"
      },
      "employment_type" : {
        "concept_id" : "PFZr_Syz_cUq",
        "label" : "Vanlig anställning",
        "legacy_ams_taxonomy_id" : "1"
      },
      "webpage_url" : "https://arbetsformedlingen.se/platsbanken/annonser/26206613",
      "driving_license_required" : false,
      "application_contacts" : [ ],
      "duration" : {
        "concept_id" : "a7uU_j21_mkL",
        "label" : "Tills vidare",
        "legacy_ams_taxonomy_id" : "1"
      },
      "nice_to_have" : {
        "education_level" : [ ],
        "work_experiences" : [ ],
        "skills" : [ ],
        "education" : [ ],
        "languages" : [ ]
      },
      "application_details" : {
        "via_af" : false,
        "email" : null,
        "other" : null,
        "reference" : null,
        "url" : "https://jobs.systra.com/job/Stockholm-Gruppchef-inom-Landskapsarkitektur-till-Stockholm/814117301/",
        "information" : null
      },
      "source_type" : "VIA_ANNONSERA",
      "application_deadline" : "2022-08-31T23:59:59",
      "external_id" : null,
      "workplace_address" : {
        "coordinates" : [ 17.946678469101148, 59.40148410525871 ],
        "city" : "Kista",
        "postcode" : "16451",
        "municipality" : "Stockholm",
        "region_concept_id" : "CifL_Rzy_Mku",
        "region" : "Stockholms län",
        "country_code" : "199",
        "region_code" : "01",
        "municipality_concept_id" : "AvNB_uwa_6n6",
        "country_concept_id" : "i46j_HmG_v64",
        "municipality_code" : "0180",
        "street_address" : "Kista science tower, Färögatan 33 10tr",
        "country" : "Sverige"
      },
      "id" : "26206613",
      "experience_required" : true,
      "working_hours_type" : {
        "concept_id" : "6YE1_gAC_R2G",
        "label" : "Heltid",
        "legacy_ams_taxonomy_id" : "1"
      },
      "access" : null,
      "timestamp" : 1656516190896,
      "must_have" : {
        "education_level" : [ ],
        "work_experiences" : [ ],
        "skills" : [ ],
        "education" : [ ],
        "languages" : [ ]
      },
      "occupation_field" : {
        "concept_id" : "6Hq3_tKo_V57",
        "label" : "Yrken med teknisk inriktning",
        "legacy_ams_taxonomy_id" : "18"
      },
      "scope_of_work" : {
        "min" : 0,
        "max" : 100
      },
      "salary_type" : {
        "concept_id" : "oG8G_9cW_nRf",
        "label" : "Fast månads- vecko- eller timlön",
        "legacy_ams_taxonomy_id" : "1"
      },
      "removed" : false,
      "salary_description" : null,
      "access_to_own_car" : false,
      "publication_date" : "2022-06-13T11:23:05"
    },
    "name" : "Gruppchef inom Landskapsarkitektur till Stockholm",
    "user" : "hannes"
  },
  "sha1" : "4d11d02602671c3efb9bf382c4adebfae28baaa5",
  "annotations" : [ {
    "preferred-label" : "landskapsarkitektur",
    "type" : "esco-skill",
    "start-position" : 15,
    "end-position" : 34,
    "concept-id" : "VryZ_dNm_o4a",
    "matched-string" : "Landskapsarkitektur",
    "annotation-id" : 10
  }, {
    "preferred-label" : "Stockholm",
    "type" : "municipality",
    "start-position" : 40,
    "end-position" : 49,
    "concept-id" : "AvNB_uwa_6n6",
    "matched-string" : "Stockholm",
    "annotation-id" : 11
  }, {
    "preferred-label" : "landskapsarkitektur",
    "type" : "esco-skill",
    "start-position" : 151,
    "end-position" : 170,
    "concept-id" : "VryZ_dNm_o4a",
    "matched-string" : "landskapsarkitektur",
    "annotation-id" : 12
  }, {
    "preferred-label" : "Personalansvar",
    "sentiment" : "MUST_HAVE",
    "type" : "skill",
    "start-position" : 213,
    "end-position" : 227,
    "concept-id" : "ZzN5_m7B_5CY",
    "matched-string" : "personalansvar",
    "annotation-id" : 0
  }, {
    "preferred-label" : "Landskapsarkitekter",
    "sentiment" : "MUST_HAVE",
    "type" : "ssyk-level-4",
    "start-position" : 236,
    "end-position" : 255,
    "concept-id" : "ETAR_ggZ_Wuw",
    "matched-string" : "landskapsarkitekter",
    "annotation-id" : 1
  }, {
    "preferred-label" : "Stockholm",
    "type" : "municipality",
    "start-position" : 258,
    "end-position" : 267,
    "concept-id" : "AvNB_uwa_6n6",
    "matched-string" : "Stockholm",
    "annotation-id" : 13
  }, {
    "preferred-label" : "Personal",
    "sentiment" : "MUST_HAVE",
    "type" : "keyword",
    "start-position" : 572,
    "end-position" : 580,
    "concept-id" : "HVxM_6MS_y1c",
    "matched-string" : "personal",
    "annotation-id" : 2
  }, {
    "preferred-label" : "Kontor",
    "sentiment" : "MUST_HAVE",
    "type" : "keyword",
    "start-position" : 845,
    "end-position" : 851,
    "concept-id" : "Hyz1_7HF_AkP",
    "matched-string" : "kontor",
    "annotation-id" : 3
  }, {
    "preferred-label" : "Resor i arbetet förekommer",
    "type" : "work-place-environment",
    "start-position" : 856,
    "end-position" : 883,
    "concept-id" : "oaM2_JTK_muh",
    "matched-string" : "resor i tjänsten förekommer",
    "annotation-id" : 14
  }, {
    "preferred-label" : "landskapsarkitektur",
    "type" : "esco-skill",
    "start-position" : 1295,
    "end-position" : 1314,
    "concept-id" : "VryZ_dNm_o4a",
    "matched-string" : "landskapsarkitektur",
    "annotation-id" : 15
  }, {
    "preferred-label" : "Eftergymnasial utbildning",
    "sentiment" : "MUST_HAVE",
    "type" : "sni-level-3",
    "start-position" : 1380,
    "end-position" : 1405,
    "concept-id" : "bg6r_KVf_KNN",
    "matched-string" : "eftergymnasial utbildning",
    "annotation-id" : 5
  }, {
    "preferred-label" : "landskapsarkitektur",
    "type" : "esco-skill",
    "start-position" : 1411,
    "end-position" : 1430,
    "concept-id" : "VryZ_dNm_o4a",
    "matched-string" : "landskapsarkitektur",
    "annotation-id" : 16
  }, {
    "preferred-label" : "5 års erfarenhet eller mer",
    "type" : "occupation-experience-year",
    "start-position" : 1446,
    "end-position" : 1466,
    "concept-id" : "8CVf_zRX_aZj",
    "matched-string" : "arbetat minst fem år",
    "annotation-id" : 17
  }, {
    "preferred-label" : "arbeta självständigt",
    "type" : "esco-skill",
    "start-position" : 1637,
    "end-position" : 1657,
    "concept-id" : "NyFu_HHd_zhz",
    "matched-string" : "arbeta självständigt",
    "annotation-id" : 18
  }, {
    "preferred-label" : "landskapsarkitektur",
    "type" : "esco-skill",
    "start-position" : 1834,
    "end-position" : 1853,
    "concept-id" : "VryZ_dNm_o4a",
    "matched-string" : "landskapsarkitektur",
    "annotation-id" : 19
  }, {
    "preferred-label" : "Stockholm",
    "type" : "municipality",
    "start-position" : 1861,
    "end-position" : 1870,
    "concept-id" : "AvNB_uwa_6n6",
    "matched-string" : "Stockholm",
    "annotation-id" : 20
  }, {
    "preferred-label" : "Sverige",
    "type" : "country",
    "start-position" : 1885,
    "end-position" : 1892,
    "concept-id" : "i46j_HmG_v64",
    "matched-string" : "Sverige",
    "annotation-id" : 21
  }, {
    "preferred-label" : "Sverige",
    "type" : "country",
    "start-position" : 2137,
    "end-position" : 2144,
    "concept-id" : "i46j_HmG_v64",
    "matched-string" : "Sverige",
    "annotation-id" : 22
  }, {
    "preferred-label" : "Kontor",
    "sentiment" : "MUST_HAVE",
    "type" : "keyword",
    "start-position" : 2190,
    "end-position" : 2196,
    "concept-id" : "Hyz1_7HF_AkP",
    "matched-string" : "kontor",
    "annotation-id" : 6
  }, {
    "preferred-label" : "landskapsarkitektur",
    "type" : "esco-skill",
    "start-position" : 3338,
    "end-position" : 3357,
    "concept-id" : "VryZ_dNm_o4a",
    "matched-string" : "landskapsarkitektur",
    "annotation-id" : 23
  }, {
    "preferred-label" : "Sverige",
    "type" : "country",
    "start-position" : 3360,
    "end-position" : 3367,
    "concept-id" : "i46j_HmG_v64",
    "matched-string" : "Sverige",
    "annotation-id" : 24
  }, {
    "preferred-label" : "Marknadsföring",
    "sentiment" : "MUST_HAVE",
    "type" : "sun-education-field-4",
    "start-position" : 3857,
    "end-position" : 3871,
    "concept-id" : "zTc5_e4U_Qsf",
    "matched-string" : "marknadsföring",
    "annotation-id" : 9
  } ],
  "text" : "Gruppchef inom Landskapsarkitektur till Stockholm\nVill du jobba i ett internationellt företag under tillväxt? Nu utökar vi och söker en gruppchef inom landskapsarkitektur!\nOm jobbet\nSom gruppchef kommer du att ha personalansvar för två landskapsarkitekter i Stockholm, en grupp du kommer att vara med och utöka.\nTillsammans med regionchef och i samarbete med dina gruppchefskollegor inom väg & gata och miljö kommer du att fortsätta utveckla och bygga upp verksamheten. Som alla våra chefer kommer du också att arbeta i uppdrag inom ditt område.\nAtt leda och utveckla din personal är viktiga delar i ditt arbete såväl som att utveckla verksamheten framåt. Som gruppchef kommer du att ansvara för:\nresursplanering\nmarknad och anbud inom ditt område\nrekrytering och utveckling av dina medarbetare.\n\nDu kommer ha ett nära samarbete med våra övriga kontor och resor i tjänsten förekommer emellanåt.\nOm dig\nVi söker dig som trivs med ett arbete där du får möjlighet att utveckla arbetet och verksamheten framåt.\nGenom ditt ledarskap får du andra att utvecklas. Du är inspirerande och bidrar till nytänkande och förändring. Ditt sätt att möta människor med värme, energi och respekt skapar entusiasm och arbetsglädje hos dina medarbetare, kollegor och kunder.\nVi söker dig som har goda kunskaper inom landskapsarkitektur gärna med fokus på transportinfrastruktur. Vi tror att du har en eftergymnasial utbildning inom landskapsarkitektur och att du har arbetat minst fem år inom området. Vi ser gärna att du haft en ledande roll och har du arbetet som chef är det en merit.\nDu arbetar bra tillsammans med andra samtidigt som du har förmåga att arbeta självständigt. Du trivs i en roll där du får dela med dig av din kunskap och fungera som coach åt andra.\nVårt erbjudande\nVi erbjuder en möjlighet att vara med och utveckla verksamheten inom landskapsarkitektur i både Stockholm och resten av Sverige. Vi är ett kraftigt expanderande internationellt företag. Du blir en viktig del av vår verksamhet, vi är öppna för nya idéer och du har stora möjligheter att påverka utvecklingen framåt. Du kommer att få möjlighet att jobba med kollegor i hela Sverige såväl som i andra länder. Du utgår från vårt kontor i Kista science Tower där vi sitter tillsammans med kollegor både inom det egna och övriga affärsområden.\nHos oss är du med och utvecklar innovativa och hållbara lösningar. På SYSTRA deltar du i skapandet av ett hållbart samhälle genom att arbeta i en organisation som tar ansvar för miljön, projekten, medarbetarna och som skapar verklighet av sina visioner.\nPå SYSTRA vet vi att det är medarbetarnas olikheter som får organisationen att växa. Vi lägger därför stor vikt vid dina personliga egenskaper och eftersträvar en mångfald på arbetsplatsen.\nOm SYSTRA\nSYSTRA är ett internationellt företag med 9 000 anställda runtom i världen. Vi är en av världens ledande aktörer inom infrastrukturlösningar inom transportinfrastruktur så som höghastighetsjärnväg, tunnelbana, spårväg, väg & trafik. Vi har bland annat designat 50 procent av världens byggda och planerade höghastighetsjärnvägar, automatiserade metro och tunnelbanor.\nSYSTRA AB har funnits i sin nuvarande form sedan 2018 och har under den perioden vuxit från 50 till 250 medarbetare, en expansion vi ser kommer att fortsätta de närmaste åren. Vi är idag 8 medarbetare inom området landskapsarkitektur i Sverige. Läs gärna mer om oss på vår hemsida www.systra.se.\nAnsökan\nVarmt välkommen med din ansökan. Urval kan komma att ske löpande. Du ansöker om jobbet här: https://jobs.systra.com/job/Stockholm-Gruppchef-inom-Landskapsarkitektur-till-Stockholm/814117301/\nVälkommen att höra av dig om du är intresserad och vill veta mer\nRegionchef Civil Öst & Mitt Mattias Källander\n070-395 69 36\nmkallander@systra.com\nInför rekryteringsarbetet har SYSTRA noggrant tagit ställning till rekryteringskanaler och marknadsföring. Vi undanber oss därför bestämt kontakt med mediesäljare, rekryteringssajter eller liknande."
}