{
  "meta" : {
    "jobad" : {
      "description" : {
        "requirements" : null,
        "needs" : null,
        "company_information" : null,
        "text_formatted" : "<p><strong>Beskrivning av tjänsten:</strong></p><ul><li>Swed Com söker två diskare till en restaurang belägen i Centrala Stockholm.  </li><li>Som diskare är det viktigt att du är flexibel, stresståligt och samtidigt har en mycket god energi att sprida. </li><li>Din arbetsuppgift består av att diska, hålla rent i restaurangen, torka av bord samt vara behjälplig att duka fram tallrikar.</li></ul><p><strong>Anställning, arbetstider och lön:</strong></p><ul><li>Anställningen börjar med en provanställning med möjlighet till en tillsvidareanställning.</li><li>Tjänsten är på heltid. </li><li>Arbetet är förlagd både på helger och vardagar med varierande arbetstider. </li></ul><p><strong>Ansökningsalternativ:</strong></p><ul><li>Du är mer än välkommen att skicka ditt CV och personliga brev till oss via mejl: info@swedcom.se</li><li>Markera gärna din ansökan med \"\"Diskare Centrala Stockholm\".</li><li>Varmt välkomna med era ansökningar.</li></ul><p><strong>Observera:</strong></p><ul><li>Läs gärna noga annonsen innan ni skickar mejl/ringer.</li></ul><p><br></p><p id=\"oppenforalla\">Öppen för alla\nVi fokuserar på din kompetens, inte dina övriga förutsättningar. Vi är öppna för att anpassa rollen eller arbetsplatsen efter dina behov.</p>",
        "conditions" : null,
        "text" : "Beskrivning av tjänsten:\nSwed Com söker två diskare till en restaurang belägen i Centrala Stockholm.  \nSom diskare är det viktigt att du är flexibel, stresståligt och samtidigt har en mycket god energi att sprida. \nDin arbetsuppgift består av att diska, hålla rent i restaurangen, torka av bord samt vara behjälplig att duka fram tallrikar.\n\nAnställning, arbetstider och lön:\nAnställningen börjar med en provanställning med möjlighet till en tillsvidareanställning.\nTjänsten är på heltid. \nArbetet är förlagd både på helger och vardagar med varierande arbetstider. \n\nAnsökningsalternativ:\nDu är mer än välkommen att skicka ditt CV och personliga brev till oss via mejl: info@swedcom.se\nMarkera gärna din ansökan med \"\"Diskare Centrala Stockholm\".\nVarmt välkomna med era ansökningar.\n\nObservera:\nLäs gärna noga annonsen innan ni skickar mejl/ringer.\n\n\n\nÖppen för alla\nVi fokuserar på din kompetens, inte dina övriga förutsättningar. Vi är öppna för att anpassa rollen eller arbetsplatsen efter dina behov."
      },
      "headline" : "Diskare sökes!",
      "driving_license" : null,
      "employer" : {
        "email" : null,
        "phone_number" : null,
        "organization_number" : "5592849482",
        "name" : "Swed Com AB",
        "url" : "www.swedcom.se",
        "workplace" : "Swed Com AB"
      },
      "removed_date" : null,
      "logo_url" : "https://www.arbetsformedlingen.se/rest/arbetsgivare/rest/af/v3/arbetsplatser/88157976/logotyper/logo.png",
      "last_publication_date" : "2022-09-30T00:00:00",
      "number_of_vacancies" : 2,
      "occupation" : {
        "concept_id" : "pKTY_Kwu_sUw",
        "label" : "Diskare",
        "legacy_ams_taxonomy_id" : "5556"
      },
      "occupation_group" : {
        "concept_id" : "tPox_ie4_X9X",
        "label" : "Restaurang- och köksbiträden m.fl.",
        "legacy_ams_taxonomy_id" : "9412"
      },
      "employment_type" : {
        "concept_id" : "PFZr_Syz_cUq",
        "label" : "Vanlig anställning",
        "legacy_ams_taxonomy_id" : "1"
      },
      "webpage_url" : "https://arbetsformedlingen.se/platsbanken/annonser/26433268",
      "driving_license_required" : false,
      "application_contacts" : [ {
        "description" : null,
        "email" : null,
        "telephone" : "076 084 84 88",
        "name" : "Maya  Mahmodi",
        "contact_type" : "Rekryteringsansvarig"
      } ],
      "duration" : {
        "concept_id" : "qQUd_4qe_NDT",
        "label" : "6 månader eller längre",
        "legacy_ams_taxonomy_id" : "2"
      },
      "nice_to_have" : {
        "education_level" : [ ],
        "work_experiences" : [ {
          "concept_id" : "pKTY_Kwu_sUw",
          "weight" : 5,
          "label" : "Diskare",
          "legacy_ams_taxonomy_id" : "5556"
        } ],
        "skills" : [ ],
        "education" : [ ],
        "languages" : [ ]
      },
      "application_details" : {
        "via_af" : false,
        "email" : "info@swedcom.se",
        "other" : null,
        "reference" : "\"Diskare Centrala Stockholm\"",
        "url" : null,
        "information" : null
      },
      "source_type" : "VIA_ANNONSERA",
      "application_deadline" : "2022-09-30T00:00:00",
      "external_id" : null,
      "workplace_address" : {
        "coordinates" : [ 18.057236866538496, 59.33239994089146 ],
        "city" : "STOCKHOLM",
        "postcode" : "11120",
        "municipality" : "Stockholm",
        "region_concept_id" : "CifL_Rzy_Mku",
        "region" : "Stockholms län",
        "country_code" : "199",
        "region_code" : "01",
        "municipality_concept_id" : "AvNB_uwa_6n6",
        "country_concept_id" : "i46j_HmG_v64",
        "municipality_code" : "0180",
        "street_address" : null,
        "country" : "Sverige"
      },
      "id" : "26433268",
      "experience_required" : true,
      "working_hours_type" : {
        "concept_id" : "6YE1_gAC_R2G",
        "label" : "Heltid",
        "legacy_ams_taxonomy_id" : "1"
      },
      "access" : null,
      "timestamp" : 1660919270285,
      "must_have" : {
        "education_level" : [ ],
        "work_experiences" : [ ],
        "skills" : [ ],
        "education" : [ ],
        "languages" : [ ]
      },
      "occupation_field" : {
        "concept_id" : "ScKy_FHB_7wT",
        "label" : "Hotell, restaurang, storhushåll",
        "legacy_ams_taxonomy_id" : "7"
      },
      "scope_of_work" : {
        "min" : 0,
        "max" : 100
      },
      "salary_type" : {
        "concept_id" : "oG8G_9cW_nRf",
        "label" : "Fast månads- vecko- eller timlön",
        "legacy_ams_taxonomy_id" : "1"
      },
      "removed" : false,
      "salary_description" : null,
      "access_to_own_car" : false,
      "publication_date" : "2022-08-19T16:27:50"
    },
    "name" : "Diskare sökes!",
    "user" : "hannes"
  },
  "sha1" : "257761d45e1c3ef552fe2bb78d6774d1c41dda0a",
  "annotations" : [ {
    "preferred-label" : "Diskare",
    "sentiment" : "MUST_HAVE",
    "type" : "occupation-name",
    "start-position" : 0,
    "end-position" : 7,
    "concept-id" : "pKTY_Kwu_sUw",
    "matched-string" : "diskare",
    "annotation-id" : 0
  }, {
    "preferred-label" : "Diskare",
    "sentiment" : "MUST_HAVE",
    "type" : "occupation-name",
    "start-position" : 59,
    "end-position" : 66,
    "concept-id" : "pKTY_Kwu_sUw",
    "matched-string" : "diskare",
    "annotation-id" : 2
  }, {
    "preferred-label" : "Restaurang",
    "sentiment" : "NOT_RELEVANT",
    "type" : "keyword",
    "start-position" : 75,
    "end-position" : 85,
    "concept-id" : "o2Cg_3Ap_qvK",
    "matched-string" : "restaurang",
    "annotation-id" : 3
  }, {
    "preferred-label" : "Diskare",
    "sentiment" : "NOT_RELEVANT",
    "type" : "occupation-name",
    "start-position" : 122,
    "end-position" : 129,
    "concept-id" : "pKTY_Kwu_sUw",
    "matched-string" : "diskare",
    "annotation-id" : 4
  }, {
    "preferred-label" : "Tillsvidareanställning (inkl. eventuell provanställning)",
    "sentiment" : "OFFERED",
    "type" : "employment-type",
    "start-position" : 457,
    "end-position" : 479,
    "concept-id" : "kpPX_CNN_gDU",
    "matched-string" : "tillsvidareanställning",
    "annotation-id" : 6
  }, {
    "preferred-label" : "Heltid",
    "sentiment" : "OFFERED",
    "type" : "worktime-extent",
    "start-position" : 496,
    "end-position" : 502,
    "concept-id" : "6YE1_gAC_R2G",
    "matched-string" : "heltid",
    "annotation-id" : 7
  }, {
    "preferred-label" : "Diskare",
    "sentiment" : "NOT_RELEVANT",
    "type" : "occupation-name",
    "start-position" : 733,
    "end-position" : 740,
    "concept-id" : "pKTY_Kwu_sUw",
    "matched-string" : "diskare",
    "annotation-id" : 5
  } ],
  "text" : "Diskare sökes!\nBeskrivning av tjänsten:\nSwed Com söker två diskare till en restaurang belägen i Centrala Stockholm.  \nSom diskare är det viktigt att du är flexibel, stresståligt och samtidigt har en mycket god energi att sprida. \nDin arbetsuppgift består av att diska, hålla rent i restaurangen, torka av bord samt vara behjälplig att duka fram tallrikar.\n\nAnställning, arbetstider och lön:\nAnställningen börjar med en provanställning med möjlighet till en tillsvidareanställning.\nTjänsten är på heltid. \nArbetet är förlagd både på helger och vardagar med varierande arbetstider. \n\nAnsökningsalternativ:\nDu är mer än välkommen att skicka ditt CV och personliga brev till oss via mejl: info@swedcom.se\nMarkera gärna din ansökan med \"\"Diskare Centrala Stockholm\".\nVarmt välkomna med era ansökningar.\n\nObservera:\nLäs gärna noga annonsen innan ni skickar mejl/ringer.\n\n\n\nÖppen för alla\nVi fokuserar på din kompetens, inte dina övriga förutsättningar. Vi är öppna för att anpassa rollen eller arbetsplatsen efter dina behov."
}