{
  "meta" : {
    "jobad" : {
      "description" : {
        "requirements" : null,
        "needs" : null,
        "company_information" : null,
        "text_formatted" : "<p>Vi söker en noggrann, lojal, service inriktad snickare som vill bli en del i vårt team, tjänsten kommer att vara varierande och är ett socialt jobb som kräver att du är punktlig, villig att lösa problem, lojal, flexibel, gillar att planera och lägga upp sina egna dagar och verkligen brinner för det vi gör, tror du att detta kan vara något för dig är du välkommen att ringa</p><p> Janne 0723288777 mellan 8.00-16.00 vardagar</p>",
        "conditions" : null,
        "text" : "Vi söker en noggrann, lojal, service inriktad snickare som vill bli en del i vårt team, tjänsten kommer att vara varierande och är ett socialt jobb som kräver att du är punktlig, villig att lösa problem, lojal, flexibel, gillar att planera och lägga upp sina egna dagar och verkligen brinner för det vi gör, tror du att detta kan vara något för dig är du välkommen att ringa\n Janne 0723288777 mellan 8.00-16.00 vardagar"
      },
      "headline" : "SNICKARE STOCKHOLM",
      "driving_license" : null,
      "employer" : {
        "email" : null,
        "phone_number" : null,
        "organization_number" : "5592478019",
        "name" : "Zelda Bygg & Design AB",
        "url" : null,
        "workplace" : "Zelda Bygg & Design AB"
      },
      "removed_date" : null,
      "logo_url" : "https://www.arbetsformedlingen.se/rest/arbetsgivare/rest/af/v3/arbetsplatser/87901546/logotyper/logo.png",
      "last_publication_date" : "2022-09-05T23:59:59",
      "number_of_vacancies" : 2,
      "occupation" : {
        "concept_id" : "4Z7F_oBG_vMG",
        "label" : "Träarbetare/Snickare",
        "legacy_ams_taxonomy_id" : "6581"
      },
      "occupation_group" : {
        "concept_id" : "9mJN_VwW_Xjg",
        "label" : "Träarbetare, snickare m.fl.",
        "legacy_ams_taxonomy_id" : "7111"
      },
      "employment_type" : {
        "concept_id" : "PFZr_Syz_cUq",
        "label" : "Vanlig anställning",
        "legacy_ams_taxonomy_id" : "1"
      },
      "webpage_url" : "https://arbetsformedlingen.se/platsbanken/annonser/26176537",
      "driving_license_required" : false,
      "application_contacts" : [ ],
      "duration" : {
        "concept_id" : "a7uU_j21_mkL",
        "label" : "Tills vidare",
        "legacy_ams_taxonomy_id" : "1"
      },
      "nice_to_have" : {
        "education_level" : [ ],
        "work_experiences" : [ {
          "concept_id" : "4Z7F_oBG_vMG",
          "weight" : 5,
          "label" : "Träarbetare/Snickare",
          "legacy_ams_taxonomy_id" : "6581"
        } ],
        "skills" : [ ],
        "education" : [ ],
        "languages" : [ ]
      },
      "application_details" : {
        "via_af" : false,
        "email" : null,
        "other" : "telefon dagtid",
        "reference" : null,
        "url" : null,
        "information" : null
      },
      "source_type" : "VIA_ANNONSERA",
      "application_deadline" : "2022-09-05T23:59:59",
      "external_id" : null,
      "workplace_address" : {
        "coordinates" : [ 17.998135316090526, 59.3558134699855 ],
        "city" : "Solna",
        "postcode" : "17144",
        "municipality" : "Solna",
        "region_concept_id" : "CifL_Rzy_Mku",
        "region" : "Stockholms län",
        "country_code" : "199",
        "region_code" : "01",
        "municipality_concept_id" : "zHxw_uJZ_NJ8",
        "country_concept_id" : "i46j_HmG_v64",
        "municipality_code" : "0184",
        "street_address" : "Skytteholmsvägen 7 A",
        "country" : "Sverige"
      },
      "id" : "26176537",
      "experience_required" : true,
      "working_hours_type" : {
        "concept_id" : "6YE1_gAC_R2G",
        "label" : "Heltid",
        "legacy_ams_taxonomy_id" : "1"
      },
      "access" : null,
      "timestamp" : 1655912465779,
      "must_have" : {
        "education_level" : [ ],
        "work_experiences" : [ ],
        "skills" : [ ],
        "education" : [ ],
        "languages" : [ ]
      },
      "occupation_field" : {
        "concept_id" : "j7Cq_ZJe_GkT",
        "label" : "Bygg och anläggning",
        "legacy_ams_taxonomy_id" : "2"
      },
      "scope_of_work" : {
        "min" : 0,
        "max" : 100
      },
      "salary_type" : {
        "concept_id" : "oG8G_9cW_nRf",
        "label" : "Fast månads- vecko- eller timlön",
        "legacy_ams_taxonomy_id" : "1"
      },
      "removed" : false,
      "salary_description" : null,
      "access_to_own_car" : false,
      "publication_date" : "2022-07-04T00:00:00"
    },
    "name" : "SNICKARE STOCKHOLM",
    "user" : "hannes"
  },
  "sha1" : "0e3a578a7519fd2d16a1e27dbb2c4dfc2ca2f61f",
  "annotations" : [ {
    "preferred-label" : "snickare",
    "sentiment" : "MUST_HAVE",
    "type" : "esco-occupation",
    "start-position" : 0,
    "end-position" : 8,
    "concept-id" : "qhAJ_Euo_tNx",
    "matched-string" : "snickare",
    "annotation-id" : 0
  }, {
    "preferred-label" : "noggrannhet",
    "type" : "esco-skill",
    "start-position" : 31,
    "end-position" : 39,
    "concept-id" : "mrsW_EkL_KRD",
    "matched-string" : "noggrann",
    "annotation-id" : 2
  }, {
    "preferred-label" : "snickare",
    "sentiment" : "MUST_HAVE",
    "type" : "esco-occupation",
    "start-position" : 65,
    "end-position" : 73,
    "concept-id" : "qhAJ_Euo_tNx",
    "matched-string" : "snickare",
    "annotation-id" : 1
  } ],
  "text" : "SNICKARE STOCKHOLM\nVi söker en noggrann, lojal, service inriktad snickare som vill bli en del i vårt team, tjänsten kommer att vara varierande och är ett socialt jobb som kräver att du är punktlig, villig att lösa problem, lojal, flexibel, gillar att planera och lägga upp sina egna dagar och verkligen brinner för det vi gör, tror du att detta kan vara något för dig är du välkommen att ringa\n Janne 0723288777 mellan 8.00-16.00 vardagar"
}