{
  "meta" : {
    "jobad" : {
      "description" : {
        "requirements" : null,
        "needs" : null,
        "company_information" : null,
        "text_formatted" : "<p>Idrottsfoto Fotograferar Lagbilder och spelarporträtt ute bland föreningar och förbund, </p><p>tillsammans med våra leverantörer producerar och levererar vi bilder, från knatte till elit.</p><p><br></p><p>Vårt mål är genom vår kvalité och kompetens vara ledande på Sverigemarknaden och </p><p>vara föreningars förstaval gällande Lag- samt individuell fotografering. </p><p><br></p><p>Då tjänsten ställer höga krav på flexibilitet, noggrannhet och punktlighet, tror vi att du som söker besitter dessa egenskaper. Vi tror dessutom att du är en lagspelare med idrottsbakgrund som har lätt för att samarbeta och är positiv till ditt sätt.</p><p> Vi söker fotografer som skall fotografera lagbilder och spelarporträtt ute bland idrottsföreningar och är intresserade av idrott. Arbetet sker em/kväll och helger.</p><p>Har man själv utövat någon lagidrott är det en merit.</p><p>Då tjänsten ställer höga krav på flexibilitet, noggrannhet och punktlighet, tror vi att du som söker besitter dessa egenskaper. </p><p>Vi tror dessutom att du är en lagspelare som har lätt för att samarbeta och är positiv till ditt sätt.</p>",
        "conditions" : null,
        "text" : "Idrottsfoto Fotograferar Lagbilder och spelarporträtt ute bland föreningar och förbund, \ntillsammans med våra leverantörer producerar och levererar vi bilder, från knatte till elit.\n\n\nVårt mål är genom vår kvalité och kompetens vara ledande på Sverigemarknaden och \nvara föreningars förstaval gällande Lag- samt individuell fotografering. \n\n\nDå tjänsten ställer höga krav på flexibilitet, noggrannhet och punktlighet, tror vi att du som söker besitter dessa egenskaper. Vi tror dessutom att du är en lagspelare med idrottsbakgrund som har lätt för att samarbeta och är positiv till ditt sätt.\n Vi söker fotografer som skall fotografera lagbilder och spelarporträtt ute bland idrottsföreningar och är intresserade av idrott. Arbetet sker em/kväll och helger.\nHar man själv utövat någon lagidrott är det en merit.\nDå tjänsten ställer höga krav på flexibilitet, noggrannhet och punktlighet, tror vi att du som söker besitter dessa egenskaper. \nVi tror dessutom att du är en lagspelare som har lätt för att samarbeta och är positiv till ditt sätt."
      },
      "headline" : "Fotograf Idrottsfoto",
      "driving_license" : [ {
        "concept_id" : "VTK8_WRx_GcM",
        "label" : "B",
        "legacy_ams_taxonomy_id" : "3"
      } ],
      "employer" : {
        "email" : null,
        "phone_number" : null,
        "organization_number" : "5563387884",
        "name" : "Idrott & Reklamfoto Pelle Börjesson AB",
        "url" : "http://www.idrottsfoto.com",
        "workplace" : "Idrott & Reklamfoto Pelle Börjesson AB"
      },
      "removed_date" : null,
      "logo_url" : null,
      "last_publication_date" : "2022-08-18T23:59:59",
      "number_of_vacancies" : 2,
      "occupation" : {
        "concept_id" : "1N2U_6xW_Tdx",
        "label" : "Fotograf",
        "legacy_ams_taxonomy_id" : "4790"
      },
      "occupation_group" : {
        "concept_id" : "3J38_DNz_YKK",
        "label" : "Fotografer",
        "legacy_ams_taxonomy_id" : "3431"
      },
      "employment_type" : {
        "concept_id" : "PFZr_Syz_cUq",
        "label" : "Vanlig anställning",
        "legacy_ams_taxonomy_id" : "1"
      },
      "webpage_url" : "https://arbetsformedlingen.se/platsbanken/annonser/26355055",
      "driving_license_required" : true,
      "application_contacts" : [ ],
      "duration" : {
        "concept_id" : "Xj7x_7yZ_jEn",
        "label" : "3 månader – upp till 6 månader",
        "legacy_ams_taxonomy_id" : "3"
      },
      "nice_to_have" : {
        "education_level" : [ ],
        "work_experiences" : [ {
          "concept_id" : "1N2U_6xW_Tdx",
          "weight" : 5,
          "label" : "Fotograf",
          "legacy_ams_taxonomy_id" : "4790"
        } ],
        "skills" : [ ],
        "education" : [ ],
        "languages" : [ ]
      },
      "application_details" : {
        "via_af" : false,
        "email" : "pelle@idrottsfoto.com",
        "other" : null,
        "reference" : "Ansökan Fotograf",
        "url" : null,
        "information" : null
      },
      "source_type" : "VIA_ANNONSERA",
      "application_deadline" : "2022-08-18T23:59:59",
      "external_id" : null,
      "workplace_address" : {
        "coordinates" : [ 17.99282667519373, 59.24969183172009 ],
        "city" : "HUDDINGE",
        "postcode" : "14143",
        "municipality" : "Huddinge",
        "region_concept_id" : "CifL_Rzy_Mku",
        "region" : "Stockholms län",
        "country_code" : "199",
        "region_code" : "01",
        "municipality_concept_id" : "g1Gc_aXK_EKu",
        "country_concept_id" : "i46j_HmG_v64",
        "municipality_code" : "0126",
        "street_address" : "STAMBANEVÄGEN 63",
        "country" : "Sverige"
      },
      "id" : "26355055",
      "experience_required" : true,
      "working_hours_type" : {
        "concept_id" : "947z_JGS_Uk2",
        "label" : "Deltid",
        "legacy_ams_taxonomy_id" : "2"
      },
      "access" : null,
      "timestamp" : 1658836710283,
      "must_have" : {
        "education_level" : [ ],
        "work_experiences" : [ ],
        "skills" : [ ],
        "education" : [ ],
        "languages" : [ ]
      },
      "occupation_field" : {
        "concept_id" : "9puE_nYg_crq",
        "label" : "Kultur, media, design",
        "legacy_ams_taxonomy_id" : "11"
      },
      "scope_of_work" : {
        "min" : 60,
        "max" : 80
      },
      "salary_type" : {
        "concept_id" : "oG8G_9cW_nRf",
        "label" : "Fast månads- vecko- eller timlön",
        "legacy_ams_taxonomy_id" : "1"
      },
      "removed" : false,
      "salary_description" : null,
      "access_to_own_car" : false,
      "publication_date" : "2022-07-26T13:58:30"
    },
    "name" : "Fotograf Idrottsfoto",
    "user" : "kristof.fischer"
  },
  "sha1" : "41d844f4d243fa8f4664690f97e6b6a0e2bb9afb",
  "annotations" : [ {
    "preferred-label" : "Fotograf",
    "sentiment" : "MUST_HAVE",
    "type" : "occupation-name",
    "start-position" : 0,
    "end-position" : 8,
    "concept-id" : "1N2U_6xW_Tdx",
    "matched-string" : "fotograf",
    "annotation-id" : 0
  }, {
    "preferred-label" : "noggrannhet",
    "sentiment" : "MUST_HAVE",
    "type" : "esco-skill",
    "start-position" : 410,
    "end-position" : 421,
    "concept-id" : "mrsW_EkL_KRD",
    "matched-string" : "noggrannhet",
    "annotation-id" : 4
  }, {
    "preferred-label" : "Fotograf",
    "sentiment" : "MUST_HAVE",
    "type" : "occupation-name",
    "start-position" : 624,
    "end-position" : 634,
    "concept-id" : "1N2U_6xW_Tdx",
    "matched-string" : "fotografer",
    "annotation-id" : 2
  }, {
    "preferred-label" : "Idrott",
    "sentiment" : "MUST_HAVE",
    "type" : "keyword",
    "start-position" : 737,
    "end-position" : 743,
    "concept-id" : "QV1z_Wdx_HaM",
    "matched-string" : "idrott",
    "annotation-id" : 3
  }, {
    "preferred-label" : "utöva idrott",
    "sentiment" : "NICE_TO_HAVE",
    "type" : "esco-skill",
    "start-position" : 806,
    "end-position" : 815,
    "concept-id" : "quXb_9cH_NPC",
    "matched-string" : "lagidrott",
    "annotation-id" : 5
  }, {
    "preferred-label" : "noggrannhet",
    "sentiment" : "MUST_HAVE",
    "type" : "esco-skill",
    "start-position" : 880,
    "end-position" : 891,
    "concept-id" : "mrsW_EkL_KRD",
    "matched-string" : "noggrannhet",
    "annotation-id" : 6
  }, {
    "preferred-label" : "samarbeta med kolleger",
    "sentiment" : "MUST_HAVE",
    "type" : "esco-skill",
    "start-position" : 1024,
    "end-position" : 1033,
    "concept-id" : "X15R_797_q62",
    "matched-string" : "samarbeta",
    "annotation-id" : 7
  } ],
  "text" : "Fotograf Idrottsfoto\nIdrottsfoto Fotograferar Lagbilder och spelarporträtt ute bland föreningar och förbund, \ntillsammans med våra leverantörer producerar och levererar vi bilder, från knatte till elit.\n\n\nVårt mål är genom vår kvalité och kompetens vara ledande på Sverigemarknaden och \nvara föreningars förstaval gällande Lag- samt individuell fotografering. \n\n\nDå tjänsten ställer höga krav på flexibilitet, noggrannhet och punktlighet, tror vi att du som söker besitter dessa egenskaper. Vi tror dessutom att du är en lagspelare med idrottsbakgrund som har lätt för att samarbeta och är positiv till ditt sätt.\n Vi söker fotografer som skall fotografera lagbilder och spelarporträtt ute bland idrottsföreningar och är intresserade av idrott. Arbetet sker em/kväll och helger.\nHar man själv utövat någon lagidrott är det en merit.\nDå tjänsten ställer höga krav på flexibilitet, noggrannhet och punktlighet, tror vi att du som söker besitter dessa egenskaper. \nVi tror dessutom att du är en lagspelare som har lätt för att samarbeta och är positiv till ditt sätt."
}