{
  "meta" : {
    "jobad" : {
      "description" : {
        "requirements" : null,
        "needs" : null,
        "company_information" : null,
        "text_formatted" : "Kom och jobba med oss på Torekov Hotell. Här får du arbeta i ett tajt team med höga ambitioner, fina råvaror från våra lokala leverantörer runtom på Bjärehalvön och smakinspiration från det asiatiska köket. Start omgående eller efter överenskommelse. Personalboende finns. \nVi söker dig som:\n\n • kan erbjuda goda referenser\n • gillar att arbeta med fantastiska råvaror i en fantastisk miljö\n • har en stark känsla för kvalitet\n • kan arbeta självständigt och i team för att nå egna och företagets mål\n • är en social, glad, energigivande och öppen person\n • tycker om ett högt tempo\nOm oss:\nBistron är hjärtat i Torekov Hotells verksamhet och vi är extremt stolta över vad vi presterar här i form av matupplevelser och service.\nBistron har öppet för hotellgäster, konferensgrupper och lokalbefolkning. Vi serverar frukost, fika, lunch, gör fantastiska picknickar till gäster som skall ut och vandra på vackra Bjäre, fika, loungemeny samt magiska menyer och à la carte på kvällen.\n \nHär på landet i utkanten av Torekov är vi granne och kompis med våra lokala producenter. Bjärekycklingen är klimatcertifierad, lammet har vuxit upp på Lindegrens gård och Torekovsparrisen är en historia i sig.\n \nVarför ska du jobba hos oss?\nI det här arbetet kan vi erbjuda dig bland annat:\n\n • gemenskap och härligt team\n • utvecklingsmöjligheter\n • generösa förmåner på koncernens anläggningar\n • erfarna ledare, kollektivavtal, ordning och reda\n • arbeta med härliga gäster och mycket sociala möten\nArbetstider och omfattning:\nAnställningstyp: (80 %)\nArbetstider: Varierande arbetstid (vardagar och helger) främst dagtid.\nTillträde: Augusti 2022\nLön: Enligt överenskommelse.\n \nAnsökan:\nVälkommen att skicka in din ansökan via knappen nedan. Urval och intervjuer sker löpande, så vänta inte med att ansöka. \n\n\nLängst ut på undersköna Bjärehalvön ligger Torekov Hotell. Här blir luften klarare, tankarna lättare, axlarna sänks. Varje rum och svit har en egen terrass, Bistron serverar närodlat och gärna kravmärkt, tennisbanorna och utegymmet lockar till utomhusträning. Hotellet är en del av GRAM Group och självklart är hela hotellet Svanenmärkt.\nwww.torekovhotell.se | www.gramgroup.se",
        "conditions" : "Deltid\r\nTillsvidare",
        "text" : "Kom och jobba med oss på Torekov Hotell. Här får du arbeta i ett tajt team med höga ambitioner, fina råvaror från våra lokala leverantörer runtom på Bjärehalvön och smakinspiration från det asiatiska köket. Start omgående eller efter överenskommelse. Personalboende finns. \nVi söker dig som:\n\n • kan erbjuda goda referenser\n • gillar att arbeta med fantastiska råvaror i en fantastisk miljö\n • har en stark känsla för kvalitet\n • kan arbeta självständigt och i team för att nå egna och företagets mål\n • är en social, glad, energigivande och öppen person\n • tycker om ett högt tempo\nOm oss:\nBistron är hjärtat i Torekov Hotells verksamhet och vi är extremt stolta över vad vi presterar här i form av matupplevelser och service.\nBistron har öppet för hotellgäster, konferensgrupper och lokalbefolkning. Vi serverar frukost, fika, lunch, gör fantastiska picknickar till gäster som skall ut och vandra på vackra Bjäre, fika, loungemeny samt magiska menyer och à la carte på kvällen.\n \nHär på landet i utkanten av Torekov är vi granne och kompis med våra lokala producenter. Bjärekycklingen är klimatcertifierad, lammet har vuxit upp på Lindegrens gård och Torekovsparrisen är en historia i sig.\n \nVarför ska du jobba hos oss?\nI det här arbetet kan vi erbjuda dig bland annat:\n\n • gemenskap och härligt team\n • utvecklingsmöjligheter\n • generösa förmåner på koncernens anläggningar\n • erfarna ledare, kollektivavtal, ordning och reda\n • arbeta med härliga gäster och mycket sociala möten\nArbetstider och omfattning:\nAnställningstyp: (80 %)\nArbetstider: Varierande arbetstid (vardagar och helger) främst dagtid.\nTillträde: Augusti 2022\nLön: Enligt överenskommelse.\n \nAnsökan:\nVälkommen att skicka in din ansökan via knappen nedan. Urval och intervjuer sker löpande, så vänta inte med att ansöka. \n\n\nLängst ut på undersköna Bjärehalvön ligger Torekov Hotell. Här blir luften klarare, tankarna lättare, axlarna sänks. Varje rum och svit har en egen terrass, Bistron serverar närodlat och gärna kravmärkt, tennisbanorna och utegymmet lockar till utomhusträning. Hotellet är en del av GRAM Group och självklart är hela hotellet Svanenmärkt.\nwww.torekovhotell.se | www.gramgroup.se"
      },
      "headline" : "Kock till Bistron på Torekov Hotell (80%)",
      "driving_license" : null,
      "employer" : {
        "email" : null,
        "phone_number" : null,
        "organization_number" : "5568019763",
        "name" : "Torekov Hotell Resort AB",
        "url" : "http://www.torekovhotell.se",
        "workplace" : "Torekov Hotell"
      },
      "removed_date" : null,
      "logo_url" : "https://www.arbetsformedlingen.se/rest/arbetsgivare/rest/af/v3/organisation/5568019763/logotyper/logo.png",
      "last_publication_date" : "2022-08-14T23:59:59",
      "number_of_vacancies" : 1,
      "occupation" : {
        "concept_id" : "JbJw_as4_S93",
        "label" : "Kock, à la carte",
        "legacy_ams_taxonomy_id" : "7663"
      },
      "occupation_group" : {
        "concept_id" : "BStc_SJh_DKG",
        "label" : "Kockar och kallskänkor",
        "legacy_ams_taxonomy_id" : "5120"
      },
      "employment_type" : {
        "concept_id" : "PFZr_Syz_cUq",
        "label" : "Vanlig anställning",
        "legacy_ams_taxonomy_id" : "1"
      },
      "webpage_url" : "https://arbetsformedlingen.se/platsbanken/annonser/26368299",
      "driving_license_required" : false,
      "application_contacts" : [ {
        "description" : "Jessica Liljedahl Marin",
        "email" : "jessica.marin@torekovhotell.se",
        "telephone" : "+46 70 389 23 40",
        "name" : null,
        "contact_type" : "Restaurangchef"
      } ],
      "duration" : {
        "concept_id" : "a7uU_j21_mkL",
        "label" : "Tills vidare",
        "legacy_ams_taxonomy_id" : "1"
      },
      "nice_to_have" : {
        "education_level" : [ ],
        "work_experiences" : [ ],
        "skills" : [ ],
        "education" : [ ],
        "languages" : [ ]
      },
      "application_details" : {
        "via_af" : false,
        "email" : null,
        "other" : null,
        "reference" : null,
        "url" : "https://www.recruto.se/apps/ads/view/id/48946-gram-group-bstad-kock-till-bistron-p-torekov-hotell-80/tracking/5",
        "information" : null
      },
      "source_type" : "VIA_PLATSBANKEN_DXA",
      "application_deadline" : "2022-08-14T23:59:59",
      "external_id" : "46-556801-9763-1130-48946-2",
      "workplace_address" : {
        "coordinates" : [ 12.847722, 56.427387 ],
        "city" : null,
        "postcode" : null,
        "municipality" : "Båstad",
        "region_concept_id" : "CaRE_1nn_cSU",
        "region" : "Skåne län",
        "country_code" : "199",
        "region_code" : "12",
        "municipality_concept_id" : "i8vK_odq_6ar",
        "country_concept_id" : "i46j_HmG_v64",
        "municipality_code" : "1278",
        "street_address" : null,
        "country" : "Sverige"
      },
      "id" : "26368299",
      "experience_required" : true,
      "working_hours_type" : {
        "concept_id" : "947z_JGS_Uk2",
        "label" : "Deltid",
        "legacy_ams_taxonomy_id" : "2"
      },
      "access" : null,
      "timestamp" : 1659356306658,
      "must_have" : {
        "education_level" : [ ],
        "work_experiences" : [ {
          "concept_id" : "JbJw_as4_S93",
          "weight" : 10,
          "label" : "Kock, à la carte",
          "legacy_ams_taxonomy_id" : "7663"
        } ],
        "skills" : [ ],
        "education" : [ ],
        "languages" : [ ]
      },
      "occupation_field" : {
        "concept_id" : "ScKy_FHB_7wT",
        "label" : "Hotell, restaurang, storhushåll",
        "legacy_ams_taxonomy_id" : "7"
      },
      "scope_of_work" : {
        "min" : 0,
        "max" : 100
      },
      "salary_type" : {
        "concept_id" : "oG8G_9cW_nRf",
        "label" : "Fast månads- vecko- eller timlön",
        "legacy_ams_taxonomy_id" : "1"
      },
      "removed" : false,
      "salary_description" : "Fast",
      "access_to_own_car" : false,
      "publication_date" : "2022-08-01T14:18:26"
    },
    "name" : "Kock till Bistron på Torekov Hotell (80%)",
    "user" : "hannes"
  },
  "sha1" : "70ceba867aa5819ce70983ac6b7e8d56c17e8c87",
  "annotations" : [ {
    "preferred-label" : "kock",
    "sentiment" : "MUST_HAVE",
    "type" : "esco-occupation",
    "start-position" : 0,
    "end-position" : 4,
    "concept-id" : "Ti2H_QoQ_EMX",
    "matched-string" : "kock",
    "annotation-id" : 0
  }, {
    "preferred-label" : "Hotell",
    "sentiment" : "MUST_HAVE",
    "type" : "keyword",
    "start-position" : 29,
    "end-position" : 35,
    "concept-id" : "Jrrg_iiS_2yp",
    "matched-string" : "hotell",
    "annotation-id" : 1
  }, {
    "preferred-label" : "Deltid",
    "type" : "worktime-extent",
    "start-position" : 37,
    "end-position" : 40,
    "concept-id" : "947z_JGS_Uk2",
    "matched-string" : "80%",
    "annotation-id" : 6
  }, {
    "preferred-label" : "Hotell",
    "sentiment" : "MUST_HAVE",
    "type" : "keyword",
    "start-position" : 75,
    "end-position" : 81,
    "concept-id" : "Jrrg_iiS_2yp",
    "matched-string" : "hotell",
    "annotation-id" : 2
  }, {
    "preferred-label" : "arbeta självständigt",
    "type" : "esco-skill",
    "start-position" : 476,
    "end-position" : 496,
    "concept-id" : "NyFu_HHd_zhz",
    "matched-string" : "arbeta självständigt",
    "annotation-id" : 7
  }, {
    "preferred-label" : "A la carte",
    "type" : "skill",
    "start-position" : 999,
    "end-position" : 1009,
    "concept-id" : "Bb4Q_Vou_pbq",
    "matched-string" : "à la carte",
    "annotation-id" : 8
  }, {
    "preferred-label" : "Kollektivavtal",
    "sentiment" : "MUST_HAVE",
    "type" : "skill",
    "start-position" : 1439,
    "end-position" : 1453,
    "concept-id" : "z7wE_9xb_3jX",
    "matched-string" : "kollektivavtal",
    "annotation-id" : 4
  }, {
    "preferred-label" : "Deltid",
    "type" : "worktime-extent",
    "start-position" : 1572,
    "end-position" : 1576,
    "concept-id" : "947z_JGS_Uk2",
    "matched-string" : "80 %",
    "annotation-id" : 9
  }, {
    "preferred-label" : "Hotell",
    "sentiment" : "MUST_HAVE",
    "type" : "keyword",
    "start-position" : 1887,
    "end-position" : 1893,
    "concept-id" : "Jrrg_iiS_2yp",
    "matched-string" : "hotell",
    "annotation-id" : 5
  } ],
  "text" : "Kock till Bistron på Torekov Hotell (80%)\nKom och jobba med oss på Torekov Hotell. Här får du arbeta i ett tajt team med höga ambitioner, fina råvaror från våra lokala leverantörer runtom på Bjärehalvön och smakinspiration från det asiatiska köket. Start omgående eller efter överenskommelse. Personalboende finns. \nVi söker dig som:\n\n • kan erbjuda goda referenser\n • gillar att arbeta med fantastiska råvaror i en fantastisk miljö\n • har en stark känsla för kvalitet\n • kan arbeta självständigt och i team för att nå egna och företagets mål\n • är en social, glad, energigivande och öppen person\n • tycker om ett högt tempo\nOm oss:\nBistron är hjärtat i Torekov Hotells verksamhet och vi är extremt stolta över vad vi presterar här i form av matupplevelser och service.\nBistron har öppet för hotellgäster, konferensgrupper och lokalbefolkning. Vi serverar frukost, fika, lunch, gör fantastiska picknickar till gäster som skall ut och vandra på vackra Bjäre, fika, loungemeny samt magiska menyer och à la carte på kvällen.\n \nHär på landet i utkanten av Torekov är vi granne och kompis med våra lokala producenter. Bjärekycklingen är klimatcertifierad, lammet har vuxit upp på Lindegrens gård och Torekovsparrisen är en historia i sig.\n \nVarför ska du jobba hos oss?\nI det här arbetet kan vi erbjuda dig bland annat:\n\n • gemenskap och härligt team\n • utvecklingsmöjligheter\n • generösa förmåner på koncernens anläggningar\n • erfarna ledare, kollektivavtal, ordning och reda\n • arbeta med härliga gäster och mycket sociala möten\nArbetstider och omfattning:\nAnställningstyp: (80 %)\nArbetstider: Varierande arbetstid (vardagar och helger) främst dagtid.\nTillträde: Augusti 2022\nLön: Enligt överenskommelse.\n \nAnsökan:\nVälkommen att skicka in din ansökan via knappen nedan. Urval och intervjuer sker löpande, så vänta inte med att ansöka. \n\n\nLängst ut på undersköna Bjärehalvön ligger Torekov Hotell. Här blir luften klarare, tankarna lättare, axlarna sänks. Varje rum och svit har en egen terrass, Bistron serverar närodlat och gärna kravmärkt, tennisbanorna och utegymmet lockar till utomhusträning. Hotellet är en del av GRAM Group och självklart är hela hotellet Svanenmärkt.\nwww.torekovhotell.se | www.gramgroup.se"
}