{
  "meta" : {
    "jobad" : {
      "description" : {
        "requirements" : null,
        "needs" : null,
        "company_information" : null,
        "text_formatted" : "<p><strong>Platsbeskrivning</strong></p><p>Vi är ett hantverksbageri med egen butik i hjärtat av Hökarängen. Vi har bakat bullar och godsaker på ren kärlek till både lokala stammisar och långväga gäster sedan mars 2015. Vi är ett litet drivet gäng som älskar det vi gör. Allt vi serverar, från bakverk och frukost till lunchsoppor och grillmackor, är gjorda från grunden av riktigt bra råvaror.  Allt bakas i stenugn, såsom surdegsbröd, söta och kavlade degar, tårtor och bitar. Vi strävar alltid efter att leverera kvalitet och service i toppklass! </p><p>Vår försäljning är styrd efter bakverkens säsonger, det vill säga att vi säljer som bäst under semmelsäsongen jan-mars och dagar som kanelbullens dag, inför jul, påsk, mors dag och andra speciella högtider.</p><p>Bageriet håller i regel stängt Jul, Nyår, Påsk och Midsommar samt ca 4 veckor under sommaren. </p><p><strong>Nu söker vi dig som vill jobba Heltid med oss! </strong></p><p><strong>Är du den vi söker? </strong></p><ul><li>Du har ett par års erfarenhet från branschen. Inom både konditori och bageri</li><li>Du har ett stort intresse för bakverk i toppklass, där KVALITET och hantverk är ledord.</li><li>Du har sinne för ordning och reda, är en problemlösare med god planeringsförmåga.</li><li>Du känner dig bekväm med att sköta en stor produktion på liten yta och du känner dig trygg i att ta eget ansvar och jobba självständigt.</li><li>Du bör vara stresstålig och vilja lägga i en extra växel inför årets högtider.</li><li>Du är en positiv, lagspelare som är prestigelös och kan hugga i där det behövs, har en riktig hög känsla för service, och hoppar gärna in i butiken när det behövs.</li></ul><p><br></p><p>Som anställd kommer du; </p><ul><li>Jobba som både bagare och konditor med ett brett sortiment helt efter säsong.</li><li>Tillsammans med dina kollegor, planera produktionen och utveckla sortimentet</li><li>Hantera beställningar och leveranser.</li><li>Jobba på rullande schema där vi växlar morgon och em, med övervägande dagtid. Samt rullande schema varannan till var tredje helg.</li><li>Hoppa in i butiken och hjälpa kunder.</li><li>Vara en glad lagspelare i vårt team</li></ul><p><br></p><p>Vi letar efter dig som är öppensinnad och känner motivation och glädje inför en händelserik framtid tillsammans med oss.</p><p><strong>Omfattning/ varaktighet och tillträde:</strong></p><p>Intervjuer sker löpande och tjänsten kan komma att tillsättas innan sista ansökningsdag utgång. Ansök därför redan idag! </p><p><strong>Ansökan</strong></p><p>Maila din ansökan med CV &amp; Personligt Brev till baka@konditornochbagarn.se</p><p>Kontaktpersoner</p><p>Susanne Ericson &amp; Cajsa Lindberg</p><p><strong>Varmt välkommen med din ansökan!</strong></p>",
        "conditions" : null,
        "text" : "Platsbeskrivning\nVi är ett hantverksbageri med egen butik i hjärtat av Hökarängen. Vi har bakat bullar och godsaker på ren kärlek till både lokala stammisar och långväga gäster sedan mars 2015. Vi är ett litet drivet gäng som älskar det vi gör. Allt vi serverar, från bakverk och frukost till lunchsoppor och grillmackor, är gjorda från grunden av riktigt bra råvaror.  Allt bakas i stenugn, såsom surdegsbröd, söta och kavlade degar, tårtor och bitar. Vi strävar alltid efter att leverera kvalitet och service i toppklass! \nVår försäljning är styrd efter bakverkens säsonger, det vill säga att vi säljer som bäst under semmelsäsongen jan-mars och dagar som kanelbullens dag, inför jul, påsk, mors dag och andra speciella högtider.\nBageriet håller i regel stängt Jul, Nyår, Påsk och Midsommar samt ca 4 veckor under sommaren. \nNu söker vi dig som vill jobba Heltid med oss! \nÄr du den vi söker? \nDu har ett par års erfarenhet från branschen. Inom både konditori och bageri\nDu har ett stort intresse för bakverk i toppklass, där KVALITET och hantverk är ledord.\nDu har sinne för ordning och reda, är en problemlösare med god planeringsförmåga.\nDu känner dig bekväm med att sköta en stor produktion på liten yta och du känner dig trygg i att ta eget ansvar och jobba självständigt.\nDu bör vara stresstålig och vilja lägga i en extra växel inför årets högtider.\nDu är en positiv, lagspelare som är prestigelös och kan hugga i där det behövs, har en riktig hög känsla för service, och hoppar gärna in i butiken när det behövs.\n\n\n\nSom anställd kommer du; \nJobba som både bagare och konditor med ett brett sortiment helt efter säsong.\nTillsammans med dina kollegor, planera produktionen och utveckla sortimentet\nHantera beställningar och leveranser.\nJobba på rullande schema där vi växlar morgon och em, med övervägande dagtid. Samt rullande schema varannan till var tredje helg.\nHoppa in i butiken och hjälpa kunder.\nVara en glad lagspelare i vårt team\n\n\n\nVi letar efter dig som är öppensinnad och känner motivation och glädje inför en händelserik framtid tillsammans med oss.\nOmfattning/ varaktighet och tillträde:\nIntervjuer sker löpande och tjänsten kan komma att tillsättas innan sista ansökningsdag utgång. Ansök därför redan idag! \nAnsökan\nMaila din ansökan med CV & Personligt Brev till baka@konditornochbagarn.se\nKontaktpersoner\nSusanne Ericson & Cajsa Lindberg\nVarmt välkommen med din ansökan!"
      },
      "headline" : "KB söker Bagare/Konditor på Heltid",
      "driving_license" : null,
      "employer" : {
        "email" : null,
        "phone_number" : null,
        "organization_number" : "5590048889",
        "name" : "Konditorn och bagarn Skandinavien AB",
        "url" : "www.konditornochbagarn.se",
        "workplace" : "Konditorn och Bagarn, Hökarängen"
      },
      "removed_date" : null,
      "logo_url" : "https://www.arbetsformedlingen.se/rest/arbetsgivare/rest/af/v3/arbetsplatser/88086615/logotyper/logo.png",
      "last_publication_date" : "2022-08-31T23:59:59",
      "number_of_vacancies" : 1,
      "occupation" : {
        "concept_id" : "XugJ_6hw_wVV",
        "label" : "Bagare/Konditor",
        "legacy_ams_taxonomy_id" : "5504"
      },
      "occupation_group" : {
        "concept_id" : "5qT8_z9d_8rw",
        "label" : "Bagare och konditorer",
        "legacy_ams_taxonomy_id" : "7612"
      },
      "employment_type" : {
        "concept_id" : "PFZr_Syz_cUq",
        "label" : "Vanlig anställning",
        "legacy_ams_taxonomy_id" : "1"
      },
      "webpage_url" : "https://arbetsformedlingen.se/platsbanken/annonser/26230687",
      "driving_license_required" : false,
      "application_contacts" : [ {
        "description" : null,
        "email" : "baka@konditornochbagarn.se",
        "telephone" : "08-42060060",
        "name" : "Susanne  Ericson",
        "contact_type" : null
      }, {
        "description" : null,
        "email" : "baka@konditornochbagarn.se",
        "telephone" : "08-42060060",
        "name" : "Cajsa Lindberg",
        "contact_type" : null
      } ],
      "duration" : {
        "concept_id" : "a7uU_j21_mkL",
        "label" : "Tills vidare",
        "legacy_ams_taxonomy_id" : "1"
      },
      "nice_to_have" : {
        "education_level" : [ ],
        "work_experiences" : [ ],
        "skills" : [ ],
        "education" : [ ],
        "languages" : [ ]
      },
      "application_details" : {
        "via_af" : false,
        "email" : "baka@konditornochbagarn.se",
        "other" : null,
        "reference" : "Bagare/Konditor Heltid",
        "url" : null,
        "information" : null
      },
      "source_type" : "VIA_ANNONSERA",
      "application_deadline" : "2022-08-31T23:59:59",
      "external_id" : null,
      "workplace_address" : {
        "coordinates" : [ 18.08132608136717, 59.25617797573192 ],
        "city" : "Farsta",
        "postcode" : "12356",
        "municipality" : "Stockholm",
        "region_concept_id" : "CifL_Rzy_Mku",
        "region" : "Stockholms län",
        "country_code" : "199",
        "region_code" : "01",
        "municipality_concept_id" : "AvNB_uwa_6n6",
        "country_concept_id" : "i46j_HmG_v64",
        "municipality_code" : "0180",
        "street_address" : "Pepparvägen 11",
        "country" : "Sverige"
      },
      "id" : "26230687",
      "experience_required" : true,
      "working_hours_type" : {
        "concept_id" : "6YE1_gAC_R2G",
        "label" : "Heltid",
        "legacy_ams_taxonomy_id" : "1"
      },
      "access" : null,
      "timestamp" : 1659451860311,
      "must_have" : {
        "education_level" : [ ],
        "work_experiences" : [ ],
        "skills" : [ ],
        "education" : [ ],
        "languages" : [ {
          "concept_id" : "zSLA_vw2_FXN",
          "weight" : 10,
          "label" : "Svenska",
          "legacy_ams_taxonomy_id" : "502"
        } ]
      },
      "occupation_field" : {
        "concept_id" : "PaxQ_o1G_wWH",
        "label" : "Hantverk",
        "legacy_ams_taxonomy_id" : "6"
      },
      "scope_of_work" : {
        "min" : 0,
        "max" : 100
      },
      "salary_type" : {
        "concept_id" : "oG8G_9cW_nRf",
        "label" : "Fast månads- vecko- eller timlön",
        "legacy_ams_taxonomy_id" : "1"
      },
      "removed" : false,
      "salary_description" : null,
      "access_to_own_car" : false,
      "publication_date" : "2022-08-02T16:51:00"
    },
    "name" : "KB söker Bagare/Konditor på Heltid",
    "user" : "hannes"
  },
  "sha1" : "2a98a1b3e0907fc814a7518d4104eea3927688c4",
  "annotations" : [ {
    "preferred-label" : "Bagare/Konditor",
    "sentiment" : "MUST_HAVE",
    "type" : "occupation-name",
    "start-position" : 9,
    "end-position" : 24,
    "concept-id" : "XugJ_6hw_wVV",
    "matched-string" : "bagare/konditor",
    "annotation-id" : 0
  }, {
    "preferred-label" : "Heltid",
    "type" : "worktime-extent",
    "start-position" : 28,
    "end-position" : 34,
    "concept-id" : "6YE1_gAC_R2G",
    "matched-string" : "Heltid",
    "annotation-id" : 6
  }, {
    "preferred-label" : "Butik",
    "sentiment" : "MUST_HAVE",
    "type" : "keyword",
    "start-position" : 87,
    "end-position" : 92,
    "concept-id" : "xLsd_zjY_5wr",
    "matched-string" : "butik",
    "annotation-id" : 1
  }, {
    "preferred-label" : "Tårtor/Bakelser",
    "sentiment" : "MUST_HAVE",
    "type" : "skill",
    "start-position" : 470,
    "end-position" : 476,
    "concept-id" : "UVj4_qZp_iqS",
    "matched-string" : "tårtor",
    "annotation-id" : 2
  }, {
    "preferred-label" : "Heltid",
    "type" : "worktime-extent",
    "start-position" : 893,
    "end-position" : 899,
    "concept-id" : "6YE1_gAC_R2G",
    "matched-string" : "Heltid",
    "annotation-id" : 7
  }, {
    "preferred-label" : "Hantverk",
    "sentiment" : "MUST_HAVE",
    "type" : "occupation-field",
    "start-position" : 1076,
    "end-position" : 1084,
    "concept-id" : "PaxQ_o1G_wWH",
    "matched-string" : "hantverk",
    "annotation-id" : 3
  }, {
    "preferred-label" : "bagare",
    "sentiment" : "MUST_HAVE",
    "type" : "esco-occupation",
    "start-position" : 1601,
    "end-position" : 1607,
    "concept-id" : "Zo8A_5ML_j3t",
    "matched-string" : "bagare",
    "annotation-id" : 4
  }, {
    "preferred-label" : "Bagare/Konditor",
    "sentiment" : "MUST_HAVE",
    "type" : "occupation-name",
    "start-position" : 1612,
    "end-position" : 1620,
    "concept-id" : "XugJ_6hw_wVV",
    "matched-string" : "konditor",
    "annotation-id" : 5
  } ],
  "text" : "KB söker Bagare/Konditor på Heltid\nPlatsbeskrivning\nVi är ett hantverksbageri med egen butik i hjärtat av Hökarängen. Vi har bakat bullar och godsaker på ren kärlek till både lokala stammisar och långväga gäster sedan mars 2015. Vi är ett litet drivet gäng som älskar det vi gör. Allt vi serverar, från bakverk och frukost till lunchsoppor och grillmackor, är gjorda från grunden av riktigt bra råvaror.  Allt bakas i stenugn, såsom surdegsbröd, söta och kavlade degar, tårtor och bitar. Vi strävar alltid efter att leverera kvalitet och service i toppklass! \nVår försäljning är styrd efter bakverkens säsonger, det vill säga att vi säljer som bäst under semmelsäsongen jan-mars och dagar som kanelbullens dag, inför jul, påsk, mors dag och andra speciella högtider.\nBageriet håller i regel stängt Jul, Nyår, Påsk och Midsommar samt ca 4 veckor under sommaren. \nNu söker vi dig som vill jobba Heltid med oss! \nÄr du den vi söker? \nDu har ett par års erfarenhet från branschen. Inom både konditori och bageri\nDu har ett stort intresse för bakverk i toppklass, där KVALITET och hantverk är ledord.\nDu har sinne för ordning och reda, är en problemlösare med god planeringsförmåga.\nDu känner dig bekväm med att sköta en stor produktion på liten yta och du känner dig trygg i att ta eget ansvar och jobba självständigt.\nDu bör vara stresstålig och vilja lägga i en extra växel inför årets högtider.\nDu är en positiv, lagspelare som är prestigelös och kan hugga i där det behövs, har en riktig hög känsla för service, och hoppar gärna in i butiken när det behövs.\n\n\n\nSom anställd kommer du; \nJobba som både bagare och konditor med ett brett sortiment helt efter säsong.\nTillsammans med dina kollegor, planera produktionen och utveckla sortimentet\nHantera beställningar och leveranser.\nJobba på rullande schema där vi växlar morgon och em, med övervägande dagtid. Samt rullande schema varannan till var tredje helg.\nHoppa in i butiken och hjälpa kunder.\nVara en glad lagspelare i vårt team\n\n\n\nVi letar efter dig som är öppensinnad och känner motivation och glädje inför en händelserik framtid tillsammans med oss.\nOmfattning/ varaktighet och tillträde:\nIntervjuer sker löpande och tjänsten kan komma att tillsättas innan sista ansökningsdag utgång. Ansök därför redan idag! \nAnsökan\nMaila din ansökan med CV & Personligt Brev till baka@konditornochbagarn.se\nKontaktpersoner\nSusanne Ericson & Cajsa Lindberg\nVarmt välkommen med din ansökan!"
}