{
  "meta" : {
    "jobad" : {
      "description" : {
        "requirements" : null,
        "needs" : null,
        "company_information" : null,
        "text_formatted" : "Är du nyfiken på branschen inom elbilsladdning, solceller samt batterier och är intresserad av att arbeta i ett härligt team ? Har du erfarenhet inom el- och serviceinstallationer sedan något år tillbaka och är bra på kommunikation och kundkontakt? Sök då tjänsten redan idag!\n\nArbetsbeskrivning:\nSom Elektriker hos oss kommer du vara en viktig del i att vi fortsätter att bibehålla vår höga kundnöjdhet. Som en del i ett team av elektriker är du företagets ansikte utåt när du driftsätter och installerar anläggningar ute hos kunder. Du agerar som en serviceelektriker men med en varierande vardag. Arbetet sker till största del på plats ute hos olika kunder i området. Det är ett varierande arbete med många moment och består av bland annat:\n\n- Mindre och större ombyggnationer av el-centraler, mätarskåp och ställverk\n- El-installationer ute hos kund\n- Installation samt driftsättning av laddstationer, solcellsanläggningar och batterier\n- Överlämning och utbildning till kunder\n\n\n\n\nVem är du:\nDu kommer arbeta tätt med projektledare, arbetschef och våra montageteam som monterar våra anläggningar. Därför lägger vi stor vikt vid att du är bra på att samarbeta, kommunicera, strukturera och är bra på kundbemötandet. Det är också viktigt att du är självgående och kan ta egna initiativ och trivs i en varierande föränderlig miljö.\n\nKravet för att söka tjänsten:\n- Du är minst 1:A års montör eller högre\n- Att du har B-körkort\n- Att du behärskar det svenska språket i tal och skrift\n\n\n\n\nVad innebär det att arbeta hos oss?\n- Mycket frihet under ansvar\n- Goda möjligheter till utveckling\n- Varierande vardag med olika typer av elinstallationer hos våra kunder\n- Du får vara med och påverka de beslut som fattas för Sesol och vår utveckling\n- Goda förmåner och arbetsvillkor\n- Egen fullkittad servicebil med möjlighet till förmånsbil\n- Delta i diverse tävlingar med bonussystem\n\n\n\n\nOm anställningen:\nLön: Fast lön\n\nPlacering: Norrköping\n\nTillträde: Enligt överenskommelse\n\nAnställningsvillkor: Heltid\n\nVi ser fram emot din ansökan redan idag! Urval sker löpande. \nOBS: Ansökan tas endast emot via vår hemsida.\n\nOm oss\nIdag är vi över 500 medarbetare med huvudkontor i Jönköping, vi har också etablerat oss i bland annat Kalmar, Helsingborg, Stockholm, Örebro, Göteborg, Norrköping och Uppsala.\n\nVarje dag levererar vi anläggningar med högsta kundnöjdhet i fokus. Eftersom fler och fler får upp ögonen för elbilsladdare, solceller och batterier så innebär det olika typer av elinstallationer även mot anläggningar av större storlekar, från en helt vanlig villa till stora parker. All vår personal är behörig och anställda direkt i Sesolkoncernen men tillhör även Sekraft som är vårt varumärke för elbilsladdare.\n\nVåra Elektriker utbildas inom olika typer av ny teknik. Utbildningarna består av allt ifrån avancerad programmering av olika laddboxar, solcellsanläggningar och batterilösningar. Även IMD-system där du bland annat kommer att göra hela elinstallationen, till exempel bygga om i ställverk och energieffektivisera fastigheter.",
        "conditions" : "Heltid\r\n6 månaders provanställning",
        "text" : "Är du nyfiken på branschen inom elbilsladdning, solceller samt batterier och är intresserad av att arbeta i ett härligt team ? Har du erfarenhet inom el- och serviceinstallationer sedan något år tillbaka och är bra på kommunikation och kundkontakt? Sök då tjänsten redan idag!\n\nArbetsbeskrivning:\nSom Elektriker hos oss kommer du vara en viktig del i att vi fortsätter att bibehålla vår höga kundnöjdhet. Som en del i ett team av elektriker är du företagets ansikte utåt när du driftsätter och installerar anläggningar ute hos kunder. Du agerar som en serviceelektriker men med en varierande vardag. Arbetet sker till största del på plats ute hos olika kunder i området. Det är ett varierande arbete med många moment och består av bland annat:\n\n- Mindre och större ombyggnationer av el-centraler, mätarskåp och ställverk\n- El-installationer ute hos kund\n- Installation samt driftsättning av laddstationer, solcellsanläggningar och batterier\n- Överlämning och utbildning till kunder\n\n\n\n\nVem är du:\nDu kommer arbeta tätt med projektledare, arbetschef och våra montageteam som monterar våra anläggningar. Därför lägger vi stor vikt vid att du är bra på att samarbeta, kommunicera, strukturera och är bra på kundbemötandet. Det är också viktigt att du är självgående och kan ta egna initiativ och trivs i en varierande föränderlig miljö.\n\nKravet för att söka tjänsten:\n- Du är minst 1:A års montör eller högre\n- Att du har B-körkort\n- Att du behärskar det svenska språket i tal och skrift\n\n\n\n\nVad innebär det att arbeta hos oss?\n- Mycket frihet under ansvar\n- Goda möjligheter till utveckling\n- Varierande vardag med olika typer av elinstallationer hos våra kunder\n- Du får vara med och påverka de beslut som fattas för Sesol och vår utveckling\n- Goda förmåner och arbetsvillkor\n- Egen fullkittad servicebil med möjlighet till förmånsbil\n- Delta i diverse tävlingar med bonussystem\n\n\n\n\nOm anställningen:\nLön: Fast lön\n\nPlacering: Norrköping\n\nTillträde: Enligt överenskommelse\n\nAnställningsvillkor: Heltid\n\nVi ser fram emot din ansökan redan idag! Urval sker löpande. \nOBS: Ansökan tas endast emot via vår hemsida.\n\nOm oss\nIdag är vi över 500 medarbetare med huvudkontor i Jönköping, vi har också etablerat oss i bland annat Kalmar, Helsingborg, Stockholm, Örebro, Göteborg, Norrköping och Uppsala.\n\nVarje dag levererar vi anläggningar med högsta kundnöjdhet i fokus. Eftersom fler och fler får upp ögonen för elbilsladdare, solceller och batterier så innebär det olika typer av elinstallationer även mot anläggningar av större storlekar, från en helt vanlig villa till stora parker. All vår personal är behörig och anställda direkt i Sesolkoncernen men tillhör även Sekraft som är vårt varumärke för elbilsladdare.\n\nVåra Elektriker utbildas inom olika typer av ny teknik. Utbildningarna består av allt ifrån avancerad programmering av olika laddboxar, solcellsanläggningar och batterilösningar. Även IMD-system där du bland annat kommer att göra hela elinstallationen, till exempel bygga om i ställverk och energieffektivisera fastigheter."
      },
      "headline" : "Elektriker till Sesol i Norrköping",
      "driving_license" : null,
      "employer" : {
        "email" : null,
        "phone_number" : null,
        "organization_number" : "5590871355",
        "name" : "Sesol AB",
        "url" : "https://sesol.se/",
        "workplace" : "Sesol"
      },
      "removed_date" : null,
      "logo_url" : "https://www.arbetsformedlingen.se/rest/arbetsgivare/rest/af/v3/organisation/5590871355/logotyper/logo.png",
      "last_publication_date" : "2022-08-24T23:59:59",
      "number_of_vacancies" : 1,
      "occupation" : {
        "concept_id" : "K3iK_iEb_41Y",
        "label" : "Serviceelektriker, installation",
        "legacy_ams_taxonomy_id" : "4781"
      },
      "occupation_group" : {
        "concept_id" : "yyF7_jsW_EeP",
        "label" : "Installations- och serviceelektriker",
        "legacy_ams_taxonomy_id" : "7411"
      },
      "employment_type" : {
        "concept_id" : "PFZr_Syz_cUq",
        "label" : "Vanlig anställning",
        "legacy_ams_taxonomy_id" : "1"
      },
      "webpage_url" : "https://arbetsformedlingen.se/platsbanken/annonser/26356365",
      "driving_license_required" : false,
      "application_contacts" : [ {
        "description" : "Isabell",
        "email" : "isabell.karlsson@sesol.se",
        "telephone" : null,
        "name" : null,
        "contact_type" : null
      } ],
      "duration" : {
        "concept_id" : "a7uU_j21_mkL",
        "label" : "Tills vidare",
        "legacy_ams_taxonomy_id" : "1"
      },
      "nice_to_have" : {
        "education_level" : [ ],
        "work_experiences" : [ ],
        "skills" : [ ],
        "education" : [ ],
        "languages" : [ ]
      },
      "application_details" : {
        "via_af" : false,
        "email" : null,
        "other" : null,
        "reference" : null,
        "url" : "https://karriar.sesol.se/jobs/1940857-elektriker-till-sesol-i-norrkoping?promotion=454321-arbetsformedlingen",
        "information" : null
      },
      "source_type" : "VIA_PLATSBANKEN_DXA",
      "application_deadline" : "2022-08-24T23:59:59",
      "external_id" : "46-559087-1355-1940857-1",
      "workplace_address" : {
        "coordinates" : [ 16.192421, 58.587746 ],
        "city" : null,
        "postcode" : null,
        "municipality" : "Norrköping",
        "region_concept_id" : "oLT3_Q9p_3nn",
        "region" : "Östergötlands län",
        "country_code" : "199",
        "region_code" : "05",
        "municipality_concept_id" : "SYty_Yho_JAF",
        "country_concept_id" : "i46j_HmG_v64",
        "municipality_code" : "0581",
        "street_address" : null,
        "country" : "Sverige"
      },
      "id" : "26356365",
      "experience_required" : true,
      "working_hours_type" : {
        "concept_id" : "6YE1_gAC_R2G",
        "label" : "Heltid",
        "legacy_ams_taxonomy_id" : "1"
      },
      "access" : null,
      "timestamp" : 1658905824929,
      "must_have" : {
        "education_level" : [ ],
        "work_experiences" : [ {
          "concept_id" : "K3iK_iEb_41Y",
          "weight" : 10,
          "label" : "Serviceelektriker, installation",
          "legacy_ams_taxonomy_id" : "4781"
        } ],
        "skills" : [ ],
        "education" : [ ],
        "languages" : [ ]
      },
      "occupation_field" : {
        "concept_id" : "yhCP_AqT_tns",
        "label" : "Installation, drift, underhåll",
        "legacy_ams_taxonomy_id" : "10"
      },
      "scope_of_work" : {
        "min" : 100,
        "max" : 100
      },
      "salary_type" : {
        "concept_id" : "oG8G_9cW_nRf",
        "label" : "Fast månads- vecko- eller timlön",
        "legacy_ams_taxonomy_id" : "1"
      },
      "removed" : false,
      "salary_description" : "Lön enligt överenskommelse",
      "access_to_own_car" : false,
      "publication_date" : "2022-07-27T09:10:24"
    },
    "name" : "Elektriker till Sesol i Norrköping",
    "user" : "kristof.fischer"
  },
  "sha1" : "a371fe6a49760c884a48f196197caa10c3c8f6c7",
  "annotations" : [ {
    "preferred-label" : "Serviceelektriker, installation",
    "type" : "occupation-name",
    "start-position" : 0,
    "end-position" : 10,
    "concept-id" : "K3iK_iEb_41Y",
    "matched-string" : "Elektriker",
    "annotation-id" : 7
  }, {
    "preferred-label" : "Norrköping",
    "type" : "municipality",
    "start-position" : 24,
    "end-position" : 34,
    "concept-id" : "SYty_Yho_JAF",
    "matched-string" : "Norrköping",
    "annotation-id" : 6
  }, {
    "preferred-label" : "Serviceelektriker, installation",
    "sentiment" : "MUST_HAVE",
    "type" : "occupation-name",
    "start-position" : 587,
    "end-position" : 604,
    "concept-id" : "K3iK_iEb_41Y",
    "matched-string" : "serviceelektriker",
    "annotation-id" : 0
  }, {
    "preferred-label" : "Projektledare, el",
    "type" : "occupation-name",
    "start-position" : 1058,
    "end-position" : 1071,
    "concept-id" : "1jm3_XFQ_TdJ",
    "matched-string" : "projektledare",
    "annotation-id" : 8
  }, {
    "preferred-label" : "Arbetsledare, elkraft",
    "type" : "occupation-name",
    "start-position" : 1073,
    "end-position" : 1083,
    "concept-id" : "Sk1c_Ut5_KSG",
    "matched-string" : "arbetschef",
    "annotation-id" : 9
  }, {
    "preferred-label" : "samarbeta med kolleger",
    "sentiment" : "MUST_HAVE",
    "type" : "esco-skill",
    "start-position" : 1189,
    "end-position" : 1198,
    "concept-id" : "X15R_797_q62",
    "matched-string" : "samarbeta",
    "annotation-id" : 10
  }, {
    "preferred-label" : "kommunikation",
    "sentiment" : "MUST_HAVE",
    "type" : "esco-skill",
    "start-position" : 1200,
    "end-position" : 1211,
    "concept-id" : "ahPU_HgE_Jeb",
    "matched-string" : "kommunicera",
    "annotation-id" : 11
  }, {
    "preferred-label" : "arbeta självständigt",
    "sentiment" : "MUST_HAVE",
    "type" : "esco-skill",
    "start-position" : 1286,
    "end-position" : 1297,
    "concept-id" : "NyFu_HHd_zhz",
    "matched-string" : "självgående",
    "annotation-id" : 12
  }, {
    "preferred-label" : "1-2 års erfarenhet",
    "sentiment" : "MUST_HAVE",
    "type" : "occupation-experience-year",
    "start-position" : 1414,
    "end-position" : 1440,
    "concept-id" : "LLnd_5GJ_4ju",
    "matched-string" : "1:A års montör eller högre",
    "annotation-id" : 13
  }, {
    "preferred-label" : "B",
    "sentiment" : "MUST_HAVE",
    "type" : "driving-licence",
    "start-position" : 1454,
    "end-position" : 1463,
    "concept-id" : "VTK8_WRx_GcM",
    "matched-string" : "B-körkort",
    "annotation-id" : 14
  }, {
    "preferred-label" : "Svenska",
    "sentiment" : "MUST_HAVE",
    "type" : "language",
    "start-position" : 1487,
    "end-position" : 1494,
    "concept-id" : "zSLA_vw2_FXN",
    "matched-string" : "svenska",
    "annotation-id" : 15
  }, {
    "preferred-label" : "Norrköping",
    "type" : "municipality",
    "start-position" : 1961,
    "end-position" : 1971,
    "concept-id" : "SYty_Yho_JAF",
    "matched-string" : "Norrköping",
    "annotation-id" : 16
  }, {
    "preferred-label" : "Heltid",
    "type" : "worktime-extent",
    "start-position" : 2029,
    "end-position" : 2035,
    "concept-id" : "6YE1_gAC_R2G",
    "matched-string" : "Heltid",
    "annotation-id" : 17
  }, {
    "preferred-label" : "Jönköping",
    "type" : "municipality",
    "start-position" : 2203,
    "end-position" : 2212,
    "concept-id" : "KURg_KJF_Lwc",
    "matched-string" : "Jönköping",
    "annotation-id" : 18
  }, {
    "preferred-label" : "Kalmar",
    "type" : "municipality",
    "start-position" : 2255,
    "end-position" : 2261,
    "concept-id" : "Pnmg_SgP_uHQ",
    "matched-string" : "Kalmar",
    "annotation-id" : 19
  }, {
    "preferred-label" : "Helsingborg",
    "type" : "municipality",
    "start-position" : 2263,
    "end-position" : 2274,
    "concept-id" : "qj3q_oXH_MGR",
    "matched-string" : "Helsingborg",
    "annotation-id" : 20
  }, {
    "preferred-label" : "Stockholm",
    "type" : "municipality",
    "start-position" : 2276,
    "end-position" : 2285,
    "concept-id" : "AvNB_uwa_6n6",
    "matched-string" : "Stockholm",
    "annotation-id" : 21
  }, {
    "preferred-label" : "Örebro",
    "type" : "municipality",
    "start-position" : 2287,
    "end-position" : 2293,
    "concept-id" : "kuMn_feU_hXx",
    "matched-string" : "Örebro",
    "annotation-id" : 22
  }, {
    "preferred-label" : "Göteborg",
    "type" : "municipality",
    "start-position" : 2295,
    "end-position" : 2303,
    "concept-id" : "PVZL_BQT_XtL",
    "matched-string" : "Göteborg",
    "annotation-id" : 23
  }, {
    "preferred-label" : "Norrköping",
    "type" : "municipality",
    "start-position" : 2305,
    "end-position" : 2315,
    "concept-id" : "SYty_Yho_JAF",
    "matched-string" : "Norrköping",
    "annotation-id" : 24
  }, {
    "preferred-label" : "Uppsala",
    "type" : "municipality",
    "start-position" : 2320,
    "end-position" : 2327,
    "concept-id" : "otaF_bQY_4ZD",
    "matched-string" : "Uppsala",
    "annotation-id" : 25
  } ],
  "text" : "Elektriker till Sesol i Norrköping\nÄr du nyfiken på branschen inom elbilsladdning, solceller samt batterier och är intresserad av att arbeta i ett härligt team ? Har du erfarenhet inom el- och serviceinstallationer sedan något år tillbaka och är bra på kommunikation och kundkontakt? Sök då tjänsten redan idag!\n\nArbetsbeskrivning:\nSom Elektriker hos oss kommer du vara en viktig del i att vi fortsätter att bibehålla vår höga kundnöjdhet. Som en del i ett team av elektriker är du företagets ansikte utåt när du driftsätter och installerar anläggningar ute hos kunder. Du agerar som en serviceelektriker men med en varierande vardag. Arbetet sker till största del på plats ute hos olika kunder i området. Det är ett varierande arbete med många moment och består av bland annat:\n\n- Mindre och större ombyggnationer av el-centraler, mätarskåp och ställverk\n- El-installationer ute hos kund\n- Installation samt driftsättning av laddstationer, solcellsanläggningar och batterier\n- Överlämning och utbildning till kunder\n\n\n\n\nVem är du:\nDu kommer arbeta tätt med projektledare, arbetschef och våra montageteam som monterar våra anläggningar. Därför lägger vi stor vikt vid att du är bra på att samarbeta, kommunicera, strukturera och är bra på kundbemötandet. Det är också viktigt att du är självgående och kan ta egna initiativ och trivs i en varierande föränderlig miljö.\n\nKravet för att söka tjänsten:\n- Du är minst 1:A års montör eller högre\n- Att du har B-körkort\n- Att du behärskar det svenska språket i tal och skrift\n\n\n\n\nVad innebär det att arbeta hos oss?\n- Mycket frihet under ansvar\n- Goda möjligheter till utveckling\n- Varierande vardag med olika typer av elinstallationer hos våra kunder\n- Du får vara med och påverka de beslut som fattas för Sesol och vår utveckling\n- Goda förmåner och arbetsvillkor\n- Egen fullkittad servicebil med möjlighet till förmånsbil\n- Delta i diverse tävlingar med bonussystem\n\n\n\n\nOm anställningen:\nLön: Fast lön\n\nPlacering: Norrköping\n\nTillträde: Enligt överenskommelse\n\nAnställningsvillkor: Heltid\n\nVi ser fram emot din ansökan redan idag! Urval sker löpande. \nOBS: Ansökan tas endast emot via vår hemsida.\n\nOm oss\nIdag är vi över 500 medarbetare med huvudkontor i Jönköping, vi har också etablerat oss i bland annat Kalmar, Helsingborg, Stockholm, Örebro, Göteborg, Norrköping och Uppsala.\n\nVarje dag levererar vi anläggningar med högsta kundnöjdhet i fokus. Eftersom fler och fler får upp ögonen för elbilsladdare, solceller och batterier så innebär det olika typer av elinstallationer även mot anläggningar av större storlekar, från en helt vanlig villa till stora parker. All vår personal är behörig och anställda direkt i Sesolkoncernen men tillhör även Sekraft som är vårt varumärke för elbilsladdare.\n\nVåra Elektriker utbildas inom olika typer av ny teknik. Utbildningarna består av allt ifrån avancerad programmering av olika laddboxar, solcellsanläggningar och batterilösningar. Även IMD-system där du bland annat kommer att göra hela elinstallationen, till exempel bygga om i ställverk och energieffektivisera fastigheter."
}