{
  "meta" : {
    "jobad" : {
      "description" : {
        "requirements" : null,
        "needs" : null,
        "company_information" : null,
        "text_formatted" : "I Mölndals stad är vi stolta över att ha Sveriges viktigaste jobb där vi tillsammans skapar bästa möjliga vardag för våra medborgare. Med mod och kreativitet utvecklar vi våra verksamheter och bidrar till att Mölndal blir en ännu bättre plats att leva och jobba i. Välkommen att göra skillnad i människors vardag varje dag!\n\nSamordning för hållbarhet arbetar för att integrera Agenda 2030 och hållbar utveckling i styrningen. Enheten har övergripande ansvar för att samordna och driva processer för en socialt och ekologiskt hållbar utveckling. Den svarar för planeringsunderlag, prognoser och omvärldsanalyser, och arbetar för att stärka stadens arbete med uppföljning, analys, processer och projekt.\n\nKlimatanpassning innebär att genomföra åtgärder för att anpassa samhället till de förändringar som märks redan idag och de som inte kan förhindras i framtiden. Effekter av klimatförändringar kan vara översvämningar, torka, värmeböljor, och andra komplexa frågor som kommunen behöver arbeta proaktivt med för att bygga Mölndal robust i ett förändrat klimat. Det klimatstrategiska arbetet handlar också om hur klimatrisker kan hanteras samtidigt som andra värden utvecklas. \n\n\r\n\r\nARBETSUPPGIFTER\nVi söker en vikarierande utvecklingsledare för klimatanpassning. Tjänsten är placerad på stadsledningsförvaltningen, enheten Samordning för hållbarhet. Uppdraget att utveckla stadens samlade klimatstrategiska arbete med särskilt fokus på klimatanpassning startades upp hösten 2021. Efter en nulägesanalys och förankringsprocess är nu fokus på att ta fram en handlingsplan och struktur för klimatanpassningsarbetet. Arbetet utgår ifrån Mölndals stads övergripande mål och strategier. Utvecklingsledaren inom klimatpassning arbetar förvaltningsövergripande och representerar staden i regionala sammanhang. \n\nSom vikarierande utvecklingsledare för klimatanpassning kommer du in i ett läge där arbetet är uppstartat. De identifierade riskerna och sårbarheterna som klimatförändringar medför i Mölndal ska bedömas och plansättas, och en systematik för att hantera riskerna ska byggas upp. Rollen svarar för övergripande samordning, planering och uppföljning, såväl som kompetensutveckling, kommunikation och engagemang i klimatanpassningsfrågorna. \n\r\n\r\nKVALIFIKATIONER\nVi söker dig som har akademisk examen på minst kandidatnivå inom exempelvis samhällsplanering, miljövetenskap eller annan högskoleutbildning som arbetsgivaren bedömer likvärdig. För att lyckas i uppdraget har du kunskap och erfarenhet av samordning, utvecklingsarbete och/eller projekt/processledning. Kunskap och erfarenhet av klimatanpassningsfrågor är meriterande. Meriterande är även erfarenhet av arbete i politiskt styrd organisation.\n\nDet här vikariatet passar dig som är ansvarstagande och driven samt självständig, med förmåga att strukturerat planera och driva ditt arbete utifrån uppsatta processer. Vi tror att du har samarbetsförmåga, flexibilitet och ett intresse för samhällsutveckling. \n\nStor vikt kommer att läggas vid personlig lämplighet\n\r\n\nÖVRIGT\nVi ser mångfald som en styrka och välkomnar därför sökande med olika bakgrund.\n\nBehöver du hjälp med att söka tjänsten? Kontakta kundservice på 0771-693 693.\n\nVi vill upplysa om att din ansökan är en offentlig handling enligt offentlighetsprincipen.\n\nInför rekryteringsarbetet har vi tagit ställning till rekryteringskanaler och marknadsföring. Vi undanber oss därför bestämt kontakt med mediesäljare, rekryteringssajter och liknande.",
        "conditions" : "Heltid. \r\nTidsbegränsad anställning, tillträde: 2022-11-01  Tillträde under hösten enligt överenskommelse, upphör: 2023-08-31  .",
        "text" : "I Mölndals stad är vi stolta över att ha Sveriges viktigaste jobb där vi tillsammans skapar bästa möjliga vardag för våra medborgare. Med mod och kreativitet utvecklar vi våra verksamheter och bidrar till att Mölndal blir en ännu bättre plats att leva och jobba i. Välkommen att göra skillnad i människors vardag varje dag!\n\nSamordning för hållbarhet arbetar för att integrera Agenda 2030 och hållbar utveckling i styrningen. Enheten har övergripande ansvar för att samordna och driva processer för en socialt och ekologiskt hållbar utveckling. Den svarar för planeringsunderlag, prognoser och omvärldsanalyser, och arbetar för att stärka stadens arbete med uppföljning, analys, processer och projekt.\n\nKlimatanpassning innebär att genomföra åtgärder för att anpassa samhället till de förändringar som märks redan idag och de som inte kan förhindras i framtiden. Effekter av klimatförändringar kan vara översvämningar, torka, värmeböljor, och andra komplexa frågor som kommunen behöver arbeta proaktivt med för att bygga Mölndal robust i ett förändrat klimat. Det klimatstrategiska arbetet handlar också om hur klimatrisker kan hanteras samtidigt som andra värden utvecklas. \n\n\r\n\r\nARBETSUPPGIFTER\nVi söker en vikarierande utvecklingsledare för klimatanpassning. Tjänsten är placerad på stadsledningsförvaltningen, enheten Samordning för hållbarhet. Uppdraget att utveckla stadens samlade klimatstrategiska arbete med särskilt fokus på klimatanpassning startades upp hösten 2021. Efter en nulägesanalys och förankringsprocess är nu fokus på att ta fram en handlingsplan och struktur för klimatanpassningsarbetet. Arbetet utgår ifrån Mölndals stads övergripande mål och strategier. Utvecklingsledaren inom klimatpassning arbetar förvaltningsövergripande och representerar staden i regionala sammanhang. \n\nSom vikarierande utvecklingsledare för klimatanpassning kommer du in i ett läge där arbetet är uppstartat. De identifierade riskerna och sårbarheterna som klimatförändringar medför i Mölndal ska bedömas och plansättas, och en systematik för att hantera riskerna ska byggas upp. Rollen svarar för övergripande samordning, planering och uppföljning, såväl som kompetensutveckling, kommunikation och engagemang i klimatanpassningsfrågorna. \n\r\n\r\nKVALIFIKATIONER\nVi söker dig som har akademisk examen på minst kandidatnivå inom exempelvis samhällsplanering, miljövetenskap eller annan högskoleutbildning som arbetsgivaren bedömer likvärdig. För att lyckas i uppdraget har du kunskap och erfarenhet av samordning, utvecklingsarbete och/eller projekt/processledning. Kunskap och erfarenhet av klimatanpassningsfrågor är meriterande. Meriterande är även erfarenhet av arbete i politiskt styrd organisation.\n\nDet här vikariatet passar dig som är ansvarstagande och driven samt självständig, med förmåga att strukturerat planera och driva ditt arbete utifrån uppsatta processer. Vi tror att du har samarbetsförmåga, flexibilitet och ett intresse för samhällsutveckling. \n\nStor vikt kommer att läggas vid personlig lämplighet\n\r\n\nÖVRIGT\nVi ser mångfald som en styrka och välkomnar därför sökande med olika bakgrund.\n\nBehöver du hjälp med att söka tjänsten? Kontakta kundservice på 0771-693 693.\n\nVi vill upplysa om att din ansökan är en offentlig handling enligt offentlighetsprincipen.\n\nInför rekryteringsarbetet har vi tagit ställning till rekryteringskanaler och marknadsföring. Vi undanber oss därför bestämt kontakt med mediesäljare, rekryteringssajter och liknande."
      },
      "headline" : "Vikarierande utvecklingsledare klimatanpassning",
      "driving_license" : null,
      "employer" : {
        "email" : null,
        "phone_number" : null,
        "organization_number" : "2120001363",
        "name" : "Mölndals kommun",
        "url" : null,
        "workplace" : "Mölndals stad, Enheten samordning för hållbarhet"
      },
      "removed_date" : null,
      "logo_url" : "https://www.arbetsformedlingen.se/rest/arbetsgivare/rest/af/v3/organisation/2120001363/logotyper/logo.png",
      "last_publication_date" : "2022-08-14T23:59:59",
      "number_of_vacancies" : 1,
      "occupation" : {
        "concept_id" : "4gH3_huQ_czg",
        "label" : "Miljösamordnare/Miljökoordinator",
        "legacy_ams_taxonomy_id" : "1922"
      },
      "occupation_group" : {
        "concept_id" : "rE1E_m3d_cx1",
        "label" : "Specialister inom miljöskydd och miljöteknik",
        "legacy_ams_taxonomy_id" : "2183"
      },
      "employment_type" : {
        "concept_id" : "PFZr_Syz_cUq",
        "label" : "Vanlig anställning",
        "legacy_ams_taxonomy_id" : "1"
      },
      "webpage_url" : "https://arbetsformedlingen.se/platsbanken/annonser/26349581",
      "driving_license_required" : false,
      "application_contacts" : [ {
        "description" : "Lisa Järner",
        "email" : "lisa.jarner@molndal.se",
        "telephone" : "031-315 13 20",
        "name" : null,
        "contact_type" : "Enhetschef"
      } ],
      "duration" : {
        "concept_id" : "qQUd_4qe_NDT",
        "label" : "6 månader eller längre",
        "legacy_ams_taxonomy_id" : "2"
      },
      "nice_to_have" : {
        "education_level" : [ ],
        "work_experiences" : [ ],
        "skills" : [ ],
        "education" : [ ],
        "languages" : [ ]
      },
      "application_details" : {
        "via_af" : false,
        "email" : null,
        "other" : null,
        "reference" : "C95809",
        "url" : "https://recruit.visma.com/Public/Apply.aspx?guidAssignment=b9ddeccc-9063-442a-99e8-f41f4ca8a98e&publishCode=AMS&TK=daea48aa-ac5b-4f13-8524-6138885e217d",
        "information" : null
      },
      "source_type" : "VIA_PLATSBANKEN_DXA",
      "application_deadline" : "2022-08-14T23:59:59",
      "external_id" : "46-212000-1363-B9DDECCC9063442A99E8F41F4CA8A98E",
      "workplace_address" : {
        "coordinates" : [ 12.016667, 57.65 ],
        "city" : null,
        "postcode" : null,
        "municipality" : "Mölndal",
        "region_concept_id" : "zdoY_6u5_Krt",
        "region" : "Västra Götalands län",
        "country_code" : "199",
        "region_code" : "14",
        "municipality_concept_id" : "mc45_ki9_Bv3",
        "country_concept_id" : "i46j_HmG_v64",
        "municipality_code" : "1481",
        "street_address" : null,
        "country" : "Sverige"
      },
      "id" : "26349581",
      "experience_required" : true,
      "working_hours_type" : {
        "concept_id" : "6YE1_gAC_R2G",
        "label" : "Heltid",
        "legacy_ams_taxonomy_id" : "1"
      },
      "access" : null,
      "timestamp" : 1658726114419,
      "must_have" : {
        "education_level" : [ ],
        "work_experiences" : [ {
          "concept_id" : "4gH3_huQ_czg",
          "weight" : 10,
          "label" : "Miljösamordnare/Miljökoordinator",
          "legacy_ams_taxonomy_id" : "1922"
        } ],
        "skills" : [ ],
        "education" : [ ],
        "languages" : [ ]
      },
      "occupation_field" : {
        "concept_id" : "kJeN_wmw_9wX",
        "label" : "Naturvetenskap",
        "legacy_ams_taxonomy_id" : "14"
      },
      "scope_of_work" : {
        "min" : 100,
        "max" : 100
      },
      "salary_type" : {
        "concept_id" : "oG8G_9cW_nRf",
        "label" : "Fast månads- vecko- eller timlön",
        "legacy_ams_taxonomy_id" : "1"
      },
      "removed" : false,
      "salary_description" : "Enligt avtal.",
      "access_to_own_car" : false,
      "publication_date" : "2022-07-25T07:15:14"
    },
    "name" : "Vikarierande utvecklingsledare klimatanpassning",
    "user" : "hannes"
  },
  "sha1" : "1f0b4f4a5ae1def23431bba7cc2791c544afcc87",
  "annotations" : [ {
    "preferred-label" : "Vikariat",
    "type" : "employment-type",
    "start-position" : 0,
    "end-position" : 12,
    "concept-id" : "gro4_cWF_6D7",
    "matched-string" : "Vikarierande",
    "annotation-id" : 16
  }, {
    "preferred-label" : "Utvecklingsledare",
    "sentiment" : "MUST_HAVE",
    "type" : "keyword",
    "start-position" : 13,
    "end-position" : 30,
    "concept-id" : "weQx_ZCB_ka9",
    "matched-string" : "utvecklingsledare",
    "annotation-id" : 0
  }, {
    "preferred-label" : "Mölndal",
    "type" : "municipality",
    "start-position" : 50,
    "end-position" : 63,
    "concept-id" : "mc45_ki9_Bv3",
    "matched-string" : "Mölndals stad",
    "annotation-id" : 11
  }, {
    "preferred-label" : "Sverige",
    "type" : "country",
    "start-position" : 89,
    "end-position" : 97,
    "concept-id" : "i46j_HmG_v64",
    "matched-string" : "Sveriges",
    "annotation-id" : 12
  }, {
    "preferred-label" : "Hållbar utveckling",
    "sentiment" : "MUST_HAVE",
    "type" : "keyword",
    "start-position" : 441,
    "end-position" : 459,
    "concept-id" : "RKw3_zWW_1pf",
    "matched-string" : "hållbar utveckling",
    "annotation-id" : 1
  }, {
    "preferred-label" : "Hållbar utveckling",
    "sentiment" : "MUST_HAVE",
    "type" : "keyword",
    "start-position" : 573,
    "end-position" : 591,
    "concept-id" : "RKw3_zWW_1pf",
    "matched-string" : "hållbar utveckling",
    "annotation-id" : 2
  }, {
    "preferred-label" : "Mölndal",
    "type" : "municipality",
    "start-position" : 1069,
    "end-position" : 1076,
    "concept-id" : "mc45_ki9_Bv3",
    "matched-string" : "Mölndal",
    "annotation-id" : 13
  }, {
    "preferred-label" : "Vikariat",
    "type" : "employment-type",
    "start-position" : 1257,
    "end-position" : 1269,
    "concept-id" : "gro4_cWF_6D7",
    "matched-string" : "vikarierande",
    "annotation-id" : 14
  }, {
    "preferred-label" : "Utvecklingsledare",
    "sentiment" : "MUST_HAVE",
    "type" : "keyword",
    "start-position" : 1270,
    "end-position" : 1287,
    "concept-id" : "weQx_ZCB_ka9",
    "matched-string" : "utvecklingsledare",
    "annotation-id" : 3
  }, {
    "preferred-label" : "Mölndal",
    "type" : "municipality",
    "start-position" : 1680,
    "end-position" : 1694,
    "concept-id" : "mc45_ki9_Bv3",
    "matched-string" : "Mölndals stads",
    "annotation-id" : 17
  }, {
    "preferred-label" : "Vikariat",
    "type" : "employment-type",
    "start-position" : 1855,
    "end-position" : 1867,
    "concept-id" : "gro4_cWF_6D7",
    "matched-string" : "vikarierande",
    "annotation-id" : 15
  }, {
    "preferred-label" : "Utvecklingsledare",
    "sentiment" : "MUST_HAVE",
    "type" : "keyword",
    "start-position" : 1868,
    "end-position" : 1885,
    "concept-id" : "weQx_ZCB_ka9",
    "matched-string" : "utvecklingsledare",
    "annotation-id" : 4
  }, {
    "preferred-label" : "Mölndal",
    "type" : "municipality",
    "start-position" : 2034,
    "end-position" : 2041,
    "concept-id" : "mc45_ki9_Bv3",
    "matched-string" : "Mölndal",
    "annotation-id" : 18
  }, {
    "preferred-label" : "Universitets- eller högskoleutbildning",
    "type" : "sni-level-5",
    "start-position" : 2330,
    "end-position" : 2346,
    "concept-id" : "4Hs1_pdH_C7k",
    "matched-string" : "akademisk examen",
    "annotation-id" : 19
  }, {
    "preferred-label" : "Högskoleutbildning, generell, 3 år",
    "type" : "sun-education-level-3",
    "start-position" : 2356,
    "end-position" : 2368,
    "concept-id" : "u9Qr_2wJ_nVu",
    "matched-string" : "kandidatnivå",
    "annotation-id" : 20
  }, {
    "preferred-label" : "Samhällsplanering",
    "sentiment" : "MUST_HAVE",
    "type" : "skill",
    "start-position" : 2385,
    "end-position" : 2402,
    "concept-id" : "5FMU_Dt4_2hF",
    "matched-string" : "samhällsplanering",
    "annotation-id" : 6
  }, {
    "preferred-label" : "Miljövetenskap",
    "sentiment" : "MUST_HAVE",
    "type" : "sun-education-field-3",
    "start-position" : 2404,
    "end-position" : 2418,
    "concept-id" : "cs1N_Zp4_KgB",
    "matched-string" : "miljövetenskap",
    "annotation-id" : 7
  }, {
    "preferred-label" : "Universitets- eller högskoleutbildning",
    "type" : "sni-level-5",
    "start-position" : 2431,
    "end-position" : 2449,
    "concept-id" : "4Hs1_pdH_C7k",
    "matched-string" : "högskoleutbildning",
    "annotation-id" : 21
  }, {
    "preferred-label" : "Utvecklingsarbete",
    "sentiment" : "MUST_HAVE",
    "type" : "skill",
    "start-position" : 2559,
    "end-position" : 2576,
    "concept-id" : "LsGo_Kh2_3kH",
    "matched-string" : "utvecklingsarbete",
    "annotation-id" : 8
  }, {
    "preferred-label" : "projektledning",
    "type" : "esco-skill",
    "start-position" : 2587,
    "end-position" : 2594,
    "concept-id" : "PPNS_ZLX_YsQ",
    "matched-string" : "projekt",
    "annotation-id" : 22
  }, {
    "preferred-label" : "visa ansvarstagande",
    "type" : "esco-skill",
    "start-position" : 2788,
    "end-position" : 2802,
    "concept-id" : "bcRp_hxV_f5G",
    "matched-string" : "ansvarstagande",
    "annotation-id" : 23
  } ],
  "text" : "Vikarierande utvecklingsledare klimatanpassning\nI Mölndals stad är vi stolta över att ha Sveriges viktigaste jobb där vi tillsammans skapar bästa möjliga vardag för våra medborgare. Med mod och kreativitet utvecklar vi våra verksamheter och bidrar till att Mölndal blir en ännu bättre plats att leva och jobba i. Välkommen att göra skillnad i människors vardag varje dag!\n\nSamordning för hållbarhet arbetar för att integrera Agenda 2030 och hållbar utveckling i styrningen. Enheten har övergripande ansvar för att samordna och driva processer för en socialt och ekologiskt hållbar utveckling. Den svarar för planeringsunderlag, prognoser och omvärldsanalyser, och arbetar för att stärka stadens arbete med uppföljning, analys, processer och projekt.\n\nKlimatanpassning innebär att genomföra åtgärder för att anpassa samhället till de förändringar som märks redan idag och de som inte kan förhindras i framtiden. Effekter av klimatförändringar kan vara översvämningar, torka, värmeböljor, och andra komplexa frågor som kommunen behöver arbeta proaktivt med för att bygga Mölndal robust i ett förändrat klimat. Det klimatstrategiska arbetet handlar också om hur klimatrisker kan hanteras samtidigt som andra värden utvecklas. \n\n\r\n\r\nARBETSUPPGIFTER\nVi söker en vikarierande utvecklingsledare för klimatanpassning. Tjänsten är placerad på stadsledningsförvaltningen, enheten Samordning för hållbarhet. Uppdraget att utveckla stadens samlade klimatstrategiska arbete med särskilt fokus på klimatanpassning startades upp hösten 2021. Efter en nulägesanalys och förankringsprocess är nu fokus på att ta fram en handlingsplan och struktur för klimatanpassningsarbetet. Arbetet utgår ifrån Mölndals stads övergripande mål och strategier. Utvecklingsledaren inom klimatpassning arbetar förvaltningsövergripande och representerar staden i regionala sammanhang. \n\nSom vikarierande utvecklingsledare för klimatanpassning kommer du in i ett läge där arbetet är uppstartat. De identifierade riskerna och sårbarheterna som klimatförändringar medför i Mölndal ska bedömas och plansättas, och en systematik för att hantera riskerna ska byggas upp. Rollen svarar för övergripande samordning, planering och uppföljning, såväl som kompetensutveckling, kommunikation och engagemang i klimatanpassningsfrågorna. \n\r\n\r\nKVALIFIKATIONER\nVi söker dig som har akademisk examen på minst kandidatnivå inom exempelvis samhällsplanering, miljövetenskap eller annan högskoleutbildning som arbetsgivaren bedömer likvärdig. För att lyckas i uppdraget har du kunskap och erfarenhet av samordning, utvecklingsarbete och/eller projekt/processledning. Kunskap och erfarenhet av klimatanpassningsfrågor är meriterande. Meriterande är även erfarenhet av arbete i politiskt styrd organisation.\n\nDet här vikariatet passar dig som är ansvarstagande och driven samt självständig, med förmåga att strukturerat planera och driva ditt arbete utifrån uppsatta processer. Vi tror att du har samarbetsförmåga, flexibilitet och ett intresse för samhällsutveckling. \n\nStor vikt kommer att läggas vid personlig lämplighet\n\r\n\nÖVRIGT\nVi ser mångfald som en styrka och välkomnar därför sökande med olika bakgrund.\n\nBehöver du hjälp med att söka tjänsten? Kontakta kundservice på 0771-693 693.\n\nVi vill upplysa om att din ansökan är en offentlig handling enligt offentlighetsprincipen.\n\nInför rekryteringsarbetet har vi tagit ställning till rekryteringskanaler och marknadsföring. Vi undanber oss därför bestämt kontakt med mediesäljare, rekryteringssajter och liknande."
}