{
  "meta" : {
    "jobad" : {
      "description" : {
        "requirements" : null,
        "needs" : null,
        "company_information" : null,
        "text_formatted" : "*\nTillsammans med Toyota Material Handling söker vi nu svetsare! \n\nToyota är ett av världens mest kända varumärken. I Mjölby utvecklar de och producerar truckar och materialhanteringslösningar. Deras verksamhet kännetecknas av hög kvalitetsmedvetenhet, ständiga förbättringar och teknik i framkant. Det går bra för företaget och deras produktion växer, vilket medför att fler svetsare behövs till verksamheten.\n\nOm tjänsten\n\nDu blir anställd hos oss på Montico och uthyrd konsult till Toyota. För dig som gör en god arbetsinsats finns stora möjligheter att sedermera blir anställd direkt av företaget.\n\nArbetsbeskrivning\nSom svetsare på Toyota svetsar du bland annat chassin och stativ till truckar. Arbetet innefattar automatiserade processer såsom robotsvets, men även manuell svetsning förekommer. \n\n\nVi söker dig som\nEtt krav för tjänsten är att du har körkort och traverskort.\n\nVi ser gärna att du har giltig certifikat enligt 9606-1 för 135 eller 138. Det är också meriterande om du har tidigare erfarenhet av manuell svets och/eller robotsvets.\n\nSom person ser vi gärna att du trivs med att arbeta i ett högt tempo och vill leverera på topp. Ett av Toyotas viktigaste ledord är kvalitet och det är därför viktigt att du är en person som prioriterar det.\n\n\n\nOm Montico\nMontico är ett komplett matchningsföretag som erbjuder helhetslösningar till företag och privatpersoner inom rekrytering, bemanning och utbildning. Montico har närmare 1 000 anställda varav cirka 800 är konsulter utplacerade på uppdrag hos kund. Montico har kontor på 23 orter i Sverige med huvudkontor i Tranås samt ett kontor i Polen för internationell arbetskraft. Läs mer på www.montico.se.\n\nDin ansökan lämnar du via länken nedan. Vi tar ej emot ansökningar via mail. \n\nDå vi gör löpande urval tar vi gärna emot din ansökan så snart som möjligt.",
        "conditions" : "Heltid\r\nVisstid, mer än 6 månader",
        "text" : "*\nTillsammans med Toyota Material Handling söker vi nu svetsare! \n\nToyota är ett av världens mest kända varumärken. I Mjölby utvecklar de och producerar truckar och materialhanteringslösningar. Deras verksamhet kännetecknas av hög kvalitetsmedvetenhet, ständiga förbättringar och teknik i framkant. Det går bra för företaget och deras produktion växer, vilket medför att fler svetsare behövs till verksamheten.\n\nOm tjänsten\n\nDu blir anställd hos oss på Montico och uthyrd konsult till Toyota. För dig som gör en god arbetsinsats finns stora möjligheter att sedermera blir anställd direkt av företaget.\n\nArbetsbeskrivning\nSom svetsare på Toyota svetsar du bland annat chassin och stativ till truckar. Arbetet innefattar automatiserade processer såsom robotsvets, men även manuell svetsning förekommer. \n\n\nVi söker dig som\nEtt krav för tjänsten är att du har körkort och traverskort.\n\nVi ser gärna att du har giltig certifikat enligt 9606-1 för 135 eller 138. Det är också meriterande om du har tidigare erfarenhet av manuell svets och/eller robotsvets.\n\nSom person ser vi gärna att du trivs med att arbeta i ett högt tempo och vill leverera på topp. Ett av Toyotas viktigaste ledord är kvalitet och det är därför viktigt att du är en person som prioriterar det.\n\n\n\nOm Montico\nMontico är ett komplett matchningsföretag som erbjuder helhetslösningar till företag och privatpersoner inom rekrytering, bemanning och utbildning. Montico har närmare 1 000 anställda varav cirka 800 är konsulter utplacerade på uppdrag hos kund. Montico har kontor på 23 orter i Sverige med huvudkontor i Tranås samt ett kontor i Polen för internationell arbetskraft. Läs mer på www.montico.se.\n\nDin ansökan lämnar du via länken nedan. Vi tar ej emot ansökningar via mail. \n\nDå vi gör löpande urval tar vi gärna emot din ansökan så snart som möjligt."
      },
      "headline" : "Svetsare till Toyota i Mjölby sökes!",
      "driving_license" : [ {
        "concept_id" : "VTK8_WRx_GcM",
        "label" : "B",
        "legacy_ams_taxonomy_id" : "3"
      } ],
      "employer" : {
        "email" : null,
        "phone_number" : null,
        "organization_number" : "5565806741",
        "name" : "Montico Hr Partner AB",
        "url" : "http://www.montico.se/",
        "workplace" : "Montico HR Partner AB"
      },
      "removed_date" : null,
      "logo_url" : "https://www.arbetsformedlingen.se/rest/arbetsgivare/rest/af/v3/organisation/5565806741/logotyper/logo.png",
      "last_publication_date" : "2022-08-31T23:59:59",
      "number_of_vacancies" : 10,
      "occupation" : {
        "concept_id" : "wf1E_nWA_EJp",
        "label" : "Svetsare, manuell",
        "legacy_ams_taxonomy_id" : "5945"
      },
      "occupation_group" : {
        "concept_id" : "wQ1E_Bzk_ZyA",
        "label" : "Svetsare och gasskärare",
        "legacy_ams_taxonomy_id" : "7212"
      },
      "employment_type" : {
        "concept_id" : "PFZr_Syz_cUq",
        "label" : "Vanlig anställning",
        "legacy_ams_taxonomy_id" : "1"
      },
      "webpage_url" : "https://arbetsformedlingen.se/platsbanken/annonser/26375068",
      "driving_license_required" : true,
      "application_contacts" : [ {
        "description" : "Medina  Denic",
        "email" : null,
        "telephone" : null,
        "name" : null,
        "contact_type" : null
      } ],
      "duration" : {
        "concept_id" : "qQUd_4qe_NDT",
        "label" : "6 månader eller längre",
        "legacy_ams_taxonomy_id" : "2"
      },
      "nice_to_have" : {
        "education_level" : [ ],
        "work_experiences" : [ ],
        "skills" : [ ],
        "education" : [ ],
        "languages" : [ ]
      },
      "application_details" : {
        "via_af" : false,
        "email" : null,
        "other" : null,
        "reference" : "7223",
        "url" : "https://jobb.montico.se/lediga-jobb/7223/",
        "information" : null
      },
      "source_type" : "VIA_PLATSBANKEN_DXA",
      "application_deadline" : "2022-08-31T23:59:59",
      "external_id" : "46-556580-6741-7223",
      "workplace_address" : {
        "coordinates" : [ 15.133534, 58.32269 ],
        "city" : null,
        "postcode" : null,
        "municipality" : "Mjölby",
        "region_concept_id" : "oLT3_Q9p_3nn",
        "region" : "Östergötlands län",
        "country_code" : "199",
        "region_code" : "05",
        "municipality_concept_id" : "stqv_JGB_x8A",
        "country_concept_id" : "i46j_HmG_v64",
        "municipality_code" : "0586",
        "street_address" : null,
        "country" : "Sverige"
      },
      "id" : "26375068",
      "experience_required" : true,
      "working_hours_type" : {
        "concept_id" : "6YE1_gAC_R2G",
        "label" : "Heltid",
        "legacy_ams_taxonomy_id" : "1"
      },
      "access" : null,
      "timestamp" : 1659526557229,
      "must_have" : {
        "education_level" : [ ],
        "work_experiences" : [ {
          "concept_id" : "wf1E_nWA_EJp",
          "weight" : 10,
          "label" : "Svetsare, manuell",
          "legacy_ams_taxonomy_id" : "5945"
        } ],
        "skills" : [ ],
        "education" : [ ],
        "languages" : [ ]
      },
      "occupation_field" : {
        "concept_id" : "wTEr_CBC_bqh",
        "label" : "Industriell tillverkning",
        "legacy_ams_taxonomy_id" : "9"
      },
      "scope_of_work" : {
        "min" : 100,
        "max" : 100
      },
      "salary_type" : {
        "concept_id" : "oG8G_9cW_nRf",
        "label" : "Fast månads- vecko- eller timlön",
        "legacy_ams_taxonomy_id" : "1"
      },
      "removed" : false,
      "salary_description" : "Fast lön",
      "access_to_own_car" : true,
      "publication_date" : "2022-08-03T13:35:57"
    },
    "name" : "Svetsare till Toyota i Mjölby sökes!",
    "user" : "hannes"
  },
  "sha1" : "5d222a13350eeb79dd2f375f45a1412b00f81a6c",
  "annotations" : [ {
    "preferred-label" : "Svetsare",
    "sentiment" : "MUST_HAVE",
    "type" : "keyword",
    "start-position" : 0,
    "end-position" : 8,
    "concept-id" : "ouXc_F9J_bAC",
    "matched-string" : "svetsare",
    "annotation-id" : 0
  }, {
    "preferred-label" : "Mjölby",
    "type" : "municipality",
    "start-position" : 23,
    "end-position" : 29,
    "concept-id" : "stqv_JGB_x8A",
    "matched-string" : "Mjölby",
    "annotation-id" : 9
  }, {
    "preferred-label" : "Svetsare",
    "sentiment" : "MUST_HAVE",
    "type" : "keyword",
    "start-position" : 92,
    "end-position" : 100,
    "concept-id" : "ouXc_F9J_bAC",
    "matched-string" : "svetsare",
    "annotation-id" : 1
  }, {
    "preferred-label" : "Mjölby",
    "type" : "municipality",
    "start-position" : 155,
    "end-position" : 161,
    "concept-id" : "stqv_JGB_x8A",
    "matched-string" : "Mjölby",
    "annotation-id" : 10
  }, {
    "preferred-label" : "Ständiga förbättringar/Lean",
    "sentiment" : "MUST_HAVE",
    "type" : "skill",
    "start-position" : 290,
    "end-position" : 312,
    "concept-id" : "74Mw_JUN_VKx",
    "matched-string" : "ständiga förbättringar",
    "annotation-id" : 2
  }, {
    "preferred-label" : "Svetsare",
    "sentiment" : "MUST_HAVE",
    "type" : "keyword",
    "start-position" : 413,
    "end-position" : 421,
    "concept-id" : "ouXc_F9J_bAC",
    "matched-string" : "svetsare",
    "annotation-id" : 3
  }, {
    "preferred-label" : "Svetsare",
    "sentiment" : "MUST_HAVE",
    "type" : "keyword",
    "start-position" : 662,
    "end-position" : 670,
    "concept-id" : "ouXc_F9J_bAC",
    "matched-string" : "svetsare",
    "annotation-id" : 4
  }, {
    "preferred-label" : "Robotsvetsare",
    "type" : "occupation-name",
    "start-position" : 787,
    "end-position" : 797,
    "concept-id" : "fcGC_Px4_Ygm",
    "matched-string" : "robotsvets",
    "annotation-id" : 11
  }, {
    "preferred-label" : "Svetsare, manuell",
    "type" : "occupation-name",
    "start-position" : 808,
    "end-position" : 825,
    "concept-id" : "wf1E_nWA_EJp",
    "matched-string" : "manuell svetsning",
    "annotation-id" : 12
  }, {
    "preferred-label" : "körkort",
    "type" : "esco-skill",
    "start-position" : 894,
    "end-position" : 901,
    "concept-id" : "UvDr_eNo_HSQ",
    "matched-string" : "körkort",
    "annotation-id" : 13
  }, {
    "preferred-label" : "Travers/Lyftanordningar",
    "type" : "skill",
    "start-position" : 906,
    "end-position" : 917,
    "concept-id" : "R6ZK_FGC_ovb",
    "matched-string" : "traverskort",
    "annotation-id" : 14
  }, {
    "preferred-label" : "Certifikat/licenser",
    "sentiment" : "MUST_HAVE",
    "type" : "skill-headline",
    "start-position" : 951,
    "end-position" : 961,
    "concept-id" : "s48H_Sft_DTn",
    "matched-string" : "certifikat",
    "annotation-id" : 5
  }, {
    "preferred-label" : "Svetsare, manuell",
    "type" : "occupation-name",
    "start-position" : 1053,
    "end-position" : 1066,
    "concept-id" : "wf1E_nWA_EJp",
    "matched-string" : "manuell svets",
    "annotation-id" : 15
  }, {
    "preferred-label" : "Robotsvetsare",
    "type" : "occupation-name",
    "start-position" : 1077,
    "end-position" : 1087,
    "concept-id" : "fcGC_Px4_Ygm",
    "matched-string" : "robotsvets",
    "annotation-id" : 16
  }, {
    "preferred-label" : "Kontor",
    "sentiment" : "MUST_HAVE",
    "type" : "keyword",
    "start-position" : 1570,
    "end-position" : 1576,
    "concept-id" : "Hyz1_7HF_AkP",
    "matched-string" : "kontor",
    "annotation-id" : 7
  }, {
    "preferred-label" : "Kontor",
    "sentiment" : "MUST_HAVE",
    "type" : "keyword",
    "start-position" : 1633,
    "end-position" : 1639,
    "concept-id" : "Hyz1_7HF_AkP",
    "matched-string" : "kontor",
    "annotation-id" : 8
  } ],
  "text" : "Svetsare till Toyota i Mjölby sökes!\n*\nTillsammans med Toyota Material Handling söker vi nu svetsare! \n\nToyota är ett av världens mest kända varumärken. I Mjölby utvecklar de och producerar truckar och materialhanteringslösningar. Deras verksamhet kännetecknas av hög kvalitetsmedvetenhet, ständiga förbättringar och teknik i framkant. Det går bra för företaget och deras produktion växer, vilket medför att fler svetsare behövs till verksamheten.\n\nOm tjänsten\n\nDu blir anställd hos oss på Montico och uthyrd konsult till Toyota. För dig som gör en god arbetsinsats finns stora möjligheter att sedermera blir anställd direkt av företaget.\n\nArbetsbeskrivning\nSom svetsare på Toyota svetsar du bland annat chassin och stativ till truckar. Arbetet innefattar automatiserade processer såsom robotsvets, men även manuell svetsning förekommer. \n\n\nVi söker dig som\nEtt krav för tjänsten är att du har körkort och traverskort.\n\nVi ser gärna att du har giltig certifikat enligt 9606-1 för 135 eller 138. Det är också meriterande om du har tidigare erfarenhet av manuell svets och/eller robotsvets.\n\nSom person ser vi gärna att du trivs med att arbeta i ett högt tempo och vill leverera på topp. Ett av Toyotas viktigaste ledord är kvalitet och det är därför viktigt att du är en person som prioriterar det.\n\n\n\nOm Montico\nMontico är ett komplett matchningsföretag som erbjuder helhetslösningar till företag och privatpersoner inom rekrytering, bemanning och utbildning. Montico har närmare 1 000 anställda varav cirka 800 är konsulter utplacerade på uppdrag hos kund. Montico har kontor på 23 orter i Sverige med huvudkontor i Tranås samt ett kontor i Polen för internationell arbetskraft. Läs mer på www.montico.se.\n\nDin ansökan lämnar du via länken nedan. Vi tar ej emot ansökningar via mail. \n\nDå vi gör löpande urval tar vi gärna emot din ansökan så snart som möjligt."
}