{
  "meta" : {
    "jobad" : {
      "description" : {
        "requirements" : null,
        "needs" : null,
        "company_information" : null,
        "text_formatted" : "Hej!\n\nUr kunders ögon innehar vi förstaplatsen i branschen när det kommer till mest kunnig och mest flexibel personal. Vi är dessutom den affärskedja som bedöms ge snabbast service enligt kunders tycke - detta tror vi helt och hållet beror på våra säljares förmåga att lösa kundens problem på bästa vis! ✨\n\nVad erbjuder vi dig?\n\nInom retail och inte minst på Kjell & Company går utvecklingen i rask takt och vi utvecklar ständigt nya vägar för att möta våra kunders nya behov, alltid med Service i världsklass som given målsättning. Just nu är vi i full transformation från butiker till Service Points. I en Service Point möter du som säljare främst våra kunder i fysisk form, men kundmötena sker även digitalt genom chatt och 1-to-1 meeting eller livestreaming - alltid med kundens behov i fokus. Vi är stolta och säkra att du erbjuds en kultur där du kan vara dig själv, känna dig trygg och börja bygga många underbara minnen.\n\nDetta innebär med andra ord att du i säljarrollen på Kjell & Company kommer att vara med om en fantastisk resa där du ges möjlighet att bredda din kompetens och utvecklas inom flera spännande områden framåt. Oavsett kan vi lova dig att du har en oerhört spännande resa framför dig!\n\nVill du veta mer om hur är det att jobba som säljare hos oss? Låt vår grymma säljare Emil berätta mer! 👇\n\nVad söker vi?\n\nVi söker dig som vill arbeta 50% i vår butik i Västerås samt Erikslund. En tjänst i denna storlek kan också vara ett steg mot en större tjänst och kanske även en karriär vidare i företaget.\n\nVad är viktigt för att passa och trivas i rollen?\n\n Teknikintresserad! Du är nyfiken och intresserad av att lära dig mer inom teknikområdet. Mer än så behöver du inte - med fantastiska kollegor vid din sida och verktyg i form utav både introduktionsdagar och utbildningsportal med onlinekurser lär du dig mer och mer för var dag som går.\n\n Relationsbyggande! Du är genuint intresserad av försäljning, service och förstår kraften av att bygga långsiktiga relationer. Du ser det som en spännande utmaning att överträffa varje kunds förväntningar och känner stolthet i både ditt personliga varumärke så väl som företagets.\n\n Målinriktad! För oss är inte tidigare erfarenhet nödvändig - vi lägger stor vikt vid din utveckling och att du växer i rollen som säljare med dina personliga egenskaper som grund. I linje med vår strategi ”grow with Kjell”, med det menar vi oavsett om din ambition är att arbeta hos oss vid sidan om dina studier eller om du på sikt vill växa internt erbjuder vi på Kjell den möjligheten. Idag internrekryteras 70% utav alla våra ledare, vi erbjuder ett ledarskapsprogram som vi kallar Butikschef - trainee för dig som är på sugen på att utvecklas vidare och ta steget till en Butikschefs-roll. På Kjell vill vi att du ska kunna växa och ta personliga kliv framåt, både i den roll du har och i nya roller.\n\nAllmän information\n\n Arbetet är förlagt till både vardagar och helger.\n\n Rekrytering sker löpande så tveka inte att skicka in din ansökan redan idag!\n\n Tjänsten kommer att tillsättas omgående.\n\nUtöver Handels kollektivavtal erbjuder vi även bonussystem, friskvårdsbidrag, attraktiv personalrabatt och vassa internutbildningar (exempelvis Butikschef - trainee).\n\nJag ser fram emot att läsa din ansökan!\n\nBästa hälsningar\n\nEleonora, Talent Acquisition & Development Partner, Kjell & Company 💙",
        "conditions" : "Deltid\r\nAnställningstid enligt överenskommelse",
        "text" : "Hej!\n\nUr kunders ögon innehar vi förstaplatsen i branschen när det kommer till mest kunnig och mest flexibel personal. Vi är dessutom den affärskedja som bedöms ge snabbast service enligt kunders tycke - detta tror vi helt och hållet beror på våra säljares förmåga att lösa kundens problem på bästa vis! ✨\n\nVad erbjuder vi dig?\n\nInom retail och inte minst på Kjell & Company går utvecklingen i rask takt och vi utvecklar ständigt nya vägar för att möta våra kunders nya behov, alltid med Service i världsklass som given målsättning. Just nu är vi i full transformation från butiker till Service Points. I en Service Point möter du som säljare främst våra kunder i fysisk form, men kundmötena sker även digitalt genom chatt och 1-to-1 meeting eller livestreaming - alltid med kundens behov i fokus. Vi är stolta och säkra att du erbjuds en kultur där du kan vara dig själv, känna dig trygg och börja bygga många underbara minnen.\n\nDetta innebär med andra ord att du i säljarrollen på Kjell & Company kommer att vara med om en fantastisk resa där du ges möjlighet att bredda din kompetens och utvecklas inom flera spännande områden framåt. Oavsett kan vi lova dig att du har en oerhört spännande resa framför dig!\n\nVill du veta mer om hur är det att jobba som säljare hos oss? Låt vår grymma säljare Emil berätta mer! 👇\n\nVad söker vi?\n\nVi söker dig som vill arbeta 50% i vår butik i Västerås samt Erikslund. En tjänst i denna storlek kan också vara ett steg mot en större tjänst och kanske även en karriär vidare i företaget.\n\nVad är viktigt för att passa och trivas i rollen?\n\n Teknikintresserad! Du är nyfiken och intresserad av att lära dig mer inom teknikområdet. Mer än så behöver du inte - med fantastiska kollegor vid din sida och verktyg i form utav både introduktionsdagar och utbildningsportal med onlinekurser lär du dig mer och mer för var dag som går.\n\n Relationsbyggande! Du är genuint intresserad av försäljning, service och förstår kraften av att bygga långsiktiga relationer. Du ser det som en spännande utmaning att överträffa varje kunds förväntningar och känner stolthet i både ditt personliga varumärke så väl som företagets.\n\n Målinriktad! För oss är inte tidigare erfarenhet nödvändig - vi lägger stor vikt vid din utveckling och att du växer i rollen som säljare med dina personliga egenskaper som grund. I linje med vår strategi ”grow with Kjell”, med det menar vi oavsett om din ambition är att arbeta hos oss vid sidan om dina studier eller om du på sikt vill växa internt erbjuder vi på Kjell den möjligheten. Idag internrekryteras 70% utav alla våra ledare, vi erbjuder ett ledarskapsprogram som vi kallar Butikschef - trainee för dig som är på sugen på att utvecklas vidare och ta steget till en Butikschefs-roll. På Kjell vill vi att du ska kunna växa och ta personliga kliv framåt, både i den roll du har och i nya roller.\n\nAllmän information\n\n Arbetet är förlagt till både vardagar och helger.\n\n Rekrytering sker löpande så tveka inte att skicka in din ansökan redan idag!\n\n Tjänsten kommer att tillsättas omgående.\n\nUtöver Handels kollektivavtal erbjuder vi även bonussystem, friskvårdsbidrag, attraktiv personalrabatt och vassa internutbildningar (exempelvis Butikschef - trainee).\n\nJag ser fram emot att läsa din ansökan!\n\nBästa hälsningar\n\nEleonora, Talent Acquisition & Development Partner, Kjell & Company 💙"
      },
      "headline" : "Kjell & Company Västerås söker säljare med servicekänsla och teknikintre...",
      "driving_license" : null,
      "employer" : {
        "email" : null,
        "phone_number" : null,
        "organization_number" : "5564005378",
        "name" : "Kjell & Co Elektronik AB",
        "url" : "https://www.kjell.com/se",
        "workplace" : "Kjell & Company"
      },
      "removed_date" : null,
      "logo_url" : "https://www.arbetsformedlingen.se/rest/arbetsgivare/rest/af/v3/organisation/5564005378/logotyper/logo.png",
      "last_publication_date" : "2023-01-01T23:59:59",
      "number_of_vacancies" : 1,
      "occupation" : {
        "concept_id" : "ek9W_CmD_y2M",
        "label" : "Butikssäljare, fackhandel",
        "legacy_ams_taxonomy_id" : "5357"
      },
      "occupation_group" : {
        "concept_id" : "YKL2_FCB_1yr",
        "label" : "Butikssäljare, fackhandel",
        "legacy_ams_taxonomy_id" : "5223"
      },
      "employment_type" : {
        "concept_id" : "PFZr_Syz_cUq",
        "label" : "Vanlig anställning",
        "legacy_ams_taxonomy_id" : "1"
      },
      "webpage_url" : "https://arbetsformedlingen.se/platsbanken/annonser/26331757",
      "driving_license_required" : false,
      "application_contacts" : [ {
        "description" : "Eleonora Lagerkvist",
        "email" : null,
        "telephone" : null,
        "name" : null,
        "contact_type" : null
      } ],
      "duration" : {
        "concept_id" : "a7uU_j21_mkL",
        "label" : "Tills vidare",
        "legacy_ams_taxonomy_id" : "1"
      },
      "nice_to_have" : {
        "education_level" : [ ],
        "work_experiences" : [ ],
        "skills" : [ ],
        "education" : [ ],
        "languages" : [ ]
      },
      "application_details" : {
        "via_af" : false,
        "email" : null,
        "other" : null,
        "reference" : null,
        "url" : "https://kjell.teamtailor.com/jobs/1923944-kjell-company-vasteras-soker-saljare-med-servicekansla-och-teknikintresse?promotion=449708-arbetsformedlingen",
        "information" : null
      },
      "source_type" : "VIA_PLATSBANKEN_DXA",
      "application_deadline" : "2023-01-01T23:59:59",
      "external_id" : "46-556400-5378-1923944-1",
      "workplace_address" : {
        "coordinates" : [ 16.54481, 59.6099 ],
        "city" : null,
        "postcode" : null,
        "municipality" : "Västerås",
        "region_concept_id" : "G6DV_fKE_Viz",
        "region" : "Västmanlands län",
        "country_code" : "199",
        "region_code" : "19",
        "municipality_concept_id" : "8deT_FRF_2SP",
        "country_concept_id" : "i46j_HmG_v64",
        "municipality_code" : "1980",
        "street_address" : null,
        "country" : "Sverige"
      },
      "id" : "26331757",
      "experience_required" : false,
      "working_hours_type" : {
        "concept_id" : "947z_JGS_Uk2",
        "label" : "Deltid",
        "legacy_ams_taxonomy_id" : "2"
      },
      "access" : null,
      "timestamp" : 1657888688137,
      "must_have" : {
        "education_level" : [ ],
        "work_experiences" : [ ],
        "skills" : [ ],
        "education" : [ ],
        "languages" : [ ]
      },
      "occupation_field" : {
        "concept_id" : "RPTn_bxG_ExZ",
        "label" : "Försäljning, inköp, marknadsföring",
        "legacy_ams_taxonomy_id" : "5"
      },
      "scope_of_work" : {
        "min" : 0,
        "max" : 100
      },
      "salary_type" : {
        "concept_id" : "oG8G_9cW_nRf",
        "label" : "Fast månads- vecko- eller timlön",
        "legacy_ams_taxonomy_id" : "1"
      },
      "removed" : false,
      "salary_description" : "Lön enligt överenskommelse",
      "access_to_own_car" : false,
      "publication_date" : "2022-07-15T14:38:08"
    },
    "name" : "Kjell & Company Västerås söker säljare med servicekänsla och teknikintre...",
    "user" : "hannes"
  },
  "sha1" : "9817b17766a08ad5155ef0b1ac6663ab8a5cfcfd",
  "annotations" : [ {
    "preferred-label" : "Säljare",
    "sentiment" : "MUST_HAVE",
    "type" : "keyword",
    "start-position" : 31,
    "end-position" : 38,
    "concept-id" : "rDcj_Tao_TJJ",
    "matched-string" : "säljare",
    "annotation-id" : 0
  }, {
    "preferred-label" : "Personal",
    "sentiment" : "MUST_HAVE",
    "type" : "keyword",
    "start-position" : 185,
    "end-position" : 193,
    "concept-id" : "HVxM_6MS_y1c",
    "matched-string" : "personal",
    "annotation-id" : 1
  }, {
    "preferred-label" : "Säljare",
    "type" : "keyword",
    "start-position" : 324,
    "end-position" : 332,
    "concept-id" : "rDcj_Tao_TJJ",
    "matched-string" : "säljares",
    "annotation-id" : 11
  }, {
    "preferred-label" : "Säljare",
    "sentiment" : "MUST_HAVE",
    "type" : "keyword",
    "start-position" : 711,
    "end-position" : 718,
    "concept-id" : "rDcj_Tao_TJJ",
    "matched-string" : "säljare",
    "annotation-id" : 2
  }, {
    "preferred-label" : "Säljare",
    "type" : "keyword",
    "start-position" : 1043,
    "end-position" : 1055,
    "concept-id" : "rDcj_Tao_TJJ",
    "matched-string" : "säljarrollen",
    "annotation-id" : 12
  }, {
    "preferred-label" : "Säljare",
    "sentiment" : "MUST_HAVE",
    "type" : "keyword",
    "start-position" : 1334,
    "end-position" : 1341,
    "concept-id" : "rDcj_Tao_TJJ",
    "matched-string" : "säljare",
    "annotation-id" : 3
  }, {
    "preferred-label" : "Säljare",
    "sentiment" : "MUST_HAVE",
    "type" : "keyword",
    "start-position" : 1366,
    "end-position" : 1373,
    "concept-id" : "rDcj_Tao_TJJ",
    "matched-string" : "säljare",
    "annotation-id" : 4
  }, {
    "preferred-label" : "Heltid",
    "type" : "worktime-extent",
    "start-position" : 1440,
    "end-position" : 1443,
    "concept-id" : "6YE1_gAC_R2G",
    "matched-string" : "50%",
    "annotation-id" : 13
  }, {
    "preferred-label" : "Butik",
    "sentiment" : "MUST_HAVE",
    "type" : "keyword",
    "start-position" : 1450,
    "end-position" : 1455,
    "concept-id" : "xLsd_zjY_5wr",
    "matched-string" : "butik",
    "annotation-id" : 5
  }, {
    "preferred-label" : "Västerås",
    "type" : "municipality",
    "start-position" : 1458,
    "end-position" : 1466,
    "concept-id" : "8deT_FRF_2SP",
    "matched-string" : "Västerås",
    "annotation-id" : 14
  }, {
    "preferred-label" : "visa nyfikenhet",
    "type" : "esco-skill",
    "start-position" : 1679,
    "end-position" : 1686,
    "concept-id" : "mbHa_NFf_vyf",
    "matched-string" : "nyfiken",
    "annotation-id" : 15
  }, {
    "preferred-label" : "Säljare",
    "sentiment" : "MUST_HAVE",
    "type" : "keyword",
    "start-position" : 2354,
    "end-position" : 2361,
    "concept-id" : "rDcj_Tao_TJJ",
    "matched-string" : "säljare",
    "annotation-id" : 7
  }, {
    "preferred-label" : "butikschef",
    "sentiment" : "MUST_HAVE",
    "type" : "esco-occupation",
    "start-position" : 2710,
    "end-position" : 2720,
    "concept-id" : "bRZF_sdj_cdk",
    "matched-string" : "butikschef",
    "annotation-id" : 8
  }, {
    "preferred-label" : "Butikschef",
    "type" : "occupation-name",
    "start-position" : 2801,
    "end-position" : 2812,
    "concept-id" : "WWVG_4sM_faC",
    "matched-string" : "Butikschefs",
    "annotation-id" : 16
  }, {
    "preferred-label" : "Kollektivavtal",
    "sentiment" : "MUST_HAVE",
    "type" : "skill",
    "start-position" : 3140,
    "end-position" : 3154,
    "concept-id" : "z7wE_9xb_3jX",
    "matched-string" : "kollektivavtal",
    "annotation-id" : 9
  }, {
    "preferred-label" : "butikschef",
    "sentiment" : "MUST_HAVE",
    "type" : "esco-occupation",
    "start-position" : 3269,
    "end-position" : 3279,
    "concept-id" : "bRZF_sdj_cdk",
    "matched-string" : "butikschef",
    "annotation-id" : 10
  } ],
  "text" : "Kjell & Company Västerås söker säljare med servicekänsla och teknikintre...\nHej!\n\nUr kunders ögon innehar vi förstaplatsen i branschen när det kommer till mest kunnig och mest flexibel personal. Vi är dessutom den affärskedja som bedöms ge snabbast service enligt kunders tycke - detta tror vi helt och hållet beror på våra säljares förmåga att lösa kundens problem på bästa vis! ✨\n\nVad erbjuder vi dig?\n\nInom retail och inte minst på Kjell & Company går utvecklingen i rask takt och vi utvecklar ständigt nya vägar för att möta våra kunders nya behov, alltid med Service i världsklass som given målsättning. Just nu är vi i full transformation från butiker till Service Points. I en Service Point möter du som säljare främst våra kunder i fysisk form, men kundmötena sker även digitalt genom chatt och 1-to-1 meeting eller livestreaming - alltid med kundens behov i fokus. Vi är stolta och säkra att du erbjuds en kultur där du kan vara dig själv, känna dig trygg och börja bygga många underbara minnen.\n\nDetta innebär med andra ord att du i säljarrollen på Kjell & Company kommer att vara med om en fantastisk resa där du ges möjlighet att bredda din kompetens och utvecklas inom flera spännande områden framåt. Oavsett kan vi lova dig att du har en oerhört spännande resa framför dig!\n\nVill du veta mer om hur är det att jobba som säljare hos oss? Låt vår grymma säljare Emil berätta mer! 👇\n\nVad söker vi?\n\nVi söker dig som vill arbeta 50% i vår butik i Västerås samt Erikslund. En tjänst i denna storlek kan också vara ett steg mot en större tjänst och kanske även en karriär vidare i företaget.\n\nVad är viktigt för att passa och trivas i rollen?\n\n Teknikintresserad! Du är nyfiken och intresserad av att lära dig mer inom teknikområdet. Mer än så behöver du inte - med fantastiska kollegor vid din sida och verktyg i form utav både introduktionsdagar och utbildningsportal med onlinekurser lär du dig mer och mer för var dag som går.\n\n Relationsbyggande! Du är genuint intresserad av försäljning, service och förstår kraften av att bygga långsiktiga relationer. Du ser det som en spännande utmaning att överträffa varje kunds förväntningar och känner stolthet i både ditt personliga varumärke så väl som företagets.\n\n Målinriktad! För oss är inte tidigare erfarenhet nödvändig - vi lägger stor vikt vid din utveckling och att du växer i rollen som säljare med dina personliga egenskaper som grund. I linje med vår strategi ”grow with Kjell”, med det menar vi oavsett om din ambition är att arbeta hos oss vid sidan om dina studier eller om du på sikt vill växa internt erbjuder vi på Kjell den möjligheten. Idag internrekryteras 70% utav alla våra ledare, vi erbjuder ett ledarskapsprogram som vi kallar Butikschef - trainee för dig som är på sugen på att utvecklas vidare och ta steget till en Butikschefs-roll. På Kjell vill vi att du ska kunna växa och ta personliga kliv framåt, både i den roll du har och i nya roller.\n\nAllmän information\n\n Arbetet är förlagt till både vardagar och helger.\n\n Rekrytering sker löpande så tveka inte att skicka in din ansökan redan idag!\n\n Tjänsten kommer att tillsättas omgående.\n\nUtöver Handels kollektivavtal erbjuder vi även bonussystem, friskvårdsbidrag, attraktiv personalrabatt och vassa internutbildningar (exempelvis Butikschef - trainee).\n\nJag ser fram emot att läsa din ansökan!\n\nBästa hälsningar\n\nEleonora, Talent Acquisition & Development Partner, Kjell & Company 💙"
}