{
  "meta" : {
    "description" : "",
    "ssyk-level-4-kod" : "[\"7111\"]",
    "name" : "Bygg och anläggning Byggnadsträarbetare",
    "type" : "AUB",
    "utbildningsid" : "124473",
    "ssyk-level-4-namn" : "[\"Träarbetare, snickare m.fl.\"]"
  },
  "sha1" : "8dc94061051958e3206cce836fc301f19fce0f56",
  "annotations" : [ {
    "preferred-label" : "Byggnadsträarbetare",
    "sentiment" : "OFFERED",
    "type" : "keyword",
    "start-position" : 1011,
    "end-position" : 1030,
    "concept-id" : "2aHV_xTM_F6X",
    "matched-string" : "byggnadsträarbetare",
    "annotation-id" : 8
  }, {
    "preferred-label" : "Arbetsförmedlingen",
    "sentiment" : "OFFERED",
    "type" : "keyword",
    "start-position" : 945,
    "end-position" : 963,
    "concept-id" : "Mb2o_h3H_uGd",
    "matched-string" : "arbetsförmedlingen",
    "annotation-id" : 7
  }, {
    "preferred-label" : "Undervisning",
    "sentiment" : "OFFERED",
    "type" : "keyword",
    "start-position" : 592,
    "end-position" : 604,
    "concept-id" : "1Dtf_9iC_yAN",
    "matched-string" : "undervisning",
    "annotation-id" : 6
  }, {
    "preferred-label" : "Byggnadsträarbetare",
    "sentiment" : "OFFERED",
    "type" : "keyword",
    "start-position" : 391,
    "end-position" : 410,
    "concept-id" : "2aHV_xTM_F6X",
    "matched-string" : "byggnadsträarbetare",
    "annotation-id" : 5
  }, {
    "preferred-label" : "Inredning",
    "sentiment" : "OFFERED",
    "type" : "keyword",
    "start-position" : 320,
    "end-position" : 329,
    "concept-id" : "uAtM_95o_kaj",
    "matched-string" : "inredning",
    "annotation-id" : 4
  }, {
    "preferred-label" : "Betonggjutning",
    "sentiment" : "OFFERED",
    "type" : "skill",
    "start-position" : 304,
    "end-position" : 318,
    "concept-id" : "4jUM_i46_dpz",
    "matched-string" : "betonggjutning",
    "annotation-id" : 3
  }, {
    "preferred-label" : "Anläggningsarbete",
    "sentiment" : "OFFERED",
    "type" : "skill",
    "start-position" : 161,
    "end-position" : 178,
    "concept-id" : "myMG_ygC_kDW",
    "matched-string" : "anläggningsarbete",
    "annotation-id" : 2
  }, {
    "preferred-label" : "träarbetare",
    "sentiment" : "OFFERED",
    "type" : "esco-occupation",
    "start-position" : 68,
    "end-position" : 79,
    "concept-id" : "FmH5_Pqk_6k3",
    "matched-string" : "träarbetare",
    "annotation-id" : 1
  }, {
    "preferred-label" : "Byggnadsträarbetare",
    "sentiment" : "OFFERED",
    "type" : "keyword",
    "start-position" : 36,
    "end-position" : 55,
    "concept-id" : "2aHV_xTM_F6X",
    "matched-string" : "byggnadsträarbetare",
    "annotation-id" : 0
  } ],
  "text" : "Byggteknikutbildning med inriktning Byggnadsträarbetare\r\n*Om yrket\r\nTräarbetare arbetar med nybyggnationer, ombyggnationer och renoveringar av hus men också med anläggningsarbete som exempelvis brobygge. Arbetsuppgifterna kan variera mellan att till exempel konstruera bärande konstruktioner, formar för betonggjutning, inredning och montera gipsskivor.\r\n\r\n*Jobbmöjligheter\r\nDet är brist på Byggnadsträarbetare i landet men kan skilja i olika regioner. Därför bedöms yrket ha bra möjligheter till arbete.\r\n\r\n*Hur går utbildningen till?\r\nUtbildningen genomförs som en kombination av lärarledd undervisning, självstudier, praktiska uppgifter och arbetsplatsförlagd utbildning. Nödvändiga certifieringar och intyg för yrket ingår i utbildningen.\r\n\r\n*Hur lång är utbildningen?\r\nYrkesutbildningen är ca 38 veckor lång, beroende på vilka moduler som måste läsas in. \r\n\r\n*När startar utbildningen?\r\nOm det inte finns några aktuella starter så kontakta Arbetsförmedlingen.\r\n\r\n*Mål\r\nMålet är att bli anställningsbar som Byggnadsträarbetare, lärling"
}