{
  "meta" : {
    "jobad" : {
      "description" : {
        "requirements" : null,
        "needs" : null,
        "company_information" : null,
        "text_formatted" : "<p>Med mer än 50 års erfarenhet och ett gediget kunnande är vi experter på inredning av skol- och företagsmiljöer! Vi utrustar professionella presentationsmiljöer med lösningar för alla behov.</p><p>Vi söker AV-tekniker för installation/konfigurering av ljud och bildutrustningar. I den här tjänsten kommer du att hjälpa våra kunder med de tekniska lösningarna vi tillhandahåller, med fokus på AV inom konferens- och mötesteknik.</p><p>Som AV-tekniker på Tabula ska du vara en händig person med höga kvalitetskrav. B körkort är ett krav.</p><p>Meriterande är om du har erfarenhet av AV-installationer och/eller Videokonferens-lösningar .</p>",
        "conditions" : null,
        "text" : "Med mer än 50 års erfarenhet och ett gediget kunnande är vi experter på inredning av skol- och företagsmiljöer! Vi utrustar professionella presentationsmiljöer med lösningar för alla behov.\nVi söker AV-tekniker för installation/konfigurering av ljud och bildutrustningar. I den här tjänsten kommer du att hjälpa våra kunder med de tekniska lösningarna vi tillhandahåller, med fokus på AV inom konferens- och mötesteknik.\nSom AV-tekniker på Tabula ska du vara en händig person med höga kvalitetskrav. B körkort är ett krav.\nMeriterande är om du har erfarenhet av AV-installationer och/eller Videokonferens-lösningar ."
      },
      "headline" : "AV - tekniker",
      "driving_license" : [ {
        "concept_id" : "VTK8_WRx_GcM",
        "label" : "B",
        "legacy_ams_taxonomy_id" : "3"
      } ],
      "employer" : {
        "email" : null,
        "phone_number" : null,
        "organization_number" : "5561153080",
        "name" : "AB Tabula",
        "url" : "www.tabula.se",
        "workplace" : "Tabula AB"
      },
      "removed_date" : null,
      "logo_url" : null,
      "last_publication_date" : "2022-09-01T23:59:59",
      "number_of_vacancies" : 1,
      "occupation" : {
        "concept_id" : "kpw6_7cd_9X6",
        "label" : "AV-tekniker",
        "legacy_ams_taxonomy_id" : "5208"
      },
      "occupation_group" : {
        "concept_id" : "4BsK_q2C_sCL",
        "label" : "Ljus-, ljud- och scentekniker",
        "legacy_ams_taxonomy_id" : "3522"
      },
      "employment_type" : {
        "concept_id" : "PFZr_Syz_cUq",
        "label" : "Vanlig anställning",
        "legacy_ams_taxonomy_id" : "1"
      },
      "webpage_url" : "https://arbetsformedlingen.se/platsbanken/annonser/26370952",
      "driving_license_required" : true,
      "application_contacts" : [ ],
      "duration" : {
        "concept_id" : "a7uU_j21_mkL",
        "label" : "Tills vidare",
        "legacy_ams_taxonomy_id" : "1"
      },
      "nice_to_have" : {
        "education_level" : [ ],
        "work_experiences" : [ {
          "concept_id" : "kpw6_7cd_9X6",
          "weight" : 5,
          "label" : "AV-tekniker",
          "legacy_ams_taxonomy_id" : "5208"
        } ],
        "skills" : [ ],
        "education" : [ ],
        "languages" : [ ]
      },
      "application_details" : {
        "via_af" : false,
        "email" : "info@tabula.se",
        "other" : null,
        "reference" : null,
        "url" : null,
        "information" : null
      },
      "source_type" : "VIA_ANNONSERA",
      "application_deadline" : "2022-09-01T23:59:59",
      "external_id" : null,
      "workplace_address" : {
        "coordinates" : [ 13.041501349965559, 55.5627858963587 ],
        "city" : "Malmö",
        "postcode" : "21375",
        "municipality" : "Malmö",
        "region_concept_id" : "CaRE_1nn_cSU",
        "region" : "Skåne län",
        "country_code" : "199",
        "region_code" : "12",
        "municipality_concept_id" : "oYPt_yRA_Smm",
        "country_concept_id" : "i46j_HmG_v64",
        "municipality_code" : "1280",
        "street_address" : "Agnesfridsvägen 187",
        "country" : "Sverige"
      },
      "id" : "26370952",
      "experience_required" : true,
      "working_hours_type" : {
        "concept_id" : "6YE1_gAC_R2G",
        "label" : "Heltid",
        "legacy_ams_taxonomy_id" : "1"
      },
      "access" : null,
      "timestamp" : 1659431800289,
      "must_have" : {
        "education_level" : [ ],
        "work_experiences" : [ ],
        "skills" : [ ],
        "education" : [ ],
        "languages" : [ ]
      },
      "occupation_field" : {
        "concept_id" : "9puE_nYg_crq",
        "label" : "Kultur, media, design",
        "legacy_ams_taxonomy_id" : "11"
      },
      "scope_of_work" : {
        "min" : 0,
        "max" : 100
      },
      "salary_type" : {
        "concept_id" : "oG8G_9cW_nRf",
        "label" : "Fast månads- vecko- eller timlön",
        "legacy_ams_taxonomy_id" : "1"
      },
      "removed" : false,
      "salary_description" : null,
      "access_to_own_car" : false,
      "publication_date" : "2022-08-02T11:16:40"
    },
    "name" : "AV - tekniker",
    "user" : "hannes"
  },
  "sha1" : "573e87fc132117270b530046b3968c4cd82ef9ba",
  "annotations" : [ {
    "preferred-label" : "AV-tekniker",
    "type" : "occupation-name",
    "start-position" : 0,
    "end-position" : 13,
    "concept-id" : "kpw6_7cd_9X6",
    "matched-string" : "AV - tekniker",
    "annotation-id" : 4
  }, {
    "preferred-label" : "Inredning",
    "sentiment" : "MUST_HAVE",
    "type" : "keyword",
    "start-position" : 86,
    "end-position" : 95,
    "concept-id" : "uAtM_95o_kaj",
    "matched-string" : "inredning",
    "annotation-id" : 0
  }, {
    "preferred-label" : "AV-tekniker",
    "sentiment" : "MUST_HAVE",
    "type" : "occupation-name",
    "start-position" : 213,
    "end-position" : 224,
    "concept-id" : "kpw6_7cd_9X6",
    "matched-string" : "av-tekniker",
    "annotation-id" : 1
  }, {
    "preferred-label" : "Mötesteknik",
    "sentiment" : "MUST_HAVE",
    "type" : "keyword",
    "start-position" : 422,
    "end-position" : 433,
    "concept-id" : "QKRo_5d7_pLp",
    "matched-string" : "mötesteknik",
    "annotation-id" : 2
  }, {
    "preferred-label" : "AV-tekniker",
    "sentiment" : "MUST_HAVE",
    "type" : "occupation-name",
    "start-position" : 439,
    "end-position" : 450,
    "concept-id" : "kpw6_7cd_9X6",
    "matched-string" : "av-tekniker",
    "annotation-id" : 3
  }, {
    "preferred-label" : "B",
    "type" : "driving-licence",
    "start-position" : 514,
    "end-position" : 523,
    "concept-id" : "VTK8_WRx_GcM",
    "matched-string" : "B körkort",
    "annotation-id" : 5
  } ],
  "text" : "AV - tekniker\nMed mer än 50 års erfarenhet och ett gediget kunnande är vi experter på inredning av skol- och företagsmiljöer! Vi utrustar professionella presentationsmiljöer med lösningar för alla behov.\nVi söker AV-tekniker för installation/konfigurering av ljud och bildutrustningar. I den här tjänsten kommer du att hjälpa våra kunder med de tekniska lösningarna vi tillhandahåller, med fokus på AV inom konferens- och mötesteknik.\nSom AV-tekniker på Tabula ska du vara en händig person med höga kvalitetskrav. B körkort är ett krav.\nMeriterande är om du har erfarenhet av AV-installationer och/eller Videokonferens-lösningar ."
}