{
  "meta" : {
    "description" : "",
    "ssyk-level-4-kod" : "[\"9119\"]",
    "name" : "Service grundutbildning",
    "type" : "AUB",
    "utbildningsid" : "125199",
    "ssyk-level-4-namn" : "[\"Övrig hemservicepersonal m.fl.\"]"
  },
  "sha1" : "abeb88a4bafa991c22184f4cd6630b5aa7281d56",
  "annotations" : [ ],
  "text" : "Vänder sig till deltagare som är i behov av serviceutbildning för sin kommande yrkesroll. Syftet är att ge en grundläggande utbildning som ger kunskaper inom service och kommunikation. Utbildningen ska ge en god grund för alla som kommer att arbeta med yrken där det är viktigt att kunna ge god service. \r\nFör de personer som ska fortsätta till  andra yrkesområden/yrkesutbildningar ska leverantören göra en bedömning av personens kunskapsnivå och förutsättningar för yrke och studier."
}