{
  "meta" : {
    "jobad" : {
      "description" : {
        "requirements" : null,
        "needs" : null,
        "company_information" : null,
        "text_formatted" : "<p>På International Färgs moderna fabrik i Angered utanför Göteborg tillverkar vi ytskyddsfärger till broar, vindkraftverk, sportarenor med mera under varumärket International, vi är världsledande inom skyddsfärger. International Färg är sedan 1998 en del av AkzoNobel-koncernen. På anläggningen finns även sälj- och marknadskontor för våra tre affärsområden: Marine &amp; Protective, Yacht och Powder Coatings i Norden. Vi är cirka 150 stolta medarbetare som tillsammans representerar ett stort antal olika nationaliteter, tillsammans arbetar vi för att göra vår värld lite mer färgglad. </p><p>Är du praktiskt lagd, har en hög ansvarskänsla och har passion för färg? Vi söker nu två härliga kollegor som vill arbeta hos oss under en visstid till vår fabrik utanför Göteborg. </p><p><br></p><p><strong>Vad kommer du att arbeta med?</strong>                </p><p>Som Tappare hos oss arbetar du tillsammans i team med att säkerställa att produktionen går så smidigt som möjligt. Du kommer att arbeta med satsning eller tappning av färg, där också viss truckkörning förekommer. </p><p>De huvudsakliga arbetsuppgifterna är:</p><p>• Övervaka maskiner vid tillverkning av målarfärg och åtgärda problematik som kan uppstå.</p><p>• Blanda (satsa) kemiska tillsatser för att tillverka färgen.</p><p>• Tappa upp färg för att färdigställa produkten.</p><p>• Truckkörning, med såväl inkörning av produkter som lastning och lossning.</p><p>Tjänsterna är två visstidsanställningar då en ska på studieledighet och den andra på föräldrarledighet. Den ena tjänsten är med start i augusti tom 2023-05-26. Den andra tjänsten gäller under 1 år med start augusti/september. Du kommer att arbeta 2 -skift och vara placerad på siten i Angered, strax utanför Göteborg. </p><p><br></p><p><strong>Vem är du? </strong></p><p>För att vara framgångsrik i denna roll krävs att du gillar praktiskt arbete, du drivs av att lösa problem och har ett intresse för industrin. Som person är du positiv, öppen och gillar att arbeta. Arbetet kommer att ske både självständigt och i team, vilket ställer krav på god samarbetsförmåga och initiativtagande. </p><p>Vi ser gärna att du: </p><p>• Har en avslutad gymnasieutbildning med godkända betyg.</p><p>• Gillar att arbeta praktiskt där du får använda kroppen i arbetet.</p><p>• Kunna arbeta i en miljö som ställer hårda krav på säkerhet och miljö.</p><p>• Talar flytande i det svenska språket.</p><p>• Meriterande men inte ett krav är truckkort/tidigare erfarenhet från industrin.</p><p> </p><p><strong>Vad erbjuder AkzoNobel?</strong></p><p>Hos oss på AkzoNobel möts du av en varm och välkomnande atmosfär, där vi tillsammans arbetar för att ständigt nå målet att vara världsledande inom färg- och ytbehandlingar. Med fokus på mångfald och innovation arbetar vi aktivt med våra medarbetare för att du ska trivas och utvecklas kontinuerligt. Detta ligger även till grund för att vi är utnämnda till ett av Sveriges Karriärföretag 2022. Vi erbjuder dig en internationell arbetsmiljö där du får ta dig an givande och utmanande projekt som vidgar dina sinnen och utmanar din företagsamhet. Du kommer att arbeta med kompetenta och likasinnade kollegor som delar din inställning och entusiasm. Välkommen till oss!</p><p> </p><p><strong>Din ansökan</strong></p><p>Vi välkomnar människor från alla olika bakgrund som ser hållbarhet, säkerhet och integritet som viktiga principer. Om du har en passion för färg, ta då steget och lämna in din ansökan redan idag för din chans att få jobba tillsammans med oss! Vi använder oss av löpande urval och tjänsten kan komma att tillsättas innan sista ansökningsdatum.</p><p> </p><p>För ytterligare information om tjänsten, vänligen kontakta Ingrid Mattsson, Department Manager, ingrid.mattsson@akzonobel.com</p><p>För mer information om rekryteringsprocessen, vänligen kontakta Karolina Möller, Talent Acquisition Partner, karolina.moeller@akzonobel.com</p>",
        "conditions" : null,
        "text" : "På International Färgs moderna fabrik i Angered utanför Göteborg tillverkar vi ytskyddsfärger till broar, vindkraftverk, sportarenor med mera under varumärket International, vi är världsledande inom skyddsfärger. International Färg är sedan 1998 en del av AkzoNobel-koncernen. På anläggningen finns även sälj- och marknadskontor för våra tre affärsområden: Marine & Protective, Yacht och Powder Coatings i Norden. Vi är cirka 150 stolta medarbetare som tillsammans representerar ett stort antal olika nationaliteter, tillsammans arbetar vi för att göra vår värld lite mer färgglad. \nÄr du praktiskt lagd, har en hög ansvarskänsla och har passion för färg? Vi söker nu två härliga kollegor som vill arbeta hos oss under en visstid till vår fabrik utanför Göteborg. \n\n\nVad kommer du att arbeta med? \nSom Tappare hos oss arbetar du tillsammans i team med att säkerställa att produktionen går så smidigt som möjligt. Du kommer att arbeta med satsning eller tappning av färg, där också viss truckkörning förekommer. \nDe huvudsakliga arbetsuppgifterna är:\n• Övervaka maskiner vid tillverkning av målarfärg och åtgärda problematik som kan uppstå.\n• Blanda (satsa) kemiska tillsatser för att tillverka färgen.\n• Tappa upp färg för att färdigställa produkten.\n• Truckkörning, med såväl inkörning av produkter som lastning och lossning.\nTjänsterna är två visstidsanställningar då en ska på studieledighet och den andra på föräldrarledighet. Den ena tjänsten är med start i augusti tom 2023-05-26. Den andra tjänsten gäller under 1 år med start augusti/september. Du kommer att arbeta 2 -skift och vara placerad på siten i Angered, strax utanför Göteborg. \n\n\nVem är du? \nFör att vara framgångsrik i denna roll krävs att du gillar praktiskt arbete, du drivs av att lösa problem och har ett intresse för industrin. Som person är du positiv, öppen och gillar att arbeta. Arbetet kommer att ske både självständigt och i team, vilket ställer krav på god samarbetsförmåga och initiativtagande. \nVi ser gärna att du: \n• Har en avslutad gymnasieutbildning med godkända betyg.\n• Gillar att arbeta praktiskt där du får använda kroppen i arbetet.\n• Kunna arbeta i en miljö som ställer hårda krav på säkerhet och miljö.\n• Talar flytande i det svenska språket.\n• Meriterande men inte ett krav är truckkort/tidigare erfarenhet från industrin.\n \nVad erbjuder AkzoNobel?\nHos oss på AkzoNobel möts du av en varm och välkomnande atmosfär, där vi tillsammans arbetar för att ständigt nå målet att vara världsledande inom färg- och ytbehandlingar. Med fokus på mångfald och innovation arbetar vi aktivt med våra medarbetare för att du ska trivas och utvecklas kontinuerligt. Detta ligger även till grund för att vi är utnämnda till ett av Sveriges Karriärföretag 2022. Vi erbjuder dig en internationell arbetsmiljö där du får ta dig an givande och utmanande projekt som vidgar dina sinnen och utmanar din företagsamhet. Du kommer att arbeta med kompetenta och likasinnade kollegor som delar din inställning och entusiasm. Välkommen till oss!\n \nDin ansökan\nVi välkomnar människor från alla olika bakgrund som ser hållbarhet, säkerhet och integritet som viktiga principer. Om du har en passion för färg, ta då steget och lämna in din ansökan redan idag för din chans att få jobba tillsammans med oss! Vi använder oss av löpande urval och tjänsten kan komma att tillsättas innan sista ansökningsdatum.\n \nFör ytterligare information om tjänsten, vänligen kontakta Ingrid Mattsson, Department Manager, ingrid.mattsson@akzonobel.com\nFör mer information om rekryteringsprocessen, vänligen kontakta Karolina Möller, Talent Acquisition Partner, karolina.moeller@akzonobel.com"
      },
      "headline" : "Tappare",
      "driving_license" : null,
      "employer" : {
        "email" : null,
        "phone_number" : null,
        "organization_number" : "5564949666",
        "name" : "International Färg AB",
        "url" : null,
        "workplace" : "International Färg AB"
      },
      "removed_date" : null,
      "logo_url" : "https://www.arbetsformedlingen.se/rest/arbetsgivare/rest/af/v3/arbetsplatser/82388854/logotyper/logo.png",
      "last_publication_date" : "2022-08-07T00:00:00",
      "number_of_vacancies" : 1,
      "occupation" : {
        "concept_id" : "Ym1L_d8s_cad",
        "label" : "Produktionsassistent",
        "legacy_ams_taxonomy_id" : "6168"
      },
      "occupation_group" : {
        "concept_id" : "PH2M_uV4_r72",
        "label" : "Inspicienter och scriptor m.fl.",
        "legacy_ams_taxonomy_id" : "3433"
      },
      "employment_type" : {
        "concept_id" : "Jh8f_q9J_pbJ",
        "label" : "Sommarjobb / feriejobb",
        "legacy_ams_taxonomy_id" : "2"
      },
      "webpage_url" : "https://arbetsformedlingen.se/platsbanken/annonser/26324279",
      "driving_license_required" : false,
      "application_contacts" : [ ],
      "duration" : {
        "concept_id" : "qQUd_4qe_NDT",
        "label" : "6 månader eller längre",
        "legacy_ams_taxonomy_id" : "2"
      },
      "nice_to_have" : {
        "education_level" : [ ],
        "work_experiences" : [ ],
        "skills" : [ ],
        "education" : [ ],
        "languages" : [ ]
      },
      "application_details" : {
        "via_af" : false,
        "email" : null,
        "other" : null,
        "reference" : null,
        "url" : "https://careers.akzonobel.com/job/Angered-Tappare/828763601/",
        "information" : null
      },
      "source_type" : "VIA_ANNONSERA",
      "application_deadline" : "2022-08-07T00:00:00",
      "external_id" : null,
      "workplace_address" : {
        "coordinates" : [ 12.04424995736961, 57.79263393863345 ],
        "city" : "GUNNILSE",
        "postcode" : "42422",
        "municipality" : "Göteborg",
        "region_concept_id" : "zdoY_6u5_Krt",
        "region" : "Västra Götalands län",
        "country_code" : "199",
        "region_code" : "14",
        "municipality_concept_id" : "PVZL_BQT_XtL",
        "country_concept_id" : "i46j_HmG_v64",
        "municipality_code" : "1480",
        "street_address" : "HOLMEDALEN 3",
        "country" : "Sverige"
      },
      "id" : "26324279",
      "experience_required" : true,
      "working_hours_type" : {
        "concept_id" : "6YE1_gAC_R2G",
        "label" : "Heltid",
        "legacy_ams_taxonomy_id" : "1"
      },
      "access" : null,
      "timestamp" : 1657716045279,
      "must_have" : {
        "education_level" : [ ],
        "work_experiences" : [ ],
        "skills" : [ ],
        "education" : [ ],
        "languages" : [ {
          "concept_id" : "zSLA_vw2_FXN",
          "weight" : 10,
          "label" : "Svenska",
          "legacy_ams_taxonomy_id" : "502"
        }, {
          "concept_id" : "NVxJ_hLg_TYS",
          "weight" : 10,
          "label" : "Engelska",
          "legacy_ams_taxonomy_id" : "283"
        } ]
      },
      "occupation_field" : {
        "concept_id" : "9puE_nYg_crq",
        "label" : "Kultur, media, design",
        "legacy_ams_taxonomy_id" : "11"
      },
      "scope_of_work" : {
        "min" : 0,
        "max" : 100
      },
      "salary_type" : {
        "concept_id" : "oG8G_9cW_nRf",
        "label" : "Fast månads- vecko- eller timlön",
        "legacy_ams_taxonomy_id" : "1"
      },
      "removed" : false,
      "salary_description" : null,
      "access_to_own_car" : false,
      "publication_date" : "2022-07-13T14:40:45"
    },
    "name" : "Tappare",
    "user" : "kristof.fischer"
  },
  "sha1" : "6660d4b57dbfcd8375c157946beef27c3f6a895c",
  "annotations" : [ {
    "preferred-label" : "färgtekniker",
    "type" : "esco-occupation",
    "start-position" : 0,
    "end-position" : 7,
    "concept-id" : "ArDT_Bjd_R6i",
    "matched-string" : "Tappare",
    "annotation-id" : 15
  }, {
    "preferred-label" : "Göteborg",
    "type" : "municipality",
    "start-position" : 64,
    "end-position" : 72,
    "concept-id" : "PVZL_BQT_XtL",
    "matched-string" : "Göteborg",
    "annotation-id" : 16
  }, {
    "preferred-label" : "visa ansvarstagande",
    "sentiment" : "MUST_HAVE",
    "type" : "esco-skill",
    "start-position" : 624,
    "end-position" : 637,
    "concept-id" : "bcRp_hxV_f5G",
    "matched-string" : "ansvarskänsla",
    "annotation-id" : 17
  }, {
    "preferred-label" : "Göteborg",
    "type" : "municipality",
    "start-position" : 762,
    "end-position" : 770,
    "concept-id" : "PVZL_BQT_XtL",
    "matched-string" : "Göteborg",
    "annotation-id" : 18
  }, {
    "preferred-label" : "färgtekniker",
    "type" : "esco-occupation",
    "start-position" : 810,
    "end-position" : 817,
    "concept-id" : "ArDT_Bjd_R6i",
    "matched-string" : "Tappare",
    "annotation-id" : 19
  }, {
    "preferred-label" : "blanda färg",
    "sentiment" : "MUST_HAVE",
    "type" : "esco-skill",
    "start-position" : 1082,
    "end-position" : 1107,
    "concept-id" : "o1j3_Baj_N8k",
    "matched-string" : "tillverkning av målarfärg",
    "annotation-id" : 20
  }, {
    "preferred-label" : "blanda kemikalier",
    "sentiment" : "MUST_HAVE",
    "type" : "esco-skill",
    "start-position" : 1150,
    "end-position" : 1183,
    "concept-id" : "qAhg_9Fs_TeU",
    "matched-string" : "Blanda (satsa) kemiska tillsatser",
    "annotation-id" : 21
  }, {
    "preferred-label" : "färgningsteknik",
    "sentiment" : "MUST_HAVE",
    "type" : "esco-skill",
    "start-position" : 1212,
    "end-position" : 1226,
    "concept-id" : "n5hZ_uZz_S9T",
    "matched-string" : "Tappa upp färg",
    "annotation-id" : 22
  }, {
    "preferred-label" : "Truckvana",
    "sentiment" : "MUST_HAVE",
    "type" : "skill",
    "start-position" : 1261,
    "end-position" : 1273,
    "concept-id" : "pGts_PKK_c8W",
    "matched-string" : "Truckkörning",
    "annotation-id" : 23
  }, {
    "preferred-label" : "utföra lastning och lossning",
    "type" : "esco-skill",
    "start-position" : 1312,
    "end-position" : 1333,
    "concept-id" : "VVCW_HBb_BLF",
    "matched-string" : "lastning och lossning",
    "annotation-id" : 24
  }, {
    "preferred-label" : "Skiftarbete",
    "type" : "work-place-environment",
    "start-position" : 1585,
    "end-position" : 1590,
    "concept-id" : "YnG9_nVP_CsZ",
    "matched-string" : "skift",
    "annotation-id" : 25
  }, {
    "preferred-label" : "Göteborg",
    "type" : "municipality",
    "start-position" : 1643,
    "end-position" : 1651,
    "concept-id" : "PVZL_BQT_XtL",
    "matched-string" : "Göteborg",
    "annotation-id" : 26
  }, {
    "preferred-label" : "hitta lösningar på problem",
    "sentiment" : "MUST_HAVE",
    "type" : "esco-skill",
    "start-position" : 1761,
    "end-position" : 1773,
    "concept-id" : "WFSY_Bwt_QWE",
    "matched-string" : "lösa problem",
    "annotation-id" : 27
  }, {
    "preferred-label" : "arbeta självständigt",
    "sentiment" : "MUST_HAVE",
    "type" : "esco-skill",
    "start-position" : 1893,
    "end-position" : 1906,
    "concept-id" : "NyFu_HHd_zhz",
    "matched-string" : "självständigt",
    "annotation-id" : 28
  }, {
    "preferred-label" : "arbeta som ett team",
    "sentiment" : "MUST_HAVE",
    "type" : "esco-skill",
    "start-position" : 1913,
    "end-position" : 1917,
    "concept-id" : "VFVZ_4YG_Ydi",
    "matched-string" : "team",
    "annotation-id" : 29
  }, {
    "preferred-label" : "samarbeta med kolleger",
    "sentiment" : "MUST_HAVE",
    "type" : "esco-skill",
    "start-position" : 1946,
    "end-position" : 1962,
    "concept-id" : "X15R_797_q62",
    "matched-string" : "samarbetsförmåga",
    "annotation-id" : 30
  }, {
    "preferred-label" : "Gymnasial utbildning",
    "sentiment" : "MUST_HAVE",
    "type" : "sni-level-3",
    "start-position" : 2026,
    "end-position" : 2044,
    "concept-id" : "t8bn_FTn_FiG",
    "matched-string" : "gymnasieutbildning",
    "annotation-id" : 31
  }, {
    "preferred-label" : "Svenska",
    "sentiment" : "MUST_HAVE",
    "type" : "language",
    "start-position" : 2228,
    "end-position" : 2235,
    "concept-id" : "zSLA_vw2_FXN",
    "matched-string" : "svenska",
    "annotation-id" : 32
  }, {
    "preferred-label" : "Truckvana",
    "sentiment" : "NICE_TO_HAVE",
    "type" : "skill",
    "start-position" : 2280,
    "end-position" : 2289,
    "concept-id" : "pGts_PKK_c8W",
    "matched-string" : "truckkort",
    "annotation-id" : 33
  } ],
  "text" : "Tappare\nPå International Färgs moderna fabrik i Angered utanför Göteborg tillverkar vi ytskyddsfärger till broar, vindkraftverk, sportarenor med mera under varumärket International, vi är världsledande inom skyddsfärger. International Färg är sedan 1998 en del av AkzoNobel-koncernen. På anläggningen finns även sälj- och marknadskontor för våra tre affärsområden: Marine & Protective, Yacht och Powder Coatings i Norden. Vi är cirka 150 stolta medarbetare som tillsammans representerar ett stort antal olika nationaliteter, tillsammans arbetar vi för att göra vår värld lite mer färgglad. \nÄr du praktiskt lagd, har en hög ansvarskänsla och har passion för färg? Vi söker nu två härliga kollegor som vill arbeta hos oss under en visstid till vår fabrik utanför Göteborg. \n\n\nVad kommer du att arbeta med? \nSom Tappare hos oss arbetar du tillsammans i team med att säkerställa att produktionen går så smidigt som möjligt. Du kommer att arbeta med satsning eller tappning av färg, där också viss truckkörning förekommer. \nDe huvudsakliga arbetsuppgifterna är:\n• Övervaka maskiner vid tillverkning av målarfärg och åtgärda problematik som kan uppstå.\n• Blanda (satsa) kemiska tillsatser för att tillverka färgen.\n• Tappa upp färg för att färdigställa produkten.\n• Truckkörning, med såväl inkörning av produkter som lastning och lossning.\nTjänsterna är två visstidsanställningar då en ska på studieledighet och den andra på föräldrarledighet. Den ena tjänsten är med start i augusti tom 2023-05-26. Den andra tjänsten gäller under 1 år med start augusti/september. Du kommer att arbeta 2 -skift och vara placerad på siten i Angered, strax utanför Göteborg. \n\n\nVem är du? \nFör att vara framgångsrik i denna roll krävs att du gillar praktiskt arbete, du drivs av att lösa problem och har ett intresse för industrin. Som person är du positiv, öppen och gillar att arbeta. Arbetet kommer att ske både självständigt och i team, vilket ställer krav på god samarbetsförmåga och initiativtagande. \nVi ser gärna att du: \n• Har en avslutad gymnasieutbildning med godkända betyg.\n• Gillar att arbeta praktiskt där du får använda kroppen i arbetet.\n• Kunna arbeta i en miljö som ställer hårda krav på säkerhet och miljö.\n• Talar flytande i det svenska språket.\n• Meriterande men inte ett krav är truckkort/tidigare erfarenhet från industrin.\n \nVad erbjuder AkzoNobel?\nHos oss på AkzoNobel möts du av en varm och välkomnande atmosfär, där vi tillsammans arbetar för att ständigt nå målet att vara världsledande inom färg- och ytbehandlingar. Med fokus på mångfald och innovation arbetar vi aktivt med våra medarbetare för att du ska trivas och utvecklas kontinuerligt. Detta ligger även till grund för att vi är utnämnda till ett av Sveriges Karriärföretag 2022. Vi erbjuder dig en internationell arbetsmiljö där du får ta dig an givande och utmanande projekt som vidgar dina sinnen och utmanar din företagsamhet. Du kommer att arbeta med kompetenta och likasinnade kollegor som delar din inställning och entusiasm. Välkommen till oss!\n \nDin ansökan\nVi välkomnar människor från alla olika bakgrund som ser hållbarhet, säkerhet och integritet som viktiga principer. Om du har en passion för färg, ta då steget och lämna in din ansökan redan idag för din chans att få jobba tillsammans med oss! Vi använder oss av löpande urval och tjänsten kan komma att tillsättas innan sista ansökningsdatum.\n \nFör ytterligare information om tjänsten, vänligen kontakta Ingrid Mattsson, Department Manager, ingrid.mattsson@akzonobel.com\nFör mer information om rekryteringsprocessen, vänligen kontakta Karolina Möller, Talent Acquisition Partner, karolina.moeller@akzonobel.com"
}