{
  "meta" : {
    "jobad" : {
      "description" : {
        "requirements" : null,
        "needs" : null,
        "company_information" : null,
        "text_formatted" : "<p><strong>Om företaget</strong></p><p>Consafe Logistics är Europas ledande leverantör av lagerhanteringssystem. Vi levererar tillförlitliga, flexibla och smarta lösningar som skapar konkurrensfördelar för våra kunder över hela världen.</p><p>Med hjälp av vår expertis inom lagerhantering och ett starkt kundfokus levererar vi hållbara lösningar som passar alla lager, oavsett volym och komplexitet. Vi fokuserar på att optimera kundernas verksamhet och i kombination med mjukvaruutveckling i världsklass, ger det våra kunder en konkurrenskraftig fördel. Det har vi gjort sedan 1978.</p><p>Consafe Logistics-koncernen har 400 anställda och huvudkontoret är placerat i Lund. Vi arbetar med våra globala kunder via våra lokala kontor i Sverige, Norge, Danmark, Finland, Nederländerna, Polen och Storbritannien.<em> www.consafelogistics.com</em></p><p><strong>Om tjänsten</strong></p><p>Som tekniker inom hårdvara hos Consafe Logistics arbetar du nära både kunder och den interna organisationen. Detta då hårdvara supporterar hela verksamheten avseende hårdvaruleveranser. Consafe Logistics mission är att optimera sina kunders logistikflöden med hjälp av vårt egenutvecklade lagerhanteringssystem Astro WMS® och rätt hårdvara för kundernas lagerprocesser såsom truckdatorer, handdatorer, röstterminaler, skanners och etikettskrivare. Du kommer att ha ansvar för installation, konfiguration, leverans, implementering, support och service i samarbete med övriga i hårdvaruteamet. Vi räknar även med att din erfarenhet och personliga egenskaper kommer att bli ett viktigt bidrag till att stärka teamet och ytterligare förbättra våra processer.</p><p>Du agerar spindeln i nätet till våra kunder och fyller en viktig representerande och kontaktintensiv roll såväl internt som externt. Det är en mycket omväxlande roll där stor vikt läggs vid eget ansvar och god förmåga att samarbeta och samspela med övriga medarbetare i teamet. Du kommer framförallt arbeta med våra produkter från större tillverkare som exempelvis hårdvara från Honeywell &amp; Zebra uppkopplade i trådlösa nätverk och ibland med MDM system från SOTI.</p><p>Tjänsten är en rekrytering där anställningen ingås med Consafe Logistics men EMPLOID driver urvalsprocessen.</p><p><strong>Om dig</strong></p><p>För att vara aktuell för tjänsten krävs följande:</p><p>- Erfarenhet av hårdvara och support från roller som It-tekniker, teknisk support, drifttekniker eller roller med motsvarande arbetsuppgifter</p><p>- Kunskap inom hårdvara, nätverk och IT-miljöer</p><p>- Konfiguration av OS såsom Embedded Windows (IoT) eller Android är meriterande</p><p>-  Det är meriterande om du har kunskaper inom C++ och Python</p><p>- God förståelse för kundkontakt och ärendehantering</p><p>- Flytande i svenska och engelska</p><p>Som person är du serviceminded, har ett stort tekniskt intresse och brinner för att lösa tekniska problem. Du har ambitionen att alltid leverera goda resultat och ser till att hjälpa kunderna till varje pris. Du har en arbetsmetodik som genomsyras av struktur, vilket hjälper dig att självständigt driva ditt arbete framåt men som även möjliggör samarbete med dina kollegor.  </p><p><strong>Övrig information</strong></p><p>Start: Enligt överenskommelse</p><p>Plats: Lund</p><p>Arbetstid: Kontorstider vardag</p><p>Lön: Enligt överenskommelse</p><p><br></p><p>Om du har frågor om tjänsten ber vi dig att maila info@emploid.se så hjälper någon i teamet dig. Ange vilken tjänst det gäller.</p><p>Vi rekommenderar att du skickar in din ansökan omgående då vi gör ett löpande urval.</p><p>Välkommen med din ansökan!</p><p><br></p><p>Sökord: It-Support, It-tekniker, Supporttekniker, support specialist, support, teknisk support, hårdvara, nätverk, server, heltid, Lund, Malmö, Helsingborg, rekrytering</p>",
        "conditions" : null,
        "text" : "Om företaget\nConsafe Logistics är Europas ledande leverantör av lagerhanteringssystem. Vi levererar tillförlitliga, flexibla och smarta lösningar som skapar konkurrensfördelar för våra kunder över hela världen.\nMed hjälp av vår expertis inom lagerhantering och ett starkt kundfokus levererar vi hållbara lösningar som passar alla lager, oavsett volym och komplexitet. Vi fokuserar på att optimera kundernas verksamhet och i kombination med mjukvaruutveckling i världsklass, ger det våra kunder en konkurrenskraftig fördel. Det har vi gjort sedan 1978.\nConsafe Logistics-koncernen har 400 anställda och huvudkontoret är placerat i Lund. Vi arbetar med våra globala kunder via våra lokala kontor i Sverige, Norge, Danmark, Finland, Nederländerna, Polen och Storbritannien. www.consafelogistics.com\nOm tjänsten\nSom tekniker inom hårdvara hos Consafe Logistics arbetar du nära både kunder och den interna organisationen. Detta då hårdvara supporterar hela verksamheten avseende hårdvaruleveranser. Consafe Logistics mission är att optimera sina kunders logistikflöden med hjälp av vårt egenutvecklade lagerhanteringssystem Astro WMS® och rätt hårdvara för kundernas lagerprocesser såsom truckdatorer, handdatorer, röstterminaler, skanners och etikettskrivare. Du kommer att ha ansvar för installation, konfiguration, leverans, implementering, support och service i samarbete med övriga i hårdvaruteamet. Vi räknar även med att din erfarenhet och personliga egenskaper kommer att bli ett viktigt bidrag till att stärka teamet och ytterligare förbättra våra processer.\nDu agerar spindeln i nätet till våra kunder och fyller en viktig representerande och kontaktintensiv roll såväl internt som externt. Det är en mycket omväxlande roll där stor vikt läggs vid eget ansvar och god förmåga att samarbeta och samspela med övriga medarbetare i teamet. Du kommer framförallt arbeta med våra produkter från större tillverkare som exempelvis hårdvara från Honeywell & Zebra uppkopplade i trådlösa nätverk och ibland med MDM system från SOTI.\nTjänsten är en rekrytering där anställningen ingås med Consafe Logistics men EMPLOID driver urvalsprocessen.\nOm dig\nFör att vara aktuell för tjänsten krävs följande:\n- Erfarenhet av hårdvara och support från roller som It-tekniker, teknisk support, drifttekniker eller roller med motsvarande arbetsuppgifter\n- Kunskap inom hårdvara, nätverk och IT-miljöer\n- Konfiguration av OS såsom Embedded Windows (IoT) eller Android är meriterande\n-  Det är meriterande om du har kunskaper inom C++ och Python\n- God förståelse för kundkontakt och ärendehantering\n- Flytande i svenska och engelska\nSom person är du serviceminded, har ett stort tekniskt intresse och brinner för att lösa tekniska problem. Du har ambitionen att alltid leverera goda resultat och ser till att hjälpa kunderna till varje pris. Du har en arbetsmetodik som genomsyras av struktur, vilket hjälper dig att självständigt driva ditt arbete framåt men som även möjliggör samarbete med dina kollegor.  \nÖvrig information\nStart: Enligt överenskommelse\nPlats: Lund\nArbetstid: Kontorstider vardag\nLön: Enligt överenskommelse\n\n\nOm du har frågor om tjänsten ber vi dig att maila info@emploid.se så hjälper någon i teamet dig. Ange vilken tjänst det gäller.\nVi rekommenderar att du skickar in din ansökan omgående då vi gör ett löpande urval.\nVälkommen med din ansökan!\n\n\nSökord: It-Support, It-tekniker, Supporttekniker, support specialist, support, teknisk support, hårdvara, nätverk, server, heltid, Lund, Malmö, Helsingborg, rekrytering"
      },
      "headline" : "Hårdvaruspecialist / Hårdvarutekniker",
      "driving_license" : null,
      "employer" : {
        "email" : null,
        "phone_number" : null,
        "organization_number" : "5590092481",
        "name" : "Emploid AB",
        "url" : null,
        "workplace" : "EMPLOID"
      },
      "removed_date" : null,
      "logo_url" : "https://www.arbetsformedlingen.se/rest/arbetsgivare/rest/af/v3/arbetsplatser/86856261/logotyper/logo.png",
      "last_publication_date" : "2022-08-04T00:00:00",
      "number_of_vacancies" : 1,
      "occupation" : {
        "concept_id" : "tdCZ_6Pn_VzT",
        "label" : "IT-tekniker/Datatekniker",
        "legacy_ams_taxonomy_id" : "6625"
      },
      "occupation_group" : {
        "concept_id" : "13md_uyV_BNG",
        "label" : "Drifttekniker, IT",
        "legacy_ams_taxonomy_id" : "3511"
      },
      "employment_type" : {
        "concept_id" : "PFZr_Syz_cUq",
        "label" : "Vanlig anställning",
        "legacy_ams_taxonomy_id" : "1"
      },
      "webpage_url" : "https://arbetsformedlingen.se/platsbanken/annonser/26325643",
      "driving_license_required" : false,
      "application_contacts" : [ ],
      "duration" : {
        "concept_id" : "a7uU_j21_mkL",
        "label" : "Tills vidare",
        "legacy_ams_taxonomy_id" : "1"
      },
      "nice_to_have" : {
        "education_level" : [ ],
        "work_experiences" : [ ],
        "skills" : [ {
          "concept_id" : "9qgQ_QyK_VVh",
          "weight" : 5,
          "label" : "Användarsupport, hårdvara",
          "legacy_ams_taxonomy_id" : "605534"
        }, {
          "concept_id" : "TFQD_onf_Tid",
          "weight" : 5,
          "label" : "Användarsupport, mjukvara",
          "legacy_ams_taxonomy_id" : "605533"
        }, {
          "concept_id" : "qfkh_ZRK_w4W",
          "weight" : 5,
          "label" : "Python, programmeringsspråk",
          "legacy_ams_taxonomy_id" : "605952"
        } ],
        "education" : [ ],
        "languages" : [ ]
      },
      "application_details" : {
        "via_af" : false,
        "email" : null,
        "other" : null,
        "reference" : null,
        "url" : "https://www.emploid.se/jobs/559-hardvaruspecialist-hardvarutekniker/",
        "information" : null
      },
      "source_type" : "VIA_ANNONSERA",
      "application_deadline" : "2022-08-04T00:00:00",
      "external_id" : null,
      "workplace_address" : {
        "coordinates" : [ null, null ],
        "city" : null,
        "postcode" : null,
        "municipality" : "Lund",
        "region_concept_id" : "CaRE_1nn_cSU",
        "region" : "Skåne län",
        "country_code" : "199",
        "region_code" : "12",
        "municipality_concept_id" : "muSY_tsR_vDZ",
        "country_concept_id" : "i46j_HmG_v64",
        "municipality_code" : "1281",
        "street_address" : null,
        "country" : "Sverige"
      },
      "id" : "26325643",
      "experience_required" : true,
      "working_hours_type" : {
        "concept_id" : "6YE1_gAC_R2G",
        "label" : "Heltid",
        "legacy_ams_taxonomy_id" : "1"
      },
      "access" : null,
      "timestamp" : 1657781140288,
      "must_have" : {
        "education_level" : [ ],
        "work_experiences" : [ ],
        "skills" : [ ],
        "education" : [ ],
        "languages" : [ {
          "concept_id" : "zSLA_vw2_FXN",
          "weight" : 10,
          "label" : "Svenska",
          "legacy_ams_taxonomy_id" : "502"
        }, {
          "concept_id" : "NVxJ_hLg_TYS",
          "weight" : 10,
          "label" : "Engelska",
          "legacy_ams_taxonomy_id" : "283"
        } ]
      },
      "occupation_field" : {
        "concept_id" : "apaJ_2ja_LuF",
        "label" : "Data/IT",
        "legacy_ams_taxonomy_id" : "3"
      },
      "scope_of_work" : {
        "min" : 0,
        "max" : 100
      },
      "salary_type" : {
        "concept_id" : "oG8G_9cW_nRf",
        "label" : "Fast månads- vecko- eller timlön",
        "legacy_ams_taxonomy_id" : "1"
      },
      "removed" : false,
      "salary_description" : null,
      "access_to_own_car" : false,
      "publication_date" : "2022-07-14T08:45:40"
    },
    "name" : "Hårdvaruspecialist / Hårdvarutekniker",
    "user" : "hannes"
  },
  "sha1" : "e50a21a95354dc46c094cf8172a4350b74b49cb5",
  "annotations" : [ {
    "preferred-label" : "hårdvarutekniker",
    "type" : "esco-occupation",
    "start-position" : 21,
    "end-position" : 37,
    "concept-id" : "P69K_8r2_DAK",
    "matched-string" : "Hårdvarutekniker",
    "annotation-id" : 24
  }, {
    "preferred-label" : "Lagerhanteringsprogram",
    "type" : "skill",
    "start-position" : 102,
    "end-position" : 123,
    "concept-id" : "1oA3_GfA_82Y",
    "matched-string" : "lagerhanteringssystem",
    "annotation-id" : 25
  }, {
    "preferred-label" : "Lager",
    "sentiment" : "MUST_HAVE",
    "type" : "keyword",
    "start-position" : 368,
    "end-position" : 373,
    "concept-id" : "J5gJ_6vV_egQ",
    "matched-string" : "lager",
    "annotation-id" : 0
  }, {
    "preferred-label" : "Mjukvaruutveckling",
    "sentiment" : "MUST_HAVE",
    "type" : "skill",
    "start-position" : 478,
    "end-position" : 496,
    "concept-id" : "A5HJ_aMw_BQt",
    "matched-string" : "mjukvaruutveckling",
    "annotation-id" : 1
  }, {
    "preferred-label" : "Lund",
    "type" : "municipality",
    "start-position" : 668,
    "end-position" : 672,
    "concept-id" : "muSY_tsR_vDZ",
    "matched-string" : "Lund",
    "annotation-id" : 26
  }, {
    "preferred-label" : "Kontor",
    "sentiment" : "MUST_HAVE",
    "type" : "keyword",
    "start-position" : 725,
    "end-position" : 731,
    "concept-id" : "Hyz1_7HF_AkP",
    "matched-string" : "kontor",
    "annotation-id" : 2
  }, {
    "preferred-label" : "Sverige",
    "type" : "country",
    "start-position" : 734,
    "end-position" : 741,
    "concept-id" : "i46j_HmG_v64",
    "matched-string" : "Sverige",
    "annotation-id" : 27
  }, {
    "preferred-label" : "Norge",
    "type" : "country",
    "start-position" : 743,
    "end-position" : 748,
    "concept-id" : "QJgN_Zge_BzJ",
    "matched-string" : "Norge",
    "annotation-id" : 28
  }, {
    "preferred-label" : "Danmark",
    "type" : "country",
    "start-position" : 750,
    "end-position" : 757,
    "concept-id" : "Co3h_1xq_Cwb",
    "matched-string" : "Danmark",
    "annotation-id" : 29
  }, {
    "preferred-label" : "Finland",
    "type" : "country",
    "start-position" : 759,
    "end-position" : 766,
    "concept-id" : "WgbG_whJ_E7J",
    "matched-string" : "Finland",
    "annotation-id" : 30
  }, {
    "preferred-label" : "Nederländerna",
    "type" : "country",
    "start-position" : 768,
    "end-position" : 781,
    "concept-id" : "mc3v_dHh_dzf",
    "matched-string" : "Nederländerna",
    "annotation-id" : 31
  }, {
    "preferred-label" : "Polen",
    "type" : "country",
    "start-position" : 783,
    "end-position" : 788,
    "concept-id" : "EV41_7cy_jw7",
    "matched-string" : "Polen",
    "annotation-id" : 32
  }, {
    "preferred-label" : "Storbritannien och Nordirland",
    "type" : "country",
    "start-position" : 793,
    "end-position" : 807,
    "concept-id" : "7wHq_Mri_wCt",
    "matched-string" : "Storbritannien",
    "annotation-id" : 33
  }, {
    "preferred-label" : "Hårdvara",
    "sentiment" : "MUST_HAVE",
    "type" : "skill-headline",
    "start-position" : 864,
    "end-position" : 872,
    "concept-id" : "22jK_Hje_3Ec",
    "matched-string" : "hårdvara",
    "annotation-id" : 4
  }, {
    "preferred-label" : "Hårdvara",
    "sentiment" : "MUST_HAVE",
    "type" : "skill-headline",
    "start-position" : 964,
    "end-position" : 972,
    "concept-id" : "22jK_Hje_3Ec",
    "matched-string" : "hårdvara",
    "annotation-id" : 5
  }, {
    "preferred-label" : "Lagerhanteringsprogram",
    "type" : "skill",
    "start-position" : 1135,
    "end-position" : 1156,
    "concept-id" : "1oA3_GfA_82Y",
    "matched-string" : "lagerhanteringssystem",
    "annotation-id" : 34
  }, {
    "preferred-label" : "Hårdvara",
    "sentiment" : "MUST_HAVE",
    "type" : "skill-headline",
    "start-position" : 1177,
    "end-position" : 1185,
    "concept-id" : "22jK_Hje_3Ec",
    "matched-string" : "hårdvara",
    "annotation-id" : 7
  }, {
    "preferred-label" : "Hårdvara",
    "sentiment" : "MUST_HAVE",
    "type" : "skill-headline",
    "start-position" : 1966,
    "end-position" : 1974,
    "concept-id" : "22jK_Hje_3Ec",
    "matched-string" : "hårdvara",
    "annotation-id" : 8
  }, {
    "preferred-label" : "Hårdvara",
    "sentiment" : "MUST_HAVE",
    "type" : "skill-headline",
    "start-position" : 2248,
    "end-position" : 2256,
    "concept-id" : "22jK_Hje_3Ec",
    "matched-string" : "hårdvara",
    "annotation-id" : 9
  }, {
    "preferred-label" : "IT-tekniker/Datatekniker",
    "type" : "occupation-name",
    "start-position" : 2285,
    "end-position" : 2296,
    "concept-id" : "tdCZ_6Pn_VzT",
    "matched-string" : "It-tekniker",
    "annotation-id" : 35
  }, {
    "preferred-label" : "Drifttekniker, IT",
    "type" : "ssyk-level-4",
    "start-position" : 2315,
    "end-position" : 2328,
    "concept-id" : "13md_uyV_BNG",
    "matched-string" : "drifttekniker",
    "annotation-id" : 36
  }, {
    "preferred-label" : "Hårdvara",
    "sentiment" : "MUST_HAVE",
    "type" : "skill-headline",
    "start-position" : 2389,
    "end-position" : 2397,
    "concept-id" : "22jK_Hje_3Ec",
    "matched-string" : "hårdvara",
    "annotation-id" : 11
  }, {
    "preferred-label" : "Nätverk",
    "type" : "skill-headline",
    "start-position" : 2399,
    "end-position" : 2406,
    "concept-id" : "nHDU_dpj_R9H",
    "matched-string" : "nätverk",
    "annotation-id" : 37
  }, {
    "preferred-label" : "Data/IT",
    "sentiment" : "MUST_HAVE",
    "type" : "occupation-field",
    "start-position" : 2411,
    "end-position" : 2413,
    "concept-id" : "apaJ_2ja_LuF",
    "matched-string" : "it",
    "annotation-id" : 12
  }, {
    "preferred-label" : "Operativsystem",
    "type" : "skill-headline",
    "start-position" : 2441,
    "end-position" : 2443,
    "concept-id" : "xAWr_WYq_JPP",
    "matched-string" : "OS",
    "annotation-id" : 38
  }, {
    "preferred-label" : "Windows, operativsystem",
    "type" : "skill",
    "start-position" : 2459,
    "end-position" : 2466,
    "concept-id" : "G4sF_xod_zoq",
    "matched-string" : "Windows",
    "annotation-id" : 39
  }, {
    "preferred-label" : "Internet of things/IoT",
    "sentiment" : "MUST_HAVE",
    "type" : "skill",
    "start-position" : 2468,
    "end-position" : 2471,
    "concept-id" : "v1kW_h4M_Kej",
    "matched-string" : "iot",
    "annotation-id" : 14
  }, {
    "preferred-label" : "Android, operativsystem",
    "sentiment" : "MUST_HAVE",
    "type" : "skill",
    "start-position" : 2479,
    "end-position" : 2486,
    "concept-id" : "WQdS_Jtu_qPC",
    "matched-string" : "android",
    "annotation-id" : 15
  }, {
    "preferred-label" : "Python, programmeringsspråk",
    "sentiment" : "MUST_HAVE",
    "type" : "skill",
    "start-position" : 2557,
    "end-position" : 2563,
    "concept-id" : "qfkh_ZRK_w4W",
    "matched-string" : "python",
    "annotation-id" : 17
  }, {
    "preferred-label" : "Svenska",
    "sentiment" : "MUST_HAVE",
    "type" : "language",
    "start-position" : 2630,
    "end-position" : 2637,
    "concept-id" : "zSLA_vw2_FXN",
    "matched-string" : "svenska",
    "annotation-id" : 18
  }, {
    "preferred-label" : "Engelska",
    "sentiment" : "MUST_HAVE",
    "type" : "language",
    "start-position" : 2642,
    "end-position" : 2650,
    "concept-id" : "NVxJ_hLg_TYS",
    "matched-string" : "engelska",
    "annotation-id" : 19
  }, {
    "preferred-label" : "arbeta självständigt",
    "type" : "esco-skill",
    "start-position" : 2935,
    "end-position" : 2966,
    "concept-id" : "NyFu_HHd_zhz",
    "matched-string" : "självständigt driva ditt arbete",
    "annotation-id" : 40
  }, {
    "preferred-label" : "Lund",
    "type" : "municipality",
    "start-position" : 3083,
    "end-position" : 3087,
    "concept-id" : "muSY_tsR_vDZ",
    "matched-string" : "Lund",
    "annotation-id" : 41
  }, {
    "preferred-label" : "IT-support",
    "sentiment" : "MUST_HAVE",
    "type" : "keyword",
    "start-position" : 3399,
    "end-position" : 3409,
    "concept-id" : "1Nz1_z46_39V",
    "matched-string" : "it-support",
    "annotation-id" : 20
  }, {
    "preferred-label" : "it-tekniker",
    "type" : "esco-occupation",
    "start-position" : 3411,
    "end-position" : 3422,
    "concept-id" : "ybqU_Mu2_Eti",
    "matched-string" : "It-tekniker",
    "annotation-id" : 42
  }, {
    "preferred-label" : "Helpdesktekniker/Supporttekniker",
    "sentiment" : "MUST_HAVE",
    "type" : "occupation-name",
    "start-position" : 3424,
    "end-position" : 3439,
    "concept-id" : "KQty_E1u_cia",
    "matched-string" : "supporttekniker",
    "annotation-id" : 22
  }, {
    "preferred-label" : "Hårdvara",
    "sentiment" : "MUST_HAVE",
    "type" : "skill-headline",
    "start-position" : 3487,
    "end-position" : 3495,
    "concept-id" : "22jK_Hje_3Ec",
    "matched-string" : "hårdvara",
    "annotation-id" : 23
  }, {
    "preferred-label" : "Nätverk",
    "type" : "skill-headline",
    "start-position" : 3497,
    "end-position" : 3504,
    "concept-id" : "nHDU_dpj_R9H",
    "matched-string" : "nätverk",
    "annotation-id" : 43
  }, {
    "preferred-label" : "Heltid",
    "type" : "worktime-extent",
    "start-position" : 3514,
    "end-position" : 3520,
    "concept-id" : "6YE1_gAC_R2G",
    "matched-string" : "heltid",
    "annotation-id" : 44
  }, {
    "preferred-label" : "Lund",
    "type" : "municipality",
    "start-position" : 3522,
    "end-position" : 3526,
    "concept-id" : "muSY_tsR_vDZ",
    "matched-string" : "Lund",
    "annotation-id" : 45
  }, {
    "preferred-label" : "Malmö",
    "type" : "municipality",
    "start-position" : 3528,
    "end-position" : 3533,
    "concept-id" : "oYPt_yRA_Smm",
    "matched-string" : "Malmö",
    "annotation-id" : 46
  }, {
    "preferred-label" : "Helsingborg",
    "type" : "municipality",
    "start-position" : 3535,
    "end-position" : 3546,
    "concept-id" : "qj3q_oXH_MGR",
    "matched-string" : "Helsingborg",
    "annotation-id" : 47
  } ],
  "text" : "Hårdvaruspecialist / Hårdvarutekniker\nOm företaget\nConsafe Logistics är Europas ledande leverantör av lagerhanteringssystem. Vi levererar tillförlitliga, flexibla och smarta lösningar som skapar konkurrensfördelar för våra kunder över hela världen.\nMed hjälp av vår expertis inom lagerhantering och ett starkt kundfokus levererar vi hållbara lösningar som passar alla lager, oavsett volym och komplexitet. Vi fokuserar på att optimera kundernas verksamhet och i kombination med mjukvaruutveckling i världsklass, ger det våra kunder en konkurrenskraftig fördel. Det har vi gjort sedan 1978.\nConsafe Logistics-koncernen har 400 anställda och huvudkontoret är placerat i Lund. Vi arbetar med våra globala kunder via våra lokala kontor i Sverige, Norge, Danmark, Finland, Nederländerna, Polen och Storbritannien. www.consafelogistics.com\nOm tjänsten\nSom tekniker inom hårdvara hos Consafe Logistics arbetar du nära både kunder och den interna organisationen. Detta då hårdvara supporterar hela verksamheten avseende hårdvaruleveranser. Consafe Logistics mission är att optimera sina kunders logistikflöden med hjälp av vårt egenutvecklade lagerhanteringssystem Astro WMS® och rätt hårdvara för kundernas lagerprocesser såsom truckdatorer, handdatorer, röstterminaler, skanners och etikettskrivare. Du kommer att ha ansvar för installation, konfiguration, leverans, implementering, support och service i samarbete med övriga i hårdvaruteamet. Vi räknar även med att din erfarenhet och personliga egenskaper kommer att bli ett viktigt bidrag till att stärka teamet och ytterligare förbättra våra processer.\nDu agerar spindeln i nätet till våra kunder och fyller en viktig representerande och kontaktintensiv roll såväl internt som externt. Det är en mycket omväxlande roll där stor vikt läggs vid eget ansvar och god förmåga att samarbeta och samspela med övriga medarbetare i teamet. Du kommer framförallt arbeta med våra produkter från större tillverkare som exempelvis hårdvara från Honeywell & Zebra uppkopplade i trådlösa nätverk och ibland med MDM system från SOTI.\nTjänsten är en rekrytering där anställningen ingås med Consafe Logistics men EMPLOID driver urvalsprocessen.\nOm dig\nFör att vara aktuell för tjänsten krävs följande:\n- Erfarenhet av hårdvara och support från roller som It-tekniker, teknisk support, drifttekniker eller roller med motsvarande arbetsuppgifter\n- Kunskap inom hårdvara, nätverk och IT-miljöer\n- Konfiguration av OS såsom Embedded Windows (IoT) eller Android är meriterande\n-  Det är meriterande om du har kunskaper inom C++ och Python\n- God förståelse för kundkontakt och ärendehantering\n- Flytande i svenska och engelska\nSom person är du serviceminded, har ett stort tekniskt intresse och brinner för att lösa tekniska problem. Du har ambitionen att alltid leverera goda resultat och ser till att hjälpa kunderna till varje pris. Du har en arbetsmetodik som genomsyras av struktur, vilket hjälper dig att självständigt driva ditt arbete framåt men som även möjliggör samarbete med dina kollegor.  \nÖvrig information\nStart: Enligt överenskommelse\nPlats: Lund\nArbetstid: Kontorstider vardag\nLön: Enligt överenskommelse\n\n\nOm du har frågor om tjänsten ber vi dig att maila info@emploid.se så hjälper någon i teamet dig. Ange vilken tjänst det gäller.\nVi rekommenderar att du skickar in din ansökan omgående då vi gör ett löpande urval.\nVälkommen med din ansökan!\n\n\nSökord: It-Support, It-tekniker, Supporttekniker, support specialist, support, teknisk support, hårdvara, nätverk, server, heltid, Lund, Malmö, Helsingborg, rekrytering"
}