{
  "meta" : {
    "jobad" : {
      "description" : {
        "requirements" : null,
        "needs" : null,
        "company_information" : null,
        "text_formatted" : "<p>Är du en embedded utvecklare som letar efter en ny utmaning nu till hösten? Då är vi nog rätt för dig. 😊 Hos oss på Cilbuper Group består vi av ett härligt team som vi gärna vill ska utökas. Vi söker därför dig som är redo för att hänga med på vårt roliga äventyr och hjälpa våra kunder att bygga på morgondagens produkter. </p><p><strong>Vad innebär det att vara anställd på Cilbuper Group?</strong> </p><p>Du kommer att arbeta som konsult ute hos en av våra kunder och det kan handla om nyutveckling eller vidareutveckling av befintliga produkter. Vilken av våra kunder du kommer att arbeta för har du stor möjlighet att påverka själv. Vi är flexibla och vill att ditt arbete ska fungera för just din livssituation. </p><p><strong>Vilka är vi på Cilbuper Group?</strong> </p><p>Vi är en koncern som består av fyra bolag som Cilbuper IT, Pagesplit, Agoshi och Republify omsluts inom Cilbuper Group. Vi har en mångfald av olika profiler som består bådadera av juniora profiler som vi vill ge en chans in i arbetslivet men även seniora utvecklare som får nya spännande uppdrag framför sig. </p><p>Vårt härliga kontor är beläget vid Järntorget i Göteborg och vi arbetar systematiskt med att skapa möten mellan våra kunder och våra konsulter inom IT-branschen. Vi tillgodoser våra anställda utbildningsmöjligheter, komfortabla nödvändigheter som friskvård och pensionstillägg samt även roliga aktiviteter utanför arbetet. Vi tror på att om man har en bra inställning, ett glatt humör och ett brinnande intresse för programmering så passar man perfekt i vårt team. Därför tror vi på de människor som befinner sig i nystarten på sin karriär men även de som varit inom branschen ett tag. Hos oss är man alltid en del av vårt Cilbuper team och får under sin resa utvecklas och ha roligt på vägen! </p><p><strong>Varför skulle du vilja jobba hos oss?</strong> </p><p>Trots att vi är ett relativt ungt bolag som grundades 2016 och vi befinner oss i en expanderande bransch som kan upplevas som en djungel för dig som arbetssökande med alla potentiella arbetsgivare, så är vi en arbetsplats som är ödmjuk och flexibel. Vi erbjuder dig att bli välkommen till en stark gemenskap och ett väletablerat kontaktnät som möjliggör att våra förfrågningar och kunder varierar. Hos oss får man vara en del av en gemenskap som främjar såväl personlig som professionell utveckling och vi kan garantera dig att du alltid kommer ha roligt. Cilbuper Group är en växande koncern som letar efter en ny kollega som vill utvecklas tillsammans med oss.  </p><p><strong>Vem är vår nya kollega?</strong> </p><p>Vi tror att du har:</p><ul><li>Eftergymnasial utbildning inom mjukvaruutveckling</li><li>Minst 1 års erfarenhet av C#-programmering</li><li>En skön personlighet</li><li>Vilja att arbeta Agilt</li><li>Lagom goda kunskaper i svenska och engelska, i både tal och skrift</li><li>Ambition att utveckla dig själv</li><li>Ett genuint teknikintresse och är en teamplayer</li><li>Vana av att arbeta i en agil miljö. </li><li>Ambition att utveckla dig själv. </li></ul><p><strong>Vad är nästa steg?</strong> </p><p>Om du är intresserad av att veta mer om oss kan vi koppla ihop dig med en av våra anställda som kan ge dig en bild av hur det är att arbeta här. </p><p>Annars börjar din nystart här! https://pnty-apply.ponty-system.se/cilbuper?id=20 </p><p>Vi ses snart 😊</p><p>Vännerna på Cilbuper Group!</p><p><br></p><p id=\"oppenforalla\">Öppen för alla\nVi fokuserar på din kompetens, inte dina övriga förutsättningar. Vi är öppna för att anpassa rollen eller arbetsplatsen efter dina behov.</p>",
        "conditions" : null,
        "text" : "Är du en embedded utvecklare som letar efter en ny utmaning nu till hösten? Då är vi nog rätt för dig. 😊 Hos oss på Cilbuper Group består vi av ett härligt team som vi gärna vill ska utökas. Vi söker därför dig som är redo för att hänga med på vårt roliga äventyr och hjälpa våra kunder att bygga på morgondagens produkter. \nVad innebär det att vara anställd på Cilbuper Group? \nDu kommer att arbeta som konsult ute hos en av våra kunder och det kan handla om nyutveckling eller vidareutveckling av befintliga produkter. Vilken av våra kunder du kommer att arbeta för har du stor möjlighet att påverka själv. Vi är flexibla och vill att ditt arbete ska fungera för just din livssituation. \nVilka är vi på Cilbuper Group? \nVi är en koncern som består av fyra bolag som Cilbuper IT, Pagesplit, Agoshi och Republify omsluts inom Cilbuper Group. Vi har en mångfald av olika profiler som består bådadera av juniora profiler som vi vill ge en chans in i arbetslivet men även seniora utvecklare som får nya spännande uppdrag framför sig. \nVårt härliga kontor är beläget vid Järntorget i Göteborg och vi arbetar systematiskt med att skapa möten mellan våra kunder och våra konsulter inom IT-branschen. Vi tillgodoser våra anställda utbildningsmöjligheter, komfortabla nödvändigheter som friskvård och pensionstillägg samt även roliga aktiviteter utanför arbetet. Vi tror på att om man har en bra inställning, ett glatt humör och ett brinnande intresse för programmering så passar man perfekt i vårt team. Därför tror vi på de människor som befinner sig i nystarten på sin karriär men även de som varit inom branschen ett tag. Hos oss är man alltid en del av vårt Cilbuper team och får under sin resa utvecklas och ha roligt på vägen! \nVarför skulle du vilja jobba hos oss? \nTrots att vi är ett relativt ungt bolag som grundades 2016 och vi befinner oss i en expanderande bransch som kan upplevas som en djungel för dig som arbetssökande med alla potentiella arbetsgivare, så är vi en arbetsplats som är ödmjuk och flexibel. Vi erbjuder dig att bli välkommen till en stark gemenskap och ett väletablerat kontaktnät som möjliggör att våra förfrågningar och kunder varierar. Hos oss får man vara en del av en gemenskap som främjar såväl personlig som professionell utveckling och vi kan garantera dig att du alltid kommer ha roligt. Cilbuper Group är en växande koncern som letar efter en ny kollega som vill utvecklas tillsammans med oss.  \nVem är vår nya kollega? \nVi tror att du har:\nEftergymnasial utbildning inom mjukvaruutveckling\nMinst 1 års erfarenhet av C#-programmering\nEn skön personlighet\nVilja att arbeta Agilt\nLagom goda kunskaper i svenska och engelska, i både tal och skrift\nAmbition att utveckla dig själv\nEtt genuint teknikintresse och är en teamplayer\nVana av att arbeta i en agil miljö. \nAmbition att utveckla dig själv. \n\nVad är nästa steg? \nOm du är intresserad av att veta mer om oss kan vi koppla ihop dig med en av våra anställda som kan ge dig en bild av hur det är att arbeta här. \nAnnars börjar din nystart här! https://pnty-apply.ponty-system.se/cilbuper?id=20 \nVi ses snart 😊\nVännerna på Cilbuper Group!\n\n\nÖppen för alla\nVi fokuserar på din kompetens, inte dina övriga förutsättningar. Vi är öppna för att anpassa rollen eller arbetsplatsen efter dina behov."
      },
      "headline" : "Är du en embedded-utvecklare som letar efter en ny utmaning till hösten?",
      "driving_license" : null,
      "employer" : {
        "email" : null,
        "phone_number" : null,
        "organization_number" : "5590501804",
        "name" : "cilbuper IT AB",
        "url" : "https://cilbuper.se/",
        "workplace" : "cilbuper IT AB"
      },
      "removed_date" : null,
      "logo_url" : "https://www.arbetsformedlingen.se/rest/arbetsgivare/rest/af/v3/arbetsplatser/86369248/logotyper/logo.png",
      "last_publication_date" : "2022-08-22T23:59:59",
      "number_of_vacancies" : 2,
      "occupation" : {
        "concept_id" : "fg7B_yov_smw",
        "label" : "Systemutvecklare/Programmerare",
        "legacy_ams_taxonomy_id" : "2419"
      },
      "occupation_group" : {
        "concept_id" : "DJh5_yyF_hEM",
        "label" : "Mjukvaru- och systemutvecklare m.fl.",
        "legacy_ams_taxonomy_id" : "2512"
      },
      "employment_type" : {
        "concept_id" : "PFZr_Syz_cUq",
        "label" : "Vanlig anställning",
        "legacy_ams_taxonomy_id" : "1"
      },
      "webpage_url" : "https://arbetsformedlingen.se/platsbanken/annonser/26385618",
      "driving_license_required" : false,
      "application_contacts" : [ ],
      "duration" : {
        "concept_id" : "a7uU_j21_mkL",
        "label" : "Tills vidare",
        "legacy_ams_taxonomy_id" : "1"
      },
      "nice_to_have" : {
        "education_level" : [ {
          "concept_id" : "asZm_TEQ_Srk",
          "weight" : 5,
          "label" : "Eftergymnasial utbildning två år eller längre",
          "legacy_ams_taxonomy_id" : "6"
        } ],
        "work_experiences" : [ {
          "concept_id" : "fg7B_yov_smw",
          "weight" : 5,
          "label" : "Systemutvecklare/Programmerare",
          "legacy_ams_taxonomy_id" : "2419"
        } ],
        "skills" : [ ],
        "education" : [ {
          "concept_id" : "FHxz_HhN_3Mk",
          "weight" : 5,
          "label" : "Data",
          "legacy_ams_taxonomy_id" : "14"
        } ],
        "languages" : [ ]
      },
      "application_details" : {
        "via_af" : false,
        "email" : null,
        "other" : null,
        "reference" : null,
        "url" : "https://pnty-apply.ponty-system.se/cilbuper?id=20",
        "information" : null
      },
      "source_type" : "VIA_ANNONSERA",
      "application_deadline" : "2022-08-22T23:59:59",
      "external_id" : null,
      "workplace_address" : {
        "coordinates" : [ 11.953378285883222, 57.70217661754566 ],
        "city" : "Göteborg",
        "postcode" : "41301",
        "municipality" : "Göteborg",
        "region_concept_id" : "zdoY_6u5_Krt",
        "region" : "Västra Götalands län",
        "country_code" : "199",
        "region_code" : "14",
        "municipality_concept_id" : "PVZL_BQT_XtL",
        "country_concept_id" : "i46j_HmG_v64",
        "municipality_code" : "1480",
        "street_address" : "Heurlins Plats 1 A",
        "country" : "Sverige"
      },
      "id" : "26385618",
      "experience_required" : true,
      "working_hours_type" : {
        "concept_id" : "6YE1_gAC_R2G",
        "label" : "Heltid",
        "legacy_ams_taxonomy_id" : "1"
      },
      "access" : null,
      "timestamp" : 1659951915285,
      "must_have" : {
        "education_level" : [ ],
        "work_experiences" : [ ],
        "skills" : [ ],
        "education" : [ ],
        "languages" : [ ]
      },
      "occupation_field" : {
        "concept_id" : "apaJ_2ja_LuF",
        "label" : "Data/IT",
        "legacy_ams_taxonomy_id" : "3"
      },
      "scope_of_work" : {
        "min" : 0,
        "max" : 100
      },
      "salary_type" : {
        "concept_id" : "oG8G_9cW_nRf",
        "label" : "Fast månads- vecko- eller timlön",
        "legacy_ams_taxonomy_id" : "1"
      },
      "removed" : false,
      "salary_description" : null,
      "access_to_own_car" : false,
      "publication_date" : "2022-08-08T11:45:15"
    },
    "name" : "Är du en embedded-utvecklare som letar efter en ny utmaning till hösten?",
    "user" : "hannes"
  },
  "sha1" : "51a8d17bc7b14f40f1af2f142cd3a24b3d5830f8",
  "annotations" : [ {
    "preferred-label" : "Embeddedutvecklare",
    "type" : "keyword",
    "start-position" : 9,
    "end-position" : 28,
    "concept-id" : "sEFD_3Zs_WiA",
    "matched-string" : "embedded-utvecklare",
    "annotation-id" : 11
  }, {
    "preferred-label" : "Embeddedutvecklare",
    "type" : "keyword",
    "start-position" : 82,
    "end-position" : 101,
    "concept-id" : "sEFD_3Zs_WiA",
    "matched-string" : "embedded utvecklare",
    "annotation-id" : 12
  }, {
    "preferred-label" : "Data/IT",
    "sentiment" : "MUST_HAVE",
    "type" : "occupation-field",
    "start-position" : 851,
    "end-position" : 853,
    "concept-id" : "apaJ_2ja_LuF",
    "matched-string" : "it",
    "annotation-id" : 0
  }, {
    "preferred-label" : "Kontor",
    "sentiment" : "MUST_HAVE",
    "type" : "keyword",
    "start-position" : 1119,
    "end-position" : 1125,
    "concept-id" : "Hyz1_7HF_AkP",
    "matched-string" : "kontor",
    "annotation-id" : 1
  }, {
    "preferred-label" : "Göteborg",
    "type" : "municipality",
    "start-position" : 1154,
    "end-position" : 1162,
    "concept-id" : "PVZL_BQT_XtL",
    "matched-string" : "Göteborg",
    "annotation-id" : 13
  }, {
    "preferred-label" : "Data/IT",
    "sentiment" : "MUST_HAVE",
    "type" : "occupation-field",
    "start-position" : 1254,
    "end-position" : 1256,
    "concept-id" : "apaJ_2ja_LuF",
    "matched-string" : "it",
    "annotation-id" : 2
  }, {
    "preferred-label" : "Friskvård",
    "sentiment" : "MUST_HAVE",
    "type" : "keyword",
    "start-position" : 1353,
    "end-position" : 1362,
    "concept-id" : "yoHe_xjK_qjH",
    "matched-string" : "friskvård",
    "annotation-id" : 3
  }, {
    "preferred-label" : "Programmering",
    "sentiment" : "MUST_HAVE",
    "type" : "skill",
    "start-position" : 1522,
    "end-position" : 1535,
    "concept-id" : "iUew_moc_BRk",
    "matched-string" : "programmering",
    "annotation-id" : 4
  }, {
    "preferred-label" : "Eftergymnasial utbildning",
    "sentiment" : "MUST_HAVE",
    "type" : "sni-level-3",
    "start-position" : 2550,
    "end-position" : 2575,
    "concept-id" : "bg6r_KVf_KNN",
    "matched-string" : "eftergymnasial utbildning",
    "annotation-id" : 5
  }, {
    "preferred-label" : "Mjukvaruutveckling",
    "sentiment" : "MUST_HAVE",
    "type" : "skill",
    "start-position" : 2581,
    "end-position" : 2599,
    "concept-id" : "A5HJ_aMw_BQt",
    "matched-string" : "mjukvaruutveckling",
    "annotation-id" : 6
  }, {
    "preferred-label" : "1-2 års erfarenhet",
    "type" : "occupation-experience-year",
    "start-position" : 2600,
    "end-position" : 2622,
    "concept-id" : "LLnd_5GJ_4ju",
    "matched-string" : "Minst 1 års erfarenhet",
    "annotation-id" : 15
  }, {
    "preferred-label" : "C#, programmeringsspråk",
    "type" : "skill",
    "start-position" : 2626,
    "end-position" : 2642,
    "concept-id" : "jBKc_5Yx_Y6T",
    "matched-string" : "C#-programmering",
    "annotation-id" : 14
  }, {
    "preferred-label" : "Agila arbetsmetoder",
    "type" : "skill",
    "start-position" : 2674,
    "end-position" : 2686,
    "concept-id" : "TMVb_DnH_etF",
    "matched-string" : "arbeta Agilt",
    "annotation-id" : 16
  }, {
    "preferred-label" : "Svenska",
    "sentiment" : "MUST_HAVE",
    "type" : "language",
    "start-position" : 2710,
    "end-position" : 2717,
    "concept-id" : "zSLA_vw2_FXN",
    "matched-string" : "svenska",
    "annotation-id" : 9
  }, {
    "preferred-label" : "Engelska",
    "type" : "language",
    "start-position" : 2722,
    "end-position" : 2730,
    "concept-id" : "NVxJ_hLg_TYS",
    "matched-string" : "engelska",
    "annotation-id" : 17
  } ],
  "text" : "Är du en embedded-utvecklare som letar efter en ny utmaning till hösten?\nÄr du en embedded utvecklare som letar efter en ny utmaning nu till hösten? Då är vi nog rätt för dig. 😊 Hos oss på Cilbuper Group består vi av ett härligt team som vi gärna vill ska utökas. Vi söker därför dig som är redo för att hänga med på vårt roliga äventyr och hjälpa våra kunder att bygga på morgondagens produkter. \nVad innebär det att vara anställd på Cilbuper Group? \nDu kommer att arbeta som konsult ute hos en av våra kunder och det kan handla om nyutveckling eller vidareutveckling av befintliga produkter. Vilken av våra kunder du kommer att arbeta för har du stor möjlighet att påverka själv. Vi är flexibla och vill att ditt arbete ska fungera för just din livssituation. \nVilka är vi på Cilbuper Group? \nVi är en koncern som består av fyra bolag som Cilbuper IT, Pagesplit, Agoshi och Republify omsluts inom Cilbuper Group. Vi har en mångfald av olika profiler som består bådadera av juniora profiler som vi vill ge en chans in i arbetslivet men även seniora utvecklare som får nya spännande uppdrag framför sig. \nVårt härliga kontor är beläget vid Järntorget i Göteborg och vi arbetar systematiskt med att skapa möten mellan våra kunder och våra konsulter inom IT-branschen. Vi tillgodoser våra anställda utbildningsmöjligheter, komfortabla nödvändigheter som friskvård och pensionstillägg samt även roliga aktiviteter utanför arbetet. Vi tror på att om man har en bra inställning, ett glatt humör och ett brinnande intresse för programmering så passar man perfekt i vårt team. Därför tror vi på de människor som befinner sig i nystarten på sin karriär men även de som varit inom branschen ett tag. Hos oss är man alltid en del av vårt Cilbuper team och får under sin resa utvecklas och ha roligt på vägen! \nVarför skulle du vilja jobba hos oss? \nTrots att vi är ett relativt ungt bolag som grundades 2016 och vi befinner oss i en expanderande bransch som kan upplevas som en djungel för dig som arbetssökande med alla potentiella arbetsgivare, så är vi en arbetsplats som är ödmjuk och flexibel. Vi erbjuder dig att bli välkommen till en stark gemenskap och ett väletablerat kontaktnät som möjliggör att våra förfrågningar och kunder varierar. Hos oss får man vara en del av en gemenskap som främjar såväl personlig som professionell utveckling och vi kan garantera dig att du alltid kommer ha roligt. Cilbuper Group är en växande koncern som letar efter en ny kollega som vill utvecklas tillsammans med oss.  \nVem är vår nya kollega? \nVi tror att du har:\nEftergymnasial utbildning inom mjukvaruutveckling\nMinst 1 års erfarenhet av C#-programmering\nEn skön personlighet\nVilja att arbeta Agilt\nLagom goda kunskaper i svenska och engelska, i både tal och skrift\nAmbition att utveckla dig själv\nEtt genuint teknikintresse och är en teamplayer\nVana av att arbeta i en agil miljö. \nAmbition att utveckla dig själv. \n\nVad är nästa steg? \nOm du är intresserad av att veta mer om oss kan vi koppla ihop dig med en av våra anställda som kan ge dig en bild av hur det är att arbeta här. \nAnnars börjar din nystart här! https://pnty-apply.ponty-system.se/cilbuper?id=20 \nVi ses snart 😊\nVännerna på Cilbuper Group!\n\n\nÖppen för alla\nVi fokuserar på din kompetens, inte dina övriga förutsättningar. Vi är öppna för att anpassa rollen eller arbetsplatsen efter dina behov."
}