{
  "meta" : {
    "jobad" : {
      "description" : {
        "requirements" : null,
        "needs" : null,
        "company_information" : null,
        "text_formatted" : "<p>Treviso Italiensk Restaurang &amp; Pizzeria i Falköping och Skövde söker extra personal.</p><p>Tillsvidare anställning 80%</p><p>Driven a la carte kock/ Kokerska eller pizzabagare med fokus på kvällar sökes!</p><p>Treviso Italiensk Restaurang &amp; Pizzeria är en stabil restaurang med fullständiga rättigheter ligger i Centrala Skövde.</p><p>Har du passion för matlagning?</p><p> Brinner du för service och vet hur du ska överträffa gästens förväntningar?</p><p>Tycker du om att jobba självständigt och ta eget ansvar för det du gör?</p><p>Som person är du stresstålig, noggrann, gillar högt tempo samt tar egna initiativ.</p><p>Ett års erfarenhet inom restaurangbranschen är ett krav.</p><p>Tjänsten är på deltid enligt överenskommelsen.</p><p id=\"oppenforalla\">Öppen för alla\nVi fokuserar på din kompetens, inte dina övriga förutsättningar. Vi är öppna för att anpassa rollen eller arbetsplatsen efter dina behov.</p>",
        "conditions" : null,
        "text" : "Treviso Italiensk Restaurang & Pizzeria i Falköping och Skövde söker extra personal.\nTillsvidare anställning 80%\nDriven a la carte kock/ Kokerska eller pizzabagare med fokus på kvällar sökes!\nTreviso Italiensk Restaurang & Pizzeria är en stabil restaurang med fullständiga rättigheter ligger i Centrala Skövde.\nHar du passion för matlagning?\n Brinner du för service och vet hur du ska överträffa gästens förväntningar?\nTycker du om att jobba självständigt och ta eget ansvar för det du gör?\nSom person är du stresstålig, noggrann, gillar högt tempo samt tar egna initiativ.\nEtt års erfarenhet inom restaurangbranschen är ett krav.\nTjänsten är på deltid enligt överenskommelsen.\nÖppen för alla\nVi fokuserar på din kompetens, inte dina övriga förutsättningar. Vi är öppna för att anpassa rollen eller arbetsplatsen efter dina behov."
      },
      "headline" : "Driven  Kock  80%",
      "driving_license" : null,
      "employer" : {
        "email" : null,
        "phone_number" : null,
        "organization_number" : "5593025769",
        "name" : "Treviso Restaurang & Pizzeria AB",
        "url" : null,
        "workplace" : "Treviso Restaurang & Pizzeria AB"
      },
      "removed_date" : null,
      "logo_url" : null,
      "last_publication_date" : "2022-08-20T23:59:59",
      "number_of_vacancies" : 2,
      "occupation" : {
        "concept_id" : "JbJw_as4_S93",
        "label" : "Kock, à la carte",
        "legacy_ams_taxonomy_id" : "7663"
      },
      "occupation_group" : {
        "concept_id" : "BStc_SJh_DKG",
        "label" : "Kockar och kallskänkor",
        "legacy_ams_taxonomy_id" : "5120"
      },
      "employment_type" : {
        "concept_id" : "PFZr_Syz_cUq",
        "label" : "Vanlig anställning",
        "legacy_ams_taxonomy_id" : "1"
      },
      "webpage_url" : "https://arbetsformedlingen.se/platsbanken/annonser/26379136",
      "driving_license_required" : false,
      "application_contacts" : [ ],
      "duration" : {
        "concept_id" : "a7uU_j21_mkL",
        "label" : "Tills vidare",
        "legacy_ams_taxonomy_id" : "1"
      },
      "nice_to_have" : {
        "education_level" : [ ],
        "work_experiences" : [ ],
        "skills" : [ ],
        "education" : [ ],
        "languages" : [ ]
      },
      "application_details" : {
        "via_af" : false,
        "email" : "hamidi_shams@yahoo.com",
        "other" : null,
        "reference" : "Kock eller pizzabagare",
        "url" : null,
        "information" : null
      },
      "source_type" : "VIA_ANNONSERA",
      "application_deadline" : "2022-08-20T23:59:59",
      "external_id" : null,
      "workplace_address" : {
        "coordinates" : [ 13.552050126620301, 58.16551403929166 ],
        "city" : "Falköping",
        "postcode" : "52143",
        "municipality" : "Falköping",
        "region_concept_id" : "zdoY_6u5_Krt",
        "region" : "Västra Götalands län",
        "country_code" : "199",
        "region_code" : "14",
        "municipality_concept_id" : "ZySF_gif_zE4",
        "country_concept_id" : "i46j_HmG_v64",
        "municipality_code" : "1499",
        "street_address" : "Odengatan 19",
        "country" : "Sverige"
      },
      "id" : "26379136",
      "experience_required" : true,
      "working_hours_type" : {
        "concept_id" : "947z_JGS_Uk2",
        "label" : "Deltid",
        "legacy_ams_taxonomy_id" : "2"
      },
      "access" : null,
      "timestamp" : 1659637290268,
      "must_have" : {
        "education_level" : [ ],
        "work_experiences" : [ {
          "concept_id" : "JbJw_as4_S93",
          "weight" : 10,
          "label" : "Kock, à la carte",
          "legacy_ams_taxonomy_id" : "7663"
        } ],
        "skills" : [ ],
        "education" : [ ],
        "languages" : [ ]
      },
      "occupation_field" : {
        "concept_id" : "ScKy_FHB_7wT",
        "label" : "Hotell, restaurang, storhushåll",
        "legacy_ams_taxonomy_id" : "7"
      },
      "scope_of_work" : {
        "min" : 0,
        "max" : 100
      },
      "salary_type" : {
        "concept_id" : "oG8G_9cW_nRf",
        "label" : "Fast månads- vecko- eller timlön",
        "legacy_ams_taxonomy_id" : "1"
      },
      "removed" : false,
      "salary_description" : null,
      "access_to_own_car" : false,
      "publication_date" : "2022-08-04T20:21:30"
    },
    "name" : "Driven  Kock  80%",
    "user" : "hannes"
  },
  "sha1" : "e43b679bfaf2760e1ac984ff7126574281fc04bb",
  "annotations" : [ {
    "preferred-label" : "kock",
    "sentiment" : "MUST_HAVE",
    "type" : "esco-occupation",
    "start-position" : 8,
    "end-position" : 12,
    "concept-id" : "Ti2H_QoQ_EMX",
    "matched-string" : "kock",
    "annotation-id" : 0
  }, {
    "preferred-label" : "Deltid",
    "type" : "worktime-extent",
    "start-position" : 14,
    "end-position" : 17,
    "concept-id" : "947z_JGS_Uk2",
    "matched-string" : "80%",
    "annotation-id" : 10
  }, {
    "preferred-label" : "Restaurang",
    "sentiment" : "MUST_HAVE",
    "type" : "keyword",
    "start-position" : 36,
    "end-position" : 46,
    "concept-id" : "o2Cg_3Ap_qvK",
    "matched-string" : "restaurang",
    "annotation-id" : 1
  }, {
    "preferred-label" : "Pizzeria",
    "sentiment" : "MUST_HAVE",
    "type" : "skill",
    "start-position" : 49,
    "end-position" : 57,
    "concept-id" : "DmFL_vHQ_j7e",
    "matched-string" : "pizzeria",
    "annotation-id" : 2
  }, {
    "preferred-label" : "Personal",
    "sentiment" : "MUST_HAVE",
    "type" : "keyword",
    "start-position" : 93,
    "end-position" : 101,
    "concept-id" : "HVxM_6MS_y1c",
    "matched-string" : "personal",
    "annotation-id" : 3
  }, {
    "preferred-label" : "Tillsvidareanställning (inkl. eventuell provanställning)",
    "type" : "employment-type",
    "start-position" : 103,
    "end-position" : 126,
    "concept-id" : "kpPX_CNN_gDU",
    "matched-string" : "Tillsvidare anställning",
    "annotation-id" : 12
  }, {
    "preferred-label" : "Deltid",
    "type" : "worktime-extent",
    "start-position" : 127,
    "end-position" : 130,
    "concept-id" : "947z_JGS_Uk2",
    "matched-string" : "80%",
    "annotation-id" : 11
  }, {
    "preferred-label" : "A la carte",
    "sentiment" : "MUST_HAVE",
    "type" : "skill",
    "start-position" : 138,
    "end-position" : 148,
    "concept-id" : "Bb4Q_Vou_pbq",
    "matched-string" : "a la carte",
    "annotation-id" : 4
  }, {
    "preferred-label" : "kock",
    "sentiment" : "MUST_HAVE",
    "type" : "esco-occupation",
    "start-position" : 149,
    "end-position" : 153,
    "concept-id" : "Ti2H_QoQ_EMX",
    "matched-string" : "kock",
    "annotation-id" : 5
  }, {
    "preferred-label" : "kokerska",
    "type" : "esco-occupation",
    "start-position" : 155,
    "end-position" : 163,
    "concept-id" : "yEcu_aQQ_oQs",
    "matched-string" : "Kokerska",
    "annotation-id" : 13
  }, {
    "preferred-label" : "Pizzabagare",
    "sentiment" : "MUST_HAVE",
    "type" : "forecast-occupation",
    "start-position" : 170,
    "end-position" : 181,
    "concept-id" : "SyvN_uBW_USt",
    "matched-string" : "pizzabagare",
    "annotation-id" : 6
  }, {
    "preferred-label" : "Restaurang",
    "sentiment" : "MUST_HAVE",
    "type" : "keyword",
    "start-position" : 228,
    "end-position" : 238,
    "concept-id" : "o2Cg_3Ap_qvK",
    "matched-string" : "restaurang",
    "annotation-id" : 7
  }, {
    "preferred-label" : "Pizzeria",
    "sentiment" : "MUST_HAVE",
    "type" : "skill",
    "start-position" : 241,
    "end-position" : 249,
    "concept-id" : "DmFL_vHQ_j7e",
    "matched-string" : "pizzeria",
    "annotation-id" : 8
  }, {
    "preferred-label" : "Restaurang",
    "sentiment" : "MUST_HAVE",
    "type" : "keyword",
    "start-position" : 263,
    "end-position" : 273,
    "concept-id" : "o2Cg_3Ap_qvK",
    "matched-string" : "restaurang",
    "annotation-id" : 9
  }, {
    "preferred-label" : "Skövde",
    "type" : "municipality",
    "start-position" : 321,
    "end-position" : 327,
    "concept-id" : "fqAy_4ji_Lz2",
    "matched-string" : "Skövde",
    "annotation-id" : 14
  }, {
    "preferred-label" : "arbeta självständigt",
    "type" : "esco-skill",
    "start-position" : 454,
    "end-position" : 473,
    "concept-id" : "NyFu_HHd_zhz",
    "matched-string" : "jobba självständigt",
    "annotation-id" : 15
  }, {
    "preferred-label" : "hantera stress",
    "type" : "esco-skill",
    "start-position" : 526,
    "end-position" : 537,
    "concept-id" : "z5Zo_DVb_VEK",
    "matched-string" : "stresstålig",
    "annotation-id" : 18
  }, {
    "preferred-label" : "noggrannhet",
    "type" : "esco-skill",
    "start-position" : 539,
    "end-position" : 547,
    "concept-id" : "mrsW_EkL_KRD",
    "matched-string" : "noggrann",
    "annotation-id" : 17
  }, {
    "preferred-label" : "Restaurang",
    "type" : "keyword",
    "start-position" : 616,
    "end-position" : 635,
    "concept-id" : "o2Cg_3Ap_qvK",
    "matched-string" : "restaurangbranschen",
    "annotation-id" : 19
  }, {
    "preferred-label" : "Deltid",
    "type" : "worktime-extent",
    "start-position" : 664,
    "end-position" : 670,
    "concept-id" : "947z_JGS_Uk2",
    "matched-string" : "deltid",
    "annotation-id" : 16
  } ],
  "text" : "Driven  Kock  80%\nTreviso Italiensk Restaurang & Pizzeria i Falköping och Skövde söker extra personal.\nTillsvidare anställning 80%\nDriven a la carte kock/ Kokerska eller pizzabagare med fokus på kvällar sökes!\nTreviso Italiensk Restaurang & Pizzeria är en stabil restaurang med fullständiga rättigheter ligger i Centrala Skövde.\nHar du passion för matlagning?\n Brinner du för service och vet hur du ska överträffa gästens förväntningar?\nTycker du om att jobba självständigt och ta eget ansvar för det du gör?\nSom person är du stresstålig, noggrann, gillar högt tempo samt tar egna initiativ.\nEtt års erfarenhet inom restaurangbranschen är ett krav.\nTjänsten är på deltid enligt överenskommelsen.\nÖppen för alla\nVi fokuserar på din kompetens, inte dina övriga förutsättningar. Vi är öppna för att anpassa rollen eller arbetsplatsen efter dina behov."
}