{
  "meta" : {
    "jobad" : {
      "description" : {
        "requirements" : null,
        "needs" : null,
        "company_information" : null,
        "text_formatted" : "<p>Vi söker nu en medarbetare till restaurangen på heltid som servitris eller servitör. Ska kunna tala flytande svenska och engelska och är meriterande om du har erfarenhet inom restaurangbranschen. Vid intresse kan mötas för en intervju och diskutera vidare.</p>",
        "conditions" : null,
        "text" : "Vi söker nu en medarbetare till restaurangen på heltid som servitris eller servitör. Ska kunna tala flytande svenska och engelska och är meriterande om du har erfarenhet inom restaurangbranschen. Vid intresse kan mötas för en intervju och diskutera vidare."
      },
      "headline" : "Söker serveringspersonal",
      "driving_license" : null,
      "employer" : {
        "email" : null,
        "phone_number" : null,
        "organization_number" : "5565006854",
        "name" : "Kinarestaurangen Chi Shen AB",
        "url" : null,
        "workplace" : "Kinarestaurangen Chi Shen AB"
      },
      "removed_date" : null,
      "logo_url" : null,
      "last_publication_date" : "2022-09-03T00:00:00",
      "number_of_vacancies" : 1,
      "occupation" : {
        "concept_id" : "rGGf_KLs_To7",
        "label" : "Servitör/Servitris",
        "legacy_ams_taxonomy_id" : "5487"
      },
      "occupation_group" : {
        "concept_id" : "UjoW_meY_Zwt",
        "label" : "Hovmästare och servitörer",
        "legacy_ams_taxonomy_id" : "5131"
      },
      "employment_type" : {
        "concept_id" : "PFZr_Syz_cUq",
        "label" : "Vanlig anställning",
        "legacy_ams_taxonomy_id" : "1"
      },
      "webpage_url" : "https://arbetsformedlingen.se/platsbanken/annonser/26378713",
      "driving_license_required" : false,
      "application_contacts" : [ ],
      "duration" : {
        "concept_id" : "qQUd_4qe_NDT",
        "label" : "6 månader eller längre",
        "legacy_ams_taxonomy_id" : "2"
      },
      "nice_to_have" : {
        "education_level" : [ ],
        "work_experiences" : [ {
          "concept_id" : "rGGf_KLs_To7",
          "weight" : 5,
          "label" : "Servitör/Servitris",
          "legacy_ams_taxonomy_id" : "5487"
        } ],
        "skills" : [ ],
        "education" : [ ],
        "languages" : [ {
          "concept_id" : "cxiY_CBR_1Ve",
          "weight" : 5,
          "label" : "Mandarin",
          "legacy_ams_taxonomy_id" : "377"
        } ]
      },
      "application_details" : {
        "via_af" : false,
        "email" : "Info@weiwei.nu",
        "other" : null,
        "reference" : null,
        "url" : null,
        "information" : null
      },
      "source_type" : "VIA_ANNONSERA",
      "application_deadline" : "2022-09-03T00:00:00",
      "external_id" : null,
      "workplace_address" : {
        "coordinates" : [ 11.969497269199497, 57.70846074899342 ],
        "city" : "Göteborg",
        "postcode" : "41106",
        "municipality" : "Göteborg",
        "region_concept_id" : "zdoY_6u5_Krt",
        "region" : "Västra Götalands län",
        "country_code" : "199",
        "region_code" : "14",
        "municipality_concept_id" : "PVZL_BQT_XtL",
        "country_concept_id" : "i46j_HmG_v64",
        "municipality_code" : "1480",
        "street_address" : "Postgatan 26",
        "country" : "Sverige"
      },
      "id" : "26378713",
      "experience_required" : true,
      "working_hours_type" : {
        "concept_id" : "6YE1_gAC_R2G",
        "label" : "Heltid",
        "legacy_ams_taxonomy_id" : "1"
      },
      "access" : null,
      "timestamp" : 1659620885266,
      "must_have" : {
        "education_level" : [ ],
        "work_experiences" : [ ],
        "skills" : [ ],
        "education" : [ ],
        "languages" : [ {
          "concept_id" : "zSLA_vw2_FXN",
          "weight" : 10,
          "label" : "Svenska",
          "legacy_ams_taxonomy_id" : "502"
        }, {
          "concept_id" : "NVxJ_hLg_TYS",
          "weight" : 10,
          "label" : "Engelska",
          "legacy_ams_taxonomy_id" : "283"
        } ]
      },
      "occupation_field" : {
        "concept_id" : "ScKy_FHB_7wT",
        "label" : "Hotell, restaurang, storhushåll",
        "legacy_ams_taxonomy_id" : "7"
      },
      "scope_of_work" : {
        "min" : 0,
        "max" : 100
      },
      "salary_type" : {
        "concept_id" : "oG8G_9cW_nRf",
        "label" : "Fast månads- vecko- eller timlön",
        "legacy_ams_taxonomy_id" : "1"
      },
      "removed" : false,
      "salary_description" : null,
      "access_to_own_car" : false,
      "publication_date" : "2022-08-04T15:48:05"
    },
    "name" : "Söker serveringspersonal",
    "user" : "hannes"
  },
  "sha1" : "e5df98bde54ec5fe84ff6284789194b53f4e9264",
  "annotations" : [ {
    "preferred-label" : "Serveringspersonal",
    "sentiment" : "MUST_HAVE",
    "type" : "keyword",
    "start-position" : 6,
    "end-position" : 24,
    "concept-id" : "VqRa_738_v98",
    "matched-string" : "serveringspersonal",
    "annotation-id" : 0
  }, {
    "preferred-label" : "Heltid",
    "type" : "worktime-extent",
    "start-position" : 73,
    "end-position" : 79,
    "concept-id" : "6YE1_gAC_R2G",
    "matched-string" : "heltid",
    "annotation-id" : 5
  }, {
    "preferred-label" : "Servitör/Servitris",
    "sentiment" : "MUST_HAVE",
    "type" : "occupation-name",
    "start-position" : 84,
    "end-position" : 93,
    "concept-id" : "rGGf_KLs_To7",
    "matched-string" : "servitris",
    "annotation-id" : 1
  }, {
    "preferred-label" : "Servitör/Servitris",
    "sentiment" : "MUST_HAVE",
    "type" : "occupation-name",
    "start-position" : 100,
    "end-position" : 108,
    "concept-id" : "rGGf_KLs_To7",
    "matched-string" : "servitör",
    "annotation-id" : 2
  }, {
    "preferred-label" : "Svenska",
    "sentiment" : "MUST_HAVE",
    "type" : "language",
    "start-position" : 134,
    "end-position" : 141,
    "concept-id" : "zSLA_vw2_FXN",
    "matched-string" : "svenska",
    "annotation-id" : 3
  }, {
    "preferred-label" : "Engelska",
    "sentiment" : "MUST_HAVE",
    "type" : "language",
    "start-position" : 146,
    "end-position" : 154,
    "concept-id" : "NVxJ_hLg_TYS",
    "matched-string" : "engelska",
    "annotation-id" : 4
  }, {
    "preferred-label" : "Restaurang",
    "type" : "keyword",
    "start-position" : 200,
    "end-position" : 219,
    "concept-id" : "o2Cg_3Ap_qvK",
    "matched-string" : "restaurangbranschen",
    "annotation-id" : 6
  } ],
  "text" : "Söker serveringspersonal\nVi söker nu en medarbetare till restaurangen på heltid som servitris eller servitör. Ska kunna tala flytande svenska och engelska och är meriterande om du har erfarenhet inom restaurangbranschen. Vid intresse kan mötas för en intervju och diskutera vidare."
}