{
  "meta" : {
    "jobad" : {
      "description" : {
        "requirements" : null,
        "needs" : null,
        "company_information" : null,
        "text_formatted" : "Serviceföretaget Pima AB är ett företag som specialiserat sig på lokalvård för företag med säkerställd renhet men vi har även en stor variation av kunder och hjälper till med allt från golvvård, fönsterputs till regelmässig lokalvård.\n\n\n\nVi har idag ca 150 medarbetare som levererar service till organisationer och privatpersoner i hela södra Sverige, från Uppsala till Skåne.\n\n\r\n\r\nBeskrivning\nVi behöver nu dig som vill jobba som lokalvårdare på skolor och förskolor i Gnesta.\r\n\r\nVi städar kvällstid på flera objekt. \n\nArbetsuppgifter\nDu kommer städa i olika typer av skolmiljöer så som i skolsalar, korridorer, matsal, toaletter, trapphus, idrottssal, omklädningsrum, förskolelokaler och andra typer av lokaler. \n\nKvalifikationer\nVi söker dig som är:\n- Ansvarstagande\n- Är social\n- Gillar att arbetat med barn runt omkring\n- Klarar av att arbeta ensam men även i grupp\n- Tycker om att följa instruktioner\n\nDet är meriterande om du har erfarenhet av städning i skolor sedan tidigare.\n\nFör att förstå instruktioner och kunna kommunicera med kunden är det viktigt att du kan svenska i tal och skrift.\n\nStämmer detta in på dig? Sök direkt, då intervjuer och rekrytering sker löpande ser vi fram emot din ansökan redan idag!\n\n\n\nVillkor\nTjänsterna vi söker är på deltid, vi tillämpar visstidsanställning. Start på respektive objekt sker från v 35. Arbetstiderna är mån-fre mellan ca 17.00 - 20.30 efter verksamheten har stängt.\n\nArbetsplatserna ligger på olika adresser i Gnesta.\n\nUtdrag ur belastningsregistret måste visas då arbetet är i skolmiljö.\n\nIntervjuer sker löpande, vi ser fram emot din ansökan redan idag.",
        "conditions" : "40-60%. Tillträde: Omgående\r\nVisstidsanställning till ",
        "text" : "Serviceföretaget Pima AB är ett företag som specialiserat sig på lokalvård för företag med säkerställd renhet men vi har även en stor variation av kunder och hjälper till med allt från golvvård, fönsterputs till regelmässig lokalvård.\n\n\n\nVi har idag ca 150 medarbetare som levererar service till organisationer och privatpersoner i hela södra Sverige, från Uppsala till Skåne.\n\n\r\n\r\nBeskrivning\nVi behöver nu dig som vill jobba som lokalvårdare på skolor och förskolor i Gnesta.\r\n\r\nVi städar kvällstid på flera objekt. \n\nArbetsuppgifter\nDu kommer städa i olika typer av skolmiljöer så som i skolsalar, korridorer, matsal, toaletter, trapphus, idrottssal, omklädningsrum, förskolelokaler och andra typer av lokaler. \n\nKvalifikationer\nVi söker dig som är:\n- Ansvarstagande\n- Är social\n- Gillar att arbetat med barn runt omkring\n- Klarar av att arbeta ensam men även i grupp\n- Tycker om att följa instruktioner\n\nDet är meriterande om du har erfarenhet av städning i skolor sedan tidigare.\n\nFör att förstå instruktioner och kunna kommunicera med kunden är det viktigt att du kan svenska i tal och skrift.\n\nStämmer detta in på dig? Sök direkt, då intervjuer och rekrytering sker löpande ser vi fram emot din ansökan redan idag!\n\n\n\nVillkor\nTjänsterna vi söker är på deltid, vi tillämpar visstidsanställning. Start på respektive objekt sker från v 35. Arbetstiderna är mån-fre mellan ca 17.00 - 20.30 efter verksamheten har stängt.\n\nArbetsplatserna ligger på olika adresser i Gnesta.\n\nUtdrag ur belastningsregistret måste visas då arbetet är i skolmiljö.\n\nIntervjuer sker löpande, vi ser fram emot din ansökan redan idag."
      },
      "headline" : "Lokalvårdare deltid - Gnesta",
      "driving_license" : null,
      "employer" : {
        "email" : null,
        "phone_number" : null,
        "organization_number" : "5564645520",
        "name" : "Serviceföretaget Pima AB",
        "url" : null,
        "workplace" : "Pima"
      },
      "removed_date" : null,
      "logo_url" : "https://www.arbetsformedlingen.se/rest/arbetsgivare/rest/af/v3/organisation/5564645520/logotyper/logo.png",
      "last_publication_date" : "2022-08-13T23:59:59",
      "number_of_vacancies" : 4,
      "occupation" : {
        "concept_id" : "dYo1_D8c_87U",
        "label" : "Städare/Lokalvårdare",
        "legacy_ams_taxonomy_id" : "464"
      },
      "occupation_group" : {
        "concept_id" : "Z6TY_xDf_Yup",
        "label" : "Städare",
        "legacy_ams_taxonomy_id" : "9111"
      },
      "employment_type" : {
        "concept_id" : "PFZr_Syz_cUq",
        "label" : "Vanlig anställning",
        "legacy_ams_taxonomy_id" : "1"
      },
      "webpage_url" : "https://arbetsformedlingen.se/platsbanken/annonser/26321985",
      "driving_license_required" : false,
      "application_contacts" : [ ],
      "duration" : {
        "concept_id" : "qQUd_4qe_NDT",
        "label" : "6 månader eller längre",
        "legacy_ams_taxonomy_id" : "2"
      },
      "nice_to_have" : {
        "education_level" : [ ],
        "work_experiences" : [ ],
        "skills" : [ ],
        "education" : [ ],
        "languages" : [ ]
      },
      "application_details" : {
        "via_af" : false,
        "email" : null,
        "other" : null,
        "reference" : "2022/45",
        "url" : "https://pima.varbi.com/what:job/jobID:530151/type:job/where:1/apply:1",
        "information" : null
      },
      "source_type" : "VIA_PLATSBANKEN_DXA",
      "application_deadline" : "2022-08-13T23:59:59",
      "external_id" : "46-556464-5520-530151",
      "workplace_address" : {
        "coordinates" : [ 17.307228, 59.048347 ],
        "city" : null,
        "postcode" : null,
        "municipality" : "Gnesta",
        "region_concept_id" : "s93u_BEb_sx2",
        "region" : "Södermanlands län",
        "country_code" : "199",
        "region_code" : "04",
        "municipality_concept_id" : "os8Y_RUo_U3u",
        "country_concept_id" : "i46j_HmG_v64",
        "municipality_code" : "0461",
        "street_address" : null,
        "country" : "Sverige"
      },
      "id" : "26321985",
      "experience_required" : true,
      "working_hours_type" : {
        "concept_id" : "947z_JGS_Uk2",
        "label" : "Deltid",
        "legacy_ams_taxonomy_id" : "2"
      },
      "access" : null,
      "timestamp" : 1657695664636,
      "must_have" : {
        "education_level" : [ ],
        "work_experiences" : [ {
          "concept_id" : "dYo1_D8c_87U",
          "weight" : 10,
          "label" : "Städare/Lokalvårdare",
          "legacy_ams_taxonomy_id" : "464"
        } ],
        "skills" : [ ],
        "education" : [ ],
        "languages" : [ ]
      },
      "occupation_field" : {
        "concept_id" : "whao_Q6A_ScE",
        "label" : "Sanering och renhållning",
        "legacy_ams_taxonomy_id" : "12"
      },
      "scope_of_work" : {
        "min" : 40,
        "max" : 60
      },
      "salary_type" : {
        "concept_id" : "oG8G_9cW_nRf",
        "label" : "Fast månads- vecko- eller timlön",
        "legacy_ams_taxonomy_id" : "1"
      },
      "removed" : false,
      "salary_description" : "Månadslön",
      "access_to_own_car" : false,
      "publication_date" : "2022-07-13T09:01:04"
    },
    "name" : "Lokalvårdare deltid - Gnesta",
    "user" : "kristof.fischer"
  },
  "sha1" : "ad568c8173aab7c7673e307f86b0e3e31441c52b",
  "annotations" : [ {
    "preferred-label" : "Städare/Lokalvårdare",
    "sentiment" : "MUST_HAVE",
    "type" : "occupation-name",
    "start-position" : 0,
    "end-position" : 12,
    "concept-id" : "dYo1_D8c_87U",
    "matched-string" : "lokalvårdare",
    "annotation-id" : 0
  }, {
    "preferred-label" : "Deltid",
    "type" : "worktime-extent",
    "start-position" : 13,
    "end-position" : 19,
    "concept-id" : "947z_JGS_Uk2",
    "matched-string" : "deltid",
    "annotation-id" : 7
  }, {
    "preferred-label" : "Gnesta",
    "type" : "municipality",
    "start-position" : 22,
    "end-position" : 28,
    "concept-id" : "os8Y_RUo_U3u",
    "matched-string" : "Gnesta",
    "annotation-id" : 6
  }, {
    "preferred-label" : "Sverige",
    "type" : "country",
    "start-position" : 372,
    "end-position" : 379,
    "concept-id" : "i46j_HmG_v64",
    "matched-string" : "Sverige",
    "annotation-id" : 8
  }, {
    "preferred-label" : "Uppsala",
    "type" : "municipality",
    "start-position" : 386,
    "end-position" : 393,
    "concept-id" : "otaF_bQY_4ZD",
    "matched-string" : "Uppsala",
    "annotation-id" : 9
  }, {
    "preferred-label" : "Skåne län",
    "type" : "region",
    "start-position" : 399,
    "end-position" : 404,
    "concept-id" : "CaRE_1nn_cSU",
    "matched-string" : "Skåne",
    "annotation-id" : 10
  }, {
    "preferred-label" : "Städare/Lokalvårdare",
    "sentiment" : "MUST_HAVE",
    "type" : "occupation-name",
    "start-position" : 460,
    "end-position" : 472,
    "concept-id" : "dYo1_D8c_87U",
    "matched-string" : "lokalvårdare",
    "annotation-id" : 3
  }, {
    "preferred-label" : "Gnesta",
    "type" : "municipality",
    "start-position" : 499,
    "end-position" : 505,
    "concept-id" : "os8Y_RUo_U3u",
    "matched-string" : "Gnesta",
    "annotation-id" : 11
  }, {
    "preferred-label" : "Städning av förskola/Städning av skola",
    "sentiment" : "MUST_HAVE",
    "type" : "skill",
    "start-position" : 575,
    "end-position" : 609,
    "concept-id" : "y4sg_zUA_mPz",
    "matched-string" : "städa i olika typer av skolmiljöer",
    "annotation-id" : 12
  }, {
    "preferred-label" : "visa ansvarstagande",
    "sentiment" : "MUST_HAVE",
    "type" : "esco-skill",
    "start-position" : 784,
    "end-position" : 798,
    "concept-id" : "bcRp_hxV_f5G",
    "matched-string" : "Ansvarstagande",
    "annotation-id" : 13
  }, {
    "preferred-label" : "Barn och ungdom",
    "sentiment" : "MUST_HAVE",
    "type" : "skill",
    "start-position" : 836,
    "end-position" : 840,
    "concept-id" : "qkyH_MC1_YKU",
    "matched-string" : "barn",
    "annotation-id" : 14
  }, {
    "preferred-label" : "arbeta självständigt",
    "sentiment" : "MUST_HAVE",
    "type" : "esco-skill",
    "start-position" : 870,
    "end-position" : 882,
    "concept-id" : "NyFu_HHd_zhz",
    "matched-string" : "arbeta ensam",
    "annotation-id" : 15
  }, {
    "preferred-label" : "arbeta som ett team",
    "sentiment" : "MUST_HAVE",
    "type" : "esco-skill",
    "start-position" : 892,
    "end-position" : 899,
    "concept-id" : "VFVZ_4YG_Ydi",
    "matched-string" : "i grupp",
    "annotation-id" : 16
  }, {
    "preferred-label" : "Städning av förskola/Städning av skola",
    "sentiment" : "NICE_TO_HAVE",
    "type" : "skill",
    "start-position" : 980,
    "end-position" : 997,
    "concept-id" : "y4sg_zUA_mPz",
    "matched-string" : "städning i skolor",
    "annotation-id" : 17
  }, {
    "preferred-label" : "Svenska",
    "sentiment" : "MUST_HAVE",
    "type" : "language",
    "start-position" : 1103,
    "end-position" : 1110,
    "concept-id" : "zSLA_vw2_FXN",
    "matched-string" : "svenska",
    "annotation-id" : 5
  }, {
    "preferred-label" : "Deltid",
    "type" : "worktime-extent",
    "start-position" : 1288,
    "end-position" : 1294,
    "concept-id" : "947z_JGS_Uk2",
    "matched-string" : "deltid",
    "annotation-id" : 18
  }, {
    "preferred-label" : "Gnesta",
    "type" : "municipality",
    "start-position" : 1497,
    "end-position" : 1503,
    "concept-id" : "os8Y_RUo_U3u",
    "matched-string" : "Gnesta",
    "annotation-id" : 19
  } ],
  "text" : "Lokalvårdare deltid - Gnesta\nServiceföretaget Pima AB är ett företag som specialiserat sig på lokalvård för företag med säkerställd renhet men vi har även en stor variation av kunder och hjälper till med allt från golvvård, fönsterputs till regelmässig lokalvård.\n\n\n\nVi har idag ca 150 medarbetare som levererar service till organisationer och privatpersoner i hela södra Sverige, från Uppsala till Skåne.\n\n\r\n\r\nBeskrivning\nVi behöver nu dig som vill jobba som lokalvårdare på skolor och förskolor i Gnesta.\r\n\r\nVi städar kvällstid på flera objekt. \n\nArbetsuppgifter\nDu kommer städa i olika typer av skolmiljöer så som i skolsalar, korridorer, matsal, toaletter, trapphus, idrottssal, omklädningsrum, förskolelokaler och andra typer av lokaler. \n\nKvalifikationer\nVi söker dig som är:\n- Ansvarstagande\n- Är social\n- Gillar att arbetat med barn runt omkring\n- Klarar av att arbeta ensam men även i grupp\n- Tycker om att följa instruktioner\n\nDet är meriterande om du har erfarenhet av städning i skolor sedan tidigare.\n\nFör att förstå instruktioner och kunna kommunicera med kunden är det viktigt att du kan svenska i tal och skrift.\n\nStämmer detta in på dig? Sök direkt, då intervjuer och rekrytering sker löpande ser vi fram emot din ansökan redan idag!\n\n\n\nVillkor\nTjänsterna vi söker är på deltid, vi tillämpar visstidsanställning. Start på respektive objekt sker från v 35. Arbetstiderna är mån-fre mellan ca 17.00 - 20.30 efter verksamheten har stängt.\n\nArbetsplatserna ligger på olika adresser i Gnesta.\n\nUtdrag ur belastningsregistret måste visas då arbetet är i skolmiljö.\n\nIntervjuer sker löpande, vi ser fram emot din ansökan redan idag."
}