{
  "meta" : {
    "jobad" : {
      "description" : {
        "requirements" : null,
        "needs" : null,
        "company_information" : null,
        "text_formatted" : "Kriminalvården växer – vi bygger nytt, bygger om och bygger till och söker nu nya medarbetare. Vårt viktigaste mål är att minska återfall i brott – att bryta den onda cirkeln. Lyckas vi med det blir samhället tryggare och säkrare för alla. Vi är den myndighet som ansvarar för anstalter, frivård, häkten och klienttransporter.\r\n\r\nARBETSUPPGIFTER\nDen här annonsen är för dig som vill arbeta som kriminalvårdare men som inte har gått kriminalvårdsutbildning.\n\nSom kriminalvårdare kan du bidra till ett tryggare och säkrare samhälle. Du jobbar i team tillsammans med andra yrkesgrupper och får möjlighet att hjälpa människor att bryta den onda cirkeln och motivera till att inte återfalla i brott. Det är viktigt att du delar Kriminalvårdens grundläggande värderingar om en human människosyn, respekt för individen och tron på att människan kan utvecklas och förändras. \n\nAtt arbeta vid transportenheten innebär att din huvudsakliga uppgift är att transportera frihetsberövade personer, för Kriminalvården och andra myndigheters räkning. Arbetet omfattar också bevakning under t.ex. rättegångar och vid sjukhusbesök. Det varierande uppdraget innebär att arbetstiden kan vara olika dag för dag.\n\nBeroende på antalet utbildningsplatser och vårt behov av personal börjar du din anställning med antingen utbildning eller arbete. Om du börjar arbeta direkt är tanken att du så fort som möjligt ska börja din kriminalvårdsutbildning. Det är en obligatorisk utbildning på 23 veckor och du får full lön under hela utbildningstiden. Utbildningen varvar teori och praktik. Under provanställningen genomförs löpande bedömningar för din möjlighet till tillsvidareanställning.\r\n\r\nKVALIFIKATIONER\nDina personliga egenskaper är viktiga. Som kriminalvårdare behöver du vara trygg, stabil, ha god självinsikt, gott omdöme och integritet. Tillsammans med dina kollegor driver du verksamheten, så du behöver ha god samarbetsförmåga och vara tydlig i din kommunikation. Du ska kunna agera fysiskt när det krävs.\n\nVi söker dig som har: \n•\tArbetslivserfarenhet, även i form av säsongsarbete, timanställning eller eget företagande. Praktik och volontärarbete är inte att jämställa med anställning.\n•\tFullständig gymnasieutbildning alternativt annan utbildning i kombination med arbetslivserfarenhet som KV bedömer relevant.\n•\tGoda kunskaper i svenska språket i både tal och skrift\n•\tGod datorvana\n•\tB-körkort för manuellt växlat fordon och körvana\n\nDet är meriterande om du har: \n•\tArbetslivserfarenhet från kriminalvård, säkerhetsarbete, social omsorg, psykiatri eller vård- och omsorgsarbete\n•\tKunskap inom relevanta områden, exempelvis beteendevetenskap, kriminologi psykiatri, juridik och konflikthantering\n•\tRelevanta språkkunskaper\r\n\nÖVRIGT\nVi ställer höga krav på våra medarbetares säkerhets- och sekretessmedvetande. Därför gör vi en säkerhetskontroll innan vi beslutar om du får anställning hos oss. Vissa tjänster är placerade i säkerhetsklass och då gör vi en säkerhetsprövning med registerkontroll innan vi fattar anställningsbeslut. För tjänster med högre säkerhetsklass behöver du vara svensk medborgare, men du får gärna ha utländsk bakgrund.\n\nI anställningen ingår en obligatorisk kriminalvårdsutbildning. Den kan komma att genomföras på annan ort. Kriminalvårdens verksamhet pågår dygnet runt, året runt. Det innebär att du kommer att arbeta dagar, kvällar och helger. Vissa scheman innebär arbete på nätter. \n\nTjänsten tillsätts under förutsättning att erforderliga beslut fattas.\n\nLäs mer om förutsättningar kring anställningsform här: https://www.kriminalvarden.se//jobba-hos-oss/yrkesroller/kriminalvardare/anstallningsform-kriminalvardsutbildning/   \n\nKriminalvården strävar efter en jämn köns- och åldersfördelning och ökad mångfald. \n\nFör att skicka in din ansökan, klicka på ansökningslänken i annonsen. Frågor om hur du ansöker och lägger in ditt CV ställer du direkt till Visma Recruit 0771- 693 693. Frågor om specifika jobb besvaras av den kontaktperson som anges i annonsen. Vi tar inte emot ansökningar i pappersform eller per e-post.\n\nVi undanber oss vänligen men bestämt direktkontakt med bemannings- och rekryteringsföretag och försäljare av rekryteringsannonser. Kriminalvården har upphandlade avtal.",
        "conditions" : "Heltid.  Schema. Schema måndag - fredag.\r\nTillsvidareanställning, tillträde: Tillträde 1/10. Anställningen påbörjas med provanställning alt. allmän visstidsanställning (läs mer via länk under övrigt).",
        "text" : "Kriminalvården växer – vi bygger nytt, bygger om och bygger till och söker nu nya medarbetare. Vårt viktigaste mål är att minska återfall i brott – att bryta den onda cirkeln. Lyckas vi med det blir samhället tryggare och säkrare för alla. Vi är den myndighet som ansvarar för anstalter, frivård, häkten och klienttransporter.\r\n\r\nARBETSUPPGIFTER\nDen här annonsen är för dig som vill arbeta som kriminalvårdare men som inte har gått kriminalvårdsutbildning.\n\nSom kriminalvårdare kan du bidra till ett tryggare och säkrare samhälle. Du jobbar i team tillsammans med andra yrkesgrupper och får möjlighet att hjälpa människor att bryta den onda cirkeln och motivera till att inte återfalla i brott. Det är viktigt att du delar Kriminalvårdens grundläggande värderingar om en human människosyn, respekt för individen och tron på att människan kan utvecklas och förändras. \n\nAtt arbeta vid transportenheten innebär att din huvudsakliga uppgift är att transportera frihetsberövade personer, för Kriminalvården och andra myndigheters räkning. Arbetet omfattar också bevakning under t.ex. rättegångar och vid sjukhusbesök. Det varierande uppdraget innebär att arbetstiden kan vara olika dag för dag.\n\nBeroende på antalet utbildningsplatser och vårt behov av personal börjar du din anställning med antingen utbildning eller arbete. Om du börjar arbeta direkt är tanken att du så fort som möjligt ska börja din kriminalvårdsutbildning. Det är en obligatorisk utbildning på 23 veckor och du får full lön under hela utbildningstiden. Utbildningen varvar teori och praktik. Under provanställningen genomförs löpande bedömningar för din möjlighet till tillsvidareanställning.\r\n\r\nKVALIFIKATIONER\nDina personliga egenskaper är viktiga. Som kriminalvårdare behöver du vara trygg, stabil, ha god självinsikt, gott omdöme och integritet. Tillsammans med dina kollegor driver du verksamheten, så du behöver ha god samarbetsförmåga och vara tydlig i din kommunikation. Du ska kunna agera fysiskt när det krävs.\n\nVi söker dig som har: \n•\tArbetslivserfarenhet, även i form av säsongsarbete, timanställning eller eget företagande. Praktik och volontärarbete är inte att jämställa med anställning.\n•\tFullständig gymnasieutbildning alternativt annan utbildning i kombination med arbetslivserfarenhet som KV bedömer relevant.\n•\tGoda kunskaper i svenska språket i både tal och skrift\n•\tGod datorvana\n•\tB-körkort för manuellt växlat fordon och körvana\n\nDet är meriterande om du har: \n•\tArbetslivserfarenhet från kriminalvård, säkerhetsarbete, social omsorg, psykiatri eller vård- och omsorgsarbete\n•\tKunskap inom relevanta områden, exempelvis beteendevetenskap, kriminologi psykiatri, juridik och konflikthantering\n•\tRelevanta språkkunskaper\r\n\nÖVRIGT\nVi ställer höga krav på våra medarbetares säkerhets- och sekretessmedvetande. Därför gör vi en säkerhetskontroll innan vi beslutar om du får anställning hos oss. Vissa tjänster är placerade i säkerhetsklass och då gör vi en säkerhetsprövning med registerkontroll innan vi fattar anställningsbeslut. För tjänster med högre säkerhetsklass behöver du vara svensk medborgare, men du får gärna ha utländsk bakgrund.\n\nI anställningen ingår en obligatorisk kriminalvårdsutbildning. Den kan komma att genomföras på annan ort. Kriminalvårdens verksamhet pågår dygnet runt, året runt. Det innebär att du kommer att arbeta dagar, kvällar och helger. Vissa scheman innebär arbete på nätter. \n\nTjänsten tillsätts under förutsättning att erforderliga beslut fattas.\n\nLäs mer om förutsättningar kring anställningsform här: https://www.kriminalvarden.se//jobba-hos-oss/yrkesroller/kriminalvardare/anstallningsform-kriminalvardsutbildning/   \n\nKriminalvården strävar efter en jämn köns- och åldersfördelning och ökad mångfald. \n\nFör att skicka in din ansökan, klicka på ansökningslänken i annonsen. Frågor om hur du ansöker och lägger in ditt CV ställer du direkt till Visma Recruit 0771- 693 693. Frågor om specifika jobb besvaras av den kontaktperson som anges i annonsen. Vi tar inte emot ansökningar i pappersform eller per e-post.\n\nVi undanber oss vänligen men bestämt direktkontakt med bemannings- och rekryteringsföretag och försäljare av rekryteringsannonser. Kriminalvården har upphandlade avtal."
      },
      "headline" : "Kriminalvårdare till kriminalvårdsutbildningen NTE Västerås, placering Sala",
      "driving_license" : [ {
        "concept_id" : "VTK8_WRx_GcM",
        "label" : "B",
        "legacy_ams_taxonomy_id" : "3"
      } ],
      "employer" : {
        "email" : null,
        "phone_number" : null,
        "organization_number" : "2021000225",
        "name" : "Kriminalvården",
        "url" : null,
        "workplace" : "Kriminalvården, Nationella transportenheten (NTE)"
      },
      "removed_date" : null,
      "logo_url" : "https://www.arbetsformedlingen.se/rest/arbetsgivare/rest/af/v3/organisation/2021000225/logotyper/logo.png",
      "last_publication_date" : "2022-07-26T23:59:59",
      "number_of_vacancies" : 3,
      "occupation" : {
        "concept_id" : "NoHX_doS_a8J",
        "label" : "Kriminalvårdare",
        "legacy_ams_taxonomy_id" : "2503"
      },
      "occupation_group" : {
        "concept_id" : "hgAg_gLr_YGg",
        "label" : "Kriminalvårdare",
        "legacy_ams_taxonomy_id" : "5412"
      },
      "employment_type" : {
        "concept_id" : "PFZr_Syz_cUq",
        "label" : "Vanlig anställning",
        "legacy_ams_taxonomy_id" : "1"
      },
      "webpage_url" : "https://arbetsformedlingen.se/platsbanken/annonser/26292865",
      "driving_license_required" : true,
      "application_contacts" : [ {
        "description" : "Richard Backström",
        "email" : null,
        "telephone" : "077-22 80 800",
        "name" : null,
        "contact_type" : "Rekryterare"
      }, {
        "description" : "Bodil Eriksson",
        "email" : null,
        "telephone" : "010-4843850",
        "name" : null,
        "contact_type" : "Kriminalvårdsinspektör"
      } ],
      "duration" : {
        "concept_id" : "a7uU_j21_mkL",
        "label" : "Tills vidare",
        "legacy_ams_taxonomy_id" : "1"
      },
      "nice_to_have" : {
        "education_level" : [ ],
        "work_experiences" : [ ],
        "skills" : [ ],
        "education" : [ ],
        "languages" : [ ]
      },
      "application_details" : {
        "via_af" : false,
        "email" : null,
        "other" : null,
        "reference" : "C94892",
        "url" : "https://recruit.visma.com/Public/Apply.aspx?guidAssignment=e2cc8d6e-f00b-486b-b2c7-080ff60b8993&publishCode=AMS&TK=5625db7f-face-449e-bb66-df6b7d3a9432",
        "information" : null
      },
      "source_type" : "VIA_PLATSBANKEN_DXA",
      "application_deadline" : "2022-07-26T23:59:59",
      "external_id" : "46-202100-0225-E2CC8D6EF00B486BB2C7080FF60B8993",
      "workplace_address" : {
        "coordinates" : [ 16.606327, 59.92086 ],
        "city" : null,
        "postcode" : null,
        "municipality" : "Sala",
        "region_concept_id" : "G6DV_fKE_Viz",
        "region" : "Västmanlands län",
        "country_code" : "199",
        "region_code" : "19",
        "municipality_concept_id" : "dAen_yTK_tqz",
        "country_concept_id" : "i46j_HmG_v64",
        "municipality_code" : "1981",
        "street_address" : null,
        "country" : "Sverige"
      },
      "id" : "26292865",
      "experience_required" : true,
      "working_hours_type" : {
        "concept_id" : "6YE1_gAC_R2G",
        "label" : "Heltid",
        "legacy_ams_taxonomy_id" : "1"
      },
      "access" : null,
      "timestamp" : 1657002909311,
      "must_have" : {
        "education_level" : [ ],
        "work_experiences" : [ {
          "concept_id" : "NoHX_doS_a8J",
          "weight" : 10,
          "label" : "Kriminalvårdare",
          "legacy_ams_taxonomy_id" : "2503"
        } ],
        "skills" : [ ],
        "education" : [ ],
        "languages" : [ ]
      },
      "occupation_field" : {
        "concept_id" : "E7hm_BLq_fqZ",
        "label" : "Säkerhet och bevakning",
        "legacy_ams_taxonomy_id" : "17"
      },
      "scope_of_work" : {
        "min" : 100,
        "max" : 100
      },
      "salary_type" : {
        "concept_id" : "oG8G_9cW_nRf",
        "label" : "Fast månads- vecko- eller timlön",
        "legacy_ams_taxonomy_id" : "1"
      },
      "removed" : false,
      "salary_description" : "Månadslön Individuell lönesättning tillämpas.",
      "access_to_own_car" : false,
      "publication_date" : "2022-07-05T08:35:09"
    },
    "name" : "Kriminalvårdare till kriminalvårdsutbildningen NTE Västerås, placering Sala",
    "user" : "hannes"
  },
  "sha1" : "f1990dd5b604d283ba9477fa6f6c5e8d92c2ef47",
  "annotations" : [ {
    "preferred-label" : "Kriminalvårdare",
    "sentiment" : "MUST_HAVE",
    "type" : "occupation-name",
    "start-position" : 0,
    "end-position" : 15,
    "concept-id" : "NoHX_doS_a8J",
    "matched-string" : "kriminalvårdare",
    "annotation-id" : 0
  }, {
    "preferred-label" : "Västerås",
    "type" : "municipality",
    "start-position" : 51,
    "end-position" : 59,
    "concept-id" : "8deT_FRF_2SP",
    "matched-string" : "Västerås",
    "annotation-id" : 22
  }, {
    "preferred-label" : "Sala",
    "type" : "municipality",
    "start-position" : 71,
    "end-position" : 75,
    "concept-id" : "dAen_yTK_tqz",
    "matched-string" : "Sala",
    "annotation-id" : 23
  }, {
    "preferred-label" : "Kriminalvården",
    "sentiment" : "MUST_HAVE",
    "type" : "keyword",
    "start-position" : 76,
    "end-position" : 90,
    "concept-id" : "S84z_MKP_aV6",
    "matched-string" : "kriminalvården",
    "annotation-id" : 1
  }, {
    "preferred-label" : "Kriminalvårdare",
    "sentiment" : "MUST_HAVE",
    "type" : "occupation-name",
    "start-position" : 470,
    "end-position" : 485,
    "concept-id" : "NoHX_doS_a8J",
    "matched-string" : "kriminalvårdare",
    "annotation-id" : 2
  }, {
    "preferred-label" : "Kriminalvårdsutbildning",
    "sentiment" : "MUST_HAVE",
    "type" : "keyword",
    "start-position" : 508,
    "end-position" : 531,
    "concept-id" : "WW47_z4A_uww",
    "matched-string" : "kriminalvårdsutbildning",
    "annotation-id" : 3
  }, {
    "preferred-label" : "Kriminalvårdare",
    "sentiment" : "MUST_HAVE",
    "type" : "occupation-name",
    "start-position" : 538,
    "end-position" : 553,
    "concept-id" : "NoHX_doS_a8J",
    "matched-string" : "kriminalvårdare",
    "annotation-id" : 4
  }, {
    "preferred-label" : "Kriminalvården",
    "type" : "keyword",
    "start-position" : 799,
    "end-position" : 814,
    "concept-id" : "S84z_MKP_aV6",
    "matched-string" : "Kriminalvårdens",
    "annotation-id" : 24
  }, {
    "preferred-label" : "Kriminalvården",
    "sentiment" : "MUST_HAVE",
    "type" : "keyword",
    "start-position" : 1064,
    "end-position" : 1078,
    "concept-id" : "S84z_MKP_aV6",
    "matched-string" : "kriminalvården",
    "annotation-id" : 5
  }, {
    "preferred-label" : "Personal",
    "sentiment" : "MUST_HAVE",
    "type" : "keyword",
    "start-position" : 1325,
    "end-position" : 1333,
    "concept-id" : "HVxM_6MS_y1c",
    "matched-string" : "personal",
    "annotation-id" : 6
  }, {
    "preferred-label" : "Kriminalvårdsutbildning",
    "sentiment" : "MUST_HAVE",
    "type" : "keyword",
    "start-position" : 1476,
    "end-position" : 1499,
    "concept-id" : "WW47_z4A_uww",
    "matched-string" : "kriminalvårdsutbildning",
    "annotation-id" : 7
  }, {
    "preferred-label" : "Tillsvidareanställning (inkl. eventuell provanställning)",
    "type" : "employment-type",
    "start-position" : 1713,
    "end-position" : 1735,
    "concept-id" : "kpPX_CNN_gDU",
    "matched-string" : "tillsvidareanställning",
    "annotation-id" : 25
  }, {
    "preferred-label" : "Kriminalvårdare",
    "sentiment" : "MUST_HAVE",
    "type" : "occupation-name",
    "start-position" : 1799,
    "end-position" : 1814,
    "concept-id" : "NoHX_doS_a8J",
    "matched-string" : "kriminalvårdare",
    "annotation-id" : 8
  }, {
    "preferred-label" : "samarbeta med kolleger",
    "type" : "esco-skill",
    "start-position" : 1969,
    "end-position" : 1985,
    "concept-id" : "X15R_797_q62",
    "matched-string" : "samarbetsförmåga",
    "annotation-id" : 26
  }, {
    "preferred-label" : "Säsongsanställning",
    "type" : "employment-type",
    "start-position" : 2128,
    "end-position" : 2141,
    "concept-id" : "EBhX_Qm2_8eX",
    "matched-string" : "säsongsarbete",
    "annotation-id" : 27
  }, {
    "preferred-label" : "Timanställning",
    "sentiment" : "MUST_HAVE",
    "type" : "keyword",
    "start-position" : 2143,
    "end-position" : 2157,
    "concept-id" : "kfXw_Vmt_Zzk",
    "matched-string" : "timanställning",
    "annotation-id" : 9
  }, {
    "preferred-label" : "Företagande",
    "sentiment" : "MUST_HAVE",
    "type" : "keyword",
    "start-position" : 2169,
    "end-position" : 2180,
    "concept-id" : "fxGP_Unf_RJZ",
    "matched-string" : "företagande",
    "annotation-id" : 10
  }, {
    "preferred-label" : "Svenska språket",
    "sentiment" : "MUST_HAVE",
    "type" : "keyword",
    "start-position" : 2393,
    "end-position" : 2408,
    "concept-id" : "BiGm_58D_SSn",
    "matched-string" : "svenska språket",
    "annotation-id" : 11
  }, {
    "preferred-label" : "B",
    "type" : "driving-licence",
    "start-position" : 2449,
    "end-position" : 2458,
    "concept-id" : "VTK8_WRx_GcM",
    "matched-string" : "B-körkort",
    "annotation-id" : 28
  }, {
    "preferred-label" : "Kriminalvård",
    "sentiment" : "MUST_HAVE",
    "type" : "sni-level-5",
    "start-position" : 2558,
    "end-position" : 2570,
    "concept-id" : "xVKK_eNQ_jrR",
    "matched-string" : "kriminalvård",
    "annotation-id" : 12
  }, {
    "preferred-label" : "Social omsorg",
    "sentiment" : "MUST_HAVE",
    "type" : "keyword",
    "start-position" : 2589,
    "end-position" : 2602,
    "concept-id" : "Sw4N_2Vt_PVD",
    "matched-string" : "social omsorg",
    "annotation-id" : 13
  }, {
    "preferred-label" : "Psykiatri",
    "sentiment" : "MUST_HAVE",
    "type" : "skill",
    "start-position" : 2604,
    "end-position" : 2613,
    "concept-id" : "sXoR_gGY_ycN",
    "matched-string" : "psykiatri",
    "annotation-id" : 14
  }, {
    "preferred-label" : "beteendevetenskap",
    "sentiment" : "MUST_HAVE",
    "type" : "esco-skill",
    "start-position" : 2689,
    "end-position" : 2706,
    "concept-id" : "Q4vC_gZx_HUa",
    "matched-string" : "beteendevetenskap",
    "annotation-id" : 15
  }, {
    "preferred-label" : "Kriminologi",
    "sentiment" : "MUST_HAVE",
    "type" : "skill",
    "start-position" : 2708,
    "end-position" : 2719,
    "concept-id" : "tc2X_KdJ_VEb",
    "matched-string" : "kriminologi",
    "annotation-id" : 16
  }, {
    "preferred-label" : "Psykiatri",
    "sentiment" : "MUST_HAVE",
    "type" : "skill",
    "start-position" : 2720,
    "end-position" : 2729,
    "concept-id" : "sXoR_gGY_ycN",
    "matched-string" : "psykiatri",
    "annotation-id" : 17
  }, {
    "preferred-label" : "Juridik",
    "sentiment" : "MUST_HAVE",
    "type" : "keyword",
    "start-position" : 2731,
    "end-position" : 2738,
    "concept-id" : "Z9ZH_7XU_Kkb",
    "matched-string" : "juridik",
    "annotation-id" : 18
  }, {
    "preferred-label" : "Kriminalvårdsutbildning",
    "sentiment" : "MUST_HAVE",
    "type" : "keyword",
    "start-position" : 3247,
    "end-position" : 3270,
    "concept-id" : "WW47_z4A_uww",
    "matched-string" : "kriminalvårdsutbildning",
    "annotation-id" : 19
  }, {
    "preferred-label" : "Kriminalvården",
    "type" : "keyword",
    "start-position" : 3315,
    "end-position" : 3330,
    "concept-id" : "S84z_MKP_aV6",
    "matched-string" : "Kriminalvårdens",
    "annotation-id" : 29
  }, {
    "preferred-label" : "Kriminalvården",
    "sentiment" : "MUST_HAVE",
    "type" : "keyword",
    "start-position" : 3724,
    "end-position" : 3738,
    "concept-id" : "S84z_MKP_aV6",
    "matched-string" : "kriminalvården",
    "annotation-id" : 20
  }, {
    "preferred-label" : "Kriminalvården",
    "sentiment" : "MUST_HAVE",
    "type" : "keyword",
    "start-position" : 4248,
    "end-position" : 4262,
    "concept-id" : "S84z_MKP_aV6",
    "matched-string" : "kriminalvården",
    "annotation-id" : 21
  } ],
  "text" : "Kriminalvårdare till kriminalvårdsutbildningen NTE Västerås, placering Sala\nKriminalvården växer – vi bygger nytt, bygger om och bygger till och söker nu nya medarbetare. Vårt viktigaste mål är att minska återfall i brott – att bryta den onda cirkeln. Lyckas vi med det blir samhället tryggare och säkrare för alla. Vi är den myndighet som ansvarar för anstalter, frivård, häkten och klienttransporter.\r\n\r\nARBETSUPPGIFTER\nDen här annonsen är för dig som vill arbeta som kriminalvårdare men som inte har gått kriminalvårdsutbildning.\n\nSom kriminalvårdare kan du bidra till ett tryggare och säkrare samhälle. Du jobbar i team tillsammans med andra yrkesgrupper och får möjlighet att hjälpa människor att bryta den onda cirkeln och motivera till att inte återfalla i brott. Det är viktigt att du delar Kriminalvårdens grundläggande värderingar om en human människosyn, respekt för individen och tron på att människan kan utvecklas och förändras. \n\nAtt arbeta vid transportenheten innebär att din huvudsakliga uppgift är att transportera frihetsberövade personer, för Kriminalvården och andra myndigheters räkning. Arbetet omfattar också bevakning under t.ex. rättegångar och vid sjukhusbesök. Det varierande uppdraget innebär att arbetstiden kan vara olika dag för dag.\n\nBeroende på antalet utbildningsplatser och vårt behov av personal börjar du din anställning med antingen utbildning eller arbete. Om du börjar arbeta direkt är tanken att du så fort som möjligt ska börja din kriminalvårdsutbildning. Det är en obligatorisk utbildning på 23 veckor och du får full lön under hela utbildningstiden. Utbildningen varvar teori och praktik. Under provanställningen genomförs löpande bedömningar för din möjlighet till tillsvidareanställning.\r\n\r\nKVALIFIKATIONER\nDina personliga egenskaper är viktiga. Som kriminalvårdare behöver du vara trygg, stabil, ha god självinsikt, gott omdöme och integritet. Tillsammans med dina kollegor driver du verksamheten, så du behöver ha god samarbetsförmåga och vara tydlig i din kommunikation. Du ska kunna agera fysiskt när det krävs.\n\nVi söker dig som har: \n•\tArbetslivserfarenhet, även i form av säsongsarbete, timanställning eller eget företagande. Praktik och volontärarbete är inte att jämställa med anställning.\n•\tFullständig gymnasieutbildning alternativt annan utbildning i kombination med arbetslivserfarenhet som KV bedömer relevant.\n•\tGoda kunskaper i svenska språket i både tal och skrift\n•\tGod datorvana\n•\tB-körkort för manuellt växlat fordon och körvana\n\nDet är meriterande om du har: \n•\tArbetslivserfarenhet från kriminalvård, säkerhetsarbete, social omsorg, psykiatri eller vård- och omsorgsarbete\n•\tKunskap inom relevanta områden, exempelvis beteendevetenskap, kriminologi psykiatri, juridik och konflikthantering\n•\tRelevanta språkkunskaper\r\n\nÖVRIGT\nVi ställer höga krav på våra medarbetares säkerhets- och sekretessmedvetande. Därför gör vi en säkerhetskontroll innan vi beslutar om du får anställning hos oss. Vissa tjänster är placerade i säkerhetsklass och då gör vi en säkerhetsprövning med registerkontroll innan vi fattar anställningsbeslut. För tjänster med högre säkerhetsklass behöver du vara svensk medborgare, men du får gärna ha utländsk bakgrund.\n\nI anställningen ingår en obligatorisk kriminalvårdsutbildning. Den kan komma att genomföras på annan ort. Kriminalvårdens verksamhet pågår dygnet runt, året runt. Det innebär att du kommer att arbeta dagar, kvällar och helger. Vissa scheman innebär arbete på nätter. \n\nTjänsten tillsätts under förutsättning att erforderliga beslut fattas.\n\nLäs mer om förutsättningar kring anställningsform här: https://www.kriminalvarden.se//jobba-hos-oss/yrkesroller/kriminalvardare/anstallningsform-kriminalvardsutbildning/   \n\nKriminalvården strävar efter en jämn köns- och åldersfördelning och ökad mångfald. \n\nFör att skicka in din ansökan, klicka på ansökningslänken i annonsen. Frågor om hur du ansöker och lägger in ditt CV ställer du direkt till Visma Recruit 0771- 693 693. Frågor om specifika jobb besvaras av den kontaktperson som anges i annonsen. Vi tar inte emot ansökningar i pappersform eller per e-post.\n\nVi undanber oss vänligen men bestämt direktkontakt med bemannings- och rekryteringsföretag och försäljare av rekryteringsannonser. Kriminalvården har upphandlade avtal."
}