{
  "meta" : {
    "jobad" : {
      "description" : {
        "requirements" : null,
        "needs" : null,
        "company_information" : null,
        "text_formatted" : "<p>Har du ett brinnande intresse för förnybar energi och projektledning? Vi erbjuder en intressant och spännande roll i en framtidsbransch. Vi befinner oss i en kraftig expansion och letar efter en Head of Operations som skall ansvara för den operativ avdelningen i hela Sverige samt bistå med hjälp och support vid större uppdrag.</p><p>SunRoof är ett internationellt företag som utvecklar och säljer 2-i-1 solcellstak, fasader och smarta energilösningar. Vår målsättning är att förse branschen med innovativa och förnybara produkter som har ett låg CO2 avtryck på miljön. Vi startade i Sverige 2013 men finns nu i ett flertal europeiska länder.</p><p><strong>Om jobbet</strong></p><p>Vi på Sunroof söker nu efter en Head of Operations som vill komma in ett nytänkande företag och göra skillnad. Tjänsten innebär att du har en nyckelroll i bolaget och får möjligheten att bygga vidare och utveckla vår operativa byggavdelning för installationer av solceller i Sverige. Du jobbar både operativt med en aktiv roll i våra installationsprojekt tillsammans med den strategiska och långsiktiga planeringen/arbetet gällande operations funktionen.  Du har det övergripande ansvaret för det dagliga operativa arbete vilket innebär att säkerställa att våra projekt utförs på ett säkert, kostnadseffektivt och planerat sätt för att hålla hög kvalitet och kundnöjdhet.Till din hjälp så har du hela vår operativa byggavdelning att tillgå, detta innebär därmed personalansvar för arbetschefer, projektledare, elektriker etc.  Tillsammans med dina area managers/arbetschefer så säkerställer du projektens planering, kvalitet och kostnadskontroll  och utöver det så ser ni tillsammans till att vi har ett bra nätverk av underentreprenörer och externa partners som bistår med hjälp av våra installationer.  Du rapporterar direkt in till vår VD.</p><p><br></p><p><strong>Arbetsuppgifter:</strong></p><ul><li>Etablera en operativ struktur och ansvara för all projektverksamhet i Sverige inom byggområdet.</li><li>Samordna, leda och hjälpa projektledarna, inköp och logistik i sin dagliga verksamhet</li><li>Coacha och motivera den operativa avdelningen</li><li>Att säkerställa kvalitén och lönsamhet på våra projekt för Sverige</li><li>Delta i större upphandlingar och inköp</li><li>Kontinuerligt arbeta med produktutveckling</li><li>Rekrytera inom sitt område</li><li>Övergripande ansvar för budget, kostnadskontroll och optimering</li><li>Vara operativt aktiv vid större installationer</li><li>Analys, uppföljning och arbete kring våra externa partners</li></ul><p><br></p><p><strong>Vi söker dig som har:</strong></p><ul><li>Ingenjörs eller byggteknisk utbildning</li><li>Min. 6-8 års arbetslivserfarenhet av projektledning som tex platschef, arbetschef etc</li><li>Erfarenhet av att hantera större byggprojekt, över 100 MSEK</li><li>Kunskap av bygg/projektbudget, schemaläggning och leverantörshantering från tidigare arbete</li><li>Förståelse för kontakt och avtal med underentreprenörer </li><li>Noggrann, kund/lösningsorienterad med ett gott affärssinne</li><li>Flytande svenska och goda engelska kunskaper både muntligt och skriftligt</li><li>Har ett B-körkort och möjlighet att vara ute på fältet</li><li>Erfarenhet från ledarroller inom byggbranschen med personalansvar för projektledare, arbetsledare, montörer etc.</li></ul><p><br></p><p><strong>Vi erbjuder:</strong></p><ul><li>Att bli en viktig pusselbit i vårt globala och multikulturella företag inom förnybar energi</li><li>En spännande arbetsplats där du har en möjlighet att påverka din egen vardag och framtid</li><li>En arbetsplats där vi tror på ett ömsesidigt förtroende, respekt och stöd. Våra anställda står i centrum.</li><li>Fast och marknadsmässig lön</li><li>Start: omgående</li></ul><p><br></p><p>Tycker du att beskrivningen passar bra in på dig? Då får du gärna söka då vi kommer tillsätta tjänsten så fort vi har hittat rätt kandidat.</p><p><br></p>",
        "conditions" : null,
        "text" : "Har du ett brinnande intresse för förnybar energi och projektledning? Vi erbjuder en intressant och spännande roll i en framtidsbransch. Vi befinner oss i en kraftig expansion och letar efter en Head of Operations som skall ansvara för den operativ avdelningen i hela Sverige samt bistå med hjälp och support vid större uppdrag.\nSunRoof är ett internationellt företag som utvecklar och säljer 2-i-1 solcellstak, fasader och smarta energilösningar. Vår målsättning är att förse branschen med innovativa och förnybara produkter som har ett låg CO2 avtryck på miljön. Vi startade i Sverige 2013 men finns nu i ett flertal europeiska länder.\nOm jobbet\nVi på Sunroof söker nu efter en Head of Operations som vill komma in ett nytänkande företag och göra skillnad. Tjänsten innebär att du har en nyckelroll i bolaget och får möjligheten att bygga vidare och utveckla vår operativa byggavdelning för installationer av solceller i Sverige. Du jobbar både operativt med en aktiv roll i våra installationsprojekt tillsammans med den strategiska och långsiktiga planeringen/arbetet gällande operations funktionen.  Du har det övergripande ansvaret för det dagliga operativa arbete vilket innebär att säkerställa att våra projekt utförs på ett säkert, kostnadseffektivt och planerat sätt för att hålla hög kvalitet och kundnöjdhet.Till din hjälp så har du hela vår operativa byggavdelning att tillgå, detta innebär därmed personalansvar för arbetschefer, projektledare, elektriker etc.  Tillsammans med dina area managers/arbetschefer så säkerställer du projektens planering, kvalitet och kostnadskontroll  och utöver det så ser ni tillsammans till att vi har ett bra nätverk av underentreprenörer och externa partners som bistår med hjälp av våra installationer.  Du rapporterar direkt in till vår VD.\n\n\nArbetsuppgifter:\nEtablera en operativ struktur och ansvara för all projektverksamhet i Sverige inom byggområdet.\nSamordna, leda och hjälpa projektledarna, inköp och logistik i sin dagliga verksamhet\nCoacha och motivera den operativa avdelningen\nAtt säkerställa kvalitén och lönsamhet på våra projekt för Sverige\nDelta i större upphandlingar och inköp\nKontinuerligt arbeta med produktutveckling\nRekrytera inom sitt område\nÖvergripande ansvar för budget, kostnadskontroll och optimering\nVara operativt aktiv vid större installationer\nAnalys, uppföljning och arbete kring våra externa partners\n\n\n\nVi söker dig som har:\nIngenjörs eller byggteknisk utbildning\nMin. 6-8 års arbetslivserfarenhet av projektledning som tex platschef, arbetschef etc\nErfarenhet av att hantera större byggprojekt, över 100 MSEK\nKunskap av bygg/projektbudget, schemaläggning och leverantörshantering från tidigare arbete\nFörståelse för kontakt och avtal med underentreprenörer \nNoggrann, kund/lösningsorienterad med ett gott affärssinne\nFlytande svenska och goda engelska kunskaper både muntligt och skriftligt\nHar ett B-körkort och möjlighet att vara ute på fältet\nErfarenhet från ledarroller inom byggbranschen med personalansvar för projektledare, arbetsledare, montörer etc.\n\n\n\nVi erbjuder:\nAtt bli en viktig pusselbit i vårt globala och multikulturella företag inom förnybar energi\nEn spännande arbetsplats där du har en möjlighet att påverka din egen vardag och framtid\nEn arbetsplats där vi tror på ett ömsesidigt förtroende, respekt och stöd. Våra anställda står i centrum.\nFast och marknadsmässig lön\nStart: omgående\n\n\n\nTycker du att beskrivningen passar bra in på dig? Då får du gärna söka då vi kommer tillsätta tjänsten så fort vi har hittat rätt kandidat."
      },
      "headline" : "Head of  Construction Operations Sverige",
      "driving_license" : [ {
        "concept_id" : "VTK8_WRx_GcM",
        "label" : "B",
        "legacy_ams_taxonomy_id" : "3"
      } ],
      "employer" : {
        "email" : null,
        "phone_number" : null,
        "organization_number" : "5568768716",
        "name" : "Sunroof Sverige AB",
        "url" : null,
        "workplace" : "Sunroof Sverige AB"
      },
      "removed_date" : null,
      "logo_url" : "https://www.arbetsformedlingen.se/rest/arbetsgivare/rest/af/v3/arbetsplatser/87387976/logotyper/logo.png",
      "last_publication_date" : "2022-08-20T23:59:59",
      "number_of_vacancies" : 1,
      "occupation" : {
        "concept_id" : "pTTz_5DC_itW",
        "label" : "Projektledare, bygg och anläggning",
        "legacy_ams_taxonomy_id" : "7649"
      },
      "occupation_group" : {
        "concept_id" : "XeBP_nMe_pXx",
        "label" : "Civilingenjörsyrken inom bygg och anläggning",
        "legacy_ams_taxonomy_id" : "2142"
      },
      "employment_type" : {
        "concept_id" : "PFZr_Syz_cUq",
        "label" : "Vanlig anställning",
        "legacy_ams_taxonomy_id" : "1"
      },
      "webpage_url" : "https://arbetsformedlingen.se/platsbanken/annonser/26345301",
      "driving_license_required" : true,
      "application_contacts" : [ ],
      "duration" : {
        "concept_id" : "a7uU_j21_mkL",
        "label" : "Tills vidare",
        "legacy_ams_taxonomy_id" : "1"
      },
      "nice_to_have" : {
        "education_level" : [ ],
        "work_experiences" : [ {
          "concept_id" : "pTTz_5DC_itW",
          "weight" : 5,
          "label" : "Projektledare, bygg och anläggning",
          "legacy_ams_taxonomy_id" : "7649"
        } ],
        "skills" : [ ],
        "education" : [ ],
        "languages" : [ ]
      },
      "application_details" : {
        "via_af" : false,
        "email" : null,
        "other" : null,
        "reference" : null,
        "url" : "https://system.erecruiter.pl/FormTemplates/RecruitmentForm.aspx?WebID=ea6c120b2011435a852462f71be3f9b6",
        "information" : null
      },
      "source_type" : "VIA_ANNONSERA",
      "application_deadline" : "2022-08-20T23:59:59",
      "external_id" : null,
      "workplace_address" : {
        "coordinates" : [ 18.008125798994023, 59.33651918986788 ],
        "city" : "STOCKHOLM",
        "postcode" : "11251",
        "municipality" : "Stockholm",
        "region_concept_id" : "CifL_Rzy_Mku",
        "region" : "Stockholms län",
        "country_code" : "199",
        "region_code" : "01",
        "municipality_concept_id" : "AvNB_uwa_6n6",
        "country_concept_id" : "i46j_HmG_v64",
        "municipality_code" : "0180",
        "street_address" : "Stockholm",
        "country" : "Sverige"
      },
      "id" : "26345301",
      "experience_required" : true,
      "working_hours_type" : {
        "concept_id" : "6YE1_gAC_R2G",
        "label" : "Heltid",
        "legacy_ams_taxonomy_id" : "1"
      },
      "access" : null,
      "timestamp" : 1658410225284,
      "must_have" : {
        "education_level" : [ ],
        "work_experiences" : [ ],
        "skills" : [ ],
        "education" : [ ],
        "languages" : [ ]
      },
      "occupation_field" : {
        "concept_id" : "j7Cq_ZJe_GkT",
        "label" : "Bygg och anläggning",
        "legacy_ams_taxonomy_id" : "2"
      },
      "scope_of_work" : {
        "min" : 0,
        "max" : 100
      },
      "salary_type" : {
        "concept_id" : "oG8G_9cW_nRf",
        "label" : "Fast månads- vecko- eller timlön",
        "legacy_ams_taxonomy_id" : "1"
      },
      "removed" : false,
      "salary_description" : null,
      "access_to_own_car" : true,
      "publication_date" : "2022-07-21T15:30:25"
    },
    "name" : "Head of  Construction Operations Sverige",
    "user" : "hannes"
  },
  "sha1" : "4c24e3dfe348fab6a86a7cc7dd17d7b8107a70d6",
  "annotations" : [ {
    "preferred-label" : "projektledning",
    "type" : "esco-skill",
    "start-position" : 95,
    "end-position" : 109,
    "concept-id" : "PPNS_ZLX_YsQ",
    "matched-string" : "projektledning",
    "annotation-id" : 7
  }, {
    "preferred-label" : "Sverige",
    "type" : "country",
    "start-position" : 309,
    "end-position" : 316,
    "concept-id" : "i46j_HmG_v64",
    "matched-string" : "Sverige",
    "annotation-id" : 8
  }, {
    "preferred-label" : "Sverige",
    "type" : "country",
    "start-position" : 620,
    "end-position" : 627,
    "concept-id" : "i46j_HmG_v64",
    "matched-string" : "Sverige",
    "annotation-id" : 9
  }, {
    "preferred-label" : "Personalansvar",
    "sentiment" : "MUST_HAVE",
    "type" : "skill",
    "start-position" : 1451,
    "end-position" : 1465,
    "concept-id" : "ZzN5_m7B_5CY",
    "matched-string" : "personalansvar",
    "annotation-id" : 0
  }, {
    "preferred-label" : "projektledare",
    "type" : "esco-occupation",
    "start-position" : 1484,
    "end-position" : 1497,
    "concept-id" : "nzMp_xN5_r6G",
    "matched-string" : "projektledare",
    "annotation-id" : 10
  }, {
    "preferred-label" : "Sverige",
    "type" : "country",
    "start-position" : 1921,
    "end-position" : 1928,
    "concept-id" : "i46j_HmG_v64",
    "matched-string" : "Sverige",
    "annotation-id" : 11
  }, {
    "preferred-label" : "projektledare",
    "type" : "esco-occupation",
    "start-position" : 1973,
    "end-position" : 1987,
    "concept-id" : "nzMp_xN5_r6G",
    "matched-string" : "projektledarna",
    "annotation-id" : 12
  }, {
    "preferred-label" : "Logistik",
    "sentiment" : "MUST_HAVE",
    "type" : "skill",
    "start-position" : 1999,
    "end-position" : 2007,
    "concept-id" : "yXmf_iKi_7ci",
    "matched-string" : "logistik",
    "annotation-id" : 1
  }, {
    "preferred-label" : "Sverige",
    "type" : "country",
    "start-position" : 2138,
    "end-position" : 2145,
    "concept-id" : "i46j_HmG_v64",
    "matched-string" : "Sverige",
    "annotation-id" : 13
  }, {
    "preferred-label" : "Produktutveckling",
    "sentiment" : "MUST_HAVE",
    "type" : "skill",
    "start-position" : 2210,
    "end-position" : 2227,
    "concept-id" : "uwev_L2n_fpz",
    "matched-string" : "produktutveckling",
    "annotation-id" : 2
  }, {
    "preferred-label" : "Högskoleingenjörsutbildning, byggteknik",
    "type" : "keyword",
    "start-position" : 2450,
    "end-position" : 2488,
    "concept-id" : "sP52_Lyv_71S",
    "matched-string" : "Ingenjörs eller byggteknisk utbildning",
    "annotation-id" : 14
  }, {
    "preferred-label" : "projektledare",
    "type" : "esco-occupation",
    "start-position" : 2526,
    "end-position" : 2540,
    "concept-id" : "nzMp_xN5_r6G",
    "matched-string" : "projektledning",
    "annotation-id" : 15
  }, {
    "preferred-label" : "platschef",
    "type" : "esco-occupation",
    "start-position" : 2549,
    "end-position" : 2558,
    "concept-id" : "7ffE_ZTJ_Mix",
    "matched-string" : "platschef",
    "annotation-id" : 16
  }, {
    "preferred-label" : "schemalägga produktion",
    "type" : "esco-skill",
    "start-position" : 2666,
    "end-position" : 2680,
    "concept-id" : "JbaZ_tPj_uiD",
    "matched-string" : "schemaläggning",
    "annotation-id" : 17
  }, {
    "preferred-label" : "noggrannhet",
    "type" : "esco-skill",
    "start-position" : 2784,
    "end-position" : 2792,
    "concept-id" : "mrsW_EkL_KRD",
    "matched-string" : "Noggrann",
    "annotation-id" : 18
  }, {
    "preferred-label" : "Svenska",
    "sentiment" : "MUST_HAVE",
    "type" : "language",
    "start-position" : 2852,
    "end-position" : 2859,
    "concept-id" : "zSLA_vw2_FXN",
    "matched-string" : "svenska",
    "annotation-id" : 3
  }, {
    "preferred-label" : "Engelska",
    "sentiment" : "MUST_HAVE",
    "type" : "language",
    "start-position" : 2869,
    "end-position" : 2877,
    "concept-id" : "NVxJ_hLg_TYS",
    "matched-string" : "engelska",
    "annotation-id" : 4
  }, {
    "preferred-label" : "B",
    "type" : "driving-licence",
    "start-position" : 2925,
    "end-position" : 2934,
    "concept-id" : "VTK8_WRx_GcM",
    "matched-string" : "B-körkort",
    "annotation-id" : 19
  }, {
    "preferred-label" : "byggbranschen",
    "type" : "esco-skill",
    "start-position" : 3005,
    "end-position" : 3018,
    "concept-id" : "Dq3z_72P_8Zy",
    "matched-string" : "byggbranschen",
    "annotation-id" : 20
  }, {
    "preferred-label" : "Personalansvar",
    "sentiment" : "MUST_HAVE",
    "type" : "skill",
    "start-position" : 3023,
    "end-position" : 3037,
    "concept-id" : "ZzN5_m7B_5CY",
    "matched-string" : "personalansvar",
    "annotation-id" : 5
  }, {
    "preferred-label" : "projektledare",
    "type" : "esco-occupation",
    "start-position" : 3042,
    "end-position" : 3055,
    "concept-id" : "nzMp_xN5_r6G",
    "matched-string" : "projektledare",
    "annotation-id" : 21
  }, {
    "preferred-label" : "Montörer",
    "sentiment" : "MUST_HAVE",
    "type" : "ssyk-level-3",
    "start-position" : 3071,
    "end-position" : 3079,
    "concept-id" : "Wz8B_WeK_vUB",
    "matched-string" : "montörer",
    "annotation-id" : 6
  } ],
  "text" : "Head of  Construction Operations Sverige\nHar du ett brinnande intresse för förnybar energi och projektledning? Vi erbjuder en intressant och spännande roll i en framtidsbransch. Vi befinner oss i en kraftig expansion och letar efter en Head of Operations som skall ansvara för den operativ avdelningen i hela Sverige samt bistå med hjälp och support vid större uppdrag.\nSunRoof är ett internationellt företag som utvecklar och säljer 2-i-1 solcellstak, fasader och smarta energilösningar. Vår målsättning är att förse branschen med innovativa och förnybara produkter som har ett låg CO2 avtryck på miljön. Vi startade i Sverige 2013 men finns nu i ett flertal europeiska länder.\nOm jobbet\nVi på Sunroof söker nu efter en Head of Operations som vill komma in ett nytänkande företag och göra skillnad. Tjänsten innebär att du har en nyckelroll i bolaget och får möjligheten att bygga vidare och utveckla vår operativa byggavdelning för installationer av solceller i Sverige. Du jobbar både operativt med en aktiv roll i våra installationsprojekt tillsammans med den strategiska och långsiktiga planeringen/arbetet gällande operations funktionen.  Du har det övergripande ansvaret för det dagliga operativa arbete vilket innebär att säkerställa att våra projekt utförs på ett säkert, kostnadseffektivt och planerat sätt för att hålla hög kvalitet och kundnöjdhet.Till din hjälp så har du hela vår operativa byggavdelning att tillgå, detta innebär därmed personalansvar för arbetschefer, projektledare, elektriker etc.  Tillsammans med dina area managers/arbetschefer så säkerställer du projektens planering, kvalitet och kostnadskontroll  och utöver det så ser ni tillsammans till att vi har ett bra nätverk av underentreprenörer och externa partners som bistår med hjälp av våra installationer.  Du rapporterar direkt in till vår VD.\n\n\nArbetsuppgifter:\nEtablera en operativ struktur och ansvara för all projektverksamhet i Sverige inom byggområdet.\nSamordna, leda och hjälpa projektledarna, inköp och logistik i sin dagliga verksamhet\nCoacha och motivera den operativa avdelningen\nAtt säkerställa kvalitén och lönsamhet på våra projekt för Sverige\nDelta i större upphandlingar och inköp\nKontinuerligt arbeta med produktutveckling\nRekrytera inom sitt område\nÖvergripande ansvar för budget, kostnadskontroll och optimering\nVara operativt aktiv vid större installationer\nAnalys, uppföljning och arbete kring våra externa partners\n\n\n\nVi söker dig som har:\nIngenjörs eller byggteknisk utbildning\nMin. 6-8 års arbetslivserfarenhet av projektledning som tex platschef, arbetschef etc\nErfarenhet av att hantera större byggprojekt, över 100 MSEK\nKunskap av bygg/projektbudget, schemaläggning och leverantörshantering från tidigare arbete\nFörståelse för kontakt och avtal med underentreprenörer \nNoggrann, kund/lösningsorienterad med ett gott affärssinne\nFlytande svenska och goda engelska kunskaper både muntligt och skriftligt\nHar ett B-körkort och möjlighet att vara ute på fältet\nErfarenhet från ledarroller inom byggbranschen med personalansvar för projektledare, arbetsledare, montörer etc.\n\n\n\nVi erbjuder:\nAtt bli en viktig pusselbit i vårt globala och multikulturella företag inom förnybar energi\nEn spännande arbetsplats där du har en möjlighet att påverka din egen vardag och framtid\nEn arbetsplats där vi tror på ett ömsesidigt förtroende, respekt och stöd. Våra anställda står i centrum.\nFast och marknadsmässig lön\nStart: omgående\n\n\n\nTycker du att beskrivningen passar bra in på dig? Då får du gärna söka då vi kommer tillsätta tjänsten så fort vi har hittat rätt kandidat."
}