{
  "meta" : {
    "description" : "",
    "name" : "",
    "type" : "",
    "" : ""
  },
  "sha1" : "37aee2cfc62ab2ef4b0ed12557f8e537b2fe3b5c",
  "annotations" : [ {
    "preferred-label" : "Tandsköterska",
    "type" : "occupation-name",
    "start-position" : 66,
    "end-position" : 79,
    "concept-id" : "ckkD_JhH_Sc6",
    "matched-string" : "tandsköterska",
    "annotation-id" : 0
  }, {
    "preferred-label" : "Tandsköterska",
    "type" : "occupation-name",
    "start-position" : 318,
    "end-position" : 331,
    "concept-id" : "ckkD_JhH_Sc6",
    "matched-string" : "tandsköterska",
    "annotation-id" : 1
  }, {
    "preferred-label" : "Hälsa",
    "type" : "keyword",
    "start-position" : 1395,
    "end-position" : 1400,
    "concept-id" : "Abys_5p1_Cnq",
    "matched-string" : "hälsa",
    "annotation-id" : 2
  }, {
    "preferred-label" : "Tandsköterska",
    "type" : "occupation-name",
    "start-position" : 1562,
    "end-position" : 1575,
    "concept-id" : "ckkD_JhH_Sc6",
    "matched-string" : "tandsköterska",
    "annotation-id" : 3
  }, {
    "preferred-label" : "Kvalitetssäkring",
    "type" : "skill",
    "start-position" : 1980,
    "end-position" : 1996,
    "concept-id" : "a1Sf_mey_gVk",
    "matched-string" : "kvalitetssäkring",
    "annotation-id" : 4
  }, {
    "preferred-label" : "Svenska",
    "type" : "language",
    "start-position" : 2103,
    "end-position" : 2110,
    "concept-id" : "zSLA_vw2_FXN",
    "matched-string" : "svenska",
    "annotation-id" : 5
  }, {
    "preferred-label" : "Främmande språk",
    "type" : "sun-education-field-3",
    "start-position" : 2130,
    "end-position" : 2145,
    "concept-id" : "BRYn_VA6_KHJ",
    "matched-string" : "främmande språk",
    "annotation-id" : 6
  }, {
    "preferred-label" : "Tandsköterska",
    "type" : "occupation-name",
    "start-position" : 2590,
    "end-position" : 2603,
    "concept-id" : "ckkD_JhH_Sc6",
    "matched-string" : "tandsköterska",
    "annotation-id" : 7
  }, {
    "preferred-label" : "Engelska",
    "type" : "sun-education-field-4",
    "start-position" : 3301,
    "end-position" : 3309,
    "concept-id" : "wC9s_urg_8jY",
    "matched-string" : "engelska",
    "annotation-id" : 8
  }, {
    "preferred-label" : "Engelska",
    "type" : "sun-education-field-4",
    "start-position" : 3357,
    "end-position" : 3365,
    "concept-id" : "wC9s_urg_8jY",
    "matched-string" : "engelska",
    "annotation-id" : 9
  }, {
    "preferred-label" : "Främmande språk",
    "type" : "sun-education-field-3",
    "start-position" : 3565,
    "end-position" : 3580,
    "concept-id" : "BRYn_VA6_KHJ",
    "matched-string" : "främmande språk",
    "annotation-id" : 10
  }, {
    "preferred-label" : "Engelska",
    "type" : "sun-education-field-4",
    "start-position" : 3634,
    "end-position" : 3642,
    "concept-id" : "wC9s_urg_8jY",
    "matched-string" : "engelska",
    "annotation-id" : 11
  }, {
    "preferred-label" : "Engelska",
    "type" : "sun-education-field-4",
    "start-position" : 3703,
    "end-position" : 3711,
    "concept-id" : "wC9s_urg_8jY",
    "matched-string" : "engelska",
    "annotation-id" : 12
  }, {
    "preferred-label" : "Svenska",
    "type" : "language",
    "start-position" : 3788,
    "end-position" : 3795,
    "concept-id" : "zSLA_vw2_FXN",
    "matched-string" : "svenska",
    "annotation-id" : 13
  }, {
    "preferred-label" : "Tandvård",
    "type" : "keyword",
    "start-position" : 3870,
    "end-position" : 3878,
    "concept-id" : "ba6n_RTw_PEr",
    "matched-string" : "tandvård",
    "annotation-id" : 14
  }, {
    "preferred-label" : "Farmakologi",
    "type" : "skill",
    "start-position" : 4355,
    "end-position" : 4366,
    "concept-id" : "xxeG_XxB_sqG",
    "matched-string" : "farmakologi",
    "annotation-id" : 15
  }, {
    "preferred-label" : "Tandhygienist",
    "type" : "occupation-name",
    "start-position" : 4564,
    "comment" : ".",
    "end-position" : 4574,
    "concept-id" : "TPRY_Wze_q6x",
    "matched-string" : "Oral hälsa",
    "annotation-id" : 119
  }, {
    "preferred-label" : "Hälsa",
    "type" : "keyword",
    "start-position" : 4585,
    "end-position" : 4590,
    "concept-id" : "Abys_5p1_Cnq",
    "matched-string" : "hälsa",
    "annotation-id" : 17
  }, {
    "preferred-label" : "Smittskydd",
    "type" : "skill",
    "start-position" : 4627,
    "end-position" : 4637,
    "concept-id" : "UbGZ_9pL_wwW",
    "matched-string" : "smittskydd",
    "annotation-id" : 18
  }, {
    "preferred-label" : "Ekonomi",
    "type" : "keyword",
    "start-position" : 5158,
    "end-position" : 5165,
    "concept-id" : "PW4f_bmT_new",
    "matched-string" : "ekonomi",
    "annotation-id" : 19
  }, {
    "preferred-label" : "Svenska",
    "type" : "language",
    "start-position" : 5342,
    "end-position" : 5349,
    "concept-id" : "zSLA_vw2_FXN",
    "matched-string" : "svenska",
    "annotation-id" : 20
  }, {
    "preferred-label" : "Främmande språk",
    "type" : "sun-education-field-3",
    "start-position" : 5368,
    "end-position" : 5383,
    "concept-id" : "BRYn_VA6_KHJ",
    "matched-string" : "främmande språk",
    "annotation-id" : 21
  }, {
    "preferred-label" : "Engelska",
    "type" : "sun-education-field-4",
    "start-position" : 5386,
    "end-position" : 5394,
    "concept-id" : "wC9s_urg_8jY",
    "matched-string" : "engelska",
    "annotation-id" : 22
  }, {
    "preferred-label" : "Ekonomi",
    "type" : "keyword",
    "start-position" : 5843,
    "end-position" : 5850,
    "concept-id" : "PW4f_bmT_new",
    "matched-string" : "ekonomi",
    "annotation-id" : 23
  }, {
    "preferred-label" : "Svenska",
    "type" : "language",
    "start-position" : 6182,
    "end-position" : 6189,
    "concept-id" : "zSLA_vw2_FXN",
    "matched-string" : "svenska",
    "annotation-id" : 24
  }, {
    "preferred-label" : "Främmande språk",
    "type" : "sun-education-field-3",
    "start-position" : 6211,
    "end-position" : 6226,
    "concept-id" : "BRYn_VA6_KHJ",
    "matched-string" : "främmande språk",
    "annotation-id" : 25
  }, {
    "preferred-label" : "Farmakologi",
    "type" : "skill",
    "start-position" : 6322,
    "end-position" : 6333,
    "concept-id" : "xxeG_XxB_sqG",
    "matched-string" : "farmakologi",
    "annotation-id" : 26
  }, {
    "preferred-label" : "Farmakologi",
    "type" : "skill",
    "start-position" : 6468,
    "end-position" : 6479,
    "concept-id" : "xxeG_XxB_sqG",
    "matched-string" : "farmakologi",
    "annotation-id" : 27
  }, {
    "preferred-label" : "Tandvård",
    "type" : "keyword",
    "start-position" : 6499,
    "end-position" : 6507,
    "concept-id" : "ba6n_RTw_PEr",
    "matched-string" : "tandvård",
    "annotation-id" : 28
  }, {
    "preferred-label" : "Hälsa",
    "type" : "keyword",
    "start-position" : 6517,
    "end-position" : 6522,
    "concept-id" : "Abys_5p1_Cnq",
    "matched-string" : "hälsa",
    "annotation-id" : 29
  }, {
    "preferred-label" : "Tandsköterska",
    "type" : "occupation-name",
    "start-position" : 7190,
    "end-position" : 7211,
    "concept-id" : "ckkD_JhH_Sc6",
    "matched-string" : "kunskaper om munhålan",
    "annotation-id" : 121
  }, {
    "preferred-label" : "Tandsköterska",
    "type" : "occupation-name",
    "start-position" : 7364,
    "end-position" : 7404,
    "concept-id" : "ckkD_JhH_Sc6",
    "matched-string" : "kunskaper om tecken på sjukdomstillstånd",
    "annotation-id" : 120
  }, {
    "preferred-label" : "Tandsköterska",
    "type" : "occupation-name",
    "start-position" : 8756,
    "end-position" : 8784,
    "concept-id" : "ckkD_JhH_Sc6",
    "matched-string" : "klinik- och instrumenthygien",
    "annotation-id" : 122
  }, {
    "preferred-label" : "Tandsköterska",
    "type" : "occupation-name",
    "start-position" : 10214,
    "end-position" : 10227,
    "concept-id" : "ckkD_JhH_Sc6",
    "matched-string" : "tandsköterska",
    "annotation-id" : 30
  }, {
    "preferred-label" : "Tandsköterska",
    "type" : "occupation-name",
    "start-position" : 11414,
    "end-position" : 11427,
    "concept-id" : "ckkD_JhH_Sc6",
    "matched-string" : "tandsköterska",
    "annotation-id" : 31
  }, {
    "preferred-label" : "Tandsköterska",
    "type" : "occupation-name",
    "start-position" : 11509,
    "end-position" : 11522,
    "concept-id" : "ckkD_JhH_Sc6",
    "matched-string" : "tandsköterska",
    "annotation-id" : 32
  }, {
    "preferred-label" : "Miljöfrågor",
    "type" : "skill",
    "start-position" : 11838,
    "end-position" : 11849,
    "concept-id" : "wLYv_Pyd_uSZ",
    "matched-string" : "miljöfrågor",
    "annotation-id" : 33
  }, {
    "preferred-label" : "Systematiskt arbetsmiljöarbete",
    "type" : "skill",
    "start-position" : 11854,
    "end-position" : 11884,
    "concept-id" : "QaW1_QPc_BXF",
    "matched-string" : "systematiskt arbetsmiljöarbete",
    "annotation-id" : 34
  }, {
    "preferred-label" : "Instrument",
    "type" : "skill-headline",
    "start-position" : 11949,
    "end-position" : 11959,
    "concept-id" : "wLYs_CKS_wK8",
    "matched-string" : "instrument",
    "annotation-id" : 35
  }, {
    "preferred-label" : "Systematiskt arbetsmiljöarbete",
    "type" : "skill",
    "start-position" : 12275,
    "end-position" : 12305,
    "concept-id" : "QaW1_QPc_BXF",
    "matched-string" : "systematiskt arbetsmiljöarbete",
    "annotation-id" : 36
  }, {
    "preferred-label" : "Ergonomi",
    "type" : "skill",
    "start-position" : 12432,
    "end-position" : 12440,
    "concept-id" : "Qecp_WbB_vyj",
    "matched-string" : "ergonomi",
    "annotation-id" : 37
  }, {
    "preferred-label" : "Instrument",
    "type" : "skill-headline",
    "start-position" : 12602,
    "end-position" : 12612,
    "concept-id" : "wLYs_CKS_wK8",
    "matched-string" : "instrument",
    "annotation-id" : 38
  }, {
    "preferred-label" : "Avfall",
    "type" : "keyword",
    "start-position" : 12664,
    "end-position" : 12670,
    "concept-id" : "Kx4Q_7TA_MuR",
    "matched-string" : "avfall",
    "annotation-id" : 39
  }, {
    "preferred-label" : "Ergonomi",
    "type" : "skill",
    "start-position" : 12744,
    "end-position" : 12752,
    "concept-id" : "Qecp_WbB_vyj",
    "matched-string" : "ergonomi",
    "annotation-id" : 40
  }, {
    "preferred-label" : "Tandsköterska",
    "type" : "occupation-name",
    "start-position" : 13593,
    "end-position" : 13606,
    "concept-id" : "ckkD_JhH_Sc6",
    "matched-string" : "tandsköterska",
    "annotation-id" : 41
  }, {
    "preferred-label" : "Tandsköterska",
    "type" : "occupation-name",
    "start-position" : 13756,
    "end-position" : 13769,
    "concept-id" : "ckkD_JhH_Sc6",
    "matched-string" : "tandsköterska",
    "annotation-id" : 42
  }, {
    "preferred-label" : "Instrument",
    "type" : "skill-headline",
    "start-position" : 14497,
    "end-position" : 14507,
    "concept-id" : "wLYs_CKS_wK8",
    "matched-string" : "instrument",
    "annotation-id" : 43
  }, {
    "preferred-label" : "Instrument",
    "type" : "skill-headline",
    "start-position" : 14573,
    "end-position" : 14583,
    "concept-id" : "wLYs_CKS_wK8",
    "matched-string" : "instrument",
    "annotation-id" : 44
  }, {
    "preferred-label" : "Instrument",
    "type" : "skill-headline",
    "start-position" : 14710,
    "end-position" : 14720,
    "concept-id" : "wLYs_CKS_wK8",
    "matched-string" : "instrument",
    "annotation-id" : 45
  }, {
    "preferred-label" : "Bettfysiologi",
    "type" : "skill",
    "start-position" : 15122,
    "end-position" : 15135,
    "concept-id" : "c6Gm_H7X_DGT",
    "matched-string" : "bettfysiologi",
    "annotation-id" : 46
  }, {
    "preferred-label" : "Träning",
    "type" : "keyword",
    "start-position" : 15515,
    "end-position" : 15522,
    "concept-id" : "n19Z_hzx_Apu",
    "matched-string" : "träning",
    "annotation-id" : 47
  }, {
    "preferred-label" : "Instrument",
    "type" : "skill-headline",
    "start-position" : 15837,
    "end-position" : 15847,
    "concept-id" : "wLYs_CKS_wK8",
    "matched-string" : "instrument",
    "annotation-id" : 48
  }, {
    "preferred-label" : "Instrument",
    "type" : "skill-headline",
    "start-position" : 15987,
    "end-position" : 15997,
    "concept-id" : "wLYs_CKS_wK8",
    "matched-string" : "instrument",
    "annotation-id" : 49
  }, {
    "preferred-label" : "Instrument",
    "type" : "skill-headline",
    "start-position" : 16367,
    "end-position" : 16377,
    "concept-id" : "wLYs_CKS_wK8",
    "matched-string" : "instrument",
    "annotation-id" : 50
  }, {
    "preferred-label" : "Hälsa",
    "type" : "keyword",
    "start-position" : 16439,
    "end-position" : 16444,
    "concept-id" : "Abys_5p1_Cnq",
    "matched-string" : "hälsa",
    "annotation-id" : 51
  }, {
    "preferred-label" : "Hälsa",
    "type" : "keyword",
    "start-position" : 16550,
    "end-position" : 16555,
    "concept-id" : "Abys_5p1_Cnq",
    "matched-string" : "hälsa",
    "annotation-id" : 52
  }, {
    "preferred-label" : "Kost",
    "type" : "keyword",
    "start-position" : 16578,
    "end-position" : 16582,
    "concept-id" : "jFWZ_tkT_QRk",
    "matched-string" : "kost",
    "annotation-id" : 53
  }, {
    "preferred-label" : "Hälsa",
    "type" : "keyword",
    "start-position" : 16602,
    "end-position" : 16607,
    "concept-id" : "Abys_5p1_Cnq",
    "matched-string" : "hälsa",
    "annotation-id" : 54
  }, {
    "preferred-label" : "Hälsa",
    "type" : "keyword",
    "start-position" : 16687,
    "end-position" : 16692,
    "concept-id" : "Abys_5p1_Cnq",
    "matched-string" : "hälsa",
    "annotation-id" : 55
  }, {
    "preferred-label" : "Hälsa",
    "type" : "keyword",
    "start-position" : 17099,
    "end-position" : 17104,
    "concept-id" : "Abys_5p1_Cnq",
    "matched-string" : "hälsa",
    "annotation-id" : 56
  }, {
    "preferred-label" : "Statistik",
    "type" : "sun-education-field-3",
    "start-position" : 17185,
    "end-position" : 17194,
    "concept-id" : "VDZC_YeP_k1P",
    "matched-string" : "statistik",
    "annotation-id" : 57
  }, {
    "preferred-label" : "Hälsa",
    "type" : "keyword",
    "start-position" : 17480,
    "end-position" : 17485,
    "concept-id" : "Abys_5p1_Cnq",
    "matched-string" : "hälsa",
    "annotation-id" : 58
  }, {
    "preferred-label" : "Hälsa",
    "type" : "keyword",
    "start-position" : 17591,
    "end-position" : 17596,
    "concept-id" : "Abys_5p1_Cnq",
    "matched-string" : "hälsa",
    "annotation-id" : 59
  }, {
    "preferred-label" : "Tandvård",
    "type" : "keyword",
    "start-position" : 17650,
    "end-position" : 17658,
    "concept-id" : "ba6n_RTw_PEr",
    "matched-string" : "tandvård",
    "annotation-id" : 60
  }, {
    "preferred-label" : "Psykologi",
    "type" : "sun-education-field-3",
    "start-position" : 17704,
    "end-position" : 17713,
    "concept-id" : "smP1_JHS_9yu",
    "matched-string" : "psykologi",
    "annotation-id" : 61
  }, {
    "preferred-label" : "Tandvård",
    "type" : "keyword",
    "start-position" : 17811,
    "end-position" : 17819,
    "concept-id" : "ba6n_RTw_PEr",
    "matched-string" : "tandvård",
    "annotation-id" : 62
  }, {
    "preferred-label" : "Psykologi",
    "type" : "sun-education-field-3",
    "start-position" : 18168,
    "end-position" : 18177,
    "concept-id" : "smP1_JHS_9yu",
    "matched-string" : "psykologi",
    "annotation-id" : 63
  }, {
    "preferred-label" : "Medicinsk vård",
    "type" : "skill",
    "start-position" : 18261,
    "end-position" : 18275,
    "concept-id" : "Wt25_oqX_S1J",
    "matched-string" : "medicinsk vård",
    "annotation-id" : 64
  }, {
    "preferred-label" : "Tandvård",
    "type" : "keyword",
    "start-position" : 18567,
    "end-position" : 18575,
    "concept-id" : "ba6n_RTw_PEr",
    "matched-string" : "tandvård",
    "annotation-id" : 65
  }, {
    "preferred-label" : "Svenska",
    "type" : "language",
    "start-position" : 18617,
    "end-position" : 18624,
    "concept-id" : "zSLA_vw2_FXN",
    "matched-string" : "svenska",
    "annotation-id" : 66
  }, {
    "preferred-label" : "Främmande språk",
    "type" : "sun-education-field-3",
    "start-position" : 18643,
    "end-position" : 18658,
    "concept-id" : "BRYn_VA6_KHJ",
    "matched-string" : "främmande språk",
    "annotation-id" : 67
  }, {
    "preferred-label" : "Tandsköterska",
    "type" : "occupation-name",
    "start-position" : 18963,
    "end-position" : 18976,
    "concept-id" : "ckkD_JhH_Sc6",
    "matched-string" : "tandsköterska",
    "annotation-id" : 68
  }, {
    "preferred-label" : "Smittskydd",
    "type" : "skill",
    "start-position" : 19737,
    "end-position" : 19747,
    "concept-id" : "UbGZ_9pL_wwW",
    "matched-string" : "smittskydd",
    "annotation-id" : 69
  }, {
    "preferred-label" : "Smittskydd",
    "type" : "skill",
    "start-position" : 19883,
    "end-position" : 19893,
    "concept-id" : "UbGZ_9pL_wwW",
    "matched-string" : "smittskydd",
    "annotation-id" : 70
  }, {
    "preferred-label" : "Infektionssjukdomar",
    "type" : "skill",
    "start-position" : 20158,
    "end-position" : 20177,
    "concept-id" : "1FrM_h3A_mLq",
    "matched-string" : "infektionssjukdomar",
    "annotation-id" : 71
  }, {
    "preferred-label" : "Smittskydd",
    "type" : "skill",
    "start-position" : 20507,
    "end-position" : 20517,
    "concept-id" : "UbGZ_9pL_wwW",
    "matched-string" : "smittskydd",
    "annotation-id" : 72
  }, {
    "preferred-label" : "Eftergymnasial utbildning",
    "type" : "sni-level-3",
    "start-position" : 21680,
    "end-position" : 21705,
    "concept-id" : "bg6r_KVf_KNN",
    "matched-string" : "eftergymnasial utbildning",
    "annotation-id" : 73
  }, {
    "preferred-label" : "Personal",
    "type" : "keyword",
    "start-position" : 22474,
    "end-position" : 22482,
    "concept-id" : "HVxM_6MS_y1c",
    "matched-string" : "personal",
    "annotation-id" : 74
  }, {
    "preferred-label" : "Svenska",
    "type" : "language",
    "start-position" : 23018,
    "end-position" : 23025,
    "concept-id" : "zSLA_vw2_FXN",
    "matched-string" : "svenska",
    "annotation-id" : 75
  }, {
    "preferred-label" : "Svenska",
    "type" : "language",
    "start-position" : 23096,
    "end-position" : 23103,
    "concept-id" : "zSLA_vw2_FXN",
    "matched-string" : "svenska",
    "annotation-id" : 76
  }, {
    "preferred-label" : "Svenska",
    "type" : "language",
    "start-position" : 23449,
    "end-position" : 23456,
    "concept-id" : "zSLA_vw2_FXN",
    "matched-string" : "svenska",
    "annotation-id" : 77
  }, {
    "preferred-label" : "Svenska",
    "type" : "language",
    "start-position" : 25453,
    "end-position" : 25460,
    "concept-id" : "zSLA_vw2_FXN",
    "matched-string" : "svenska",
    "annotation-id" : 78
  }, {
    "preferred-label" : "Svenska",
    "type" : "language",
    "start-position" : 25465,
    "end-position" : 25472,
    "concept-id" : "zSLA_vw2_FXN",
    "matched-string" : "svenska",
    "annotation-id" : 79
  }, {
    "preferred-label" : "Engelska",
    "type" : "sun-education-field-4",
    "start-position" : 25547,
    "end-position" : 25555,
    "concept-id" : "wC9s_urg_8jY",
    "matched-string" : "engelska",
    "annotation-id" : 80
  }, {
    "preferred-label" : "Matematik",
    "type" : "sun-education-field-4",
    "start-position" : 25599,
    "end-position" : 25608,
    "concept-id" : "qKRX_KkP_ayX",
    "matched-string" : "matematik",
    "annotation-id" : 81
  }, {
    "preferred-label" : "Svenska",
    "type" : "language",
    "start-position" : 25723,
    "end-position" : 25730,
    "concept-id" : "zSLA_vw2_FXN",
    "matched-string" : "svenska",
    "annotation-id" : 82
  }, {
    "preferred-label" : "Svenska",
    "type" : "language",
    "start-position" : 25736,
    "end-position" : 25743,
    "concept-id" : "zSLA_vw2_FXN",
    "matched-string" : "svenska",
    "annotation-id" : 83
  }, {
    "preferred-label" : "Engelska",
    "type" : "sun-education-field-4",
    "start-position" : 25941,
    "end-position" : 25949,
    "concept-id" : "wC9s_urg_8jY",
    "matched-string" : "engelska",
    "annotation-id" : 84
  }, {
    "preferred-label" : "Engelska",
    "type" : "sun-education-field-4",
    "start-position" : 25955,
    "end-position" : 25963,
    "concept-id" : "wC9s_urg_8jY",
    "matched-string" : "engelska",
    "annotation-id" : 85
  }, {
    "preferred-label" : "Dental",
    "type" : "keyword",
    "start-position" : 26058,
    "end-position" : 26064,
    "concept-id" : "o83B_XFM_uqZ",
    "matched-string" : "dental",
    "annotation-id" : 86
  }, {
    "preferred-label" : "Engelska",
    "type" : "sun-education-field-4",
    "start-position" : 26108,
    "end-position" : 26116,
    "concept-id" : "wC9s_urg_8jY",
    "matched-string" : "engelska",
    "annotation-id" : 87
  }, {
    "preferred-label" : "Lantbruk, trädgård, skog och fiske, övrig/ospec utbildning",
    "type" : "sun-education-field-3",
    "start-position" : 26118,
    "end-position" : 26127,
    "concept-id" : "9gGq_Dzs_KHG",
    "matched-string" : "matematik",
    "annotation-id" : 88
  }, {
    "preferred-label" : "Studie- och yrkesvägledare",
    "type" : "ssyk-level-4",
    "start-position" : 27063,
    "end-position" : 27089,
    "concept-id" : "jJF3_qaQ_Zsh",
    "matched-string" : "studie- och yrkesvägledare",
    "annotation-id" : 89
  }, {
    "preferred-label" : "Studie- och yrkesvägledare",
    "type" : "ssyk-level-4",
    "start-position" : 27422,
    "end-position" : 27448,
    "concept-id" : "jJF3_qaQ_Zsh",
    "matched-string" : "studie- och yrkesvägledare",
    "annotation-id" : 90
  }, {
    "preferred-label" : "Webb",
    "type" : "skill",
    "start-position" : 27628,
    "end-position" : 27632,
    "concept-id" : "KKQV_aGF_bWq",
    "matched-string" : "webb",
    "annotation-id" : 91
  }, {
    "preferred-label" : "Studie- och yrkesvägledare",
    "type" : "ssyk-level-4",
    "start-position" : 27921,
    "end-position" : 27947,
    "concept-id" : "jJF3_qaQ_Zsh",
    "matched-string" : "studie- och yrkesvägledare",
    "annotation-id" : 92
  }, {
    "preferred-label" : "Engelska",
    "type" : "sun-education-field-4",
    "start-position" : 28378,
    "end-position" : 28386,
    "concept-id" : "wC9s_urg_8jY",
    "matched-string" : "engelska",
    "annotation-id" : 93
  }, {
    "preferred-label" : "Matematik",
    "type" : "sun-education-field-4",
    "start-position" : 28388,
    "end-position" : 28397,
    "concept-id" : "qKRX_KkP_ayX",
    "matched-string" : "matematik",
    "annotation-id" : 94
  }, {
    "preferred-label" : "Svenska",
    "type" : "language",
    "start-position" : 28403,
    "end-position" : 28410,
    "concept-id" : "zSLA_vw2_FXN",
    "matched-string" : "svenska",
    "annotation-id" : 95
  }, {
    "preferred-label" : "Personal",
    "type" : "keyword",
    "start-position" : 29556,
    "end-position" : 29564,
    "concept-id" : "HVxM_6MS_y1c",
    "matched-string" : "personal",
    "annotation-id" : 96
  }, {
    "preferred-label" : "Studie- och yrkesvägledare",
    "type" : "ssyk-level-4",
    "start-position" : 29944,
    "end-position" : 29970,
    "concept-id" : "jJF3_qaQ_Zsh",
    "matched-string" : "studie- och yrkesvägledare",
    "annotation-id" : 97
  }, {
    "preferred-label" : "Svenska",
    "type" : "language",
    "start-position" : 30299,
    "end-position" : 30306,
    "concept-id" : "zSLA_vw2_FXN",
    "matched-string" : "svenska",
    "annotation-id" : 98
  }, {
    "preferred-label" : "Engelska",
    "type" : "sun-education-field-4",
    "start-position" : 30310,
    "end-position" : 30318,
    "concept-id" : "wC9s_urg_8jY",
    "matched-string" : "engelska",
    "annotation-id" : 99
  }, {
    "preferred-label" : "Matematik",
    "type" : "sun-education-field-4",
    "start-position" : 30325,
    "end-position" : 30334,
    "concept-id" : "qKRX_KkP_ayX",
    "matched-string" : "matematik",
    "annotation-id" : 100
  }, {
    "preferred-label" : "Svenska",
    "type" : "language",
    "start-position" : 30629,
    "end-position" : 30636,
    "concept-id" : "zSLA_vw2_FXN",
    "matched-string" : "svenska",
    "annotation-id" : 101
  }, {
    "preferred-label" : "Engelska",
    "type" : "sun-education-field-4",
    "start-position" : 30638,
    "end-position" : 30646,
    "concept-id" : "wC9s_urg_8jY",
    "matched-string" : "engelska",
    "annotation-id" : 102
  }, {
    "preferred-label" : "Matematik",
    "type" : "sun-education-field-4",
    "start-position" : 30651,
    "end-position" : 30660,
    "concept-id" : "qKRX_KkP_ayX",
    "matched-string" : "matematik",
    "annotation-id" : 103
  }, {
    "preferred-label" : "Svenska",
    "type" : "language",
    "start-position" : 31638,
    "end-position" : 31645,
    "concept-id" : "zSLA_vw2_FXN",
    "matched-string" : "svenska",
    "annotation-id" : 104
  }, {
    "preferred-label" : "Svenska",
    "type" : "language",
    "start-position" : 32031,
    "end-position" : 32038,
    "concept-id" : "zSLA_vw2_FXN",
    "matched-string" : "svenska",
    "annotation-id" : 105
  }, {
    "preferred-label" : "Engelska",
    "type" : "sun-education-field-4",
    "start-position" : 32040,
    "end-position" : 32048,
    "concept-id" : "wC9s_urg_8jY",
    "matched-string" : "engelska",
    "annotation-id" : 106
  }, {
    "preferred-label" : "Träning",
    "type" : "keyword",
    "start-position" : 33874,
    "end-position" : 33881,
    "concept-id" : "n19Z_hzx_Apu",
    "matched-string" : "träning",
    "annotation-id" : 107
  }, {
    "preferred-label" : "Specialpedagog",
    "type" : "occupation-name",
    "start-position" : 35625,
    "end-position" : 35639,
    "concept-id" : "f1zq_tpA_QtN",
    "matched-string" : "specialpedagog",
    "annotation-id" : 108
  }, {
    "preferred-label" : "Arbetsterapeut",
    "type" : "occupation-name",
    "start-position" : 35650,
    "end-position" : 35664,
    "concept-id" : "heGV_uHh_o8W",
    "matched-string" : "arbetsterapeut",
    "annotation-id" : 109
  }, {
    "preferred-label" : "Fältstudier",
    "type" : "skill",
    "start-position" : 36609,
    "end-position" : 36620,
    "concept-id" : "GQ1j_TmQ_Xxy",
    "matched-string" : "fältstudier",
    "annotation-id" : 110
  }, {
    "preferred-label" : "Kvalitetssäkring",
    "type" : "skill",
    "start-position" : 37482,
    "end-position" : 37498,
    "concept-id" : "a1Sf_mey_gVk",
    "matched-string" : "kvalitetssäkring",
    "annotation-id" : 111
  }, {
    "preferred-label" : "Kvalitetssäkring",
    "type" : "skill",
    "start-position" : 43820,
    "end-position" : 43836,
    "concept-id" : "a1Sf_mey_gVk",
    "matched-string" : "kvalitetssäkring",
    "annotation-id" : 112
  }, {
    "preferred-label" : "Verktyg",
    "type" : "skill",
    "start-position" : 44093,
    "end-position" : 44100,
    "concept-id" : "KG9j_WxP_ym2",
    "matched-string" : "verktyg",
    "annotation-id" : 113
  }, {
    "preferred-label" : "Personal",
    "type" : "keyword",
    "start-position" : 44266,
    "end-position" : 44274,
    "concept-id" : "HVxM_6MS_y1c",
    "matched-string" : "personal",
    "annotation-id" : 114
  }, {
    "preferred-label" : "Utbildningschef",
    "type" : "keyword",
    "start-position" : 47229,
    "end-position" : 47244,
    "concept-id" : "AP9j_nQq_Ucp",
    "matched-string" : "utbildningschef",
    "annotation-id" : 115
  }, {
    "preferred-label" : "Pedagogik",
    "type" : "sun-education-field-4",
    "start-position" : 48012,
    "end-position" : 48021,
    "concept-id" : "zzEU_5xS_cJw",
    "matched-string" : "pedagogik",
    "annotation-id" : 116
  }, {
    "preferred-label" : "Personal",
    "type" : "keyword",
    "start-position" : 48305,
    "end-position" : 48313,
    "concept-id" : "HVxM_6MS_y1c",
    "matched-string" : "personal",
    "annotation-id" : 117
  }, {
    "preferred-label" : "Studie- och yrkesvägledare",
    "type" : "ssyk-level-4",
    "start-position" : 48761,
    "end-position" : 48787,
    "concept-id" : "jJF3_qaQ_Zsh",
    "matched-string" : "studie- och yrkesvägledare",
    "annotation-id" : 118
  } ],
  "text" : "\nUtbildningsplan för yrkeshögskoleutbildning\n\nUtbildningens namn:\nTandsköterska\n\nAnsvarig utbildningsanordnare:\nKronobergs läns landsting, YH Region Kronoberg\n\nOmfattning, poäng:\n325\n\nStudieort:\nVäxjö\n\nStudieform:\nBunden\n\nStudietakt:\n100\n\nUtbildningsnummer:\n201600220\n\nOmgång:\n2\n\n\n\nFaktauppgifter\n\nUtbildningens namn\n\nTandsköterska\n\nAnsvarig utbildningsanordnare\n\nKronobergs läns landsting, YH Region Kronoberg\n\nOrganisationsnummer\n\n232100-0065\n\nPostadress och besöksadress\nPostadress\nOrganisation:\nAdress:\nPostnr/ort\n\nBesök\nOrganisation:\nAdress:\nOrt:\n\nWebbadress, telefonnummer och e-postadress\nTelefon\nHemsida\nE-post\n\nKronobergs läns landsting, YH Region Kronoberg\nKronobergs läns landsting YH Region Kronoberg\n35188 Växjö\n\nKronobergs läns landsting, YH Region Kronoberg\nJ F Liedholms väg 17\nVäxjö\n\n0470-588000\nhttp://www.regionkronoberg.se/jobb-och-\nutbildning/kompetensforsorjning-i-kronoberg/yrkeshogskola/\nregion@kronoberg.se\n\nSida 1 (20)\n\nUtbildningsplan för yrkeshögskoleutbildning\nUtbildningsnummer: 201600220-2\n\nDatum: 2018-06-20\n\n\n\nUtbildningen\n\n1. specialiserade kunskaper inom arbetsområdet och överblick över områden gränsande till det \negna arbetsområdet,\n2. kunskaper om arbetsprocesser och kvalitetskriterier inom arbetsområdet,\n3. kunskaper om planering och samordning i tandvårdsteamet,\n4. kunskaper om förhållanden i samhället som påverkar barns, ungdomars och vuxnas orala \nhälsa,\n5. kunskaper om relevanta författningar,\n6. kunskap i hygienrutiner.\n\nEfter avslutad utbildning ska den studerande ha kunskaper om/i\n\nYrkesroller\n\nYrkesroll 1: Tandsköterska\n\nUtbildningens mål\n\nEfter avslutad utbildning ska den studerande ha färdigheter i att\n1. planera, utföra samt identifiera resurser för att utföra specialiserade arbetsuppgifter inom \narbetsområdet,\n2. självständigt och i samverkan med tandvårdsteamet identifiera patientens tandvårdsbehov,\n3. identifiera behov av och genomföra hälsofrämjande och förebyggande arbete,\n4. identifiera metodförbättring och kvalitetssäkring,\n5. tillämpa sitt kunnande för att hantera olika situationer,\n6. informera och undervisa olika grupper på svenska samt på minste ett främmande språk\n\nUtbildningsplan\n\nExamen och examenskrav\n\nExamensbeteckning\n\nUtbildningen ger yrkeshögskoleexamen – SeQF nivå 5\n\nExamen\n\nEfter fullgjord utbildning kan den studerande efter begäran erhålla ett examensbevis. Med \nfullgjord utbildning avses minst betyget Godkänt i var och en av de kurser som ingår i \nutbildningen. Studerande som inte fullgjort utbildningen kan efter begäran erhålla ett \nutbildningsbevis.\n\nExamensbenämning\nYrkeshögskoleexamen Tandsköterska\n\nSida 2 (20)\n\nUtbildningsplan för yrkeshögskoleutbildning\nUtbildningsnummer: 201600220-2\n\nDatum: 2018-06-20\n\n\n\nEfter avslutad utbildning ska den studerande ha kompetenser för att\n1. förmåga att ta ansvar, att värdera och att agera självständigt,\n2. förmåga att behandla innehållet i ett område med anknytning till kursinnehållet som leder \nvidare till lärande och \n    professionell utveckling\n3. förmåga att övervaka arbetsverksamheten\n4. förmåga att kunna slutföra förelagda projekt\n5. empatisk förmåga,\n6. förmåga till ett professionellt förhållningssätt gentemot patienter, kollegor, myndigheter och \növriga instanser,\n7. insikt om behovet av ytterligare kompetensutveckling.\n\nUndervisning på engelska\nDenna utbildning kommer att bedrivas delvis på engelska\n\nEnligt förslaget för förändring i föreskrift 2014:6 utifrån ny skrivelse i förordning 2 kap. 13 ska de \nstuderande i sin undervisning lära sig att informera, undervisa och kommunicera på minst ett \nfrämmande språk. Vi kommer använda i dessa kurser en del artiklar på engelska som ger den \nblivande tandsköterskan ett gott ordförråd med engelska termer att även kunna vända sig till \npatienten som inte pratar och förstår svenska. Med många nyanlända människor som kommer till \nSverige och är i behov av tandvård känns denna ändring mycket rätt i tiden\n\n7. lösa sammansatta problem samt kunna samverkan med andra i tandvårdsteamet,\n8. kritiskt granska, bedöma och använda relevant information samt att diskutera nya fakta, \nföreteelser och \n    frågeställningar med olika målgrupper och därmed bidra till utveckling av yrket och \nverksamheten,\n9. assistera vid tandvårdsbehandlingar\n\nKursöversikt\n\nObligatoriska kurser\n\nKurs Poäng\nAdministration och organisation 30\n\nAnatomi, anestesi och farmakologi 20\n\nExamensarbete 10\n\nLIA1, Lärande i Arbete 1 15\nLIA2, Lärande i Arbete 2 25\nLIA3, Lärande i Arbete 3 40\nMaterial och miljö 20\nMunhålans och tändernas anatomi 10\nOdontologi 1 35\n\nOdontologi 2 30\n\nOral hälsa 1 30\nOral hälsa 2 25\nTeamtandvård 10\nVårdhygien och smittskydd 25\n\nSumma: 325\n\nSida 3 (20)\n\nUtbildningsplan för yrkeshögskoleutbildning\nUtbildningsnummer: 201600220-2\n\nDatum: 2018-06-20\n\n\n\nKurser\n\nKursen har 14 huvudmoment/delkurs(er)\n\nKursens namn: Administration och organisation\n\nKurstyp: Standard\n\nValbar: Nej\n\nYH-poäng: 30\nSyfte och mål: Kursen ger kunskap i och erfarenhet av administrativt arbete vid \n\ntandvårdsklinik. Kursen ska ge kunskaper om organisation, bestämmelser \noch centrala begrepp som är väsentliga inom tandvården. Kursen ska även \nge kunskap i IT-användning, ekonomi, arbetsprocesser och systematiskt \nkvalitetsarbete. Dessutom ska kursen ge teoretiska kunskaper för att kunna \nkommunicera och agera på ett etiskt och serviceinriktat sätt, på svenska \noch på minst ett främmande språk. (engelska) \n\nDenna kurs bidrar helt med kunskap 2 & 5 samt delvis med kompetens 3\n\nMål som den studerande ska ha uppnått efter avslutat kurs: \nKunskaper: - kunskaper om tandvårdens organisation och utveckling\n\n- ha kunskaper om arbetsformer och administrativa rutiner vid \ntandvårdsklinik\n- ha kunskaper om tandsköterskans roll och arbetsuppgifter inom olika \narbetsorganisationer\n- ha kunskaper om centrala lagar och förordningar\n- ha kunskaper om IT-stöd, ekonomi, arbetsprocesser och systematiskt \nkvalitetsarbete\n- ha kunskap i kommunikation mellan människor och hur denna påverkas \nav olika faktorer\n- ha kunskap i både tandvårdsrelaterade program och datakunskap\n- ha kännedom om tandvårdsstödet\n\nFärdigheter: - kunna kommunicera med och och stödja vårdtagare utifrån individuella \nbehov på svenska samt \n  på minst ett främmande språk\n\nKompetenser: - kunna utföra tidsbokning och dokumenation\n\nKursens namn: Anatomi, anestesi och farmakologi\n\nKurstyp: Standard\n\nValbar: Nej\n\nYH-poäng: 20\nSyfte och mål: Kursen ger kunskaper i huvudets och halsens anatomi, samt anestesi och \n\nfarmakologi med inriktning mot tandvård och oral hälsa. Kursen ska ge \nkännedom om människokroppens uppbyggnad och funktion samt ge \nfärdigheter för att kunna utföra specialiserade arbetsuppgifter som att \nexempelvis e infiltrationsanestesi. \n\nValbara kurser\n\n{Det finns inga valbara kurser}\n\nSida 4 (20)\n\nUtbildningsplan för yrkeshögskoleutbildning\nUtbildningsnummer: 201600220-2\n\nDatum: 2018-06-20\n\n\n\nDenna kurs bidrar helt med kunskap 1 och delvis med färdighet 1 och \nkompetens 3. \n\nEfter avslutat kurs ska den studerande:\n\nKunskaper: - ha kännedom om människokroppens uppbyggnad och funktion\n- ha kunskaper om huvudets och halsens anatomi\n- ha kunskaper om läkemedel, läkemedelseffekter och \nläkemedelshantering\n- ha kunskaper om munhålan, dess sjukdomar och behandlingsformer\n\nFärdigheter: - ha kunskap i anestesi och sedering och ha erfarenhet av \ninfiltrationsanestesi\n\nKompetenser: - ha kunskaper om tecken på sjukdomstillstånd och åtgärder vid akuta \nsituationer och kunna utföra\n  första hjälpen och hjärtlungräddning\n\nKursens namn: Examensarbete\n\nKurstyp: Examensarbete\n\nValbar: Nej\n\nYH-poäng: 10\n\nSyfte och mål: Kursen ska ge den studerande möjlighet att behandla innehållet i ett \narbetsområde inom tandvården med anknytning till någon, eller några, av \nkurserna i utbildningen. Det valda området ska ge den studerande inblickar \ni vägar till vidare lärande och professionell utveckling.\n\nDenna kurs bidrar helt till kunskap 1 och delvis till kunskap 2 & 3, färdighet \n4 & 8 samt kompetens 1.\n\nMål som den studerande ska ha uppnått efter avslutad kurs\n\nKunskaper: – självständigt kunna behandla innehållet i ett arbets- eller studieområde\n\nFärdigheter: – kunna slutföra förelagt projekt\nKompetenser: – föreslå hur det studerade området kan leda till vidare lärande eller \n\nprofessionell utveckling\n\nKursens namn: LIA1, Lärande i Arbete 1\nKurstyp: LIA\n\nValbar: Nej\n\nYH-poäng: 15\nSyfte och mål: Kursen genomförs på tandvårdsklinik, heltid under tre veckor och ska ge \n\nden studerande en uppfattning om yrket och arbetsuppgifter i \ntandvårdsteamet.\nUnder kursen ska den studerande lära känna arbetsmiljön och få \nerfarenhet av dagliga rutiner på tandvårdsklinik samt få erfarenhet av \nmottagande och bemötande av vårdtagare. Den studerande ska få \nerfarenhet av hygienrutiner, klinik- och instrumenthygien. Den studerande \nska under handledning få erfarenhet av assistans vid enklare \ntandvårdsbehandlingar.\n\nSida 5 (20)\n\nUtbildningsplan för yrkeshögskoleutbildning\nUtbildningsnummer: 201600220-2\n\nDatum: 2018-06-20\n\n\n\nDenna kurs bidrar helt till kunskap 2 & 6 och färdighet 9. Kursen bidrar \ndelvis till kunskap 1, 3, 4 och 5.\n\nEfter avslutat kurs ska den studerande:\n\nKunskaper: - ha övergripande kunskaper om och överblick över arbetet i \ntandvårdsteamet med alla dess yrkeskompetenser\n- kunskaper om arbetsprocesser och kvalitetskriterier inom ett \ntandvårdsteam\n\nFärdigheter: - ha kunnat öva på att ta emot och bemöta patienter\nKompetenser: - ha en förståelse om hur arbetet inom ett tandvårdsteam planeras\n\nKursens namn: LIA2, Lärande i Arbete 2\nKurstyp: LIA\n\nValbar: Nej\n\nYH-poäng: 25\nSyfte och mål: Kursen är förlagd till tandvårdsklinik, heltid i fem veckor och ska ge praktisk \n\nkunskap i tillämpning av vårdhygien och smittskyddsarbete, med \nhandledning assistera vid tandvårdsbehandlingar och kunna ge information \noch instruktion om munhygien samt medverka och utföra profylaktiska \nbehandlingar.\n\nDenna kurs bidrar helt till kunskap 1,2, 3 och 6, färdighet 5 och 9 samt \nkompetens 3. Denna kurs bidrar delvis till kunskap 4 & 5, färdighet 1 & 2 \noch kompetens 2.\n\nEfter avslutat kurs ska den studerande:\n\nKunskaper: - få kunskaper om och överblick över arbetet på en tandvårdsklinik och \npraktiskt kunskap om arbetet som tandsköterska\n\nFärdigheter: - kunna assistera vid tandvårdsbehandlingar och föreslå lösningar på \nproblem som till exempel instruktion av olika munhygienartiklar\n\nKompetenser: - få kunskaper om arbetsprocesser och kvalitetskriterier, samt utföra \ndagliga hygienrutiner\n\nKursens namn: LIA3, Lärande i Arbete 3\nKurstyp: LIA\n\nValbar: Nej\n\nYH-poäng: 40\n\nSyfte och mål: Kursen är förlagd till tandvårdsklinik, heltid under åtta veckor och ska ge \npraktisk kunskap i att på egen hand assistera vid tandvårdsbehandlingar \noch få fördjupad kunskap i förekommande arbetsuppgifter inom \ntandsköterskans arbete i tandvårdsteamet. Syftet är att i strukturerad form \nge de teoretiska delarna i utbildningen en praktisk tillämpning. Delar av \nperioden kan förläggas inom specialisttandvården.\n\nDenna kurs bidrar helt till kunskap 1,2,3 och 6, färdighet 5&9 och \nkompetens 1, 2 och 3. Denna kurs bidrar delvis till kunskap 4 & 5, färdighet \n1 & 4.\n\nSida 6 (20)\n\nUtbildningsplan för yrkeshögskoleutbildning\nUtbildningsnummer: 201600220-2\n\nDatum: 2018-06-20\n\n\n\nEfter avslutat kurs ska den studerande:\n\nKunskaper: – ha kunskaper om och överblick över arbetet på en tandvårdsklinik och \npraktisk kunskap om arbetet som tandsköterska\n\nFärdigheter: – självständigt kunna planera och utföra sina arbetsuppgifter som \ntandsköterska\n\nKompetenser: – kunna lösa problem inom tandvårdsområdet, som exempelvis utföra mer \navancerade arbetsuppgifter i nya situationer på ett kvalitets-och \nsäkerhetsmässigt sätt kopplade till yrket.\n\nKursens namn: Material och miljö\nKurstyp: Standard\n\nValbar: Nej\n\nYH-poäng: 20\n\nSyfte och mål: Kursen ska ge kunskap om miljöfrågor och systematiskt arbetsmiljöarbete \ninom tandvården. Kursen ska ge kunskaper om dentala material, \ninstrument och skötsel av utrustning. Dessutom ska kursen ge kunskap i \nhantering och om risker vid användning av härdplaster och andra dentala \nmaterial. \n\nDenna kurs bidrar helt till kunskap 6 och delvis till kunskap 1 och 5.\n\nEfter genomförd kurs ska den studerande:\nKunskaper: - ha kunskaper om miljö, hållbar utveckling, systematiskt arbetsmiljöarbete \n\nsamt tillhörande \n  arbetsprocesser\n- ha kunskaper om och kunna tillämpa regler för arbetsmiljö och säkerhet\n- ha kunskap i ergonomi och kunna förebygga arbetsskador\n- ha kunskaper om verksamhetens och det egna arbetes inverkan på miljön\n- ha kunskaper om härdplaster, material, utrustning och instrument inom \ntandvården och kunna \n  hantera material och avfall på ett ändamålsenligt och säkert sätt\n\nFärdigheter: - kunna tillämpa god ergonomi för att förebygga arbetsskador\nKompetenser: - kunna tillämpa regler för arbetsmiljö och säkerhet\n\n- kunna redogöra  för faktorer som påverkar den psykosocial arbetsmiljön\n\nKursens namn: Munhålans och tändernas anatomi\nKurstyp: Standard\n\nValbar: Nej\n\nYH-poäng: 10\nSyfte och mål: Kursens syfte är att ge kunskaper om munhålans och tändernas anatomi. \n\nDenna kurs bidrar helt m kunskap 1 och delvis med kunskap 2 & 3, \nfärdighet 1,2,3,6 & 9 samt med kompetens 4.\n\nMål som den studerande ska ha uppnått efter avslutat kurs:\nKunskaper: - kunskaper om primär och permanent tanduppsättning\n\n- kunskaper om munhålans och tändernas anatomi, vävnader och \nutveckling\n\nSida 7 (20)\n\nUtbildningsplan för yrkeshögskoleutbildning\nUtbildningsnummer: 201600220-2\n\nDatum: 2018-06-20\n\n\n\nFärdigheter: Denna kurs leder till endast kunskaps mål som den blivande tandsköterska \nbehöver för att kunna utföra sitt arbete på ett rationellt och säkert sätt\n\nKompetenser: Denna kurs leder till endast kunskaps mål som den blivande tandsköterska \nbehöver för att kunna utföra sitt arbete på ett rationellt och säkert sätt\n\nKursens namn: Odontologi 1\n\nKurstyp: Standard\n\nValbar: Nej\n\nYH-poäng: 35\nSyfte och mål: Kursen ska ge kunskap om kariologi, endodonti, paradontologi och oral \n\nradiologi. Kursen ska ge teoretiska kunskaper och och utveckla förmåga i \natt assistera och utföra arbetsuppgifter som att till exempel \ninformera/instruera patienter i syfte att förebygga uppkomst av karies och \nparodontit. \n\nDenna kurs bidrar helt till kunskap 4 och färdighet 6. Denna kurs bidrar \ndelvis till kunskap 1 och 5. \n\nEfter avslutat kurs ska den studerande:  \n\nKunskaper: - ha kunskaper om kariessjukdom, påverkande faktorer, \nbehandlingsformer, förebyggande \n  åtgärder samt instrument och arbetssätt\n- ha kunskap i endodonti, behandlingsformer, samt instrument och \narbetssätt\n- ha kunskap om parodontala sjukdomars påverkande faktorer, \nbehandlingsformer, förebyggande \n  åtgärder samt instrument och arbetssätt\n- ha kunskap om fissurförsegling\n\nFärdigheter: - kunna assistera vid tandvårdsbehandlingar\n\nKompetenser: - ha kunskap i oral radiologi och erfarenhet av oral röntgentagning samt \nmetoder och hjälpmedel \n  vid röntgentagning\n\nKursens namn: Odontologi 2\n\nKurstyp: Standard\n\nValbar: Nej\n\nYH-poäng: 30\n\nSyfte och mål: Kursen ska ge kunskap i pedodonti, ortodonti, käkkirurgi, protetik och \nbettfysiologi. Kursen ska ge teoretiska kunskaper och utveckla förmåga att \nassistera och utför arbetsuppgifter inom området som att till exempel \nframställa temporära ersättningar.  \n\nDenna kurs bidrar delvis till kunskap 1 och 3 samt kompetens 4.\n\nEfter genomförd kurs ska den studerande:\nKunskaper: - ha kunskaper om barnets utveckling, rättigheter och behov\n\n- ha kunskaper om metoder och träning för inskolning av barn\n- ha kunskaper om tandsjukdomar, behandlingsformer och profylaktiska \nåtgärder till den växande \n  individen\n- ha kunskaper om bettavvikelser, ortodontiska behandlingsmetoder och \n\nSida 8 (20)\n\nUtbildningsplan för yrkeshögskoleutbildning\nUtbildningsnummer: 201600220-2\n\nDatum: 2018-06-20\n\n\n\ninstrument\n- ha kunskaper om trauma\n- ha kunskaper om tuggsystemets uppbyggnad och funktion\n\nFärdigheter: - ha kunskaper om käkkirurgi, assistans och instrument vid operativa \ningrepp\n- ha kunskap i avtryckstagning och temporära ersättningar\n\nKompetenser: - ha kunskaper om protetik, konstruktioner, material och hantering\n- ha kunskaper om besvär i samband med käkkirurgiska ingrepp\n- ha förmåga att assistera och planera samt identifiera resurser för att \nutföra arbetsuppgifter inom\n  området som att till exempel ta fram rätt instrument vid olika kirurgiska \ningrepp i munhålan\n\nKursens namn: Oral hälsa 1\nKurstyp: Standard\n\nValbar: Nej\n\nYH-poäng: 30\nSyfte och mål: Kursen ska ge kunskaper om allmän och oral hälsa samt samband mellan \n\nkost, livsstil och oral hälsa. Kursen ska även ge kunskap i och erfarenhet \nav förebyggande arbete inom oral hälsa. Kursen ska ge färdigheter i att \nidentifiera behov av och genomföra hälsofrämjande och förebyggande \narbete som att exempelvis utföra munhygienkontroll. \n\nDenna kurs bidrar helt till kunskap 4 och färdighet 8. Denna kurs bidrar \ndelvis till färdighet 2 och kompetens 1 och 3.\n\nEfter genomgången kurs ska den studerande:\nKunskaper: - ha kunskaper om kostens och livsstilens betydelse för allmän och oral \n\nhälsa\n- ha kunskaper om tobaksprevention\n- ha kunskap i epidemologisk uppföljning och statistik som rör munhälsa \noch behandling\n\nFärdigheter: - kunna utföra profylax, munhygienkontroll och tandrengöring\n- ha erfarenhet av salivprovtagning\n- kunna avlägsna supragingival tandsten\n\nKompetenser: - kunna medverka vid kliniska registreringar och anamnesupptagning\n\nKursens namn: Oral hälsa 2\nKurstyp: Standard\n\nValbar: Nej\n\nYH-poäng: 25\nSyfte och mål: Kursen ska ge fördjupade kunskaper om oral hälsa och utveckla förmåga \n\natt informera om munhälsa och tandvård. Kursen ska även ge \ngrundläggande kunskap i psykologi med intriktning odontologi. Dessutom \nska kursen ge kunskaper om tandvårdsmiljöer och former för tandvård. \n\nDenna kurs bidrar helt till färdighet 3, 6 och 8 samt kompetens 2. Denna \nkurs bidrar delvis till kunskap 1 och 3, färdighet 2 och kompetens 3 och 4.\n\nEfter genomgången kurs ska den studerande:\n\nSida 9 (20)\n\nUtbildningsplan för yrkeshögskoleutbildning\nUtbildningsnummer: 201600220-2\n\nDatum: 2018-06-20\n\n\n\nKunskaper: - ha grundläggande kunskap i psykologi\n- ha kunskaper om sambandet oral häls och allmänhälsotillstånd\n- ha kunskap i oral medicinsk vård/sjukhustandvård\n- ha kunskaper om uppsökande verksamhet inom äldre- och \nhandikapptandvård\n\nFärdigheter: - kunna assistera vid behandlingar av patienter med särskilda behov\n- kunna medverka vid munhälsoutbildning av vårdpersonal\n\nKompetenser: - kunna diskutera och informera om munhälsa och tandvård såväl till grupp \nsom individuellt på \n  svenska samt på minst ett främmande språk\n- ha kunskaper om och kunna stödja patienter med särskilda behov\n- ha kunskap i munhälsobedömningar\n\nKursens namn: Teamtandvård\nKurstyp: Standard\n\nValbar: Nej\n\nYH-poäng: 10\nSyfte och mål: Kursen ska ge kunskaper om olika arbetssätt med inriktning mot \n\nteamtandvård. Kursen ska ge inblick i de moment en tandsköterska utför i \nsitt arbete i förhållande till de andra professionerna i teamet som en \nförberedelse inför den arbetsfördelning som kan finnas i verksamheten. De \ningående momenten kan variera efter lokala förutsättningar. \n\nDenna kurs bidrar helt till kunskap 3 och färdighet 3 och 7. Denna kurs \nbidrar delvis till kunskap 2 och färdighet 1 och 2. \n\nEfter genomförd kurs ska den studerande: \nKunskaper: - kunna identifiera och planera resurser som behövs för att utföra arbetet i \n\nett tandvårdsteam\nFärdigheter: - kunna övervaka arbetsverksamheten genom exempelvis tidböcker och \n\nrevisioner av patient och kunna kalla patienter och planera dagarna utifrån \nklinikens tidböcker.\n\nKompetenser: - detta område tillämpas ej i denna kurs\n\nKursens namn: Vårdhygien och smittskydd\nKurstyp: Standard\n\nValbar: Nej\n\nYH-poäng: 25\nSyfte och mål: Kursen ska ge kunskaper om ansvar, regler och metoder för vårdhygien \n\noch smittskydd. Kursen ska även ge kunskap i hygien- och \nsmittskyddsarbete vid tandvårdsklinik. \n\nDenna kurs bidrar helt till kunskap 2, 5 och 6 samt delvis till färdighet 1.\n\nEfter genomgången kurs ska den studerande:\nKunskaper: - ha kunskap i hygienrutiner\n\n- ha kunskaper om infektionssjukdomar och immunsystemets uppbyggnad \noch funktion\n- ha kunskaper om mikroorganismer och deras spridiningsvägar\n- ha kunskap i rengöring, sterilisering och desinfektion\n\nSida 10 (20)\n\nUtbildningsplan för yrkeshögskoleutbildning\nUtbildningsnummer: 201600220-2\n\nDatum: 2018-06-20\n\n\n\n- ha kunskaper om ansvar och regler för vårdhygien och smittskydd\nFärdigheter: - ha kunskap i skötsel och användande av diskdesinfektor, autoklav och \n\növrig medicinteknisk \n  utrustning och kunna föra loggbok över olika tester av denna utrustning\n\nKompetenser: - kunna planera, utföra och utvärdera hygien- och smittskyddsarbete vid \ntandvårdsklinik och därigenom lösa sammansatta problem som att \nexempelvis förebygga smittspridning på en tandvårdsklinik genom \nsterilarbete utifrån klinikens rutiner\n\nTillgodoräknande\n\nRutiner vid tillgodoräknande\nStuderande kan under hela utbildningens längd få tillgodoräkna sig tidigare genomgång kurser \ndelar av utbildning eller yrkesverksamhet som motsvarar aktuell utbildning. Detta sker i första \nhand i samråd med ansvarig utbildningsledare och eventuell kursansvarig, beslut om \ntillgodoräknande fattas sedan i ledningsgruppen för utbildningen. \n\nEftergymnasiala studier inom universitet, högskola, yrkeshögskola eller annan relevant och \nintygad utbildning samt yrkeserfarenhet är föremål för tillgodoräknande. Beslutet kan inte \növerklagas. Den studerande fyller i en blankett om tillgodoräknande av kunskaper, färdigheter \noch kompetenser, förvärvade genom yrkesliv eller annan eftergymnasial utbildning, som i \nhuvudsak svarar mot den aktuella utbildningen.\n\nDen studerande ska bifoga fullständiga och vidimerade underlag i form betyg, \nkursplaner/kursbeskrivning, lärosäte, som vem som har varit examinator. Yrkeserfarenhet ska \nstyrkas med dokumentation av arbetsuppgifter, tidsomfattning, arbetsställe och uppdragsgivare. \nBlankett och bilagor ska diarieföras. Vid behov av komplettering begärs detta in av den \nstuderande.\n\nFörslag till tillgodoräknande ska ske i samråd med utbildningsledare och studie- yrkesvägledare.\nI förekommande fall sker en muntlig eller skriftlig form av kunskapstest för att identifiera och \nbedöma reell kompetens, som utförs av utbildningsledare och ev. annan inkallad kompetens. En \narbetsgrupp bestående att ansvarig utbildningsledare, personal från relevant verksamhet och en \nrepresentant från ledningsgrupp tar fram ett underlag som presenteras i ledningsgruppen, där \nbeslut fattas om tillgodo räknandet.\n\nBeslutet dokumenteras och protokollförs. Den studerande meddelas ledningsgruppens beslut\nVid betygssättning överförs betyget av den tillgodoräknande kursen till examensbetyget, och det \nska framgå att kursen är tillgodoräknad. Den studerande kan få alla betygsnivåer genom tillgodo \nräknandet.\n\nProcess och beslut ska dokumenteras, sparas och arkiveras.\n\nUndervisning i svenska med yrkesinriktning\n\nOm behovet uppstår kan vi erbjuda undervisning i svenska med yrkesinriktning, genom ett \nsamarbete med Centrum för vuxnas lärande i Växjö. Målet är att den studerande ska tillgodogöra \nsig utbildningen och nå sin yrkesroll.\n\nLedningsgruppen och utbildningsanordnaren identifierar behovet vid antagningen och \nuppmärksammar behovet. Kursupplägget anpassas efter deltagarens studiebakgrund, kunskaper \ni svenska och erfarenhet i branschen som ska vara på en kvalificerad och eftergymnasial nivå.\n\nSida 11 (20)\n\nUtbildningsplan för yrkeshögskoleutbildning\nUtbildningsnummer: 201600220-2\n\nDatum: 2018-06-20\n\n\n\nSpråklärare med erfarenhet av utbildning i ämnet gör en bedömning tillsammans med den \nstuderande och planerar den individuella studieplanen som integreras löpande i utbildningen \nparallellt med ordinarie kurser. Studieplanen är inriktad mot det yrkesområde som studerande är \nantagen till och undervisningen inriktas på yrkesrollen och de specifika yrkesinriktade \nspråkkunskaper som arbetsmarknaden kräver. Den studerande erhåller ett intyg på genomförd \nundervisning\n\nTillträde\n\nBehörighet till yrkeshögskolan\n\nI 3 kap 1 § förordningen (2009:130) om yrkeshögskolan och med ändringar som hör ihop med \nFörordning om ändring i förordningen (2009:130) om yrkeshögskolan (SFS 2011:110) anges att \nbehörig att antas till utbildningen är den som\n\n1. avlagt en gymnasieexamen i gymnasieskolan eller inom kommunal vuxenutbildning,\n2. har en svensk eller utländsk utbildning som motsvarar kraven i 1,\n3. är bosatt i Danmark, Finland, Island eller Norge och där är behörig till motsvarande \n\nutbildning, eller\n4. genom svensk eller utländsk utbildning, praktisk erfarenhet eller på grund av någon annan \n\nomständighet har förutsättningar att tillgodogöra sig utbildningen.\n\nÄldre bestämmelser om behörighet gäller fortfarande för den som före den 1 juli 2015 har fått \nslutbetyg från ett fullständigt nationellt eller specialutformat program i gymnasieskolan eller från \ngymnasial vuxenutbildning, nämligen man är behörig att antas till yrkeshögskoleutbildningar om \nman har lägst betyget Godkänt i minst 2 250 gymnasiepoäng. Dessutom kan de som uppfyllde de \näldre kraven på behörighet för tillträde till utbildning före den 1 januari 2013 anses vara behörig.\n\nTillträde till utbildningen\n\nSärskilda förkunskaper\n\nUtöver grundläggande behörighet ska den studerande ha;\nLägst godkänt betyg (3, G eller E) i Svenska 2 / Svenska som andrapspråk 2, eller motsvarande\nLägst godkänt betyg (3, G eller E) i engelska 5 och lägst godkänt betyg (3, G eller E) i Matematik \n1 a,b eller c.\n\nKrav på särskilda förkunskaper\n\nFastställande av behörighet\n\nSärskilda förkunskaper - motivering\nSvenska, det svenska språket behövs för att kunna tillgodogöra sig utbildningen, kunna\nkommunicera med patienter och övrig tandvårdspersonal, ha förmåga attdokumentera i\njournalhandlingar och kunna läsa instruktioner.\nEngelska, den engelska språket behövs för att kunna läsa instruktioner, förstå vetenskapliga \nartiklar\nsamt att viss dental apparatur ofta har beskrivningar endast på engelska.\nMatematik, matematiska kunskaper behövs för att kunna medverka vid kostnadsförslag, förstå\nförsäkringskassans tandvårdsstöd och kunna förklara detta för patienter, förstå hur man hanterar\nprocentberäkningar vid fluorberedning, kunna hantera läkemedel.\n\nSida 12 (20)\n\nUtbildningsplan för yrkeshögskoleutbildning\nUtbildningsnummer: 201600220-2\n\nDatum: 2018-06-20\n\n\n\nGenomförande och dokumentation av behörighetsprocessen\n\nUrvalsgrunder och urvalsprocess\n\nSökande som inte bedöms vara behörig utifrån 3 kap. 1§ punkt 1-4 1 i förordningen, men anser \nsig ha möjlighet att tillgodogöra sig utbildningen på grund av annan utbildning eller praktisk \nerfarenhet eller någon annan omständighet, kan åberopa reell kompetens för att anses vara \nbehörig. Den sökande kan få sin reella kompetens prövad genom att lämna in handlingar som \nstyrker motsvarande kunskaper och erfarenheter. En kompetenskartläggning görs i samverkan \nmellan utbildningsledare och studie- och yrkesvägledare. Validering kan ske för bedömning av \nkvalitetskrav för tillträde till utbildningen. Valideringsprocessen innebär kartläggning av tidigare \nstudier, yrkeserfarenhet, livserfarenhet, bedömning av relevanta kurser, självskattning av kursmål \noch betygskriterier samt valideringssamtal. Bedömning av utländska betyg görs i samråd med \nstudie- och yrkesvägledare. Validerande lärare utfärdar valideringsintyg som bifogas \nkompetensintyget. Utbildningsledaren sammanställer kompetensintyg/bilagor\n\nReell kompetens\n\nDen sökande gör ansökan via webb, för närvarande är det YH-antagning.se (länk finns på \nwebbsidan Region Kronoberg)\nBetyg, arbetsgivarintyg och övriga handlingar skickas in digitalt.\nAdministratör på Kunskapsutveckling Syd har huvudansvar för webben\nDaglig och kontinuerlig uppföljning och uppdatering sker av de sökande\nStudie- och yrkesvägledare har tillgång till webben och hanterar meritvärdesberäkning\nYtterligare en person/utbildningsledare från Kunskapsutveckling Syd arbetar med analys av betyg \noch arbetslivserfarenhet som dokumenteras i systemet.\nRutin kring förfarande finns dokumenterat i en framtagen ”lathund” för bedömning som används \nsom hjälpmedel under antagningens gång.\nTidsplan är upprättad.\nBehörighetsgrunderna rangordnas utifrån meritvärde och betyg i engelska, matematik och \nsvenska poängbedöms. Vid behov kan 20-procentsregeln användas.\nSummering och kommentarer dokumenteras och följs upp kontinuerligt i systemet. Saknas \nunderlag för bedömning, begärs de relevanta kompletterande underlagen in från den sökande vid \nett tillfälle.\nÖverstiger antalet sökande antalet beviljade platser på utbildningen, rangordnas sökande enligt \nangivna urvalsgrunder\nBeräkning av behörighet, meritvärde, (utifrån att den sökande har behörighet till yrkeshögskola) \noch yrkeserfarenhet (endast vid reell kompetens och fri kvot) görs i samverkan med administratör, \nutbildningsledare och studie- yrkesvägledare.\nFörslag på antagning och reserver på sökande studerande presenteras vid ledningsgruppsmöte, \ndär ledningsgruppen fastställer antagningen.\nBeviljade sökande samt reserver meddelas via mail och dokumentationen arkiveras.\nReserver meddelas vilken plats de har i kön.\nDe som inte är behöriga får information direkt när ansökan är behandlad.\nDe som är antagna till utbildningen får information om utbildningen, upplägg, kurstider, inbjudan \ntill uppstart mm via e-post. Efter avslutad antagning görs en gemensam utvärdering med berörd \npersonal.\nDet är minst två personer som deltar under antagningens gång för att säkerställa \nantagningsförfarande och kvalitet.\n\nOm antalet behöriga sökande överstiger antalet platser för utbildningen \nska ett urval göras bland samtliga behöriga sökande.\n\nSida 13 (20)\n\nUtbildningsplan för yrkeshögskoleutbildning\nUtbildningsnummer: 201600220-2\n\nDatum: 2018-06-20\n\n\n\nUrvalsgrunder\n\nBetyg\n\nStudie- och yrkesvägledare beräknar meritvärde på de ansökningar som bedömts vara behöriga.\nBeräkningen sker enligt UHR:s regler och tillämpningar om beräkning av meritvärde (Mv) av\ngymnasieutbildning med undantag av meritpoäng.\nMv 10.00 – 11.99 = 4 p.\nMv 12.00 – 13.99 = 6 p\nMv 14.00 – 15.99 = 8 p\nMv 16.00 – 17.99 = 10 p\nMv 18.00 – 20.00 = 12 p\nBetyg i svenska 1, engelska 5 och matematik 1 poängsätts av utbildningsansvarig och studie- och\nyrkesvägledare enligt följande. Slutpoängen blir snittet av den sammanlagda summan av \nkurserna.\nMax är 5 poäng.\nBetyg Poäng\nF = 1-2 = IG =>0p\nE = 3 = G =>1p\nD = 3,5 =>2p\nC = 4 = VG =>3p\nB = 4,5 =>4p\nA = 5 = MVG =>5p\nMeritvärde och poäng för svenska, engelska och matematik summeras (maxpoäng 17p)\n\nDe som söker och bedöms utifrån en reell kompetens kan få max 12 p, fördelade med 4 p var \nutifrån kunskap, kompetens och färdighet. Bedömningen sker utifrån relevanta betyg/intyg som \nerhålls samt validering och intervjuer.\n\nSärskilt prov\n\nDe särskilda proven är inriktade på kunskaper och färdigheter relaterade till utbildningen.\nSyfte och mål med det särskilda provet, som är en del av urvalsprocessen, är att de som antas till\nutbildningen är de som bedöms att ha den största möjligheten att tillgodogöra sig denna.\n\nDe särskilda proven består av ett skriftligt test som avser språkliga färdigheter och ett prov i \nbemötande/läsförståelse som är vård relaterat. Detta prov görs i datasalen då även de \nstuderandes datorkunskaper provas. \nMaximalt kan de sökande under det särskilda provet samla 12 urvalspoäng. Detta ger \ntillsammans\nmed urvalsvärdet av betygen maximalt 29 poäng.\nLäsförståelse, bemötande och datorkunskap: max. 8 poäng\nSkriftlig svenska test: max. 4 poäng\n\nGenomförande och dokumentation av urvalsprocessen\n\nOm antalet sökande överstiger det beviljade antalet platser på utbildningen rangordnas de \nsökande enligt upprättad rutin.\nSummering och kommentarer dokumenteras i det digitala ansökningsportal (yh-antagning.se)\n- För- och efternamn, personnummer, gatuadress, postnummer och ort\n- Behörighet\n- Meritvärde, betyg i svenska, engelska, matte – poäng\n- Total summa poäng\n- Summering av antal sökande\n- Antal behöriga sökande\nDe olika grupperingarna – behörighet, särskild behörighet sammanställs\nListan sammanställs och redovisas vid ledningsgruppens möte, som fastställer antagningen.\nAntagningsbeskedet skickas via e-post till de sökande (antagna och reserver med platsnummer)\nDe som är antagna ska svara på antagningsbeskedet inom en viss tid.\n\nSida 14 (20)\n\nUtbildningsplan för yrkeshögskoleutbildning\nUtbildningsnummer: 201600220-2\n\nDatum: 2018-06-20\n\n\n\nUtbildningens huvudsakliga upplägg och organisation\n\nUppgifter om eventuella övriga utbildningsanordnare\n\n{Uppgift saknas}\n\nUtbildningens upplägg\n\nUtbildningens upplägg och organisation\n\nMålet med det pedagogiska upplägget är att den studerande ska kunna utveckla ett reflekterande \narbetssätt (den reflekterande praktikern) genom att låta erfarenhetsbaserade kunskap och \nteoretisk/generell kunskap prövas och speglas mot varandra. (Donald Schöns teori) Vårt mål är \natt samordna forskningsbaserad och teoretisk kunskap med praktisk förtrogenhets kunskap. \nPedagogiken och undervisningen bygger på att ge den studerande en teoretisk och praktisk \nplattform för den framtida yrkesrollen. Vi ger utrymme för praktiska övningar, dialog, diskussioner \noch seminarier/reflektions seminarier för att den studerande ska kunna tillgodoföra sig nya \nkunskaper, färdigheter och kompetenser. \n\nFörutsättningarna för studierna innebär att det är heltidsstudier som sker i bunden \nutbildningsform. Vid utbildnings start sker en introduktion av utbildningen, de studerande får \nkännedom om det pedagogiska upplägget, studieteknik lärplattform och yrkesrollen. \n\nDe studerande har varje vecka tre dagars platsbunden teoretisk undervisning i Växjö. Det kan \näven förekomma veckor där en fjärde dag ägnas åt praktiskt träning. Dessa dagar är förlagda till \nFolktandvårdens lokaler centralt i Växjö. Där har vi tillgång till en avdelning med tre \nundersökningsrum. \n\nVid de teoretiska träffar i skolan ges föreläsningar som är kopplade till ämnet i kursen, praktiska \növningar, gruppdiskussioner, examinationer samt möjlighet till erfarenhetsutbyte.\n\nUnder perioden när de studerande är på sin LIA sker den mesta av kommunikationen via \nlärplattformen Fronter. Där finns även all information om utbildningen (schema, presentationer, \nföreläsningsmaterial, uppgifter och inlämningar) Därutöver finns den ansvarige utbildningsledaren \ntillgänglig via e-post och mobiltelefon vid behov. Genom att låta våra studerande diskutera, \nreflektera och utbyta erfarenheter i reflektionsgrupperna och även ha gemensamma \ngrupparbeten, diskussioner och examinationer blir reflektionsgruppen betydelsefull för den \nstuderande under hela sin utbildning. Den individuella utvecklingen hos den studerande sker via \nen skriftlig framgångsrapport med uppföljning och avstämningssamtal. \n\nArbete med studerande i behov av pedagogiskt stöd\n\nI ansökan ges den studerande möjlighet att anmäla sitt behov för särskilt pedagogisk stöd. Om \nutbildningsledaren ser behov av stöd under utbildningens gång upplyses och informeras den \nstuderande om olika möjligheter till särskilt pedagogisk stöd. Vi erbjuder den studerande \nindividuellt samtal och handledning där vi upprättar en handlingsplan för den studerande, utifrån \nutbildningens mål och den studerandes förutsättningar.\n\nFör varje studerande där stöd sätts in upprättas en särskild handlingsplan där det anges vilket\npedagogiskt stöd som sätts in med ex anpassade kunskapsprov och studiematerial, extra lärartid,\nanteckningsstöd, behov av specialpedagog och/eller arbetsterapeut. Handlingsplanen granskas \n\nEventuella reserver får besked om antagning.\nSökande som inte uppfyller behörighetskraven meddelas med orsak till avslag.\n\nSida 15 (20)\n\nUtbildningsplan för yrkeshögskoleutbildning\nUtbildningsnummer: 201600220-2\n\nDatum: 2018-06-20\n\n\n\nFörberedelse av de studerande inför LIA-perioden/perioderna\nVi bjuder in gästföreläsare från olika verksamheter som beskriver sin yrkesroll och sitt arbete för \nde studerande, samt att de studerande får tidigt i utbildningen göra studiebesök inom \nyrkesområdet för att få en inblick i yrkesrollen.\nDet pedagogiska upplägget utgår från den reflekterande praktikern, som bygger på att de \nstuderande får autentiska fallbeskrivningar som ska bearbetas och diskuteras. De studerande \nerbjuds också möjligheter till reflektion och handledning utifrån erfarenhetsutbyte och \nfallbeskrivningar, med varandra och med utbildningsledaren. Teoretiska moment i utbildningen \nkopplas samman med fältstudier/observationer som den studerande sedan får omsätta i \nreflektioner och praktisk handling.\n\nLIA-handledarna bjuds in till en handledarträff i skolan som är en dag. Under dagen får \nhandledarna utbildning som    syftar till att få en fördjupad kunskap och förståelse för \nhandledarrollen och för att kunna möta en YH-studerande på LIA:n.\n\nDen utsedda LIA-handledaren får i god tid, en skriftlig information om utbildningens upplägg och \nmål av ansvarig utbildningsledare. Den studerande följer en eller två handledare och schema \nunder LIA-perioden, detta för att den studerande ska få god insikt samt kontinuitet i yrkesrollen för \natt nå målen med LIA-kursen. Den studerande ska ha regelbundna samtal med sin handledare, \nsamt att den studerande för en loggbok och ev. examinationsuppgifter, som utbildningsledaren \nföljer under hela perioden.\n\nAnskaffning och kvalitetssäkring av LIA-platser\n\nHR-samordnare och ansvarig utbildningsledare samverkar för att få ett större perspektiv på \nfördelningen av platser, samt att det finns en gemensam syn och kontroll på olika LIA-platser. Vi \nhar även god samverkan och kontakter med många privata tandläkarmottagningar i länet som tar \nemot våra LIA-elever. Kunskapsutveckling Syd garanterar en LIA-plats inom länet och har ett väl \nupparbetat nätverk inom yrkesområdet. Önskar den studerande en LIA-plats i hemkommun \nutanför länet görs detta i samverkan med den studerande och utbildningsledare genom kontakt \nmed verksamheten för att säkerställa att LIA-platsen uppfyller utbildningens mål.\n\nUnder LIA-perioden gör utbildningsledaren i första hand ett besök, alternativt har ett telefonsamtal \nmed LIA-handledare, studerande och verksamhet. Det studerande skriver loggbok under hela \nLIA-perioden, som utbildningsledaren har tillgång till, samt att den studerande gör en utvärdering \nefter avslutad LIA.\n\noch kvalitetssäkras i ledningsgruppen för att säkerställa att personen når utbildningsmålen.\n\nSamarbete med arbetslivet för arbetslivsanknutet lärande i utbildningen\n\nI ledningsgruppen för utbildningen finns representanter från det specifika yrkesområdet \nrepresenterade, där kompetensbehovet synliggörs utifrån tandsköterskans yrkesroll för att säkra \nkvaliteten i utbildningen. \n\nUnder utbildningens gång är gästföreläsare från arbetslivet ofta anlitade i specialämnen i olika \nkurser. Samt att gästföreläsaren kan vara behjälplig med att formulera examinationsuppgifter som \nhar anknytning till föreläsningen och området. Samt att vi kommer att förlägga vissa \nutbildningsmoment inom berörd verksamhet, där vi har gott samarbete med olika enheter. Vi har \nett stark nätverk inom arbetslivet i form av dialog och möten, för att säkerställa kvaliteten i \nutbildningen, som den ansvarig utbildningsledare har som uppgift i sitt uppdrag. Vi har även ett \nmycket god nätverk inom Folktandvården Kronoberg som möjliggör många studiebesök inom de \nolika verksamheter för att den blivande tandsköterskan ska få en god förståelse för de olika \nspecialiteter inom tandvården. \n\nSida 16 (20)\n\nUtbildningsplan för yrkeshögskoleutbildning\nUtbildningsnummer: 201600220-2\n\nDatum: 2018-06-20\n\n\n\nMetoder för kunskapskontroll\n\n- Enskilda skriftliga tentamina, salstentamen\n- Fallbeskrivningar, som de studerande får läsa och diskutera/reflektera kring\n- Grupparbeten, både på centrala träffar samt via lärplattform/Fronter\n- Inlämningsuppgifter, både på centrala träffar samt via lärplattform/Fronter\n- Muntliga seminarier\n- Praktiska tentamen\n- Rumsobservationer, alternativt före, under eller efter LIA\n- Loggbok som skrivs under LIA-perioden \n- Reflektioner över LIA-perioden\n- Verksamhetens skriftliga omdöme\n\nMinst 3 delar ska bedömas och ingå i ett kursbetyg (ex. skriftlig examination, individuellt arbete \nsamt deltagande i grupparbete/handledning). För att uppnå godkänt betyg i hela kursen krävs att \nbedömning görs som godkänner vart och ett av de ingående delarna. Betygssättningen sker \nutifrån hur väl den studerande uppnår kursmålen i kursplanen. Ansvarig utbildningsledare sätter \nbetygen för hela kursen och betygen fastställs sedan i ledningsgruppen. De moment som är \nbetygsgrundande i kursen finns angivna i studiehandledningen med en specificerad beskrivning. \nOmtentamen erbjuds vid ett tillfälle in närheten till det ordinarie examinationstillfället, utöver detta \nerbjuds ett tillfälle till under terminen. Möjlighet kan också erbjudas att den studerande kan delta i \nnästkommande utbildnings motsvarande kurs, om den finns att tillgå. \n\nOm den studerande har fått en enskild handlingsplan för sina studier, ska kursen och dess \nmoment vara genomförda senast 6 månader efter sista avslutade utbildningen.  \n\nBetygskriterier och betygskrav\n\nBetygsskalan är tre-gradig utifrån följande kriterier:\n\nIcke godkänd (IG)   Ej nått kursmålen\nGodkänd (G)          Nått kursmålen med godtagbart resultat utifrån kursmålen, så att den \nstuderande kan utföra sina \n                               arbetsuppgifter med hänsyn till kvalitetskrav.\nVäl godkänd (VG)   Nått kursmålen samt, analyserat, reflekterat och kan dra olika konsekvenser. \nUtifrån analysen se \n                                samband och göra relevanta val av metoder med hänsyn till kvalitetskrav och \nutveckling.\n\nUnder LIA-perioden ger LIA-handledaren ett skriftligt omdöme utifrån kursmålen. \nUtbildningsledaren sätter det slutgiltiga betyget, i samtliga kurser. Betygen fastställs sedan av \nledningsgruppen. Samtliga kurser i utbildningen har en kursplan med tydlig beskrivning av \nsamtliga betygskriterier utifrån målen i kursen. De studerande har under hela utbildningen alltid \ntillgång till samtliga kursplaner via lärandeplattform (Fronter). Betygskriterierna ska ange vilka \nkunskapsnivå som den studerande ska uppnå för att erhålla betyg i kursen och målen i \nkursplanen utgår från nivån på kunskapskraven i ämnet. Betyget sätts sedan utifrån den \nstuderandes måluppfyllelse.\n\nEntreprenörskap i utbildningen\n\nEfter avslutad utbildning ska Tandsköterskan kunna ta initiativ till och kunna organisera \nnyskapande verksamhet. Det utgår från kreativitet, experimentlusta och förverkligande av idéer \nsom ska ses både ur arbetslivets och den studerandes perspektiv under utbildningens tid. Under \nutbildningen finns det moment där den studerande får använda sig av ett entreprenöriellt \narbetssätt som sker i form av ett förbättringsarbete i samråd med verksamheter.\n\nUnder utbildningens gång tar vi även in privata aktörer från olika verksamheter som föreläser \n\nSida 17 (20)\n\nUtbildningsplan för yrkeshögskoleutbildning\nUtbildningsnummer: 201600220-2\n\nDatum: 2018-06-20\n\n\n\nutifrån sitt perspektiv, för att inspirera till ett entreprenöriellt tankesätt. D.v.s. att kunna identifiera \nmöjligheter, vara kreativ och gå från ord till handling.\n\nVår strävan är att ge den studerande en utbildning på en så hög nivå att den ger Tandsköterskan \nen bredd och kompetens i yrkesrollen som kan ge nya möjligheter och förutsättningar till \nutveckling och nyskapande inom yrkesrollen och i verksamheter.\n\nLärarledd verksamhet som utbildningen omfattar\n\n18 tim/vecka per studerande\n\nHandledarledd verksamhet som utbildningen omfattar vid LIA\n\n35 tim/vecka per studerande\n\nKvalitetsarbete\n\nKvalitetssäkring av utbildningen\nUtvärderingsfasen\n\nEfter varje delkurs under utbildningens period ska de studerande utvärdera både sina egna \ninsatser samt utbildningsanordnarens upplägg och insatser i förhållande till mål i kursen.\n\nUtvärderingarna sker via det digitala verktyg Esmaker och de studerandes svar är anonyma. \nUtvärderingen sammanställs av ansvarig utbildningsledare och återkopplas till de studerande och \ninblandad undervisande personal.  \n\nDen ansvarige utbildningsledaren ska sedan göra ett skriftligt tillägg i utvärderingen med sina \negna kommentarer runt den avslutade kursen. Dessa utvärderingar ska skickas ut till \nledningsgruppen i samband med kallelse, och utvärderingarna tas sedan upp under \nledningsgruppsmötet. Behöver det vidtas några åtgärder utifrån utvärderingarna ska den \nansvariga utbildningsledaren se till att det sker och att det återkopplas till ledningsgruppen. \nUtvärderingarna arkiveras sedan tillsammans med ledningsgruppens handlingar. \n\nVid varje utbildningsstart utses en studeranderepresentant, samt en suppleant som ska kunna \nföra gruppens talan vid ledningsgruppens möten. Studeranderepresentanten ingår i \nledningsgruppen och har där möjlighet att lyfta frågor och synpunkter som finns direkt till \nledningsgruppen vid mötena. Studeranderepresentanten ska även erbjudas tillfälle i skolan där de \nkan ventilera gemensamma punkter som gruppen vill lyfta och få svar på.\n\nEfter avslutad utbildning gör de studerande en slututvärdering på hela utbildningen, denna \nutvärdering arkiveras i 2 år.\n\nÖversyn\n\nUtvärderingar från varje kurs i utbildningen presenteras senast vid nästkommande \nledningsgruppsmöte, den ansvarige utbildningsledaren ska också ge sina kommentarer till \nkursens upplägg och innehåll. Möjligheter att återkoppla vid ledningsgruppsmötena finns som ett \ngivet inslag i dagordningen.\n\nInitiativet till revidering kan komma från olika håll, exempelvis att ledningsgruppen ger i uppdrag \natt förändra ett moment, att de studerandes utvärderingar ligger till grund för en förändring eller att \nden ansvarige utbildningsledaren belyser ett område som behöver revideras. Beslutet fattas i \nledningsgruppen och protokollförs. \n\nVid större revideringar av en utbildning används en referensgrupp som finns knuten till \nutbildningen. I samråd bearbetas förändringar i utbildningen/kursplan fram. Förslag till \n\nSida 18 (20)\n\nUtbildningsplan för yrkeshögskoleutbildning\nUtbildningsnummer: 201600220-2\n\nDatum: 2018-06-20\n\n\n\nförändringar presenteras i samband med kallelse till ledningsgrupp och ärendet tas sedan upp och \nbeslutas på ledningsgruppsmötet. \n\nVid ett enskilt individuellt problem/situation hanteras det utifrån en upprättad handlingsplan som \nförankras i ledningsgruppen (alternativt med ledningsgruppens ordförande om det gäller en \nenskild studerandes privata förutsättningar), där finns även utbildningschefen med vid mötet.\n\nHandlingsplanen upprättas och undertecknas av den studerande samt ansvarig utbildningsledare. \nSamt att handlingsplanen ska ha ett förutbestämt datum för uppföljning.\n\nUtbildningsorganisation och ansvarsfördelning\n\nKunskapsutveckling Syd är en avdelning inom Region Kronoberg, inom förvaltningen för Regional \nutveckling. Kunskapsutveckling Syds uppdrag är att bedriva yrkeshögskoleutbildning och \ndärigenom bidra till länets kompetensförsörjning. Avdelningen har för närvarande 9 anställda som \ninnefattar utbildningschef, utbildningsledare, lärare och administratörer. Utbildningschefen har det \növergripande ansvaret för verksamheten medan utbildningsledaren ansvarar för genomförandet \nav respektive utbildning och stödjer i det arbetet ledningsgruppen med underlag för att denna ska \nkunna fullgöra sina uppgifter. Till ledningsgruppen finns också en administratör kopplad, som \nbistår med kallelse och protokoll. YH-administratören är också ansvarig för arkiv, diarieföring, \nadministrativa rutiner, dokumentation av kvalitetsarbete och rapportering av CSN. Administratören \nfinns tillgänglig för de studerande dagligen vid frågor och behov av intyg etc.  Avdelningen strävar \nefter ett ständigt utbyte mellan samtliga anställda för att arbeta utifrån en gemensam grund \nkopplat till pedagogik och rutiner, för att samtliga utbildningar ska hålla samma goda kvalitet.  \nGenom regelbundna verksamhetsmöten skapas förutsättningar för planering, erfarenhetsutbyte \noch fördelning av resurser. Vid behov av ytterligare kompetens och aktuell arbetslivsanknytning, \nanställs/anlitas personal inom vård- och omsorg eller en konsult för genomförande av vissa \nmoment i en del av kurs, eller som helhet av kurs i en utbildning. För studerande med behov av \nsärskilt pedagogiskt stöd p.g.a. funktionsnedsättning, finns en kontaktperson vid \nKunskapsutveckling Syd att tillgå.  Kontaktpersonen kan erbjuda samtal, planering och \ngenomförande av handlingsplan, samt att tillgodose de extra behov av material som finns. \nAvdelningen har också en studie- och yrkesvägledare kopplad till sig, som är delaktig under \nutformningen av kursplan, samt under antagningen.\n\nStuderandeinflytande\n\nDe studerande har inflytande över planering, genomförande och uppföljning av utbildningarna \ngenom sina respektive studeranderepresentanter i ledningsgruppen. Val av \nstuderanderepresentanter sker vid start och introduktion av ny utbildning. Finns intresse från flera \nstuderande från samma klass att vara aktiva, väljer gruppen ut en person som är representant i \nledningsgruppen.\nInför varje ledningsgruppsmöte ska studeranderepresentanten hämta in synpunkter och \ninformation från sin klass för att återkoppla till ledningsgruppen. Under sittande \nledningsgruppsmöte ges det utrymme för dialog.\nGenom kursutvärderingar får utbildningsledaren och ledningsgrupp information om de \nstuderandes åsikter om upplägg, innehåll, socialt klimat och egen insats. Det ger värdefull \ninformation för utvecklingen av utbildningens innehåll och upplägg. \n\nUtsedd studeranderepresentant för varje klass får information om och ska även intyga att ansvarig \nutbildningsledare går igenom följande moment vid introduktion. Den studerande får även skriva \nunder och bekräfta följande punkter:\n\n- att utbildningsledaren gått igenom utbildningsplanen med samtliga studerande\n- att de studerande fått kursplaner för utbildningens kurser\n- att de studerande informerats om rutinerna för betygssättning och återkoppling av \nkursutvärdering samt regler för \n  omtentamen\n- att metod och tidsplanering för LIA-anskaffning gåtts igenom\n- att utbildningsledaren med studerandegruppen gått igenom ledningsgruppens sammansättning, \n\nSida 19 (20)\n\nUtbildningsplan för yrkeshögskoleutbildning\nUtbildningsnummer: 201600220-2\n\nDatum: 2018-06-20\n\n\n\nroll och funktion i \n   utbildningen\n- eventuella avvikelser i förhållande till utbildningsplanens beskrivning redovisas till ledningsgrupp \noch studerande.\n\nSida 20 (20)\n\nUtbildningsplan för yrkeshögskoleutbildning\nUtbildningsnummer: 201600220-2\n\nDatum: 2018-06-20\n\n\n"
}