{
  "meta" : {
    "jobad" : {
      "description" : {
        "requirements" : null,
        "needs" : null,
        "company_information" : null,
        "text_formatted" : "<p>We are looking for a skilled bicycle courier who have experience in goods/food delivery. He ensures customer satisfaction and delivers goods/food safely and on time.</p><p>He must know how to use the GPS apps on a mobile phone.</p><p>Does this job sound like something for you? Then apply at jobs@amanatenterprise.se</p><p>-------------------------------------------------------------------------------------------------------------------</p><p>Vi söker duktiga Cykelbud som har erfarenhet av leverans/bud. Han se till kundnöjdhet och att levererar varor/mat på ett säkert sätt i tid.</p><p>Han måste veta hur man använder GPS-apparna på en mobiltelefon.</p><p>Låter detta jobb som något för dig? Ansök då på jobs@amanatenterprise.se</p>",
        "conditions" : null,
        "text" : "We are looking for a skilled bicycle courier who have experience in goods/food delivery. He ensures customer satisfaction and delivers goods/food safely and on time.\nHe must know how to use the GPS apps on a mobile phone.\nDoes this job sound like something for you? Then apply at jobs@amanatenterprise.se\n-------------------------------------------------------------------------------------------------------------------\nVi söker duktiga Cykelbud som har erfarenhet av leverans/bud. Han se till kundnöjdhet och att levererar varor/mat på ett säkert sätt i tid.\nHan måste veta hur man använder GPS-apparna på en mobiltelefon.\nLåter detta jobb som något för dig? Ansök då på jobs@amanatenterprise.se"
      },
      "headline" : "Cykelbud",
      "driving_license" : null,
      "employer" : {
        "email" : null,
        "phone_number" : null,
        "organization_number" : "5592140346",
        "name" : "Amanat Enterprise AB",
        "url" : "www.amanatenterprise.se",
        "workplace" : "Amanat Enterprise AB"
      },
      "removed_date" : null,
      "logo_url" : null,
      "last_publication_date" : "2022-12-31T23:59:59",
      "number_of_vacancies" : 1,
      "occupation" : {
        "concept_id" : "JjFi_LiK_yR1",
        "label" : "Cykelbud",
        "legacy_ams_taxonomy_id" : "3470"
      },
      "occupation_group" : {
        "concept_id" : "P7Ay_ooF_pri",
        "label" : "Övriga bil-, motorcykel- och cykelförare",
        "legacy_ams_taxonomy_id" : "8329"
      },
      "employment_type" : {
        "concept_id" : "PFZr_Syz_cUq",
        "label" : "Vanlig anställning",
        "legacy_ams_taxonomy_id" : "1"
      },
      "webpage_url" : "https://arbetsformedlingen.se/platsbanken/annonser/26376116",
      "driving_license_required" : false,
      "application_contacts" : [ ],
      "duration" : {
        "concept_id" : "a7uU_j21_mkL",
        "label" : "Tills vidare",
        "legacy_ams_taxonomy_id" : "1"
      },
      "nice_to_have" : {
        "education_level" : [ ],
        "work_experiences" : [ ],
        "skills" : [ ],
        "education" : [ ],
        "languages" : [ {
          "concept_id" : "NVxJ_hLg_TYS",
          "weight" : 5,
          "label" : "Engelska",
          "legacy_ams_taxonomy_id" : "283"
        } ]
      },
      "application_details" : {
        "via_af" : false,
        "email" : "jobs@amanatenterprise.se",
        "other" : null,
        "reference" : null,
        "url" : null,
        "information" : null
      },
      "source_type" : "VIA_ANNONSERA",
      "application_deadline" : "2022-12-31T23:59:59",
      "external_id" : null,
      "workplace_address" : {
        "coordinates" : [ 17.810789819579362, 59.25085036124362 ],
        "city" : "Norsborg",
        "postcode" : "14576",
        "municipality" : "Botkyrka",
        "region_concept_id" : "CifL_Rzy_Mku",
        "region" : "Stockholms län",
        "country_code" : "199",
        "region_code" : "01",
        "municipality_concept_id" : "CCVZ_JA7_d3y",
        "country_concept_id" : "i46j_HmG_v64",
        "municipality_code" : "0127",
        "street_address" : "Källåkersvägen 16",
        "country" : "Sverige"
      },
      "id" : "26376116",
      "experience_required" : true,
      "working_hours_type" : {
        "concept_id" : "947z_JGS_Uk2",
        "label" : "Deltid",
        "legacy_ams_taxonomy_id" : "2"
      },
      "access" : null,
      "timestamp" : 1659555440323,
      "must_have" : {
        "education_level" : [ ],
        "work_experiences" : [ {
          "concept_id" : "JjFi_LiK_yR1",
          "weight" : 10,
          "label" : "Cykelbud",
          "legacy_ams_taxonomy_id" : "3470"
        } ],
        "skills" : [ ],
        "education" : [ ],
        "languages" : [ ]
      },
      "occupation_field" : {
        "concept_id" : "ASGV_zcE_bWf",
        "label" : "Transport, distribution, lager",
        "legacy_ams_taxonomy_id" : "19"
      },
      "scope_of_work" : {
        "min" : 50,
        "max" : 100
      },
      "salary_type" : {
        "concept_id" : "oG8G_9cW_nRf",
        "label" : "Fast månads- vecko- eller timlön",
        "legacy_ams_taxonomy_id" : "1"
      },
      "removed" : false,
      "salary_description" : null,
      "access_to_own_car" : false,
      "publication_date" : "2022-08-03T21:37:20"
    },
    "name" : "Cykelbud",
    "user" : "kristof.fischer"
  },
  "sha1" : "8385422738293b3253ba1f7ff755ae7cc267a22f",
  "annotations" : [ {
    "preferred-label" : "Cykelbud",
    "sentiment" : "MUST_HAVE",
    "type" : "occupation-name",
    "start-position" : 0,
    "end-position" : 8,
    "concept-id" : "JjFi_LiK_yR1",
    "matched-string" : "cykelbud",
    "annotation-id" : 0
  }, {
    "preferred-label" : "Cykelbud",
    "sentiment" : "MUST_HAVE",
    "type" : "occupation-name",
    "start-position" : 447,
    "end-position" : 455,
    "concept-id" : "JjFi_LiK_yR1",
    "matched-string" : "cykelbud",
    "annotation-id" : 2
  }, {
    "preferred-label" : "Geografiskt positionssystem/GPS",
    "sentiment" : "MUST_HAVE",
    "type" : "skill",
    "start-position" : 602,
    "end-position" : 605,
    "concept-id" : "pTEz_GD2_J9b",
    "matched-string" : "gps",
    "annotation-id" : 3
  } ],
  "text" : "Cykelbud\nWe are looking for a skilled bicycle courier who have experience in goods/food delivery. He ensures customer satisfaction and delivers goods/food safely and on time.\nHe must know how to use the GPS apps on a mobile phone.\nDoes this job sound like something for you? Then apply at jobs@amanatenterprise.se\n-------------------------------------------------------------------------------------------------------------------\nVi söker duktiga Cykelbud som har erfarenhet av leverans/bud. Han se till kundnöjdhet och att levererar varor/mat på ett säkert sätt i tid.\nHan måste veta hur man använder GPS-apparna på en mobiltelefon.\nLåter detta jobb som något för dig? Ansök då på jobs@amanatenterprise.se"
}