{
  "meta" : {
    "jobad" : {
      "description" : {
        "requirements" : null,
        "needs" : null,
        "company_information" : null,
        "text_formatted" : "<p>Är du intresserad av processteknik, sugen på att jobba skift samt ingå i ett härligt gäng med kollegor? Just nu söker vi operatörer till vår massaproduktion inom blekt och oblekt fiber samt CTMP.</p><p>I den här rollen ingår du i ett dynamiskt team på Skoghalls bruk och du rapporterar till driftchefen.</p><p><strong>Karriär för ett bättre klimat. Varje dag.  </strong></p><p>Stora Enso är en ledande global leverantör av förnybara lösningar inom förpackningar, biomaterial, träprodukter och papper och med detta en del av bioekonomin. Stora Enso är även en av världens största privata skogsägare. Vi är övertygade om att allt som tillverkas av fossilbaserade material i dag kan tillverkas av träd i morgon. Hållbarhetsaspekten är djupt förankrad i vår affärsstrategi och våra ansvarsfulla affärsrutiner. </p><p><strong>Om tjänsten</strong></p><p>Som operatör på sektion Fiber/CTMP är du ansvarig för att den dagliga driften av kokeri, blekeri eller CTMP utförs på ett effektivt och säkert sätt. </p><p>I rollen följer och arbetar du för att avdelningen och Skoghalls verksamhetsmål, tillståndsgränser och riktvärden avseende produktion, miljö, och kvalitet uppfylls. Du har tillsammans med dina kollegor ett ansvar för att produktionen utförs på ett optimalt sätt för att uppnå givna mål och att uppstart, nedkörning eller avställning av olika delar inom ansvarsområdet sker på ett säkert sätt.</p><p>Här är några av de dagliga arbetsuppgifterna:</p><ul><li>Processövervakning som i huvudsak utförs från manöverrum</li><li>Kontinuerlig rondering där du utför förebyggande operatörsunderhållsarbete för att identifiera och avhjälpa brister och på så sätt säkerställa effektiv drift</li><li>Externa kontakter som består av kunder, leverantörer för utrustning och verktyg samt för formfiberteknik</li><li>Aktivt delta i förbättringsarbeten som rör produktionen</li></ul><p><br></p><p>Hos oss är säkerheten A och O, därför är det viktigt att du aktivt värnar om denna både för dig själv och dina kollegor.</p><p><strong>Vad vi erbjuder </strong></p><p>Vi tror att våra medarbetare är nyckeln till framgång, därför erbjuder vi ett komplett förmånspaket för att engagera och motivera våra medarbetare samt möjliggöra professionell utveckling, karriärsteg och välbefinnande. Som medarbetare, får du också vara med på resan som Stora Enso är på - att omvandlas från ett traditionellt skogsindustriföretag till ett tillväxtföretag inom förnybara material - en industri med stor potential som drivs av globala megatrender. </p><p><strong>Vem söker vi</strong></p><p>För att trivas och lyckas i den här rollen är det viktigt att du är en lagspelare som trivs med att samarbeta och du motiveras av och tar dig gärna an utmaningar med ett starkt lösningsfokus. </p><p>Som person är du driven och engagerad och du har ett stort tekniskt intresse. Eftersom du kommer att jobba med underhållsarbete så är det meriterande om du har kunskap och erfarenhet av detta samt inom automation. Vi värdesätter även om du har arbetslivserfarenhet som processoperatör. </p><p>Då tjänsten innebär skiftgång via kontinuerligt 3-skift är det en förutsättning att du trivs med och har möjlighet att jobba på ett schema som spänner över dygnets alla timmar och årets alla dagar.</p><p>Vi söker dig som har teknisk gymnasieexamen eller eftergymnasial utbildning från Yrkeshögskola inom exempelvis processteknik, driftteknik eller annan teknisk utbildning. Du har god datorvana, hanterar svenska och engelska obehindrat i både tal och skrift. </p><p><strong>Övrig information </strong></p><p>Har du frågor om tjänsten är du välkommen att kontakta rekryterande chefer Jörgen Olsson på tel. 072 – 455 61 63 eller Anders Waller på tel. 070 – 282 58 07. Facklig kontaktperson på Pappers, Johan Ramström, tel. 072 – 457 46 43.</p><p>Sista ansökan är den 21 augusti men urval sker löpande så skicka gärna in din ansökan redan nu. Tjänsten kan komma att tillsättas under pågående annonsering. Vi tar endast emot ansökningar som lämnas in genom vårt rekryteringssystem. I din ansökan ska CV, personligt brev och betyg/kursbetyg finnas med.</p><p>Vi tror att mångfald stärker vår konkurrenskraft och bidrar till bättre beslutsfattande. Olika arbetsgrupper med olika bakgrund hjälper oss att utforska olika perspektiv och utmanar vårt sätt att tänka. Vi arbetar aktivt för att öka mångfalden på arbetsplatsen och välkomnar sökande med olika bakgrund. Stora Enso är en arbetsgivare för lika möjligheter som följer icke-diskriminerande metoder.</p><p>Baserat på geografiskt läge och nivå för positionen kan den normala rekryteringsprocessen dessutom innebära videointervju, lämplighetstester och övriga åtgärder inför anställning, såsom bakgrundskontroller, referenser, hälsokontroll och drogtest, som en del av slutskedet i processen.</p><p><br></p><p><em>Divisionen Packaging Materials strävar efter att leda utvecklingen av cirkulära förpackningar och tillhandahålla förpackningsmaterial i premiumkvalitet baserade på nyfiber och återvunnen fiber. Med fokus på dagens miljömedvetna konsumenter hjälper Stora Enso kunderna att ersätta fossilbaserade material med förnybara, återvinningsbara och miljövänliga alternativ för deras dryckes-, livsmedels-, läkemedels- och transportförpackningar. Ett brett sortiment av barriärskikt möjliggör designoptimering för mer krävande slutanvändningsområden.</em></p><p>Se vår film: https://www.youtube.com/watch?v=rUElPYaxgqs&amp;t</p><p><br></p>",
        "conditions" : null,
        "text" : "Är du intresserad av processteknik, sugen på att jobba skift samt ingå i ett härligt gäng med kollegor? Just nu söker vi operatörer till vår massaproduktion inom blekt och oblekt fiber samt CTMP.\nI den här rollen ingår du i ett dynamiskt team på Skoghalls bruk och du rapporterar till driftchefen.\nKarriär för ett bättre klimat. Varje dag.  \nStora Enso är en ledande global leverantör av förnybara lösningar inom förpackningar, biomaterial, träprodukter och papper och med detta en del av bioekonomin. Stora Enso är även en av världens största privata skogsägare. Vi är övertygade om att allt som tillverkas av fossilbaserade material i dag kan tillverkas av träd i morgon. Hållbarhetsaspekten är djupt förankrad i vår affärsstrategi och våra ansvarsfulla affärsrutiner. \nOm tjänsten\nSom operatör på sektion Fiber/CTMP är du ansvarig för att den dagliga driften av kokeri, blekeri eller CTMP utförs på ett effektivt och säkert sätt. \nI rollen följer och arbetar du för att avdelningen och Skoghalls verksamhetsmål, tillståndsgränser och riktvärden avseende produktion, miljö, och kvalitet uppfylls. Du har tillsammans med dina kollegor ett ansvar för att produktionen utförs på ett optimalt sätt för att uppnå givna mål och att uppstart, nedkörning eller avställning av olika delar inom ansvarsområdet sker på ett säkert sätt.\nHär är några av de dagliga arbetsuppgifterna:\nProcessövervakning som i huvudsak utförs från manöverrum\nKontinuerlig rondering där du utför förebyggande operatörsunderhållsarbete för att identifiera och avhjälpa brister och på så sätt säkerställa effektiv drift\nExterna kontakter som består av kunder, leverantörer för utrustning och verktyg samt för formfiberteknik\nAktivt delta i förbättringsarbeten som rör produktionen\n\n\n\nHos oss är säkerheten A och O, därför är det viktigt att du aktivt värnar om denna både för dig själv och dina kollegor.\nVad vi erbjuder \nVi tror att våra medarbetare är nyckeln till framgång, därför erbjuder vi ett komplett förmånspaket för att engagera och motivera våra medarbetare samt möjliggöra professionell utveckling, karriärsteg och välbefinnande. Som medarbetare, får du också vara med på resan som Stora Enso är på - att omvandlas från ett traditionellt skogsindustriföretag till ett tillväxtföretag inom förnybara material - en industri med stor potential som drivs av globala megatrender. \nVem söker vi\nFör att trivas och lyckas i den här rollen är det viktigt att du är en lagspelare som trivs med att samarbeta och du motiveras av och tar dig gärna an utmaningar med ett starkt lösningsfokus. \nSom person är du driven och engagerad och du har ett stort tekniskt intresse. Eftersom du kommer att jobba med underhållsarbete så är det meriterande om du har kunskap och erfarenhet av detta samt inom automation. Vi värdesätter även om du har arbetslivserfarenhet som processoperatör. \nDå tjänsten innebär skiftgång via kontinuerligt 3-skift är det en förutsättning att du trivs med och har möjlighet att jobba på ett schema som spänner över dygnets alla timmar och årets alla dagar.\nVi söker dig som har teknisk gymnasieexamen eller eftergymnasial utbildning från Yrkeshögskola inom exempelvis processteknik, driftteknik eller annan teknisk utbildning. Du har god datorvana, hanterar svenska och engelska obehindrat i både tal och skrift. \nÖvrig information \nHar du frågor om tjänsten är du välkommen att kontakta rekryterande chefer Jörgen Olsson på tel. 072 – 455 61 63 eller Anders Waller på tel. 070 – 282 58 07. Facklig kontaktperson på Pappers, Johan Ramström, tel. 072 – 457 46 43.\nSista ansökan är den 21 augusti men urval sker löpande så skicka gärna in din ansökan redan nu. Tjänsten kan komma att tillsättas under pågående annonsering. Vi tar endast emot ansökningar som lämnas in genom vårt rekryteringssystem. I din ansökan ska CV, personligt brev och betyg/kursbetyg finnas med.\nVi tror att mångfald stärker vår konkurrenskraft och bidrar till bättre beslutsfattande. Olika arbetsgrupper med olika bakgrund hjälper oss att utforska olika perspektiv och utmanar vårt sätt att tänka. Vi arbetar aktivt för att öka mångfalden på arbetsplatsen och välkomnar sökande med olika bakgrund. Stora Enso är en arbetsgivare för lika möjligheter som följer icke-diskriminerande metoder.\nBaserat på geografiskt läge och nivå för positionen kan den normala rekryteringsprocessen dessutom innebära videointervju, lämplighetstester och övriga åtgärder inför anställning, såsom bakgrundskontroller, referenser, hälsokontroll och drogtest, som en del av slutskedet i processen.\n\n\nDivisionen Packaging Materials strävar efter att leda utvecklingen av cirkulära förpackningar och tillhandahålla förpackningsmaterial i premiumkvalitet baserade på nyfiber och återvunnen fiber. Med fokus på dagens miljömedvetna konsumenter hjälper Stora Enso kunderna att ersätta fossilbaserade material med förnybara, återvinningsbara och miljövänliga alternativ för deras dryckes-, livsmedels-, läkemedels- och transportförpackningar. Ett brett sortiment av barriärskikt möjliggör designoptimering för mer krävande slutanvändningsområden.\nSe vår film: https://www.youtube.com/watch?v=rUElPYaxgqs&t"
      },
      "headline" : "Operatörer till produktion massa, Stora Enso Skoghalls bruk",
      "driving_license" : null,
      "employer" : {
        "email" : null,
        "phone_number" : null,
        "organization_number" : "5561733360",
        "name" : "Stora Enso AB",
        "url" : "www.storaenso.com",
        "workplace" : "Stora Enso AB"
      },
      "removed_date" : null,
      "logo_url" : null,
      "last_publication_date" : "2022-08-21T23:59:59",
      "number_of_vacancies" : 3,
      "occupation" : {
        "concept_id" : "h4wH_7kG_UTN",
        "label" : "Processoperatör, pappersmassa",
        "legacy_ams_taxonomy_id" : "5588"
      },
      "occupation_group" : {
        "concept_id" : "4obu_LL6_RqJ",
        "label" : "Processoperatörer, pappersmassa",
        "legacy_ams_taxonomy_id" : "8171"
      },
      "employment_type" : {
        "concept_id" : "PFZr_Syz_cUq",
        "label" : "Vanlig anställning",
        "legacy_ams_taxonomy_id" : "1"
      },
      "webpage_url" : "https://arbetsformedlingen.se/platsbanken/annonser/26319234",
      "driving_license_required" : false,
      "application_contacts" : [ ],
      "duration" : {
        "concept_id" : "a7uU_j21_mkL",
        "label" : "Tills vidare",
        "legacy_ams_taxonomy_id" : "1"
      },
      "nice_to_have" : {
        "education_level" : [ ],
        "work_experiences" : [ {
          "concept_id" : "h4wH_7kG_UTN",
          "weight" : 5,
          "label" : "Processoperatör, pappersmassa",
          "legacy_ams_taxonomy_id" : "5588"
        } ],
        "skills" : [ ],
        "education" : [ ],
        "languages" : [ ]
      },
      "application_details" : {
        "via_af" : false,
        "email" : null,
        "other" : null,
        "reference" : null,
        "url" : "https://jobs.storaenso.com/job-invite/6437/",
        "information" : null
      },
      "source_type" : "VIA_ANNONSERA",
      "application_deadline" : "2022-08-21T23:59:59",
      "external_id" : null,
      "workplace_address" : {
        "coordinates" : [ 13.467249622097436, 59.325110699261565 ],
        "city" : "Skoghall",
        "postcode" : "66329",
        "municipality" : "Hammarö",
        "region_concept_id" : "EVVp_h6U_GSZ",
        "region" : "Värmlands län",
        "country_code" : "199",
        "region_code" : "17",
        "municipality_concept_id" : "x5qW_BXr_aut",
        "country_concept_id" : "i46j_HmG_v64",
        "municipality_code" : "1761",
        "street_address" : "Bruksgatan",
        "country" : "Sverige"
      },
      "id" : "26319234",
      "experience_required" : true,
      "working_hours_type" : {
        "concept_id" : "6YE1_gAC_R2G",
        "label" : "Heltid",
        "legacy_ams_taxonomy_id" : "1"
      },
      "access" : null,
      "timestamp" : 1659077125316,
      "must_have" : {
        "education_level" : [ ],
        "work_experiences" : [ ],
        "skills" : [ ],
        "education" : [ ],
        "languages" : [ ]
      },
      "occupation_field" : {
        "concept_id" : "wTEr_CBC_bqh",
        "label" : "Industriell tillverkning",
        "legacy_ams_taxonomy_id" : "9"
      },
      "scope_of_work" : {
        "min" : 0,
        "max" : 100
      },
      "salary_type" : {
        "concept_id" : "oG8G_9cW_nRf",
        "label" : "Fast månads- vecko- eller timlön",
        "legacy_ams_taxonomy_id" : "1"
      },
      "removed" : false,
      "salary_description" : null,
      "access_to_own_car" : false,
      "publication_date" : "2022-07-29T08:45:25"
    },
    "name" : "Operatörer till produktion massa, Stora Enso Skoghalls bruk",
    "user" : "kristof.fischer"
  },
  "sha1" : "be10517b5a1e8fd9295ab2d84fbc306876e74118",
  "annotations" : [ {
    "preferred-label" : "Processoperatör, papper",
    "type" : "occupation-name",
    "start-position" : 0,
    "end-position" : 10,
    "concept-id" : "a6Hu_zpi_ALp",
    "matched-string" : "Operatörer",
    "annotation-id" : 11
  }, {
    "preferred-label" : "Processoperatör, papper",
    "type" : "occupation-name",
    "start-position" : 181,
    "end-position" : 191,
    "concept-id" : "a6Hu_zpi_ALp",
    "matched-string" : "operatörer",
    "annotation-id" : 12
  }, {
    "preferred-label" : "Processoperatör, papper",
    "type" : "occupation-name",
    "start-position" : 848,
    "end-position" : 856,
    "concept-id" : "a6Hu_zpi_ALp",
    "matched-string" : "operatör",
    "annotation-id" : 13
  }, {
    "preferred-label" : "Processövervakning",
    "sentiment" : "MUST_HAVE",
    "type" : "skill",
    "start-position" : 1433,
    "end-position" : 1451,
    "concept-id" : "aF3J_SgE_uck",
    "matched-string" : "processövervakning",
    "annotation-id" : 2
  }, {
    "preferred-label" : "underhåll och reparation",
    "sentiment" : "MUST_HAVE",
    "type" : "esco-skill",
    "start-position" : 1526,
    "end-position" : 1564,
    "concept-id" : "i19U_G6R_t19",
    "matched-string" : "förebyggande operatörsunderhållsarbete",
    "annotation-id" : 14
  }, {
    "preferred-label" : "Processutveckling",
    "sentiment" : "MUST_HAVE",
    "type" : "skill",
    "start-position" : 1768,
    "end-position" : 1787,
    "concept-id" : "TuP9_SAc_iMs",
    "matched-string" : "förbättringsarbeten",
    "annotation-id" : 15
  }, {
    "preferred-label" : "samarbeta med kolleger",
    "sentiment" : "MUST_HAVE",
    "type" : "esco-skill",
    "start-position" : 2529,
    "end-position" : 2538,
    "concept-id" : "X15R_797_q62",
    "matched-string" : "samarbeta",
    "annotation-id" : 16
  }, {
    "preferred-label" : "Lösningsfokuserat arbetssätt",
    "sentiment" : "MUST_HAVE",
    "type" : "skill",
    "start-position" : 2606,
    "end-position" : 2619,
    "concept-id" : "94uF_bkH_QF5",
    "matched-string" : "lösningsfokus",
    "annotation-id" : 17
  }, {
    "preferred-label" : "underhåll och reparation",
    "sentiment" : "NICE_TO_HAVE",
    "type" : "esco-skill",
    "start-position" : 2733,
    "end-position" : 2749,
    "concept-id" : "i19U_G6R_t19",
    "matched-string" : "underhållsarbete",
    "annotation-id" : 18
  }, {
    "preferred-label" : "Automationsteknik",
    "sentiment" : "NICE_TO_HAVE",
    "type" : "skill",
    "start-position" : 2824,
    "end-position" : 2834,
    "concept-id" : "MT1a_Nyq_DGQ",
    "matched-string" : "automation",
    "annotation-id" : 4
  }, {
    "preferred-label" : "Processoperatör, papper",
    "sentiment" : "NICE_TO_HAVE",
    "type" : "occupation-name",
    "start-position" : 2891,
    "end-position" : 2906,
    "concept-id" : "a6Hu_zpi_ALp",
    "matched-string" : "processoperatör",
    "annotation-id" : 19
  }, {
    "preferred-label" : "Skiftarbete",
    "type" : "work-place-environment",
    "start-position" : 2929,
    "end-position" : 2938,
    "concept-id" : "YnG9_nVP_CsZ",
    "matched-string" : "skiftgång",
    "annotation-id" : 20
  }, {
    "preferred-label" : "Teknik och teknisk industri, övrig och ospecificerad utbildning",
    "sentiment" : "MUST_HAVE",
    "type" : "sun-education-field-3",
    "start-position" : 3128,
    "end-position" : 3150,
    "concept-id" : "ex8F_PzU_aqT",
    "matched-string" : "teknisk gymnasieexamen",
    "annotation-id" : 21
  }, {
    "preferred-label" : "Universitets- eller högskoleutbildning",
    "sentiment" : "MUST_HAVE",
    "type" : "sni-level-4",
    "start-position" : 3157,
    "end-position" : 3182,
    "concept-id" : "m1vC_Ssq_5Y7",
    "matched-string" : "eftergymnasial utbildning",
    "annotation-id" : 5
  }, {
    "preferred-label" : "Processteknik",
    "sentiment" : "MUST_HAVE",
    "type" : "skill",
    "start-position" : 3218,
    "end-position" : 3231,
    "concept-id" : "Jgmc_3hD_JEt",
    "matched-string" : "processteknik",
    "annotation-id" : 6
  }, {
    "preferred-label" : null,
    "sentiment" : "MUST_HAVE",
    "type" : "skill",
    "start-position" : 3233,
    "end-position" : 3244,
    "concept-id" : null,
    "matched-string" : "driftteknik",
    "annotation-id" : 22
  }, {
    "preferred-label" : "Annan utbildning inom teknik och teknisk industri",
    "sentiment" : "MUST_HAVE",
    "type" : "sun-education-field-4",
    "start-position" : 3251,
    "end-position" : 3275,
    "concept-id" : "NKNc_sE8_2ok",
    "matched-string" : "annan teknisk utbildning",
    "annotation-id" : 23
  }, {
    "preferred-label" : "använda dator",
    "sentiment" : "MUST_HAVE",
    "type" : "esco-skill",
    "start-position" : 3284,
    "end-position" : 3297,
    "concept-id" : "HEbR_xrb_MpT",
    "matched-string" : "god datorvana",
    "annotation-id" : 24
  }, {
    "preferred-label" : "Svenska",
    "sentiment" : "MUST_HAVE",
    "type" : "language",
    "start-position" : 3308,
    "end-position" : 3315,
    "concept-id" : "zSLA_vw2_FXN",
    "matched-string" : "svenska",
    "annotation-id" : 7
  }, {
    "preferred-label" : "Engelska",
    "sentiment" : "MUST_HAVE",
    "type" : "language",
    "start-position" : 3320,
    "end-position" : 3328,
    "concept-id" : "NVxJ_hLg_TYS",
    "matched-string" : "engelska",
    "annotation-id" : 8
  } ],
  "text" : "Operatörer till produktion massa, Stora Enso Skoghalls bruk\nÄr du intresserad av processteknik, sugen på att jobba skift samt ingå i ett härligt gäng med kollegor? Just nu söker vi operatörer till vår massaproduktion inom blekt och oblekt fiber samt CTMP.\nI den här rollen ingår du i ett dynamiskt team på Skoghalls bruk och du rapporterar till driftchefen.\nKarriär för ett bättre klimat. Varje dag.  \nStora Enso är en ledande global leverantör av förnybara lösningar inom förpackningar, biomaterial, träprodukter och papper och med detta en del av bioekonomin. Stora Enso är även en av världens största privata skogsägare. Vi är övertygade om att allt som tillverkas av fossilbaserade material i dag kan tillverkas av träd i morgon. Hållbarhetsaspekten är djupt förankrad i vår affärsstrategi och våra ansvarsfulla affärsrutiner. \nOm tjänsten\nSom operatör på sektion Fiber/CTMP är du ansvarig för att den dagliga driften av kokeri, blekeri eller CTMP utförs på ett effektivt och säkert sätt. \nI rollen följer och arbetar du för att avdelningen och Skoghalls verksamhetsmål, tillståndsgränser och riktvärden avseende produktion, miljö, och kvalitet uppfylls. Du har tillsammans med dina kollegor ett ansvar för att produktionen utförs på ett optimalt sätt för att uppnå givna mål och att uppstart, nedkörning eller avställning av olika delar inom ansvarsområdet sker på ett säkert sätt.\nHär är några av de dagliga arbetsuppgifterna:\nProcessövervakning som i huvudsak utförs från manöverrum\nKontinuerlig rondering där du utför förebyggande operatörsunderhållsarbete för att identifiera och avhjälpa brister och på så sätt säkerställa effektiv drift\nExterna kontakter som består av kunder, leverantörer för utrustning och verktyg samt för formfiberteknik\nAktivt delta i förbättringsarbeten som rör produktionen\n\n\n\nHos oss är säkerheten A och O, därför är det viktigt att du aktivt värnar om denna både för dig själv och dina kollegor.\nVad vi erbjuder \nVi tror att våra medarbetare är nyckeln till framgång, därför erbjuder vi ett komplett förmånspaket för att engagera och motivera våra medarbetare samt möjliggöra professionell utveckling, karriärsteg och välbefinnande. Som medarbetare, får du också vara med på resan som Stora Enso är på - att omvandlas från ett traditionellt skogsindustriföretag till ett tillväxtföretag inom förnybara material - en industri med stor potential som drivs av globala megatrender. \nVem söker vi\nFör att trivas och lyckas i den här rollen är det viktigt att du är en lagspelare som trivs med att samarbeta och du motiveras av och tar dig gärna an utmaningar med ett starkt lösningsfokus. \nSom person är du driven och engagerad och du har ett stort tekniskt intresse. Eftersom du kommer att jobba med underhållsarbete så är det meriterande om du har kunskap och erfarenhet av detta samt inom automation. Vi värdesätter även om du har arbetslivserfarenhet som processoperatör. \nDå tjänsten innebär skiftgång via kontinuerligt 3-skift är det en förutsättning att du trivs med och har möjlighet att jobba på ett schema som spänner över dygnets alla timmar och årets alla dagar.\nVi söker dig som har teknisk gymnasieexamen eller eftergymnasial utbildning från Yrkeshögskola inom exempelvis processteknik, driftteknik eller annan teknisk utbildning. Du har god datorvana, hanterar svenska och engelska obehindrat i både tal och skrift. \nÖvrig information \nHar du frågor om tjänsten är du välkommen att kontakta rekryterande chefer Jörgen Olsson på tel. 072 – 455 61 63 eller Anders Waller på tel. 070 – 282 58 07. Facklig kontaktperson på Pappers, Johan Ramström, tel. 072 – 457 46 43.\nSista ansökan är den 21 augusti men urval sker löpande så skicka gärna in din ansökan redan nu. Tjänsten kan komma att tillsättas under pågående annonsering. Vi tar endast emot ansökningar som lämnas in genom vårt rekryteringssystem. I din ansökan ska CV, personligt brev och betyg/kursbetyg finnas med.\nVi tror att mångfald stärker vår konkurrenskraft och bidrar till bättre beslutsfattande. Olika arbetsgrupper med olika bakgrund hjälper oss att utforska olika perspektiv och utmanar vårt sätt att tänka. Vi arbetar aktivt för att öka mångfalden på arbetsplatsen och välkomnar sökande med olika bakgrund. Stora Enso är en arbetsgivare för lika möjligheter som följer icke-diskriminerande metoder.\nBaserat på geografiskt läge och nivå för positionen kan den normala rekryteringsprocessen dessutom innebära videointervju, lämplighetstester och övriga åtgärder inför anställning, såsom bakgrundskontroller, referenser, hälsokontroll och drogtest, som en del av slutskedet i processen.\n\n\nDivisionen Packaging Materials strävar efter att leda utvecklingen av cirkulära förpackningar och tillhandahålla förpackningsmaterial i premiumkvalitet baserade på nyfiber och återvunnen fiber. Med fokus på dagens miljömedvetna konsumenter hjälper Stora Enso kunderna att ersätta fossilbaserade material med förnybara, återvinningsbara och miljövänliga alternativ för deras dryckes-, livsmedels-, läkemedels- och transportförpackningar. Ett brett sortiment av barriärskikt möjliggör designoptimering för mer krävande slutanvändningsområden.\nSe vår film: https://www.youtube.com/watch?v=rUElPYaxgqs&t"
}