{
  "meta" : {
    "jobad" : {
      "description" : {
        "requirements" : null,
        "needs" : null,
        "company_information" : null,
        "text_formatted" : "<p><br></p><p><strong>Mister York expanderar och söker stjärnor till VÄXJÖ!</strong></p><p>Det började som en food truck på Stortorget i Kalmar direkt efter studenten år 2020. Coronapandemin slog hårt och arbetslösheten steg. Två vänner bestämde sig då för att laga burgare i sin nyinköpta food truck för att sprida glädje till folket. Burgarna visade sig bli en fortsatt enorm succé. Verksamheten finns idag på flera olika orter och har en tydlig expansionsplan för framtiden där Växjö är vårt senaste tillskott!</p><p> </p><p><strong>Tjänst</strong></p><p>Denna tjänst varierar mellan 70-100%. Arbetstid kan variera alla dagar i veckan. Tjänsten tillträds omgående.</p><p>Tjänsten tillsätts löpande, så tveka inte på att söka! </p><p><br></p><p><strong>Rollen som Team Member</strong></p><p>Vi söker dig som är ansvarstagande, utåtriktad, engagerad &amp; duktig på att samarbeta väl i grupp. Du kommer att jobba i ett sammansvetsat team för att leverera mat &amp; service i världsklass.</p><p>Dina arbetsuppgifter som <strong>Team Member</strong> kommer innefatta bland annat:</p><p>Förberedelser av tillbehör, tillagning av våra prisbelönta burgare, städning samt mottagande av kunder i kassan.</p><p><br></p><p>Hög kvalitet är något som genomsyrar hela vår företagskultur. Alla som arbetar inom vår verksamhet ska veta varför de går till jobbet varje morgon och hur de är med och bidrar.</p><p> </p><p><strong>VÅRA FÖRVÄNTNINGAR PÅ DIG:</strong></p><p><strong>- </strong>Du har rätt approach och vill ha roligt på jobbet.</p><p><strong>-</strong> Du är en person som vill utvecklas och lära dig nya saker.</p><p><strong>- </strong>Du är en lagspelare som samarbetar bra med andra. </p><p><strong>-</strong> Du uppskattar att jobba i ett högt tempo.</p><p><strong>-</strong> Du är noggrann och effektiv. </p><p> </p><p><em>På Mister York så rekryterar vi utifrån personlighet och potential och inte endast utifrån tidigare erfarenheter. Vi erbjuder er full utbildning på plats.</em></p><p><em>Mister York är anslutna till kollektivavtal.</em></p>",
        "conditions" : null,
        "text" : "Mister York expanderar och söker stjärnor till VÄXJÖ!\nDet började som en food truck på Stortorget i Kalmar direkt efter studenten år 2020. Coronapandemin slog hårt och arbetslösheten steg. Två vänner bestämde sig då för att laga burgare i sin nyinköpta food truck för att sprida glädje till folket. Burgarna visade sig bli en fortsatt enorm succé. Verksamheten finns idag på flera olika orter och har en tydlig expansionsplan för framtiden där Växjö är vårt senaste tillskott!\n \nTjänst\nDenna tjänst varierar mellan 70-100%. Arbetstid kan variera alla dagar i veckan. Tjänsten tillträds omgående.\nTjänsten tillsätts löpande, så tveka inte på att söka! \n\n\nRollen som Team Member\nVi söker dig som är ansvarstagande, utåtriktad, engagerad & duktig på att samarbeta väl i grupp. Du kommer att jobba i ett sammansvetsat team för att leverera mat & service i världsklass.\nDina arbetsuppgifter som Team Member kommer innefatta bland annat:\nFörberedelser av tillbehör, tillagning av våra prisbelönta burgare, städning samt mottagande av kunder i kassan.\n\n\nHög kvalitet är något som genomsyrar hela vår företagskultur. Alla som arbetar inom vår verksamhet ska veta varför de går till jobbet varje morgon och hur de är med och bidrar.\n \nVÅRA FÖRVÄNTNINGAR PÅ DIG:\n- Du har rätt approach och vill ha roligt på jobbet.\n- Du är en person som vill utvecklas och lära dig nya saker.\n- Du är en lagspelare som samarbetar bra med andra. \n- Du uppskattar att jobba i ett högt tempo.\n- Du är noggrann och effektiv. \n \nPå Mister York så rekryterar vi utifrån personlighet och potential och inte endast utifrån tidigare erfarenheter. Vi erbjuder er full utbildning på plats.\nMister York är anslutna till kollektivavtal."
      },
      "headline" : "Team Member 70-100% - MISTER YORK Växjö",
      "driving_license" : null,
      "employer" : {
        "email" : null,
        "phone_number" : null,
        "organization_number" : "5592584360",
        "name" : "Mister York AB",
        "url" : "https://www.misteryork.se/",
        "workplace" : "Mister York Växjö"
      },
      "removed_date" : null,
      "logo_url" : "https://www.arbetsformedlingen.se/rest/arbetsgivare/rest/af/v3/arbetsplatser/88146187/logotyper/logo.png",
      "last_publication_date" : "2022-08-06T00:00:00",
      "number_of_vacancies" : 3,
      "occupation" : {
        "concept_id" : "yXRQ_Ad9_E8V",
        "label" : "Restaurangbiträde",
        "legacy_ams_taxonomy_id" : "5555"
      },
      "occupation_group" : {
        "concept_id" : "tPox_ie4_X9X",
        "label" : "Restaurang- och köksbiträden m.fl.",
        "legacy_ams_taxonomy_id" : "9412"
      },
      "employment_type" : {
        "concept_id" : "PFZr_Syz_cUq",
        "label" : "Vanlig anställning",
        "legacy_ams_taxonomy_id" : "1"
      },
      "webpage_url" : "https://arbetsformedlingen.se/platsbanken/annonser/26305712",
      "driving_license_required" : false,
      "application_contacts" : [ {
        "description" : null,
        "email" : "matilda.wikman@misteryork.se",
        "telephone" : null,
        "name" : "Matilda Wikman",
        "contact_type" : "Etablering & Rekryteringsansvarig"
      } ],
      "duration" : {
        "concept_id" : "a7uU_j21_mkL",
        "label" : "Tills vidare",
        "legacy_ams_taxonomy_id" : "1"
      },
      "nice_to_have" : {
        "education_level" : [ ],
        "work_experiences" : [ ],
        "skills" : [ ],
        "education" : [ ],
        "languages" : [ ]
      },
      "application_details" : {
        "via_af" : false,
        "email" : null,
        "other" : null,
        "reference" : null,
        "url" : "https://career.misteryork.se/jobs/1908766-team-member-70-100",
        "information" : null
      },
      "source_type" : "VIA_ANNONSERA",
      "application_deadline" : "2022-08-06T00:00:00",
      "external_id" : null,
      "workplace_address" : {
        "coordinates" : [ 14.78380230987953, 56.88125391128206 ],
        "city" : "Växjö",
        "postcode" : "35246",
        "municipality" : "Växjö",
        "region_concept_id" : "tF3y_MF9_h5G",
        "region" : "Kronobergs län",
        "country_code" : "199",
        "region_code" : "07",
        "municipality_concept_id" : "mmot_H3A_auW",
        "country_concept_id" : "i46j_HmG_v64",
        "municipality_code" : "0780",
        "street_address" : "Arabygatan 13",
        "country" : "Sverige"
      },
      "id" : "26305712",
      "experience_required" : true,
      "working_hours_type" : {
        "concept_id" : "6YE1_gAC_R2G",
        "label" : "Heltid",
        "legacy_ams_taxonomy_id" : "1"
      },
      "access" : null,
      "timestamp" : 1657201165282,
      "must_have" : {
        "education_level" : [ ],
        "work_experiences" : [ ],
        "skills" : [ ],
        "education" : [ ],
        "languages" : [ ]
      },
      "occupation_field" : {
        "concept_id" : "ScKy_FHB_7wT",
        "label" : "Hotell, restaurang, storhushåll",
        "legacy_ams_taxonomy_id" : "7"
      },
      "scope_of_work" : {
        "min" : 0,
        "max" : 100
      },
      "salary_type" : {
        "concept_id" : "oG8G_9cW_nRf",
        "label" : "Fast månads- vecko- eller timlön",
        "legacy_ams_taxonomy_id" : "1"
      },
      "removed" : false,
      "salary_description" : null,
      "access_to_own_car" : false,
      "publication_date" : "2022-07-07T15:39:25"
    },
    "name" : "Team Member 70-100% - MISTER YORK Växjö",
    "user" : "hannes"
  },
  "sha1" : "034ab284a2f9b4202127d6410d37829bdccb3713",
  "annotations" : [ {
    "preferred-label" : "Deltid",
    "sentiment" : "OFFERED",
    "type" : "worktime-extent",
    "start-position" : 12,
    "end-position" : 14,
    "concept-id" : "947z_JGS_Uk2",
    "matched-string" : "70",
    "annotation-id" : 3
  }, {
    "preferred-label" : "Heltid",
    "type" : "worktime-extent",
    "start-position" : 15,
    "end-position" : 19,
    "concept-id" : "6YE1_gAC_R2G",
    "matched-string" : "100%",
    "annotation-id" : 4
  }, {
    "preferred-label" : "Växjö",
    "type" : "municipality",
    "start-position" : 34,
    "end-position" : 39,
    "concept-id" : "mmot_H3A_auW",
    "matched-string" : "Växjö",
    "annotation-id" : 5
  }, {
    "preferred-label" : "Växjö",
    "type" : "municipality",
    "start-position" : 87,
    "end-position" : 92,
    "concept-id" : "mmot_H3A_auW",
    "matched-string" : "VÄXJÖ",
    "annotation-id" : 6
  }, {
    "preferred-label" : "Kalmar",
    "type" : "municipality",
    "start-position" : 140,
    "end-position" : 146,
    "concept-id" : "Pnmg_SgP_uHQ",
    "matched-string" : "Kalmar",
    "annotation-id" : 7
  }, {
    "preferred-label" : "Växjö",
    "type" : "municipality",
    "start-position" : 484,
    "end-position" : 489,
    "concept-id" : "mmot_H3A_auW",
    "matched-string" : "Växjö",
    "annotation-id" : 8
  }, {
    "preferred-label" : "Deltid",
    "type" : "worktime-extent",
    "start-position" : 555,
    "end-position" : 557,
    "concept-id" : "947z_JGS_Uk2",
    "matched-string" : "70",
    "annotation-id" : 9
  }, {
    "preferred-label" : "Heltid",
    "type" : "worktime-extent",
    "start-position" : 558,
    "end-position" : 562,
    "concept-id" : "6YE1_gAC_R2G",
    "matched-string" : "100%",
    "annotation-id" : 10
  }, {
    "preferred-label" : "visa ansvarstagande",
    "sentiment" : "MUST_HAVE",
    "type" : "esco-skill",
    "start-position" : 737,
    "end-position" : 751,
    "concept-id" : "bcRp_hxV_f5G",
    "matched-string" : "ansvarstagande",
    "annotation-id" : 11
  }, {
    "preferred-label" : "samarbeta med kolleger",
    "sentiment" : "MUST_HAVE",
    "type" : "esco-skill",
    "start-position" : 791,
    "end-position" : 800,
    "concept-id" : "X15R_797_q62",
    "matched-string" : "samarbeta",
    "annotation-id" : 14
  }, {
    "preferred-label" : "Gatukök",
    "sentiment" : "OFFERED",
    "type" : "skill",
    "start-position" : 1000,
    "end-position" : 1010,
    "concept-id" : "dmi6_Jfs_pso",
    "matched-string" : "tillagning",
    "annotation-id" : 15
  }, {
    "preferred-label" : "ansvara för städning",
    "type" : "esco-skill",
    "start-position" : 1040,
    "end-position" : 1048,
    "concept-id" : "2pc1_7xW_uYA",
    "matched-string" : "städning",
    "annotation-id" : 12
  }, {
    "preferred-label" : "ta emot mat- och dryckesbeställningar från kunder",
    "sentiment" : "OFFERED",
    "type" : "esco-skill",
    "start-position" : 1054,
    "end-position" : 1074,
    "concept-id" : "xHq2_765_ZC8",
    "matched-string" : "mottagande av kunder",
    "annotation-id" : 16
  }, {
    "preferred-label" : "noggrannhet",
    "sentiment" : "MUST_HAVE",
    "type" : "esco-skill",
    "start-position" : 1512,
    "end-position" : 1520,
    "concept-id" : "mrsW_EkL_KRD",
    "matched-string" : "noggrann",
    "annotation-id" : 13
  } ],
  "text" : "Team Member 70-100% - MISTER YORK Växjö\nMister York expanderar och söker stjärnor till VÄXJÖ!\nDet började som en food truck på Stortorget i Kalmar direkt efter studenten år 2020. Coronapandemin slog hårt och arbetslösheten steg. Två vänner bestämde sig då för att laga burgare i sin nyinköpta food truck för att sprida glädje till folket. Burgarna visade sig bli en fortsatt enorm succé. Verksamheten finns idag på flera olika orter och har en tydlig expansionsplan för framtiden där Växjö är vårt senaste tillskott!\n \nTjänst\nDenna tjänst varierar mellan 70-100%. Arbetstid kan variera alla dagar i veckan. Tjänsten tillträds omgående.\nTjänsten tillsätts löpande, så tveka inte på att söka! \n\n\nRollen som Team Member\nVi söker dig som är ansvarstagande, utåtriktad, engagerad & duktig på att samarbeta väl i grupp. Du kommer att jobba i ett sammansvetsat team för att leverera mat & service i världsklass.\nDina arbetsuppgifter som Team Member kommer innefatta bland annat:\nFörberedelser av tillbehör, tillagning av våra prisbelönta burgare, städning samt mottagande av kunder i kassan.\n\n\nHög kvalitet är något som genomsyrar hela vår företagskultur. Alla som arbetar inom vår verksamhet ska veta varför de går till jobbet varje morgon och hur de är med och bidrar.\n \nVÅRA FÖRVÄNTNINGAR PÅ DIG:\n- Du har rätt approach och vill ha roligt på jobbet.\n- Du är en person som vill utvecklas och lära dig nya saker.\n- Du är en lagspelare som samarbetar bra med andra. \n- Du uppskattar att jobba i ett högt tempo.\n- Du är noggrann och effektiv. \n \nPå Mister York så rekryterar vi utifrån personlighet och potential och inte endast utifrån tidigare erfarenheter. Vi erbjuder er full utbildning på plats.\nMister York är anslutna till kollektivavtal."
}