{
  "meta" : {
    "jobad" : {
      "description" : {
        "requirements" : null,
        "needs" : null,
        "company_information" : null,
        "text_formatted" : "- Vi söker dig som tillsammans med oss vill genomföra och utveckla arbetet på avloppsområdet med fokus tillsynsvägledning.\n\nTjänsten är placerad på Vatten och avloppsenheten. Enheten har ett övergripande, nationellt ansvar för avloppsfrågor. Vår huvuduppgift är lagtillämpning och utveckling av föreskrifter och tillhörande tillsynsvägledning. Vi ansvarar bland annat för vägledning om avloppsanläggningar som är dimensionerade från 200 pe och uppåt. Vi deltar också i tillståndsprövningar, beredskapsarbete, hanterar bidrag och samordnar Naturvårdsverkets arbete inom havs- och vattenförvaltning. Arbetsuppgifterna inkluderar även nationell och internationell rapportering samt att bistå Regeringskansliet med expertis i bland annat EU-processer.\n\nNaturvårdsverkets tillsynsvägledning är ett viktigt verktyg för att stötta och utveckla den operativa tillsynen av miljöfarliga verksamheter, som ofta länsstyrelser eller kommuner ansvarar för. Naturvårdsverket håller på att utveckla sina processer för tillsynsvägledning och vägledning i syfte att öka användarvänligheten och få större effekt. Den här tjänsten är ett led i att stärka vårt arbete med tillsynsvägledning.\n\nDina arbetsuppgifter \nDina huvudsakliga arbetsuppgifter kommer vara att delta i genomförandet av enhetens tillsynsvägledning av miljöfarliga verksamheter, med fokus på avloppsområdet. Du kommer samordna vårt interna tillsynsvägledningsarbete på enheten och vara enhetens kontakt gentemot andra enheter på Naturvårdsverket gällande tillsynsvägledning. Du kommer hålla ihop vår löpande tillsynsvägledning, se till att frågor fördelas och besvaras. En viktig del handlar om att administrera vårt arbete med tillsynsvägledning, bland annat i vårt ärendehanteringssystem Artvise. Med stöd av erfarna kollegor kommer du även svara på tillsynsvägledningsfrågor. Du kommer också delta i planering, genomförande, uppföljning och utveckling av tillsynsvägledningen på enheten. Dialog med frågeställare, våra jurister och kommunikatörer ingår i arbetet. \n\nI den rollen ingår att samverkan internt med andra enheter på Naturvårdsverket och med andra myndigheter. Samverkan med kommuner. verksamhetsutövare och näringsliv, är arbete du också kommer delta i. Vid behov deltar du i andra arbetsuppgifter på enheten, såsom sammanställa remissvar, bidra till yttranden och till utredning, liksom att bistå Miljödepartementet med underlag. I samtliga dessa arbetsuppgifter ingår att tillgodogöra sig information, dra slutsatser och omsätta dessa i handling. Det ingår också att skriva texter och dokumentera möten, och på sikt kunna hålla föredrag. \n\nI denna roll har du möjlighet att göra skillnad och utvecklas såväl personligen som inom ditt arbetsområde.\n\nDin kompetens\nVi söker dig som har en för arbetsuppgifterna relevant universitets-/högskoleutbildning (minst 3-årig kandidatexamen) och minst 1 års relevant arbetslivserfarenhet för tjänsten. Det är meriterande om du har erfarenhet av tillsyn eller tillsynsvägledning, gärna från kommun eller länsstyrelse. Har du erfarenhet av tillsyn eller tillsynsvägledning inom avloppsområdet eller av miljöfarliga verksamheter är det ett plus. \n\nVi lägger stor vikt vid personliga egenskaper där vi ser att du har god samarbetsförmåga och kommunikativ förmåga, liksom förmåga att ta ansvar. Att få saker att hända och löpa linan ut är en förutsättning för arbetsuppgifterna, liksom att du är självgående och tar ansvar för resultatet. Vi ser gärna att du arbetar systematiskt. Du ska kunna uttrycka dig väl skriftligt och muntligt på svenska och engelska. \n\nOm anställningen\n\nAnställningen är en visstidsanställning på heltid, 1 år. Anställningens placering är Stockholm alternativt Östersund. Tillträde snarast enligt överenskommelse. \n\nNaturvårdsverket vill erbjuda ett flexibelt arbetssätt genom möjlighet till distansarbete upp till 50% av arbetstiden. Vi eftersträvar en effektiv verksamhet, ett hållbart arbetsliv samt ökad trivsel. \n\nVi arbetar i allt större utsträckning med resfria arbetsformer men tjänsten kan innebär resor, främst inom Sverige.\n\nAnsökan\n\nVälkommen med din ansökan senast den 16 augusti. \n\nKontakt\n\n Vill du veta mer om anställningen är du välkommen att kontakta följande personer via vår kundtjänst, tel.nr. 010-698 10 00.\n\nKerstin Åstrand, chef (tillgänglig för frågor fr o m v. 32)\n\nKontaktpersoner för ST och Saco\n\n\n\nOm Naturvårdsverket\n\nNaturvårdsverket driver och samordnar arbetet för en god livsmiljö tillsammans med andra. Vi bygger vårt arbete på kunskap och visar på möjligheter för en hållbar utveckling. Vi är en miljömyndighet som arbetar på uppdrag av regeringen. Naturvårdsverket ansvarar för frågor som handlar om klimat och luft, mark, biologisk mångfald, förorenade områden, kretslopp och avfall, miljöövervakning samt miljöforskning.\n\nNaturvårdsverket eftersträvar en arbetsplats präglad av jämställdhet och mångfald. Vi ser att medarbetare med olika bakgrund och erfarenheter är en viktig förutsättning för detta.\n\nInför rekryteringsarbetet har vi tagit ställning till rekryteringskanaler och marknadsföring och undanber oss därför kontakt med mediesäljare, rekryteringssajter och liknande.",
        "conditions" : "Visstidsanställning på 1 år.\r\nEj specificerat",
        "text" : "- Vi söker dig som tillsammans med oss vill genomföra och utveckla arbetet på avloppsområdet med fokus tillsynsvägledning.\n\nTjänsten är placerad på Vatten och avloppsenheten. Enheten har ett övergripande, nationellt ansvar för avloppsfrågor. Vår huvuduppgift är lagtillämpning och utveckling av föreskrifter och tillhörande tillsynsvägledning. Vi ansvarar bland annat för vägledning om avloppsanläggningar som är dimensionerade från 200 pe och uppåt. Vi deltar också i tillståndsprövningar, beredskapsarbete, hanterar bidrag och samordnar Naturvårdsverkets arbete inom havs- och vattenförvaltning. Arbetsuppgifterna inkluderar även nationell och internationell rapportering samt att bistå Regeringskansliet med expertis i bland annat EU-processer.\n\nNaturvårdsverkets tillsynsvägledning är ett viktigt verktyg för att stötta och utveckla den operativa tillsynen av miljöfarliga verksamheter, som ofta länsstyrelser eller kommuner ansvarar för. Naturvårdsverket håller på att utveckla sina processer för tillsynsvägledning och vägledning i syfte att öka användarvänligheten och få större effekt. Den här tjänsten är ett led i att stärka vårt arbete med tillsynsvägledning.\n\nDina arbetsuppgifter \nDina huvudsakliga arbetsuppgifter kommer vara att delta i genomförandet av enhetens tillsynsvägledning av miljöfarliga verksamheter, med fokus på avloppsområdet. Du kommer samordna vårt interna tillsynsvägledningsarbete på enheten och vara enhetens kontakt gentemot andra enheter på Naturvårdsverket gällande tillsynsvägledning. Du kommer hålla ihop vår löpande tillsynsvägledning, se till att frågor fördelas och besvaras. En viktig del handlar om att administrera vårt arbete med tillsynsvägledning, bland annat i vårt ärendehanteringssystem Artvise. Med stöd av erfarna kollegor kommer du även svara på tillsynsvägledningsfrågor. Du kommer också delta i planering, genomförande, uppföljning och utveckling av tillsynsvägledningen på enheten. Dialog med frågeställare, våra jurister och kommunikatörer ingår i arbetet. \n\nI den rollen ingår att samverkan internt med andra enheter på Naturvårdsverket och med andra myndigheter. Samverkan med kommuner. verksamhetsutövare och näringsliv, är arbete du också kommer delta i. Vid behov deltar du i andra arbetsuppgifter på enheten, såsom sammanställa remissvar, bidra till yttranden och till utredning, liksom att bistå Miljödepartementet med underlag. I samtliga dessa arbetsuppgifter ingår att tillgodogöra sig information, dra slutsatser och omsätta dessa i handling. Det ingår också att skriva texter och dokumentera möten, och på sikt kunna hålla föredrag. \n\nI denna roll har du möjlighet att göra skillnad och utvecklas såväl personligen som inom ditt arbetsområde.\n\nDin kompetens\nVi söker dig som har en för arbetsuppgifterna relevant universitets-/högskoleutbildning (minst 3-årig kandidatexamen) och minst 1 års relevant arbetslivserfarenhet för tjänsten. Det är meriterande om du har erfarenhet av tillsyn eller tillsynsvägledning, gärna från kommun eller länsstyrelse. Har du erfarenhet av tillsyn eller tillsynsvägledning inom avloppsområdet eller av miljöfarliga verksamheter är det ett plus. \n\nVi lägger stor vikt vid personliga egenskaper där vi ser att du har god samarbetsförmåga och kommunikativ förmåga, liksom förmåga att ta ansvar. Att få saker att hända och löpa linan ut är en förutsättning för arbetsuppgifterna, liksom att du är självgående och tar ansvar för resultatet. Vi ser gärna att du arbetar systematiskt. Du ska kunna uttrycka dig väl skriftligt och muntligt på svenska och engelska. \n\nOm anställningen\n\nAnställningen är en visstidsanställning på heltid, 1 år. Anställningens placering är Stockholm alternativt Östersund. Tillträde snarast enligt överenskommelse. \n\nNaturvårdsverket vill erbjuda ett flexibelt arbetssätt genom möjlighet till distansarbete upp till 50% av arbetstiden. Vi eftersträvar en effektiv verksamhet, ett hållbart arbetsliv samt ökad trivsel. \n\nVi arbetar i allt större utsträckning med resfria arbetsformer men tjänsten kan innebär resor, främst inom Sverige.\n\nAnsökan\n\nVälkommen med din ansökan senast den 16 augusti. \n\nKontakt\n\n Vill du veta mer om anställningen är du välkommen att kontakta följande personer via vår kundtjänst, tel.nr. 010-698 10 00.\n\nKerstin Åstrand, chef (tillgänglig för frågor fr o m v. 32)\n\nKontaktpersoner för ST och Saco\n\n\n\nOm Naturvårdsverket\n\nNaturvårdsverket driver och samordnar arbetet för en god livsmiljö tillsammans med andra. Vi bygger vårt arbete på kunskap och visar på möjligheter för en hållbar utveckling. Vi är en miljömyndighet som arbetar på uppdrag av regeringen. Naturvårdsverket ansvarar för frågor som handlar om klimat och luft, mark, biologisk mångfald, förorenade områden, kretslopp och avfall, miljöövervakning samt miljöforskning.\n\nNaturvårdsverket eftersträvar en arbetsplats präglad av jämställdhet och mångfald. Vi ser att medarbetare med olika bakgrund och erfarenheter är en viktig förutsättning för detta.\n\nInför rekryteringsarbetet har vi tagit ställning till rekryteringskanaler och marknadsföring och undanber oss därför kontakt med mediesäljare, rekryteringssajter och liknande."
      },
      "headline" : "Handläggare avloppsfrågor",
      "driving_license" : null,
      "employer" : {
        "email" : null,
        "phone_number" : null,
        "organization_number" : "2021001975",
        "name" : "Naturvårdsverket",
        "url" : "http://www.naturvardsverket.se/",
        "workplace" : "Naturvårdsverket"
      },
      "removed_date" : null,
      "logo_url" : "https://www.arbetsformedlingen.se/rest/arbetsgivare/rest/af/v3/organisation/2021001975/logotyper/logo.png",
      "last_publication_date" : "2022-08-16T23:59:59",
      "number_of_vacancies" : 1,
      "occupation" : {
        "concept_id" : "SLfL_nQ3_MnE",
        "label" : "Miljöhandläggare",
        "legacy_ams_taxonomy_id" : "1919"
      },
      "occupation_group" : {
        "concept_id" : "rE1E_m3d_cx1",
        "label" : "Specialister inom miljöskydd och miljöteknik",
        "legacy_ams_taxonomy_id" : "2183"
      },
      "employment_type" : {
        "concept_id" : "PFZr_Syz_cUq",
        "label" : "Vanlig anställning",
        "legacy_ams_taxonomy_id" : "1"
      },
      "webpage_url" : "https://arbetsformedlingen.se/platsbanken/annonser/26298516",
      "driving_license_required" : false,
      "application_contacts" : [ ],
      "duration" : {
        "concept_id" : "qQUd_4qe_NDT",
        "label" : "6 månader eller längre",
        "legacy_ams_taxonomy_id" : "2"
      },
      "nice_to_have" : {
        "education_level" : [ ],
        "work_experiences" : [ ],
        "skills" : [ ],
        "education" : [ ],
        "languages" : [ ]
      },
      "application_details" : {
        "via_af" : false,
        "email" : null,
        "other" : null,
        "reference" : null,
        "url" : "https://web103.reachmee.com/ext/I005/1025/main?site=7&validator=459cfe39cd73a1331eefa71ddfcae080&lang=SE&rmpage=job&rmjob=1305",
        "information" : null
      },
      "source_type" : "VIA_PLATSBANKEN_DXA",
      "application_deadline" : "2022-08-16T23:59:59",
      "external_id" : "46-202100-1975-1305",
      "workplace_address" : {
        "coordinates" : [ 18.06858, 59.329323 ],
        "city" : null,
        "postcode" : null,
        "municipality" : "Stockholm",
        "region_concept_id" : "CifL_Rzy_Mku",
        "region" : "Stockholms län",
        "country_code" : "199",
        "region_code" : "01",
        "municipality_concept_id" : "AvNB_uwa_6n6",
        "country_concept_id" : "i46j_HmG_v64",
        "municipality_code" : "0180",
        "street_address" : null,
        "country" : "Sverige"
      },
      "id" : "26298516",
      "experience_required" : true,
      "working_hours_type" : {
        "concept_id" : "6YE1_gAC_R2G",
        "label" : "Heltid",
        "legacy_ams_taxonomy_id" : "1"
      },
      "access" : null,
      "timestamp" : 1657095878088,
      "must_have" : {
        "education_level" : [ ],
        "work_experiences" : [ {
          "concept_id" : "SLfL_nQ3_MnE",
          "weight" : 10,
          "label" : "Miljöhandläggare",
          "legacy_ams_taxonomy_id" : "1919"
        } ],
        "skills" : [ ],
        "education" : [ ],
        "languages" : [ ]
      },
      "occupation_field" : {
        "concept_id" : "kJeN_wmw_9wX",
        "label" : "Naturvetenskap",
        "legacy_ams_taxonomy_id" : "14"
      },
      "scope_of_work" : {
        "min" : 100,
        "max" : 100
      },
      "salary_type" : {
        "concept_id" : "oG8G_9cW_nRf",
        "label" : "Fast månads- vecko- eller timlön",
        "legacy_ams_taxonomy_id" : "1"
      },
      "removed" : false,
      "salary_description" : "Individuell lönesättning",
      "access_to_own_car" : false,
      "publication_date" : "2022-07-25T00:00:00"
    },
    "name" : "Handläggare avloppsfrågor",
    "user" : "hannes"
  },
  "sha1" : "eadd615bf3ead31577dea04560c337d529aa2b5a",
  "annotations" : [ {
    "preferred-label" : "Jurister",
    "sentiment" : "MUST_HAVE",
    "type" : "ssyk-level-3",
    "start-position" : 1996,
    "end-position" : 2004,
    "concept-id" : "qWdm_MBz_r99",
    "matched-string" : "jurister",
    "annotation-id" : 1
  }, {
    "preferred-label" : "Informatörer, kommunikatörer och PR-specialister",
    "type" : "ssyk-level-4",
    "start-position" : 2009,
    "end-position" : 2023,
    "concept-id" : "k1Nx_auG_sNh",
    "matched-string" : "kommunikatörer",
    "annotation-id" : 12
  }, {
    "preferred-label" : "Universitets- eller högskoleutbildning",
    "type" : "sni-level-5",
    "start-position" : 2809,
    "end-position" : 2841,
    "concept-id" : "4Hs1_pdH_C7k",
    "matched-string" : "universitets-/högskoleutbildning",
    "annotation-id" : 13
  }, {
    "preferred-label" : "Högskoleutbildning, generell, 3 år",
    "type" : "sun-education-level-3",
    "start-position" : 2843,
    "end-position" : 2870,
    "concept-id" : "u9Qr_2wJ_nVu",
    "matched-string" : "minst 3-årig kandidatexamen",
    "annotation-id" : 14
  }, {
    "preferred-label" : "1-2 års erfarenhet",
    "type" : "occupation-experience-year",
    "start-position" : 2882,
    "end-position" : 2917,
    "concept-id" : "LLnd_5GJ_4ju",
    "matched-string" : "1 års relevant arbetslivserfarenhet",
    "annotation-id" : 15
  }, {
    "preferred-label" : "Svenska",
    "sentiment" : "MUST_HAVE",
    "type" : "language",
    "start-position" : 3563,
    "end-position" : 3570,
    "concept-id" : "zSLA_vw2_FXN",
    "matched-string" : "svenska",
    "annotation-id" : 2
  }, {
    "preferred-label" : "Engelska",
    "sentiment" : "MUST_HAVE",
    "type" : "language",
    "start-position" : 3575,
    "end-position" : 3583,
    "concept-id" : "NVxJ_hLg_TYS",
    "matched-string" : "engelska",
    "annotation-id" : 3
  }, {
    "preferred-label" : "Allmän visstidsanställning",
    "type" : "keyword",
    "start-position" : 3625,
    "end-position" : 3644,
    "concept-id" : "hxfz_ayC_9Vd",
    "matched-string" : "visstidsanställning",
    "annotation-id" : 16
  }, {
    "preferred-label" : "Heltid",
    "type" : "worktime-extent",
    "start-position" : 3648,
    "end-position" : 3654,
    "concept-id" : "6YE1_gAC_R2G",
    "matched-string" : "heltid",
    "annotation-id" : 17
  }, {
    "preferred-label" : "Stockholm",
    "type" : "municipality",
    "start-position" : 3690,
    "end-position" : 3699,
    "concept-id" : "AvNB_uwa_6n6",
    "matched-string" : "Stockholm",
    "annotation-id" : 18
  }, {
    "preferred-label" : "Östersund",
    "type" : "municipality",
    "start-position" : 3712,
    "end-position" : 3721,
    "concept-id" : "Vt7P_856_WZS",
    "matched-string" : "Östersund",
    "annotation-id" : 19
  }, {
    "preferred-label" : "Distansarbete",
    "type" : "work-place-environment",
    "start-position" : 3843,
    "end-position" : 3856,
    "concept-id" : "uwzb_xcR_vxS",
    "matched-string" : "distansarbete",
    "annotation-id" : 20
  }, {
    "preferred-label" : "Arbetsliv",
    "sentiment" : "MUST_HAVE",
    "type" : "keyword",
    "start-position" : 3939,
    "end-position" : 3948,
    "concept-id" : "UceZ_JCp_23T",
    "matched-string" : "arbetsliv",
    "annotation-id" : 4
  }, {
    "preferred-label" : "Resor i arbetet förekommer",
    "type" : "work-place-environment",
    "start-position" : 4037,
    "end-position" : 4063,
    "concept-id" : "oaM2_JTK_muh",
    "matched-string" : "tjänsten kan innebär resor",
    "annotation-id" : 21
  }, {
    "preferred-label" : "Hållbar utveckling",
    "sentiment" : "MUST_HAVE",
    "type" : "keyword",
    "start-position" : 4554,
    "end-position" : 4572,
    "concept-id" : "RKw3_zWW_1pf",
    "matched-string" : "hållbar utveckling",
    "annotation-id" : 7
  } ],
  "text" : "Handläggare avloppsfrågor\n- Vi söker dig som tillsammans med oss vill genomföra och utveckla arbetet på avloppsområdet med fokus tillsynsvägledning.\n\nTjänsten är placerad på Vatten och avloppsenheten. Enheten har ett övergripande, nationellt ansvar för avloppsfrågor. Vår huvuduppgift är lagtillämpning och utveckling av föreskrifter och tillhörande tillsynsvägledning. Vi ansvarar bland annat för vägledning om avloppsanläggningar som är dimensionerade från 200 pe och uppåt. Vi deltar också i tillståndsprövningar, beredskapsarbete, hanterar bidrag och samordnar Naturvårdsverkets arbete inom havs- och vattenförvaltning. Arbetsuppgifterna inkluderar även nationell och internationell rapportering samt att bistå Regeringskansliet med expertis i bland annat EU-processer.\n\nNaturvårdsverkets tillsynsvägledning är ett viktigt verktyg för att stötta och utveckla den operativa tillsynen av miljöfarliga verksamheter, som ofta länsstyrelser eller kommuner ansvarar för. Naturvårdsverket håller på att utveckla sina processer för tillsynsvägledning och vägledning i syfte att öka användarvänligheten och få större effekt. Den här tjänsten är ett led i att stärka vårt arbete med tillsynsvägledning.\n\nDina arbetsuppgifter \nDina huvudsakliga arbetsuppgifter kommer vara att delta i genomförandet av enhetens tillsynsvägledning av miljöfarliga verksamheter, med fokus på avloppsområdet. Du kommer samordna vårt interna tillsynsvägledningsarbete på enheten och vara enhetens kontakt gentemot andra enheter på Naturvårdsverket gällande tillsynsvägledning. Du kommer hålla ihop vår löpande tillsynsvägledning, se till att frågor fördelas och besvaras. En viktig del handlar om att administrera vårt arbete med tillsynsvägledning, bland annat i vårt ärendehanteringssystem Artvise. Med stöd av erfarna kollegor kommer du även svara på tillsynsvägledningsfrågor. Du kommer också delta i planering, genomförande, uppföljning och utveckling av tillsynsvägledningen på enheten. Dialog med frågeställare, våra jurister och kommunikatörer ingår i arbetet. \n\nI den rollen ingår att samverkan internt med andra enheter på Naturvårdsverket och med andra myndigheter. Samverkan med kommuner. verksamhetsutövare och näringsliv, är arbete du också kommer delta i. Vid behov deltar du i andra arbetsuppgifter på enheten, såsom sammanställa remissvar, bidra till yttranden och till utredning, liksom att bistå Miljödepartementet med underlag. I samtliga dessa arbetsuppgifter ingår att tillgodogöra sig information, dra slutsatser och omsätta dessa i handling. Det ingår också att skriva texter och dokumentera möten, och på sikt kunna hålla föredrag. \n\nI denna roll har du möjlighet att göra skillnad och utvecklas såväl personligen som inom ditt arbetsområde.\n\nDin kompetens\nVi söker dig som har en för arbetsuppgifterna relevant universitets-/högskoleutbildning (minst 3-årig kandidatexamen) och minst 1 års relevant arbetslivserfarenhet för tjänsten. Det är meriterande om du har erfarenhet av tillsyn eller tillsynsvägledning, gärna från kommun eller länsstyrelse. Har du erfarenhet av tillsyn eller tillsynsvägledning inom avloppsområdet eller av miljöfarliga verksamheter är det ett plus. \n\nVi lägger stor vikt vid personliga egenskaper där vi ser att du har god samarbetsförmåga och kommunikativ förmåga, liksom förmåga att ta ansvar. Att få saker att hända och löpa linan ut är en förutsättning för arbetsuppgifterna, liksom att du är självgående och tar ansvar för resultatet. Vi ser gärna att du arbetar systematiskt. Du ska kunna uttrycka dig väl skriftligt och muntligt på svenska och engelska. \n\nOm anställningen\n\nAnställningen är en visstidsanställning på heltid, 1 år. Anställningens placering är Stockholm alternativt Östersund. Tillträde snarast enligt överenskommelse. \n\nNaturvårdsverket vill erbjuda ett flexibelt arbetssätt genom möjlighet till distansarbete upp till 50% av arbetstiden. Vi eftersträvar en effektiv verksamhet, ett hållbart arbetsliv samt ökad trivsel. \n\nVi arbetar i allt större utsträckning med resfria arbetsformer men tjänsten kan innebär resor, främst inom Sverige.\n\nAnsökan\n\nVälkommen med din ansökan senast den 16 augusti. \n\nKontakt\n\n Vill du veta mer om anställningen är du välkommen att kontakta följande personer via vår kundtjänst, tel.nr. 010-698 10 00.\n\nKerstin Åstrand, chef (tillgänglig för frågor fr o m v. 32)\n\nKontaktpersoner för ST och Saco\n\n\n\nOm Naturvårdsverket\n\nNaturvårdsverket driver och samordnar arbetet för en god livsmiljö tillsammans med andra. Vi bygger vårt arbete på kunskap och visar på möjligheter för en hållbar utveckling. Vi är en miljömyndighet som arbetar på uppdrag av regeringen. Naturvårdsverket ansvarar för frågor som handlar om klimat och luft, mark, biologisk mångfald, förorenade områden, kretslopp och avfall, miljöövervakning samt miljöforskning.\n\nNaturvårdsverket eftersträvar en arbetsplats präglad av jämställdhet och mångfald. Vi ser att medarbetare med olika bakgrund och erfarenheter är en viktig förutsättning för detta.\n\nInför rekryteringsarbetet har vi tagit ställning till rekryteringskanaler och marknadsföring och undanber oss därför kontakt med mediesäljare, rekryteringssajter och liknande."
}