{
  "meta" : {
    "jobad" : {
      "description" : {
        "requirements" : null,
        "needs" : null,
        "company_information" : null,
        "text_formatted" : "<p><strong>Var med och utveckla svensk betodling!</strong></p><p>Våra sockerbetor kommer från ca 1 000 odlare i södra Sverige och våra produkter säljs under varumärkena Nordic Sugar för industrin och Dansukker för konsumenter. Av resterna från sockertillverkningen gör vi högkvalitativt foder. Nordic Sugar Sverige har en attraktiv placering mitt i matregionen Skåne, strax utanför kunskapsstaden Lund, och inom företaget finns goda karriärmöjligheter. Sockerbetorna är den gröda som haft den mest positiva skördeutvecklingen de senaste decennierna. Det arbetet fortsätter vi med, i samarbete med våra betodlare och Nordic Beet Research. Vi ingår i Nordzucker som med en omsättning på ca 1,5 mdr euro är en av Europas ledande sockerproducenter.</p><p>Nu har vi två spännande roller att tillsätta på vårt Agricenter. Vi söker dig som vill jobba tillsammans med våra betodlare och odlingsutveckling med målsättningen att säkra betgrödans långsiktiga konkurrenskraft. Är du agronom eller lantmästare och tycker det skulle vara spännande att bidra till att utveckla relationerna med Nordic Sugars odlare och utvecklingen av betodlingen i Sverige? Då kan detta vara jobbet för dig!  </p><p>Tjänsterna är placerade i Örtofta och du refererar till den svenska chefen för Agricenter som också är placerad i Örtofta. Enheten består sammanlagt av 5 medarbetare. Ordinarie arbetstid är dagtid med möjlighet till flex. Tjänsten kan innebära visst skiftarbete i kampanjperioden september-januari. <strong> </strong></p><p><strong>Huvudsakliga arbetsuppgifter:</strong> </p><p>·        Ansvar för odlingsrådgivning gentemot både odlare och andra partners tillsammans med övriga medarbetare i teamet</p><p>·        Vara en driven kommunikatör och utveckla kommunikationen med hjälp av digitala kanaler såsom hemsida, videoklipp med mera</p><p>·        Genom projektarbete vara med driva utvecklingen av betodlingen i Sverige och internationellt, bland annat genom ett tätt samarbete med Nordic Beet Research</p><p>·         Vara med och stärka affärsrelationerna till betodlarna gällande kontrakt, rådgivning och odlingsekonomi och säkra att de får den information de behöver</p><p>·        Vara delaktig i att kvalitetssäkra betleveranserna till fabriken </p><p><strong>Din bakgrund:</strong></p><p>Du har troligen en utbildning som agronom eller lantmästare och några års erfarenhet av yrkesrollen och/eller branschen. Erfarenhet av rådgivningsarbete är meriterande. Du har ett brett nätverk inom lantbruksnäringen tillsammans med en stor nyfikenhet för branschen.  </p><p>Du utvecklar din arbetskunskap och sakkunskap genom att kontinuerligt utveckla dig i professionen. Att vara expert på ditt område är något som både motiverar och driver dig framåt. Du har lätt för att skapa goda relationer och bygger omfattande och effektiva kontaktnät inom och utanför organisationen. </p><p>Du har god kommunikativ förmåga och har lätt att skapa förtroende i din omgivning såväl internt som externt, och du kan hålla presentationer och tala offentligt med både skicklighet och förtroende.</p><p>Eftersom vårt koncernspråk är engelska så är det viktigt att du kan uttrycka dig väl både i engelska och svenska, skriftligen och muntligen.</p><p> </p><p><strong>Ansökan och information</strong></p><p>Om du önskar ytterligare information om befattningen kontaktar du rekryterande chef Anders Rydén: 0709–537 264 eller HR Tina Persson: 0709–537 139. Fackliga frågor besvaras av PTK ordförande, Eva Nilsson: 0709–539 636. Din ansökan till tjänsten som ”agronom/lantmästare” sänder du till oss via vår hemsida www.nordzucker.com senast den 12 augusti. Vi tillämpar löpande urval så vänta inte med din ansökan.</p><p><strong>Vi har gjort vårt val av annonseringskanaler för denna tjänst och undanber oss därför kontakt med annonssäljare, bemanningsföretag samt säljare av andra rekryteringsverktyg</strong></p><p><br></p>",
        "conditions" : null,
        "text" : "Var med och utveckla svensk betodling!\nVåra sockerbetor kommer från ca 1 000 odlare i södra Sverige och våra produkter säljs under varumärkena Nordic Sugar för industrin och Dansukker för konsumenter. Av resterna från sockertillverkningen gör vi högkvalitativt foder. Nordic Sugar Sverige har en attraktiv placering mitt i matregionen Skåne, strax utanför kunskapsstaden Lund, och inom företaget finns goda karriärmöjligheter. Sockerbetorna är den gröda som haft den mest positiva skördeutvecklingen de senaste decennierna. Det arbetet fortsätter vi med, i samarbete med våra betodlare och Nordic Beet Research. Vi ingår i Nordzucker som med en omsättning på ca 1,5 mdr euro är en av Europas ledande sockerproducenter.\nNu har vi två spännande roller att tillsätta på vårt Agricenter. Vi söker dig som vill jobba tillsammans med våra betodlare och odlingsutveckling med målsättningen att säkra betgrödans långsiktiga konkurrenskraft. Är du agronom eller lantmästare och tycker det skulle vara spännande att bidra till att utveckla relationerna med Nordic Sugars odlare och utvecklingen av betodlingen i Sverige? Då kan detta vara jobbet för dig!  \nTjänsterna är placerade i Örtofta och du refererar till den svenska chefen för Agricenter som också är placerad i Örtofta. Enheten består sammanlagt av 5 medarbetare. Ordinarie arbetstid är dagtid med möjlighet till flex. Tjänsten kan innebära visst skiftarbete i kampanjperioden september-januari.  \nHuvudsakliga arbetsuppgifter: \n·        Ansvar för odlingsrådgivning gentemot både odlare och andra partners tillsammans med övriga medarbetare i teamet\n·        Vara en driven kommunikatör och utveckla kommunikationen med hjälp av digitala kanaler såsom hemsida, videoklipp med mera\n·        Genom projektarbete vara med driva utvecklingen av betodlingen i Sverige och internationellt, bland annat genom ett tätt samarbete med Nordic Beet Research\n·         Vara med och stärka affärsrelationerna till betodlarna gällande kontrakt, rådgivning och odlingsekonomi och säkra att de får den information de behöver\n·        Vara delaktig i att kvalitetssäkra betleveranserna till fabriken \nDin bakgrund:\nDu har troligen en utbildning som agronom eller lantmästare och några års erfarenhet av yrkesrollen och/eller branschen. Erfarenhet av rådgivningsarbete är meriterande. Du har ett brett nätverk inom lantbruksnäringen tillsammans med en stor nyfikenhet för branschen.  \nDu utvecklar din arbetskunskap och sakkunskap genom att kontinuerligt utveckla dig i professionen. Att vara expert på ditt område är något som både motiverar och driver dig framåt. Du har lätt för att skapa goda relationer och bygger omfattande och effektiva kontaktnät inom och utanför organisationen. \nDu har god kommunikativ förmåga och har lätt att skapa förtroende i din omgivning såväl internt som externt, och du kan hålla presentationer och tala offentligt med både skicklighet och förtroende.\nEftersom vårt koncernspråk är engelska så är det viktigt att du kan uttrycka dig väl både i engelska och svenska, skriftligen och muntligen.\n \nAnsökan och information\nOm du önskar ytterligare information om befattningen kontaktar du rekryterande chef Anders Rydén: 0709–537 264 eller HR Tina Persson: 0709–537 139. Fackliga frågor besvaras av PTK ordförande, Eva Nilsson: 0709–539 636. Din ansökan till tjänsten som ”agronom/lantmästare” sänder du till oss via vår hemsida www.nordzucker.com senast den 12 augusti. Vi tillämpar löpande urval så vänta inte med din ansökan.\nVi har gjort vårt val av annonseringskanaler för denna tjänst och undanber oss därför kontakt med annonssäljare, bemanningsföretag samt säljare av andra rekryteringsverktyg"
      },
      "headline" : "Agronom/Lantmästare Nordic Sugar Örtofta",
      "driving_license" : null,
      "employer" : {
        "email" : null,
        "phone_number" : null,
        "organization_number" : "5564561602",
        "name" : "Nordic Sugar AB",
        "url" : "www.nordzucker.com",
        "workplace" : "Nordic Sugar Örtofta"
      },
      "removed_date" : null,
      "logo_url" : "https://www.arbetsformedlingen.se/rest/arbetsgivare/rest/af/v3/arbetsplatser/82200754/logotyper/logo.png",
      "last_publication_date" : "2022-08-05T00:00:00",
      "number_of_vacancies" : 2,
      "occupation" : {
        "concept_id" : "egDr_i9z_xoT",
        "label" : "Agronom",
        "legacy_ams_taxonomy_id" : "6264"
      },
      "occupation_group" : {
        "concept_id" : "XurM_DVs_ggn",
        "label" : "Specialister och rådgivare inom lantbruk m.m.",
        "legacy_ams_taxonomy_id" : "2134"
      },
      "employment_type" : {
        "concept_id" : "PFZr_Syz_cUq",
        "label" : "Vanlig anställning",
        "legacy_ams_taxonomy_id" : "1"
      },
      "webpage_url" : "https://arbetsformedlingen.se/platsbanken/annonser/26250169",
      "driving_license_required" : false,
      "application_contacts" : [ ],
      "duration" : {
        "concept_id" : "a7uU_j21_mkL",
        "label" : "Tills vidare",
        "legacy_ams_taxonomy_id" : "1"
      },
      "nice_to_have" : {
        "education_level" : [ ],
        "work_experiences" : [ {
          "concept_id" : "egDr_i9z_xoT",
          "weight" : 5,
          "label" : "Agronom",
          "legacy_ams_taxonomy_id" : "6264"
        } ],
        "skills" : [ ],
        "education" : [ ],
        "languages" : [ ]
      },
      "application_details" : {
        "via_af" : false,
        "email" : null,
        "other" : null,
        "reference" : null,
        "url" : "https://jobs.nordzucker.com/job-invite/3135/",
        "information" : null
      },
      "source_type" : "VIA_ANNONSERA",
      "application_deadline" : "2022-08-05T00:00:00",
      "external_id" : null,
      "workplace_address" : {
        "coordinates" : [ 13.314800824494387, 55.80474272356607 ],
        "city" : "Sockerbruksvägen 1",
        "postcode" : "24193",
        "municipality" : "Eslöv",
        "region_concept_id" : "CaRE_1nn_cSU",
        "region" : "Skåne län",
        "country_code" : "199",
        "region_code" : "12",
        "municipality_concept_id" : "gfCw_egj_1M4",
        "country_concept_id" : "i46j_HmG_v64",
        "municipality_code" : "1285",
        "street_address" : "Örtofta Sockerbruk",
        "country" : "Sverige"
      },
      "id" : "26250169",
      "experience_required" : true,
      "working_hours_type" : {
        "concept_id" : "6YE1_gAC_R2G",
        "label" : "Heltid",
        "legacy_ams_taxonomy_id" : "1"
      },
      "access" : null,
      "timestamp" : 1655906370826,
      "must_have" : {
        "education_level" : [ {
          "concept_id" : "asZm_TEQ_Srk",
          "weight" : 10,
          "label" : "Eftergymnasial utbildning två år eller längre",
          "legacy_ams_taxonomy_id" : "6"
        } ],
        "work_experiences" : [ ],
        "skills" : [ {
          "concept_id" : "74uH_39f_D58",
          "weight" : 10,
          "label" : "Lantmästarexamen",
          "legacy_ams_taxonomy_id" : "608321"
        }, {
          "concept_id" : "jpcR_F1P_8Wr",
          "weight" : 10,
          "label" : "Agronomexamen",
          "legacy_ams_taxonomy_id" : "608326"
        } ],
        "education" : [ {
          "concept_id" : "d2cS_Ajj_6DK",
          "weight" : 10,
          "label" : "Lantbruk, trädgård, skog och fiske",
          "legacy_ams_taxonomy_id" : "18"
        } ],
        "languages" : [ {
          "concept_id" : "zSLA_vw2_FXN",
          "weight" : 10,
          "label" : "Svenska",
          "legacy_ams_taxonomy_id" : "502"
        }, {
          "concept_id" : "NVxJ_hLg_TYS",
          "weight" : 10,
          "label" : "Engelska",
          "legacy_ams_taxonomy_id" : "283"
        } ]
      },
      "occupation_field" : {
        "concept_id" : "VuuL_7CH_adj",
        "label" : "Naturbruk",
        "legacy_ams_taxonomy_id" : "13"
      },
      "scope_of_work" : {
        "min" : 0,
        "max" : 100
      },
      "salary_type" : {
        "concept_id" : "oG8G_9cW_nRf",
        "label" : "Fast månads- vecko- eller timlön",
        "legacy_ams_taxonomy_id" : "1"
      },
      "removed" : false,
      "salary_description" : null,
      "access_to_own_car" : false,
      "publication_date" : "2022-06-22T15:59:30"
    },
    "name" : "Agronom/Lantmästare Nordic Sugar Örtofta",
    "user" : "hannes"
  },
  "sha1" : "f360c363d376b46b952c5e82fa75ac01ecf4c303",
  "annotations" : [ {
    "preferred-label" : "Agronom",
    "sentiment" : "MUST_HAVE",
    "type" : "occupation-name",
    "start-position" : 0,
    "end-position" : 7,
    "concept-id" : "egDr_i9z_xoT",
    "matched-string" : "agronom",
    "annotation-id" : 0
  }, {
    "preferred-label" : "Lantmästare",
    "sentiment" : "MUST_HAVE",
    "type" : "occupation-name",
    "start-position" : 8,
    "end-position" : 19,
    "concept-id" : "hfBR_H6L_vbv",
    "matched-string" : "lantmästare",
    "annotation-id" : 1
  }, {
    "preferred-label" : "Odlare av jordbruksväxter",
    "type" : "isco-level-4",
    "start-position" : 118,
    "end-position" : 124,
    "concept-id" : "Hb1S_69T_krH",
    "matched-string" : "odlare",
    "annotation-id" : 18
  }, {
    "preferred-label" : "Sverige",
    "type" : "country",
    "start-position" : 133,
    "end-position" : 140,
    "concept-id" : "i46j_HmG_v64",
    "matched-string" : "Sverige",
    "annotation-id" : 19
  }, {
    "preferred-label" : "Sockertillverkning",
    "type" : "sni-level-5",
    "start-position" : 259,
    "end-position" : 279,
    "concept-id" : "y8rR_ypJ_5qG",
    "matched-string" : "sockertillverkningen",
    "annotation-id" : 20
  }, {
    "preferred-label" : "Sverige",
    "type" : "country",
    "start-position" : 322,
    "end-position" : 329,
    "concept-id" : "i46j_HmG_v64",
    "matched-string" : "Sverige",
    "annotation-id" : 21
  }, {
    "preferred-label" : "Skåne län",
    "type" : "region",
    "start-position" : 376,
    "end-position" : 381,
    "concept-id" : "CaRE_1nn_cSU",
    "matched-string" : "Skåne",
    "annotation-id" : 22
  }, {
    "preferred-label" : "Lund",
    "type" : "municipality",
    "start-position" : 412,
    "end-position" : 416,
    "concept-id" : "muSY_tsR_vDZ",
    "matched-string" : "Lund",
    "annotation-id" : 23
  }, {
    "preferred-label" : "Europa/EU/EES/EURES",
    "type" : "continent",
    "start-position" : 725,
    "end-position" : 732,
    "concept-id" : "HstV_nCB_W2i",
    "matched-string" : "Europas",
    "annotation-id" : 24
  }, {
    "preferred-label" : "Agronom",
    "sentiment" : "MUST_HAVE",
    "type" : "occupation-name",
    "start-position" : 980,
    "end-position" : 987,
    "concept-id" : "egDr_i9z_xoT",
    "matched-string" : "agronom",
    "annotation-id" : 3
  }, {
    "preferred-label" : "Lantmästare",
    "sentiment" : "MUST_HAVE",
    "type" : "occupation-name",
    "start-position" : 994,
    "end-position" : 1005,
    "concept-id" : "hfBR_H6L_vbv",
    "matched-string" : "lantmästare",
    "annotation-id" : 4
  }, {
    "preferred-label" : "Odlare av jordbruksväxter",
    "type" : "isco-level-4",
    "start-position" : 1102,
    "end-position" : 1108,
    "concept-id" : "Hb1S_69T_krH",
    "matched-string" : "odlare",
    "annotation-id" : 25
  }, {
    "preferred-label" : "Sverige",
    "type" : "country",
    "start-position" : 1143,
    "end-position" : 1150,
    "concept-id" : "i46j_HmG_v64",
    "matched-string" : "Sverige",
    "annotation-id" : 26
  }, {
    "preferred-label" : "Svenska",
    "type" : "keyword",
    "start-position" : 1248,
    "end-position" : 1255,
    "concept-id" : "gfhX_bqH_U4K",
    "matched-string" : "svenska",
    "annotation-id" : 27
  }, {
    "preferred-label" : "Rådgivare inom jordbruk, skogsbruk och fiske m.fl.",
    "type" : "isco-level-4",
    "start-position" : 1540,
    "end-position" : 1557,
    "concept-id" : "mSjA_1pP_ttD",
    "matched-string" : "odlingsrådgivning",
    "annotation-id" : 28
  }, {
    "preferred-label" : "Odlare av jordbruksväxter",
    "type" : "isco-level-4",
    "start-position" : 1572,
    "end-position" : 1578,
    "concept-id" : "Hb1S_69T_krH",
    "matched-string" : "odlare",
    "annotation-id" : 29
  }, {
    "preferred-label" : "Sverige",
    "type" : "country",
    "start-position" : 1847,
    "end-position" : 1854,
    "concept-id" : "i46j_HmG_v64",
    "matched-string" : "Sverige",
    "annotation-id" : 30
  }, {
    "preferred-label" : "ge rådgivning till klienter",
    "type" : "esco-skill",
    "start-position" : 2022,
    "end-position" : 2032,
    "concept-id" : "j6KC_ugu_wVD",
    "matched-string" : "rådgivning",
    "annotation-id" : 31
  }, {
    "preferred-label" : "Agronom",
    "sentiment" : "MUST_HAVE",
    "type" : "occupation-name",
    "start-position" : 2223,
    "end-position" : 2230,
    "concept-id" : "egDr_i9z_xoT",
    "matched-string" : "agronom",
    "annotation-id" : 8
  }, {
    "preferred-label" : "Lantmästare",
    "sentiment" : "MUST_HAVE",
    "type" : "occupation-name",
    "start-position" : 2237,
    "end-position" : 2248,
    "concept-id" : "hfBR_H6L_vbv",
    "matched-string" : "lantmästare",
    "annotation-id" : 9
  }, {
    "preferred-label" : "Lantbruk, allmän",
    "type" : "keyword",
    "start-position" : 2388,
    "end-position" : 2405,
    "concept-id" : "u4Vd_Jtt_xP6",
    "matched-string" : "lantbruksnäringen",
    "annotation-id" : 32
  }, {
    "preferred-label" : "visa nyfikenhet",
    "type" : "esco-skill",
    "start-position" : 2430,
    "end-position" : 2440,
    "concept-id" : "mbHa_NFf_vyf",
    "matched-string" : "nyfikenhet",
    "annotation-id" : 33
  }, {
    "preferred-label" : "Engelska",
    "sentiment" : "MUST_HAVE",
    "type" : "language",
    "start-position" : 2990,
    "end-position" : 2998,
    "concept-id" : "NVxJ_hLg_TYS",
    "matched-string" : "engelska",
    "annotation-id" : 10
  }, {
    "preferred-label" : "Engelska",
    "sentiment" : "MUST_HAVE",
    "type" : "language",
    "start-position" : 3052,
    "end-position" : 3060,
    "concept-id" : "NVxJ_hLg_TYS",
    "matched-string" : "engelska",
    "annotation-id" : 11
  }, {
    "preferred-label" : "Svenska",
    "sentiment" : "MUST_HAVE",
    "type" : "language",
    "start-position" : 3065,
    "end-position" : 3072,
    "concept-id" : "zSLA_vw2_FXN",
    "matched-string" : "svenska",
    "annotation-id" : 12
  }, {
    "preferred-label" : "Agronom",
    "sentiment" : "MUST_HAVE",
    "type" : "occupation-name",
    "start-position" : 3377,
    "end-position" : 3384,
    "concept-id" : "egDr_i9z_xoT",
    "matched-string" : "agronom",
    "annotation-id" : 13
  }, {
    "preferred-label" : "Lantmästare",
    "sentiment" : "MUST_HAVE",
    "type" : "occupation-name",
    "start-position" : 3385,
    "end-position" : 3396,
    "concept-id" : "hfBR_H6L_vbv",
    "matched-string" : "lantmästare",
    "annotation-id" : 14
  } ],
  "text" : "Agronom/Lantmästare Nordic Sugar Örtofta\nVar med och utveckla svensk betodling!\nVåra sockerbetor kommer från ca 1 000 odlare i södra Sverige och våra produkter säljs under varumärkena Nordic Sugar för industrin och Dansukker för konsumenter. Av resterna från sockertillverkningen gör vi högkvalitativt foder. Nordic Sugar Sverige har en attraktiv placering mitt i matregionen Skåne, strax utanför kunskapsstaden Lund, och inom företaget finns goda karriärmöjligheter. Sockerbetorna är den gröda som haft den mest positiva skördeutvecklingen de senaste decennierna. Det arbetet fortsätter vi med, i samarbete med våra betodlare och Nordic Beet Research. Vi ingår i Nordzucker som med en omsättning på ca 1,5 mdr euro är en av Europas ledande sockerproducenter.\nNu har vi två spännande roller att tillsätta på vårt Agricenter. Vi söker dig som vill jobba tillsammans med våra betodlare och odlingsutveckling med målsättningen att säkra betgrödans långsiktiga konkurrenskraft. Är du agronom eller lantmästare och tycker det skulle vara spännande att bidra till att utveckla relationerna med Nordic Sugars odlare och utvecklingen av betodlingen i Sverige? Då kan detta vara jobbet för dig!  \nTjänsterna är placerade i Örtofta och du refererar till den svenska chefen för Agricenter som också är placerad i Örtofta. Enheten består sammanlagt av 5 medarbetare. Ordinarie arbetstid är dagtid med möjlighet till flex. Tjänsten kan innebära visst skiftarbete i kampanjperioden september-januari.  \nHuvudsakliga arbetsuppgifter: \n·        Ansvar för odlingsrådgivning gentemot både odlare och andra partners tillsammans med övriga medarbetare i teamet\n·        Vara en driven kommunikatör och utveckla kommunikationen med hjälp av digitala kanaler såsom hemsida, videoklipp med mera\n·        Genom projektarbete vara med driva utvecklingen av betodlingen i Sverige och internationellt, bland annat genom ett tätt samarbete med Nordic Beet Research\n·         Vara med och stärka affärsrelationerna till betodlarna gällande kontrakt, rådgivning och odlingsekonomi och säkra att de får den information de behöver\n·        Vara delaktig i att kvalitetssäkra betleveranserna till fabriken \nDin bakgrund:\nDu har troligen en utbildning som agronom eller lantmästare och några års erfarenhet av yrkesrollen och/eller branschen. Erfarenhet av rådgivningsarbete är meriterande. Du har ett brett nätverk inom lantbruksnäringen tillsammans med en stor nyfikenhet för branschen.  \nDu utvecklar din arbetskunskap och sakkunskap genom att kontinuerligt utveckla dig i professionen. Att vara expert på ditt område är något som både motiverar och driver dig framåt. Du har lätt för att skapa goda relationer och bygger omfattande och effektiva kontaktnät inom och utanför organisationen. \nDu har god kommunikativ förmåga och har lätt att skapa förtroende i din omgivning såväl internt som externt, och du kan hålla presentationer och tala offentligt med både skicklighet och förtroende.\nEftersom vårt koncernspråk är engelska så är det viktigt att du kan uttrycka dig väl både i engelska och svenska, skriftligen och muntligen.\n \nAnsökan och information\nOm du önskar ytterligare information om befattningen kontaktar du rekryterande chef Anders Rydén: 0709–537 264 eller HR Tina Persson: 0709–537 139. Fackliga frågor besvaras av PTK ordförande, Eva Nilsson: 0709–539 636. Din ansökan till tjänsten som ”agronom/lantmästare” sänder du till oss via vår hemsida www.nordzucker.com senast den 12 augusti. Vi tillämpar löpande urval så vänta inte med din ansökan.\nVi har gjort vårt val av annonseringskanaler för denna tjänst och undanber oss därför kontakt med annonssäljare, bemanningsföretag samt säljare av andra rekryteringsverktyg"
}