{
  "meta" : {
    "jobad" : {
      "description" : {
        "requirements" : null,
        "needs" : null,
        "company_information" : null,
        "text_formatted" : "För ett spännande uppdrag hos EcoGuard söker vi nu dig med ett stort tekniskt intresse och en fallenhet för att skapa goda relationer. Tycker du dessutom om att ta stort ansvar för ditt arbete och gillar att självständigt lägga upp dina arbetsdagar? Här har du chansen att få göra just detta, sök redan idag! Urval sker löpande. \n\nOM TJÄNSTEN \nEcoGuard vill göra det enkelt och lönsamt att koppla upp, mäta och visualisera mätvärden för mindre energianvändning och sänkta energikostnader. EcoGuard hjälper fastighetsägare att optimera deras förbrukning av värme och vatten vilket leder till en bättre ekonomi för fastighetsägare, BRF och hyresvärdar samt en bättre miljö. EcoGuard samarbetar med fastighetsägare i hela Sverige och de finns även i Finland och Norge.\n\nI rollen som 3D-modifierare kommer du få vara en del av ett välmående företag där organisationen beskrivs som platt. Här arbetar du närmast projektsupporten som består av 2 kollegor. Ecoguard söker nu dig som vill hjälpa deras kunder med att modifiera 3D-hus i deras egna programvara Curves. Arbetet kräver inga förkunskaper men vi ser det som fördelaktigt att du är van vid olika datasystem och trivs med en omfattade kundkontakt. 3D-modifieringen är en tilläggstjänst som EcoGuard erbjuder sina kunder vilket innebär att du självständigt tilldelar dig själv uppdrag som inkommer via mail. Här ges du en stor frihet att planera din arbetsdag där du är välkommen att arbeta både på kontoret eller på distans. Du kommer att introduceras till företaget och arbetsuppgifterna genom en grundläggande introduktion för att få den bästa förutsättningen att skapa en relation med dina nya kollegor och bli en del av EcoGuard.\n\nDu erbjuds\n\n\n* Ett flexibelt deltidsjobb vid sidan av studierna. \n* Eget ansvar och samtidigt ett tätt samarbete med kollegor.\n\n\nSom konsult för Academic Work erbjuder vi stora möjligheter för dig att växa professionellt, bygga ditt nätverk och skapa värdefulla kontakter för framtiden. Läs mer om vårt konsulterbjudande.\n\nARBETSUPPGIFTER \n- Skapa 3D-visualiseringar av EcoGuards kunders byggnader i programmet Curves\n- Självständigt söka upp planritningar och kompletterande uppgifter om byggnaders exteriör via exempelvis eniro och hitta.se\n\nVI SÖKER DIG SOM \n\nVi söker dig som\n\n\n* Studerar minst 50% på högskola eller universitet, gärna med en teknik- eller IT-inriktning och har minst 1,5 år kvar av dina studier. Registreringsintyg behöver kunna uppvisas.\n* Har goda verbala och skriftliga kunskaper i svenska då detta förekommer i det dagliga arbetet.\n* Har god datavana och grundläggande kunskaper i Officepaketet.\n* Har ett tekniskt intresse.\n\n\nDet är meriterande om du har:\n\n\n* Arbetslivserfarenhet av servicerelaterat arbete och kundkontakt.\n\n\nSom person är du:\n\n\n* Uthållig\n* Serviceinriktad\n* Noggrann\n* Initativtagande\n\n\nÖvrig information\n\n\n* Start: Omgående, alterntivt augusti\n* Omfattning: deltid\n* Placering: Örebro\n\n\nRekryteringsprocessen hanteras av Academic Work och kundens önskemål är att alla frågor rörande tjänsten hanteras av Academic Work.\n\nVi går igenom urvalet löpande och annonsen kan stängas ner innan tjänsten är tillsatt om vi gått över till urvals- och intervjufasen.",
        "conditions" : "Deltid \r\n08:00-17:00",
        "text" : "För ett spännande uppdrag hos EcoGuard söker vi nu dig med ett stort tekniskt intresse och en fallenhet för att skapa goda relationer. Tycker du dessutom om att ta stort ansvar för ditt arbete och gillar att självständigt lägga upp dina arbetsdagar? Här har du chansen att få göra just detta, sök redan idag! Urval sker löpande. \n\nOM TJÄNSTEN \nEcoGuard vill göra det enkelt och lönsamt att koppla upp, mäta och visualisera mätvärden för mindre energianvändning och sänkta energikostnader. EcoGuard hjälper fastighetsägare att optimera deras förbrukning av värme och vatten vilket leder till en bättre ekonomi för fastighetsägare, BRF och hyresvärdar samt en bättre miljö. EcoGuard samarbetar med fastighetsägare i hela Sverige och de finns även i Finland och Norge.\n\nI rollen som 3D-modifierare kommer du få vara en del av ett välmående företag där organisationen beskrivs som platt. Här arbetar du närmast projektsupporten som består av 2 kollegor. Ecoguard söker nu dig som vill hjälpa deras kunder med att modifiera 3D-hus i deras egna programvara Curves. Arbetet kräver inga förkunskaper men vi ser det som fördelaktigt att du är van vid olika datasystem och trivs med en omfattade kundkontakt. 3D-modifieringen är en tilläggstjänst som EcoGuard erbjuder sina kunder vilket innebär att du självständigt tilldelar dig själv uppdrag som inkommer via mail. Här ges du en stor frihet att planera din arbetsdag där du är välkommen att arbeta både på kontoret eller på distans. Du kommer att introduceras till företaget och arbetsuppgifterna genom en grundläggande introduktion för att få den bästa förutsättningen att skapa en relation med dina nya kollegor och bli en del av EcoGuard.\n\nDu erbjuds\n\n\n* Ett flexibelt deltidsjobb vid sidan av studierna. \n* Eget ansvar och samtidigt ett tätt samarbete med kollegor.\n\n\nSom konsult för Academic Work erbjuder vi stora möjligheter för dig att växa professionellt, bygga ditt nätverk och skapa värdefulla kontakter för framtiden. Läs mer om vårt konsulterbjudande.\n\nARBETSUPPGIFTER \n- Skapa 3D-visualiseringar av EcoGuards kunders byggnader i programmet Curves\n- Självständigt söka upp planritningar och kompletterande uppgifter om byggnaders exteriör via exempelvis eniro och hitta.se\n\nVI SÖKER DIG SOM \n\nVi söker dig som\n\n\n* Studerar minst 50% på högskola eller universitet, gärna med en teknik- eller IT-inriktning och har minst 1,5 år kvar av dina studier. Registreringsintyg behöver kunna uppvisas.\n* Har goda verbala och skriftliga kunskaper i svenska då detta förekommer i det dagliga arbetet.\n* Har god datavana och grundläggande kunskaper i Officepaketet.\n* Har ett tekniskt intresse.\n\n\nDet är meriterande om du har:\n\n\n* Arbetslivserfarenhet av servicerelaterat arbete och kundkontakt.\n\n\nSom person är du:\n\n\n* Uthållig\n* Serviceinriktad\n* Noggrann\n* Initativtagande\n\n\nÖvrig information\n\n\n* Start: Omgående, alterntivt augusti\n* Omfattning: deltid\n* Placering: Örebro\n\n\nRekryteringsprocessen hanteras av Academic Work och kundens önskemål är att alla frågor rörande tjänsten hanteras av Academic Work.\n\nVi går igenom urvalet löpande och annonsen kan stängas ner innan tjänsten är tillsatt om vi gått över till urvals- och intervjufasen."
      },
      "headline" : "Student sökes till uppdrag inom 3D-modifiering hos EcoGuard",
      "driving_license" : null,
      "employer" : {
        "email" : null,
        "phone_number" : null,
        "organization_number" : "5565595450",
        "name" : "Academic Work Sweden AB",
        "url" : "http://www.academicwork.se",
        "workplace" : "Academic Work"
      },
      "removed_date" : null,
      "logo_url" : "https://www.arbetsformedlingen.se/rest/arbetsgivare/rest/af/v3/organisation/5565595450/logotyper/logo.png",
      "last_publication_date" : "2022-07-03T23:59:59",
      "number_of_vacancies" : 1,
      "occupation" : {
        "concept_id" : "VpYo_k5f_N9R",
        "label" : "Grafisk formgivare",
        "legacy_ams_taxonomy_id" : "4039"
      },
      "occupation_group" : {
        "concept_id" : "8Bmh_vtM_zts",
        "label" : "Grafisk formgivare m.fl.",
        "legacy_ams_taxonomy_id" : "2172"
      },
      "employment_type" : {
        "concept_id" : "PFZr_Syz_cUq",
        "label" : "Vanlig anställning",
        "legacy_ams_taxonomy_id" : "1"
      },
      "webpage_url" : "https://arbetsformedlingen.se/platsbanken/annonser/26172859",
      "driving_license_required" : false,
      "application_contacts" : [ {
        "description" : "Elin Sandh",
        "email" : null,
        "telephone" : null,
        "name" : null,
        "contact_type" : null
      } ],
      "duration" : {
        "concept_id" : "qQUd_4qe_NDT",
        "label" : "6 månader eller längre",
        "legacy_ams_taxonomy_id" : "2"
      },
      "nice_to_have" : {
        "education_level" : [ ],
        "work_experiences" : [ ],
        "skills" : [ ],
        "education" : [ ],
        "languages" : [ ]
      },
      "application_details" : {
        "via_af" : false,
        "email" : null,
        "other" : null,
        "reference" : "15076160",
        "url" : "http://www.academicwork.se/jobad/student-sokes-till-uppdrag-inom-3d-modifiering-hos-ecoguard/15076160?apply=1",
        "information" : null
      },
      "source_type" : "VIA_PLATSBANKEN_DXA",
      "application_deadline" : "2022-07-03T23:59:59",
      "external_id" : "46-556559-5450-15076160",
      "workplace_address" : {
        "coordinates" : [ 15.21341, 59.27526 ],
        "city" : null,
        "postcode" : null,
        "municipality" : "Örebro",
        "region_concept_id" : "xTCk_nT5_Zjm",
        "region" : "Örebro län",
        "country_code" : "199",
        "region_code" : "18",
        "municipality_concept_id" : "kuMn_feU_hXx",
        "country_concept_id" : "i46j_HmG_v64",
        "municipality_code" : "1880",
        "street_address" : null,
        "country" : "Sverige"
      },
      "id" : "26172859",
      "experience_required" : true,
      "working_hours_type" : {
        "concept_id" : "947z_JGS_Uk2",
        "label" : "Deltid",
        "legacy_ams_taxonomy_id" : "2"
      },
      "access" : null,
      "timestamp" : 1654250454741,
      "must_have" : {
        "education_level" : [ ],
        "work_experiences" : [ {
          "concept_id" : "VpYo_k5f_N9R",
          "weight" : 10,
          "label" : "Grafisk formgivare",
          "legacy_ams_taxonomy_id" : "4039"
        } ],
        "skills" : [ ],
        "education" : [ ],
        "languages" : [ ]
      },
      "occupation_field" : {
        "concept_id" : "9puE_nYg_crq",
        "label" : "Kultur, media, design",
        "legacy_ams_taxonomy_id" : "11"
      },
      "scope_of_work" : {
        "min" : 0,
        "max" : 100
      },
      "salary_type" : {
        "concept_id" : "oG8G_9cW_nRf",
        "label" : "Fast månads- vecko- eller timlön",
        "legacy_ams_taxonomy_id" : "1"
      },
      "removed" : false,
      "salary_description" : "Enligt avtal",
      "access_to_own_car" : false,
      "publication_date" : "2022-06-03T12:00:54"
    },
    "name" : "Student sökes till uppdrag inom 3D-modifiering hos EcoGuard",
    "user" : "kristof.fischer"
  },
  "sha1" : "a0cc80792b2b87af1ab90bbd028138b6d08daf5d",
  "annotations" : [ {
    "preferred-label" : "Universitets- eller högskoleutbildning",
    "sentiment" : "MUST_HAVE",
    "type" : "sni-level-4",
    "start-position" : 2352,
    "end-position" : 2378,
    "concept-id" : "m1vC_Ssq_5Y7",
    "matched-string" : "högskola eller universitet",
    "annotation-id" : 4
  }, {
    "preferred-label" : "Teknik och teknisk industri, allmän utbildning",
    "sentiment" : "MUST_HAVE",
    "type" : "sun-education-field-3",
    "start-position" : 2393,
    "end-position" : 2399,
    "concept-id" : "LDWD_zzm_jeY",
    "matched-string" : "teknik",
    "annotation-id" : 5
  }, {
    "preferred-label" : "Datavetenskap och systemvetenskap",
    "sentiment" : "MUST_HAVE",
    "type" : "sun-education-field-3",
    "start-position" : 2407,
    "end-position" : 2409,
    "concept-id" : "j3Jd_2NA_so8",
    "matched-string" : "IT",
    "annotation-id" : 6
  }, {
    "preferred-label" : "Svenska",
    "sentiment" : "MUST_HAVE",
    "type" : "language",
    "start-position" : 2553,
    "end-position" : 2560,
    "concept-id" : "zSLA_vw2_FXN",
    "matched-string" : "svenska",
    "annotation-id" : 2
  }, {
    "preferred-label" : "använda dator",
    "sentiment" : "MUST_HAVE",
    "type" : "esco-skill",
    "start-position" : 2614,
    "end-position" : 2622,
    "concept-id" : "HEbR_xrb_MpT",
    "matched-string" : "datavana",
    "annotation-id" : 7
  }, {
    "preferred-label" : "MS Office",
    "sentiment" : "MUST_HAVE",
    "type" : "skill",
    "start-position" : 2653,
    "end-position" : 2666,
    "concept-id" : "w8bU_wHe_omF",
    "matched-string" : "officepaketet",
    "annotation-id" : 3
  }, {
    "preferred-label" : "Serviceyrken",
    "sentiment" : "NICE_TO_HAVE",
    "type" : "ssyk-level-2",
    "start-position" : 2757,
    "end-position" : 2780,
    "concept-id" : "UVxV_4Bz_JeR",
    "matched-string" : "servicerelaterat arbete",
    "annotation-id" : 8
  }, {
    "preferred-label" : "kommunicera med kunder",
    "sentiment" : "NICE_TO_HAVE",
    "type" : "esco-skill",
    "start-position" : 2785,
    "end-position" : 2796,
    "concept-id" : "sPCy_icd_mxy",
    "matched-string" : "kundkontakt",
    "annotation-id" : 9
  } ],
  "text" : "Student sökes till uppdrag inom 3D-modifiering hos EcoGuard\nFör ett spännande uppdrag hos EcoGuard söker vi nu dig med ett stort tekniskt intresse och en fallenhet för att skapa goda relationer. Tycker du dessutom om att ta stort ansvar för ditt arbete och gillar att självständigt lägga upp dina arbetsdagar? Här har du chansen att få göra just detta, sök redan idag! Urval sker löpande. \n\nOM TJÄNSTEN \nEcoGuard vill göra det enkelt och lönsamt att koppla upp, mäta och visualisera mätvärden för mindre energianvändning och sänkta energikostnader. EcoGuard hjälper fastighetsägare att optimera deras förbrukning av värme och vatten vilket leder till en bättre ekonomi för fastighetsägare, BRF och hyresvärdar samt en bättre miljö. EcoGuard samarbetar med fastighetsägare i hela Sverige och de finns även i Finland och Norge.\n\nI rollen som 3D-modifierare kommer du få vara en del av ett välmående företag där organisationen beskrivs som platt. Här arbetar du närmast projektsupporten som består av 2 kollegor. Ecoguard söker nu dig som vill hjälpa deras kunder med att modifiera 3D-hus i deras egna programvara Curves. Arbetet kräver inga förkunskaper men vi ser det som fördelaktigt att du är van vid olika datasystem och trivs med en omfattade kundkontakt. 3D-modifieringen är en tilläggstjänst som EcoGuard erbjuder sina kunder vilket innebär att du självständigt tilldelar dig själv uppdrag som inkommer via mail. Här ges du en stor frihet att planera din arbetsdag där du är välkommen att arbeta både på kontoret eller på distans. Du kommer att introduceras till företaget och arbetsuppgifterna genom en grundläggande introduktion för att få den bästa förutsättningen att skapa en relation med dina nya kollegor och bli en del av EcoGuard.\n\nDu erbjuds\n\n\n* Ett flexibelt deltidsjobb vid sidan av studierna. \n* Eget ansvar och samtidigt ett tätt samarbete med kollegor.\n\n\nSom konsult för Academic Work erbjuder vi stora möjligheter för dig att växa professionellt, bygga ditt nätverk och skapa värdefulla kontakter för framtiden. Läs mer om vårt konsulterbjudande.\n\nARBETSUPPGIFTER \n- Skapa 3D-visualiseringar av EcoGuards kunders byggnader i programmet Curves\n- Självständigt söka upp planritningar och kompletterande uppgifter om byggnaders exteriör via exempelvis eniro och hitta.se\n\nVI SÖKER DIG SOM \n\nVi söker dig som\n\n\n* Studerar minst 50% på högskola eller universitet, gärna med en teknik- eller IT-inriktning och har minst 1,5 år kvar av dina studier. Registreringsintyg behöver kunna uppvisas.\n* Har goda verbala och skriftliga kunskaper i svenska då detta förekommer i det dagliga arbetet.\n* Har god datavana och grundläggande kunskaper i Officepaketet.\n* Har ett tekniskt intresse.\n\n\nDet är meriterande om du har:\n\n\n* Arbetslivserfarenhet av servicerelaterat arbete och kundkontakt.\n\n\nSom person är du:\n\n\n* Uthållig\n* Serviceinriktad\n* Noggrann\n* Initativtagande\n\n\nÖvrig information\n\n\n* Start: Omgående, alterntivt augusti\n* Omfattning: deltid\n* Placering: Örebro\n\n\nRekryteringsprocessen hanteras av Academic Work och kundens önskemål är att alla frågor rörande tjänsten hanteras av Academic Work.\n\nVi går igenom urvalet löpande och annonsen kan stängas ner innan tjänsten är tillsatt om vi gått över till urvals- och intervjufasen."
}