{
  "meta" : {
    "dataset-id" : "myh-spreadsheet-2021",
    "type" : "education-description",
    "dataset-document-id" : "YH00246",
    "user" : "kristof.fischer"
  },
  "sha1" : "37e0f74e97eb7114f85fe980165f7f16c53ddbf6",
  "annotations" : [ {
    "preferred-label" : "Systemutvecklare/Programmerare",
    "sentiment" : "OFFERED",
    "type" : "occupation-name",
    "start-position" : 180,
    "end-position" : 193,
    "concept-id" : "fg7B_yov_smw",
    "matched-string" : "programmerare",
    "annotation-id" : 0
  }, {
    "preferred-label" : "Programmering",
    "sentiment" : "OFFERED",
    "type" : "skill",
    "start-position" : 202,
    "end-position" : 231,
    "concept-id" : "iUew_moc_BRk",
    "matched-string" : "skriva och utveckla den koden",
    "annotation-id" : 4
  }, {
    "preferred-label" : "Webbutveckling",
    "sentiment" : "OFFERED",
    "type" : "skill",
    "start-position" : 283,
    "end-position" : 297,
    "concept-id" : "AfJ4_Pvv_YBa",
    "matched-string" : "webbutveckling",
    "annotation-id" : 1
  }, {
    "preferred-label" : "ramverk",
    "sentiment" : "OFFERED",
    "type" : "esco-skill",
    "start-position" : 317,
    "comment" : "microsoft .net framework",
    "end-position" : 342,
    "concept-id" : "JD8j_tGG_cJT",
    "matched-string" : "Microsofts .NET-plattform",
    "annotation-id" : 5
  }, {
    "preferred-label" : "C#, programmeringsspråk",
    "sentiment" : "OFFERED",
    "type" : "skill",
    "start-position" : 347,
    "end-position" : 371,
    "concept-id" : "jBKc_5Yx_Y6T",
    "matched-string" : "programmeringsspråket #C",
    "annotation-id" : 6
  }, {
    "preferred-label" : "Sverige",
    "sentiment" : "NOT_RELEVANT",
    "type" : "country",
    "start-position" : 492,
    "end-position" : 499,
    "concept-id" : "i46j_HmG_v64",
    "matched-string" : "Sverige",
    "annotation-id" : 7
  } ],
  "text" : "OM UTBILDNINGEN  Kod är grunden till alla webbsidor, appar och gränssnitt. Ju mer digitaliserade vi blir och ju fler plattformar som används, desto större blir också behovet efter programmerare som kan skriva och utveckla den koden.    Under denna utbildning specialiserar du dig på webbutveckling med utgångspunkt i Microsofts .NET-plattform och programmeringsspråket #C. Tillsammans ligger dessa till grund för de flesta av dagens kommersiella applikationer och är starkt etablerade både i Sverige och resten av världen.    Mer information om utbildningen hittar du på:  https://www.ecutbildning.se/utbildningar/webbutvecklare-inom-net"
}