{
  "meta" : {
    "jobad" : {
      "description" : {
        "requirements" : null,
        "needs" : null,
        "company_information" : null,
        "text_formatted" : "Som testledare ingår planera, leda, medverka och ansvara för arbetet med system- och integrationstester samt acceptanstester . \n\nKortfattat vad som ingår i uppdraget som testledare: \n\n- Följa testprocesser \n- Rapportera status \n- Introducera nya testare \n- Koordinera med andra testledare/testare \n- Planera, koordinera och genomföra tillägg/förändringar i testdesign och testplan beroende på Change Requests som identifieras inom ramen för kravarbetet \n- Säkerställa de verksamhetsprocesser som faller inom teamets ansvar \n- Förvalta och utveckla testprocesserna \n- Ansvara för testmiljöerna och testa nya releaser\n\nVem är du?\n\nDet är av vikt att du har en analytisk förmåga och arbetar problemlösande och ser aldrig några hinder i ditt arbete \n\nDitt arbetssätt är strukturerat och resultatorienterad. Prestigelös, ödmjuk, lätt att samarbeta med samt delar med dig av din kunskap är de personliga egenskaper vi lägger stor vikt vid. \n\nDin tidigare erfarenhet: \n\n- Akademisk utbildning eller motsvarande arbetslivserfarenhet \n- Erfarenhet av komplexa testmiljöer \n- Erfarenhet av att kommunicera frågeställningar \n- ISTQB \n- Erfarenhet från större organisationer \n- Kompetens runt och erfarenhet av olika testverktyg för testautomatisering \n- Daglig kontakt med internt anställda på svenska och engelska, mycket goda kunskaper i båda språken i tal och skrift \n- Några års erfarenhet i rollen som testledare \n- Meriterande med erfarenhet från offentlig verksamhet\n\nHur du ansöker\n\nLåter rollen intressant och passande? Ansök i så fall omgående för vi intervjuar löpande och rollen kan tillsättas innan sista ansökningsdatum. \n\nVi är flera rekryterare som hanterar rekryteringen av denna tjänst, vid frågor gällande den här rekryteringen eller tjänsten når du oss enklast på e-post info@quest.se \n\nVi kan enbart ta emot och bearbeta din ansökan genom att du registrerar ditt CV i vår portal. Med avseende på GDPR kan vi ej ta emot ansökningar via e-post. \n\nDetta uppdrag är säkerhetsklassat, säkerhetsklassning bedöms ta ca 6-10 veckor. Start kan inte ske innan godkänd säkerhetsklassning. \n\nVarmt välkommen med din ansökan!\n\nOm Quest Consulting\n\nQuest Consulting är ett auktoriserat konsultbolag med kollektivavtal, försäkringar, friskvård och tjänstepension. Vi är specialiserade inom IT, Teknik, HR, Administration och Ekonomi. Vår målsättning är att vara din personliga samarbetspartner och just därför är det så viktigt för oss att arbeta efter våra kärnvärden där våra ledord är att vara Personliga, Nyskapande och Professionella.",
        "conditions" : "Heltid\r\nTillsvidare",
        "text" : "Som testledare ingår planera, leda, medverka och ansvara för arbetet med system- och integrationstester samt acceptanstester . \n\nKortfattat vad som ingår i uppdraget som testledare: \n\n- Följa testprocesser \n- Rapportera status \n- Introducera nya testare \n- Koordinera med andra testledare/testare \n- Planera, koordinera och genomföra tillägg/förändringar i testdesign och testplan beroende på Change Requests som identifieras inom ramen för kravarbetet \n- Säkerställa de verksamhetsprocesser som faller inom teamets ansvar \n- Förvalta och utveckla testprocesserna \n- Ansvara för testmiljöerna och testa nya releaser\n\nVem är du?\n\nDet är av vikt att du har en analytisk förmåga och arbetar problemlösande och ser aldrig några hinder i ditt arbete \n\nDitt arbetssätt är strukturerat och resultatorienterad. Prestigelös, ödmjuk, lätt att samarbeta med samt delar med dig av din kunskap är de personliga egenskaper vi lägger stor vikt vid. \n\nDin tidigare erfarenhet: \n\n- Akademisk utbildning eller motsvarande arbetslivserfarenhet \n- Erfarenhet av komplexa testmiljöer \n- Erfarenhet av att kommunicera frågeställningar \n- ISTQB \n- Erfarenhet från större organisationer \n- Kompetens runt och erfarenhet av olika testverktyg för testautomatisering \n- Daglig kontakt med internt anställda på svenska och engelska, mycket goda kunskaper i båda språken i tal och skrift \n- Några års erfarenhet i rollen som testledare \n- Meriterande med erfarenhet från offentlig verksamhet\n\nHur du ansöker\n\nLåter rollen intressant och passande? Ansök i så fall omgående för vi intervjuar löpande och rollen kan tillsättas innan sista ansökningsdatum. \n\nVi är flera rekryterare som hanterar rekryteringen av denna tjänst, vid frågor gällande den här rekryteringen eller tjänsten når du oss enklast på e-post info@quest.se \n\nVi kan enbart ta emot och bearbeta din ansökan genom att du registrerar ditt CV i vår portal. Med avseende på GDPR kan vi ej ta emot ansökningar via e-post. \n\nDetta uppdrag är säkerhetsklassat, säkerhetsklassning bedöms ta ca 6-10 veckor. Start kan inte ske innan godkänd säkerhetsklassning. \n\nVarmt välkommen med din ansökan!\n\nOm Quest Consulting\n\nQuest Consulting är ett auktoriserat konsultbolag med kollektivavtal, försäkringar, friskvård och tjänstepension. Vi är specialiserade inom IT, Teknik, HR, Administration och Ekonomi. Vår målsättning är att vara din personliga samarbetspartner och just därför är det så viktigt för oss att arbeta efter våra kärnvärden där våra ledord är att vara Personliga, Nyskapande och Professionella."
      },
      "headline" : "Testledare",
      "driving_license" : null,
      "employer" : {
        "email" : null,
        "phone_number" : null,
        "organization_number" : "5569456659",
        "name" : "Quest Consulting Sverige AB",
        "url" : null,
        "workplace" : "Quest Consulting"
      },
      "removed_date" : null,
      "logo_url" : "https://www.arbetsformedlingen.se/rest/arbetsgivare/rest/af/v3/organisation/5569456659/logotyper/logo.png",
      "last_publication_date" : "2022-08-23T23:59:59",
      "number_of_vacancies" : 1,
      "occupation" : {
        "concept_id" : "bbSi_hWq_H98",
        "label" : "Testledare",
        "legacy_ams_taxonomy_id" : "6826"
      },
      "occupation_group" : {
        "concept_id" : "D9SL_mtn_vGM",
        "label" : "Systemtestare och testledare",
        "legacy_ams_taxonomy_id" : "2514"
      },
      "employment_type" : {
        "concept_id" : "PFZr_Syz_cUq",
        "label" : "Vanlig anställning",
        "legacy_ams_taxonomy_id" : "1"
      },
      "webpage_url" : "https://arbetsformedlingen.se/platsbanken/annonser/26359370",
      "driving_license_required" : false,
      "application_contacts" : [ {
        "description" : "Quest Consulting",
        "email" : null,
        "telephone" : null,
        "name" : null,
        "contact_type" : null
      } ],
      "duration" : {
        "concept_id" : "a7uU_j21_mkL",
        "label" : "Tills vidare",
        "legacy_ams_taxonomy_id" : "1"
      },
      "nice_to_have" : {
        "education_level" : [ ],
        "work_experiences" : [ ],
        "skills" : [ ],
        "education" : [ ],
        "languages" : [ ]
      },
      "application_details" : {
        "via_af" : false,
        "email" : null,
        "other" : null,
        "reference" : null,
        "url" : "https://www.quest.se/lediga-jobb?mtrpage=assignment&mtrt=ams&mtrid=2374",
        "information" : null
      },
      "source_type" : "VIA_PLATSBANKEN_DXA",
      "application_deadline" : "2022-08-23T23:59:59",
      "external_id" : "46-556945-6659-2374",
      "workplace_address" : {
        "coordinates" : [ 18.06858, 59.329323 ],
        "city" : null,
        "postcode" : null,
        "municipality" : "Stockholm",
        "region_concept_id" : "CifL_Rzy_Mku",
        "region" : "Stockholms län",
        "country_code" : "199",
        "region_code" : "01",
        "municipality_concept_id" : "AvNB_uwa_6n6",
        "country_concept_id" : "i46j_HmG_v64",
        "municipality_code" : "0180",
        "street_address" : null,
        "country" : "Sverige"
      },
      "id" : "26359370",
      "experience_required" : true,
      "working_hours_type" : {
        "concept_id" : "6YE1_gAC_R2G",
        "label" : "Heltid",
        "legacy_ams_taxonomy_id" : "1"
      },
      "access" : null,
      "timestamp" : 1658993473879,
      "must_have" : {
        "education_level" : [ ],
        "work_experiences" : [ {
          "concept_id" : "bbSi_hWq_H98",
          "weight" : 10,
          "label" : "Testledare/QA lead",
          "legacy_ams_taxonomy_id" : "6826"
        } ],
        "skills" : [ ],
        "education" : [ ],
        "languages" : [ ]
      },
      "occupation_field" : {
        "concept_id" : "apaJ_2ja_LuF",
        "label" : "Data/IT",
        "legacy_ams_taxonomy_id" : "3"
      },
      "scope_of_work" : {
        "min" : 100,
        "max" : 100
      },
      "salary_type" : {
        "concept_id" : "oG8G_9cW_nRf",
        "label" : "Fast månads- vecko- eller timlön",
        "legacy_ams_taxonomy_id" : "1"
      },
      "removed" : false,
      "salary_description" : "Månadslön",
      "access_to_own_car" : false,
      "publication_date" : "2022-07-28T09:31:13"
    },
    "name" : "Testledare",
    "user" : "hannes"
  },
  "sha1" : "ec0058939cd0a53a004413c04b24bf7599177839",
  "annotations" : [ {
    "preferred-label" : "Testledare/QA lead",
    "sentiment" : "MUST_HAVE",
    "type" : "occupation-name",
    "start-position" : 0,
    "end-position" : 10,
    "concept-id" : "bbSi_hWq_H98",
    "matched-string" : "testledare",
    "annotation-id" : 0
  }, {
    "preferred-label" : "Testledare/QA lead",
    "sentiment" : "MUST_HAVE",
    "type" : "occupation-name",
    "start-position" : 15,
    "end-position" : 25,
    "concept-id" : "bbSi_hWq_H98",
    "matched-string" : "testledare",
    "annotation-id" : 1
  }, {
    "preferred-label" : "Systemtestning",
    "type" : "skill",
    "start-position" : 84,
    "end-position" : 90,
    "concept-id" : "xAbu_uKA_Jeu",
    "matched-string" : "system",
    "annotation-id" : 13
  }, {
    "preferred-label" : "Acceptanstestning",
    "type" : "skill",
    "start-position" : 120,
    "end-position" : 135,
    "concept-id" : "jYaA_Cwa_Yyf",
    "matched-string" : "acceptanstester",
    "annotation-id" : 14
  }, {
    "preferred-label" : "Testledare/QA lead",
    "sentiment" : "MUST_HAVE",
    "type" : "occupation-name",
    "start-position" : 181,
    "end-position" : 191,
    "concept-id" : "bbSi_hWq_H98",
    "matched-string" : "testledare",
    "annotation-id" : 2
  }, {
    "preferred-label" : "Testledare/QA lead",
    "sentiment" : "MUST_HAVE",
    "type" : "occupation-name",
    "start-position" : 289,
    "end-position" : 299,
    "concept-id" : "bbSi_hWq_H98",
    "matched-string" : "testledare",
    "annotation-id" : 3
  }, {
    "preferred-label" : "Universitets- eller högskoleutbildning",
    "type" : "sni-level-5",
    "start-position" : 976,
    "end-position" : 996,
    "concept-id" : "4Hs1_pdH_C7k",
    "matched-string" : "Akademisk utbildning",
    "annotation-id" : 15
  }, {
    "preferred-label" : "ISTQB certificate",
    "type" : "skill",
    "start-position" : 1127,
    "end-position" : 1132,
    "concept-id" : "g6at_Enf_Q85",
    "matched-string" : "ISTQB",
    "annotation-id" : 16
  }, {
    "preferred-label" : "Testautomatisering/Test automation",
    "sentiment" : "MUST_HAVE",
    "type" : "skill",
    "start-position" : 1232,
    "end-position" : 1250,
    "concept-id" : "muKv_rHW_7ES",
    "matched-string" : "testautomatisering",
    "annotation-id" : 4
  }, {
    "preferred-label" : "Svenska",
    "sentiment" : "MUST_HAVE",
    "type" : "language",
    "start-position" : 1294,
    "end-position" : 1301,
    "concept-id" : "zSLA_vw2_FXN",
    "matched-string" : "svenska",
    "annotation-id" : 5
  }, {
    "preferred-label" : "Engelska",
    "sentiment" : "MUST_HAVE",
    "type" : "language",
    "start-position" : 1306,
    "end-position" : 1314,
    "concept-id" : "NVxJ_hLg_TYS",
    "matched-string" : "engelska",
    "annotation-id" : 6
  }, {
    "preferred-label" : "Testledare/QA lead",
    "sentiment" : "MUST_HAVE",
    "type" : "occupation-name",
    "start-position" : 1407,
    "end-position" : 1417,
    "concept-id" : "bbSi_hWq_H98",
    "matched-string" : "testledare",
    "annotation-id" : 7
  }, {
    "preferred-label" : "Data/IT",
    "sentiment" : "MUST_HAVE",
    "type" : "occupation-field",
    "start-position" : 2296,
    "end-position" : 2298,
    "concept-id" : "apaJ_2ja_LuF",
    "matched-string" : "it",
    "annotation-id" : 11
  }, {
    "preferred-label" : "Ekonomi",
    "sentiment" : "MUST_HAVE",
    "type" : "keyword",
    "start-position" : 2331,
    "end-position" : 2338,
    "concept-id" : "PW4f_bmT_new",
    "matched-string" : "ekonomi",
    "annotation-id" : 12
  } ],
  "text" : "Testledare\nSom testledare ingår planera, leda, medverka och ansvara för arbetet med system- och integrationstester samt acceptanstester . \n\nKortfattat vad som ingår i uppdraget som testledare: \n\n- Följa testprocesser \n- Rapportera status \n- Introducera nya testare \n- Koordinera med andra testledare/testare \n- Planera, koordinera och genomföra tillägg/förändringar i testdesign och testplan beroende på Change Requests som identifieras inom ramen för kravarbetet \n- Säkerställa de verksamhetsprocesser som faller inom teamets ansvar \n- Förvalta och utveckla testprocesserna \n- Ansvara för testmiljöerna och testa nya releaser\n\nVem är du?\n\nDet är av vikt att du har en analytisk förmåga och arbetar problemlösande och ser aldrig några hinder i ditt arbete \n\nDitt arbetssätt är strukturerat och resultatorienterad. Prestigelös, ödmjuk, lätt att samarbeta med samt delar med dig av din kunskap är de personliga egenskaper vi lägger stor vikt vid. \n\nDin tidigare erfarenhet: \n\n- Akademisk utbildning eller motsvarande arbetslivserfarenhet \n- Erfarenhet av komplexa testmiljöer \n- Erfarenhet av att kommunicera frågeställningar \n- ISTQB \n- Erfarenhet från större organisationer \n- Kompetens runt och erfarenhet av olika testverktyg för testautomatisering \n- Daglig kontakt med internt anställda på svenska och engelska, mycket goda kunskaper i båda språken i tal och skrift \n- Några års erfarenhet i rollen som testledare \n- Meriterande med erfarenhet från offentlig verksamhet\n\nHur du ansöker\n\nLåter rollen intressant och passande? Ansök i så fall omgående för vi intervjuar löpande och rollen kan tillsättas innan sista ansökningsdatum. \n\nVi är flera rekryterare som hanterar rekryteringen av denna tjänst, vid frågor gällande den här rekryteringen eller tjänsten når du oss enklast på e-post info@quest.se \n\nVi kan enbart ta emot och bearbeta din ansökan genom att du registrerar ditt CV i vår portal. Med avseende på GDPR kan vi ej ta emot ansökningar via e-post. \n\nDetta uppdrag är säkerhetsklassat, säkerhetsklassning bedöms ta ca 6-10 veckor. Start kan inte ske innan godkänd säkerhetsklassning. \n\nVarmt välkommen med din ansökan!\n\nOm Quest Consulting\n\nQuest Consulting är ett auktoriserat konsultbolag med kollektivavtal, försäkringar, friskvård och tjänstepension. Vi är specialiserade inom IT, Teknik, HR, Administration och Ekonomi. Vår målsättning är att vara din personliga samarbetspartner och just därför är det så viktigt för oss att arbeta efter våra kärnvärden där våra ledord är att vara Personliga, Nyskapande och Professionella."
}