{
  "meta" : {
    "jobad" : {
      "description" : {
        "requirements" : null,
        "needs" : null,
        "company_information" : null,
        "text_formatted" : "Om tjänsten\nVi söker dig som brinner för service och nöjda kunder! Hemlarmsföretaget Gardio söker nu en kundtjänstmedarbetare till deras växande kundtjänst. Vi erbjuder en arbetsmiljö  i Solna där man kommer utvecklas inom service och affärsmannaskap. Du kommer tillhöra ett litet och tight team om 3 personer som jobbar tätt ihop. Effektivitet och kundnöjdhet är nyckeln i det här jobbet och man ska kunna ha många bollar i luften men samtidigt alltid sätta kunden i fokus för att lösa deras problem. Gardio är ett snabbväxande bolag där man har möjlighet att klättra och gå mot andra roller och avdelningar om man visar framfötterna på sikt. Låter det här som någonting för dig? Ansök redan idag, urval sker löpande\n\nDina arbetsuppgifter\n•\tBesvara inkommande samtal.\n•\tSvara på mail\n•\tAdministrera kundavtal\n•\tVägleda och besvara kunders frågor gällande hemlarm\n•\tBoka ut tekniker vid behov\n\n\nDin profil\nDin erfarenhet\n•\tHar en vilja av att hjälpa och professionell attityd.\n•       Service- och försäljningserfarenhet är ett krav\n•\tTidigare arbete med telefonen som verktyg är ett krav.\n•\tFlytande i svenska i tal och skrift och goda kunskaper i engelska.\n\nVem är du?\nVi värdesätter dina personliga egenskaper, och tror att du känner igen dig i dessa! \n\nVi tror att du:\n•\tÄr flexibel.\n•\tÄr serviceinriktad. \n•\tÄr flexibel.\n\nOm företaget\nVi erbjuder\n•\tIndividuell lön.\n•\tArbetstiderna 8-17. Stängt röda dagar och helg.\n•\tFina kontorslokaler och nära till kommunikationer i Solna.\n\nHar du viljan att hjälpa? Trivs du när ditt arbete gör livet lättare för andra? Gillar du att skapa relationer - då är detta jobbet för dig. \n\nAnsök idag! Urval sker löpande.\n\nOm oss\nRecruitive är en tjänsteleverantör inom rekrytering och bemanning med ett heltäckande erbjudande inom tjänstemannasektorn i Stockholm, Borås, Eskilstuna, Örebro och Göteborg. \nVi är auktoriserat Bemanning- &amp; Rekryteringsföretag och har kollektivavtal med Unionen och Akademikerförbundet. Vi erbjuder  friskvårdsbidrag, företagshälsovård och pensionsavsättningar till våra anställda. Som anställd på Recruitive får du en konsultchef som finns tillgänglig för dig under hela anställningsperioden. Konsultchefen har som uppgift att hjälpa dig att utvecklas i din yrkesroll och säkerställa att du trivs på din arbetsplats.",
        "conditions" : "Heltid\r\nTillsvidare",
        "text" : "Om tjänsten\nVi söker dig som brinner för service och nöjda kunder! Hemlarmsföretaget Gardio söker nu en kundtjänstmedarbetare till deras växande kundtjänst. Vi erbjuder en arbetsmiljö  i Solna där man kommer utvecklas inom service och affärsmannaskap. Du kommer tillhöra ett litet och tight team om 3 personer som jobbar tätt ihop. Effektivitet och kundnöjdhet är nyckeln i det här jobbet och man ska kunna ha många bollar i luften men samtidigt alltid sätta kunden i fokus för att lösa deras problem. Gardio är ett snabbväxande bolag där man har möjlighet att klättra och gå mot andra roller och avdelningar om man visar framfötterna på sikt. Låter det här som någonting för dig? Ansök redan idag, urval sker löpande\n\nDina arbetsuppgifter\n•\tBesvara inkommande samtal.\n•\tSvara på mail\n•\tAdministrera kundavtal\n•\tVägleda och besvara kunders frågor gällande hemlarm\n•\tBoka ut tekniker vid behov\n\n\nDin profil\nDin erfarenhet\n•\tHar en vilja av att hjälpa och professionell attityd.\n•       Service- och försäljningserfarenhet är ett krav\n•\tTidigare arbete med telefonen som verktyg är ett krav.\n•\tFlytande i svenska i tal och skrift och goda kunskaper i engelska.\n\nVem är du?\nVi värdesätter dina personliga egenskaper, och tror att du känner igen dig i dessa! \n\nVi tror att du:\n•\tÄr flexibel.\n•\tÄr serviceinriktad. \n•\tÄr flexibel.\n\nOm företaget\nVi erbjuder\n•\tIndividuell lön.\n•\tArbetstiderna 8-17. Stängt röda dagar och helg.\n•\tFina kontorslokaler och nära till kommunikationer i Solna.\n\nHar du viljan att hjälpa? Trivs du när ditt arbete gör livet lättare för andra? Gillar du att skapa relationer - då är detta jobbet för dig. \n\nAnsök idag! Urval sker löpande.\n\nOm oss\nRecruitive är en tjänsteleverantör inom rekrytering och bemanning med ett heltäckande erbjudande inom tjänstemannasektorn i Stockholm, Borås, Eskilstuna, Örebro och Göteborg. \nVi är auktoriserat Bemanning- & Rekryteringsföretag och har kollektivavtal med Unionen och Akademikerförbundet. Vi erbjuder  friskvårdsbidrag, företagshälsovård och pensionsavsättningar till våra anställda. Som anställd på Recruitive får du en konsultchef som finns tillgänglig för dig under hela anställningsperioden. Konsultchefen har som uppgift att hjälpa dig att utvecklas i din yrkesroll och säkerställa att du trivs på din arbetsplats."
      },
      "headline" : "Kundtjänst till hemlarmsföretag!",
      "driving_license" : null,
      "employer" : {
        "email" : null,
        "phone_number" : null,
        "organization_number" : "5590729546",
        "name" : "Recruitive AB",
        "url" : "http://www.recruitive.se/",
        "workplace" : "Recruitive AB"
      },
      "removed_date" : null,
      "logo_url" : "https://www.arbetsformedlingen.se/rest/arbetsgivare/rest/af/v3/organisation/5590729546/logotyper/logo.png",
      "last_publication_date" : "2022-08-13T23:59:59",
      "number_of_vacancies" : 1,
      "occupation" : {
        "concept_id" : "8Uhp_XYo_z5f",
        "label" : "Kundtjänstmedarbetare",
        "legacy_ams_taxonomy_id" : "2291"
      },
      "occupation_group" : {
        "concept_id" : "pwRH_MT1_8nR",
        "label" : "Kundtjänstpersonal",
        "legacy_ams_taxonomy_id" : "4222"
      },
      "employment_type" : {
        "concept_id" : "PFZr_Syz_cUq",
        "label" : "Vanlig anställning",
        "legacy_ams_taxonomy_id" : "1"
      },
      "webpage_url" : "https://arbetsformedlingen.se/platsbanken/annonser/26329734",
      "driving_license_required" : false,
      "application_contacts" : [ {
        "description" : "Helena Wallin",
        "email" : "helena.wallin@recruitive.se",
        "telephone" : null,
        "name" : null,
        "contact_type" : null
      } ],
      "duration" : {
        "concept_id" : "a7uU_j21_mkL",
        "label" : "Tills vidare",
        "legacy_ams_taxonomy_id" : "1"
      },
      "nice_to_have" : {
        "education_level" : [ ],
        "work_experiences" : [ ],
        "skills" : [ ],
        "education" : [ ],
        "languages" : [ ]
      },
      "application_details" : {
        "via_af" : false,
        "email" : null,
        "other" : null,
        "reference" : "5816",
        "url" : "http://recruitive.se/lediga-jobb/visa-annons/?jaid=5816",
        "information" : null
      },
      "source_type" : "VIA_PLATSBANKEN_DXA",
      "application_deadline" : "2022-08-13T23:59:59",
      "external_id" : "46-559072-9546-5816",
      "workplace_address" : {
        "coordinates" : [ 18.06858, 59.329323 ],
        "city" : null,
        "postcode" : null,
        "municipality" : "Stockholm",
        "region_concept_id" : "CifL_Rzy_Mku",
        "region" : "Stockholms län",
        "country_code" : "199",
        "region_code" : "01",
        "municipality_concept_id" : "AvNB_uwa_6n6",
        "country_concept_id" : "i46j_HmG_v64",
        "municipality_code" : "0180",
        "street_address" : null,
        "country" : "Sverige"
      },
      "id" : "26329734",
      "experience_required" : true,
      "working_hours_type" : {
        "concept_id" : "6YE1_gAC_R2G",
        "label" : "Heltid",
        "legacy_ams_taxonomy_id" : "1"
      },
      "access" : null,
      "timestamp" : 1657872159600,
      "must_have" : {
        "education_level" : [ ],
        "work_experiences" : [ {
          "concept_id" : "8Uhp_XYo_z5f",
          "weight" : 10,
          "label" : "Kundtjänstmedarbetare",
          "legacy_ams_taxonomy_id" : "2291"
        } ],
        "skills" : [ ],
        "education" : [ ],
        "languages" : [ ]
      },
      "occupation_field" : {
        "concept_id" : "RPTn_bxG_ExZ",
        "label" : "Försäljning, inköp, marknadsföring",
        "legacy_ams_taxonomy_id" : "5"
      },
      "scope_of_work" : {
        "min" : 100,
        "max" : 100
      },
      "salary_type" : {
        "concept_id" : "oG8G_9cW_nRf",
        "label" : "Fast månads- vecko- eller timlön",
        "legacy_ams_taxonomy_id" : "1"
      },
      "removed" : false,
      "salary_description" : "Fast lön",
      "access_to_own_car" : false,
      "publication_date" : "2022-07-15T10:02:39"
    },
    "name" : "Kundtjänst till hemlarmsföretag!",
    "user" : "hannes"
  },
  "sha1" : "70b4e88e2b62bd8bb69b31f187e7309aaf9728b1",
  "annotations" : [ {
    "preferred-label" : "Kundtjänst",
    "sentiment" : "MUST_HAVE",
    "type" : "skill",
    "start-position" : 0,
    "end-position" : 10,
    "concept-id" : "aMyW_hB7_TpU",
    "matched-string" : "kundtjänst",
    "annotation-id" : 0
  }, {
    "preferred-label" : "Kundtjänstmedarbetare",
    "sentiment" : "MUST_HAVE",
    "type" : "occupation-name",
    "start-position" : 137,
    "end-position" : 158,
    "concept-id" : "8Uhp_XYo_z5f",
    "matched-string" : "kundtjänstmedarbetare",
    "annotation-id" : 1
  }, {
    "preferred-label" : "Kundtjänst",
    "sentiment" : "MUST_HAVE",
    "type" : "skill",
    "start-position" : 178,
    "end-position" : 188,
    "concept-id" : "aMyW_hB7_TpU",
    "matched-string" : "kundtjänst",
    "annotation-id" : 2
  }, {
    "preferred-label" : "arbetsmiljö",
    "sentiment" : "MUST_HAVE",
    "type" : "esco-skill",
    "start-position" : 205,
    "end-position" : 216,
    "concept-id" : "zdQY_QJh_nUH",
    "matched-string" : "arbetsmiljö",
    "annotation-id" : 3
  }, {
    "preferred-label" : "Solna",
    "type" : "municipality",
    "start-position" : 220,
    "end-position" : 225,
    "concept-id" : "zHxw_uJZ_NJ8",
    "matched-string" : "Solna",
    "annotation-id" : 10
  }, {
    "preferred-label" : "Affärsmannaskap",
    "sentiment" : "MUST_HAVE",
    "type" : "keyword",
    "start-position" : 268,
    "end-position" : 283,
    "concept-id" : "zgV5_X3h_GgS",
    "matched-string" : "affärsmannaskap",
    "annotation-id" : 4
  }, {
    "preferred-label" : "Verktyg",
    "sentiment" : "MUST_HAVE",
    "type" : "skill",
    "start-position" : 1102,
    "end-position" : 1109,
    "concept-id" : "KG9j_WxP_ym2",
    "matched-string" : "verktyg",
    "annotation-id" : 5
  }, {
    "preferred-label" : "Svenska",
    "sentiment" : "MUST_HAVE",
    "type" : "language",
    "start-position" : 1136,
    "end-position" : 1143,
    "concept-id" : "zSLA_vw2_FXN",
    "matched-string" : "svenska",
    "annotation-id" : 6
  }, {
    "preferred-label" : "Engelska",
    "sentiment" : "MUST_HAVE",
    "type" : "language",
    "start-position" : 1182,
    "end-position" : 1190,
    "concept-id" : "NVxJ_hLg_TYS",
    "matched-string" : "engelska",
    "annotation-id" : 7
  }, {
    "preferred-label" : "Solna",
    "type" : "municipality",
    "start-position" : 1508,
    "end-position" : 1513,
    "concept-id" : "zHxw_uJZ_NJ8",
    "matched-string" : "Solna",
    "annotation-id" : 11
  }, {
    "preferred-label" : "Stockholm",
    "type" : "municipality",
    "start-position" : 1823,
    "end-position" : 1832,
    "concept-id" : "AvNB_uwa_6n6",
    "matched-string" : "Stockholm",
    "annotation-id" : 12
  }, {
    "preferred-label" : "Borås",
    "type" : "municipality",
    "start-position" : 1834,
    "end-position" : 1839,
    "concept-id" : "TpRZ_bFL_jhL",
    "matched-string" : "Borås",
    "annotation-id" : 13
  }, {
    "preferred-label" : "Eskilstuna",
    "type" : "municipality",
    "start-position" : 1841,
    "end-position" : 1851,
    "concept-id" : "kMxr_NiX_YrU",
    "matched-string" : "Eskilstuna",
    "annotation-id" : 14
  }, {
    "preferred-label" : "Örebro",
    "type" : "municipality",
    "start-position" : 1853,
    "end-position" : 1859,
    "concept-id" : "kuMn_feU_hXx",
    "matched-string" : "Örebro",
    "annotation-id" : 15
  }, {
    "preferred-label" : "Göteborg",
    "type" : "municipality",
    "start-position" : 1864,
    "end-position" : 1872,
    "concept-id" : "PVZL_BQT_XtL",
    "matched-string" : "Göteborg",
    "annotation-id" : 16
  }, {
    "preferred-label" : "Kollektivavtal",
    "sentiment" : "MUST_HAVE",
    "type" : "skill",
    "start-position" : 1935,
    "end-position" : 1949,
    "concept-id" : "z7wE_9xb_3jX",
    "matched-string" : "kollektivavtal",
    "annotation-id" : 8
  }, {
    "preferred-label" : "Företagshälsovård",
    "sentiment" : "MUST_HAVE",
    "type" : "skill",
    "start-position" : 2018,
    "end-position" : 2035,
    "concept-id" : "ULfW_rVS_Vpr",
    "matched-string" : "företagshälsovård",
    "annotation-id" : 9
  } ],
  "text" : "Kundtjänst till hemlarmsföretag!\nOm tjänsten\nVi söker dig som brinner för service och nöjda kunder! Hemlarmsföretaget Gardio söker nu en kundtjänstmedarbetare till deras växande kundtjänst. Vi erbjuder en arbetsmiljö  i Solna där man kommer utvecklas inom service och affärsmannaskap. Du kommer tillhöra ett litet och tight team om 3 personer som jobbar tätt ihop. Effektivitet och kundnöjdhet är nyckeln i det här jobbet och man ska kunna ha många bollar i luften men samtidigt alltid sätta kunden i fokus för att lösa deras problem. Gardio är ett snabbväxande bolag där man har möjlighet att klättra och gå mot andra roller och avdelningar om man visar framfötterna på sikt. Låter det här som någonting för dig? Ansök redan idag, urval sker löpande\n\nDina arbetsuppgifter\n•\tBesvara inkommande samtal.\n•\tSvara på mail\n•\tAdministrera kundavtal\n•\tVägleda och besvara kunders frågor gällande hemlarm\n•\tBoka ut tekniker vid behov\n\n\nDin profil\nDin erfarenhet\n•\tHar en vilja av att hjälpa och professionell attityd.\n•       Service- och försäljningserfarenhet är ett krav\n•\tTidigare arbete med telefonen som verktyg är ett krav.\n•\tFlytande i svenska i tal och skrift och goda kunskaper i engelska.\n\nVem är du?\nVi värdesätter dina personliga egenskaper, och tror att du känner igen dig i dessa! \n\nVi tror att du:\n•\tÄr flexibel.\n•\tÄr serviceinriktad. \n•\tÄr flexibel.\n\nOm företaget\nVi erbjuder\n•\tIndividuell lön.\n•\tArbetstiderna 8-17. Stängt röda dagar och helg.\n•\tFina kontorslokaler och nära till kommunikationer i Solna.\n\nHar du viljan att hjälpa? Trivs du när ditt arbete gör livet lättare för andra? Gillar du att skapa relationer - då är detta jobbet för dig. \n\nAnsök idag! Urval sker löpande.\n\nOm oss\nRecruitive är en tjänsteleverantör inom rekrytering och bemanning med ett heltäckande erbjudande inom tjänstemannasektorn i Stockholm, Borås, Eskilstuna, Örebro och Göteborg. \nVi är auktoriserat Bemanning- & Rekryteringsföretag och har kollektivavtal med Unionen och Akademikerförbundet. Vi erbjuder  friskvårdsbidrag, företagshälsovård och pensionsavsättningar till våra anställda. Som anställd på Recruitive får du en konsultchef som finns tillgänglig för dig under hela anställningsperioden. Konsultchefen har som uppgift att hjälpa dig att utvecklas i din yrkesroll och säkerställa att du trivs på din arbetsplats."
}