{
  "meta" : {
    "jobad" : {
      "description" : {
        "requirements" : null,
        "needs" : null,
        "company_information" : null,
        "text_formatted" : "<p>Är du intresserad av ett extrajobb och kan jobba 2-3 dagar i veckan? Toppen, då har du hittat rätt! Vi på Manpower söker just nu lagerarbetare till Maersks lager i Torslanda. Jobbet passar dig som är engagerad, driven och som trivs bra med att arbeta fysiskt. Låter det som något för dig? Varmt välkommen med din ansökan! #jobbjustnu</p>\n<p>I den här tjänsten kommer du att arbeta extra på Maersk som konsult, vilket innebär att du är anställd av oss på Manpower men arbetar som uthyrd till Maersk i Torslanda. Detta ger dig en mängd fördelar som vi gärna berättar mer om!\n\n<iframe width=\"1280\" height=\"720\" src=\"https://www.youtube.com/embed/Tk3qzrX9Aqo\" title=\"YouTube video player\" frameborder=\"0\" allow=\"accelerometer; autoplay; clipboard-write; encrypted-media; gyroscope; picture-in-picture\" allowfullscreen></iframe>\n\nÄr du rätt för rollen som lagerarbetare på Maersk?\n\nVi letar efter dig som vill ha ett extrajobb vid sidan av deltidsjobb eller studier och gillar fysiskt arbete med högt tempo. Arbetsuppgifterna för tjänsten kan komma att variera beroende på vilken avdelning man hamnar på.\n\nMaersks lager är placerat i Arendal i Torslanda och arbetstiderna kan variera.\n\nDagsskift:\n Måndag-fredag: 06.00-15.00\n\nKvällsskift:\n Måndag-fredag: 15.00-00.00\n\nDu behöver med andra ord kunna jobba 2-3 dagar på dagtid med start omgående för att bli aktuell för den här tjänsten.\n\nÄr det dig vi söker?\n\nTill rollen som lagerarbetare på Maersk söker vi framför allt dig som är en engagerad och driven person som motiveras av att få ta eget ansvar och att få bli en viktig medlem i teamet. För att komma in i rollen så snabbt som möjligt är det ett stort plus om du har erfarenhet av liknande fysiskt tungt arbete eller av att arbeta på lager. Det dagliga arbetet kräver att du är strukturerad samt stresstålig i din yrkesroll.\n\nVi söker dig som\n\n * har en annan huvudsaklig sysselsättning på minst 50% - deltidsjobb, studier, egenföretagare, elitidrottare mm.\n * har god fysik\n\nDet är meriterande för tjänsten om du har truckkort A1-A4, B1-B4 och B-körkort och tillgång till bil.\n\nVad erbjuder Manpower mig?\n\nVi på Manpower hjälper dig att forma din framtid utifrån din kompetens samt dina behov och önskemål. Vi samarbetar med många attraktiva företag och kan öppna dörren till intressanta och spännande uppdrag. Som resurskonsult hos oss får du en anställning med allt vad det innebär i form av marknadsmässig lön, övertidsersättning, semester, tjänstepension och försäkringar enligt kollektivavtal. Friskvårdsbidrag och företagshälsovård ingår också.\n\nSök tjänsten idag!\n\nGenom att skicka in din ansökan via vår hemsida så har du fullföljt din ansökan. Vid frågor om tjänsten är du välkommen att kontakta Sabina via e-post: sabina.larsson@manpower.se. Start för tjänsten är omgående, det innebär att urval och tillsättningar för tjänsten sker löpande och därmed kan annonsen tas bort redan innan sista ansökningsdatum. Vi ser fram emot att höra från dig!\n\n​​​​​​​<img src=\"https://mpgnlogo.blob.core.windows.net/swe/cbed7d94-753a-486a-8e77-ffab750d72f3.png\">\n\nOm Manpower\n\nManpower är Sveriges ledande rekryterings- och bemanningsföretag med tiotusentals attraktiva arbetsgivare över hela landet som våra kunder. Med vårt omfattande nätverk, lokalt såväl som globalt, kan vi erbjuda mängder av spännande lediga jobb som hjälper dig att bygga din karriär, både på kort och lång sikt. Hos oss kan du söka heltidsjobb eller extrajobb vid sidan av studierna.</p>",
        "conditions" : "Deltid\r\nTemporary",
        "text" : "Är du intresserad av ett extrajobb och kan jobba 2-3 dagar i veckan? Toppen, då har du hittat rätt! Vi på Manpower söker just nu lagerarbetare till Maersks lager i Torslanda. Jobbet passar dig som är engagerad, driven och som trivs bra med att arbeta fysiskt. Låter det som något för dig? Varmt välkommen med din ansökan! #jobbjustnu\n\nI den här tjänsten kommer du att arbeta extra på Maersk som konsult, vilket innebär att du är anställd av oss på Manpower men arbetar som uthyrd till Maersk i Torslanda. Detta ger dig en mängd fördelar som vi gärna berättar mer om!\n\n\n\nÄr du rätt för rollen som lagerarbetare på Maersk?\n\nVi letar efter dig som vill ha ett extrajobb vid sidan av deltidsjobb eller studier och gillar fysiskt arbete med högt tempo. Arbetsuppgifterna för tjänsten kan komma att variera beroende på vilken avdelning man hamnar på.\n\nMaersks lager är placerat i Arendal i Torslanda och arbetstiderna kan variera.\n\nDagsskift:\n Måndag-fredag: 06.00-15.00\n\nKvällsskift:\n Måndag-fredag: 15.00-00.00\n\nDu behöver med andra ord kunna jobba 2-3 dagar på dagtid med start omgående för att bli aktuell för den här tjänsten.\n\nÄr det dig vi söker?\n\nTill rollen som lagerarbetare på Maersk söker vi framför allt dig som är en engagerad och driven person som motiveras av att få ta eget ansvar och att få bli en viktig medlem i teamet. För att komma in i rollen så snabbt som möjligt är det ett stort plus om du har erfarenhet av liknande fysiskt tungt arbete eller av att arbeta på lager. Det dagliga arbetet kräver att du är strukturerad samt stresstålig i din yrkesroll.\n\nVi söker dig som\n\n * har en annan huvudsaklig sysselsättning på minst 50% - deltidsjobb, studier, egenföretagare, elitidrottare mm.\n * har god fysik\n\nDet är meriterande för tjänsten om du har truckkort A1-A4, B1-B4 och B-körkort och tillgång till bil.\n\nVad erbjuder Manpower mig?\n\nVi på Manpower hjälper dig att forma din framtid utifrån din kompetens samt dina behov och önskemål. Vi samarbetar med många attraktiva företag och kan öppna dörren till intressanta och spännande uppdrag. Som resurskonsult hos oss får du en anställning med allt vad det innebär i form av marknadsmässig lön, övertidsersättning, semester, tjänstepension och försäkringar enligt kollektivavtal. Friskvårdsbidrag och företagshälsovård ingår också.\n\nSök tjänsten idag!\n\nGenom att skicka in din ansökan via vår hemsida så har du fullföljt din ansökan. Vid frågor om tjänsten är du välkommen att kontakta Sabina via e-post: sabina.larsson@manpower.se. Start för tjänsten är omgående, det innebär att urval och tillsättningar för tjänsten sker löpande och därmed kan annonsen tas bort redan innan sista ansökningsdatum. Vi ser fram emot att höra från dig!\n\n​​​​​​​\n\nOm Manpower\n\nManpower är Sveriges ledande rekryterings- och bemanningsföretag med tiotusentals attraktiva arbetsgivare över hela landet som våra kunder. Med vårt omfattande nätverk, lokalt såväl som globalt, kan vi erbjuda mängder av spännande lediga jobb som hjälper dig att bygga din karriär, både på kort och lång sikt. Hos oss kan du söka heltidsjobb eller extrajobb vid sidan av studierna."
      },
      "headline" : "Extrajobb som lagerarbetare på Maersks lager!",
      "driving_license" : null,
      "employer" : {
        "email" : null,
        "phone_number" : null,
        "organization_number" : "5563481588",
        "name" : "Manpower AB",
        "url" : null,
        "workplace" : "Manpower"
      },
      "removed_date" : null,
      "logo_url" : "https://www.arbetsformedlingen.se/rest/arbetsgivare/rest/af/v3/organisation/5563481588/logotyper/logo.png",
      "last_publication_date" : "2022-07-15T23:59:59",
      "number_of_vacancies" : 5,
      "occupation" : {
        "concept_id" : "sizv_uPq_nWf",
        "label" : "Lagerarbetare",
        "legacy_ams_taxonomy_id" : "5842"
      },
      "occupation_group" : {
        "concept_id" : "kLyY_rwr_aJr",
        "label" : "Lager- och terminalpersonal",
        "legacy_ams_taxonomy_id" : "4322"
      },
      "employment_type" : {
        "concept_id" : "PFZr_Syz_cUq",
        "label" : "Vanlig anställning",
        "legacy_ams_taxonomy_id" : "1"
      },
      "webpage_url" : "https://arbetsformedlingen.se/platsbanken/annonser/26230973",
      "driving_license_required" : false,
      "application_contacts" : [ {
        "description" : "Sabina Larsson",
        "email" : null,
        "telephone" : null,
        "name" : null,
        "contact_type" : null
      } ],
      "duration" : {
        "concept_id" : "qQUd_4qe_NDT",
        "label" : "6 månader eller längre",
        "legacy_ams_taxonomy_id" : "2"
      },
      "nice_to_have" : {
        "education_level" : [ ],
        "work_experiences" : [ ],
        "skills" : [ ],
        "education" : [ ],
        "languages" : [ ]
      },
      "application_details" : {
        "via_af" : false,
        "email" : null,
        "other" : null,
        "reference" : "195a5280-9384-",
        "url" : "https://www.aplitrak.com/?adid=U0xhcnNzLjQ4Mzg1LjMxMDFAbWFucG93ZXJncm91cG5vcmRpY3MuYXBsaXRyYWsuY29t",
        "information" : null
      },
      "source_type" : "VIA_PLATSBANKEN_DXA",
      "application_deadline" : "2022-07-15T23:59:59",
      "external_id" : "46-556348-1588-195a5280-9384-",
      "workplace_address" : {
        "coordinates" : [ 11.97456, 57.70887 ],
        "city" : null,
        "postcode" : null,
        "municipality" : "Göteborg",
        "region_concept_id" : "zdoY_6u5_Krt",
        "region" : "Västra Götalands län",
        "country_code" : "199",
        "region_code" : "14",
        "municipality_concept_id" : "PVZL_BQT_XtL",
        "country_concept_id" : "i46j_HmG_v64",
        "municipality_code" : "1480",
        "street_address" : null,
        "country" : "Sverige"
      },
      "id" : "26230973",
      "experience_required" : false,
      "working_hours_type" : {
        "concept_id" : "947z_JGS_Uk2",
        "label" : "Deltid",
        "legacy_ams_taxonomy_id" : "2"
      },
      "access" : null,
      "timestamp" : 1655472521807,
      "must_have" : {
        "education_level" : [ ],
        "work_experiences" : [ ],
        "skills" : [ ],
        "education" : [ ],
        "languages" : [ ]
      },
      "occupation_field" : {
        "concept_id" : "ASGV_zcE_bWf",
        "label" : "Transport, distribution, lager",
        "legacy_ams_taxonomy_id" : "19"
      },
      "scope_of_work" : {
        "min" : 0,
        "max" : 100
      },
      "salary_type" : {
        "concept_id" : "oG8G_9cW_nRf",
        "label" : "Fast månads- vecko- eller timlön",
        "legacy_ams_taxonomy_id" : "1"
      },
      "removed" : false,
      "salary_description" : "Not Specified",
      "access_to_own_car" : false,
      "publication_date" : "2022-06-17T15:28:41"
    },
    "name" : "Extrajobb som lagerarbetare på Maersks lager!",
    "user" : "fisko"
  },
  "sha1" : "757faa8af15d8468a4539379f5a02baf03ed1034",
  "annotations" : [ {
    "preferred-label" : "Lagerarbetare",
    "type" : "occupation-name",
    "start-position" : 14,
    "end-position" : 27,
    "concept-id" : "sizv_uPq_nWf",
    "matched-string" : "lagerarbetare",
    "annotation-id" : 12
  }, {
    "preferred-label" : "Lagerarbetare",
    "type" : "occupation-name",
    "start-position" : 175,
    "end-position" : 188,
    "concept-id" : "sizv_uPq_nWf",
    "matched-string" : "lagerarbetare",
    "annotation-id" : 13
  }, {
    "preferred-label" : "Lagerarbetare",
    "type" : "occupation-name",
    "start-position" : 642,
    "end-position" : 655,
    "concept-id" : "sizv_uPq_nWf",
    "matched-string" : "lagerarbetare",
    "annotation-id" : 14
  }, {
    "preferred-label" : "Lagerarbetare",
    "type" : "occupation-name",
    "start-position" : 1211,
    "end-position" : 1224,
    "concept-id" : "sizv_uPq_nWf",
    "matched-string" : "lagerarbetare",
    "annotation-id" : 15
  }, {
    "preferred-label" : "visa ansvarstagande",
    "sentiment" : "MUST_HAVE",
    "type" : "esco-skill",
    "start-position" : 1323,
    "end-position" : 1337,
    "concept-id" : "bcRp_hxV_f5G",
    "matched-string" : "ta eget ansvar",
    "annotation-id" : 16
  }, {
    "preferred-label" : "God fysik (tunga lyft)",
    "sentiment" : "NICE_TO_HAVE",
    "type" : "skill",
    "start-position" : 1460,
    "end-position" : 1503,
    "concept-id" : "rwir_xvu_443",
    "matched-string" : "erfarenhet av liknande fysiskt tungt arbete",
    "annotation-id" : 22
  }, {
    "preferred-label" : "Terminal- och lagerarbete",
    "sentiment" : "NICE_TO_HAVE",
    "type" : "skill",
    "start-position" : 1517,
    "end-position" : 1532,
    "concept-id" : "ijHY_aHk_ADE",
    "matched-string" : "arbeta på lager",
    "annotation-id" : 18
  }, {
    "preferred-label" : null,
    "sentiment" : "MUST_HAVE",
    "type" : "skill",
    "start-position" : 1571,
    "end-position" : 1583,
    "concept-id" : null,
    "matched-string" : "strukturerad",
    "annotation-id" : 19
  }, {
    "preferred-label" : "Stresshantering",
    "sentiment" : "MUST_HAVE",
    "type" : "skill",
    "start-position" : 1589,
    "end-position" : 1600,
    "concept-id" : "XZbe_Z7P_jiL",
    "matched-string" : "stresstålig",
    "annotation-id" : 20
  }, {
    "preferred-label" : "God fysik - Lagerarbetare",
    "sentiment" : "MUST_HAVE",
    "type" : "swedish-retail-and-wholesale-council-skill",
    "start-position" : 1754,
    "end-position" : 1767,
    "concept-id" : "McPo_uhA_g4U",
    "matched-string" : "har god fysik",
    "annotation-id" : 21
  }, {
    "preferred-label" : "A-truckar",
    "sentiment" : "NICE_TO_HAVE",
    "type" : "skill",
    "start-position" : 1821,
    "end-position" : 1826,
    "concept-id" : "Zk4h_jP4_e85",
    "matched-string" : "A1-A4",
    "annotation-id" : 23
  }, {
    "preferred-label" : "B-truckar",
    "sentiment" : "NICE_TO_HAVE",
    "type" : "skill",
    "start-position" : 1828,
    "end-position" : 1833,
    "concept-id" : "HeXq_amc_ABd",
    "matched-string" : "B1-B4",
    "annotation-id" : 24
  }, {
    "preferred-label" : "B",
    "sentiment" : "NICE_TO_HAVE",
    "type" : "driving-licence",
    "start-position" : 1838,
    "end-position" : 1847,
    "concept-id" : "VTK8_WRx_GcM",
    "matched-string" : "B-körkort",
    "annotation-id" : 25
  }, {
    "preferred-label" : "Kollektivavtal",
    "sentiment" : "MUST_HAVE",
    "type" : "skill",
    "start-position" : 2277,
    "end-position" : 2291,
    "concept-id" : "z7wE_9xb_3jX",
    "matched-string" : "kollektivavtal",
    "annotation-id" : 10
  }, {
    "preferred-label" : "Företagshälsovård",
    "sentiment" : "MUST_HAVE",
    "type" : "skill",
    "start-position" : 2314,
    "end-position" : 2331,
    "concept-id" : "ULfW_rVS_Vpr",
    "matched-string" : "företagshälsovård",
    "annotation-id" : 11
  } ],
  "text" : "Extrajobb som lagerarbetare på Maersks lager!\nÄr du intresserad av ett extrajobb och kan jobba 2-3 dagar i veckan? Toppen, då har du hittat rätt! Vi på Manpower söker just nu lagerarbetare till Maersks lager i Torslanda. Jobbet passar dig som är engagerad, driven och som trivs bra med att arbeta fysiskt. Låter det som något för dig? Varmt välkommen med din ansökan! #jobbjustnu\n\nI den här tjänsten kommer du att arbeta extra på Maersk som konsult, vilket innebär att du är anställd av oss på Manpower men arbetar som uthyrd till Maersk i Torslanda. Detta ger dig en mängd fördelar som vi gärna berättar mer om!\n\n\n\nÄr du rätt för rollen som lagerarbetare på Maersk?\n\nVi letar efter dig som vill ha ett extrajobb vid sidan av deltidsjobb eller studier och gillar fysiskt arbete med högt tempo. Arbetsuppgifterna för tjänsten kan komma att variera beroende på vilken avdelning man hamnar på.\n\nMaersks lager är placerat i Arendal i Torslanda och arbetstiderna kan variera.\n\nDagsskift:\n Måndag-fredag: 06.00-15.00\n\nKvällsskift:\n Måndag-fredag: 15.00-00.00\n\nDu behöver med andra ord kunna jobba 2-3 dagar på dagtid med start omgående för att bli aktuell för den här tjänsten.\n\nÄr det dig vi söker?\n\nTill rollen som lagerarbetare på Maersk söker vi framför allt dig som är en engagerad och driven person som motiveras av att få ta eget ansvar och att få bli en viktig medlem i teamet. För att komma in i rollen så snabbt som möjligt är det ett stort plus om du har erfarenhet av liknande fysiskt tungt arbete eller av att arbeta på lager. Det dagliga arbetet kräver att du är strukturerad samt stresstålig i din yrkesroll.\n\nVi söker dig som\n\n * har en annan huvudsaklig sysselsättning på minst 50% - deltidsjobb, studier, egenföretagare, elitidrottare mm.\n * har god fysik\n\nDet är meriterande för tjänsten om du har truckkort A1-A4, B1-B4 och B-körkort och tillgång till bil.\n\nVad erbjuder Manpower mig?\n\nVi på Manpower hjälper dig att forma din framtid utifrån din kompetens samt dina behov och önskemål. Vi samarbetar med många attraktiva företag och kan öppna dörren till intressanta och spännande uppdrag. Som resurskonsult hos oss får du en anställning med allt vad det innebär i form av marknadsmässig lön, övertidsersättning, semester, tjänstepension och försäkringar enligt kollektivavtal. Friskvårdsbidrag och företagshälsovård ingår också.\n\nSök tjänsten idag!\n\nGenom att skicka in din ansökan via vår hemsida så har du fullföljt din ansökan. Vid frågor om tjänsten är du välkommen att kontakta Sabina via e-post: sabina.larsson@manpower.se. Start för tjänsten är omgående, det innebär att urval och tillsättningar för tjänsten sker löpande och därmed kan annonsen tas bort redan innan sista ansökningsdatum. Vi ser fram emot att höra från dig!\n\n​​​​​​​\n\nOm Manpower\n\nManpower är Sveriges ledande rekryterings- och bemanningsföretag med tiotusentals attraktiva arbetsgivare över hela landet som våra kunder. Med vårt omfattande nätverk, lokalt såväl som globalt, kan vi erbjuda mängder av spännande lediga jobb som hjälper dig att bygga din karriär, både på kort och lång sikt. Hos oss kan du söka heltidsjobb eller extrajobb vid sidan av studierna."
}