{
  "meta" : {
    "jobad" : {
      "description" : {
        "requirements" : null,
        "needs" : null,
        "company_information" : null,
        "text_formatted" : "<p><em>CMI Group är ett svenskt investmentbolag som äger och utvecklar företag. CMI Group är huvudsakligen inriktad på verksamheter inom fintech, kapitalförvaltning samt investeringar i tillväxtbolag. Med verksamhet i Sverige och utomlands, med drygt 300 antal anställda i 35 bolag, erbjuder CMI Group unika investeringsmöjligheter genom att erbjuda nischade finansiella lösningar och produkter baserade på kompetent och bred analys samt initierad marknadssyn.\n\nFöretagskulturen kännetecknas av professionalism, hög kompetens, nytänkande i kombination med entreprenöriellt driv.\n\nHuvudkontoret är placerat i moderna lokaler i Mood Gallerian i centrala Stockholm.\n\nFör mer information om koncernen, se </em><a href=\"http://www.cmigroup.se/\" target=\"_blank\"><em>www.cmigroup.se</em></a><em>.</em></p>\n<p></p>\n<p><strong>\n\nCMI Group växer och söker nu en Marketing Design Manager</strong></p>\n<p><strong>Arbetsuppgifter inbegriper men ej begränsat till:\n\n</strong>I denna roll ansvarar du för utformandet av visuellt material för kommunikation och marknadsföring i CMI Group med tillhörande koncernbolag. Du har förmågan att sätta dig in i och förstå olika typer av marknadsföringsmässiga utmaningar i syfte att skapa konceptuella och tilltalande lösningar för en stor variation av varumärken och branscher. I rollen ingår all sorts formgivning, typografi och visuellt underlag till den produkt som ska produceras – vilket kan vara allt från att skapa en presentation, säljmaterial, rapportmallar, nyhetsbrev och hemsidor till marknadsföringsmaterial i form av annonsformat, digital feature, kampanjsida eller en film.\n\n <strong>\n\nVem är du?</strong>\n\nVi fäster stor vikt vid din personlighet och ditt engagemang. Du är noggrann och alltid kvalitetsmedveten i ditt utförande och din leverans, kombinerat med hög kapacitet och förmåga att prioritera dina arbetsuppgifter. Vi söker dig som har hög affärsmässighet, personlig mognad och drivkraft samt en djup förståelse för marknadsföring och interaktiv design. Du är anpassningsbar, har en förmåga att möta och hantera olika typer av människor samt är en bra lagspelare. \n\nSjälvklart kan du Adobe XD, Photoshop, InDesign, Powerpoint och Illustrator eller likvärdiga program.</p>\n<p>Du är digitalt nyfiken, har ett brinnande intresse för användarbeteenden i syfte att skapa en optimal design och tilltalande marknadsföringsmaterial. Du har för vana att använda analyssystem, till exempel Google Analytics, Google Tag manager, Hotjar, för att följa upp ditt arbete gentemot uppsatta KPIer. Du har god kunskap i att utveckla sajtdesign samt vana av att använda publiceringsverktyg. \n\nDetta är en utmanande och bred roll som innefattar många delar.</p>\n<p><em>Viktigt att ha med sig är att rollen kan anpassas efter din/respektive kandidats erfarenhet och kunskap!</em></p>\n<p><strong>Kvalifikationer</strong>\n\nUniversitetsutbildning (min kandidatexamen.)\n\nMinst 3-5 års erfarenhet inom liknade eller angränsande roll gärna inom liknande eller angränsande bransch (fintech-/finansbranschen).\n\nDu har utmärkt kommunikationsförmåga, och du behärskar svenska och engelska flytande både i tal och i skrift.</p>\n<p><strong>Ansökan</strong>\n\n I denna rekrytering samarbetar vi med Talent &amp; Partner.\n\n Du är välkommen med din ansökan snarast då urval och intervjuer kommer att ske löpande.\n\n Dina ansökningshandlingar ska innehålla CV och ett personligt brev gärna foto.\n\n Skicka din ansökan idag via <a href=\"mailto:work@talentpartner.se\" target=\"_blank\">work@talentpartner.se</a></p>\n<p>\n</p>",
        "conditions" : "Heltid\r\nTillsvidareanställning ",
        "text" : "CMI Group är ett svenskt investmentbolag som äger och utvecklar företag. CMI Group är huvudsakligen inriktad på verksamheter inom fintech, kapitalförvaltning samt investeringar i tillväxtbolag. Med verksamhet i Sverige och utomlands, med drygt 300 antal anställda i 35 bolag, erbjuder CMI Group unika investeringsmöjligheter genom att erbjuda nischade finansiella lösningar och produkter baserade på kompetent och bred analys samt initierad marknadssyn.\n\nFöretagskulturen kännetecknas av professionalism, hög kompetens, nytänkande i kombination med entreprenöriellt driv.\n\nHuvudkontoret är placerat i moderna lokaler i Mood Gallerian i centrala Stockholm.\n\nFör mer information om koncernen, se www.cmigroup.se.\n\n\n\n\n\nCMI Group växer och söker nu en Marketing Design Manager\n\nArbetsuppgifter inbegriper men ej begränsat till:\n\nI denna roll ansvarar du för utformandet av visuellt material för kommunikation och marknadsföring i CMI Group med tillhörande koncernbolag. Du har förmågan att sätta dig in i och förstå olika typer av marknadsföringsmässiga utmaningar i syfte att skapa konceptuella och tilltalande lösningar för en stor variation av varumärken och branscher. I rollen ingår all sorts formgivning, typografi och visuellt underlag till den produkt som ska produceras – vilket kan vara allt från att skapa en presentation, säljmaterial, rapportmallar, nyhetsbrev och hemsidor till marknadsföringsmaterial i form av annonsformat, digital feature, kampanjsida eller en film.\n\n \n\nVem är du?\n\nVi fäster stor vikt vid din personlighet och ditt engagemang. Du är noggrann och alltid kvalitetsmedveten i ditt utförande och din leverans, kombinerat med hög kapacitet och förmåga att prioritera dina arbetsuppgifter. Vi söker dig som har hög affärsmässighet, personlig mognad och drivkraft samt en djup förståelse för marknadsföring och interaktiv design. Du är anpassningsbar, har en förmåga att möta och hantera olika typer av människor samt är en bra lagspelare. \n\nSjälvklart kan du Adobe XD, Photoshop, InDesign, Powerpoint och Illustrator eller likvärdiga program.\n\nDu är digitalt nyfiken, har ett brinnande intresse för användarbeteenden i syfte att skapa en optimal design och tilltalande marknadsföringsmaterial. Du har för vana att använda analyssystem, till exempel Google Analytics, Google Tag manager, Hotjar, för att följa upp ditt arbete gentemot uppsatta KPIer. Du har god kunskap i att utveckla sajtdesign samt vana av att använda publiceringsverktyg. \n\nDetta är en utmanande och bred roll som innefattar många delar.\n\nViktigt att ha med sig är att rollen kan anpassas efter din/respektive kandidats erfarenhet och kunskap!\n\nKvalifikationer\n\nUniversitetsutbildning (min kandidatexamen.)\n\nMinst 3-5 års erfarenhet inom liknade eller angränsande roll gärna inom liknande eller angränsande bransch (fintech-/finansbranschen).\n\nDu har utmärkt kommunikationsförmåga, och du behärskar svenska och engelska flytande både i tal och i skrift.\n\nAnsökan\n\n I denna rekrytering samarbetar vi med Talent & Partner.\n\n Du är välkommen med din ansökan snarast då urval och intervjuer kommer att ske löpande.\n\n Dina ansökningshandlingar ska innehålla CV och ett personligt brev gärna foto.\n\n Skicka din ansökan idag via work@talentpartner.se"
      },
      "headline" : "Marketing Design Manager",
      "driving_license" : null,
      "employer" : {
        "email" : null,
        "phone_number" : null,
        "organization_number" : "5568811763",
        "name" : "Talent & Partner AB",
        "url" : "http://talentpartner.se",
        "workplace" : "Talent & Partner AB"
      },
      "removed_date" : null,
      "logo_url" : "https://www.arbetsformedlingen.se/rest/arbetsgivare/rest/af/v3/organisation/5568811763/logotyper/logo.png",
      "last_publication_date" : "2022-08-09T23:59:59",
      "number_of_vacancies" : 1,
      "occupation" : {
        "concept_id" : "VpYo_k5f_N9R",
        "label" : "Grafisk formgivare",
        "legacy_ams_taxonomy_id" : "4039"
      },
      "occupation_group" : {
        "concept_id" : "8Bmh_vtM_zts",
        "label" : "Grafisk formgivare m.fl.",
        "legacy_ams_taxonomy_id" : "2172"
      },
      "employment_type" : {
        "concept_id" : "PFZr_Syz_cUq",
        "label" : "Vanlig anställning",
        "legacy_ams_taxonomy_id" : "1"
      },
      "webpage_url" : "https://arbetsformedlingen.se/platsbanken/annonser/26354719",
      "driving_license_required" : false,
      "application_contacts" : [ ],
      "duration" : {
        "concept_id" : "a7uU_j21_mkL",
        "label" : "Tills vidare",
        "legacy_ams_taxonomy_id" : "1"
      },
      "nice_to_have" : {
        "education_level" : [ ],
        "work_experiences" : [ ],
        "skills" : [ ],
        "education" : [ ],
        "languages" : [ ]
      },
      "application_details" : {
        "via_af" : false,
        "email" : null,
        "other" : null,
        "reference" : "talentpartner581",
        "url" : "https://talentpartner.se/jobb/581-marketing-design-manager/?pnty_src=arbetsformedlingen",
        "information" : null
      },
      "source_type" : "VIA_PLATSBANKEN_DXA",
      "application_deadline" : "2022-08-09T23:59:59",
      "external_id" : "46-556881-1763-talentpartner-581",
      "workplace_address" : {
        "coordinates" : [ 18.06858, 59.329323 ],
        "city" : null,
        "postcode" : null,
        "municipality" : "Stockholm",
        "region_concept_id" : "CifL_Rzy_Mku",
        "region" : "Stockholms län",
        "country_code" : "199",
        "region_code" : "01",
        "municipality_concept_id" : "AvNB_uwa_6n6",
        "country_concept_id" : "i46j_HmG_v64",
        "municipality_code" : "0180",
        "street_address" : null,
        "country" : "Sverige"
      },
      "id" : "26354719",
      "experience_required" : true,
      "working_hours_type" : {
        "concept_id" : "6YE1_gAC_R2G",
        "label" : "Heltid",
        "legacy_ams_taxonomy_id" : "1"
      },
      "access" : null,
      "timestamp" : 1658831323888,
      "must_have" : {
        "education_level" : [ ],
        "work_experiences" : [ {
          "concept_id" : "VpYo_k5f_N9R",
          "weight" : 10,
          "label" : "Grafisk formgivare",
          "legacy_ams_taxonomy_id" : "4039"
        } ],
        "skills" : [ ],
        "education" : [ ],
        "languages" : [ ]
      },
      "occupation_field" : {
        "concept_id" : "9puE_nYg_crq",
        "label" : "Kultur, media, design",
        "legacy_ams_taxonomy_id" : "11"
      },
      "scope_of_work" : {
        "min" : 100,
        "max" : 100
      },
      "salary_type" : {
        "concept_id" : "oG8G_9cW_nRf",
        "label" : "Fast månads- vecko- eller timlön",
        "legacy_ams_taxonomy_id" : "1"
      },
      "removed" : false,
      "salary_description" : "Månadslön - Fast lön",
      "access_to_own_car" : false,
      "publication_date" : "2022-07-26T12:28:43"
    },
    "name" : "Marketing Design Manager",
    "user" : "kristof.fischer"
  },
  "sha1" : "1e1433723fc7f418261a14ab934651ae30495a49",
  "annotations" : [ {
    "preferred-label" : "Manager",
    "type" : "occupation-name",
    "start-position" : 0,
    "end-position" : 24,
    "concept-id" : "X9jv_K2b_m48",
    "matched-string" : "Marketing Design Manager",
    "annotation-id" : 11
  }, {
    "preferred-label" : "Sverige",
    "type" : "country",
    "start-position" : 236,
    "end-position" : 243,
    "concept-id" : "i46j_HmG_v64",
    "matched-string" : "Sverige",
    "annotation-id" : 12
  }, {
    "preferred-label" : "Stockholm",
    "type" : "municipality",
    "start-position" : 670,
    "end-position" : 679,
    "concept-id" : "AvNB_uwa_6n6",
    "matched-string" : "Stockholm",
    "annotation-id" : 13
  }, {
    "preferred-label" : "Manager",
    "type" : "occupation-name",
    "start-position" : 773,
    "end-position" : 797,
    "concept-id" : "X9jv_K2b_m48",
    "matched-string" : "Marketing Design Manager",
    "annotation-id" : 14
  }, {
    "preferred-label" : "noggrannhet",
    "sentiment" : "MUST_HAVE",
    "type" : "esco-skill",
    "start-position" : 1589,
    "end-position" : 1597,
    "concept-id" : "mrsW_EkL_KRD",
    "matched-string" : "noggrann",
    "annotation-id" : 15
  }, {
    "preferred-label" : "prioritera uppgifter",
    "sentiment" : "MUST_HAVE",
    "type" : "esco-skill",
    "start-position" : 1695,
    "end-position" : 1738,
    "concept-id" : "j5rg_b5X_nBS",
    "matched-string" : "förmåga att prioritera dina arbetsuppgifter",
    "annotation-id" : 16
  }, {
    "preferred-label" : null,
    "sentiment" : "MUST_HAVE",
    "type" : "skill",
    "start-position" : 2009,
    "end-position" : 2017,
    "concept-id" : null,
    "matched-string" : "Adobe XD",
    "annotation-id" : 17
  }, {
    "preferred-label" : "2D-grafik-Adobe Photoshop",
    "sentiment" : "MUST_HAVE",
    "type" : "skill",
    "start-position" : 2019,
    "end-position" : 2028,
    "concept-id" : "xNyv_PTi_fSa",
    "matched-string" : "Photoshop",
    "annotation-id" : 18
  }, {
    "preferred-label" : "Layout-Adobe InDesign",
    "sentiment" : "MUST_HAVE",
    "type" : "skill",
    "start-position" : 2030,
    "end-position" : 2038,
    "concept-id" : "Y2t4_aS8_tGo",
    "matched-string" : "InDesign",
    "annotation-id" : 19
  }, {
    "preferred-label" : "MS Power Point",
    "sentiment" : "MUST_HAVE",
    "type" : "skill",
    "start-position" : 2040,
    "end-position" : 2050,
    "concept-id" : "8u7A_ze1_bvd",
    "matched-string" : "Powerpoint",
    "annotation-id" : 20
  }, {
    "preferred-label" : "2D-grafik-Adobe Illustrator",
    "sentiment" : "MUST_HAVE",
    "type" : "skill",
    "start-position" : 2055,
    "end-position" : 2066,
    "concept-id" : "FKub_QFH_Btk",
    "matched-string" : "Illustrator",
    "annotation-id" : 21
  }, {
    "preferred-label" : "Google Analytics",
    "sentiment" : "MUST_HAVE",
    "type" : "skill",
    "start-position" : 2299,
    "end-position" : 2315,
    "concept-id" : "oCKN_G9k_zTj",
    "matched-string" : "google analytics",
    "annotation-id" : 7
  }, {
    "preferred-label" : "Google Analytics",
    "sentiment" : "MUST_HAVE",
    "type" : "skill",
    "start-position" : 2317,
    "end-position" : 2335,
    "concept-id" : "oCKN_G9k_zTj",
    "matched-string" : "Google Tag manager",
    "annotation-id" : 22
  }, {
    "preferred-label" : null,
    "sentiment" : "MUST_HAVE",
    "type" : "skill",
    "start-position" : 2337,
    "end-position" : 2343,
    "concept-id" : null,
    "matched-string" : "Hotjar",
    "annotation-id" : 23
  }, {
    "preferred-label" : "Universitets- eller högskoleutbildning",
    "sentiment" : "MUST_HAVE",
    "type" : "sni-level-4",
    "start-position" : 2681,
    "end-position" : 2703,
    "concept-id" : "m1vC_Ssq_5Y7",
    "matched-string" : "Universitetsutbildning",
    "annotation-id" : 24
  }, {
    "preferred-label" : "2-4 års erfarenhet",
    "sentiment" : "MUST_HAVE",
    "type" : "occupation-experience-year",
    "start-position" : 2727,
    "end-position" : 2751,
    "concept-id" : "RWA2_uu6_udD",
    "matched-string" : "Minst 3-5 års erfarenhet",
    "annotation-id" : 25
  }, {
    "preferred-label" : "kommunikation",
    "sentiment" : "MUST_HAVE",
    "type" : "esco-skill",
    "start-position" : 2878,
    "end-position" : 2899,
    "concept-id" : "ahPU_HgE_Jeb",
    "matched-string" : "kommunikationsförmåga",
    "annotation-id" : 26
  }, {
    "preferred-label" : "Svenska",
    "sentiment" : "MUST_HAVE",
    "type" : "language",
    "start-position" : 2918,
    "end-position" : 2925,
    "concept-id" : "zSLA_vw2_FXN",
    "matched-string" : "svenska",
    "annotation-id" : 9
  }, {
    "preferred-label" : "Engelska",
    "sentiment" : "MUST_HAVE",
    "type" : "language",
    "start-position" : 2930,
    "end-position" : 2938,
    "concept-id" : "NVxJ_hLg_TYS",
    "matched-string" : "engelska",
    "annotation-id" : 10
  } ],
  "text" : "Marketing Design Manager\nCMI Group är ett svenskt investmentbolag som äger och utvecklar företag. CMI Group är huvudsakligen inriktad på verksamheter inom fintech, kapitalförvaltning samt investeringar i tillväxtbolag. Med verksamhet i Sverige och utomlands, med drygt 300 antal anställda i 35 bolag, erbjuder CMI Group unika investeringsmöjligheter genom att erbjuda nischade finansiella lösningar och produkter baserade på kompetent och bred analys samt initierad marknadssyn.\n\nFöretagskulturen kännetecknas av professionalism, hög kompetens, nytänkande i kombination med entreprenöriellt driv.\n\nHuvudkontoret är placerat i moderna lokaler i Mood Gallerian i centrala Stockholm.\n\nFör mer information om koncernen, se www.cmigroup.se.\n\n\n\n\n\nCMI Group växer och söker nu en Marketing Design Manager\n\nArbetsuppgifter inbegriper men ej begränsat till:\n\nI denna roll ansvarar du för utformandet av visuellt material för kommunikation och marknadsföring i CMI Group med tillhörande koncernbolag. Du har förmågan att sätta dig in i och förstå olika typer av marknadsföringsmässiga utmaningar i syfte att skapa konceptuella och tilltalande lösningar för en stor variation av varumärken och branscher. I rollen ingår all sorts formgivning, typografi och visuellt underlag till den produkt som ska produceras – vilket kan vara allt från att skapa en presentation, säljmaterial, rapportmallar, nyhetsbrev och hemsidor till marknadsföringsmaterial i form av annonsformat, digital feature, kampanjsida eller en film.\n\n \n\nVem är du?\n\nVi fäster stor vikt vid din personlighet och ditt engagemang. Du är noggrann och alltid kvalitetsmedveten i ditt utförande och din leverans, kombinerat med hög kapacitet och förmåga att prioritera dina arbetsuppgifter. Vi söker dig som har hög affärsmässighet, personlig mognad och drivkraft samt en djup förståelse för marknadsföring och interaktiv design. Du är anpassningsbar, har en förmåga att möta och hantera olika typer av människor samt är en bra lagspelare. \n\nSjälvklart kan du Adobe XD, Photoshop, InDesign, Powerpoint och Illustrator eller likvärdiga program.\n\nDu är digitalt nyfiken, har ett brinnande intresse för användarbeteenden i syfte att skapa en optimal design och tilltalande marknadsföringsmaterial. Du har för vana att använda analyssystem, till exempel Google Analytics, Google Tag manager, Hotjar, för att följa upp ditt arbete gentemot uppsatta KPIer. Du har god kunskap i att utveckla sajtdesign samt vana av att använda publiceringsverktyg. \n\nDetta är en utmanande och bred roll som innefattar många delar.\n\nViktigt att ha med sig är att rollen kan anpassas efter din/respektive kandidats erfarenhet och kunskap!\n\nKvalifikationer\n\nUniversitetsutbildning (min kandidatexamen.)\n\nMinst 3-5 års erfarenhet inom liknade eller angränsande roll gärna inom liknande eller angränsande bransch (fintech-/finansbranschen).\n\nDu har utmärkt kommunikationsförmåga, och du behärskar svenska och engelska flytande både i tal och i skrift.\n\nAnsökan\n\n I denna rekrytering samarbetar vi med Talent & Partner.\n\n Du är välkommen med din ansökan snarast då urval och intervjuer kommer att ske löpande.\n\n Dina ansökningshandlingar ska innehålla CV och ett personligt brev gärna foto.\n\n Skicka din ansökan idag via work@talentpartner.se"
}