{
  "meta" : {
    "jobad" : {
      "description" : {
        "requirements" : null,
        "needs" : null,
        "company_information" : null,
        "text_formatted" : "<p><strong>Har du några års erfarenhet som smed? Vill du arbeta med olika projekt och trivs att arbeta självständigt men även i team? Värdesätter du att vara en del av ett familjärt företag? Då vill vi höra mer om dig!</strong>Som smed hos Zmide i Krylbo kommer du att arbeta med tillverkning och montage av smidesprodukter. Du kommer att arbeta både i verkstad och ute hos kunder. Projekten varierar och du kommer bland annat att tillverka samt montera rondellkonst, staket, reparationer och balkonger. \n\n</p>\n<p><strong>För att lyckas i rollen</strong>:</p>\n<ul><li>Minst 3 års erfarenhet som smed</li><li>God svets- &amp; materialkännedom</li><li>B-körkort</li><li>Vana av ritläsning</li></ul>\n<p><strong>Zmide i Krylbo erbjuder dig:</strong></p>\n<ul><li>En roll i ett företag med högt i tak och familjär känsla</li><li>Goda utvecklingsmöjligheter</li><li>Projekt i varierande storlek</li></ul>\n<p><strong>Låter detta som rätt möjlighet för dig?</strong> Då ser vi gärna att du skickar din ansökan tillsammans med CV! I denna rekrytering samarbetar Zmide i Krylbo med rekryteringsföretaget Jobway. Eventuella frågor besvaras av rekryterare Lina Martinsson på mail <a href=\"mailto:lina.martinsson@jobway.se\" target=\"_blank\">lina.martinsson@jobway.se</a>. Vi tillämpar löpande urval och tjänsten kan därmed tillsättas innan sista ansökningsdag. Din ansökan behandlas konfidentiellt.</p>\n<p><strong>Om Zmide i Krylbo</strong>\n\nFöretaget har uppdragsgivare som återfinns inom tillverknings- och byggnadsindustrin, men även kommunala bolag, privata fastighetsbolag och privatpersoner. Zmide AB utför även industrimontage och tekniska lösningar inom montage, service och underhåll.\n\n \n\nVesam i Katrineholm tillsammans med Ebes Ventilations i Västerås, Elservice i Hallsberg, Eks Plåt &amp; Vent och Zmide i Krylbo bildar tillsammans Vesamgroup.</p>",
        "conditions" : "Heltid\r\nTillsvidare",
        "text" : "Har du några års erfarenhet som smed? Vill du arbeta med olika projekt och trivs att arbeta självständigt men även i team? Värdesätter du att vara en del av ett familjärt företag? Då vill vi höra mer om dig!Som smed hos Zmide i Krylbo kommer du att arbeta med tillverkning och montage av smidesprodukter. Du kommer att arbeta både i verkstad och ute hos kunder. Projekten varierar och du kommer bland annat att tillverka samt montera rondellkonst, staket, reparationer och balkonger. \n\n\n\nFör att lyckas i rollen:\n\nMinst 3 års erfarenhet som smed\nGod svets- & materialkännedom\nB-körkort\nVana av ritläsning\n\n\nZmide i Krylbo erbjuder dig:\n\nEn roll i ett företag med högt i tak och familjär känsla\nGoda utvecklingsmöjligheter\nProjekt i varierande storlek\n\n\nLåter detta som rätt möjlighet för dig? Då ser vi gärna att du skickar din ansökan tillsammans med CV! I denna rekrytering samarbetar Zmide i Krylbo med rekryteringsföretaget Jobway. Eventuella frågor besvaras av rekryterare Lina Martinsson på mail lina.martinsson@jobway.se. Vi tillämpar löpande urval och tjänsten kan därmed tillsättas innan sista ansökningsdag. Din ansökan behandlas konfidentiellt.\n\nOm Zmide i Krylbo\n\nFöretaget har uppdragsgivare som återfinns inom tillverknings- och byggnadsindustrin, men även kommunala bolag, privata fastighetsbolag och privatpersoner. Zmide AB utför även industrimontage och tekniska lösningar inom montage, service och underhåll.\n\n \n\nVesam i Katrineholm tillsammans med Ebes Ventilations i Västerås, Elservice i Hallsberg, Eks Plåt & Vent och Zmide i Krylbo bildar tillsammans Vesamgroup."
      },
      "headline" : "Smed",
      "driving_license" : [ {
        "concept_id" : "VTK8_WRx_GcM",
        "label" : "B",
        "legacy_ams_taxonomy_id" : "3"
      } ],
      "employer" : {
        "email" : null,
        "phone_number" : null,
        "organization_number" : "5567269518",
        "name" : "Jobway AB",
        "url" : "www.jobway.se",
        "workplace" : "Scandinavian Internet Group AB"
      },
      "removed_date" : null,
      "logo_url" : "https://www.arbetsformedlingen.se/rest/arbetsgivare/rest/af/v3/organisation/5567269518/logotyper/logo.png",
      "last_publication_date" : "2022-09-30T23:59:59",
      "number_of_vacancies" : 1,
      "occupation" : {
        "concept_id" : "FM1r_vQd_zS8",
        "label" : "Smed",
        "legacy_ams_taxonomy_id" : "5927"
      },
      "occupation_group" : {
        "concept_id" : "q8Ho_3Xw_sHq",
        "label" : "Smeder",
        "legacy_ams_taxonomy_id" : "7221"
      },
      "employment_type" : {
        "concept_id" : "PFZr_Syz_cUq",
        "label" : "Vanlig anställning",
        "legacy_ams_taxonomy_id" : "1"
      },
      "webpage_url" : "https://arbetsformedlingen.se/platsbanken/annonser/26307783",
      "driving_license_required" : true,
      "application_contacts" : [ ],
      "duration" : {
        "concept_id" : "a7uU_j21_mkL",
        "label" : "Tills vidare",
        "legacy_ams_taxonomy_id" : "1"
      },
      "nice_to_have" : {
        "education_level" : [ ],
        "work_experiences" : [ ],
        "skills" : [ ],
        "education" : [ ],
        "languages" : [ ]
      },
      "application_details" : {
        "via_af" : false,
        "email" : null,
        "other" : null,
        "reference" : "jobway4019",
        "url" : "https://pnty-apply.ponty-system.se/jobway?id=4019&pnty_src=arbetsformedlingen",
        "information" : null
      },
      "source_type" : "VIA_PLATSBANKEN_DXA",
      "application_deadline" : "2022-09-30T23:59:59",
      "external_id" : "46-556726-9518-jobway-4019",
      "workplace_address" : {
        "coordinates" : [ 16.17384, 60.14533 ],
        "city" : null,
        "postcode" : null,
        "municipality" : "Avesta",
        "region_concept_id" : "oDpK_oZ2_WYt",
        "region" : "Dalarnas län",
        "country_code" : "199",
        "region_code" : "20",
        "municipality_concept_id" : "Szbq_2fg_ydQ",
        "country_concept_id" : "i46j_HmG_v64",
        "municipality_code" : "2084",
        "street_address" : null,
        "country" : "Sverige"
      },
      "id" : "26307783",
      "experience_required" : true,
      "working_hours_type" : {
        "concept_id" : "6YE1_gAC_R2G",
        "label" : "Heltid",
        "legacy_ams_taxonomy_id" : "1"
      },
      "access" : null,
      "timestamp" : 1657265258415,
      "must_have" : {
        "education_level" : [ ],
        "work_experiences" : [ {
          "concept_id" : "FM1r_vQd_zS8",
          "weight" : 10,
          "label" : "Smed",
          "legacy_ams_taxonomy_id" : "5927"
        } ],
        "skills" : [ ],
        "education" : [ ],
        "languages" : [ ]
      },
      "occupation_field" : {
        "concept_id" : "PaxQ_o1G_wWH",
        "label" : "Hantverk",
        "legacy_ams_taxonomy_id" : "6"
      },
      "scope_of_work" : {
        "min" : 100,
        "max" : 100
      },
      "salary_type" : {
        "concept_id" : "oG8G_9cW_nRf",
        "label" : "Fast månads- vecko- eller timlön",
        "legacy_ams_taxonomy_id" : "1"
      },
      "removed" : false,
      "salary_description" : "Månadslön - Fast lön",
      "access_to_own_car" : false,
      "publication_date" : "2022-07-08T09:27:38"
    },
    "name" : "Smed",
    "user" : "kristof.fischer"
  },
  "sha1" : "a885b5e58524a0baaa5ed0acce88894e94def016",
  "annotations" : [ {
    "preferred-label" : "Smed",
    "sentiment" : "MUST_HAVE",
    "type" : "occupation-name",
    "start-position" : 0,
    "end-position" : 4,
    "concept-id" : "FM1r_vQd_zS8",
    "matched-string" : "smed",
    "annotation-id" : 0
  }, {
    "preferred-label" : "Smed",
    "sentiment" : "MUST_HAVE",
    "type" : "occupation-name",
    "start-position" : 37,
    "end-position" : 41,
    "concept-id" : "FM1r_vQd_zS8",
    "matched-string" : "smed",
    "annotation-id" : 1
  }, {
    "preferred-label" : "arbeta självständigt",
    "sentiment" : "MUST_HAVE",
    "type" : "esco-skill",
    "start-position" : 90,
    "end-position" : 110,
    "concept-id" : "NyFu_HHd_zhz",
    "matched-string" : "arbeta självständigt",
    "annotation-id" : 7
  }, {
    "preferred-label" : "arbeta som ett team",
    "sentiment" : "MUST_HAVE",
    "type" : "esco-skill",
    "start-position" : 120,
    "end-position" : 126,
    "concept-id" : "VFVZ_4YG_Ydi",
    "matched-string" : "i team",
    "annotation-id" : 8
  }, {
    "preferred-label" : "Smed",
    "sentiment" : "MUST_HAVE",
    "type" : "occupation-name",
    "start-position" : 216,
    "end-position" : 220,
    "concept-id" : "FM1r_vQd_zS8",
    "matched-string" : "smed",
    "annotation-id" : 2
  }, {
    "preferred-label" : "2-4 års erfarenhet",
    "sentiment" : "MUST_HAVE",
    "type" : "occupation-experience-year",
    "start-position" : 519,
    "end-position" : 541,
    "concept-id" : "RWA2_uu6_udD",
    "matched-string" : "Minst 3 års erfarenhet",
    "annotation-id" : 9
  }, {
    "preferred-label" : "Smed",
    "sentiment" : "MUST_HAVE",
    "type" : "occupation-name",
    "start-position" : 546,
    "end-position" : 550,
    "concept-id" : "FM1r_vQd_zS8",
    "matched-string" : "smed",
    "annotation-id" : 4
  }, {
    "preferred-label" : "Svetsteknik",
    "sentiment" : "MUST_HAVE",
    "type" : "skill",
    "start-position" : 555,
    "end-position" : 560,
    "concept-id" : "agUF_zx8_iKE",
    "matched-string" : "svets",
    "annotation-id" : 5
  }, {
    "preferred-label" : "Materialteknik",
    "sentiment" : "MUST_HAVE",
    "type" : "skill",
    "start-position" : 564,
    "end-position" : 580,
    "concept-id" : "YHb7_uwj_7NG",
    "matched-string" : "materialkännedom",
    "annotation-id" : 10
  }, {
    "preferred-label" : "B",
    "sentiment" : "MUST_HAVE",
    "type" : "driving-licence",
    "start-position" : 581,
    "end-position" : 590,
    "concept-id" : "VTK8_WRx_GcM",
    "matched-string" : "B-körkort",
    "annotation-id" : 11
  }, {
    "preferred-label" : "Ritningsläsning",
    "sentiment" : "MUST_HAVE",
    "type" : "skill",
    "start-position" : 599,
    "end-position" : 609,
    "concept-id" : "aHCV_VsV_LiD",
    "matched-string" : "ritläsning",
    "annotation-id" : 12
  } ],
  "text" : "Smed\nHar du några års erfarenhet som smed? Vill du arbeta med olika projekt och trivs att arbeta självständigt men även i team? Värdesätter du att vara en del av ett familjärt företag? Då vill vi höra mer om dig!Som smed hos Zmide i Krylbo kommer du att arbeta med tillverkning och montage av smidesprodukter. Du kommer att arbeta både i verkstad och ute hos kunder. Projekten varierar och du kommer bland annat att tillverka samt montera rondellkonst, staket, reparationer och balkonger. \n\n\n\nFör att lyckas i rollen:\n\nMinst 3 års erfarenhet som smed\nGod svets- & materialkännedom\nB-körkort\nVana av ritläsning\n\n\nZmide i Krylbo erbjuder dig:\n\nEn roll i ett företag med högt i tak och familjär känsla\nGoda utvecklingsmöjligheter\nProjekt i varierande storlek\n\n\nLåter detta som rätt möjlighet för dig? Då ser vi gärna att du skickar din ansökan tillsammans med CV! I denna rekrytering samarbetar Zmide i Krylbo med rekryteringsföretaget Jobway. Eventuella frågor besvaras av rekryterare Lina Martinsson på mail lina.martinsson@jobway.se. Vi tillämpar löpande urval och tjänsten kan därmed tillsättas innan sista ansökningsdag. Din ansökan behandlas konfidentiellt.\n\nOm Zmide i Krylbo\n\nFöretaget har uppdragsgivare som återfinns inom tillverknings- och byggnadsindustrin, men även kommunala bolag, privata fastighetsbolag och privatpersoner. Zmide AB utför även industrimontage och tekniska lösningar inom montage, service och underhåll.\n\n \n\nVesam i Katrineholm tillsammans med Ebes Ventilations i Västerås, Elservice i Hallsberg, Eks Plåt & Vent och Zmide i Krylbo bildar tillsammans Vesamgroup."
}