{
  "meta" : {
    "jobad" : "26270024",
    "user" : "hannes"
  },
  "sha1" : "2d450972b617096cc24619f30bc6e08cc437c241",
  "annotations" : [ {
    "preferred-label" : "Vattenreningsteknik",
    "type" : "skill",
    "start-position" : 63,
    "end-position" : 75,
    "concept-id" : "jWzV_BBX_pJc",
    "matched-string" : "vattenrening",
    "annotation-id" : 12
  }, {
    "preferred-label" : "produktionschef, vattenbruk",
    "type" : "esco-occupation",
    "start-position" : 270,
    "end-position" : 304,
    "concept-id" : "fq4j_P5n_KnR",
    "matched-string" : "Production Manager Water Treatment",
    "annotation-id" : 13
  }, {
    "preferred-label" : "Miljövård",
    "sentiment" : "OFFERED",
    "type" : "keyword",
    "start-position" : 411,
    "end-position" : 420,
    "concept-id" : "v5Fo_6Gp_imd",
    "matched-string" : "miljövård",
    "annotation-id" : 1
  }, {
    "preferred-label" : "bevara naturresurser",
    "type" : "esco-skill",
    "start-position" : 472,
    "end-position" : 494,
    "concept-id" : "ZVFf_YCU_bmH",
    "matched-string" : "spara på naturresurser",
    "annotation-id" : 14
  }, {
    "preferred-label" : "cirkulär ekonomi",
    "type" : "esco-skill",
    "start-position" : 509,
    "end-position" : 525,
    "concept-id" : "USnm_nT7_jqG",
    "matched-string" : "cirkulär ekonomi",
    "annotation-id" : 15
  }, {
    "preferred-label" : "energieffektivitet",
    "type" : "esco-skill",
    "start-position" : 555,
    "end-position" : 575,
    "concept-id" : "BKi5_ZKS_iyz",
    "matched-string" : "energieffektiviteten",
    "annotation-id" : 16
  }, {
    "preferred-label" : "Återvinning",
    "type" : "sni-level-3",
    "start-position" : 640,
    "end-position" : 651,
    "concept-id" : "dHL8_syv_oST",
    "matched-string" : "återvinning",
    "annotation-id" : 17
  }, {
    "preferred-label" : "avfallshantering",
    "sentiment" : "OFFERED",
    "type" : "esco-skill",
    "start-position" : 653,
    "end-position" : 669,
    "concept-id" : "gnUk_f4X_HnN",
    "matched-string" : "avfallshantering",
    "annotation-id" : 3
  }, {
    "preferred-label" : "Sverige",
    "type" : "country",
    "start-position" : 807,
    "end-position" : 814,
    "concept-id" : "i46j_HmG_v64",
    "matched-string" : "Sverige",
    "annotation-id" : 18
  }, {
    "preferred-label" : "Finland",
    "type" : "country",
    "start-position" : 816,
    "end-position" : 823,
    "concept-id" : "WgbG_whJ_E7J",
    "matched-string" : "Finland",
    "annotation-id" : 19
  }, {
    "preferred-label" : "Danmark",
    "type" : "country",
    "start-position" : 825,
    "end-position" : 832,
    "concept-id" : "Co3h_1xq_Cwb",
    "matched-string" : "Danmark",
    "annotation-id" : 20
  }, {
    "preferred-label" : "Norge",
    "type" : "country",
    "start-position" : 837,
    "end-position" : 842,
    "concept-id" : "QJgN_Zge_BzJ",
    "matched-string" : "Norge",
    "annotation-id" : 21
  }, {
    "preferred-label" : "produktionschef, vattenbruk",
    "type" : "esco-occupation",
    "start-position" : 861,
    "end-position" : 895,
    "concept-id" : "fq4j_P5n_KnR",
    "matched-string" : "Production Manager Water Treatment",
    "annotation-id" : 22
  }, {
    "preferred-label" : "Kumla",
    "type" : "municipality",
    "start-position" : 996,
    "end-position" : 1001,
    "concept-id" : "viCA_36P_pQp",
    "matched-string" : "Kumla",
    "annotation-id" : 23
  }, {
    "preferred-label" : "Personalansvar",
    "sentiment" : "OFFERED",
    "type" : "skill",
    "start-position" : 1162,
    "end-position" : 1170,
    "concept-id" : "ZzN5_m7B_5CY",
    "matched-string" : "personal",
    "annotation-id" : 5
  }, {
    "preferred-label" : "genomföra återkommande fortbildning",
    "type" : "esco-skill",
    "start-position" : 1330,
    "end-position" : 1362,
    "concept-id" : "5USM_HMS_kpV",
    "matched-string" : "Ansvara för löpande fortbildning",
    "annotation-id" : 24
  }, {
    "preferred-label" : "Personal",
    "sentiment" : "OFFERED",
    "type" : "keyword",
    "start-position" : 1366,
    "end-position" : 1374,
    "concept-id" : "HVxM_6MS_y1c",
    "matched-string" : "personal",
    "annotation-id" : 6
  }, {
    "preferred-label" : "Vattenreningsteknik",
    "type" : "skill",
    "start-position" : 1453,
    "end-position" : 1468,
    "concept-id" : "jWzV_BBX_pJc",
    "matched-string" : "reningstekniker",
    "annotation-id" : 25
  }, {
    "preferred-label" : "Kumla",
    "type" : "municipality",
    "start-position" : 1573,
    "end-position" : 1578,
    "concept-id" : "viCA_36P_pQp",
    "matched-string" : "Kumla",
    "annotation-id" : 26
  }, {
    "preferred-label" : "Resor i arbetet förekommer",
    "type" : "work-place-environment",
    "start-position" : 1592,
    "end-position" : 1597,
    "concept-id" : "oaM2_JTK_muh",
    "matched-string" : "resor",
    "annotation-id" : 27
  }, {
    "preferred-label" : "Sundsvall",
    "type" : "municipality",
    "start-position" : 1636,
    "end-position" : 1645,
    "concept-id" : "dJbx_FWY_tK6",
    "matched-string" : "Sundsvall",
    "annotation-id" : 28
  }, {
    "preferred-label" : "Kemi",
    "type" : "sun-education-field-3",
    "start-position" : 2618,
    "end-position" : 2647,
    "concept-id" : "vpZY_6iv_NPL",
    "matched-string" : "högskoleutbildning inom kemi-",
    "annotation-id" : 29
  }, {
    "preferred-label" : "Miljövetenskap",
    "sentiment" : "OFFERED",
    "type" : "sun-education-field-3",
    "start-position" : 2654,
    "end-position" : 2668,
    "concept-id" : "cs1N_Zp4_KgB",
    "matched-string" : "miljövetenskap",
    "annotation-id" : 9
  }, {
    "preferred-label" : "Eftergymnasial utbildning, ej vid universitet och högskola, yrkesinriktad, 3 år",
    "type" : "sun-education-level-3",
    "start-position" : 2689,
    "end-position" : 2712,
    "concept-id" : "Dxdt_jZu_Je3",
    "matched-string" : "yrkeshögskoleutbildning",
    "annotation-id" : 30
  }, {
    "preferred-label" : "Vattenteknik, ej ingenjörsutbildning",
    "type" : "keyword",
    "start-position" : 2729,
    "end-position" : 2736,
    "concept-id" : "rJgz_Q8j_umn",
    "matched-string" : "vatten-",
    "annotation-id" : 31
  }, {
    "preferred-label" : "Miljöteknik",
    "sentiment" : "OFFERED",
    "type" : "skill",
    "start-position" : 2741,
    "end-position" : 2752,
    "concept-id" : "S4Ku_uT7_yuV",
    "matched-string" : "miljöteknik",
    "annotation-id" : 10
  }, {
    "preferred-label" : "Projektledning, erfarenhet",
    "type" : "skill",
    "start-position" : 3078,
    "end-position" : 3092,
    "concept-id" : "3TSx_fJE_Z26",
    "matched-string" : "projektledning",
    "annotation-id" : 32
  }, {
    "preferred-label" : "Truck",
    "type" : "keyword",
    "start-position" : 3094,
    "end-position" : 3103,
    "concept-id" : "Wz82_4Xv_ZFr",
    "matched-string" : "Truckkort",
    "annotation-id" : 33
  }, {
    "preferred-label" : "Coaching/Coachning",
    "type" : "skill",
    "start-position" : 3593,
    "end-position" : 3602,
    "concept-id" : "91Ef_58Y_jX4",
    "matched-string" : "coachande",
    "annotation-id" : 34
  } ],
  "text" : "Är du en prestigelös och lösningsorienterad ledare med koll på vattenrening? Vill du ta nästa kliv i karriären och samtidigt bli en del av en dynamisk och väletablerad verksamhet som tar ansvar för och gör skillnad för miljön? Då har vi rollen för dig! Sök tjänsten som Production Manager Water Treatment hos Fortum Recycling and Waste redan idag.\n\nOm Fortum \n\nFortum Recycling and Waste erbjuder tjänster inom miljövård och materialeffektivitet i Norden. Vårt mål är att spara på naturresurser och främja en cirkulär ekonomi. Vi förbättrar material- och energieffektiviteten för våra kunder genom att erbjuda lösningar för återanvändning, återvinning, avfallshantering och slutdeponering samt tjänster för marksanering och miljöbyggnation. Fortum Recycling and Waste Solutions har nästan 650 medarbetare i Sverige, Finland, Danmark och Norge.\n\nOm rollen \n\nSom Production Manager Water Treatment ansvarar du för reningen av det vatten som används och som regnar på Fortums anläggning i Norrtorp, Kumla. På anläggningen i Norrtorp finns två reningsanläggningar, varav det ena är rening för utgående vatten. Tillsammans med två processoperatörer, som du också har personal- och arbetsmiljöansvar för, ansvarar du för\n\n - Genomförande av tester för olika behandlingsprocesser\n - Provtagning av inkommande flöden och processvatten\n - Ansvara för löpande fortbildning av personal\n - Rapportering och myndighetskontakter\n - Driva processutvecklingen av olika reningstekniker\n - Utveckling av driftsrutiner och instruktioner.\n\nRollen är placerad på Fortums anläggning i Norrtorp, Kumla, med enstaka resor till andra anläggningar i Hakunge och Sundsvall. Du ingår i ledningsgruppen för Material Recycling Center, som servar samtliga anläggningar inom Fortum Waste Solutions Sweden.\n\nVarför Fortum?\n\nÄr du redo för ditt livs största utmaning? För att kunna driva på övergången till en renare värld måste vi omforma energisystemet. En öppen kultur är nyckeln till att nå våra mål. Med ömsesidigt förtroende, en tro på människors förmåga och genom att se till att alla mår bra kan vi nå ännu bättre resultat. Flexibilitet är det nya normala och vårt hybrida arbetssätt tillämpas när det är möjligt.\n\nFör dig innebär ett arbete på Fortum spännande möjligheter att utveckla din expertis och skapa en meningsfull karriär – och vi kommer stötta dig på den resan. Vi tror att mångfald och inkludering inspirerar oss alla att vara innovativa och växa tillsammans. Därför strävar vi efter att bygga team där alla känner sig inkluderade och behandlas lika.\n\nDina kvalifikationer\n\nVi söker dig som har relevant utbildningsbakgrund, helst högskoleutbildning inom kemi- eller miljövetenskap, men även genomförd yrkeshögskoleutbildning inom exempelvis vatten- och miljöteknik i kombination med relevant arbetslivserfarenhet är av intresse. Vi tror att du är tekniskt kunnig och har tidigare arbetslivserfarenhet av vattenrening i någon form, antingen inom industrin, konsultbranschen eller inom offentlig sektor, med fördel i ledande position.\n\nDet är meriterande om du ha erfarenhet av ledarskap och projektledning. Truckkort är också meriterande.  \n\nDina personliga egenskaper \n\nSom person är du prestigelös, empatisk och lösningsorienterad. Du kommer ha många samarbetsytor inom organisationen och arbeta nära platsansvariga och marknadssidan, varför det är viktigt att du är kommunikativ och kan samarbeta brett inom organisationen.\n\nDu gillar att arbeta operativt och verksamhetsnära, vilket också syns i ditt ledarskap. Du finns till hands för dina medarbetare, leder och fördelar arbetet på ett stöttande och coachande sätt för att ni tillsammans ska bidra till att verksamheten utvecklas och når uppsatta mål. Du står för trygghet och stabilitet samtidigt som du tycker om att jobba med utveckling och förbättringar, där du kommer ha goda möjligheter att påverka och utforma verksamhetens processer.\n\nVi lägger stor vikt vid dina personliga egenskaper i den här rekryteringen.\n\nInformation och ansökan\nI den här rekryteringen samarbetar Fortum Recycling and Waste med AxÖ Consulting. Ansökan görs via www.axoconsulting.se senast den 21 augusti 2022. Vi jobbar med löpande urval så tjänsten kan komma att tillsättas innan sista ansökningsdatum, men kontakter och intervjuer kommer att påbörjas först i augusti.\n\nVi svarar gärna på frågor från dig. Ring eller mejla rekryteringskonsult Kajsa Rosén, kajsa.rosen@axoconsulting.se tfn: 072-398 02 67. Alla ansökningar behandlas konfidentiellt.\n\nVarmt välkommen med din ansökan!\n\nAxÖ Consulting AB har lång och gedigen erfarenhet från rekryterings- och konsultbranschen och har arbetat med såväl privat marknad som inom offentlig sektor. För mer information och ansökan besök www.axoconsulting.se. Vi tar tyvärr inte emot ansökningar via brev eller e-post. \nVarmt välkommen med din ansökan."
}