{
  "meta" : {
    "jobad" : {
      "description" : {
        "requirements" : null,
        "needs" : null,
        "company_information" : null,
        "text_formatted" : "Skaraborgs flygflottilj (F 7) söker ställföreträdande stabschef tillika avdelningschef för förbandsstödsavdelningen. Vi söker dig som vill jobba som ställföreträdande stabschef tillika chef för förbandsstödsavdelningen och som vill ha ett utmanande och spännande arbete.\n\nOm enheten\n\nBefattningen ingår i flottiljstaben som består av cirka 125 medarbetare. I rollen som ställföreträdande stabschef ingår du tillsammans med stabschef och stabsförvaltare i stabens ledningstriad. \n I rollen som chef förbandsstödsavdelningen är du chef för avdelningens personal och funktioner. Avdelningen består av 11 medarbetare som arbetar inom kvalité, kommunikation, expedition, administration och besök/museum.\n\nHuvudsakliga arbetsuppgifter\n\n\n• stödja stabschef tillika enhetschef för flottiljstaben\n• vara chef för förbandsstödsavdelningen\n• ingå i flottiljledningsgruppen\n• leder, på uppdrag av stabschefen, den interna samordningen av flottiljstaben i fred såväl som i kris och krig\n• sammanhåller flottiljstabens interna arbete såsom verksamhetsutveckling, lönerevision, ekonomisk uppföljning och orderskrivande\n• samordna, genom kvalitetschefen, verksamhetsutvecklings- och kvalitetsarbetet vid F 7 samt följa upp att fastställda kvalitetssäkringsrutiner efterlevs\n• samordna, genom expeditionen, informationsflödet inom Såtenäs garnison\n• ansvara för att genomföra en första beredning av inkommande externa handlingar till F 7 samt interna till flottiljstaben\n\nKvalifikationer\n\n\n• Anställd i Försvarsmakten med kontinuerlig tjänstgöring\n• Godkänd yrkesofficersexamen\n\n\n• Förtrogen med Försvarsmaktens stabsarbetsmetodik\n\n\n• Goda kunskaper i svenska och engelska, tal och skrift\n• Körkort B för manuell växellåda\n• Svenskt medborgarskap \n\nMeriterande \n\n\n• Erfarenhet av flygvapnets verksamhet och organisation\n• Erfarenhet som kompanichef, avdelningschef eller motsvarande\n\nPersonliga egenskaper  \n\nSom person är du drivande, initiativtagande, organiserad och strukturerad i ditt arbete. För att trivas i rollen är du social och har lätt för att samarbeta. Då det tidvis är hög arbetsbelastning krävs att du är flexibel och stresstålig.\n\nVi ser även att du är en god representant för Försvarsmakten och står bakom Försvarsmaktens värdegrund (se www.forsvarsmakten.se). Stor vikt kommer att läggas vid personlig lämplighet.\n\nÖvrigt\n\nAnställningsform: Tillsvidare, militär befattning, OF 3\n\nSysselsättningsgrad: Heltid\n Arbetsort: Såtenäs\n Tillträdesdatum: Enligt överenskommelse  \n\nTjänsten innebär krav på fysisk förmåga, genomförande av tjänsteresor, deltagande i utbildning och övning i krigsorganisationen.\n\nKontaktpersoner\n Vill du veta mer om befattningen är du välkommen att kontakta stabschef Jim Hallander, jim.hallander@mil.se\n \n\nFackliga företrädare: \n\nOfficersförbundet OFR/O, Jan Möller, tfn 0704 - 614 400\n Försvarsförbundet OFR/S, Per Gunnarsson, tfn 0510 - 47 77 08\n SACO, Ulf Svensson, tfn 0510 - 47 74 63\n SEKO, Erling Svensson, tfn 072 - 98 11 659\n \n Sista ansökningsdag\n\nVälkommen med din ansökan senast 2022-07-03. Din ansökan ska innehålla CV samt ansökningsbrev där vi vill att du motiverar varför du är lämpad för denna befattning.\n \n\n\n Ansökningar till denna befattning kommer endast tas emot via Försvarsmaktens webbplats. \n--------------------------------------------------------\nInformation om Försvarsmakten och det rekryterande förbandet:\n\nSkaraborgs flygflottilj är en mångsidig och unik flygflottilj. Här finns stridsflyg samt Försvarsmaktens samlade resurs av transport- och specialflyg. Vi genomför grund- och befattningsutbildning av pliktinkallade rekryter samt utbildar alla svenska och utländska Gripenpiloter. Förbandet deltar också i många insatser. I Sverige finns verksamheten på Såtenäs, Malmen, Arlanda och Karlsborg. Utomlands ansvarar vi för Gripensupporten i Thailand samt för den svenska personalen vid det internationella transportflygsamarbetet Heavy Airlift Wing i Ungern.\nLäs gärna mer på https://www.forsvarsmakten.se/f7\n\nVarje dag och varje timme gör våra medarbetare insatser som påverkar andra människors liv, både i stort och smått, och både på hemmaplan och runt om i världen.\n\nI Försvarsmakten finns en stark värdegrund som bygger på öppenhet, resultat och ansvar. Professionell utveckling och personlig hälsa värdesätts och uppmuntras. Det finns goda förutsättningar för intern karriärrörlighet, friskvård samt bra balans mellan arbete och privatliv.\n\nEn anställning hos oss innebär placering i säkerhetsklass. Vanligtvis krävs svenskt medborgarskap.\nSäkerhetsprövning med registerkontroll kommer att genomföras före anställning enligt 3 kap i säkerhetsskyddslagen. Med anställning följer en skyldighet att krigsplaceras. I anställningen ingår även en skyldighet att tjänstgöra utomlands. Innebörden av detta varierar beroende på typ av befattning.\n\nTill ansökan om anställning ska CV och personligt brev bifogas. Om du går vidare i anställningsprocessen ska alltid vidimerade kopior av betyg och intyg uppvisas.\n\nSamtal från externa rekryteringsföretag och säljare undanbedes.",
        "conditions" : "Heltid/\r\nEj specificerat",
        "text" : "Skaraborgs flygflottilj (F 7) söker ställföreträdande stabschef tillika avdelningschef för förbandsstödsavdelningen. Vi söker dig som vill jobba som ställföreträdande stabschef tillika chef för förbandsstödsavdelningen och som vill ha ett utmanande och spännande arbete.\n\nOm enheten\n\nBefattningen ingår i flottiljstaben som består av cirka 125 medarbetare. I rollen som ställföreträdande stabschef ingår du tillsammans med stabschef och stabsförvaltare i stabens ledningstriad. \n I rollen som chef förbandsstödsavdelningen är du chef för avdelningens personal och funktioner. Avdelningen består av 11 medarbetare som arbetar inom kvalité, kommunikation, expedition, administration och besök/museum.\n\nHuvudsakliga arbetsuppgifter\n\n\n• stödja stabschef tillika enhetschef för flottiljstaben\n• vara chef för förbandsstödsavdelningen\n• ingå i flottiljledningsgruppen\n• leder, på uppdrag av stabschefen, den interna samordningen av flottiljstaben i fred såväl som i kris och krig\n• sammanhåller flottiljstabens interna arbete såsom verksamhetsutveckling, lönerevision, ekonomisk uppföljning och orderskrivande\n• samordna, genom kvalitetschefen, verksamhetsutvecklings- och kvalitetsarbetet vid F 7 samt följa upp att fastställda kvalitetssäkringsrutiner efterlevs\n• samordna, genom expeditionen, informationsflödet inom Såtenäs garnison\n• ansvara för att genomföra en första beredning av inkommande externa handlingar till F 7 samt interna till flottiljstaben\n\nKvalifikationer\n\n\n• Anställd i Försvarsmakten med kontinuerlig tjänstgöring\n• Godkänd yrkesofficersexamen\n\n\n• Förtrogen med Försvarsmaktens stabsarbetsmetodik\n\n\n• Goda kunskaper i svenska och engelska, tal och skrift\n• Körkort B för manuell växellåda\n• Svenskt medborgarskap \n\nMeriterande \n\n\n• Erfarenhet av flygvapnets verksamhet och organisation\n• Erfarenhet som kompanichef, avdelningschef eller motsvarande\n\nPersonliga egenskaper  \n\nSom person är du drivande, initiativtagande, organiserad och strukturerad i ditt arbete. För att trivas i rollen är du social och har lätt för att samarbeta. Då det tidvis är hög arbetsbelastning krävs att du är flexibel och stresstålig.\n\nVi ser även att du är en god representant för Försvarsmakten och står bakom Försvarsmaktens värdegrund (se www.forsvarsmakten.se). Stor vikt kommer att läggas vid personlig lämplighet.\n\nÖvrigt\n\nAnställningsform: Tillsvidare, militär befattning, OF 3\n\nSysselsättningsgrad: Heltid\n Arbetsort: Såtenäs\n Tillträdesdatum: Enligt överenskommelse  \n\nTjänsten innebär krav på fysisk förmåga, genomförande av tjänsteresor, deltagande i utbildning och övning i krigsorganisationen.\n\nKontaktpersoner\n Vill du veta mer om befattningen är du välkommen att kontakta stabschef Jim Hallander, jim.hallander@mil.se\n \n\nFackliga företrädare: \n\nOfficersförbundet OFR/O, Jan Möller, tfn 0704 - 614 400\n Försvarsförbundet OFR/S, Per Gunnarsson, tfn 0510 - 47 77 08\n SACO, Ulf Svensson, tfn 0510 - 47 74 63\n SEKO, Erling Svensson, tfn 072 - 98 11 659\n \n Sista ansökningsdag\n\nVälkommen med din ansökan senast 2022-07-03. Din ansökan ska innehålla CV samt ansökningsbrev där vi vill att du motiverar varför du är lämpad för denna befattning.\n \n\n\n Ansökningar till denna befattning kommer endast tas emot via Försvarsmaktens webbplats. \n--------------------------------------------------------\nInformation om Försvarsmakten och det rekryterande förbandet:\n\nSkaraborgs flygflottilj är en mångsidig och unik flygflottilj. Här finns stridsflyg samt Försvarsmaktens samlade resurs av transport- och specialflyg. Vi genomför grund- och befattningsutbildning av pliktinkallade rekryter samt utbildar alla svenska och utländska Gripenpiloter. Förbandet deltar också i många insatser. I Sverige finns verksamheten på Såtenäs, Malmen, Arlanda och Karlsborg. Utomlands ansvarar vi för Gripensupporten i Thailand samt för den svenska personalen vid det internationella transportflygsamarbetet Heavy Airlift Wing i Ungern.\nLäs gärna mer på https://www.forsvarsmakten.se/f7\n\nVarje dag och varje timme gör våra medarbetare insatser som påverkar andra människors liv, både i stort och smått, och både på hemmaplan och runt om i världen.\n\nI Försvarsmakten finns en stark värdegrund som bygger på öppenhet, resultat och ansvar. Professionell utveckling och personlig hälsa värdesätts och uppmuntras. Det finns goda förutsättningar för intern karriärrörlighet, friskvård samt bra balans mellan arbete och privatliv.\n\nEn anställning hos oss innebär placering i säkerhetsklass. Vanligtvis krävs svenskt medborgarskap.\nSäkerhetsprövning med registerkontroll kommer att genomföras före anställning enligt 3 kap i säkerhetsskyddslagen. Med anställning följer en skyldighet att krigsplaceras. I anställningen ingår även en skyldighet att tjänstgöra utomlands. Innebörden av detta varierar beroende på typ av befattning.\n\nTill ansökan om anställning ska CV och personligt brev bifogas. Om du går vidare i anställningsprocessen ska alltid vidimerade kopior av betyg och intyg uppvisas.\n\nSamtal från externa rekryteringsföretag och säljare undanbedes."
      },
      "headline" : "Ställföreträdande stabschef tillika avdelningschef",
      "driving_license" : [ {
        "concept_id" : "VTK8_WRx_GcM",
        "label" : "B",
        "legacy_ams_taxonomy_id" : "3"
      } ],
      "employer" : {
        "email" : null,
        "phone_number" : null,
        "organization_number" : "2021004615",
        "name" : "Försvarsmakten",
        "url" : "http://www.forsvarsmakten.se/sv/",
        "workplace" : "Försvarsmakten"
      },
      "removed_date" : null,
      "logo_url" : "https://www.arbetsformedlingen.se/rest/arbetsgivare/rest/af/v3/organisation/2021004615/logotyper/logo.png",
      "last_publication_date" : "2022-08-14T23:59:59",
      "number_of_vacancies" : 1,
      "occupation" : {
        "concept_id" : "fsDP_fPf_xfC",
        "label" : "Officer",
        "legacy_ams_taxonomy_id" : "5541"
      },
      "occupation_group" : {
        "concept_id" : "KiVA_anS_RJh",
        "label" : "Officerare",
        "legacy_ams_taxonomy_id" : "0110"
      },
      "employment_type" : {
        "concept_id" : "PFZr_Syz_cUq",
        "label" : "Vanlig anställning",
        "legacy_ams_taxonomy_id" : "1"
      },
      "webpage_url" : "https://arbetsformedlingen.se/platsbanken/annonser/26322144",
      "driving_license_required" : true,
      "application_contacts" : [ ],
      "duration" : {
        "concept_id" : "a7uU_j21_mkL",
        "label" : "Tills vidare",
        "legacy_ams_taxonomy_id" : "1"
      },
      "nice_to_have" : {
        "education_level" : [ ],
        "work_experiences" : [ ],
        "skills" : [ ],
        "education" : [ ],
        "languages" : [ ]
      },
      "application_details" : {
        "via_af" : false,
        "email" : null,
        "other" : null,
        "reference" : null,
        "url" : "https://web103.reachmee.com/ext/I005/333/main?site=2&validator=a75fbd88f1b2a3a49de2af9c8b7bc228&lang=SE&rmpage=job&rmjob=29580",
        "information" : null
      },
      "source_type" : "VIA_PLATSBANKEN_DXA",
      "application_deadline" : "2022-08-14T23:59:59",
      "external_id" : "46-202100-4615-29580",
      "workplace_address" : {
        "coordinates" : [ 11.349068, 58.452816 ],
        "city" : null,
        "postcode" : null,
        "municipality" : "Sotenäs",
        "region_concept_id" : "zdoY_6u5_Krt",
        "region" : "Västra Götalands län",
        "country_code" : "199",
        "region_code" : "14",
        "municipality_concept_id" : "aKkp_sEX_cVM",
        "country_concept_id" : "i46j_HmG_v64",
        "municipality_code" : "1427",
        "street_address" : null,
        "country" : "Sverige"
      },
      "id" : "26322144",
      "experience_required" : true,
      "working_hours_type" : {
        "concept_id" : "6YE1_gAC_R2G",
        "label" : "Heltid",
        "legacy_ams_taxonomy_id" : "1"
      },
      "access" : null,
      "timestamp" : 1657696693272,
      "must_have" : {
        "education_level" : [ ],
        "work_experiences" : [ {
          "concept_id" : "fsDP_fPf_xfC",
          "weight" : 10,
          "label" : "Officer",
          "legacy_ams_taxonomy_id" : "5541"
        } ],
        "skills" : [ ],
        "education" : [ ],
        "languages" : [ ]
      },
      "occupation_field" : {
        "concept_id" : "bH5L_uXD_ZAX",
        "label" : "Militära yrken",
        "legacy_ams_taxonomy_id" : "22"
      },
      "scope_of_work" : {
        "min" : 100,
        "max" : 100
      },
      "salary_type" : {
        "concept_id" : "oG8G_9cW_nRf",
        "label" : "Fast månads- vecko- eller timlön",
        "legacy_ams_taxonomy_id" : "1"
      },
      "removed" : false,
      "salary_description" : ".",
      "access_to_own_car" : false,
      "publication_date" : "2022-07-13T09:18:13"
    },
    "name" : "Ställföreträdande stabschef tillika avdelningschef",
    "user" : "hannes"
  },
  "sha1" : "081d3a0aed19575e8facdb87b85fe3131d064442",
  "annotations" : [ {
    "preferred-label" : "avdelningschef",
    "type" : "esco-occupation",
    "start-position" : 36,
    "end-position" : 50,
    "concept-id" : "9Aoj_BL5_m3b",
    "matched-string" : "avdelningschef",
    "annotation-id" : 18
  }, {
    "preferred-label" : "avdelningschef",
    "type" : "esco-occupation",
    "start-position" : 123,
    "end-position" : 137,
    "concept-id" : "9Aoj_BL5_m3b",
    "matched-string" : "avdelningschef",
    "annotation-id" : 19
  }, {
    "preferred-label" : "Personal",
    "sentiment" : "MUST_HAVE",
    "type" : "keyword",
    "start-position" : 602,
    "end-position" : 610,
    "concept-id" : "HVxM_6MS_y1c",
    "matched-string" : "personal",
    "annotation-id" : 0
  }, {
    "preferred-label" : "kommunikation",
    "type" : "esco-skill",
    "start-position" : 690,
    "end-position" : 703,
    "concept-id" : "ahPU_HgE_Jeb",
    "matched-string" : "kommunikation",
    "annotation-id" : 20
  }, {
    "preferred-label" : "sköta administration",
    "type" : "esco-skill",
    "start-position" : 717,
    "end-position" : 731,
    "concept-id" : "NEWh_NMX_RCZ",
    "matched-string" : "administration",
    "annotation-id" : 21
  }, {
    "preferred-label" : "Museum",
    "sentiment" : "MUST_HAVE",
    "type" : "keyword",
    "start-position" : 742,
    "end-position" : 748,
    "concept-id" : "rXhg_8kE_9zx",
    "matched-string" : "museum",
    "annotation-id" : 1
  }, {
    "preferred-label" : "Lönerevision",
    "sentiment" : "MUST_HAVE",
    "type" : "skill",
    "start-position" : 1100,
    "end-position" : 1112,
    "concept-id" : "A5jq_Gnu_8tG",
    "matched-string" : "lönerevision",
    "annotation-id" : 2
  }, {
    "preferred-label" : "Försvarsmakten",
    "sentiment" : "MUST_HAVE",
    "type" : "keyword",
    "start-position" : 1537,
    "end-position" : 1551,
    "concept-id" : "GSC3_yU4_K5V",
    "matched-string" : "försvarsmakten",
    "annotation-id" : 3
  }, {
    "preferred-label" : "Yrkesofficer",
    "type" : "keyword",
    "start-position" : 1592,
    "end-position" : 1604,
    "concept-id" : "PPsR_fcZ_JCd",
    "matched-string" : "yrkesofficer",
    "annotation-id" : 22
  }, {
    "preferred-label" : "Försvarsmakten",
    "type" : "keyword",
    "start-position" : 1630,
    "end-position" : 1645,
    "concept-id" : "GSC3_yU4_K5V",
    "matched-string" : "Försvarsmaktens",
    "annotation-id" : 23
  }, {
    "preferred-label" : "Svenska",
    "sentiment" : "MUST_HAVE",
    "type" : "language",
    "start-position" : 1686,
    "end-position" : 1693,
    "concept-id" : "zSLA_vw2_FXN",
    "matched-string" : "svenska",
    "annotation-id" : 4
  }, {
    "preferred-label" : "Engelska",
    "sentiment" : "MUST_HAVE",
    "type" : "language",
    "start-position" : 1698,
    "end-position" : 1706,
    "concept-id" : "NVxJ_hLg_TYS",
    "matched-string" : "engelska",
    "annotation-id" : 5
  }, {
    "preferred-label" : "B",
    "type" : "driving-licence",
    "start-position" : 1725,
    "end-position" : 1734,
    "concept-id" : "VTK8_WRx_GcM",
    "matched-string" : "Körkort B",
    "annotation-id" : 24
  }, {
    "preferred-label" : "Svenskt medborgarskap",
    "sentiment" : "MUST_HAVE",
    "type" : "skill",
    "start-position" : 1759,
    "end-position" : 1780,
    "concept-id" : "chKz_HpD_XL5",
    "matched-string" : "svenskt medborgarskap",
    "annotation-id" : 6
  }, {
    "preferred-label" : "avdelningschef",
    "type" : "esco-occupation",
    "start-position" : 1884,
    "end-position" : 1898,
    "concept-id" : "9Aoj_BL5_m3b",
    "matched-string" : "avdelningschef",
    "annotation-id" : 25
  }, {
    "preferred-label" : "hantera stress",
    "type" : "esco-skill",
    "start-position" : 2168,
    "end-position" : 2179,
    "concept-id" : "z5Zo_DVb_VEK",
    "matched-string" : "stresstålig",
    "annotation-id" : 26
  }, {
    "preferred-label" : "Försvarsmakten",
    "sentiment" : "MUST_HAVE",
    "type" : "keyword",
    "start-position" : 2228,
    "end-position" : 2242,
    "concept-id" : "GSC3_yU4_K5V",
    "matched-string" : "försvarsmakten",
    "annotation-id" : 7
  }, {
    "preferred-label" : "Försvarsmakten",
    "type" : "keyword",
    "start-position" : 2258,
    "end-position" : 2273,
    "concept-id" : "GSC3_yU4_K5V",
    "matched-string" : "Försvarsmaktens",
    "annotation-id" : 27
  }, {
    "preferred-label" : "Tillsvidareanställning (inkl. eventuell provanställning)",
    "type" : "employment-type",
    "start-position" : 2394,
    "end-position" : 2405,
    "concept-id" : "kpPX_CNN_gDU",
    "matched-string" : "Tillsvidare",
    "annotation-id" : 28
  }, {
    "preferred-label" : "Militär",
    "sentiment" : "MUST_HAVE",
    "type" : "keyword",
    "start-position" : 2407,
    "end-position" : 2414,
    "concept-id" : "DwGx_oR9_N4t",
    "matched-string" : "militär",
    "annotation-id" : 8
  }, {
    "preferred-label" : "Heltid",
    "type" : "worktime-extent",
    "start-position" : 2454,
    "end-position" : 2460,
    "concept-id" : "6YE1_gAC_R2G",
    "matched-string" : "Heltid",
    "annotation-id" : 29
  }, {
    "preferred-label" : "Resor i arbetet förekommer",
    "type" : "work-place-environment",
    "start-position" : 2566,
    "end-position" : 2594,
    "concept-id" : "oaM2_JTK_muh",
    "matched-string" : "genomförande av tjänsteresor",
    "annotation-id" : 30
  }, {
    "preferred-label" : "Försvarsmakten",
    "type" : "keyword",
    "start-position" : 3265,
    "end-position" : 3280,
    "concept-id" : "GSC3_yU4_K5V",
    "matched-string" : "Försvarsmaktens",
    "annotation-id" : 31
  }, {
    "preferred-label" : "Försvarsmakten",
    "sentiment" : "MUST_HAVE",
    "type" : "keyword",
    "start-position" : 3365,
    "end-position" : 3379,
    "concept-id" : "GSC3_yU4_K5V",
    "matched-string" : "försvarsmakten",
    "annotation-id" : 9
  }, {
    "preferred-label" : "Försvarsmakten",
    "type" : "keyword",
    "start-position" : 3502,
    "end-position" : 3517,
    "concept-id" : "GSC3_yU4_K5V",
    "matched-string" : "Försvarsmaktens",
    "annotation-id" : 32
  }, {
    "preferred-label" : "Försvarsmakten",
    "sentiment" : "MUST_HAVE",
    "type" : "keyword",
    "start-position" : 4181,
    "end-position" : 4195,
    "concept-id" : "GSC3_yU4_K5V",
    "matched-string" : "försvarsmakten",
    "annotation-id" : 12
  }, {
    "preferred-label" : "Svenskt medborgarskap",
    "sentiment" : "MUST_HAVE",
    "type" : "skill",
    "start-position" : 4531,
    "end-position" : 4552,
    "concept-id" : "chKz_HpD_XL5",
    "matched-string" : "svenskt medborgarskap",
    "annotation-id" : 16
  }, {
    "preferred-label" : "Säljare",
    "sentiment" : "MUST_HAVE",
    "type" : "keyword",
    "start-position" : 5061,
    "end-position" : 5068,
    "concept-id" : "rDcj_Tao_TJJ",
    "matched-string" : "säljare",
    "annotation-id" : 17
  } ],
  "text" : "Ställföreträdande stabschef tillika avdelningschef\nSkaraborgs flygflottilj (F 7) söker ställföreträdande stabschef tillika avdelningschef för förbandsstödsavdelningen. Vi söker dig som vill jobba som ställföreträdande stabschef tillika chef för förbandsstödsavdelningen och som vill ha ett utmanande och spännande arbete.\n\nOm enheten\n\nBefattningen ingår i flottiljstaben som består av cirka 125 medarbetare. I rollen som ställföreträdande stabschef ingår du tillsammans med stabschef och stabsförvaltare i stabens ledningstriad. \n I rollen som chef förbandsstödsavdelningen är du chef för avdelningens personal och funktioner. Avdelningen består av 11 medarbetare som arbetar inom kvalité, kommunikation, expedition, administration och besök/museum.\n\nHuvudsakliga arbetsuppgifter\n\n\n• stödja stabschef tillika enhetschef för flottiljstaben\n• vara chef för förbandsstödsavdelningen\n• ingå i flottiljledningsgruppen\n• leder, på uppdrag av stabschefen, den interna samordningen av flottiljstaben i fred såväl som i kris och krig\n• sammanhåller flottiljstabens interna arbete såsom verksamhetsutveckling, lönerevision, ekonomisk uppföljning och orderskrivande\n• samordna, genom kvalitetschefen, verksamhetsutvecklings- och kvalitetsarbetet vid F 7 samt följa upp att fastställda kvalitetssäkringsrutiner efterlevs\n• samordna, genom expeditionen, informationsflödet inom Såtenäs garnison\n• ansvara för att genomföra en första beredning av inkommande externa handlingar till F 7 samt interna till flottiljstaben\n\nKvalifikationer\n\n\n• Anställd i Försvarsmakten med kontinuerlig tjänstgöring\n• Godkänd yrkesofficersexamen\n\n\n• Förtrogen med Försvarsmaktens stabsarbetsmetodik\n\n\n• Goda kunskaper i svenska och engelska, tal och skrift\n• Körkort B för manuell växellåda\n• Svenskt medborgarskap \n\nMeriterande \n\n\n• Erfarenhet av flygvapnets verksamhet och organisation\n• Erfarenhet som kompanichef, avdelningschef eller motsvarande\n\nPersonliga egenskaper  \n\nSom person är du drivande, initiativtagande, organiserad och strukturerad i ditt arbete. För att trivas i rollen är du social och har lätt för att samarbeta. Då det tidvis är hög arbetsbelastning krävs att du är flexibel och stresstålig.\n\nVi ser även att du är en god representant för Försvarsmakten och står bakom Försvarsmaktens värdegrund (se www.forsvarsmakten.se). Stor vikt kommer att läggas vid personlig lämplighet.\n\nÖvrigt\n\nAnställningsform: Tillsvidare, militär befattning, OF 3\n\nSysselsättningsgrad: Heltid\n Arbetsort: Såtenäs\n Tillträdesdatum: Enligt överenskommelse  \n\nTjänsten innebär krav på fysisk förmåga, genomförande av tjänsteresor, deltagande i utbildning och övning i krigsorganisationen.\n\nKontaktpersoner\n Vill du veta mer om befattningen är du välkommen att kontakta stabschef Jim Hallander, jim.hallander@mil.se\n \n\nFackliga företrädare: \n\nOfficersförbundet OFR/O, Jan Möller, tfn 0704 - 614 400\n Försvarsförbundet OFR/S, Per Gunnarsson, tfn 0510 - 47 77 08\n SACO, Ulf Svensson, tfn 0510 - 47 74 63\n SEKO, Erling Svensson, tfn 072 - 98 11 659\n \n Sista ansökningsdag\n\nVälkommen med din ansökan senast 2022-07-03. Din ansökan ska innehålla CV samt ansökningsbrev där vi vill att du motiverar varför du är lämpad för denna befattning.\n \n\n\n Ansökningar till denna befattning kommer endast tas emot via Försvarsmaktens webbplats. \n--------------------------------------------------------\nInformation om Försvarsmakten och det rekryterande förbandet:\n\nSkaraborgs flygflottilj är en mångsidig och unik flygflottilj. Här finns stridsflyg samt Försvarsmaktens samlade resurs av transport- och specialflyg. Vi genomför grund- och befattningsutbildning av pliktinkallade rekryter samt utbildar alla svenska och utländska Gripenpiloter. Förbandet deltar också i många insatser. I Sverige finns verksamheten på Såtenäs, Malmen, Arlanda och Karlsborg. Utomlands ansvarar vi för Gripensupporten i Thailand samt för den svenska personalen vid det internationella transportflygsamarbetet Heavy Airlift Wing i Ungern.\nLäs gärna mer på https://www.forsvarsmakten.se/f7\n\nVarje dag och varje timme gör våra medarbetare insatser som påverkar andra människors liv, både i stort och smått, och både på hemmaplan och runt om i världen.\n\nI Försvarsmakten finns en stark värdegrund som bygger på öppenhet, resultat och ansvar. Professionell utveckling och personlig hälsa värdesätts och uppmuntras. Det finns goda förutsättningar för intern karriärrörlighet, friskvård samt bra balans mellan arbete och privatliv.\n\nEn anställning hos oss innebär placering i säkerhetsklass. Vanligtvis krävs svenskt medborgarskap.\nSäkerhetsprövning med registerkontroll kommer att genomföras före anställning enligt 3 kap i säkerhetsskyddslagen. Med anställning följer en skyldighet att krigsplaceras. I anställningen ingår även en skyldighet att tjänstgöra utomlands. Innebörden av detta varierar beroende på typ av befattning.\n\nTill ansökan om anställning ska CV och personligt brev bifogas. Om du går vidare i anställningsprocessen ska alltid vidimerade kopior av betyg och intyg uppvisas.\n\nSamtal från externa rekryteringsföretag och säljare undanbedes."
}