{
  "meta" : {
    "jobad" : {
      "description" : {
        "requirements" : null,
        "needs" : null,
        "company_information" : null,
        "text_formatted" : "Som backendutvecklare hos SVT i Stockholm är du delaktig i att säkerställa så att SVT:s utbud alltid är tillgängligt! \n\nSVT Play har under en vecka nästan 50 % av Sveriges befolkning som besökare. Att säkerställa så att tjänsterna och utbudet finns tillgängligt och att nertid minimeras är av högsta vikt. Teamet TOC Plattform, vars uppgift är att säkerställa just detta, söker nu en backendutvecklare. Här får du möjlighet att vara med på en ny, spännande satsning. Då teamet är relativt nyskapat får du chansen att bidra till gruppens kultur samtidigt som teamet är på väg att växa. Här blir du involverad i att bygga SVT:s övervakningsplattform, där teamet jobbar både användardrivet och utforskande genom att ta fram, testa och utvärdera olika tekniska lösningar som underlättar för övervakningen av SVT:s kritiska tjänster. \n\nVi erbjuder dig\n\nHos SVT får du en varierande och händelserik vardag samtidigt som du arbetar på ett av Sveriges mest kända varumärken. Här får du möjlighet att arbeta i en datadriven kultur som ständigt lär av varandra.\n\nHos oss på SVT får du:\n\n • Bli en del av ett autonomt och agilt team där du får stora möjligheter att påverka teknikval och teamets inriktning\n • Arbeta i nära samarbete tillsammans med teamet som präglas av en stark gemenskap. Teamet arbetar ofta med parprogrammering och jobbar med moderna ramverk och tekniker\n • Innovera och testa ny teknik och nya lösningar på våra regelbundna återkommande hackarfredagar och tekniksprintar!\n • Sist men inte minst; hos SVT får du en trygg och unik arbetsgivare med ett meningsfullt Public Service-uppdrag och högt engagemang bland sina anställda\n\nDet här gör du hos oss\n\nI rollen som backendutvecklare blir du en del av ett team som utvecklar system för monitorering av SVT:s onlinetjänster. Du kommer arbeta tätt mot SVT:s Technical Operations Center där övervakning och incidenthantering sker. Du kommer även att arbeta mot utvecklingsteamen på SVT för att tillgodese deras behov av monitorering.\n\nI rollen kommer du bland annat:\n\n • Utveckla system som gör det enkelt för andra utvecklingsteam på SVT att övervaka sina tjänster\n • Utveckla system och applikationer som ger SVTs Technical Operations Center en bild av hur kritiska tjänster mår, samt underlättar vid incidenter\n • Integrera mot tredjepartssystem för övervakning\n • Utforska och utvärdera behov tillsammans med våra användare\n\n \n\nDitt team och arbetsplats\n\nHär blir du del av teamet TOC Plattform. Idag är vi ett mindre team som jobbar i nära samarbete med varandra. Teamet har stort fokus på användardrivet och att experimentera både arbetssätt och tekniker. Här uppmuntras du att vara kreativ och dela med dig av dina idéer och förslag. Hos är det viktigt att du har kul på jobbet och vi strävar efter att alla ska trivas och må bra! Vi jobbar delvis remote. När vi väl är på plats så sitter vi centralt i SVT-huset på Gärdet i Stockholm.\n\nMer om dig\n\nI den här tjänsten söker vi dig som kan utmana oss med nya perspektiv! Teknikmässigt har du tidigare erfarenhet av backendutveckling, antingen i Java eller Kotlin. Personlighetsmässigt trivs du att samarbeta tillsammans med andra. Du har lätt för att anpassa dig utefter förändringar, samtidigt som du gärna bidrar med egna tankar och initiativ. Därtill så trivs du i en roll där du får utvecklas. Slutligen har du även mycket goda kunskaper i både svenska och engelska i tal och skrift.\n\nSå här får vi kontakt\nI den här rekryteringen har vi valt att samarbeta med Ada Digital som strävar efter en transparent, inkluderande och snabbrörlig rekryteringsupplevelse. Vi vill veta mer om dig och din potential! Du söker tjänsten enkelt och behöver inte bifoga några dokument. Det räcker med en motivering till varför du söker tjänsten och om du saknar CV kan du bifoga din LinkedIn-profil. Följ sedan din ansökan live via vår hemsida. Urvalet sker löpande och tjänsten kan bli tillsatt före sista ansökningsdatum. Är du nyfiken och vill veta mer innan du söker? Hör av dig till ansvarig rekryterare. Vi ser fram emot att få kontakt med dig!",
        "conditions" : "Heltid\r\nTillsvidare",
        "text" : "Som backendutvecklare hos SVT i Stockholm är du delaktig i att säkerställa så att SVT:s utbud alltid är tillgängligt! \n\nSVT Play har under en vecka nästan 50 % av Sveriges befolkning som besökare. Att säkerställa så att tjänsterna och utbudet finns tillgängligt och att nertid minimeras är av högsta vikt. Teamet TOC Plattform, vars uppgift är att säkerställa just detta, söker nu en backendutvecklare. Här får du möjlighet att vara med på en ny, spännande satsning. Då teamet är relativt nyskapat får du chansen att bidra till gruppens kultur samtidigt som teamet är på väg att växa. Här blir du involverad i att bygga SVT:s övervakningsplattform, där teamet jobbar både användardrivet och utforskande genom att ta fram, testa och utvärdera olika tekniska lösningar som underlättar för övervakningen av SVT:s kritiska tjänster. \n\nVi erbjuder dig\n\nHos SVT får du en varierande och händelserik vardag samtidigt som du arbetar på ett av Sveriges mest kända varumärken. Här får du möjlighet att arbeta i en datadriven kultur som ständigt lär av varandra.\n\nHos oss på SVT får du:\n\n • Bli en del av ett autonomt och agilt team där du får stora möjligheter att påverka teknikval och teamets inriktning\n • Arbeta i nära samarbete tillsammans med teamet som präglas av en stark gemenskap. Teamet arbetar ofta med parprogrammering och jobbar med moderna ramverk och tekniker\n • Innovera och testa ny teknik och nya lösningar på våra regelbundna återkommande hackarfredagar och tekniksprintar!\n • Sist men inte minst; hos SVT får du en trygg och unik arbetsgivare med ett meningsfullt Public Service-uppdrag och högt engagemang bland sina anställda\n\nDet här gör du hos oss\n\nI rollen som backendutvecklare blir du en del av ett team som utvecklar system för monitorering av SVT:s onlinetjänster. Du kommer arbeta tätt mot SVT:s Technical Operations Center där övervakning och incidenthantering sker. Du kommer även att arbeta mot utvecklingsteamen på SVT för att tillgodese deras behov av monitorering.\n\nI rollen kommer du bland annat:\n\n • Utveckla system som gör det enkelt för andra utvecklingsteam på SVT att övervaka sina tjänster\n • Utveckla system och applikationer som ger SVTs Technical Operations Center en bild av hur kritiska tjänster mår, samt underlättar vid incidenter\n • Integrera mot tredjepartssystem för övervakning\n • Utforska och utvärdera behov tillsammans med våra användare\n\n \n\nDitt team och arbetsplats\n\nHär blir du del av teamet TOC Plattform. Idag är vi ett mindre team som jobbar i nära samarbete med varandra. Teamet har stort fokus på användardrivet och att experimentera både arbetssätt och tekniker. Här uppmuntras du att vara kreativ och dela med dig av dina idéer och förslag. Hos är det viktigt att du har kul på jobbet och vi strävar efter att alla ska trivas och må bra! Vi jobbar delvis remote. När vi väl är på plats så sitter vi centralt i SVT-huset på Gärdet i Stockholm.\n\nMer om dig\n\nI den här tjänsten söker vi dig som kan utmana oss med nya perspektiv! Teknikmässigt har du tidigare erfarenhet av backendutveckling, antingen i Java eller Kotlin. Personlighetsmässigt trivs du att samarbeta tillsammans med andra. Du har lätt för att anpassa dig utefter förändringar, samtidigt som du gärna bidrar med egna tankar och initiativ. Därtill så trivs du i en roll där du får utvecklas. Slutligen har du även mycket goda kunskaper i både svenska och engelska i tal och skrift.\n\nSå här får vi kontakt\nI den här rekryteringen har vi valt att samarbeta med Ada Digital som strävar efter en transparent, inkluderande och snabbrörlig rekryteringsupplevelse. Vi vill veta mer om dig och din potential! Du söker tjänsten enkelt och behöver inte bifoga några dokument. Det räcker med en motivering till varför du söker tjänsten och om du saknar CV kan du bifoga din LinkedIn-profil. Följ sedan din ansökan live via vår hemsida. Urvalet sker löpande och tjänsten kan bli tillsatt före sista ansökningsdatum. Är du nyfiken och vill veta mer innan du söker? Hör av dig till ansvarig rekryterare. Vi ser fram emot att få kontakt med dig!"
      },
      "headline" : "Backendutvecklare till SVT i Stockholm",
      "driving_license" : null,
      "employer" : {
        "email" : null,
        "phone_number" : null,
        "organization_number" : "5566482781",
        "name" : "Tng Group AB",
        "url" : "https://www.tng.se/",
        "workplace" : "TNG Group AB"
      },
      "removed_date" : null,
      "logo_url" : "https://www.arbetsformedlingen.se/rest/arbetsgivare/rest/af/v3/organisation/5566482781/logotyper/logo.png",
      "last_publication_date" : "2022-08-24T23:59:59",
      "number_of_vacancies" : 1,
      "occupation" : {
        "concept_id" : "7wdX_4rv_33z",
        "label" : "Backend-utvecklare",
        "legacy_ams_taxonomy_id" : "7632"
      },
      "occupation_group" : {
        "concept_id" : "DJh5_yyF_hEM",
        "label" : "Mjukvaru- och systemutvecklare m.fl.",
        "legacy_ams_taxonomy_id" : "2512"
      },
      "employment_type" : {
        "concept_id" : "PFZr_Syz_cUq",
        "label" : "Vanlig anställning",
        "legacy_ams_taxonomy_id" : "1"
      },
      "webpage_url" : "https://arbetsformedlingen.se/platsbanken/annonser/26349702",
      "driving_license_required" : false,
      "application_contacts" : [ {
        "description" : "Emil Lindberg",
        "email" : "emil.lindberg@adadigital.se",
        "telephone" : "0737450436",
        "name" : null,
        "contact_type" : "Talent Business Partner"
      } ],
      "duration" : {
        "concept_id" : "a7uU_j21_mkL",
        "label" : "Tills vidare",
        "legacy_ams_taxonomy_id" : "1"
      },
      "nice_to_have" : {
        "education_level" : [ ],
        "work_experiences" : [ ],
        "skills" : [ ],
        "education" : [ ],
        "languages" : [ ]
      },
      "application_details" : {
        "via_af" : false,
        "email" : null,
        "other" : null,
        "reference" : null,
        "url" : "https://adadigital.se/lediga-jobb?jid=053C7DCB-C8C6-469B-B319-392B5E22057A&src=AMS",
        "information" : null
      },
      "source_type" : "VIA_PLATSBANKEN_DXA",
      "application_deadline" : "2022-08-24T23:59:59",
      "external_id" : "46-556648-2781-0000011097DDE6C2CD",
      "workplace_address" : {
        "coordinates" : [ 18.06858, 59.329323 ],
        "city" : null,
        "postcode" : null,
        "municipality" : "Stockholm",
        "region_concept_id" : "CifL_Rzy_Mku",
        "region" : "Stockholms län",
        "country_code" : "199",
        "region_code" : "01",
        "municipality_concept_id" : "AvNB_uwa_6n6",
        "country_concept_id" : "i46j_HmG_v64",
        "municipality_code" : "0180",
        "street_address" : null,
        "country" : "Sverige"
      },
      "id" : "26349702",
      "experience_required" : true,
      "working_hours_type" : {
        "concept_id" : "6YE1_gAC_R2G",
        "label" : "Heltid",
        "legacy_ams_taxonomy_id" : "1"
      },
      "access" : null,
      "timestamp" : 1658730773852,
      "must_have" : {
        "education_level" : [ ],
        "work_experiences" : [ {
          "concept_id" : "7wdX_4rv_33z",
          "weight" : 10,
          "label" : "Backend-utvecklare",
          "legacy_ams_taxonomy_id" : "7632"
        } ],
        "skills" : [ ],
        "education" : [ ],
        "languages" : [ ]
      },
      "occupation_field" : {
        "concept_id" : "apaJ_2ja_LuF",
        "label" : "Data/IT",
        "legacy_ams_taxonomy_id" : "3"
      },
      "scope_of_work" : {
        "min" : 100,
        "max" : 100
      },
      "salary_type" : {
        "concept_id" : "oG8G_9cW_nRf",
        "label" : "Fast månads- vecko- eller timlön",
        "legacy_ams_taxonomy_id" : "1"
      },
      "removed" : false,
      "salary_description" : "Fast lön",
      "access_to_own_car" : false,
      "publication_date" : "2022-07-25T08:32:53"
    },
    "name" : "Backendutvecklare till SVT i Stockholm",
    "user" : "hannes"
  },
  "sha1" : "3cab5f38b2c0947ae0e2b6771de68584c018b6dc",
  "annotations" : [ {
    "preferred-label" : "Backend-utvecklare",
    "type" : "occupation-name",
    "start-position" : 0,
    "end-position" : 17,
    "concept-id" : "7wdX_4rv_33z",
    "matched-string" : "Backendutvecklare",
    "annotation-id" : 7
  }, {
    "preferred-label" : "Stockholm",
    "type" : "municipality",
    "start-position" : 29,
    "end-position" : 38,
    "concept-id" : "AvNB_uwa_6n6",
    "matched-string" : "Stockholm",
    "annotation-id" : 8
  }, {
    "preferred-label" : "Backend-utvecklare",
    "type" : "occupation-name",
    "start-position" : 43,
    "end-position" : 60,
    "concept-id" : "7wdX_4rv_33z",
    "matched-string" : "backendutvecklare",
    "annotation-id" : 9
  }, {
    "preferred-label" : "Stockholm",
    "type" : "municipality",
    "start-position" : 71,
    "end-position" : 80,
    "concept-id" : "AvNB_uwa_6n6",
    "matched-string" : "Stockholm",
    "annotation-id" : 10
  }, {
    "preferred-label" : "Sverige",
    "type" : "country",
    "start-position" : 202,
    "end-position" : 210,
    "concept-id" : "i46j_HmG_v64",
    "matched-string" : "Sveriges",
    "annotation-id" : 11
  }, {
    "preferred-label" : "Backend-utvecklare",
    "type" : "occupation-name",
    "start-position" : 423,
    "end-position" : 440,
    "concept-id" : "7wdX_4rv_33z",
    "matched-string" : "backendutvecklare",
    "annotation-id" : 12
  }, {
    "preferred-label" : "Sverige",
    "type" : "country",
    "start-position" : 974,
    "end-position" : 982,
    "concept-id" : "i46j_HmG_v64",
    "matched-string" : "Sveriges",
    "annotation-id" : 13
  }, {
    "preferred-label" : "Agila arbetsmetoder",
    "type" : "skill",
    "start-position" : 1150,
    "end-position" : 1155,
    "concept-id" : "TMVb_DnH_etF",
    "matched-string" : "agilt",
    "annotation-id" : 14
  }, {
    "preferred-label" : "ramverk",
    "sentiment" : "MUST_HAVE",
    "type" : "esco-skill",
    "start-position" : 1384,
    "end-position" : 1391,
    "concept-id" : "JD8j_tGG_cJT",
    "matched-string" : "ramverk",
    "annotation-id" : 0
  }, {
    "preferred-label" : "Backend-utvecklare",
    "type" : "occupation-name",
    "start-position" : 1716,
    "end-position" : 1733,
    "concept-id" : "7wdX_4rv_33z",
    "matched-string" : "backendutvecklare",
    "annotation-id" : 15
  }, {
    "preferred-label" : "Stockholm",
    "type" : "municipality",
    "start-position" : 2929,
    "end-position" : 2938,
    "concept-id" : "AvNB_uwa_6n6",
    "matched-string" : "Stockholm",
    "annotation-id" : 16
  }, {
    "preferred-label" : "Backend-utvecklare",
    "type" : "occupation-name",
    "start-position" : 3068,
    "end-position" : 3085,
    "concept-id" : "7wdX_4rv_33z",
    "matched-string" : "backendutveckling",
    "annotation-id" : 17
  }, {
    "preferred-label" : "Java, programmeringsspråk",
    "sentiment" : "MUST_HAVE",
    "type" : "skill",
    "start-position" : 3098,
    "end-position" : 3102,
    "concept-id" : "jCsR_WQX_CKD",
    "matched-string" : "java",
    "annotation-id" : 1
  }, {
    "preferred-label" : "Kotlin, programmeringsspråk",
    "sentiment" : "MUST_HAVE",
    "type" : "skill",
    "start-position" : 3109,
    "end-position" : 3115,
    "concept-id" : "Xakb_qAt_g9u",
    "matched-string" : "kotlin",
    "annotation-id" : 2
  }, {
    "preferred-label" : "Svenska",
    "sentiment" : "MUST_HAVE",
    "type" : "language",
    "start-position" : 3402,
    "end-position" : 3409,
    "concept-id" : "zSLA_vw2_FXN",
    "matched-string" : "svenska",
    "annotation-id" : 3
  }, {
    "preferred-label" : "Engelska",
    "sentiment" : "MUST_HAVE",
    "type" : "language",
    "start-position" : 3414,
    "end-position" : 3422,
    "concept-id" : "NVxJ_hLg_TYS",
    "matched-string" : "engelska",
    "annotation-id" : 4
  } ],
  "text" : "Backendutvecklare till SVT i Stockholm\nSom backendutvecklare hos SVT i Stockholm är du delaktig i att säkerställa så att SVT:s utbud alltid är tillgängligt! \n\nSVT Play har under en vecka nästan 50 % av Sveriges befolkning som besökare. Att säkerställa så att tjänsterna och utbudet finns tillgängligt och att nertid minimeras är av högsta vikt. Teamet TOC Plattform, vars uppgift är att säkerställa just detta, söker nu en backendutvecklare. Här får du möjlighet att vara med på en ny, spännande satsning. Då teamet är relativt nyskapat får du chansen att bidra till gruppens kultur samtidigt som teamet är på väg att växa. Här blir du involverad i att bygga SVT:s övervakningsplattform, där teamet jobbar både användardrivet och utforskande genom att ta fram, testa och utvärdera olika tekniska lösningar som underlättar för övervakningen av SVT:s kritiska tjänster. \n\nVi erbjuder dig\n\nHos SVT får du en varierande och händelserik vardag samtidigt som du arbetar på ett av Sveriges mest kända varumärken. Här får du möjlighet att arbeta i en datadriven kultur som ständigt lär av varandra.\n\nHos oss på SVT får du:\n\n • Bli en del av ett autonomt och agilt team där du får stora möjligheter att påverka teknikval och teamets inriktning\n • Arbeta i nära samarbete tillsammans med teamet som präglas av en stark gemenskap. Teamet arbetar ofta med parprogrammering och jobbar med moderna ramverk och tekniker\n • Innovera och testa ny teknik och nya lösningar på våra regelbundna återkommande hackarfredagar och tekniksprintar!\n • Sist men inte minst; hos SVT får du en trygg och unik arbetsgivare med ett meningsfullt Public Service-uppdrag och högt engagemang bland sina anställda\n\nDet här gör du hos oss\n\nI rollen som backendutvecklare blir du en del av ett team som utvecklar system för monitorering av SVT:s onlinetjänster. Du kommer arbeta tätt mot SVT:s Technical Operations Center där övervakning och incidenthantering sker. Du kommer även att arbeta mot utvecklingsteamen på SVT för att tillgodese deras behov av monitorering.\n\nI rollen kommer du bland annat:\n\n • Utveckla system som gör det enkelt för andra utvecklingsteam på SVT att övervaka sina tjänster\n • Utveckla system och applikationer som ger SVTs Technical Operations Center en bild av hur kritiska tjänster mår, samt underlättar vid incidenter\n • Integrera mot tredjepartssystem för övervakning\n • Utforska och utvärdera behov tillsammans med våra användare\n\n \n\nDitt team och arbetsplats\n\nHär blir du del av teamet TOC Plattform. Idag är vi ett mindre team som jobbar i nära samarbete med varandra. Teamet har stort fokus på användardrivet och att experimentera både arbetssätt och tekniker. Här uppmuntras du att vara kreativ och dela med dig av dina idéer och förslag. Hos är det viktigt att du har kul på jobbet och vi strävar efter att alla ska trivas och må bra! Vi jobbar delvis remote. När vi väl är på plats så sitter vi centralt i SVT-huset på Gärdet i Stockholm.\n\nMer om dig\n\nI den här tjänsten söker vi dig som kan utmana oss med nya perspektiv! Teknikmässigt har du tidigare erfarenhet av backendutveckling, antingen i Java eller Kotlin. Personlighetsmässigt trivs du att samarbeta tillsammans med andra. Du har lätt för att anpassa dig utefter förändringar, samtidigt som du gärna bidrar med egna tankar och initiativ. Därtill så trivs du i en roll där du får utvecklas. Slutligen har du även mycket goda kunskaper i både svenska och engelska i tal och skrift.\n\nSå här får vi kontakt\nI den här rekryteringen har vi valt att samarbeta med Ada Digital som strävar efter en transparent, inkluderande och snabbrörlig rekryteringsupplevelse. Vi vill veta mer om dig och din potential! Du söker tjänsten enkelt och behöver inte bifoga några dokument. Det räcker med en motivering till varför du söker tjänsten och om du saknar CV kan du bifoga din LinkedIn-profil. Följ sedan din ansökan live via vår hemsida. Urvalet sker löpande och tjänsten kan bli tillsatt före sista ansökningsdatum. Är du nyfiken och vill veta mer innan du söker? Hör av dig till ansvarig rekryterare. Vi ser fram emot att få kontakt med dig!"
}