{
  "meta" : {
    "jobad" : {
      "description" : {
        "requirements" : null,
        "needs" : null,
        "company_information" : null,
        "text_formatted" : "Har du lätt att prata med folk och behärskar samtidigt konsten att lyssna? Då har du bra förutsättningar att kunna bli en skicklig säljare hos oss. \nVi söker dig som vill jobba med försäljning i vår butik Elgiganten Phone House Tuna Park, Eskilstuna. \nDen viktigaste uppgiften för dig som säljare är att hitta den perfekta lösningen för din kund genom att lyssna, svara på frågor och vägleda kunden till bästa köp. Du genomför kampanjer tillsammans med kollegor och får säljträning och coachning.\nArbetsuppgifter\nMöta kunder, försäljning\nHantera frågor och kundärenden\nFylla på varor och hålla butiken säljande och konceptenlig\nGenomföra kampanjer\nKassa, Öppning-Stängning\nTräning och utbildning\nDu går på rullande schema och arbetstider kan variera mellan dagtid, kvällstid och helger.\nAtt arbeta för Elgiganten är både roligt, utmanande och fartfyllt. Tillsammans med dina kollegor är uppgiften att göra våra kunder 100 % nöjda varje dag - och att ha roligt under tiden!\nProfil & Bakgrund \nDina egenskaper och sätt att vara är viktigare för oss än en imponerande meritförteckning. Du älskar att uppnå dina mål - och när du gör det vill vi fira det med dig. Vi tror att du:\nTycker om att arbeta med människor\nResultat- och lösningsorienterad\nHar lätt för att lära och en vilja att utvecklas\nVill göra ditt absolut bästa\nEtt intresse för de varor och tjänster som vi säljer är en stor fördel, men inte ett krav. Du får en bra introduktion som kommer att förse dig med de kunskaper och expertis som du behöver samt som ger dig rätt förutsättningar att lyckas och trivas.\nArbetsglädje \nHär jobbar ett gäng personer som är drivna och intresserade i kontakt med kunder och kollegor. Vi är ärliga, ödmjuka och lyssnar på kunden och kundens behov. Vi söker en kollega som är en peppande, lojal och hjälpsam person som ställer upp för andra. Som löser problem som uppstår på ett effektivt sätt och håller dig uppdaterad på företagets produkter. Vår kultur är viktig för oss och i stort sett allt som du gör som medarbetare på Elgiganten genomsyras av våra tre grundstenar: Ansvarstagande, Engagemang och Effektivitet.\nDe som har affärssinne, gillar att tävla och vill bidra till positiva resultat för företaget brukar trivas väl hos oss. Det är personer som gillar att utvecklas och tar sig an sina arbetsuppgifter på ett effektivt, strukturerat och noggrant sätt. Är du en av dem? Då gillar du säkert snabba förändringar och det faller sig naturligt för dig att ta egna initiativ. Vi kommer att ha kul tillsammans! \nUtveckling på Elgiganten\nVårt mål är att bli branschens bästa arbetsgivare och vi tror att vi når dit genom ett gott ledarskap. På Elgiganten skapar en god ledare engagemang, arbetsglädje och motiverade medarbetare med hjälp av en stor portion vanlig snällhet och sunt förnuft. Som stöd finns en stöttande varuhuschef och ett omfattande utbildningsprogram i ledarskap och personlig utveckling.\nHar du massor av energi, är social och är bra på ditt jobb, kan vi garantera att du får både möjligheter och utmaningar hos oss. Vi investerar årligen över 50 mkr och 36.000 kursdagar i att utbilda och träna våra medarbetare inom produktkunskap, försäljning och kundvård.\nElgiganten erbjuder \nAvtalsenlig lön och pension\nGeneröst bonusavtal\nFörmåner inom friskvård och personalköp\nInternt utbildningsprogram för medarbetare och ledare\nGoda karriärmöjligheter\nPå Elgiganten gillar vi mångfald och välkomnar därför alla sökanden oavsett kön, ålder eller etnisk bakgrund.\nAnsökningar utvärderas löpande och hittar vi en passande Gigant kan rekryteringsprocessen gå snabbare än planerat. Frågor om tjänsten besvaras av mig på sam.seyed.ali@giganten.se.\nTycker du detta låter kul? Då hoppas vi att du vill jobba hos oss! \nVarmt välkommen med din ansökan.",
        "conditions" : "Deltid ",
        "text" : "Har du lätt att prata med folk och behärskar samtidigt konsten att lyssna? Då har du bra förutsättningar att kunna bli en skicklig säljare hos oss. \nVi söker dig som vill jobba med försäljning i vår butik Elgiganten Phone House Tuna Park, Eskilstuna. \nDen viktigaste uppgiften för dig som säljare är att hitta den perfekta lösningen för din kund genom att lyssna, svara på frågor och vägleda kunden till bästa köp. Du genomför kampanjer tillsammans med kollegor och får säljträning och coachning.\nArbetsuppgifter\nMöta kunder, försäljning\nHantera frågor och kundärenden\nFylla på varor och hålla butiken säljande och konceptenlig\nGenomföra kampanjer\nKassa, Öppning-Stängning\nTräning och utbildning\nDu går på rullande schema och arbetstider kan variera mellan dagtid, kvällstid och helger.\nAtt arbeta för Elgiganten är både roligt, utmanande och fartfyllt. Tillsammans med dina kollegor är uppgiften att göra våra kunder 100 % nöjda varje dag - och att ha roligt under tiden!\nProfil & Bakgrund \nDina egenskaper och sätt att vara är viktigare för oss än en imponerande meritförteckning. Du älskar att uppnå dina mål - och när du gör det vill vi fira det med dig. Vi tror att du:\nTycker om att arbeta med människor\nResultat- och lösningsorienterad\nHar lätt för att lära och en vilja att utvecklas\nVill göra ditt absolut bästa\nEtt intresse för de varor och tjänster som vi säljer är en stor fördel, men inte ett krav. Du får en bra introduktion som kommer att förse dig med de kunskaper och expertis som du behöver samt som ger dig rätt förutsättningar att lyckas och trivas.\nArbetsglädje \nHär jobbar ett gäng personer som är drivna och intresserade i kontakt med kunder och kollegor. Vi är ärliga, ödmjuka och lyssnar på kunden och kundens behov. Vi söker en kollega som är en peppande, lojal och hjälpsam person som ställer upp för andra. Som löser problem som uppstår på ett effektivt sätt och håller dig uppdaterad på företagets produkter. Vår kultur är viktig för oss och i stort sett allt som du gör som medarbetare på Elgiganten genomsyras av våra tre grundstenar: Ansvarstagande, Engagemang och Effektivitet.\nDe som har affärssinne, gillar att tävla och vill bidra till positiva resultat för företaget brukar trivas väl hos oss. Det är personer som gillar att utvecklas och tar sig an sina arbetsuppgifter på ett effektivt, strukturerat och noggrant sätt. Är du en av dem? Då gillar du säkert snabba förändringar och det faller sig naturligt för dig att ta egna initiativ. Vi kommer att ha kul tillsammans! \nUtveckling på Elgiganten\nVårt mål är att bli branschens bästa arbetsgivare och vi tror att vi når dit genom ett gott ledarskap. På Elgiganten skapar en god ledare engagemang, arbetsglädje och motiverade medarbetare med hjälp av en stor portion vanlig snällhet och sunt förnuft. Som stöd finns en stöttande varuhuschef och ett omfattande utbildningsprogram i ledarskap och personlig utveckling.\nHar du massor av energi, är social och är bra på ditt jobb, kan vi garantera att du får både möjligheter och utmaningar hos oss. Vi investerar årligen över 50 mkr och 36.000 kursdagar i att utbilda och träna våra medarbetare inom produktkunskap, försäljning och kundvård.\nElgiganten erbjuder \nAvtalsenlig lön och pension\nGeneröst bonusavtal\nFörmåner inom friskvård och personalköp\nInternt utbildningsprogram för medarbetare och ledare\nGoda karriärmöjligheter\nPå Elgiganten gillar vi mångfald och välkomnar därför alla sökanden oavsett kön, ålder eller etnisk bakgrund.\nAnsökningar utvärderas löpande och hittar vi en passande Gigant kan rekryteringsprocessen gå snabbare än planerat. Frågor om tjänsten besvaras av mig på sam.seyed.ali@giganten.se.\nTycker du detta låter kul? Då hoppas vi att du vill jobba hos oss! \nVarmt välkommen med din ansökan."
      },
      "headline" : "Elgiganten Phone house Tuna Park söker Säljare 75%",
      "driving_license" : null,
      "employer" : {
        "email" : null,
        "phone_number" : null,
        "organization_number" : "5564714474",
        "name" : "Elgiganten AB",
        "url" : null,
        "workplace" : "Elgiganten AB"
      },
      "removed_date" : null,
      "logo_url" : "https://www.arbetsformedlingen.se/rest/arbetsgivare/rest/af/v3/organisation/5564714474/logotyper/logo.png",
      "last_publication_date" : "2022-09-04T23:59:59",
      "number_of_vacancies" : 1,
      "occupation" : {
        "concept_id" : "pBhS_6fg_727",
        "label" : "Butikssäljare/Medarbetare, dagligvaror",
        "legacy_ams_taxonomy_id" : "2284"
      },
      "occupation_group" : {
        "concept_id" : "s1Qk_o98_2o1",
        "label" : "Butikssäljare, dagligvaror",
        "legacy_ams_taxonomy_id" : "5222"
      },
      "employment_type" : {
        "concept_id" : "PFZr_Syz_cUq",
        "label" : "Vanlig anställning",
        "legacy_ams_taxonomy_id" : "1"
      },
      "webpage_url" : "https://arbetsformedlingen.se/platsbanken/annonser/26384971",
      "driving_license_required" : false,
      "application_contacts" : [ ],
      "duration" : {
        "concept_id" : "a7uU_j21_mkL",
        "label" : "Tills vidare",
        "legacy_ams_taxonomy_id" : "1"
      },
      "nice_to_have" : {
        "education_level" : [ ],
        "work_experiences" : [ ],
        "skills" : [ ],
        "education" : [ ],
        "languages" : [ ]
      },
      "application_details" : {
        "via_af" : false,
        "email" : null,
        "other" : null,
        "reference" : null,
        "url" : "https://candidate.hr-manager.net/ApplicationInit.aspx?cid=1548&ProjectId=158096&DepartmentId=19676&MediaId=4616&SkipAdvertisement=true",
        "information" : null
      },
      "source_type" : "VIA_PLATSBANKEN_DXA",
      "application_deadline" : "2022-09-04T23:59:59",
      "external_id" : "46-556471-4474-00113589",
      "workplace_address" : {
        "coordinates" : [ 16.509804, 59.37125 ],
        "city" : null,
        "postcode" : null,
        "municipality" : "Eskilstuna",
        "region_concept_id" : "s93u_BEb_sx2",
        "region" : "Södermanlands län",
        "country_code" : "199",
        "region_code" : "04",
        "municipality_concept_id" : "kMxr_NiX_YrU",
        "country_concept_id" : "i46j_HmG_v64",
        "municipality_code" : "0484",
        "street_address" : null,
        "country" : "Sverige"
      },
      "id" : "26384971",
      "experience_required" : false,
      "working_hours_type" : {
        "concept_id" : "947z_JGS_Uk2",
        "label" : "Deltid",
        "legacy_ams_taxonomy_id" : "2"
      },
      "access" : null,
      "timestamp" : 1659947733576,
      "must_have" : {
        "education_level" : [ ],
        "work_experiences" : [ ],
        "skills" : [ ],
        "education" : [ ],
        "languages" : [ ]
      },
      "occupation_field" : {
        "concept_id" : "RPTn_bxG_ExZ",
        "label" : "Försäljning, inköp, marknadsföring",
        "legacy_ams_taxonomy_id" : "5"
      },
      "scope_of_work" : {
        "min" : 0,
        "max" : 100
      },
      "salary_type" : {
        "concept_id" : "asrX_9Df_ukn",
        "label" : "Fast och rörlig lön",
        "legacy_ams_taxonomy_id" : "7"
      },
      "removed" : false,
      "salary_description" : "Avtalsenlig lön med bonus",
      "access_to_own_car" : false,
      "publication_date" : "2022-08-08T10:35:33"
    },
    "name" : "Elgiganten Phone house Tuna Park söker Säljare 75%",
    "user" : "kristof.fischer"
  },
  "sha1" : "27fdc7eb6eb6862058bd3afb1071f4e3b9b535f4",
  "annotations" : [ {
    "preferred-label" : "specialiserad säljare",
    "sentiment" : "MUST_HAVE",
    "type" : "esco-occupation",
    "start-position" : 39,
    "end-position" : 46,
    "concept-id" : "r6yu_Jip_6tE",
    "matched-string" : "säljare",
    "annotation-id" : 1
  }, {
    "preferred-label" : "Deltid",
    "type" : "worktime-extent",
    "start-position" : 47,
    "end-position" : 50,
    "concept-id" : "947z_JGS_Uk2",
    "matched-string" : "75%",
    "annotation-id" : 12
  }, {
    "preferred-label" : "specialiserad säljare",
    "sentiment" : "MUST_HAVE",
    "type" : "esco-occupation",
    "start-position" : 182,
    "end-position" : 189,
    "concept-id" : "r6yu_Jip_6tE",
    "matched-string" : "säljare",
    "annotation-id" : 2
  }, {
    "preferred-label" : "Eskilstuna",
    "type" : "municipality",
    "start-position" : 290,
    "end-position" : 300,
    "concept-id" : "kMxr_NiX_YrU",
    "matched-string" : "Eskilstuna",
    "annotation-id" : 13
  }, {
    "preferred-label" : "specialiserad säljare",
    "sentiment" : "MUST_HAVE",
    "type" : "esco-occupation",
    "start-position" : 340,
    "end-position" : 347,
    "concept-id" : "r6yu_Jip_6tE",
    "matched-string" : "säljare",
    "annotation-id" : 5
  }, {
    "preferred-label" : "kommunicera med kunder",
    "sentiment" : "MUST_HAVE",
    "type" : "esco-skill",
    "start-position" : 564,
    "end-position" : 575,
    "concept-id" : "sPCy_icd_mxy",
    "matched-string" : "Möta kunder",
    "annotation-id" : 14
  }, {
    "preferred-label" : "sälja produkter",
    "sentiment" : "MUST_HAVE",
    "type" : "esco-skill",
    "start-position" : 577,
    "end-position" : 588,
    "concept-id" : "zVth_nYb_sxr",
    "matched-string" : "försäljning",
    "annotation-id" : 15
  }, {
    "preferred-label" : "hjälpa kunder",
    "sentiment" : "MUST_HAVE",
    "type" : "esco-skill",
    "start-position" : 589,
    "end-position" : 619,
    "concept-id" : "5pKK_p8C_ydP",
    "matched-string" : "Hantera frågor och kundärenden",
    "annotation-id" : 16
  }, {
    "preferred-label" : "fylla på hyllor",
    "sentiment" : "MUST_HAVE",
    "type" : "esco-skill",
    "start-position" : 620,
    "end-position" : 634,
    "concept-id" : "uhYV_asD_53D",
    "matched-string" : "Fylla på varor",
    "annotation-id" : 17
  }, {
    "preferred-label" : "utforma kampanjer",
    "sentiment" : "MUST_HAVE",
    "type" : "esco-skill",
    "start-position" : 679,
    "end-position" : 698,
    "concept-id" : "bWgX_MKq_wHt",
    "matched-string" : "Genomföra kampanjer",
    "annotation-id" : 18
  }, {
    "preferred-label" : "ansvara för kassa",
    "sentiment" : "MUST_HAVE",
    "type" : "esco-skill",
    "start-position" : 699,
    "end-position" : 704,
    "concept-id" : "2YxS_zUo_Rji",
    "matched-string" : "Kassa",
    "annotation-id" : 19
  }, {
    "preferred-label" : "se till att kunderna är nöjda",
    "sentiment" : "MUST_HAVE",
    "type" : "esco-skill",
    "start-position" : 952,
    "end-position" : 980,
    "concept-id" : "GcZm_VYN_2VR",
    "matched-string" : "göra våra kunder 100 % nöjda",
    "annotation-id" : 20
  }, {
    "preferred-label" : "Lösningsfokuserat arbetssätt",
    "sentiment" : "MUST_HAVE",
    "type" : "skill",
    "start-position" : 1275,
    "end-position" : 1293,
    "concept-id" : "94uF_bkH_QF5",
    "matched-string" : "lösningsorienterad",
    "annotation-id" : 21
  }, {
    "preferred-label" : "hitta lösningar på problem",
    "sentiment" : "MUST_HAVE",
    "type" : "esco-skill",
    "start-position" : 1890,
    "end-position" : 1903,
    "concept-id" : "WFSY_Bwt_QWE",
    "matched-string" : "löser problem",
    "annotation-id" : 22
  }, {
    "preferred-label" : "arbeta effektivt",
    "sentiment" : "MUST_HAVE",
    "type" : "esco-skill",
    "start-position" : 2366,
    "end-position" : 2375,
    "concept-id" : "6VAn_tFw_oKo",
    "matched-string" : "effektivt",
    "annotation-id" : 23
  }, {
    "preferred-label" : "noggrannhet",
    "sentiment" : "MUST_HAVE",
    "type" : "esco-skill",
    "start-position" : 2394,
    "end-position" : 2402,
    "concept-id" : "mrsW_EkL_KRD",
    "matched-string" : "noggrant",
    "annotation-id" : 24
  }, {
    "preferred-label" : "Digital Imaging Technician/DIT/Loggare",
    "sentiment" : "MUST_HAVE",
    "type" : "occupation-name",
    "start-position" : 2659,
    "end-position" : 2662,
    "concept-id" : "A1xB_vHm_maW",
    "matched-string" : "dit",
    "annotation-id" : 8
  }, {
    "preferred-label" : "varuhuschef",
    "sentiment" : "MUST_HAVE",
    "type" : "esco-occupation",
    "start-position" : 2867,
    "end-position" : 2878,
    "concept-id" : "FWF3_rgs_n53",
    "matched-string" : "varuhuschef",
    "annotation-id" : 9
  } ],
  "text" : "Elgiganten Phone house Tuna Park söker Säljare 75%\nHar du lätt att prata med folk och behärskar samtidigt konsten att lyssna? Då har du bra förutsättningar att kunna bli en skicklig säljare hos oss. \nVi söker dig som vill jobba med försäljning i vår butik Elgiganten Phone House Tuna Park, Eskilstuna. \nDen viktigaste uppgiften för dig som säljare är att hitta den perfekta lösningen för din kund genom att lyssna, svara på frågor och vägleda kunden till bästa köp. Du genomför kampanjer tillsammans med kollegor och får säljträning och coachning.\nArbetsuppgifter\nMöta kunder, försäljning\nHantera frågor och kundärenden\nFylla på varor och hålla butiken säljande och konceptenlig\nGenomföra kampanjer\nKassa, Öppning-Stängning\nTräning och utbildning\nDu går på rullande schema och arbetstider kan variera mellan dagtid, kvällstid och helger.\nAtt arbeta för Elgiganten är både roligt, utmanande och fartfyllt. Tillsammans med dina kollegor är uppgiften att göra våra kunder 100 % nöjda varje dag - och att ha roligt under tiden!\nProfil & Bakgrund \nDina egenskaper och sätt att vara är viktigare för oss än en imponerande meritförteckning. Du älskar att uppnå dina mål - och när du gör det vill vi fira det med dig. Vi tror att du:\nTycker om att arbeta med människor\nResultat- och lösningsorienterad\nHar lätt för att lära och en vilja att utvecklas\nVill göra ditt absolut bästa\nEtt intresse för de varor och tjänster som vi säljer är en stor fördel, men inte ett krav. Du får en bra introduktion som kommer att förse dig med de kunskaper och expertis som du behöver samt som ger dig rätt förutsättningar att lyckas och trivas.\nArbetsglädje \nHär jobbar ett gäng personer som är drivna och intresserade i kontakt med kunder och kollegor. Vi är ärliga, ödmjuka och lyssnar på kunden och kundens behov. Vi söker en kollega som är en peppande, lojal och hjälpsam person som ställer upp för andra. Som löser problem som uppstår på ett effektivt sätt och håller dig uppdaterad på företagets produkter. Vår kultur är viktig för oss och i stort sett allt som du gör som medarbetare på Elgiganten genomsyras av våra tre grundstenar: Ansvarstagande, Engagemang och Effektivitet.\nDe som har affärssinne, gillar att tävla och vill bidra till positiva resultat för företaget brukar trivas väl hos oss. Det är personer som gillar att utvecklas och tar sig an sina arbetsuppgifter på ett effektivt, strukturerat och noggrant sätt. Är du en av dem? Då gillar du säkert snabba förändringar och det faller sig naturligt för dig att ta egna initiativ. Vi kommer att ha kul tillsammans! \nUtveckling på Elgiganten\nVårt mål är att bli branschens bästa arbetsgivare och vi tror att vi når dit genom ett gott ledarskap. På Elgiganten skapar en god ledare engagemang, arbetsglädje och motiverade medarbetare med hjälp av en stor portion vanlig snällhet och sunt förnuft. Som stöd finns en stöttande varuhuschef och ett omfattande utbildningsprogram i ledarskap och personlig utveckling.\nHar du massor av energi, är social och är bra på ditt jobb, kan vi garantera att du får både möjligheter och utmaningar hos oss. Vi investerar årligen över 50 mkr och 36.000 kursdagar i att utbilda och träna våra medarbetare inom produktkunskap, försäljning och kundvård.\nElgiganten erbjuder \nAvtalsenlig lön och pension\nGeneröst bonusavtal\nFörmåner inom friskvård och personalköp\nInternt utbildningsprogram för medarbetare och ledare\nGoda karriärmöjligheter\nPå Elgiganten gillar vi mångfald och välkomnar därför alla sökanden oavsett kön, ålder eller etnisk bakgrund.\nAnsökningar utvärderas löpande och hittar vi en passande Gigant kan rekryteringsprocessen gå snabbare än planerat. Frågor om tjänsten besvaras av mig på sam.seyed.ali@giganten.se.\nTycker du detta låter kul? Då hoppas vi att du vill jobba hos oss! \nVarmt välkommen med din ansökan."
}