{
  "meta" : {
    "jobad" : {
      "description" : {
        "requirements" : null,
        "needs" : null,
        "company_information" : null,
        "text_formatted" : "Om dig\nDu är en positiv person som är engagerad och bidrar med en god kamratanda för att skapa trivsel på arbetsplatsen.\r\n\r\nDu tar ansvar för ditt arbete och förstår att du är en del av en viktig helhet. I ditt arbete kan du komma att ha kontakt med patienter, anhöriga och vårdpersonal, därför är det viktigt att du är social, utåtriktad och har lätt för att kommunicera. Vi ser också att du har förmåga att vara flexibel och kan prioritera mellan arbetsuppgifter då det behövs.\n\nAv säkerhetsskäl måste du kunna förstå skriftliga instruktioner och kunna kommunicera med kollegor och övriga samarbetspartners, därför krävs mycket goda kunskaper i svenska, i såväl tal som skrift. Stor vikt läggs vid personlig lämplighet.\n\nDu som söker måste ha fyllt 18 år och vi ser gärna att du har erfarenhet av servicearbete som exempelvis städ.\n\nOm arbetet\nArbetsuppgifterna innefattar städning av mottagningar, administrativa lokaler och allmänna ytor på Kungsbacka sjukhus samt vårdcentraler inom Kungsbacka kommun. Vårdnära service innebär att ett team ansvarar för den vårdnära servicen på avdelningen. Serviceteamet samarbetar nära vårdpersonalen för att göra patientflödet så smidigt som möjligt och bidra till hög kvalitet på avdelningen. Arbetsuppgifterna för teamet kan bland annat innefatta ansvar för patientkök, städning och förrådshantering och innebär mycket samarbete, både inom teamet och med vårdpersonalen. Arbetet innefattar också kontakt med patienter och anhöriga, där serviceteamet stärker patientens upplevelse av kvalitet. Arbetet är främst schemalagt med tjänstgöring dagtid men kan variera mellan kl. 06.00-23.30. Helgtjänstgöring kan ingå. \n\nVarmt välkommen att skicka in din ansökan!\n\nUrval och intervjuer sker löpande under ansökningstiden, så skicka gärna in din ansökan så fort som möjligt.\n\nInför eventuell anställning måste utdrag ur belastningsregistret kunna uppvisas.\n\nOm Region Halland\n\n\nRegion Halland är till för alla som bor och arbetar här i Halland. Vi är över 8 000 medarbetare inom 370 olika yrken som alla arbetar för att erbjuda en god hälso- och sjukvård och att främja tillväxt och utveckling. Vi ansvarar också för kollektivtrafiken i Halland och driver frågor inom områden som näringsliv, kultur och utbildning. Vår vision är ”Halland ­ – bästa livsplatsen” och med det menar vi att Halland ska bli den bästa platsen att bo på, utbilda sig, arbeta och driva företag i. Vi har kommit en bra bit på vägen, välkommen att följa med oss på vår resa! https://www.regionhalland.se/om-region-halland/\n\nSträvan efter jämställdhet, mångfald och likvärdiga villkor är både en kvalitetsfråga och en självklar del av Region Hallands värdegrund.\n\n\nRegion Halland krigsplacerar all tillsvidareanställd personal.\n\n\nTill bemannings- och rekryteringsföretag och till dig som är försäljare:\nVi undanber oss vänligt men bestämt direktkontakt med bemannings- och rekryteringsföretag samt försäljare av ytterligare jobbannonser. Region Halland har upphandlade avtal.",
        "conditions" : "Heltid/Deltid. Timanställning vid behov. Tillträde: Enligt överenskommelse.\r\nVisstidsanställning till ",
        "text" : "Om dig\nDu är en positiv person som är engagerad och bidrar med en god kamratanda för att skapa trivsel på arbetsplatsen.\r\n\r\nDu tar ansvar för ditt arbete och förstår att du är en del av en viktig helhet. I ditt arbete kan du komma att ha kontakt med patienter, anhöriga och vårdpersonal, därför är det viktigt att du är social, utåtriktad och har lätt för att kommunicera. Vi ser också att du har förmåga att vara flexibel och kan prioritera mellan arbetsuppgifter då det behövs.\n\nAv säkerhetsskäl måste du kunna förstå skriftliga instruktioner och kunna kommunicera med kollegor och övriga samarbetspartners, därför krävs mycket goda kunskaper i svenska, i såväl tal som skrift. Stor vikt läggs vid personlig lämplighet.\n\nDu som söker måste ha fyllt 18 år och vi ser gärna att du har erfarenhet av servicearbete som exempelvis städ.\n\nOm arbetet\nArbetsuppgifterna innefattar städning av mottagningar, administrativa lokaler och allmänna ytor på Kungsbacka sjukhus samt vårdcentraler inom Kungsbacka kommun. Vårdnära service innebär att ett team ansvarar för den vårdnära servicen på avdelningen. Serviceteamet samarbetar nära vårdpersonalen för att göra patientflödet så smidigt som möjligt och bidra till hög kvalitet på avdelningen. Arbetsuppgifterna för teamet kan bland annat innefatta ansvar för patientkök, städning och förrådshantering och innebär mycket samarbete, både inom teamet och med vårdpersonalen. Arbetet innefattar också kontakt med patienter och anhöriga, där serviceteamet stärker patientens upplevelse av kvalitet. Arbetet är främst schemalagt med tjänstgöring dagtid men kan variera mellan kl. 06.00-23.30. Helgtjänstgöring kan ingå. \n\nVarmt välkommen att skicka in din ansökan!\n\nUrval och intervjuer sker löpande under ansökningstiden, så skicka gärna in din ansökan så fort som möjligt.\n\nInför eventuell anställning måste utdrag ur belastningsregistret kunna uppvisas.\n\nOm Region Halland\n\n\nRegion Halland är till för alla som bor och arbetar här i Halland. Vi är över 8 000 medarbetare inom 370 olika yrken som alla arbetar för att erbjuda en god hälso- och sjukvård och att främja tillväxt och utveckling. Vi ansvarar också för kollektivtrafiken i Halland och driver frågor inom områden som näringsliv, kultur och utbildning. Vår vision är ”Halland ­ – bästa livsplatsen” och med det menar vi att Halland ska bli den bästa platsen att bo på, utbilda sig, arbeta och driva företag i. Vi har kommit en bra bit på vägen, välkommen att följa med oss på vår resa! https://www.regionhalland.se/om-region-halland/\n\nSträvan efter jämställdhet, mångfald och likvärdiga villkor är både en kvalitetsfråga och en självklar del av Region Hallands värdegrund.\n\n\nRegion Halland krigsplacerar all tillsvidareanställd personal.\n\n\nTill bemannings- och rekryteringsföretag och till dig som är försäljare:\nVi undanber oss vänligt men bestämt direktkontakt med bemannings- och rekryteringsföretag samt försäljare av ytterligare jobbannonser. Region Halland har upphandlade avtal."
      },
      "headline" : "Timvikarier sökes till Städ och Vårdnära service, Kungsbacka",
      "driving_license" : null,
      "employer" : {
        "email" : null,
        "phone_number" : null,
        "organization_number" : "2321000115",
        "name" : "REGION HALLAND",
        "url" : null,
        "workplace" : "Regionservice"
      },
      "removed_date" : null,
      "logo_url" : "https://www.arbetsformedlingen.se/rest/arbetsgivare/rest/af/v3/organisation/2321000115/logotyper/logo.png",
      "last_publication_date" : "2022-08-21T23:59:59",
      "number_of_vacancies" : 3,
      "occupation" : {
        "concept_id" : "dYo1_D8c_87U",
        "label" : "Städare/Lokalvårdare",
        "legacy_ams_taxonomy_id" : "464"
      },
      "occupation_group" : {
        "concept_id" : "Z6TY_xDf_Yup",
        "label" : "Städare",
        "legacy_ams_taxonomy_id" : "9111"
      },
      "employment_type" : {
        "concept_id" : "PFZr_Syz_cUq",
        "label" : "Vanlig anställning",
        "legacy_ams_taxonomy_id" : "1"
      },
      "webpage_url" : "https://arbetsformedlingen.se/platsbanken/annonser/26378955",
      "driving_license_required" : false,
      "application_contacts" : [ {
        "description" : "Ann-Sofie Olin Avdelningschef",
        "email" : null,
        "telephone" : "0766-976339",
        "name" : null,
        "contact_type" : null
      } ],
      "duration" : {
        "concept_id" : "qQUd_4qe_NDT",
        "label" : "6 månader eller längre",
        "legacy_ams_taxonomy_id" : "2"
      },
      "nice_to_have" : {
        "education_level" : [ ],
        "work_experiences" : [ ],
        "skills" : [ ],
        "education" : [ ],
        "languages" : [ ]
      },
      "application_details" : {
        "via_af" : false,
        "email" : null,
        "other" : null,
        "reference" : "2022/1055",
        "url" : "https://regionhalland.varbi.com/what:job/jobID:533203/type:job/where:1/apply:1",
        "information" : null
      },
      "source_type" : "VIA_PLATSBANKEN_DXA",
      "application_deadline" : "2022-08-21T23:59:59",
      "external_id" : "46-232100-0115-533203",
      "workplace_address" : {
        "coordinates" : [ 12.076193, 57.48749 ],
        "city" : null,
        "postcode" : null,
        "municipality" : "Kungsbacka",
        "region_concept_id" : "wjee_qH2_yb6",
        "region" : "Hallands län",
        "country_code" : "199",
        "region_code" : "13",
        "municipality_concept_id" : "3JKV_KSK_x6z",
        "country_concept_id" : "i46j_HmG_v64",
        "municipality_code" : "1384",
        "street_address" : null,
        "country" : "Sverige"
      },
      "id" : "26378955",
      "experience_required" : false,
      "working_hours_type" : {
        "concept_id" : "947z_JGS_Uk2",
        "label" : "Deltid",
        "legacy_ams_taxonomy_id" : "2"
      },
      "access" : null,
      "timestamp" : 1659624584230,
      "must_have" : {
        "education_level" : [ ],
        "work_experiences" : [ ],
        "skills" : [ ],
        "education" : [ ],
        "languages" : [ ]
      },
      "occupation_field" : {
        "concept_id" : "whao_Q6A_ScE",
        "label" : "Sanering och renhållning",
        "legacy_ams_taxonomy_id" : "12"
      },
      "scope_of_work" : {
        "min" : 0,
        "max" : 100
      },
      "salary_type" : {
        "concept_id" : "oG8G_9cW_nRf",
        "label" : "Fast månads- vecko- eller timlön",
        "legacy_ams_taxonomy_id" : "1"
      },
      "removed" : false,
      "salary_description" : "Timavlönad",
      "access_to_own_car" : false,
      "publication_date" : "2022-08-04T16:49:44"
    },
    "name" : "Timvikarier sökes till Städ och Vårdnära service, Kungsbacka",
    "user" : "kristof.fischer"
  },
  "sha1" : "e1d12e2766860982a56b8a9283acc04432bd051a",
  "annotations" : [ {
    "preferred-label" : "Kungsbacka",
    "type" : "municipality",
    "start-position" : 50,
    "end-position" : 60,
    "concept-id" : "3JKV_KSK_x6z",
    "matched-string" : "Kungsbacka",
    "annotation-id" : 5
  }, {
    "preferred-label" : "visa ansvarstagande",
    "sentiment" : "MUST_HAVE",
    "type" : "esco-skill",
    "start-position" : 188,
    "end-position" : 198,
    "concept-id" : "bcRp_hxV_f5G",
    "matched-string" : "tar ansvar",
    "annotation-id" : 6
  }, {
    "preferred-label" : "kommunikation",
    "sentiment" : "MUST_HAVE",
    "type" : "esco-skill",
    "start-position" : 408,
    "end-position" : 432,
    "concept-id" : "ahPU_HgE_Jeb",
    "matched-string" : "lätt för att kommunicera",
    "annotation-id" : 7
  }, {
    "preferred-label" : "prioritera uppgifter",
    "sentiment" : "MUST_HAVE",
    "type" : "esco-skill",
    "start-position" : 492,
    "end-position" : 525,
    "concept-id" : "j5rg_b5X_nBS",
    "matched-string" : "prioritera mellan arbetsuppgifter",
    "annotation-id" : 8
  }, {
    "preferred-label" : "Svenska",
    "sentiment" : "MUST_HAVE",
    "type" : "language",
    "start-position" : 708,
    "end-position" : 715,
    "concept-id" : "zSLA_vw2_FXN",
    "matched-string" : "svenska",
    "annotation-id" : 0
  }, {
    "preferred-label" : "ansvara för städning",
    "sentiment" : "MUST_HAVE",
    "type" : "esco-skill",
    "start-position" : 889,
    "end-position" : 893,
    "concept-id" : "2pc1_7xW_uYA",
    "matched-string" : "städ",
    "annotation-id" : 9
  }, {
    "preferred-label" : "Kungsbacka",
    "type" : "municipality",
    "start-position" : 1006,
    "end-position" : 1016,
    "concept-id" : "3JKV_KSK_x6z",
    "matched-string" : "Kungsbacka",
    "annotation-id" : 10
  }, {
    "preferred-label" : "Kungsbacka",
    "type" : "municipality",
    "start-position" : 1049,
    "end-position" : 1059,
    "concept-id" : "3JKV_KSK_x6z",
    "matched-string" : "Kungsbacka",
    "annotation-id" : 11
  }, {
    "preferred-label" : "ansvara för städning",
    "sentiment" : "MUST_HAVE",
    "type" : "esco-skill",
    "start-position" : 1374,
    "end-position" : 1382,
    "concept-id" : "2pc1_7xW_uYA",
    "matched-string" : "städning",
    "annotation-id" : 12
  }, {
    "preferred-label" : "Förrådshantering",
    "sentiment" : "MUST_HAVE",
    "type" : "skill",
    "start-position" : 1387,
    "end-position" : 1403,
    "concept-id" : "vvPg_scR_Pp6",
    "matched-string" : "förrådshantering",
    "annotation-id" : 1
  } ],
  "text" : "Timvikarier sökes till Städ och Vårdnära service, Kungsbacka\nOm dig\nDu är en positiv person som är engagerad och bidrar med en god kamratanda för att skapa trivsel på arbetsplatsen.\r\n\r\nDu tar ansvar för ditt arbete och förstår att du är en del av en viktig helhet. I ditt arbete kan du komma att ha kontakt med patienter, anhöriga och vårdpersonal, därför är det viktigt att du är social, utåtriktad och har lätt för att kommunicera. Vi ser också att du har förmåga att vara flexibel och kan prioritera mellan arbetsuppgifter då det behövs.\n\nAv säkerhetsskäl måste du kunna förstå skriftliga instruktioner och kunna kommunicera med kollegor och övriga samarbetspartners, därför krävs mycket goda kunskaper i svenska, i såväl tal som skrift. Stor vikt läggs vid personlig lämplighet.\n\nDu som söker måste ha fyllt 18 år och vi ser gärna att du har erfarenhet av servicearbete som exempelvis städ.\n\nOm arbetet\nArbetsuppgifterna innefattar städning av mottagningar, administrativa lokaler och allmänna ytor på Kungsbacka sjukhus samt vårdcentraler inom Kungsbacka kommun. Vårdnära service innebär att ett team ansvarar för den vårdnära servicen på avdelningen. Serviceteamet samarbetar nära vårdpersonalen för att göra patientflödet så smidigt som möjligt och bidra till hög kvalitet på avdelningen. Arbetsuppgifterna för teamet kan bland annat innefatta ansvar för patientkök, städning och förrådshantering och innebär mycket samarbete, både inom teamet och med vårdpersonalen. Arbetet innefattar också kontakt med patienter och anhöriga, där serviceteamet stärker patientens upplevelse av kvalitet. Arbetet är främst schemalagt med tjänstgöring dagtid men kan variera mellan kl. 06.00-23.30. Helgtjänstgöring kan ingå. \n\nVarmt välkommen att skicka in din ansökan!\n\nUrval och intervjuer sker löpande under ansökningstiden, så skicka gärna in din ansökan så fort som möjligt.\n\nInför eventuell anställning måste utdrag ur belastningsregistret kunna uppvisas.\n\nOm Region Halland\n\n\nRegion Halland är till för alla som bor och arbetar här i Halland. Vi är över 8 000 medarbetare inom 370 olika yrken som alla arbetar för att erbjuda en god hälso- och sjukvård och att främja tillväxt och utveckling. Vi ansvarar också för kollektivtrafiken i Halland och driver frågor inom områden som näringsliv, kultur och utbildning. Vår vision är ”Halland ­ – bästa livsplatsen” och med det menar vi att Halland ska bli den bästa platsen att bo på, utbilda sig, arbeta och driva företag i. Vi har kommit en bra bit på vägen, välkommen att följa med oss på vår resa! https://www.regionhalland.se/om-region-halland/\n\nSträvan efter jämställdhet, mångfald och likvärdiga villkor är både en kvalitetsfråga och en självklar del av Region Hallands värdegrund.\n\n\nRegion Halland krigsplacerar all tillsvidareanställd personal.\n\n\nTill bemannings- och rekryteringsföretag och till dig som är försäljare:\nVi undanber oss vänligt men bestämt direktkontakt med bemannings- och rekryteringsföretag samt försäljare av ytterligare jobbannonser. Region Halland har upphandlade avtal."
}