{
  "meta" : {
    "jobad" : {
      "description" : {
        "requirements" : null,
        "needs" : null,
        "company_information" : null,
        "text_formatted" : "Vill du leda, samordna och utveckla vårt flygsäkerhets- och kvalitetsarbete?\n\nOm tjänsten\nSom Flygsäkerhetskoordinator kommer du att arbeta med flygsäkerhetsfrågor. Du arbetar proaktivt med förbättringar för att minska risker för olyckor och tillbud. Som FSK spelar du en avgörande roll i det fortsatta arbetet.\nFlygsäkerhetskoordinatorn rapporterar direkt till verksamhetsansvarig (VA). Du har ett redovisningsansvar gentemot flygplatsens ledningsgrupp och har hela flygplatsorganisationen som sitt arbetsområde.\n\nTjänsten kräver att du godkänns i en säkerhetsprövning i enlighet med säkerhetsskyddslagen vilket innebär att vi genomför en säkerhetsprövning med tillhörande säkerhetsintervju. Det är viktigt att du kan visa upp intyg eller betyg 5 år tillbaka i tiden där det inte finns en lucka på mer än 28 dagar.\nTjänsten kräver även att du genomgår en kompetenskontroll hos Transportstyrelsen som efter godkänd kontroll utfärdar ett godkännande. Godkännandet är personligt och anges på flygplatsens driftcertifikat.\nInnan anställning genomgår du även en nyanställningskontroll på företagshälsovården. Vi behöver även utdrag ur belastningsregistret.\n\nI din roll som FSK kommer dina huvudsakliga arbetsuppgifter innebära:\n\n • Vara sammanhållande för, samt utveckla och underhålla säkerhets- och kvalitetsledningssystemet.\n • Ansvara för riskkälleidentifiering och riskanalys.\n • Sammanställa och rapportera analyserade flygsäkerhetsrelaterade data till VA.\n • Hålla säkerhetsrelaterad dokumentation uppdaterad\n • Regelbundet följa upp relevansen i, och vid behov revidera, nyckeltalen.\n • Ansvara för att flygsäkerhetsrelaterad utbildning finns tillgänglig och genomförs.\n • Vara rådgivande till flygplatsens ledning i flygsäkerhetsfrågor.\n • Följa upp att det genomförs säkerhetsarbete vid förändringar.\n • Initiera och delta i interna flygsäkerhetsrelaterade utredningar och ansvara för händelserapporteringssystemet.\n • Övervaka flygsäkerhetsnivån för flygplatsens operativa verksamhet.\n • Delge VA all flygsäkerhetsrelaterad information som krävs för att VA ska kunna fatta beslut.\n • Etablera, samordna och leda flygsäkerhetsgruppen samt andra förekommande forum.\n • Uppdaterar och kvalitetssäkrar flygplatsens AIP och NOTAM när det sker förändringar.\n • Övervaka att de för flygplatsen fastställda hinderytorna inte genomträngs av hinder.\n • Håller revisionsplan uppdaterad samt genomföra revisioner både internt och på externa verksamhetsutövare.\n • Regelbevakning av tillämpliga myndighetsföreskrifter, EU-förordningar och kommissionsbeslut.\n\nTjänsten som Flygsäkerhetskoordinator är en fastanställning med start enligt överenskommelse. Vi arbetar med löpande urval av sökande under ansökningstidens gång, det kan därför vara en fördel att söka tidigt.\n\nOm dig\nDu är självständig, noggrann och strukturerad samt har en god analytisk förmåga. Du har en väl utvecklad förmåga att se till helheten i arbetet och stimuleras av och ser utmaningar i förändringar. Du kommer att bidra till en ökad riskmedvetenhet och god säkerhetskultur.\n\nViktigt för tjänsten är:\n\n • Du har arbetat i en verksamhet där säkerhetsarbetet prioriterats.\n • Du har erfarenhet av arbete inom kvalitets-/säkerhetsledning, analys och utredningsarbete, eller har likvärdig erfarenhet\n • Erfarenhet från områden som krishantering, beredskap- och säkerhetsfrågor.\n • Mycket goda kunskaper i såväl svenska som engelska i tal och skrift\n • B-körkort.\n • Mycket goda IT-kunskaper\n • Administrativ förmåga\n • Meriterande om du har tidigare erfarenhet från flygverksamhet.\n • Meriterande om du har goda kunskaper i luftfartens lagstiftning och regelverk, grunderna för ett kvalitets- och säkerhetsledningssystem, kunskap om standarder och metoder för risk- och säkerhetsanalyser, erfarenhet av revisionsverksamhet.\n\nVi lägger stor vikt vid dina personliga egenskaper.\n\nOm Ängelholms Flygplats\nÄngelholms Flygplats AB ägs sedan 2021-09-01 av sju nordvästskånska kommuner. Vi erbjuder reguljärflyg till Stockholm, Sälen och Visby samt charterdestinationer. Verksamheten har ca 50 medarbetare. Affärsidén är att tillgodose behovet av kommunikationermed flyg till och från Ängelholm Helsingborg Airport för invånare, näringsliv och besökare och därigenom bidra till regionens utveckling och tillväxt.\nPå Ängelholms Flygplats jobbar vi målinriktad med miljö- och hållbarhetsfrågor i en spännande bransch i ständig förändring. Det är viktigt för oss att du delar våra kärnvärden personlig, pålitlig och nyskapande eftersom de är grundläggande för det vi gör.\n\nÄr du intresserad?\nVi samarbetar i denna rekrytering med Adecco, du skickar in din intresseanmälan via: www.adecco.se och lediga jobb. Vi behandlar intresseanmälningarna löpande under ansökningstiden och ber dig därför att skicka in dina dokument så snart som möjligt, dock senast den 04 september 2022.\nEventuella frågor besvara av Adeccos Rekryteringskonsult Rahma Mallek på mail rahma.mallek@adecco.se .\nVid frågor angående registrering på hemsidan kontakta vår Kandidatsupport på tel: 08-598 980 10.\n\nVälkommen med din ansökan!\n\nSökord\nFSK, Flygsäkerhetskoordinator, Aviation Safety Coordinator, Ängelholm, Ängelholms Flygplats, Flygplats, Säkerhet, Helsingborg, Skåne, Rekrytering, Adecco",
        "conditions" : "Heltid\r\nTillsvidare",
        "text" : "Vill du leda, samordna och utveckla vårt flygsäkerhets- och kvalitetsarbete?\n\nOm tjänsten\nSom Flygsäkerhetskoordinator kommer du att arbeta med flygsäkerhetsfrågor. Du arbetar proaktivt med förbättringar för att minska risker för olyckor och tillbud. Som FSK spelar du en avgörande roll i det fortsatta arbetet.\nFlygsäkerhetskoordinatorn rapporterar direkt till verksamhetsansvarig (VA). Du har ett redovisningsansvar gentemot flygplatsens ledningsgrupp och har hela flygplatsorganisationen som sitt arbetsområde.\n\nTjänsten kräver att du godkänns i en säkerhetsprövning i enlighet med säkerhetsskyddslagen vilket innebär att vi genomför en säkerhetsprövning med tillhörande säkerhetsintervju. Det är viktigt att du kan visa upp intyg eller betyg 5 år tillbaka i tiden där det inte finns en lucka på mer än 28 dagar.\nTjänsten kräver även att du genomgår en kompetenskontroll hos Transportstyrelsen som efter godkänd kontroll utfärdar ett godkännande. Godkännandet är personligt och anges på flygplatsens driftcertifikat.\nInnan anställning genomgår du även en nyanställningskontroll på företagshälsovården. Vi behöver även utdrag ur belastningsregistret.\n\nI din roll som FSK kommer dina huvudsakliga arbetsuppgifter innebära:\n\n • Vara sammanhållande för, samt utveckla och underhålla säkerhets- och kvalitetsledningssystemet.\n • Ansvara för riskkälleidentifiering och riskanalys.\n • Sammanställa och rapportera analyserade flygsäkerhetsrelaterade data till VA.\n • Hålla säkerhetsrelaterad dokumentation uppdaterad\n • Regelbundet följa upp relevansen i, och vid behov revidera, nyckeltalen.\n • Ansvara för att flygsäkerhetsrelaterad utbildning finns tillgänglig och genomförs.\n • Vara rådgivande till flygplatsens ledning i flygsäkerhetsfrågor.\n • Följa upp att det genomförs säkerhetsarbete vid förändringar.\n • Initiera och delta i interna flygsäkerhetsrelaterade utredningar och ansvara för händelserapporteringssystemet.\n • Övervaka flygsäkerhetsnivån för flygplatsens operativa verksamhet.\n • Delge VA all flygsäkerhetsrelaterad information som krävs för att VA ska kunna fatta beslut.\n • Etablera, samordna och leda flygsäkerhetsgruppen samt andra förekommande forum.\n • Uppdaterar och kvalitetssäkrar flygplatsens AIP och NOTAM när det sker förändringar.\n • Övervaka att de för flygplatsen fastställda hinderytorna inte genomträngs av hinder.\n • Håller revisionsplan uppdaterad samt genomföra revisioner både internt och på externa verksamhetsutövare.\n • Regelbevakning av tillämpliga myndighetsföreskrifter, EU-förordningar och kommissionsbeslut.\n\nTjänsten som Flygsäkerhetskoordinator är en fastanställning med start enligt överenskommelse. Vi arbetar med löpande urval av sökande under ansökningstidens gång, det kan därför vara en fördel att söka tidigt.\n\nOm dig\nDu är självständig, noggrann och strukturerad samt har en god analytisk förmåga. Du har en väl utvecklad förmåga att se till helheten i arbetet och stimuleras av och ser utmaningar i förändringar. Du kommer att bidra till en ökad riskmedvetenhet och god säkerhetskultur.\n\nViktigt för tjänsten är:\n\n • Du har arbetat i en verksamhet där säkerhetsarbetet prioriterats.\n • Du har erfarenhet av arbete inom kvalitets-/säkerhetsledning, analys och utredningsarbete, eller har likvärdig erfarenhet\n • Erfarenhet från områden som krishantering, beredskap- och säkerhetsfrågor.\n • Mycket goda kunskaper i såväl svenska som engelska i tal och skrift\n • B-körkort.\n • Mycket goda IT-kunskaper\n • Administrativ förmåga\n • Meriterande om du har tidigare erfarenhet från flygverksamhet.\n • Meriterande om du har goda kunskaper i luftfartens lagstiftning och regelverk, grunderna för ett kvalitets- och säkerhetsledningssystem, kunskap om standarder och metoder för risk- och säkerhetsanalyser, erfarenhet av revisionsverksamhet.\n\nVi lägger stor vikt vid dina personliga egenskaper.\n\nOm Ängelholms Flygplats\nÄngelholms Flygplats AB ägs sedan 2021-09-01 av sju nordvästskånska kommuner. Vi erbjuder reguljärflyg till Stockholm, Sälen och Visby samt charterdestinationer. Verksamheten har ca 50 medarbetare. Affärsidén är att tillgodose behovet av kommunikationermed flyg till och från Ängelholm Helsingborg Airport för invånare, näringsliv och besökare och därigenom bidra till regionens utveckling och tillväxt.\nPå Ängelholms Flygplats jobbar vi målinriktad med miljö- och hållbarhetsfrågor i en spännande bransch i ständig förändring. Det är viktigt för oss att du delar våra kärnvärden personlig, pålitlig och nyskapande eftersom de är grundläggande för det vi gör.\n\nÄr du intresserad?\nVi samarbetar i denna rekrytering med Adecco, du skickar in din intresseanmälan via: www.adecco.se och lediga jobb. Vi behandlar intresseanmälningarna löpande under ansökningstiden och ber dig därför att skicka in dina dokument så snart som möjligt, dock senast den 04 september 2022.\nEventuella frågor besvara av Adeccos Rekryteringskonsult Rahma Mallek på mail rahma.mallek@adecco.se .\nVid frågor angående registrering på hemsidan kontakta vår Kandidatsupport på tel: 08-598 980 10.\n\nVälkommen med din ansökan!\n\nSökord\nFSK, Flygsäkerhetskoordinator, Aviation Safety Coordinator, Ängelholm, Ängelholms Flygplats, Flygplats, Säkerhet, Helsingborg, Skåne, Rekrytering, Adecco"
      },
      "headline" : "Flygsäkerhetskoordinator till Ängelholms Flygplats",
      "driving_license" : null,
      "employer" : {
        "email" : null,
        "phone_number" : null,
        "organization_number" : "5564472677",
        "name" : "Adecco Sweden AB",
        "url" : "http://www.adecco.se/",
        "workplace" : "Adecco Sweden AB"
      },
      "removed_date" : null,
      "logo_url" : "https://www.arbetsformedlingen.se/rest/arbetsgivare/rest/af/v3/organisation/5564472677/logotyper/logo.png",
      "last_publication_date" : "2022-09-04T23:59:59",
      "number_of_vacancies" : 1,
      "occupation" : {
        "concept_id" : "JPBx_Vxc_zWM",
        "label" : "Säkerhetsadministratör, IT",
        "legacy_ams_taxonomy_id" : "2718"
      },
      "occupation_group" : {
        "concept_id" : "BAeH_eg8_T2d",
        "label" : "IT-säkerhetsspecialister",
        "legacy_ams_taxonomy_id" : "2516"
      },
      "employment_type" : {
        "concept_id" : "PFZr_Syz_cUq",
        "label" : "Vanlig anställning",
        "legacy_ams_taxonomy_id" : "1"
      },
      "webpage_url" : "https://arbetsformedlingen.se/platsbanken/annonser/26383119",
      "driving_license_required" : false,
      "application_contacts" : [ {
        "description" : "Rahma Mallek",
        "email" : null,
        "telephone" : null,
        "name" : null,
        "contact_type" : "Talent Agent"
      } ],
      "duration" : {
        "concept_id" : "a7uU_j21_mkL",
        "label" : "Tills vidare",
        "legacy_ams_taxonomy_id" : "1"
      },
      "nice_to_have" : {
        "education_level" : [ ],
        "work_experiences" : [ ],
        "skills" : [ ],
        "education" : [ ],
        "languages" : [ ]
      },
      "application_details" : {
        "via_af" : false,
        "email" : null,
        "other" : null,
        "reference" : "ref-38813",
        "url" : "https://www.adecco.se/ansok?zlid=5B825DBF-4D4D-4AA3-830A-FF1BAEAED673&src=AMS",
        "information" : null
      },
      "source_type" : "VIA_PLATSBANKEN_DXA",
      "application_deadline" : "2022-09-04T23:59:59",
      "external_id" : "46-556447-2677-00000387965B825DBF",
      "workplace_address" : {
        "coordinates" : [ 12.863881, 56.245747 ],
        "city" : null,
        "postcode" : null,
        "municipality" : "Ängelholm",
        "region_concept_id" : "CaRE_1nn_cSU",
        "region" : "Skåne län",
        "country_code" : "199",
        "region_code" : "12",
        "municipality_concept_id" : "pCuv_P5A_9oh",
        "country_concept_id" : "i46j_HmG_v64",
        "municipality_code" : "1292",
        "street_address" : null,
        "country" : "Sverige"
      },
      "id" : "26383119",
      "experience_required" : true,
      "working_hours_type" : {
        "concept_id" : "6YE1_gAC_R2G",
        "label" : "Heltid",
        "legacy_ams_taxonomy_id" : "1"
      },
      "access" : null,
      "timestamp" : 1659909615377,
      "must_have" : {
        "education_level" : [ ],
        "work_experiences" : [ {
          "concept_id" : "JPBx_Vxc_zWM",
          "weight" : 10,
          "label" : "Säkerhetsadministratör, IT",
          "legacy_ams_taxonomy_id" : "2718"
        } ],
        "skills" : [ ],
        "education" : [ ],
        "languages" : [ ]
      },
      "occupation_field" : {
        "concept_id" : "apaJ_2ja_LuF",
        "label" : "Data/IT",
        "legacy_ams_taxonomy_id" : "3"
      },
      "scope_of_work" : {
        "min" : 100,
        "max" : 100
      },
      "salary_type" : {
        "concept_id" : "oG8G_9cW_nRf",
        "label" : "Fast månads- vecko- eller timlön",
        "legacy_ams_taxonomy_id" : "1"
      },
      "removed" : false,
      "salary_description" : "Fast lön",
      "access_to_own_car" : false,
      "publication_date" : "2022-08-08T00:00:15"
    },
    "name" : "Flygsäkerhetskoordinator till Ängelholms Flygplats",
    "user" : "kristof.fischer"
  },
  "sha1" : "62dfb33ea344fe3c12597a63a6fe7ebc68f4e7fb",
  "annotations" : [ {
    "preferred-label" : "Säkerhetsadministratör, IT",
    "type" : "occupation-name",
    "start-position" : 0,
    "end-position" : 24,
    "concept-id" : "JPBx_Vxc_zWM",
    "matched-string" : "Flygsäkerhetskoordinator",
    "annotation-id" : 9
  }, {
    "preferred-label" : "Ängelholm",
    "type" : "municipality",
    "start-position" : 30,
    "end-position" : 40,
    "concept-id" : "pCuv_P5A_9oh",
    "matched-string" : "Ängelholms",
    "annotation-id" : 8
  }, {
    "preferred-label" : "Säkerhetsadministratör, IT",
    "type" : "occupation-name",
    "start-position" : 145,
    "end-position" : 169,
    "concept-id" : "JPBx_Vxc_zWM",
    "matched-string" : "Flygsäkerhetskoordinator",
    "annotation-id" : 10
  }, {
    "preferred-label" : "Redovisningsansvar",
    "sentiment" : "MUST_HAVE",
    "type" : "skill",
    "start-position" : 450,
    "end-position" : 468,
    "concept-id" : "U2Vq_X6J_y3o",
    "matched-string" : "redovisningsansvar",
    "annotation-id" : 0
  }, {
    "preferred-label" : "Säkerhetsadministratör, IT",
    "type" : "occupation-name",
    "start-position" : 1220,
    "end-position" : 1223,
    "concept-id" : "JPBx_Vxc_zWM",
    "matched-string" : "FSK",
    "annotation-id" : 11
  }, {
    "preferred-label" : "Säkerhetsadministratör, IT",
    "type" : "occupation-name",
    "start-position" : 2617,
    "end-position" : 2641,
    "concept-id" : "JPBx_Vxc_zWM",
    "matched-string" : "Flygsäkerhetskoordinator",
    "annotation-id" : 12
  }, {
    "preferred-label" : "arbeta självständigt",
    "sentiment" : "MUST_HAVE",
    "type" : "esco-skill",
    "start-position" : 2828,
    "end-position" : 2840,
    "concept-id" : "NyFu_HHd_zhz",
    "matched-string" : "självständig",
    "annotation-id" : 13
  }, {
    "preferred-label" : "noggrannhet",
    "sentiment" : "MUST_HAVE",
    "type" : "esco-skill",
    "start-position" : 2842,
    "end-position" : 2850,
    "concept-id" : "mrsW_EkL_KRD",
    "matched-string" : "noggrann",
    "annotation-id" : 14
  }, {
    "preferred-label" : "tänka analytiskt",
    "sentiment" : "MUST_HAVE",
    "type" : "esco-skill",
    "start-position" : 2884,
    "end-position" : 2893,
    "concept-id" : "osu5_TsT_qGo",
    "matched-string" : "analytisk",
    "annotation-id" : 15
  }, {
    "preferred-label" : "Säkerhetsfrågor",
    "sentiment" : "MUST_HAVE",
    "type" : "skill",
    "start-position" : 3158,
    "end-position" : 3174,
    "concept-id" : "nu52_VXq_5MD",
    "matched-string" : "säkerhetsarbetet",
    "annotation-id" : 16
  }, {
    "preferred-label" : "Kvalitetssäkring",
    "sentiment" : "MUST_HAVE",
    "type" : "skill",
    "start-position" : 3225,
    "end-position" : 3234,
    "concept-id" : "a1Sf_mey_gVk",
    "matched-string" : "kvalitets",
    "annotation-id" : 19
  }, {
    "preferred-label" : "arbeta med säkerhetsledning",
    "sentiment" : "MUST_HAVE",
    "type" : "esco-skill",
    "start-position" : 3236,
    "end-position" : 3252,
    "concept-id" : "spqi_N3e_Rwn",
    "matched-string" : "säkerhetsledning",
    "annotation-id" : 17
  }, {
    "preferred-label" : "Utredningsvana",
    "sentiment" : "MUST_HAVE",
    "type" : "skill",
    "start-position" : 3265,
    "end-position" : 3281,
    "concept-id" : "QAaJ_QeY_Q6P",
    "matched-string" : "utredningsarbete",
    "annotation-id" : 18
  }, {
    "preferred-label" : "krishantering",
    "sentiment" : "MUST_HAVE",
    "type" : "esco-skill",
    "start-position" : 3345,
    "end-position" : 3358,
    "concept-id" : "RbE7_Nxx_S4Y",
    "matched-string" : "krishantering",
    "annotation-id" : 20
  }, {
    "preferred-label" : "Säkerhetsfrågor",
    "sentiment" : "MUST_HAVE",
    "type" : "skill",
    "start-position" : 3360,
    "end-position" : 3390,
    "concept-id" : "nu52_VXq_5MD",
    "matched-string" : "beredskap- och säkerhetsfrågor",
    "annotation-id" : 21
  }, {
    "preferred-label" : "Svenska",
    "sentiment" : "MUST_HAVE",
    "type" : "language",
    "start-position" : 3425,
    "end-position" : 3432,
    "concept-id" : "zSLA_vw2_FXN",
    "matched-string" : "svenska",
    "annotation-id" : 4
  }, {
    "preferred-label" : "Engelska",
    "sentiment" : "MUST_HAVE",
    "type" : "keyword",
    "start-position" : 3437,
    "end-position" : 3445,
    "concept-id" : "xiD7_snJ_D8x",
    "matched-string" : "engelska",
    "annotation-id" : 5
  }, {
    "preferred-label" : "B",
    "sentiment" : "MUST_HAVE",
    "type" : "driving-licence",
    "start-position" : 3466,
    "end-position" : 3475,
    "concept-id" : "VTK8_WRx_GcM",
    "matched-string" : "B-körkort",
    "annotation-id" : 22
  }, {
    "preferred-label" : "använda dator",
    "sentiment" : "MUST_HAVE",
    "type" : "esco-skill",
    "start-position" : 3492,
    "end-position" : 3504,
    "concept-id" : "HEbR_xrb_MpT",
    "matched-string" : "IT-kunskaper",
    "annotation-id" : 23
  }, {
    "preferred-label" : null,
    "sentiment" : "MUST_HAVE",
    "type" : "skill",
    "start-position" : 3508,
    "end-position" : 3529,
    "concept-id" : null,
    "matched-string" : "Administrativ förmåga",
    "annotation-id" : 24
  }, {
    "preferred-label" : null,
    "sentiment" : "NICE_TO_HAVE",
    "type" : "skill",
    "start-position" : 3564,
    "end-position" : 3594,
    "concept-id" : null,
    "matched-string" : "erfarenhet från flygverksamhet",
    "annotation-id" : 25
  }, {
    "preferred-label" : "lagstiftning för luftfart",
    "sentiment" : "NICE_TO_HAVE",
    "type" : "esco-skill",
    "start-position" : 3638,
    "end-position" : 3676,
    "concept-id" : "3Px8_vRo_xF8",
    "matched-string" : "luftfartens lagstiftning och regelverk",
    "annotation-id" : 26
  }, {
    "preferred-label" : "komponenter i ett säkerhetsledningssystem",
    "sentiment" : "NICE_TO_HAVE",
    "type" : "esco-skill",
    "start-position" : 3678,
    "end-position" : 3734,
    "concept-id" : "RXvz_2Vv_XFs",
    "matched-string" : "grunderna för ett kvalitets- och säkerhetsledningssystem",
    "annotation-id" : 27
  }, {
    "preferred-label" : "Säkerhetsanalys, datasäkerhet",
    "sentiment" : "NICE_TO_HAVE",
    "type" : "skill",
    "start-position" : 3747,
    "end-position" : 3801,
    "concept-id" : "mPE9_cBb_5ua",
    "matched-string" : "standarder och metoder för risk- och säkerhetsanalyser",
    "annotation-id" : 28
  }, {
    "preferred-label" : "Revision",
    "sentiment" : "NICE_TO_HAVE",
    "type" : "skill",
    "start-position" : 3817,
    "end-position" : 3836,
    "concept-id" : "hVq9_mTt_xkv",
    "matched-string" : "revisionsverksamhet",
    "annotation-id" : 29
  }, {
    "preferred-label" : "Ängelholm",
    "type" : "municipality",
    "start-position" : 3895,
    "end-position" : 3905,
    "concept-id" : "pCuv_P5A_9oh",
    "matched-string" : "Ängelholms",
    "annotation-id" : 30
  }, {
    "preferred-label" : "Ängelholm",
    "type" : "municipality",
    "start-position" : 3916,
    "end-position" : 3926,
    "concept-id" : "pCuv_P5A_9oh",
    "matched-string" : "Ängelholms",
    "annotation-id" : 33
  }, {
    "preferred-label" : "Stockholm",
    "type" : "municipality",
    "start-position" : 4024,
    "end-position" : 4033,
    "concept-id" : "AvNB_uwa_6n6",
    "matched-string" : "Stockholm",
    "annotation-id" : 31
  }, {
    "preferred-label" : "Malung-Sälen",
    "type" : "municipality",
    "start-position" : 4035,
    "end-position" : 4040,
    "concept-id" : "FPCd_poj_3tq",
    "matched-string" : "Sälen",
    "annotation-id" : 32
  }, {
    "preferred-label" : "Ängelholm",
    "type" : "municipality",
    "start-position" : 4192,
    "end-position" : 4201,
    "concept-id" : "pCuv_P5A_9oh",
    "matched-string" : "Ängelholm",
    "annotation-id" : 34
  }, {
    "preferred-label" : "Helsingborg",
    "type" : "municipality",
    "start-position" : 4202,
    "end-position" : 4213,
    "concept-id" : "qj3q_oXH_MGR",
    "matched-string" : "Helsingborg",
    "annotation-id" : 35
  }, {
    "preferred-label" : "Ängelholm",
    "type" : "municipality",
    "start-position" : 4323,
    "end-position" : 4333,
    "concept-id" : "pCuv_P5A_9oh",
    "matched-string" : "Ängelholms",
    "annotation-id" : 36
  } ],
  "text" : "Flygsäkerhetskoordinator till Ängelholms Flygplats\nVill du leda, samordna och utveckla vårt flygsäkerhets- och kvalitetsarbete?\n\nOm tjänsten\nSom Flygsäkerhetskoordinator kommer du att arbeta med flygsäkerhetsfrågor. Du arbetar proaktivt med förbättringar för att minska risker för olyckor och tillbud. Som FSK spelar du en avgörande roll i det fortsatta arbetet.\nFlygsäkerhetskoordinatorn rapporterar direkt till verksamhetsansvarig (VA). Du har ett redovisningsansvar gentemot flygplatsens ledningsgrupp och har hela flygplatsorganisationen som sitt arbetsområde.\n\nTjänsten kräver att du godkänns i en säkerhetsprövning i enlighet med säkerhetsskyddslagen vilket innebär att vi genomför en säkerhetsprövning med tillhörande säkerhetsintervju. Det är viktigt att du kan visa upp intyg eller betyg 5 år tillbaka i tiden där det inte finns en lucka på mer än 28 dagar.\nTjänsten kräver även att du genomgår en kompetenskontroll hos Transportstyrelsen som efter godkänd kontroll utfärdar ett godkännande. Godkännandet är personligt och anges på flygplatsens driftcertifikat.\nInnan anställning genomgår du även en nyanställningskontroll på företagshälsovården. Vi behöver även utdrag ur belastningsregistret.\n\nI din roll som FSK kommer dina huvudsakliga arbetsuppgifter innebära:\n\n • Vara sammanhållande för, samt utveckla och underhålla säkerhets- och kvalitetsledningssystemet.\n • Ansvara för riskkälleidentifiering och riskanalys.\n • Sammanställa och rapportera analyserade flygsäkerhetsrelaterade data till VA.\n • Hålla säkerhetsrelaterad dokumentation uppdaterad\n • Regelbundet följa upp relevansen i, och vid behov revidera, nyckeltalen.\n • Ansvara för att flygsäkerhetsrelaterad utbildning finns tillgänglig och genomförs.\n • Vara rådgivande till flygplatsens ledning i flygsäkerhetsfrågor.\n • Följa upp att det genomförs säkerhetsarbete vid förändringar.\n • Initiera och delta i interna flygsäkerhetsrelaterade utredningar och ansvara för händelserapporteringssystemet.\n • Övervaka flygsäkerhetsnivån för flygplatsens operativa verksamhet.\n • Delge VA all flygsäkerhetsrelaterad information som krävs för att VA ska kunna fatta beslut.\n • Etablera, samordna och leda flygsäkerhetsgruppen samt andra förekommande forum.\n • Uppdaterar och kvalitetssäkrar flygplatsens AIP och NOTAM när det sker förändringar.\n • Övervaka att de för flygplatsen fastställda hinderytorna inte genomträngs av hinder.\n • Håller revisionsplan uppdaterad samt genomföra revisioner både internt och på externa verksamhetsutövare.\n • Regelbevakning av tillämpliga myndighetsföreskrifter, EU-förordningar och kommissionsbeslut.\n\nTjänsten som Flygsäkerhetskoordinator är en fastanställning med start enligt överenskommelse. Vi arbetar med löpande urval av sökande under ansökningstidens gång, det kan därför vara en fördel att söka tidigt.\n\nOm dig\nDu är självständig, noggrann och strukturerad samt har en god analytisk förmåga. Du har en väl utvecklad förmåga att se till helheten i arbetet och stimuleras av och ser utmaningar i förändringar. Du kommer att bidra till en ökad riskmedvetenhet och god säkerhetskultur.\n\nViktigt för tjänsten är:\n\n • Du har arbetat i en verksamhet där säkerhetsarbetet prioriterats.\n • Du har erfarenhet av arbete inom kvalitets-/säkerhetsledning, analys och utredningsarbete, eller har likvärdig erfarenhet\n • Erfarenhet från områden som krishantering, beredskap- och säkerhetsfrågor.\n • Mycket goda kunskaper i såväl svenska som engelska i tal och skrift\n • B-körkort.\n • Mycket goda IT-kunskaper\n • Administrativ förmåga\n • Meriterande om du har tidigare erfarenhet från flygverksamhet.\n • Meriterande om du har goda kunskaper i luftfartens lagstiftning och regelverk, grunderna för ett kvalitets- och säkerhetsledningssystem, kunskap om standarder och metoder för risk- och säkerhetsanalyser, erfarenhet av revisionsverksamhet.\n\nVi lägger stor vikt vid dina personliga egenskaper.\n\nOm Ängelholms Flygplats\nÄngelholms Flygplats AB ägs sedan 2021-09-01 av sju nordvästskånska kommuner. Vi erbjuder reguljärflyg till Stockholm, Sälen och Visby samt charterdestinationer. Verksamheten har ca 50 medarbetare. Affärsidén är att tillgodose behovet av kommunikationermed flyg till och från Ängelholm Helsingborg Airport för invånare, näringsliv och besökare och därigenom bidra till regionens utveckling och tillväxt.\nPå Ängelholms Flygplats jobbar vi målinriktad med miljö- och hållbarhetsfrågor i en spännande bransch i ständig förändring. Det är viktigt för oss att du delar våra kärnvärden personlig, pålitlig och nyskapande eftersom de är grundläggande för det vi gör.\n\nÄr du intresserad?\nVi samarbetar i denna rekrytering med Adecco, du skickar in din intresseanmälan via: www.adecco.se och lediga jobb. Vi behandlar intresseanmälningarna löpande under ansökningstiden och ber dig därför att skicka in dina dokument så snart som möjligt, dock senast den 04 september 2022.\nEventuella frågor besvara av Adeccos Rekryteringskonsult Rahma Mallek på mail rahma.mallek@adecco.se .\nVid frågor angående registrering på hemsidan kontakta vår Kandidatsupport på tel: 08-598 980 10.\n\nVälkommen med din ansökan!\n\nSökord\nFSK, Flygsäkerhetskoordinator, Aviation Safety Coordinator, Ängelholm, Ängelholms Flygplats, Flygplats, Säkerhet, Helsingborg, Skåne, Rekrytering, Adecco"
}