{
  "meta" : {
    "jobad" : {
      "description" : {
        "requirements" : null,
        "needs" : null,
        "company_information" : null,
        "text_formatted" : "Vi söker en säljare med passion för innovativ teknik för att representera Dyson i Malmö. Som Dyson Expert kommer du jobba tätt ihop med ett team stylister som också kommer vara specialister på produkterna. Ni kommer tillsammans att leverera spännande demonstrationer och stylingar till kunder, med fokus på den nya hårtorken, Airwrap stylern och grundläggande kunskap om Dysons övriga produkter.\n\nOm Dyson\n\nDysons nordiska huvudkontor ligger i Stockholm. Idag säljs Dysons produkter i 65 länder. Dyson har vuxit från en man med en idé till ett världsomspännande teknikföretag med över 1 000 ingenjörer. Men den står inte still. I hjärtat av företaget finns ett ständigt växande team av ingenjörer och forskare. Fler idéer. Fler uppfinningar. Läs mer på: www.dyson.se\n\nArbetsområden\n\n- Var kundorienterad och alltid ge kundservice utöver det vanliga.\n\n- Fånga konsumenternas uppmärksamhet och inspirera kunderna att prova dysons produkter.\n\n- Håll ordning och reda runt Dysons monter.\n- Fyll på sortiment och hjälp till med de dagliga sysslorna.\n\n\nVi förväntar oss\n\n- Erfarenhet från detaljhandel och servicebranschen gärna inom hemelektronik.\n- Du har ett högt driv och kan balansera din förmåga att både vara en lagspelare, samt arbeta självständigt.\n- Du är social, professionell och skapar snabbt goda relationer med dina kollegor och kunder.\n- Du behärskar svenska och engelska flytande i tal och skrift\n\n\nVi erbjuder en glad och energisk arbetsplats där du blir en del av ett team av härliga kollegor som alltid är villiga att hjälpa till och ge support. Vi står för en utbildning i produktkunskap i samband med start.\n\nVi erbjuder dig\n\n- En plats i ett fantastiskt team\n- Sjukförsäkring och ett tryggt avtal\n- Löpande coachning\n\n\nÖvrigt\nI denna tjänst kommer du att vara anställd av Nordic Retail Group. Innan ditt första pass behöver du gå en produktutbildning med Dyson.\n\nVar: Jobbet är placerat i Emporia Köpcentrum och utförs i Dysons monter.\nArbetstider: Tjänsten kräver arbetsdagar uppdelade på vardagar, lördagar och söndagar\nAnställning: kontrakt på 50-75%\n\nTjänsten beräknas tillsättas omgående så intervjuer sker löpande så ansök så snart som möjligt. Detta är ett projektuppdrag på åtta månader. Det finns stor chans till fast anställning.\n\nFrågor (ej ansökningar) om tjänsten kan ställas till Adiam Araya på: araya@nordicretailgroup.com\n\nOm Nordic Retail Group\n\nNordic Retail Group är en fullservice retail byrå, som grundades 1997 och finns idag lokalt representerade i alla fyra nordiska länder. Vi fokuserar på att hjälpa våra kunder att bygga sina varumärken och nå sina mål genom att erbjuda bemanning, rekrytering, creative studio, och andra innovativa uppfinningar för våra kunder. Vi har byggt ett starkt team och vi vet vad som krävs för ett varumärke att lyckas inom retail och hur man ökar försäljning både lokalt och globalt.\n\nPå Nordic Retail Group har vi ett arbetsklimat som är kreativt och energiskt och vi är alltid ivriga att göra det lilla extra för att lyckas. Vi har verkligen passion för människor och det är därför det är viktigt för oss att erbjuda den mest säkra, inkluderande och inspirerande arbetsplatsen vi kan för våra fantastiska medarbetare.\n\nVi värdesätter högt att ha ett mångsidigt team med olika typer av erfarenheter och bakgrunder som ingår i gruppen. Det är viktigt för oss att alla känner sig värderade, uppskattade och som en viktig del av vårt team. Det viktigaste är att vi vill att vår personal ska älska att komma till jobbet. Som våra grundare alltid säger: “Du ska inte bara vissla på väg hem från kontoret - utan också på väg till kontoret”.\n\nBesök vår hemsida www.nordicretailgroup.com (http://www.nordicretailgroup.com/) för mer information.",
        "conditions" : "Deltid\r\nAnställning enligt överenskommelse ",
        "text" : "Vi söker en säljare med passion för innovativ teknik för att representera Dyson i Malmö. Som Dyson Expert kommer du jobba tätt ihop med ett team stylister som också kommer vara specialister på produkterna. Ni kommer tillsammans att leverera spännande demonstrationer och stylingar till kunder, med fokus på den nya hårtorken, Airwrap stylern och grundläggande kunskap om Dysons övriga produkter.\n\nOm Dyson\n\nDysons nordiska huvudkontor ligger i Stockholm. Idag säljs Dysons produkter i 65 länder. Dyson har vuxit från en man med en idé till ett världsomspännande teknikföretag med över 1 000 ingenjörer. Men den står inte still. I hjärtat av företaget finns ett ständigt växande team av ingenjörer och forskare. Fler idéer. Fler uppfinningar. Läs mer på: www.dyson.se\n\nArbetsområden\n\n- Var kundorienterad och alltid ge kundservice utöver det vanliga.\n\n- Fånga konsumenternas uppmärksamhet och inspirera kunderna att prova dysons produkter.\n\n- Håll ordning och reda runt Dysons monter.\n- Fyll på sortiment och hjälp till med de dagliga sysslorna.\n\n\nVi förväntar oss\n\n- Erfarenhet från detaljhandel och servicebranschen gärna inom hemelektronik.\n- Du har ett högt driv och kan balansera din förmåga att både vara en lagspelare, samt arbeta självständigt.\n- Du är social, professionell och skapar snabbt goda relationer med dina kollegor och kunder.\n- Du behärskar svenska och engelska flytande i tal och skrift\n\n\nVi erbjuder en glad och energisk arbetsplats där du blir en del av ett team av härliga kollegor som alltid är villiga att hjälpa till och ge support. Vi står för en utbildning i produktkunskap i samband med start.\n\nVi erbjuder dig\n\n- En plats i ett fantastiskt team\n- Sjukförsäkring och ett tryggt avtal\n- Löpande coachning\n\n\nÖvrigt\nI denna tjänst kommer du att vara anställd av Nordic Retail Group. Innan ditt första pass behöver du gå en produktutbildning med Dyson.\n\nVar: Jobbet är placerat i Emporia Köpcentrum och utförs i Dysons monter.\nArbetstider: Tjänsten kräver arbetsdagar uppdelade på vardagar, lördagar och söndagar\nAnställning: kontrakt på 50-75%\n\nTjänsten beräknas tillsättas omgående så intervjuer sker löpande så ansök så snart som möjligt. Detta är ett projektuppdrag på åtta månader. Det finns stor chans till fast anställning.\n\nFrågor (ej ansökningar) om tjänsten kan ställas till Adiam Araya på: araya@nordicretailgroup.com\n\nOm Nordic Retail Group\n\nNordic Retail Group är en fullservice retail byrå, som grundades 1997 och finns idag lokalt representerade i alla fyra nordiska länder. Vi fokuserar på att hjälpa våra kunder att bygga sina varumärken och nå sina mål genom att erbjuda bemanning, rekrytering, creative studio, och andra innovativa uppfinningar för våra kunder. Vi har byggt ett starkt team och vi vet vad som krävs för ett varumärke att lyckas inom retail och hur man ökar försäljning både lokalt och globalt.\n\nPå Nordic Retail Group har vi ett arbetsklimat som är kreativt och energiskt och vi är alltid ivriga att göra det lilla extra för att lyckas. Vi har verkligen passion för människor och det är därför det är viktigt för oss att erbjuda den mest säkra, inkluderande och inspirerande arbetsplatsen vi kan för våra fantastiska medarbetare.\n\nVi värdesätter högt att ha ett mångsidigt team med olika typer av erfarenheter och bakgrunder som ingår i gruppen. Det är viktigt för oss att alla känner sig värderade, uppskattade och som en viktig del av vårt team. Det viktigaste är att vi vill att vår personal ska älska att komma till jobbet. Som våra grundare alltid säger: “Du ska inte bara vissla på väg hem från kontoret - utan också på väg till kontoret”.\n\nBesök vår hemsida www.nordicretailgroup.com (http://www.nordicretailgroup.com/) för mer information."
      },
      "headline" : "Butikssäljare till Dyson Emporia - Malmö",
      "driving_license" : null,
      "employer" : {
        "email" : null,
        "phone_number" : null,
        "organization_number" : "5566119474",
        "name" : "NRG Sweden AB",
        "url" : "http://nordicretailgroup.com/",
        "workplace" : "Nordic Retail Group "
      },
      "removed_date" : null,
      "logo_url" : null,
      "last_publication_date" : "2023-01-01T23:59:59",
      "number_of_vacancies" : 1,
      "occupation" : {
        "concept_id" : "ek9W_CmD_y2M",
        "label" : "Butikssäljare, fackhandel",
        "legacy_ams_taxonomy_id" : "5357"
      },
      "occupation_group" : {
        "concept_id" : "YKL2_FCB_1yr",
        "label" : "Butikssäljare, fackhandel",
        "legacy_ams_taxonomy_id" : "5223"
      },
      "employment_type" : {
        "concept_id" : "PFZr_Syz_cUq",
        "label" : "Vanlig anställning",
        "legacy_ams_taxonomy_id" : "1"
      },
      "webpage_url" : "https://arbetsformedlingen.se/platsbanken/annonser/26331817",
      "driving_license_required" : false,
      "application_contacts" : [ {
        "description" : "Lovisa Tengnér",
        "email" : "tengner@nordicretailgroup.com",
        "telephone" : null,
        "name" : null,
        "contact_type" : null
      } ],
      "duration" : {
        "concept_id" : "qQUd_4qe_NDT",
        "label" : "6 månader eller längre",
        "legacy_ams_taxonomy_id" : "2"
      },
      "nice_to_have" : {
        "education_level" : [ ],
        "work_experiences" : [ ],
        "skills" : [ ],
        "education" : [ ],
        "languages" : [ ]
      },
      "application_details" : {
        "via_af" : false,
        "email" : null,
        "other" : null,
        "reference" : null,
        "url" : "https://career.nordicretailgroup.com/jobs/1782579-butikssaljare-till-dyson-emporia-malmo?promotion=414450-arbetsformedlingen",
        "information" : null
      },
      "source_type" : "VIA_PLATSBANKEN_DXA",
      "application_deadline" : "2023-01-01T23:59:59",
      "external_id" : "46-556611-9474-1782579-12",
      "workplace_address" : {
        "coordinates" : [ 13.003822, 55.60498 ],
        "city" : null,
        "postcode" : null,
        "municipality" : "Malmö",
        "region_concept_id" : "CaRE_1nn_cSU",
        "region" : "Skåne län",
        "country_code" : "199",
        "region_code" : "12",
        "municipality_concept_id" : "oYPt_yRA_Smm",
        "country_concept_id" : "i46j_HmG_v64",
        "municipality_code" : "1280",
        "street_address" : null,
        "country" : "Sverige"
      },
      "id" : "26331817",
      "experience_required" : true,
      "working_hours_type" : {
        "concept_id" : "947z_JGS_Uk2",
        "label" : "Deltid",
        "legacy_ams_taxonomy_id" : "2"
      },
      "access" : null,
      "timestamp" : 1657889129878,
      "must_have" : {
        "education_level" : [ ],
        "work_experiences" : [ {
          "concept_id" : "ek9W_CmD_y2M",
          "weight" : 10,
          "label" : "Butikssäljare, fackhandel",
          "legacy_ams_taxonomy_id" : "5357"
        } ],
        "skills" : [ ],
        "education" : [ ],
        "languages" : [ ]
      },
      "occupation_field" : {
        "concept_id" : "RPTn_bxG_ExZ",
        "label" : "Försäljning, inköp, marknadsföring",
        "legacy_ams_taxonomy_id" : "5"
      },
      "scope_of_work" : {
        "min" : 0,
        "max" : 100
      },
      "salary_type" : {
        "concept_id" : "oG8G_9cW_nRf",
        "label" : "Fast månads- vecko- eller timlön",
        "legacy_ams_taxonomy_id" : "1"
      },
      "removed" : false,
      "salary_description" : "Lön enligt överenskommelse",
      "access_to_own_car" : false,
      "publication_date" : "2022-07-15T14:45:29"
    },
    "name" : "Butikssäljare till Dyson Emporia - Malmö",
    "user" : "hannes"
  },
  "sha1" : "25dab805cd80c3a66543392c5c6b6d7b92ccd94c",
  "annotations" : [ {
    "preferred-label" : "Emporia",
    "sentiment" : "MUST_HAVE",
    "type" : "keyword",
    "start-position" : 25,
    "end-position" : 32,
    "concept-id" : "nV5j_CvT_riH",
    "matched-string" : "emporia",
    "annotation-id" : 0
  }, {
    "preferred-label" : "Säljare",
    "sentiment" : "MUST_HAVE",
    "type" : "keyword",
    "start-position" : 53,
    "end-position" : 60,
    "concept-id" : "rDcj_Tao_TJJ",
    "matched-string" : "säljare",
    "annotation-id" : 1
  }, {
    "preferred-label" : "kundservice",
    "sentiment" : "MUST_HAVE",
    "type" : "esco-skill",
    "start-position" : 859,
    "end-position" : 870,
    "concept-id" : "WykS_79d_Fz7",
    "matched-string" : "kundservice",
    "annotation-id" : 2
  }, {
    "preferred-label" : "arbeta självständigt",
    "type" : "esco-skill",
    "start-position" : 1271,
    "end-position" : 1291,
    "concept-id" : "NyFu_HHd_zhz",
    "matched-string" : "arbeta självständigt",
    "annotation-id" : 12
  }, {
    "preferred-label" : "Svenska",
    "sentiment" : "MUST_HAVE",
    "type" : "language",
    "start-position" : 1402,
    "end-position" : 1409,
    "concept-id" : "zSLA_vw2_FXN",
    "matched-string" : "svenska",
    "annotation-id" : 3
  }, {
    "preferred-label" : "Engelska",
    "sentiment" : "MUST_HAVE",
    "type" : "language",
    "start-position" : 1414,
    "end-position" : 1422,
    "concept-id" : "NVxJ_hLg_TYS",
    "matched-string" : "engelska",
    "annotation-id" : 4
  }, {
    "preferred-label" : "Coaching/Coachning",
    "sentiment" : "MUST_HAVE",
    "type" : "skill",
    "start-position" : 1765,
    "end-position" : 1774,
    "concept-id" : "91Ef_58Y_jX4",
    "matched-string" : "coachning",
    "annotation-id" : 5
  }, {
    "preferred-label" : "Deltid",
    "type" : "worktime-extent",
    "start-position" : 2105,
    "end-position" : 2111,
    "concept-id" : "947z_JGS_Uk2",
    "matched-string" : "50-75%",
    "annotation-id" : 13
  }, {
    "preferred-label" : "Fast anställning",
    "sentiment" : "MUST_HAVE",
    "type" : "keyword",
    "start-position" : 2280,
    "end-position" : 2296,
    "concept-id" : "oV9d_Jxy_x14",
    "matched-string" : "fast anställning",
    "annotation-id" : 7
  }, {
    "preferred-label" : "Personal",
    "sentiment" : "MUST_HAVE",
    "type" : "keyword",
    "start-position" : 3489,
    "end-position" : 3497,
    "concept-id" : "HVxM_6MS_y1c",
    "matched-string" : "personal",
    "annotation-id" : 9
  } ],
  "text" : "Butikssäljare till Dyson Emporia - Malmö\nVi söker en säljare med passion för innovativ teknik för att representera Dyson i Malmö. Som Dyson Expert kommer du jobba tätt ihop med ett team stylister som också kommer vara specialister på produkterna. Ni kommer tillsammans att leverera spännande demonstrationer och stylingar till kunder, med fokus på den nya hårtorken, Airwrap stylern och grundläggande kunskap om Dysons övriga produkter.\n\nOm Dyson\n\nDysons nordiska huvudkontor ligger i Stockholm. Idag säljs Dysons produkter i 65 länder. Dyson har vuxit från en man med en idé till ett världsomspännande teknikföretag med över 1 000 ingenjörer. Men den står inte still. I hjärtat av företaget finns ett ständigt växande team av ingenjörer och forskare. Fler idéer. Fler uppfinningar. Läs mer på: www.dyson.se\n\nArbetsområden\n\n- Var kundorienterad och alltid ge kundservice utöver det vanliga.\n\n- Fånga konsumenternas uppmärksamhet och inspirera kunderna att prova dysons produkter.\n\n- Håll ordning och reda runt Dysons monter.\n- Fyll på sortiment och hjälp till med de dagliga sysslorna.\n\n\nVi förväntar oss\n\n- Erfarenhet från detaljhandel och servicebranschen gärna inom hemelektronik.\n- Du har ett högt driv och kan balansera din förmåga att både vara en lagspelare, samt arbeta självständigt.\n- Du är social, professionell och skapar snabbt goda relationer med dina kollegor och kunder.\n- Du behärskar svenska och engelska flytande i tal och skrift\n\n\nVi erbjuder en glad och energisk arbetsplats där du blir en del av ett team av härliga kollegor som alltid är villiga att hjälpa till och ge support. Vi står för en utbildning i produktkunskap i samband med start.\n\nVi erbjuder dig\n\n- En plats i ett fantastiskt team\n- Sjukförsäkring och ett tryggt avtal\n- Löpande coachning\n\n\nÖvrigt\nI denna tjänst kommer du att vara anställd av Nordic Retail Group. Innan ditt första pass behöver du gå en produktutbildning med Dyson.\n\nVar: Jobbet är placerat i Emporia Köpcentrum och utförs i Dysons monter.\nArbetstider: Tjänsten kräver arbetsdagar uppdelade på vardagar, lördagar och söndagar\nAnställning: kontrakt på 50-75%\n\nTjänsten beräknas tillsättas omgående så intervjuer sker löpande så ansök så snart som möjligt. Detta är ett projektuppdrag på åtta månader. Det finns stor chans till fast anställning.\n\nFrågor (ej ansökningar) om tjänsten kan ställas till Adiam Araya på: araya@nordicretailgroup.com\n\nOm Nordic Retail Group\n\nNordic Retail Group är en fullservice retail byrå, som grundades 1997 och finns idag lokalt representerade i alla fyra nordiska länder. Vi fokuserar på att hjälpa våra kunder att bygga sina varumärken och nå sina mål genom att erbjuda bemanning, rekrytering, creative studio, och andra innovativa uppfinningar för våra kunder. Vi har byggt ett starkt team och vi vet vad som krävs för ett varumärke att lyckas inom retail och hur man ökar försäljning både lokalt och globalt.\n\nPå Nordic Retail Group har vi ett arbetsklimat som är kreativt och energiskt och vi är alltid ivriga att göra det lilla extra för att lyckas. Vi har verkligen passion för människor och det är därför det är viktigt för oss att erbjuda den mest säkra, inkluderande och inspirerande arbetsplatsen vi kan för våra fantastiska medarbetare.\n\nVi värdesätter högt att ha ett mångsidigt team med olika typer av erfarenheter och bakgrunder som ingår i gruppen. Det är viktigt för oss att alla känner sig värderade, uppskattade och som en viktig del av vårt team. Det viktigaste är att vi vill att vår personal ska älska att komma till jobbet. Som våra grundare alltid säger: “Du ska inte bara vissla på väg hem från kontoret - utan också på väg till kontoret”.\n\nBesök vår hemsida www.nordicretailgroup.com (http://www.nordicretailgroup.com/) för mer information."
}