{
  "meta" : {
    "jobad" : {
      "description" : {
        "requirements" : null,
        "needs" : null,
        "company_information" : null,
        "text_formatted" : "Toppmoderna fullservicehotellet Elite Hotel Ideon är en del av Lunds landmärke Ideon Gateway. Byggnaden är Lunds högsta med sina 19 våningar varav hotelldelen utgörs av 14 våningar. Liksom byggnaden i sig har hotellet ett högt miljötänk. Hotellet erbjuder 178 bekväma och luftkonditionerade och modernt inredda hotellrum.\n\nHotellets food and beverage verksamhet innefattar restaurangen Paolo’s samt 9 konferenslokaler för mellan 10 och 220 personer.\n\nNu söker vi erfarna serveringspersonal till vår verksamhet.\n\nVi söker dig som har minst 3-års dokumenterad arbetslivserfarenhet i servisen med a la carte. Vi ser att du har goda kunskaper inom mat samt dryck och du ska brinna för att sätta gästen i centrum. Du har även god samarbetsförmåga, energi och positiv utstrålning. Viktigt är även att du tycker om att verka i en bransch som står under ständig vidareutveckling.\n\nVi lägger stor vikt på personkemi, yrkesstolthet och att du har ett öga för detaljer. Vidare är du utåtriktad och engagerad samt vill göra ditt bästa i alla lägen.\n\nDet är meriterande om du har jobbat med Micros sedan tidigare.\n\nPraktikaliteter:\n\n- Arbetstider: Varierande dagtid, kvällstid och helger.\n- Omfattning: Tillsvidareanställning 75 %. Anställningen inleds med 6 månaders provanställning.\n- Start: Enligt överenskommelse.\n- Lön: Enligt överenskommelse. Vi tillämpar HRFs kollektivavtal.\n- För frågor om tjänsten kontakta: kontakta: Christian Hatesaul christian.hatesaul@elite.se\n- Sista ansökningsdag: Urval kommer ske löpande, vi rekommenderar därför att du inte väntar med din ansökan!\n\n\nVi ser framemot att höra från dig!",
        "conditions" : "Deltid\r\nAnställningstid enligt överenskommelse",
        "text" : "Toppmoderna fullservicehotellet Elite Hotel Ideon är en del av Lunds landmärke Ideon Gateway. Byggnaden är Lunds högsta med sina 19 våningar varav hotelldelen utgörs av 14 våningar. Liksom byggnaden i sig har hotellet ett högt miljötänk. Hotellet erbjuder 178 bekväma och luftkonditionerade och modernt inredda hotellrum.\n\nHotellets food and beverage verksamhet innefattar restaurangen Paolo’s samt 9 konferenslokaler för mellan 10 och 220 personer.\n\nNu söker vi erfarna serveringspersonal till vår verksamhet.\n\nVi söker dig som har minst 3-års dokumenterad arbetslivserfarenhet i servisen med a la carte. Vi ser att du har goda kunskaper inom mat samt dryck och du ska brinna för att sätta gästen i centrum. Du har även god samarbetsförmåga, energi och positiv utstrålning. Viktigt är även att du tycker om att verka i en bransch som står under ständig vidareutveckling.\n\nVi lägger stor vikt på personkemi, yrkesstolthet och att du har ett öga för detaljer. Vidare är du utåtriktad och engagerad samt vill göra ditt bästa i alla lägen.\n\nDet är meriterande om du har jobbat med Micros sedan tidigare.\n\nPraktikaliteter:\n\n- Arbetstider: Varierande dagtid, kvällstid och helger.\n- Omfattning: Tillsvidareanställning 75 %. Anställningen inleds med 6 månaders provanställning.\n- Start: Enligt överenskommelse.\n- Lön: Enligt överenskommelse. Vi tillämpar HRFs kollektivavtal.\n- För frågor om tjänsten kontakta: kontakta: Christian Hatesaul christian.hatesaul@elite.se\n- Sista ansökningsdag: Urval kommer ske löpande, vi rekommenderar därför att du inte väntar med din ansökan!\n\n\nVi ser framemot att höra från dig!"
      },
      "headline" : "SERVERINGSPERSONAL till ELITE HOTEL IDEON",
      "driving_license" : null,
      "employer" : {
        "email" : null,
        "phone_number" : null,
        "organization_number" : "5562485259",
        "name" : "Elite Hotels Of Sweden AB",
        "url" : "https://www.elite.se/sv/",
        "workplace" : "Elite Hotels"
      },
      "removed_date" : null,
      "logo_url" : "https://www.arbetsformedlingen.se/rest/arbetsgivare/rest/af/v3/organisation/5562485259/logotyper/logo.png",
      "last_publication_date" : "2022-08-31T23:59:59",
      "number_of_vacancies" : 1,
      "occupation" : {
        "concept_id" : "rGGf_KLs_To7",
        "label" : "Servitör/Servitris",
        "legacy_ams_taxonomy_id" : "5487"
      },
      "occupation_group" : {
        "concept_id" : "UjoW_meY_Zwt",
        "label" : "Hovmästare och servitörer",
        "legacy_ams_taxonomy_id" : "5131"
      },
      "employment_type" : {
        "concept_id" : "PFZr_Syz_cUq",
        "label" : "Vanlig anställning",
        "legacy_ams_taxonomy_id" : "1"
      },
      "webpage_url" : "https://arbetsformedlingen.se/platsbanken/annonser/26356278",
      "driving_license_required" : false,
      "application_contacts" : [ {
        "description" : "Christian Hatesaul",
        "email" : "christian.hatesaul@elite.se",
        "telephone" : "0768 792 091",
        "name" : null,
        "contact_type" : null
      } ],
      "duration" : {
        "concept_id" : "a7uU_j21_mkL",
        "label" : "Tills vidare",
        "legacy_ams_taxonomy_id" : "1"
      },
      "nice_to_have" : {
        "education_level" : [ ],
        "work_experiences" : [ ],
        "skills" : [ ],
        "education" : [ ],
        "languages" : [ ]
      },
      "application_details" : {
        "via_af" : false,
        "email" : null,
        "other" : null,
        "reference" : null,
        "url" : "https://elitehotels.teamtailor.com/jobs/1717949-serveringspersonal-till-elite-hotel-ideon?promotion=395117-arbetsformedlingen",
        "information" : null
      },
      "source_type" : "VIA_PLATSBANKEN_DXA",
      "application_deadline" : "2022-08-31T23:59:59",
      "external_id" : "46-556248-5259-1717949-5",
      "workplace_address" : {
        "coordinates" : [ 13.191008, 55.70466 ],
        "city" : null,
        "postcode" : null,
        "municipality" : "Lund",
        "region_concept_id" : "CaRE_1nn_cSU",
        "region" : "Skåne län",
        "country_code" : "199",
        "region_code" : "12",
        "municipality_concept_id" : "muSY_tsR_vDZ",
        "country_concept_id" : "i46j_HmG_v64",
        "municipality_code" : "1281",
        "street_address" : null,
        "country" : "Sverige"
      },
      "id" : "26356278",
      "experience_required" : true,
      "working_hours_type" : {
        "concept_id" : "947z_JGS_Uk2",
        "label" : "Deltid",
        "legacy_ams_taxonomy_id" : "2"
      },
      "access" : null,
      "timestamp" : 1658904735156,
      "must_have" : {
        "education_level" : [ ],
        "work_experiences" : [ {
          "concept_id" : "rGGf_KLs_To7",
          "weight" : 10,
          "label" : "Servitör/Servitris",
          "legacy_ams_taxonomy_id" : "5487"
        } ],
        "skills" : [ ],
        "education" : [ ],
        "languages" : [ ]
      },
      "occupation_field" : {
        "concept_id" : "ScKy_FHB_7wT",
        "label" : "Hotell, restaurang, storhushåll",
        "legacy_ams_taxonomy_id" : "7"
      },
      "scope_of_work" : {
        "min" : 0,
        "max" : 100
      },
      "salary_type" : {
        "concept_id" : "oG8G_9cW_nRf",
        "label" : "Fast månads- vecko- eller timlön",
        "legacy_ams_taxonomy_id" : "1"
      },
      "removed" : false,
      "salary_description" : "Lön enligt överenskommelse",
      "access_to_own_car" : false,
      "publication_date" : "2022-07-27T08:52:15"
    },
    "name" : "SERVERINGSPERSONAL till ELITE HOTEL IDEON",
    "user" : "hannes"
  },
  "sha1" : "c7a1ef6cbafc7113d262a7794e9d74e6d1c8df9a",
  "annotations" : [ {
    "preferred-label" : "Serveringspersonal",
    "sentiment" : "MUST_HAVE",
    "type" : "keyword",
    "start-position" : 0,
    "end-position" : 18,
    "concept-id" : "VqRa_738_v98",
    "matched-string" : "serveringspersonal",
    "annotation-id" : 0
  }, {
    "preferred-label" : "Hotell",
    "type" : "keyword",
    "start-position" : 65,
    "end-position" : 73,
    "concept-id" : "Jrrg_iiS_2yp",
    "matched-string" : "hotellet",
    "annotation-id" : 6
  }, {
    "preferred-label" : "Lund",
    "type" : "municipality",
    "start-position" : 105,
    "end-position" : 110,
    "concept-id" : "muSY_tsR_vDZ",
    "matched-string" : "Lunds",
    "annotation-id" : 4
  }, {
    "preferred-label" : "Lund",
    "type" : "municipality",
    "start-position" : 149,
    "end-position" : 154,
    "concept-id" : "muSY_tsR_vDZ",
    "matched-string" : "Lunds",
    "annotation-id" : 5
  }, {
    "preferred-label" : "Hotell",
    "type" : "keyword",
    "start-position" : 365,
    "end-position" : 374,
    "concept-id" : "Jrrg_iiS_2yp",
    "matched-string" : "Hotellets",
    "annotation-id" : 7
  }, {
    "preferred-label" : "Restaurang",
    "type" : "keyword",
    "start-position" : 415,
    "end-position" : 427,
    "concept-id" : "o2Cg_3Ap_qvK",
    "matched-string" : "restaurangen",
    "annotation-id" : 8
  }, {
    "preferred-label" : "Serveringspersonal",
    "sentiment" : "MUST_HAVE",
    "type" : "keyword",
    "start-position" : 513,
    "end-position" : 531,
    "concept-id" : "VqRa_738_v98",
    "matched-string" : "serveringspersonal",
    "annotation-id" : 1
  }, {
    "preferred-label" : "2-4 års erfarenhet",
    "type" : "occupation-experience-year",
    "start-position" : 581,
    "end-position" : 586,
    "concept-id" : "RWA2_uu6_udD",
    "matched-string" : "3-års",
    "annotation-id" : 10
  }, {
    "preferred-label" : "2-4 års erfarenhet",
    "type" : "occupation-experience-year",
    "start-position" : 600,
    "end-position" : 620,
    "concept-id" : "RWA2_uu6_udD",
    "matched-string" : "arbetslivserfarenhet",
    "annotation-id" : 9
  }, {
    "preferred-label" : "A la carte",
    "sentiment" : "MUST_HAVE",
    "type" : "skill",
    "start-position" : 636,
    "end-position" : 646,
    "concept-id" : "Bb4Q_Vou_pbq",
    "matched-string" : "a la carte",
    "annotation-id" : 2
  }, {
    "preferred-label" : "Tillsvidareanställning (inkl. eventuell provanställning)",
    "type" : "employment-type",
    "start-position" : 1232,
    "end-position" : 1254,
    "concept-id" : "kpPX_CNN_gDU",
    "matched-string" : "Tillsvidareanställning",
    "annotation-id" : 12
  }, {
    "preferred-label" : "Deltid",
    "type" : "worktime-extent",
    "start-position" : 1255,
    "end-position" : 1259,
    "concept-id" : "947z_JGS_Uk2",
    "matched-string" : "75 %",
    "annotation-id" : 11
  }, {
    "preferred-label" : "Kollektivavtal",
    "sentiment" : "MUST_HAVE",
    "type" : "skill",
    "start-position" : 1396,
    "end-position" : 1410,
    "concept-id" : "z7wE_9xb_3jX",
    "matched-string" : "kollektivavtal",
    "annotation-id" : 3
  } ],
  "text" : "SERVERINGSPERSONAL till ELITE HOTEL IDEON\nToppmoderna fullservicehotellet Elite Hotel Ideon är en del av Lunds landmärke Ideon Gateway. Byggnaden är Lunds högsta med sina 19 våningar varav hotelldelen utgörs av 14 våningar. Liksom byggnaden i sig har hotellet ett högt miljötänk. Hotellet erbjuder 178 bekväma och luftkonditionerade och modernt inredda hotellrum.\n\nHotellets food and beverage verksamhet innefattar restaurangen Paolo’s samt 9 konferenslokaler för mellan 10 och 220 personer.\n\nNu söker vi erfarna serveringspersonal till vår verksamhet.\n\nVi söker dig som har minst 3-års dokumenterad arbetslivserfarenhet i servisen med a la carte. Vi ser att du har goda kunskaper inom mat samt dryck och du ska brinna för att sätta gästen i centrum. Du har även god samarbetsförmåga, energi och positiv utstrålning. Viktigt är även att du tycker om att verka i en bransch som står under ständig vidareutveckling.\n\nVi lägger stor vikt på personkemi, yrkesstolthet och att du har ett öga för detaljer. Vidare är du utåtriktad och engagerad samt vill göra ditt bästa i alla lägen.\n\nDet är meriterande om du har jobbat med Micros sedan tidigare.\n\nPraktikaliteter:\n\n- Arbetstider: Varierande dagtid, kvällstid och helger.\n- Omfattning: Tillsvidareanställning 75 %. Anställningen inleds med 6 månaders provanställning.\n- Start: Enligt överenskommelse.\n- Lön: Enligt överenskommelse. Vi tillämpar HRFs kollektivavtal.\n- För frågor om tjänsten kontakta: kontakta: Christian Hatesaul christian.hatesaul@elite.se\n- Sista ansökningsdag: Urval kommer ske löpande, vi rekommenderar därför att du inte väntar med din ansökan!\n\n\nVi ser framemot att höra från dig!"
}