{
  "meta" : {
    "jobad" : {
      "description" : {
        "requirements" : null,
        "needs" : null,
        "company_information" : null,
        "text_formatted" : "<p>På myNanny barnvakt är vårt mål är att erbjuda Sveriges bästa barnpassning. Var med och dela glädjen av att passa barn och göra skillnad för familjer runtom i Sverige! Som nanny hos myNanny har du ett flexibelt, givande &amp; glädjefyllt extrajobb hos som ett av Sveriges ledande företag för barnpassning. Just nu vill rekordmånga familjer ha nannies från myNanny och det är med glädje som vi nu utökar myNanny-familjen med flera duktiga och passionerade barnvakter!</p><p><br></p><p>Läs mer om myNanny barnvakt: https://my-nanny.se/ och ansök redan idag på: https://my-nanny.se/extrajobb-barnvakt/</p><p><br></p><p><strong>Varför arbeta med barnpassning på myNanny?</strong></p><p>Mycket flexibelt extrajobb, vanligtvis arbetar du 2-4 timmar / veckan</p><p>Bra lön, 90 till 130 kr / timmen beroende på avstånd till familjen</p><p>Viktig och relevant merit för framtida jobb</p><p>Du är alltid försäkrad under barnpassningen</p><p>Kontinuerligt stöd från din personliga kontaktperson som är specialist på barnpassning på myNanny</p><p><br></p><p><strong>Passar du som barnpassare på myNanny? Vi söker dig som:</strong></p><p>Är ansvarsfull och lekfull med ett genuint engagemang för barn</p><p>Tidigare har passat ett eller flera barn (0 - 6 år) helt självständigt</p><p>Kan arbeta flexibelt både vardagar och helger som nanny</p><p><br></p><p><strong>Hur ansöker jag till nanny på myNanny?</strong></p><ol><li>Enkelt och smidigt på vår hemsida</li><li>Ansökan tar endast några minuter och du blir sedan kallad till intervju för jobbet som nanny på myNanny</li></ol><p><br></p><p><strong>En av våra många familjer som behöver hjälp nära dig: </strong></p><p>Vad som krävs av dig som söker arbetet: Erfarenhet av barnpassning i åldrarna 0-6 år.</p><ol><li>Antal barn och ålder: 1 barn, 3 år.</li><li>Dagar och tider: Familjen vill ha hjälp vid sporadiska tillfällen (ca 1 kväll i månaden) med start så snart som möjligt. De kan tänka sig passning på vilka veckodagar som helst.</li><li>Önskat startdatum för barnpassningen: Omgående!</li><li>Barnpassningen sker hemma hos familjen</li><li>Plats är myNanny barnvakt Skövde</li><li>Ref.nr: RN92999</li></ol><p><br></p><p>Om du inte kan hjälpa just den här familjen, så rekommenderar vi dig att söka en generell tjänst som barnvakt på myNanny direkt på vår hemsida. Då får du sedan erbjudanden om fler uppdrag som passar dig.</p><p><br></p><p>En annan fördel med för alla nannies på myNanny är att du kan arbeta i hela Sverige, oavsett om du bor i storstad eller på landsbygd. Bland annat:</p><p><br></p><ol><li>myNanny barnvakt Stockholm</li><li>myNanny barnvakt Göteborg</li><li>myNanny barnvakt Malmö</li><li>myNanny barnvakt Uppsala</li><li>myNanny barnvakt Västerås</li><li>Hitta fler städer på vår hemsida</li></ol><p><br></p><p>Vårt mål är att erbjuda Sveriges bästa barnpassning med myNanny. Var med och dela glädjen av att passa barn och göra skillnad för familjer runtom i Sverige! Just nu vill rekordmånga familjer få hjälp av en myNanny barnpassning och vi ser fram emot att få utöka myNanny-familjen med flera duktiga och passionerade myNanny barnvakter!</p><p><br></p><p>Många möjligheter: Utöver att arbeta hos oss på https://my-nanny.se/barnvakt/ kan du även få fler uppdrag som nanny via våra kollegor på https://nannypoppins.se/. Dessutom kan du om du vill även ge läxhjälp via https://www.allakando.se/laxhjalp/ och https://smartstudies.se/laxhjalp/. En förmån är även att du som har arbetat en längre period hos oss även får tillgång till t.ex. en kurs inför högskoleprovet kostnadsfritt: https://www.allakando.se/hogskoleprovet/</p><p><br></p><p>Ansök till extrajobbet som barnvakt på myNanny: https://my-nanny.se/extrajobb-barnvakt/</p>",
        "conditions" : null,
        "text" : "På myNanny barnvakt är vårt mål är att erbjuda Sveriges bästa barnpassning. Var med och dela glädjen av att passa barn och göra skillnad för familjer runtom i Sverige! Som nanny hos myNanny har du ett flexibelt, givande & glädjefyllt extrajobb hos som ett av Sveriges ledande företag för barnpassning. Just nu vill rekordmånga familjer ha nannies från myNanny och det är med glädje som vi nu utökar myNanny-familjen med flera duktiga och passionerade barnvakter!\n\n\nLäs mer om myNanny barnvakt: https://my-nanny.se/ och ansök redan idag på: https://my-nanny.se/extrajobb-barnvakt/\n\n\nVarför arbeta med barnpassning på myNanny?\nMycket flexibelt extrajobb, vanligtvis arbetar du 2-4 timmar / veckan\nBra lön, 90 till 130 kr / timmen beroende på avstånd till familjen\nViktig och relevant merit för framtida jobb\nDu är alltid försäkrad under barnpassningen\nKontinuerligt stöd från din personliga kontaktperson som är specialist på barnpassning på myNanny\n\n\nPassar du som barnpassare på myNanny? Vi söker dig som:\nÄr ansvarsfull och lekfull med ett genuint engagemang för barn\nTidigare har passat ett eller flera barn (0 - 6 år) helt självständigt\nKan arbeta flexibelt både vardagar och helger som nanny\n\n\nHur ansöker jag till nanny på myNanny?\nEnkelt och smidigt på vår hemsida\nAnsökan tar endast några minuter och du blir sedan kallad till intervju för jobbet som nanny på myNanny\n\n\n\nEn av våra många familjer som behöver hjälp nära dig: \nVad som krävs av dig som söker arbetet: Erfarenhet av barnpassning i åldrarna 0-6 år.\nAntal barn och ålder: 1 barn, 3 år.\nDagar och tider: Familjen vill ha hjälp vid sporadiska tillfällen (ca 1 kväll i månaden) med start så snart som möjligt. De kan tänka sig passning på vilka veckodagar som helst.\nÖnskat startdatum för barnpassningen: Omgående!\nBarnpassningen sker hemma hos familjen\nPlats är myNanny barnvakt Skövde\nRef.nr: RN92999\n\n\n\nOm du inte kan hjälpa just den här familjen, så rekommenderar vi dig att söka en generell tjänst som barnvakt på myNanny direkt på vår hemsida. Då får du sedan erbjudanden om fler uppdrag som passar dig.\n\n\nEn annan fördel med för alla nannies på myNanny är att du kan arbeta i hela Sverige, oavsett om du bor i storstad eller på landsbygd. Bland annat:\n\n\nmyNanny barnvakt Stockholm\nmyNanny barnvakt Göteborg\nmyNanny barnvakt Malmö\nmyNanny barnvakt Uppsala\nmyNanny barnvakt Västerås\nHitta fler städer på vår hemsida\n\n\n\nVårt mål är att erbjuda Sveriges bästa barnpassning med myNanny. Var med och dela glädjen av att passa barn och göra skillnad för familjer runtom i Sverige! Just nu vill rekordmånga familjer få hjälp av en myNanny barnpassning och vi ser fram emot att få utöka myNanny-familjen med flera duktiga och passionerade myNanny barnvakter!\n\n\nMånga möjligheter: Utöver att arbeta hos oss på https://my-nanny.se/barnvakt/ kan du även få fler uppdrag som nanny via våra kollegor på https://nannypoppins.se/. Dessutom kan du om du vill även ge läxhjälp via https://www.allakando.se/laxhjalp/ och https://smartstudies.se/laxhjalp/. En förmån är även att du som har arbetat en längre period hos oss även får tillgång till t.ex. en kurs inför högskoleprovet kostnadsfritt: https://www.allakando.se/hogskoleprovet/\n\n\nAnsök till extrajobbet som barnvakt på myNanny: https://my-nanny.se/extrajobb-barnvakt/"
      },
      "headline" : "myNanny barnvakt Skövde, nanny / barnpassning, sporadiska tillfällen",
      "driving_license" : null,
      "employer" : {
        "email" : null,
        "phone_number" : null,
        "organization_number" : "5569751901",
        "name" : "YCLA AB",
        "url" : "https://my-nanny.se/extrajobb-barnvakt/",
        "workplace" : "myNanny Barnvakt Skövde"
      },
      "removed_date" : null,
      "logo_url" : null,
      "last_publication_date" : "2022-07-27T23:59:59",
      "number_of_vacancies" : 1,
      "occupation" : {
        "concept_id" : "zVkQ_wLL_78i",
        "label" : "Barnflicka/Barnvakt",
        "legacy_ams_taxonomy_id" : "438"
      },
      "occupation_group" : {
        "concept_id" : "o1gn_FoS_fB7",
        "label" : "Övrig hemservicepersonal m.fl.",
        "legacy_ams_taxonomy_id" : "9119"
      },
      "employment_type" : {
        "concept_id" : "1paU_aCR_nGn",
        "label" : "Behovsanställning",
        "legacy_ams_taxonomy_id" : "4"
      },
      "webpage_url" : "https://arbetsformedlingen.se/platsbanken/annonser/26323138",
      "driving_license_required" : false,
      "application_contacts" : [ ],
      "duration" : {
        "concept_id" : null,
        "label" : null,
        "legacy_ams_taxonomy_id" : null
      },
      "nice_to_have" : {
        "education_level" : [ ],
        "work_experiences" : [ ],
        "skills" : [ ],
        "education" : [ ],
        "languages" : [ ]
      },
      "application_details" : {
        "via_af" : false,
        "email" : null,
        "other" : null,
        "reference" : null,
        "url" : "https://my-nanny.se/extrajobb-barnvakt/",
        "information" : null
      },
      "source_type" : "VIA_ANNONSERA",
      "application_deadline" : "2022-07-27T23:59:59",
      "external_id" : null,
      "workplace_address" : {
        "coordinates" : [ 13.846562822033082, 58.39113995808456 ],
        "city" : "Skövde",
        "postcode" : "54130",
        "municipality" : "Skövde",
        "region_concept_id" : "zdoY_6u5_Krt",
        "region" : "Västra Götalands län",
        "country_code" : "199",
        "region_code" : "14",
        "municipality_concept_id" : "fqAy_4ji_Lz2",
        "country_concept_id" : "i46j_HmG_v64",
        "municipality_code" : "1496",
        "street_address" : "myNanny",
        "country" : "Sverige"
      },
      "id" : "26323138",
      "experience_required" : true,
      "working_hours_type" : {
        "concept_id" : null,
        "label" : null,
        "legacy_ams_taxonomy_id" : null
      },
      "access" : null,
      "timestamp" : 1657704430284,
      "must_have" : {
        "education_level" : [ ],
        "work_experiences" : [ ],
        "skills" : [ ],
        "education" : [ ],
        "languages" : [ ]
      },
      "occupation_field" : {
        "concept_id" : "whao_Q6A_ScE",
        "label" : "Sanering och renhållning",
        "legacy_ams_taxonomy_id" : "12"
      },
      "scope_of_work" : {
        "min" : 0,
        "max" : null
      },
      "salary_type" : {
        "concept_id" : "oG8G_9cW_nRf",
        "label" : "Fast månads- vecko- eller timlön",
        "legacy_ams_taxonomy_id" : "1"
      },
      "removed" : false,
      "salary_description" : null,
      "access_to_own_car" : false,
      "publication_date" : "2022-07-13T11:27:10"
    },
    "name" : "myNanny barnvakt Skövde, nanny / barnpassning, sporadiska tillfällen",
    "user" : "kristof.fischer"
  },
  "sha1" : "18672331af8bf118c4dedce801affd65f7c389d9",
  "annotations" : [ {
    "preferred-label" : "Barnvakt",
    "sentiment" : "MUST_HAVE",
    "type" : "occupation-name",
    "start-position" : 8,
    "end-position" : 16,
    "concept-id" : "zVkQ_wLL_78i",
    "matched-string" : "barnvakt",
    "annotation-id" : 0
  }, {
    "preferred-label" : "Skövde",
    "type" : "municipality",
    "start-position" : 17,
    "end-position" : 23,
    "concept-id" : "fqAy_4ji_Lz2",
    "matched-string" : "Skövde",
    "annotation-id" : 24
  }, {
    "preferred-label" : "Barnvakt",
    "sentiment" : "MUST_HAVE",
    "type" : "occupation-name",
    "start-position" : 25,
    "end-position" : 30,
    "concept-id" : "zVkQ_wLL_78i",
    "matched-string" : "nanny",
    "annotation-id" : 1
  }, {
    "preferred-label" : "barnpassning",
    "sentiment" : "MUST_HAVE",
    "type" : "esco-skill",
    "start-position" : 33,
    "end-position" : 45,
    "concept-id" : "m5G2_tuy_2uZ",
    "matched-string" : "barnpassning",
    "annotation-id" : 25
  }, {
    "preferred-label" : "Barnvakt",
    "sentiment" : "MUST_HAVE",
    "type" : "occupation-name",
    "start-position" : 80,
    "end-position" : 88,
    "concept-id" : "zVkQ_wLL_78i",
    "matched-string" : "barnvakt",
    "annotation-id" : 2
  }, {
    "preferred-label" : "Sverige",
    "type" : "country",
    "start-position" : 116,
    "end-position" : 124,
    "concept-id" : "i46j_HmG_v64",
    "matched-string" : "Sveriges",
    "annotation-id" : 26
  }, {
    "preferred-label" : "Sverige",
    "type" : "country",
    "start-position" : 228,
    "end-position" : 235,
    "concept-id" : "i46j_HmG_v64",
    "matched-string" : "Sverige",
    "annotation-id" : 27
  }, {
    "preferred-label" : "Barnvakt",
    "sentiment" : "MUST_HAVE",
    "type" : "occupation-name",
    "start-position" : 241,
    "end-position" : 246,
    "concept-id" : "zVkQ_wLL_78i",
    "matched-string" : "nanny",
    "annotation-id" : 3
  }, {
    "preferred-label" : "Sverige",
    "type" : "country",
    "start-position" : 328,
    "end-position" : 336,
    "concept-id" : "i46j_HmG_v64",
    "matched-string" : "Sveriges",
    "annotation-id" : 28
  }, {
    "preferred-label" : "Barnvakt",
    "type" : "occupation-name",
    "start-position" : 408,
    "end-position" : 415,
    "concept-id" : "zVkQ_wLL_78i",
    "matched-string" : "nannies",
    "annotation-id" : 29
  }, {
    "preferred-label" : "Barnvakt",
    "type" : "occupation-name",
    "start-position" : 520,
    "end-position" : 530,
    "concept-id" : "zVkQ_wLL_78i",
    "matched-string" : "barnvakter",
    "annotation-id" : 30
  }, {
    "preferred-label" : "Barnvakt",
    "sentiment" : "MUST_HAVE",
    "type" : "occupation-name",
    "start-position" : 553,
    "end-position" : 561,
    "concept-id" : "zVkQ_wLL_78i",
    "matched-string" : "barnvakt",
    "annotation-id" : 4
  }, {
    "preferred-label" : "visa ansvarstagande",
    "sentiment" : "MUST_HAVE",
    "type" : "esco-skill",
    "start-position" : 1078,
    "end-position" : 1089,
    "concept-id" : "bcRp_hxV_f5G",
    "matched-string" : "ansvarsfull",
    "annotation-id" : 31
  }, {
    "preferred-label" : "barnpassning",
    "sentiment" : "MUST_HAVE",
    "type" : "esco-skill",
    "start-position" : 1151,
    "end-position" : 1178,
    "concept-id" : "m5G2_tuy_2uZ",
    "matched-string" : "passat ett eller flera barn",
    "annotation-id" : 32
  }, {
    "preferred-label" : "arbeta självständigt",
    "sentiment" : "MUST_HAVE",
    "type" : "esco-skill",
    "start-position" : 1195,
    "end-position" : 1208,
    "concept-id" : "NyFu_HHd_zhz",
    "matched-string" : "självständigt",
    "annotation-id" : 33
  }, {
    "preferred-label" : "Barnvakt",
    "sentiment" : "MUST_HAVE",
    "type" : "occupation-name",
    "start-position" : 1259,
    "end-position" : 1264,
    "concept-id" : "zVkQ_wLL_78i",
    "matched-string" : "nanny",
    "annotation-id" : 8
  }, {
    "preferred-label" : "Barnvakt",
    "sentiment" : "MUST_HAVE",
    "type" : "occupation-name",
    "start-position" : 1288,
    "end-position" : 1293,
    "concept-id" : "zVkQ_wLL_78i",
    "matched-string" : "nanny",
    "annotation-id" : 9
  }, {
    "preferred-label" : "Barnvakt",
    "sentiment" : "MUST_HAVE",
    "type" : "occupation-name",
    "start-position" : 1427,
    "end-position" : 1432,
    "concept-id" : "zVkQ_wLL_78i",
    "matched-string" : "nanny",
    "annotation-id" : 10
  }, {
    "preferred-label" : "barnpassning",
    "sentiment" : "MUST_HAVE",
    "type" : "esco-skill",
    "start-position" : 1542,
    "end-position" : 1568,
    "concept-id" : "m5G2_tuy_2uZ",
    "matched-string" : "Erfarenhet av barnpassning",
    "annotation-id" : 34
  }, {
    "preferred-label" : "Barnvakt",
    "sentiment" : "MUST_HAVE",
    "type" : "occupation-name",
    "start-position" : 1906,
    "end-position" : 1914,
    "concept-id" : "zVkQ_wLL_78i",
    "matched-string" : "barnvakt",
    "annotation-id" : 11
  }, {
    "preferred-label" : "Skövde",
    "type" : "municipality",
    "start-position" : 1915,
    "end-position" : 1921,
    "concept-id" : "fqAy_4ji_Lz2",
    "matched-string" : "Skövde",
    "annotation-id" : 35
  }, {
    "preferred-label" : "Barnvakt",
    "sentiment" : "MUST_HAVE",
    "type" : "occupation-name",
    "start-position" : 2042,
    "end-position" : 2050,
    "concept-id" : "zVkQ_wLL_78i",
    "matched-string" : "barnvakt",
    "annotation-id" : 12
  }, {
    "preferred-label" : "Sverige",
    "type" : "country",
    "start-position" : 2223,
    "end-position" : 2230,
    "concept-id" : "i46j_HmG_v64",
    "matched-string" : "Sverige",
    "annotation-id" : 36
  }, {
    "preferred-label" : "Barnvakt",
    "sentiment" : "MUST_HAVE",
    "type" : "occupation-name",
    "start-position" : 2304,
    "end-position" : 2312,
    "concept-id" : "zVkQ_wLL_78i",
    "matched-string" : "barnvakt",
    "annotation-id" : 13
  }, {
    "preferred-label" : "Stockholm",
    "type" : "municipality",
    "start-position" : 2313,
    "end-position" : 2322,
    "concept-id" : "AvNB_uwa_6n6",
    "matched-string" : "Stockholm",
    "annotation-id" : 37
  }, {
    "preferred-label" : "Barnvakt",
    "sentiment" : "MUST_HAVE",
    "type" : "occupation-name",
    "start-position" : 2331,
    "end-position" : 2339,
    "concept-id" : "zVkQ_wLL_78i",
    "matched-string" : "barnvakt",
    "annotation-id" : 14
  }, {
    "preferred-label" : "Göteborg",
    "type" : "municipality",
    "start-position" : 2340,
    "end-position" : 2348,
    "concept-id" : "PVZL_BQT_XtL",
    "matched-string" : "Göteborg",
    "annotation-id" : 38
  }, {
    "preferred-label" : "Barnvakt",
    "sentiment" : "MUST_HAVE",
    "type" : "occupation-name",
    "start-position" : 2357,
    "end-position" : 2365,
    "concept-id" : "zVkQ_wLL_78i",
    "matched-string" : "barnvakt",
    "annotation-id" : 15
  }, {
    "preferred-label" : "Malmö",
    "type" : "municipality",
    "start-position" : 2366,
    "end-position" : 2371,
    "concept-id" : "oYPt_yRA_Smm",
    "matched-string" : "Malmö",
    "annotation-id" : 39
  }, {
    "preferred-label" : "Barnvakt",
    "sentiment" : "MUST_HAVE",
    "type" : "occupation-name",
    "start-position" : 2380,
    "end-position" : 2388,
    "concept-id" : "zVkQ_wLL_78i",
    "matched-string" : "barnvakt",
    "annotation-id" : 16
  }, {
    "preferred-label" : "Uppsala",
    "type" : "municipality",
    "start-position" : 2389,
    "end-position" : 2396,
    "concept-id" : "otaF_bQY_4ZD",
    "matched-string" : "Uppsala",
    "annotation-id" : 40
  }, {
    "preferred-label" : "Barnvakt",
    "sentiment" : "MUST_HAVE",
    "type" : "occupation-name",
    "start-position" : 2405,
    "end-position" : 2413,
    "concept-id" : "zVkQ_wLL_78i",
    "matched-string" : "barnvakt",
    "annotation-id" : 17
  }, {
    "preferred-label" : "Västerås",
    "type" : "municipality",
    "start-position" : 2414,
    "end-position" : 2422,
    "concept-id" : "8deT_FRF_2SP",
    "matched-string" : "Västerås",
    "annotation-id" : 41
  }, {
    "preferred-label" : "Barnvakt",
    "sentiment" : "MUST_HAVE",
    "type" : "occupation-name",
    "start-position" : 3288,
    "end-position" : 3296,
    "concept-id" : "zVkQ_wLL_78i",
    "matched-string" : "barnvakt",
    "annotation-id" : 21
  } ],
  "text" : "myNanny barnvakt Skövde, nanny / barnpassning, sporadiska tillfällen\nPå myNanny barnvakt är vårt mål är att erbjuda Sveriges bästa barnpassning. Var med och dela glädjen av att passa barn och göra skillnad för familjer runtom i Sverige! Som nanny hos myNanny har du ett flexibelt, givande & glädjefyllt extrajobb hos som ett av Sveriges ledande företag för barnpassning. Just nu vill rekordmånga familjer ha nannies från myNanny och det är med glädje som vi nu utökar myNanny-familjen med flera duktiga och passionerade barnvakter!\n\n\nLäs mer om myNanny barnvakt: https://my-nanny.se/ och ansök redan idag på: https://my-nanny.se/extrajobb-barnvakt/\n\n\nVarför arbeta med barnpassning på myNanny?\nMycket flexibelt extrajobb, vanligtvis arbetar du 2-4 timmar / veckan\nBra lön, 90 till 130 kr / timmen beroende på avstånd till familjen\nViktig och relevant merit för framtida jobb\nDu är alltid försäkrad under barnpassningen\nKontinuerligt stöd från din personliga kontaktperson som är specialist på barnpassning på myNanny\n\n\nPassar du som barnpassare på myNanny? Vi söker dig som:\nÄr ansvarsfull och lekfull med ett genuint engagemang för barn\nTidigare har passat ett eller flera barn (0 - 6 år) helt självständigt\nKan arbeta flexibelt både vardagar och helger som nanny\n\n\nHur ansöker jag till nanny på myNanny?\nEnkelt och smidigt på vår hemsida\nAnsökan tar endast några minuter och du blir sedan kallad till intervju för jobbet som nanny på myNanny\n\n\n\nEn av våra många familjer som behöver hjälp nära dig: \nVad som krävs av dig som söker arbetet: Erfarenhet av barnpassning i åldrarna 0-6 år.\nAntal barn och ålder: 1 barn, 3 år.\nDagar och tider: Familjen vill ha hjälp vid sporadiska tillfällen (ca 1 kväll i månaden) med start så snart som möjligt. De kan tänka sig passning på vilka veckodagar som helst.\nÖnskat startdatum för barnpassningen: Omgående!\nBarnpassningen sker hemma hos familjen\nPlats är myNanny barnvakt Skövde\nRef.nr: RN92999\n\n\n\nOm du inte kan hjälpa just den här familjen, så rekommenderar vi dig att söka en generell tjänst som barnvakt på myNanny direkt på vår hemsida. Då får du sedan erbjudanden om fler uppdrag som passar dig.\n\n\nEn annan fördel med för alla nannies på myNanny är att du kan arbeta i hela Sverige, oavsett om du bor i storstad eller på landsbygd. Bland annat:\n\n\nmyNanny barnvakt Stockholm\nmyNanny barnvakt Göteborg\nmyNanny barnvakt Malmö\nmyNanny barnvakt Uppsala\nmyNanny barnvakt Västerås\nHitta fler städer på vår hemsida\n\n\n\nVårt mål är att erbjuda Sveriges bästa barnpassning med myNanny. Var med och dela glädjen av att passa barn och göra skillnad för familjer runtom i Sverige! Just nu vill rekordmånga familjer få hjälp av en myNanny barnpassning och vi ser fram emot att få utöka myNanny-familjen med flera duktiga och passionerade myNanny barnvakter!\n\n\nMånga möjligheter: Utöver att arbeta hos oss på https://my-nanny.se/barnvakt/ kan du även få fler uppdrag som nanny via våra kollegor på https://nannypoppins.se/. Dessutom kan du om du vill även ge läxhjälp via https://www.allakando.se/laxhjalp/ och https://smartstudies.se/laxhjalp/. En förmån är även att du som har arbetat en längre period hos oss även får tillgång till t.ex. en kurs inför högskoleprovet kostnadsfritt: https://www.allakando.se/hogskoleprovet/\n\n\nAnsök till extrajobbet som barnvakt på myNanny: https://my-nanny.se/extrajobb-barnvakt/"
}