{
  "meta" : {
    "description" : "",
    "name" : "107 Arbetsmiljöplan",
    "modulens id" : "20688",
    "type" : ""
  },
  "sha1" : "af34d7cb84995b10d3324d9fb9140f8396cbcde6",
  "annotations" : [ ],
  "text" : "Upprätande av och arbete med arbetsmiljöplan."
}