{
  "meta" : {
    "jobad" : {
      "description" : {
        "requirements" : null,
        "needs" : null,
        "company_information" : null,
        "text_formatted" : "<p>Vi på restaurang Slingerbulten söker nu någon att jobba med oss i vårat team. Heltid och deltid samt inför hösten/vintern. Vi ligger mitt i gamla stan med mycket turister. Stresstålig och ett högtempo behövs! Helst någon med erfarenhet av servering.</p>",
        "conditions" : null,
        "text" : "Vi på restaurang Slingerbulten söker nu någon att jobba med oss i vårat team. Heltid och deltid samt inför hösten/vintern. Vi ligger mitt i gamla stan med mycket turister. Stresstålig och ett högtempo behövs! Helst någon med erfarenhet av servering."
      },
      "headline" : "Serveringspersonal",
      "driving_license" : null,
      "employer" : {
        "email" : null,
        "phone_number" : null,
        "organization_number" : "9697480664",
        "name" : "Poonfood HB",
        "url" : "http://www.slingerbulten.com",
        "workplace" : "Poonfood HB"
      },
      "removed_date" : null,
      "logo_url" : null,
      "last_publication_date" : "2022-09-12T00:00:00",
      "number_of_vacancies" : 2,
      "occupation" : {
        "concept_id" : "rGGf_KLs_To7",
        "label" : "Servitör/Servitris",
        "legacy_ams_taxonomy_id" : "5487"
      },
      "occupation_group" : {
        "concept_id" : "UjoW_meY_Zwt",
        "label" : "Hovmästare och servitörer",
        "legacy_ams_taxonomy_id" : "5131"
      },
      "employment_type" : {
        "concept_id" : "PFZr_Syz_cUq",
        "label" : "Vanlig anställning",
        "legacy_ams_taxonomy_id" : "1"
      },
      "webpage_url" : "https://arbetsformedlingen.se/platsbanken/annonser/26406235",
      "driving_license_required" : false,
      "application_contacts" : [ ],
      "duration" : {
        "concept_id" : "qQUd_4qe_NDT",
        "label" : "6 månader eller längre",
        "legacy_ams_taxonomy_id" : "2"
      },
      "nice_to_have" : {
        "education_level" : [ ],
        "work_experiences" : [ {
          "concept_id" : "rGGf_KLs_To7",
          "weight" : 5,
          "label" : "Servitör/Servitris",
          "legacy_ams_taxonomy_id" : "5487"
        } ],
        "skills" : [ ],
        "education" : [ ],
        "languages" : [ ]
      },
      "application_details" : {
        "via_af" : false,
        "email" : "nya.slingerbulten@gmail.com",
        "other" : null,
        "reference" : null,
        "url" : null,
        "information" : null
      },
      "source_type" : "VIA_ANNONSERA",
      "application_deadline" : "2022-09-12T00:00:00",
      "external_id" : null,
      "workplace_address" : {
        "coordinates" : [ 18.068880732881215, 59.32435102027424 ],
        "city" : "STOCKHOLM",
        "postcode" : "11127",
        "municipality" : "Stockholm",
        "region_concept_id" : "CifL_Rzy_Mku",
        "region" : "Stockholms län",
        "country_code" : "199",
        "region_code" : "01",
        "municipality_concept_id" : "AvNB_uwa_6n6",
        "country_concept_id" : "i46j_HmG_v64",
        "municipality_code" : "0180",
        "street_address" : "STORA NYGATAN 24",
        "country" : "Sverige"
      },
      "id" : "26406235",
      "experience_required" : true,
      "working_hours_type" : {
        "concept_id" : "6YE1_gAC_R2G",
        "label" : "Heltid",
        "legacy_ams_taxonomy_id" : "1"
      },
      "access" : null,
      "timestamp" : 1660376065267,
      "must_have" : {
        "education_level" : [ ],
        "work_experiences" : [ ],
        "skills" : [ ],
        "education" : [ ],
        "languages" : [ ]
      },
      "occupation_field" : {
        "concept_id" : "ScKy_FHB_7wT",
        "label" : "Hotell, restaurang, storhushåll",
        "legacy_ams_taxonomy_id" : "7"
      },
      "scope_of_work" : {
        "min" : 0,
        "max" : 100
      },
      "salary_type" : {
        "concept_id" : "oG8G_9cW_nRf",
        "label" : "Fast månads- vecko- eller timlön",
        "legacy_ams_taxonomy_id" : "1"
      },
      "removed" : false,
      "salary_description" : null,
      "access_to_own_car" : false,
      "publication_date" : "2022-08-13T09:34:25"
    },
    "name" : "Serveringspersonal",
    "user" : "hannes"
  },
  "sha1" : "0f5f87e8505ce41906c89d742bc02b21b1d6af6d",
  "annotations" : [ {
    "preferred-label" : "Serveringspersonal",
    "sentiment" : "MUST_HAVE",
    "type" : "keyword",
    "start-position" : 0,
    "end-position" : 18,
    "concept-id" : "VqRa_738_v98",
    "matched-string" : "serveringspersonal",
    "annotation-id" : 0
  }, {
    "preferred-label" : "Restaurang",
    "sentiment" : "NOT_RELEVANT",
    "type" : "keyword",
    "start-position" : 25,
    "end-position" : 35,
    "concept-id" : "o2Cg_3Ap_qvK",
    "matched-string" : "restaurang",
    "annotation-id" : 1
  }, {
    "preferred-label" : "Heltid/Deltid",
    "sentiment" : "OFFERED",
    "type" : "worktime-extent",
    "start-position" : 97,
    "end-position" : 114,
    "concept-id" : "hGCt_6Ni_XPz",
    "matched-string" : "Heltid och deltid",
    "annotation-id" : 2
  }, {
    "preferred-label" : "hantera stress",
    "sentiment" : "MUST_HAVE",
    "type" : "esco-skill",
    "start-position" : 191,
    "end-position" : 202,
    "concept-id" : "z5Zo_DVb_VEK",
    "matched-string" : "Stresstålig",
    "annotation-id" : 3
  }, {
    "preferred-label" : "Restaurang, servering",
    "sentiment" : "NICE_TO_HAVE",
    "type" : "keyword",
    "start-position" : 258,
    "end-position" : 267,
    "concept-id" : "GqXD_ArB_Mmg",
    "matched-string" : "servering",
    "annotation-id" : 4
  } ],
  "text" : "Serveringspersonal\nVi på restaurang Slingerbulten söker nu någon att jobba med oss i vårat team. Heltid och deltid samt inför hösten/vintern. Vi ligger mitt i gamla stan med mycket turister. Stresstålig och ett högtempo behövs! Helst någon med erfarenhet av servering."
}