{
  "meta" : {
    "jobad" : {
      "description" : {
        "requirements" : null,
        "needs" : null,
        "company_information" : null,
        "text_formatted" : "<p>Vi söker driven och social tekniker till vårt kontor i Östersund då vi fortsätter växa med nya uppdrag. </p><p>Som fastighetstekniker hos oss på A.R.C får du en varierad, utmanande och inflytelserik roll i vårt gäng där ingen arbetsdag är den andra lik. Vi lägger stor vikt på rätt personlighet hos våra medarbetare, detta för att få ett sammansvetsat arbetslag och en rolig arbetsplats att komma till på morgonen. Ett engagerat servicetänk och ett trevligt bemötande är också viktigt då vi är ansiktet utåt åt våra kunder och hyresgäster.</p><p>En fastighetstekniker hos oss är ansvarig för ”sina” fastigheter och ser till att alla delar i förvaltningsavtalen sköts.</p><p><br></p><p>Arbetsuppgifter innefattar:</p><p>·       Hantering av felanmälan och rapportering mot kund.</p><p>·       Tillsyn och skötsel av värmecentraler, ventilation/kyla, brandlarm och sprinkler.</p><p>·       Bevaka och medverka vid myndighetsbesiktningar.</p><p>·       Delta och rapportera till driftmöten.</p><p>·       Ta fram fastpriser vid mindre ombyggnationer och projekt.</p><p><br></p><p>A.R.C Fastighetspartner startades sommaren 2020 och har sedan dess etablerat kontor i Växjö, Älmhult, Kalmar, Borgholm, Nybro, Malmö, Örnsköldsvik och nu inom kort även i Östersund. Vi har fått en flygande start och tror stenhårt på vår idé om att skapa arbetsplatser där man trivs. Vi har även höga ambitioner och tydligt satta mål och vill bli bästa fastighetsförvaltaren i Sverige. </p><p>Vi ser gärna att du som söker dig till oss har några års erfarenhet av fastighetstekniskt arbete med utbildningar inom värme/ventilation, brand/sprinkler samt Heta arbeten och att du tycker om att ta eget ansvar. Även goda kunskaper inom Office-paketet och hanterar svenska och engelska i tal och skrift.</p><p>B-körkort är ett krav.</p><p>Goda kunskaper inom El är meriterande men inte ett krav.</p><p>Rekrytering sker löpande så skynda in med ansökan innan tjänsten blir tillsatt.</p>",
        "conditions" : null,
        "text" : "Vi söker driven och social tekniker till vårt kontor i Östersund då vi fortsätter växa med nya uppdrag. \nSom fastighetstekniker hos oss på A.R.C får du en varierad, utmanande och inflytelserik roll i vårt gäng där ingen arbetsdag är den andra lik. Vi lägger stor vikt på rätt personlighet hos våra medarbetare, detta för att få ett sammansvetsat arbetslag och en rolig arbetsplats att komma till på morgonen. Ett engagerat servicetänk och ett trevligt bemötande är också viktigt då vi är ansiktet utåt åt våra kunder och hyresgäster.\nEn fastighetstekniker hos oss är ansvarig för ”sina” fastigheter och ser till att alla delar i förvaltningsavtalen sköts.\n\n\nArbetsuppgifter innefattar:\n·       Hantering av felanmälan och rapportering mot kund.\n·       Tillsyn och skötsel av värmecentraler, ventilation/kyla, brandlarm och sprinkler.\n·       Bevaka och medverka vid myndighetsbesiktningar.\n·       Delta och rapportera till driftmöten.\n·       Ta fram fastpriser vid mindre ombyggnationer och projekt.\n\n\nA.R.C Fastighetspartner startades sommaren 2020 och har sedan dess etablerat kontor i Växjö, Älmhult, Kalmar, Borgholm, Nybro, Malmö, Örnsköldsvik och nu inom kort även i Östersund. Vi har fått en flygande start och tror stenhårt på vår idé om att skapa arbetsplatser där man trivs. Vi har även höga ambitioner och tydligt satta mål och vill bli bästa fastighetsförvaltaren i Sverige. \nVi ser gärna att du som söker dig till oss har några års erfarenhet av fastighetstekniskt arbete med utbildningar inom värme/ventilation, brand/sprinkler samt Heta arbeten och att du tycker om att ta eget ansvar. Även goda kunskaper inom Office-paketet och hanterar svenska och engelska i tal och skrift.\nB-körkort är ett krav.\nGoda kunskaper inom El är meriterande men inte ett krav.\nRekrytering sker löpande så skynda in med ansökan innan tjänsten blir tillsatt."
      },
      "headline" : "Fastighetstekniker",
      "driving_license" : [ {
        "concept_id" : "VTK8_WRx_GcM",
        "label" : "B",
        "legacy_ams_taxonomy_id" : "3"
      } ],
      "employer" : {
        "email" : null,
        "phone_number" : null,
        "organization_number" : "5592680739",
        "name" : "A.R.C Fastighetspartner AB",
        "url" : "www.arcfast.se",
        "workplace" : "A R C Fastighetspartner AB"
      },
      "removed_date" : null,
      "logo_url" : "https://www.arbetsformedlingen.se/rest/arbetsgivare/rest/af/v3/arbetsplatser/87822247/logotyper/logo.png",
      "last_publication_date" : "2022-08-26T23:59:59",
      "number_of_vacancies" : 2,
      "occupation" : {
        "concept_id" : "9NVZ_LfD_vqT",
        "label" : "Fastighetstekniker/Drifttekniker, fastighet",
        "legacy_ams_taxonomy_id" : "2386"
      },
      "occupation_group" : {
        "concept_id" : "df9D_e6y_61z",
        "label" : "Fastighetsskötare",
        "legacy_ams_taxonomy_id" : "5152"
      },
      "employment_type" : {
        "concept_id" : "PFZr_Syz_cUq",
        "label" : "Vanlig anställning",
        "legacy_ams_taxonomy_id" : "1"
      },
      "webpage_url" : "https://arbetsformedlingen.se/platsbanken/annonser/26356316",
      "driving_license_required" : true,
      "application_contacts" : [ ],
      "duration" : {
        "concept_id" : "a7uU_j21_mkL",
        "label" : "Tills vidare",
        "legacy_ams_taxonomy_id" : "1"
      },
      "nice_to_have" : {
        "education_level" : [ ],
        "work_experiences" : [ {
          "concept_id" : "9NVZ_LfD_vqT",
          "weight" : 5,
          "label" : "Fastighetstekniker/Drifttekniker, fastighet",
          "legacy_ams_taxonomy_id" : "2386"
        } ],
        "skills" : [ {
          "concept_id" : "rmuF_Dce_PPS",
          "weight" : 5,
          "label" : "Elarbeten, servicevana",
          "legacy_ams_taxonomy_id" : "607092"
        } ],
        "education" : [ ],
        "languages" : [ ]
      },
      "application_details" : {
        "via_af" : false,
        "email" : "hr@arcfast.se",
        "other" : null,
        "reference" : "Fastighetstekniker Östersund",
        "url" : null,
        "information" : null
      },
      "source_type" : "VIA_ANNONSERA",
      "application_deadline" : "2022-08-26T23:59:59",
      "external_id" : null,
      "workplace_address" : {
        "coordinates" : [ null, null ],
        "city" : null,
        "postcode" : null,
        "municipality" : null,
        "region_concept_id" : null,
        "region" : null,
        "country_code" : "199",
        "region_code" : null,
        "municipality_concept_id" : null,
        "country_concept_id" : "i46j_HmG_v64",
        "municipality_code" : null,
        "street_address" : null,
        "country" : "Sverige"
      },
      "id" : "26356316",
      "experience_required" : true,
      "working_hours_type" : {
        "concept_id" : "6YE1_gAC_R2G",
        "label" : "Heltid",
        "legacy_ams_taxonomy_id" : "1"
      },
      "access" : null,
      "timestamp" : 1658905135279,
      "must_have" : {
        "education_level" : [ ],
        "work_experiences" : [ ],
        "skills" : [ ],
        "education" : [ ],
        "languages" : [ {
          "concept_id" : "zSLA_vw2_FXN",
          "weight" : 10,
          "label" : "Svenska",
          "legacy_ams_taxonomy_id" : "502"
        } ]
      },
      "occupation_field" : {
        "concept_id" : "yhCP_AqT_tns",
        "label" : "Installation, drift, underhåll",
        "legacy_ams_taxonomy_id" : "10"
      },
      "scope_of_work" : {
        "min" : 0,
        "max" : 100
      },
      "salary_type" : {
        "concept_id" : "oG8G_9cW_nRf",
        "label" : "Fast månads- vecko- eller timlön",
        "legacy_ams_taxonomy_id" : "1"
      },
      "removed" : false,
      "salary_description" : null,
      "access_to_own_car" : false,
      "publication_date" : "2022-07-27T08:58:55"
    },
    "name" : "Fastighetstekniker",
    "user" : "kristof.fischer"
  },
  "sha1" : "3ca292c6a867f72498ae11240807a81144ef80bb",
  "annotations" : [ {
    "preferred-label" : "Fastighetstekniker/Drifttekniker, fastighet",
    "sentiment" : "MUST_HAVE",
    "type" : "occupation-name",
    "start-position" : 0,
    "end-position" : 18,
    "concept-id" : "9NVZ_LfD_vqT",
    "matched-string" : "fastighetstekniker",
    "annotation-id" : 0
  }, {
    "preferred-label" : "Fastighetstekniker/Drifttekniker, fastighet",
    "type" : "occupation-name",
    "start-position" : 46,
    "end-position" : 54,
    "concept-id" : "9NVZ_LfD_vqT",
    "matched-string" : "tekniker",
    "annotation-id" : 12
  }, {
    "preferred-label" : "Östersund",
    "type" : "municipality",
    "start-position" : 74,
    "end-position" : 83,
    "concept-id" : "Vt7P_856_WZS",
    "matched-string" : "Östersund",
    "annotation-id" : 13
  }, {
    "preferred-label" : "Fastighetstekniker/Drifttekniker, fastighet",
    "sentiment" : "MUST_HAVE",
    "type" : "occupation-name",
    "start-position" : 128,
    "end-position" : 146,
    "concept-id" : "9NVZ_LfD_vqT",
    "matched-string" : "fastighetstekniker",
    "annotation-id" : 2
  }, {
    "preferred-label" : "Fastighetstekniker/Drifttekniker, fastighet",
    "sentiment" : "MUST_HAVE",
    "type" : "occupation-name",
    "start-position" : 556,
    "end-position" : 574,
    "concept-id" : "9NVZ_LfD_vqT",
    "matched-string" : "fastighetstekniker",
    "annotation-id" : 5
  }, {
    "preferred-label" : "Växjö",
    "type" : "municipality",
    "start-position" : 1110,
    "end-position" : 1115,
    "concept-id" : "mmot_H3A_auW",
    "matched-string" : "Växjö",
    "annotation-id" : 14
  }, {
    "preferred-label" : "Älmhult",
    "type" : "municipality",
    "start-position" : 1117,
    "end-position" : 1124,
    "concept-id" : "EK6X_wZq_CQ8",
    "matched-string" : "Älmhult",
    "annotation-id" : 15
  }, {
    "preferred-label" : "Kalmar",
    "type" : "municipality",
    "start-position" : 1126,
    "end-position" : 1132,
    "concept-id" : "Pnmg_SgP_uHQ",
    "matched-string" : "Kalmar",
    "annotation-id" : 16
  }, {
    "preferred-label" : "Borgholm",
    "type" : "municipality",
    "start-position" : 1134,
    "end-position" : 1142,
    "concept-id" : "LY9i_qNL_kXf",
    "matched-string" : "Borgholm",
    "annotation-id" : 17
  }, {
    "preferred-label" : "Nybro",
    "type" : "municipality",
    "start-position" : 1144,
    "end-position" : 1149,
    "concept-id" : "xk68_bJa_6Fh",
    "matched-string" : "Nybro",
    "annotation-id" : 18
  }, {
    "preferred-label" : "Malmö",
    "type" : "municipality",
    "start-position" : 1151,
    "end-position" : 1156,
    "concept-id" : "oYPt_yRA_Smm",
    "matched-string" : "Malmö",
    "annotation-id" : 19
  }, {
    "preferred-label" : "Örnsköldsvik",
    "type" : "municipality",
    "start-position" : 1158,
    "end-position" : 1170,
    "concept-id" : "zBmE_n6s_MnQ",
    "matched-string" : "Örnsköldsvik",
    "annotation-id" : 20
  }, {
    "preferred-label" : "Östersund",
    "type" : "municipality",
    "start-position" : 1195,
    "end-position" : 1204,
    "concept-id" : "Vt7P_856_WZS",
    "matched-string" : "Östersund",
    "annotation-id" : 21
  }, {
    "preferred-label" : "Sverige",
    "type" : "country",
    "start-position" : 1400,
    "end-position" : 1407,
    "concept-id" : "i46j_HmG_v64",
    "matched-string" : "Sverige",
    "annotation-id" : 22
  }, {
    "preferred-label" : "1-2 års erfarenhet",
    "sentiment" : "MUST_HAVE",
    "type" : "occupation-experience-year",
    "start-position" : 1457,
    "end-position" : 1477,
    "concept-id" : "LLnd_5GJ_4ju",
    "matched-string" : "några års erfarenhet",
    "annotation-id" : 23
  }, {
    "preferred-label" : "VVS- och fastighetsinriktning, undervisning",
    "sentiment" : "MUST_HAVE",
    "type" : "skill",
    "start-position" : 1529,
    "end-position" : 1546,
    "concept-id" : "BcSr_7ZY_5nn",
    "matched-string" : "värme/ventilation",
    "annotation-id" : 24
  }, {
    "preferred-label" : "Brandteknik",
    "sentiment" : "MUST_HAVE",
    "type" : "skill",
    "start-position" : 1548,
    "end-position" : 1563,
    "concept-id" : "cRTW_MkF_2wh",
    "matched-string" : "brand/sprinkler",
    "annotation-id" : 25
  }, {
    "preferred-label" : "Certifikat, heta arbeten",
    "sentiment" : "MUST_HAVE",
    "type" : "skill",
    "start-position" : 1569,
    "end-position" : 1581,
    "concept-id" : "Q7eC_B7g_QiU",
    "matched-string" : "Heta arbeten",
    "annotation-id" : 26
  }, {
    "preferred-label" : "visa ansvarstagande",
    "sentiment" : "MUST_HAVE",
    "type" : "esco-skill",
    "start-position" : 1607,
    "end-position" : 1621,
    "concept-id" : "bcRp_hxV_f5G",
    "matched-string" : "ta eget ansvar",
    "annotation-id" : 27
  }, {
    "preferred-label" : "MS Office",
    "sentiment" : "MUST_HAVE",
    "type" : "skill",
    "start-position" : 1648,
    "end-position" : 1662,
    "concept-id" : "w8bU_wHe_omF",
    "matched-string" : "Office-paketet",
    "annotation-id" : 28
  }, {
    "preferred-label" : "Svenska",
    "sentiment" : "MUST_HAVE",
    "type" : "language",
    "start-position" : 1676,
    "end-position" : 1683,
    "concept-id" : "zSLA_vw2_FXN",
    "matched-string" : "svenska",
    "annotation-id" : 10
  }, {
    "preferred-label" : "Engelska",
    "sentiment" : "MUST_HAVE",
    "type" : "language",
    "start-position" : 1688,
    "end-position" : 1696,
    "concept-id" : "NVxJ_hLg_TYS",
    "matched-string" : "engelska",
    "annotation-id" : 11
  }, {
    "preferred-label" : "B",
    "sentiment" : "MUST_HAVE",
    "type" : "driving-licence",
    "start-position" : 1715,
    "end-position" : 1724,
    "concept-id" : "VTK8_WRx_GcM",
    "matched-string" : "B-körkort",
    "annotation-id" : 29
  } ],
  "text" : "Fastighetstekniker\nVi söker driven och social tekniker till vårt kontor i Östersund då vi fortsätter växa med nya uppdrag. \nSom fastighetstekniker hos oss på A.R.C får du en varierad, utmanande och inflytelserik roll i vårt gäng där ingen arbetsdag är den andra lik. Vi lägger stor vikt på rätt personlighet hos våra medarbetare, detta för att få ett sammansvetsat arbetslag och en rolig arbetsplats att komma till på morgonen. Ett engagerat servicetänk och ett trevligt bemötande är också viktigt då vi är ansiktet utåt åt våra kunder och hyresgäster.\nEn fastighetstekniker hos oss är ansvarig för ”sina” fastigheter och ser till att alla delar i förvaltningsavtalen sköts.\n\n\nArbetsuppgifter innefattar:\n·       Hantering av felanmälan och rapportering mot kund.\n·       Tillsyn och skötsel av värmecentraler, ventilation/kyla, brandlarm och sprinkler.\n·       Bevaka och medverka vid myndighetsbesiktningar.\n·       Delta och rapportera till driftmöten.\n·       Ta fram fastpriser vid mindre ombyggnationer och projekt.\n\n\nA.R.C Fastighetspartner startades sommaren 2020 och har sedan dess etablerat kontor i Växjö, Älmhult, Kalmar, Borgholm, Nybro, Malmö, Örnsköldsvik och nu inom kort även i Östersund. Vi har fått en flygande start och tror stenhårt på vår idé om att skapa arbetsplatser där man trivs. Vi har även höga ambitioner och tydligt satta mål och vill bli bästa fastighetsförvaltaren i Sverige. \nVi ser gärna att du som söker dig till oss har några års erfarenhet av fastighetstekniskt arbete med utbildningar inom värme/ventilation, brand/sprinkler samt Heta arbeten och att du tycker om att ta eget ansvar. Även goda kunskaper inom Office-paketet och hanterar svenska och engelska i tal och skrift.\nB-körkort är ett krav.\nGoda kunskaper inom El är meriterande men inte ett krav.\nRekrytering sker löpande så skynda in med ansökan innan tjänsten blir tillsatt."
}