{
  "meta" : {
    "jobad" : {
      "description" : {
        "requirements" : null,
        "needs" : null,
        "company_information" : null,
        "text_formatted" : "<p>Om jobbet</p><p>Rapid Säkerhet söker nu nya medarbetare att bli en del av vårat team.</p><p><strong>Vi söker Trygghetsvärdar till Stockholm Lokaltrafik. </strong></p><p>I rollen som trygghetsvärd ingår du i vårt team som arbetar dygnet runt. Därför bör du ha förutsättningar att kunna arbeta långa pass och varierande arbetstider. Vi söker säkerhetsmedvetna, organiserade och serviceinriktade personer som tycker om att arbeta under varierande arbetsuppgifter. Du som person behöver kunna hantera högt arbetstempo. Du behöver kunna arbeta självständigt men även kunna samarbeta bra i ett team. Som trygghetsvärd är din främsta uppgift att leverera trygghet, kontaktskapande och vara resenärer behjälplig.</p><p>Våra trygghetsvärdspatruller börjar och avslutar sina arbetspass i vår lokal i City.</p><p><strong>Du behöver vara tillgänglig 18 &amp; 21-22 /7</strong></p><p>Våra allmänna krav är:</p><p>- <strong>24 år </strong></p><p>- väktarutbildning (vu1+ vu2)</p><p>- vara ostraffad</p><p>-gymnasiekompetens</p><p>- god svenska i tal och skrift samt engelska i tal</p><p><br></p><p>Om Rapid Säkerhet AB</p><p>Verksamheten som ligger till grund för dagens Rapid koncern startades 1985. Dagens skepnadav Rapid har funnits sedan 1999 och sedan 2002 står Gabrielsson Invest som 100 % ägare. Rapid har utvecklats kraftigt de senaste åren och har en estimerad omsättning på ca 185 miljoner kronor och ca 350 anställda. Fokus för vår verksamhet har grundats i vår affärsidé och kvalitetspolicy som också genomsyrat verksamheten.</p><p><strong>Löneform</strong> Lön enligt kollektivavtalet</p><p>Arbetsgivaren</p><p>Rapid Säkerhet AB</p><p>Se företagsprofil</p><p>http://www.rapidsakerhet.se</p>",
        "conditions" : null,
        "text" : "Om jobbet\nRapid Säkerhet söker nu nya medarbetare att bli en del av vårat team.\nVi söker Trygghetsvärdar till Stockholm Lokaltrafik. \nI rollen som trygghetsvärd ingår du i vårt team som arbetar dygnet runt. Därför bör du ha förutsättningar att kunna arbeta långa pass och varierande arbetstider. Vi söker säkerhetsmedvetna, organiserade och serviceinriktade personer som tycker om att arbeta under varierande arbetsuppgifter. Du som person behöver kunna hantera högt arbetstempo. Du behöver kunna arbeta självständigt men även kunna samarbeta bra i ett team. Som trygghetsvärd är din främsta uppgift att leverera trygghet, kontaktskapande och vara resenärer behjälplig.\nVåra trygghetsvärdspatruller börjar och avslutar sina arbetspass i vår lokal i City.\nDu behöver vara tillgänglig 18 & 21-22 /7\nVåra allmänna krav är:\n- 24 år \n- väktarutbildning (vu1+ vu2)\n- vara ostraffad\n-gymnasiekompetens\n- god svenska i tal och skrift samt engelska i tal\n\n\nOm Rapid Säkerhet AB\nVerksamheten som ligger till grund för dagens Rapid koncern startades 1985. Dagens skepnadav Rapid har funnits sedan 1999 och sedan 2002 står Gabrielsson Invest som 100 % ägare. Rapid har utvecklats kraftigt de senaste åren och har en estimerad omsättning på ca 185 miljoner kronor och ca 350 anställda. Fokus för vår verksamhet har grundats i vår affärsidé och kvalitetspolicy som också genomsyrat verksamheten.\nLöneform Lön enligt kollektivavtalet\nArbetsgivaren\nRapid Säkerhet AB\nSe företagsprofil\nhttp://www.rapidsakerhet.se"
      },
      "headline" : "Trygghetsvärdar till SL (kollektivtrafik) ",
      "driving_license" : null,
      "employer" : {
        "email" : null,
        "phone_number" : null,
        "organization_number" : "5565653002",
        "name" : "Rapid Säkerhet AB",
        "url" : null,
        "workplace" : "Rapid Säkerhet AB"
      },
      "removed_date" : null,
      "logo_url" : null,
      "last_publication_date" : "2022-08-03T23:59:59",
      "number_of_vacancies" : 6,
      "occupation" : {
        "concept_id" : "mobn_aTk_jS6",
        "label" : "Väktare",
        "legacy_ams_taxonomy_id" : "5906"
      },
      "occupation_group" : {
        "concept_id" : "iqZh_3yX_i8n",
        "label" : "Väktare och ordningsvakter",
        "legacy_ams_taxonomy_id" : "5413"
      },
      "employment_type" : {
        "concept_id" : "1paU_aCR_nGn",
        "label" : "Behovsanställning",
        "legacy_ams_taxonomy_id" : "4"
      },
      "webpage_url" : "https://arbetsformedlingen.se/platsbanken/annonser/26291918",
      "driving_license_required" : false,
      "application_contacts" : [ {
        "description" : null,
        "email" : "petar.milic@rapidsakerhet.se",
        "telephone" : "08-564 22102",
        "name" : "Petar Milic",
        "contact_type" : "Samordnare"
      }, {
        "description" : null,
        "email" : "camilla.westberg@rapidsakerhet.se",
        "telephone" : "08-564 202 11",
        "name" : "Camilla Westberg",
        "contact_type" : "Rekryteringsansvarig "
      }, {
        "description" : null,
        "email" : "olivera.pobra@rapidsakerhet.se",
        "telephone" : "08-56422103",
        "name" : "Olivera  Pobra",
        "contact_type" : "HR-resurs"
      } ],
      "duration" : {
        "concept_id" : null,
        "label" : null,
        "legacy_ams_taxonomy_id" : null
      },
      "nice_to_have" : {
        "education_level" : [ ],
        "work_experiences" : [ {
          "concept_id" : "mobn_aTk_jS6",
          "weight" : 5,
          "label" : "Väktare",
          "legacy_ams_taxonomy_id" : "5906"
        } ],
        "skills" : [ ],
        "education" : [ ],
        "languages" : [ {
          "concept_id" : "zSLA_vw2_FXN",
          "weight" : 5,
          "label" : "Svenska",
          "legacy_ams_taxonomy_id" : "502"
        } ]
      },
      "application_details" : {
        "via_af" : false,
        "email" : "camilla.westberg@rapidsakerhet.se",
        "other" : null,
        "reference" : "SL TRV",
        "url" : null,
        "information" : null
      },
      "source_type" : "VIA_ANNONSERA",
      "application_deadline" : "2022-08-03T23:59:59",
      "external_id" : null,
      "workplace_address" : {
        "coordinates" : [ 17.93531655892736, 59.37261938906268 ],
        "city" : "Sundbyberg",
        "postcode" : "17457",
        "municipality" : "Sundbyberg",
        "region_concept_id" : "CifL_Rzy_Mku",
        "region" : "Stockholms län",
        "country_code" : "199",
        "region_code" : "01",
        "municipality_concept_id" : "UTJZ_zHH_mJm",
        "country_concept_id" : "i46j_HmG_v64",
        "municipality_code" : "0183",
        "street_address" : "Rissneleden 140",
        "country" : "Sverige"
      },
      "id" : "26291918",
      "experience_required" : true,
      "working_hours_type" : {
        "concept_id" : null,
        "label" : null,
        "legacy_ams_taxonomy_id" : null
      },
      "access" : null,
      "timestamp" : 1656945630783,
      "must_have" : {
        "education_level" : [ ],
        "work_experiences" : [ ],
        "skills" : [ {
          "concept_id" : "qsCj_EhM_fyT",
          "weight" : 10,
          "label" : "Väktarutbildning (grundutbildning)",
          "legacy_ams_taxonomy_id" : "6572"
        } ],
        "education" : [ ],
        "languages" : [ ]
      },
      "occupation_field" : {
        "concept_id" : "E7hm_BLq_fqZ",
        "label" : "Säkerhet och bevakning",
        "legacy_ams_taxonomy_id" : "17"
      },
      "scope_of_work" : {
        "min" : 0,
        "max" : null
      },
      "salary_type" : {
        "concept_id" : "oG8G_9cW_nRf",
        "label" : "Fast månads- vecko- eller timlön",
        "legacy_ams_taxonomy_id" : "1"
      },
      "removed" : false,
      "salary_description" : null,
      "access_to_own_car" : false,
      "publication_date" : "2022-07-04T16:40:30"
    },
    "name" : "Trygghetsvärdar till SL (kollektivtrafik) ",
    "user" : "hannes"
  },
  "sha1" : "3e4ba0090de1430c7415441b6f0e067b641e4643",
  "annotations" : [ {
    "preferred-label" : "Kollektivtrafik",
    "sentiment" : "MUST_HAVE",
    "type" : "sni-level-4",
    "start-position" : 25,
    "end-position" : 40,
    "concept-id" : "XVG5_tVe_RFd",
    "matched-string" : "kollektivtrafik",
    "annotation-id" : 0
  }, {
    "preferred-label" : "arbeta självständigt",
    "type" : "esco-skill",
    "start-position" : 540,
    "end-position" : 560,
    "concept-id" : "NyFu_HHd_zhz",
    "matched-string" : "arbeta självständigt",
    "annotation-id" : 3
  }, {
    "preferred-label" : "samarbeta med kolleger",
    "type" : "esco-skill",
    "start-position" : 576,
    "end-position" : 600,
    "concept-id" : "X15R_797_q62",
    "matched-string" : "samarbeta bra i ett team",
    "annotation-id" : 4
  }, {
    "preferred-label" : "Väktarutbildning (grundutbildning)",
    "type" : "skill",
    "start-position" : 874,
    "end-position" : 890,
    "concept-id" : "qsCj_EhM_fyT",
    "matched-string" : "väktarutbildning",
    "annotation-id" : 5
  }, {
    "preferred-label" : "Gymnasial utbildning, 3 år",
    "type" : "sun-education-level-2",
    "start-position" : 920,
    "end-position" : 937,
    "concept-id" : "7wEe_uui_q7S",
    "matched-string" : "gymnasiekompetens",
    "annotation-id" : 6
  }, {
    "preferred-label" : "Svenska",
    "sentiment" : "MUST_HAVE",
    "type" : "language",
    "start-position" : 944,
    "end-position" : 951,
    "concept-id" : "zSLA_vw2_FXN",
    "matched-string" : "svenska",
    "annotation-id" : 1
  }, {
    "preferred-label" : "Engelska",
    "sentiment" : "MUST_HAVE",
    "type" : "language",
    "start-position" : 974,
    "end-position" : 982,
    "concept-id" : "NVxJ_hLg_TYS",
    "matched-string" : "engelska",
    "annotation-id" : 2
  } ],
  "text" : "Trygghetsvärdar till SL (kollektivtrafik) \nOm jobbet\nRapid Säkerhet söker nu nya medarbetare att bli en del av vårat team.\nVi söker Trygghetsvärdar till Stockholm Lokaltrafik. \nI rollen som trygghetsvärd ingår du i vårt team som arbetar dygnet runt. Därför bör du ha förutsättningar att kunna arbeta långa pass och varierande arbetstider. Vi söker säkerhetsmedvetna, organiserade och serviceinriktade personer som tycker om att arbeta under varierande arbetsuppgifter. Du som person behöver kunna hantera högt arbetstempo. Du behöver kunna arbeta självständigt men även kunna samarbeta bra i ett team. Som trygghetsvärd är din främsta uppgift att leverera trygghet, kontaktskapande och vara resenärer behjälplig.\nVåra trygghetsvärdspatruller börjar och avslutar sina arbetspass i vår lokal i City.\nDu behöver vara tillgänglig 18 & 21-22 /7\nVåra allmänna krav är:\n- 24 år \n- väktarutbildning (vu1+ vu2)\n- vara ostraffad\n-gymnasiekompetens\n- god svenska i tal och skrift samt engelska i tal\n\n\nOm Rapid Säkerhet AB\nVerksamheten som ligger till grund för dagens Rapid koncern startades 1985. Dagens skepnadav Rapid har funnits sedan 1999 och sedan 2002 står Gabrielsson Invest som 100 % ägare. Rapid har utvecklats kraftigt de senaste åren och har en estimerad omsättning på ca 185 miljoner kronor och ca 350 anställda. Fokus för vår verksamhet har grundats i vår affärsidé och kvalitetspolicy som också genomsyrat verksamheten.\nLöneform Lön enligt kollektivavtalet\nArbetsgivaren\nRapid Säkerhet AB\nSe företagsprofil\nhttp://www.rapidsakerhet.se"
}