{
  "meta" : {
    "jobad" : {
      "description" : {
        "requirements" : null,
        "needs" : null,
        "company_information" : null,
        "text_formatted" : "I Kungälv mäts inte storheten i meter utan i det vi drömmer om, satsar på och åstadkommer tillsammans. Här finns ambitioner, stora hjärtan och visioner. I Kungälvs kommun finns spännande och viktiga yrken där du gör skillnad i människors vardag varje dag. Det är det som är storheten. Välkommen till Kungälv!\n\n\n\r\n\r\nBeskrivning\nKareby skola ligger cirka fem kilometer norr om Kungälv.\r\n\r\nPå Kareby skola går omkring 250 elever från förskoleklass till och med årskurs 6.\n\nHär finns tre fritidshem för de yngre barnen (F-3) och ett fritidshem för de äldre barnen (4-6). Kareby skola är den lilla skolan med anor från 1868. Vi vill att varje barn ska känna trygghet, bli bekräftad och bemött med respekt och förståelse. Vi arbetar aktivt med elevinflytande och genomför kompissamtal, elevråd och klassråd.\n\nVi söker nu två vikarierande fritidsledare under ett år, eventuellt längre.\n\nArbetsuppgifter\nDu arbetar på Kareby skola. Du ansvarar för fritidshemmet tillsammans med dina kollegor och har gemensamt ansvar för eleverna. Du ingår och arbetar i arbetslag.\nDu skapar en god fritidsverksamhet med grund i våra styrdokument. Tillsammans ger ni eleverna en trygg och stimulerande verksamhet på fritidshemmet.\n\nKvalifikationer\n - Du är skicklig i att leda din elevgrupp och skapar goda och trygga relationer med alla elever.\n - Du är intresserad av att alla elever skall lyckas och driver ett bra inkluderande arbete.\n - Din relationella kompetens är dokumenterat god och du är en trygg och stabil person som samarbetar med andra.\n - Du är kreativ och har lätt för att skapa stimulerande verksamhet för eleverna.\n - Du klarar ett självständigt arbete och har förmågan att ta egna initiativ.\n - Du är en duktig ledare i och utanför klassrummet och på fritidshemmet.\n - Du har ett gott omdöme och klarar att navigera i skolans alla krav och förväntningar.\n\nVi ser gärna att du har arbetat inom skola och fritids tidigare och har en god erfarenhet av undervisning och arbete med barn. Utbildning som fritidsledare är meriterande.\n\nStor vikt kommer läggas vid personliga egenskaper.\n\nUrvalsarbetet kommer pågå löpande under ansökningstiden, så vänta inte med din ansökan!\n\nÖvrigt\n\nAnsökan tas endast emot digitalt via kungalv.varbi.com.\nBetyg/intyg lämnas på begäran eller vid en eventuell intervju.\nTillsättning sker under förutsättning att tjänsten ej behöver tas i anspråk av befintlig personal på grund av övertalighet eller annan orsak.\nUrvalsprocessen sker löpande under ansökningstiden.\nVi tillämpar rökfri arbetstid och erbjuder våra medarbetare friskvårdsbidrag.\nVi undanber oss vänligt men bestämt all direktkontakt med bemannings- och rekryteringsföretag samt försäljare av ytterligare jobbannonser.\nKungälvs kommun har upphandlade avtal.",
        "conditions" : "100%. Tillträde: Enligt överenskommelse\r\nVisstidsanställning till ",
        "text" : "I Kungälv mäts inte storheten i meter utan i det vi drömmer om, satsar på och åstadkommer tillsammans. Här finns ambitioner, stora hjärtan och visioner. I Kungälvs kommun finns spännande och viktiga yrken där du gör skillnad i människors vardag varje dag. Det är det som är storheten. Välkommen till Kungälv!\n\n\n\r\n\r\nBeskrivning\nKareby skola ligger cirka fem kilometer norr om Kungälv.\r\n\r\nPå Kareby skola går omkring 250 elever från förskoleklass till och med årskurs 6.\n\nHär finns tre fritidshem för de yngre barnen (F-3) och ett fritidshem för de äldre barnen (4-6). Kareby skola är den lilla skolan med anor från 1868. Vi vill att varje barn ska känna trygghet, bli bekräftad och bemött med respekt och förståelse. Vi arbetar aktivt med elevinflytande och genomför kompissamtal, elevråd och klassråd.\n\nVi söker nu två vikarierande fritidsledare under ett år, eventuellt längre.\n\nArbetsuppgifter\nDu arbetar på Kareby skola. Du ansvarar för fritidshemmet tillsammans med dina kollegor och har gemensamt ansvar för eleverna. Du ingår och arbetar i arbetslag.\nDu skapar en god fritidsverksamhet med grund i våra styrdokument. Tillsammans ger ni eleverna en trygg och stimulerande verksamhet på fritidshemmet.\n\nKvalifikationer\n - Du är skicklig i att leda din elevgrupp och skapar goda och trygga relationer med alla elever.\n - Du är intresserad av att alla elever skall lyckas och driver ett bra inkluderande arbete.\n - Din relationella kompetens är dokumenterat god och du är en trygg och stabil person som samarbetar med andra.\n - Du är kreativ och har lätt för att skapa stimulerande verksamhet för eleverna.\n - Du klarar ett självständigt arbete och har förmågan att ta egna initiativ.\n - Du är en duktig ledare i och utanför klassrummet och på fritidshemmet.\n - Du har ett gott omdöme och klarar att navigera i skolans alla krav och förväntningar.\n\nVi ser gärna att du har arbetat inom skola och fritids tidigare och har en god erfarenhet av undervisning och arbete med barn. Utbildning som fritidsledare är meriterande.\n\nStor vikt kommer läggas vid personliga egenskaper.\n\nUrvalsarbetet kommer pågå löpande under ansökningstiden, så vänta inte med din ansökan!\n\nÖvrigt\n\nAnsökan tas endast emot digitalt via kungalv.varbi.com.\nBetyg/intyg lämnas på begäran eller vid en eventuell intervju.\nTillsättning sker under förutsättning att tjänsten ej behöver tas i anspråk av befintlig personal på grund av övertalighet eller annan orsak.\nUrvalsprocessen sker löpande under ansökningstiden.\nVi tillämpar rökfri arbetstid och erbjuder våra medarbetare friskvårdsbidrag.\nVi undanber oss vänligt men bestämt all direktkontakt med bemannings- och rekryteringsföretag samt försäljare av ytterligare jobbannonser.\nKungälvs kommun har upphandlade avtal."
      },
      "headline" : "Vi söker två vikarierande fritidsledare till Kareby Skola!",
      "driving_license" : null,
      "employer" : {
        "email" : null,
        "phone_number" : null,
        "organization_number" : "2120001371",
        "name" : "Kungälvs kommun",
        "url" : null,
        "workplace" : "Kungälvs kommun, Bildning och Lärande"
      },
      "removed_date" : null,
      "logo_url" : "https://www.arbetsformedlingen.se/rest/arbetsgivare/rest/af/v3/organisation/2120001371/logotyper/logo.png",
      "last_publication_date" : "2022-07-25T23:59:59",
      "number_of_vacancies" : 2,
      "occupation" : {
        "concept_id" : "ZnNn_D2K_pTi",
        "label" : "Fritidsledare",
        "legacy_ams_taxonomy_id" : "5725"
      },
      "occupation_group" : {
        "concept_id" : "aA2Z_9XX_R1v",
        "label" : "Fritidsledare m.fl.",
        "legacy_ams_taxonomy_id" : "3423"
      },
      "employment_type" : {
        "concept_id" : "PFZr_Syz_cUq",
        "label" : "Vanlig anställning",
        "legacy_ams_taxonomy_id" : "1"
      },
      "webpage_url" : "https://arbetsformedlingen.se/platsbanken/annonser/26307995",
      "driving_license_required" : false,
      "application_contacts" : [ {
        "description" : "Tanja Tajic Björkman",
        "email" : null,
        "telephone" : "0303-239250",
        "name" : null,
        "contact_type" : null
      } ],
      "duration" : {
        "concept_id" : "qQUd_4qe_NDT",
        "label" : "6 månader eller längre",
        "legacy_ams_taxonomy_id" : "2"
      },
      "nice_to_have" : {
        "education_level" : [ ],
        "work_experiences" : [ ],
        "skills" : [ ],
        "education" : [ ],
        "languages" : [ ]
      },
      "application_details" : {
        "via_af" : false,
        "email" : null,
        "other" : null,
        "reference" : "2022/433",
        "url" : "https://kungalv.varbi.com/what:job/jobID:529398/type:job/where:1/apply:1",
        "information" : null
      },
      "source_type" : "VIA_PLATSBANKEN_DXA",
      "application_deadline" : "2022-07-25T23:59:59",
      "external_id" : "46-212000-1371-529398",
      "workplace_address" : {
        "coordinates" : [ 11.974031, 57.869755 ],
        "city" : null,
        "postcode" : null,
        "municipality" : "Kungälv",
        "region_concept_id" : "zdoY_6u5_Krt",
        "region" : "Västra Götalands län",
        "country_code" : "199",
        "region_code" : "14",
        "municipality_concept_id" : "ZkZf_HbK_Mcr",
        "country_concept_id" : "i46j_HmG_v64",
        "municipality_code" : "1482",
        "street_address" : null,
        "country" : "Sverige"
      },
      "id" : "26307995",
      "experience_required" : false,
      "working_hours_type" : {
        "concept_id" : "6YE1_gAC_R2G",
        "label" : "Heltid",
        "legacy_ams_taxonomy_id" : "1"
      },
      "access" : null,
      "timestamp" : 1657266728094,
      "must_have" : {
        "education_level" : [ ],
        "work_experiences" : [ ],
        "skills" : [ ],
        "education" : [ ],
        "languages" : [ ]
      },
      "occupation_field" : {
        "concept_id" : "GazW_2TU_kJw",
        "label" : "Yrken med social inriktning",
        "legacy_ams_taxonomy_id" : "16"
      },
      "scope_of_work" : {
        "min" : 100,
        "max" : 100
      },
      "salary_type" : {
        "concept_id" : "oG8G_9cW_nRf",
        "label" : "Fast månads- vecko- eller timlön",
        "legacy_ams_taxonomy_id" : "1"
      },
      "removed" : false,
      "salary_description" : "Månadslön",
      "access_to_own_car" : false,
      "publication_date" : "2022-07-08T09:52:08"
    },
    "name" : "Vi söker två vikarierande fritidsledare till Kareby Skola!",
    "user" : "hannes"
  },
  "sha1" : "14617c85a053f0464e4f612ac812e2ab33ec5ef7",
  "annotations" : [ {
    "preferred-label" : "Fritidsledare",
    "sentiment" : "MUST_HAVE",
    "type" : "occupation-name",
    "start-position" : 26,
    "end-position" : 39,
    "concept-id" : "ZnNn_D2K_pTi",
    "matched-string" : "fritidsledare",
    "annotation-id" : 0
  }, {
    "preferred-label" : "Kungälv",
    "type" : "municipality",
    "start-position" : 61,
    "end-position" : 68,
    "concept-id" : "ZkZf_HbK_Mcr",
    "matched-string" : "Kungälv",
    "annotation-id" : 9
  }, {
    "preferred-label" : "Kungälv",
    "type" : "municipality",
    "start-position" : 214,
    "end-position" : 229,
    "concept-id" : "ZkZf_HbK_Mcr",
    "matched-string" : "Kungälvs kommun",
    "annotation-id" : 10
  }, {
    "preferred-label" : "Kungälv",
    "type" : "municipality",
    "start-position" : 359,
    "end-position" : 366,
    "concept-id" : "ZkZf_HbK_Mcr",
    "matched-string" : "Kungälv",
    "annotation-id" : 11
  }, {
    "preferred-label" : "Kungälv",
    "type" : "municipality",
    "start-position" : 434,
    "end-position" : 441,
    "concept-id" : "ZkZf_HbK_Mcr",
    "matched-string" : "Kungälv",
    "annotation-id" : 12
  }, {
    "preferred-label" : "Förskoleklass",
    "sentiment" : "MUST_HAVE",
    "type" : "sun-education-level-3",
    "start-position" : 490,
    "end-position" : 503,
    "concept-id" : "pCha_vWk_pbR",
    "matched-string" : "förskoleklass",
    "annotation-id" : 1
  }, {
    "preferred-label" : "Fritidshem",
    "sentiment" : "MUST_HAVE",
    "type" : "skill",
    "start-position" : 543,
    "end-position" : 553,
    "concept-id" : "Aq3e_Bdv_v45",
    "matched-string" : "fritidshem",
    "annotation-id" : 2
  }, {
    "preferred-label" : "Fritidshem",
    "sentiment" : "MUST_HAVE",
    "type" : "skill",
    "start-position" : 588,
    "end-position" : 598,
    "concept-id" : "Aq3e_Bdv_v45",
    "matched-string" : "fritidshem",
    "annotation-id" : 3
  }, {
    "preferred-label" : "Fritidsledare",
    "sentiment" : "MUST_HAVE",
    "type" : "occupation-name",
    "start-position" : 891,
    "end-position" : 904,
    "concept-id" : "ZnNn_D2K_pTi",
    "matched-string" : "fritidsledare",
    "annotation-id" : 4
  }, {
    "preferred-label" : "Fritidshem",
    "type" : "skill",
    "start-position" : 999,
    "end-position" : 1012,
    "concept-id" : "Aq3e_Bdv_v45",
    "matched-string" : "fritidshemmet",
    "annotation-id" : 13
  }, {
    "preferred-label" : "fritidsverksamhet",
    "type" : "esco-skill",
    "start-position" : 1133,
    "end-position" : 1150,
    "concept-id" : "dmTU_3DM_uW3",
    "matched-string" : "fritidsverksamhet",
    "annotation-id" : 14
  }, {
    "preferred-label" : "Fritidshem",
    "type" : "skill",
    "start-position" : 1250,
    "end-position" : 1263,
    "concept-id" : "Aq3e_Bdv_v45",
    "matched-string" : "fritidshemmet",
    "annotation-id" : 15
  }, {
    "preferred-label" : "arbeta självständigt",
    "type" : "esco-skill",
    "start-position" : 1685,
    "end-position" : 1705,
    "concept-id" : "NyFu_HHd_zhz",
    "matched-string" : "självständigt arbete",
    "annotation-id" : 16
  }, {
    "preferred-label" : "Fritidshem",
    "type" : "skill",
    "start-position" : 1805,
    "end-position" : 1818,
    "concept-id" : "Aq3e_Bdv_v45",
    "matched-string" : "fritidshemmet",
    "annotation-id" : 17
  }, {
    "preferred-label" : "Fritidshem",
    "type" : "skill",
    "start-position" : 1957,
    "end-position" : 1964,
    "concept-id" : "Aq3e_Bdv_v45",
    "matched-string" : "fritids",
    "annotation-id" : 18
  }, {
    "preferred-label" : "Undervisning",
    "sentiment" : "MUST_HAVE",
    "type" : "keyword",
    "start-position" : 2003,
    "end-position" : 2015,
    "concept-id" : "1Dtf_9iC_yAN",
    "matched-string" : "undervisning",
    "annotation-id" : 5
  }, {
    "preferred-label" : "Fritidsledare",
    "sentiment" : "MUST_HAVE",
    "type" : "occupation-name",
    "start-position" : 2052,
    "end-position" : 2065,
    "concept-id" : "ZnNn_D2K_pTi",
    "matched-string" : "fritidsledare",
    "annotation-id" : 6
  }, {
    "preferred-label" : "Personal",
    "sentiment" : "MUST_HAVE",
    "type" : "keyword",
    "start-position" : 2440,
    "end-position" : 2448,
    "concept-id" : "HVxM_6MS_y1c",
    "matched-string" : "personal",
    "annotation-id" : 8
  }, {
    "preferred-label" : "Kungälv",
    "type" : "municipality",
    "start-position" : 2762,
    "end-position" : 2777,
    "concept-id" : "ZkZf_HbK_Mcr",
    "matched-string" : "Kungälvs kommun",
    "annotation-id" : 19
  } ],
  "text" : "Vi söker två vikarierande fritidsledare till Kareby Skola!\nI Kungälv mäts inte storheten i meter utan i det vi drömmer om, satsar på och åstadkommer tillsammans. Här finns ambitioner, stora hjärtan och visioner. I Kungälvs kommun finns spännande och viktiga yrken där du gör skillnad i människors vardag varje dag. Det är det som är storheten. Välkommen till Kungälv!\n\n\n\r\n\r\nBeskrivning\nKareby skola ligger cirka fem kilometer norr om Kungälv.\r\n\r\nPå Kareby skola går omkring 250 elever från förskoleklass till och med årskurs 6.\n\nHär finns tre fritidshem för de yngre barnen (F-3) och ett fritidshem för de äldre barnen (4-6). Kareby skola är den lilla skolan med anor från 1868. Vi vill att varje barn ska känna trygghet, bli bekräftad och bemött med respekt och förståelse. Vi arbetar aktivt med elevinflytande och genomför kompissamtal, elevråd och klassråd.\n\nVi söker nu två vikarierande fritidsledare under ett år, eventuellt längre.\n\nArbetsuppgifter\nDu arbetar på Kareby skola. Du ansvarar för fritidshemmet tillsammans med dina kollegor och har gemensamt ansvar för eleverna. Du ingår och arbetar i arbetslag.\nDu skapar en god fritidsverksamhet med grund i våra styrdokument. Tillsammans ger ni eleverna en trygg och stimulerande verksamhet på fritidshemmet.\n\nKvalifikationer\n - Du är skicklig i att leda din elevgrupp och skapar goda och trygga relationer med alla elever.\n - Du är intresserad av att alla elever skall lyckas och driver ett bra inkluderande arbete.\n - Din relationella kompetens är dokumenterat god och du är en trygg och stabil person som samarbetar med andra.\n - Du är kreativ och har lätt för att skapa stimulerande verksamhet för eleverna.\n - Du klarar ett självständigt arbete och har förmågan att ta egna initiativ.\n - Du är en duktig ledare i och utanför klassrummet och på fritidshemmet.\n - Du har ett gott omdöme och klarar att navigera i skolans alla krav och förväntningar.\n\nVi ser gärna att du har arbetat inom skola och fritids tidigare och har en god erfarenhet av undervisning och arbete med barn. Utbildning som fritidsledare är meriterande.\n\nStor vikt kommer läggas vid personliga egenskaper.\n\nUrvalsarbetet kommer pågå löpande under ansökningstiden, så vänta inte med din ansökan!\n\nÖvrigt\n\nAnsökan tas endast emot digitalt via kungalv.varbi.com.\nBetyg/intyg lämnas på begäran eller vid en eventuell intervju.\nTillsättning sker under förutsättning att tjänsten ej behöver tas i anspråk av befintlig personal på grund av övertalighet eller annan orsak.\nUrvalsprocessen sker löpande under ansökningstiden.\nVi tillämpar rökfri arbetstid och erbjuder våra medarbetare friskvårdsbidrag.\nVi undanber oss vänligt men bestämt all direktkontakt med bemannings- och rekryteringsföretag samt försäljare av ytterligare jobbannonser.\nKungälvs kommun har upphandlade avtal."
}