{
  "meta" : {
    "jobad" : {
      "description" : {
        "requirements" : null,
        "needs" : null,
        "company_information" : null,
        "text_formatted" : "<p>Vi söker arbetare till plantering och skogsvård. Jobb med planteringsborr, planteringsrör och röjsåg.</p><p>Jobb from snarast i minst 2 månader. Till bra och duktiga arbetare vi kan erbjuda jobbet på längre tid, inklusive tillsvidareanställning.</p><p><br></p><p>Behov:</p><p>·        Mycket bra hälsa, pga arbete kräver fysisk ansträngning. </p><p>·        Efter några dagars arbete bör en viss standard utföras norm (ställ in standard beroende på ytan på vilken arbetet utförs).</p><p>·        Förmåga att arbeta i ett lag (2- 5 personer).</p><p>·        Ansvar och mycket god kvalitet på arbetet.</p><p>·        Lojalitet mot företaget.</p><p>·        Respekt för kollegor.</p><p>·        Stor fördel är erfarenhet av att arbeta i skogen och körkortet B. </p><p>·        Kunskaper i engelska och svenska är inte nödvändiga.</p><p>·        Gärna, personen interessade av långsiktigt samarbete.</p><p><br></p><p>Det mesta av plantering är ackordjobb. Pris per planta är från 0,72 sek per styck tom 1,237 sek per styck beroende på vilken typ av plantor (priset ingår semesterersättning och arbetstidskonto). Pris brutto.</p><p>Vid arbetet för timmen lägsta pris är 143,10 sek per timme brutto med semesterersättning och arbetstidskonto.</p><p>Skatter, försäkringar och pensionsavgifter betalas i Sverige.</p><p>Vi erbjuder heltidsjobb. Säsonganställning. Till bästa och duktiga arbetare vi kan erbjuda jobbet på längre tid, inklusive tillsvidareanställning.</p><p>Vi tillhandahåller arbetskläder, arbetsredskap och transport till arbetet med företagsbil.</p>",
        "conditions" : null,
        "text" : "Vi söker arbetare till plantering och skogsvård. Jobb med planteringsborr, planteringsrör och röjsåg.\nJobb from snarast i minst 2 månader. Till bra och duktiga arbetare vi kan erbjuda jobbet på längre tid, inklusive tillsvidareanställning.\n\n\nBehov:\n·        Mycket bra hälsa, pga arbete kräver fysisk ansträngning. \n·        Efter några dagars arbete bör en viss standard utföras norm (ställ in standard beroende på ytan på vilken arbetet utförs).\n·        Förmåga att arbeta i ett lag (2- 5 personer).\n·        Ansvar och mycket god kvalitet på arbetet.\n·        Lojalitet mot företaget.\n·        Respekt för kollegor.\n·        Stor fördel är erfarenhet av att arbeta i skogen och körkortet B. \n·        Kunskaper i engelska och svenska är inte nödvändiga.\n·        Gärna, personen interessade av långsiktigt samarbete.\n\n\nDet mesta av plantering är ackordjobb. Pris per planta är från 0,72 sek per styck tom 1,237 sek per styck beroende på vilken typ av plantor (priset ingår semesterersättning och arbetstidskonto). Pris brutto.\nVid arbetet för timmen lägsta pris är 143,10 sek per timme brutto med semesterersättning och arbetstidskonto.\nSkatter, försäkringar och pensionsavgifter betalas i Sverige.\nVi erbjuder heltidsjobb. Säsonganställning. Till bästa och duktiga arbetare vi kan erbjuda jobbet på längre tid, inklusive tillsvidareanställning.\nVi tillhandahåller arbetskläder, arbetsredskap och transport till arbetet med företagsbil."
      },
      "headline" : "skogsarbetare",
      "driving_license" : [ {
        "concept_id" : "VTK8_WRx_GcM",
        "label" : "B",
        "legacy_ams_taxonomy_id" : "3"
      } ],
      "employer" : {
        "email" : null,
        "phone_number" : null,
        "organization_number" : "9697668094",
        "name" : "Frelas Grönservice HB",
        "url" : "www.frelasgronservicegmail.com",
        "workplace" : "Frelas Grönservice HB"
      },
      "removed_date" : null,
      "logo_url" : null,
      "last_publication_date" : "2022-07-21T00:00:00",
      "number_of_vacancies" : 25,
      "occupation" : {
        "concept_id" : "7x9Q_FTM_6kQ",
        "label" : "Skogsarbetare, plantering",
        "legacy_ams_taxonomy_id" : "6957"
      },
      "occupation_group" : {
        "concept_id" : "qouP_wtb_93q",
        "label" : "Skogsarbetare",
        "legacy_ams_taxonomy_id" : "6210"
      },
      "employment_type" : {
        "concept_id" : "Jh8f_q9J_pbJ",
        "label" : "Sommarjobb / feriejobb",
        "legacy_ams_taxonomy_id" : "2"
      },
      "webpage_url" : "https://arbetsformedlingen.se/platsbanken/annonser/26244760",
      "driving_license_required" : true,
      "application_contacts" : [ {
        "description" : null,
        "email" : "mkolodziejfrelasgronservice@gmail.com",
        "telephone" : "0763412320",
        "name" : "Mateusz Kolodziej",
        "contact_type" : null
      } ],
      "duration" : {
        "concept_id" : "Xj7x_7yZ_jEn",
        "label" : "3 månader – upp till 6 månader",
        "legacy_ams_taxonomy_id" : "3"
      },
      "nice_to_have" : {
        "education_level" : [ ],
        "work_experiences" : [ ],
        "skills" : [ ],
        "education" : [ ],
        "languages" : [ {
          "concept_id" : "zSLA_vw2_FXN",
          "weight" : 5,
          "label" : "Svenska",
          "legacy_ams_taxonomy_id" : "502"
        }, {
          "concept_id" : "Gp9q_gTW_XAw",
          "weight" : 5,
          "label" : "Polska",
          "legacy_ams_taxonomy_id" : "415"
        }, {
          "concept_id" : "zkfD_Qwv_kTk",
          "weight" : 5,
          "label" : "Ukrainska",
          "legacy_ams_taxonomy_id" : "486"
        } ]
      },
      "application_details" : {
        "via_af" : false,
        "email" : "mkolodziejfrelasgronservice@gmail.com",
        "other" : null,
        "reference" : null,
        "url" : null,
        "information" : null
      },
      "source_type" : "VIA_ANNONSERA",
      "application_deadline" : "2022-07-21T00:00:00",
      "external_id" : null,
      "workplace_address" : {
        "coordinates" : [ 15.487536014119533, 56.73174821524984 ],
        "city" : "Eriksmåla",
        "postcode" : "36194",
        "municipality" : "Emmaboda",
        "region_concept_id" : "9QUH_2bb_6Np",
        "region" : "Kalmar län",
        "country_code" : "199",
        "region_code" : "08",
        "municipality_concept_id" : "1koj_6Bg_8K6",
        "country_concept_id" : "i46j_HmG_v64",
        "municipality_code" : "0862",
        "street_address" : "Marknadsvägen 22",
        "country" : "Sverige"
      },
      "id" : "26244760",
      "experience_required" : false,
      "working_hours_type" : {
        "concept_id" : "6YE1_gAC_R2G",
        "label" : "Heltid",
        "legacy_ams_taxonomy_id" : "1"
      },
      "access" : null,
      "timestamp" : 1655827315779,
      "must_have" : {
        "education_level" : [ ],
        "work_experiences" : [ ],
        "skills" : [ ],
        "education" : [ ],
        "languages" : [ ]
      },
      "occupation_field" : {
        "concept_id" : "VuuL_7CH_adj",
        "label" : "Naturbruk",
        "legacy_ams_taxonomy_id" : "13"
      },
      "scope_of_work" : {
        "min" : 0,
        "max" : 100
      },
      "salary_type" : {
        "concept_id" : "vVtj_qm6_GQu",
        "label" : "Rörlig ackords- eller provisionslön",
        "legacy_ams_taxonomy_id" : "8"
      },
      "removed" : false,
      "salary_description" : null,
      "access_to_own_car" : false,
      "publication_date" : "2022-06-21T18:01:55"
    },
    "name" : "skogsarbetare",
    "user" : "hannes"
  },
  "sha1" : "05bc5a14e773f54283dae1c2aafdd8e63030006d",
  "annotations" : [ {
    "preferred-label" : "Skogsarbetare, plantering",
    "sentiment" : "OFFERED",
    "type" : "occupation-name",
    "start-position" : 0,
    "end-position" : 13,
    "concept-id" : "7x9Q_FTM_6kQ",
    "matched-string" : "skogsarbetare",
    "annotation-id" : 0
  }, {
    "preferred-label" : "Skogsplantering",
    "sentiment" : "OFFERED",
    "type" : "skill",
    "start-position" : 37,
    "end-position" : 47,
    "concept-id" : "jnhn_HSM_2eC",
    "matched-string" : "plantering",
    "annotation-id" : 6
  }, {
    "preferred-label" : "Skogsvård",
    "sentiment" : "OFFERED",
    "type" : "skill",
    "start-position" : 52,
    "end-position" : 61,
    "concept-id" : "zve2_ooW_xhy",
    "matched-string" : "skogsvård",
    "annotation-id" : 1
  }, {
    "preferred-label" : "Tillsvidareanställning (inkl. eventuell provanställning)",
    "type" : "employment-type",
    "start-position" : 230,
    "end-position" : 252,
    "concept-id" : "kpPX_CNN_gDU",
    "matched-string" : "tillsvidareanställning",
    "annotation-id" : 7
  }, {
    "preferred-label" : "samarbeta med kolleger",
    "sentiment" : "MUST_HAVE",
    "type" : "esco-skill",
    "start-position" : 483,
    "end-position" : 499,
    "concept-id" : "X15R_797_q62",
    "matched-string" : "arbeta i ett lag",
    "annotation-id" : 8
  }, {
    "preferred-label" : "B",
    "sentiment" : "MUST_HAVE",
    "type" : "driving-licence",
    "start-position" : 696,
    "end-position" : 708,
    "concept-id" : "VTK8_WRx_GcM",
    "matched-string" : "körkortet B.",
    "annotation-id" : 9
  }, {
    "preferred-label" : "Engelska",
    "sentiment" : "NICE_TO_HAVE",
    "type" : "language",
    "start-position" : 731,
    "end-position" : 739,
    "concept-id" : "NVxJ_hLg_TYS",
    "matched-string" : "engelska",
    "annotation-id" : 3
  }, {
    "preferred-label" : "Svenska",
    "sentiment" : "NICE_TO_HAVE",
    "type" : "language",
    "start-position" : 744,
    "end-position" : 751,
    "concept-id" : "zSLA_vw2_FXN",
    "matched-string" : "svenska",
    "annotation-id" : 4
  }, {
    "preferred-label" : "Skogsplantering",
    "sentiment" : "OFFERED",
    "type" : "skill",
    "start-position" : 850,
    "end-position" : 860,
    "concept-id" : "jnhn_HSM_2eC",
    "matched-string" : "plantering",
    "annotation-id" : 11
  }, {
    "preferred-label" : "Rörlig ackords- eller provisionslön",
    "sentiment" : "OFFERED",
    "type" : "wage-type",
    "start-position" : 864,
    "end-position" : 874,
    "concept-id" : "vVtj_qm6_GQu",
    "matched-string" : "ackordjobb",
    "annotation-id" : 10
  }, {
    "preferred-label" : "Heltid",
    "sentiment" : "OFFERED",
    "type" : "worktime-extent",
    "start-position" : 1229,
    "end-position" : 1240,
    "concept-id" : "6YE1_gAC_R2G",
    "matched-string" : "heltidsjobb",
    "annotation-id" : 12
  }, {
    "preferred-label" : "Säsongsanställning",
    "sentiment" : "OFFERED",
    "type" : "employment-type",
    "start-position" : 1242,
    "end-position" : 1259,
    "concept-id" : "EBhX_Qm2_8eX",
    "matched-string" : "Säsonganställning",
    "annotation-id" : 13
  }, {
    "preferred-label" : "Tillsvidareanställning (inkl. eventuell provanställning)",
    "sentiment" : "OFFERED",
    "type" : "employment-type",
    "start-position" : 1340,
    "end-position" : 1362,
    "concept-id" : "kpPX_CNN_gDU",
    "matched-string" : "tillsvidareanställning",
    "annotation-id" : 14
  } ],
  "text" : "skogsarbetare\nVi söker arbetare till plantering och skogsvård. Jobb med planteringsborr, planteringsrör och röjsåg.\nJobb from snarast i minst 2 månader. Till bra och duktiga arbetare vi kan erbjuda jobbet på längre tid, inklusive tillsvidareanställning.\n\n\nBehov:\n·        Mycket bra hälsa, pga arbete kräver fysisk ansträngning. \n·        Efter några dagars arbete bör en viss standard utföras norm (ställ in standard beroende på ytan på vilken arbetet utförs).\n·        Förmåga att arbeta i ett lag (2- 5 personer).\n·        Ansvar och mycket god kvalitet på arbetet.\n·        Lojalitet mot företaget.\n·        Respekt för kollegor.\n·        Stor fördel är erfarenhet av att arbeta i skogen och körkortet B. \n·        Kunskaper i engelska och svenska är inte nödvändiga.\n·        Gärna, personen interessade av långsiktigt samarbete.\n\n\nDet mesta av plantering är ackordjobb. Pris per planta är från 0,72 sek per styck tom 1,237 sek per styck beroende på vilken typ av plantor (priset ingår semesterersättning och arbetstidskonto). Pris brutto.\nVid arbetet för timmen lägsta pris är 143,10 sek per timme brutto med semesterersättning och arbetstidskonto.\nSkatter, försäkringar och pensionsavgifter betalas i Sverige.\nVi erbjuder heltidsjobb. Säsonganställning. Till bästa och duktiga arbetare vi kan erbjuda jobbet på längre tid, inklusive tillsvidareanställning.\nVi tillhandahåller arbetskläder, arbetsredskap och transport till arbetet med företagsbil."
}