{
  "meta" : {
    "jobad" : {
      "description" : {
        "requirements" : null,
        "needs" : null,
        "company_information" : null,
        "text_formatted" : "<p>I mer än 130 år har Johnson &amp; Johnson värnat om mångfald, rättvisa och inkludering. Detta är en stor del av vår företagskultur och inbyggt i hur vi varje dag gör affärer och för dialoger. Vårt åtagande att värna om respekt och mångfald hos de personer och verksamheter som vi arbetar med är starkt integrerat i vårt Credo som är vårt löfte riktat till patienter, medarbetare, samhälle och ägare.</p><p> </p><p>Johnson &amp; Johnson i Sverige värdesätter våra medarbetare som vår främsta tillgång. Varje medarbetare bidrar med en unik mix av erfarenheter, bakgrunder, perspektiv och upplevelser och tillsammans möjliggör det att vi bättre kan hjälpa den breda mångfalden bland konsumenter runt om i världen och i vår region.</p><p> </p><p>Vi arbetar aktivt för att skapa en inkluderande miljö där våra olikheter värdesätts / uppskattas och där alla anställda känner att de tillhör och kan nå sin fulla potential. Oavsett vem de är.</p><p> </p><p>Mångfald, rättvisa och inkludering på Johnson &amp; Johnson betyder \"Du tillhör\"!</p><p> </p><p>Om McNeil AB - Ett Johnson &amp; Johnson Företag</p><p>I Helsingborg tillverkas &amp; packas Rhinocort och Nicorette-produkter för den globala marknaden. Förutom produktion har vi även en stor enhet för forskning och utveckling som arbetar inom tre områden: Smoking Cessation, Digestive Health samt Cough &amp; Cold. Vi finns i Helsingborg och med cirka 700 anställda är vi ett av regionens största och viktigaste företag. Läs mer om oss på www.mcneilab.se</p><p><br></p><p> </p><p>Vi Söker Nu Maskinoperatörer Till Vår Produktion</p><p>Vill du vara en del av vår fortsatta utveckling mot effektiva och högpresterande avdelningar? För oss på Johnson &amp; Johnson värdesätter vi en hög teamkänsla, som vi ser som den viktigaste pusselbiten för att uppnå de bästa resultaten. Vi följer gällande kollektivavtal och erbjuder attraktiva förmåner såsom t.ex. viss flextid och subventionerad lunch som går att beställa från vår trevliga matsal. Vi söker dig som kan jobba heltid och det förekommer flera olika skiftesformer såsom dagtid, tvåskift, 3 skift, 5 skift, ständigt nattskift och ständig helgskift. Anställningsformen är visstid första 12 månaderna och därefter möjlighet till fast tjänst.</p><p><br></p><p> </p><p>Arbetsuppgifter</p><ul><li>Drift av processutrustning inklusive rengöring av utrustning</li><li>Demontering/montering av utrustning</li><li>Processkontroll &amp; dokumenthantering</li><li>Avfallshantering och materialbeställning</li><li>Förebyggande underhåll &amp; ständiga förbättringar</li><li>Truckhantering</li></ul><p><br></p><p>Kvalifikationer</p><ul><li>Gymnasial utbildning (krav)</li><li>Goda kunskaper i svenska språket, verbalt och skriftligt (krav).</li><li>Grundläggande kunskaper i engelska språket, verbalt och skriftligt (krav).</li><li>Grundläggande datorförståelse, t.ex Microsoft Office (krav) samt erfarenhet av PAS-X (meriterande).</li><li>Styrsystem och teknisk kunskap (meriterande)</li><li>Flexibel till att arbeta olika skiftesformer (merit)</li><li>Inneha truckkort A2, B1 (meriterande)</li></ul><p> </p><p>Vad Du Behöver För Att Lyckas</p><p>Du är en lagspelare med ett stort egenansvar. Du är en engagerad person som aktivt vill medverka till förbättring av processer och rutiner. Arbetet kräver att du har förmågan att arbeta noggrant med dina arbetsuppgifter. Du är en resultatinriktad person som sätter värde på att uppnå våra KPIer.</p><p><br></p><p> </p><p> Ansökan</p><p>Är du intresserad av tjänsten vill vi veta mer om din bakgrund och vad du kan bidra med. Bifoga ditt CV och personliga brev i ansökan och du kommer få vidare information via mail. Alla ansökanden kommer få återkoppling på sin ansökan. Om du möter kvalifikationerna kommer du inom 14 dagar få inbjudan att göra två digitala för att komma vidare i processen. För din information, som del av rekryteringsprocessen så genomförs en hälsoundersökning samt drogtest för slutkandidater.</p><p>För fackliga frågor, vänligen kontakta någon av följande: Marigona Bala: IF Metall, mbala1@ITS.JNJ.com. Om du stöter på tekniska problem kopplat till din ansökan kan du få hjälp på denna sida https://www.careers.jnj.com/contactus-faq</p>",
        "conditions" : null,
        "text" : "I mer än 130 år har Johnson & Johnson värnat om mångfald, rättvisa och inkludering. Detta är en stor del av vår företagskultur och inbyggt i hur vi varje dag gör affärer och för dialoger. Vårt åtagande att värna om respekt och mångfald hos de personer och verksamheter som vi arbetar med är starkt integrerat i vårt Credo som är vårt löfte riktat till patienter, medarbetare, samhälle och ägare.\n \nJohnson & Johnson i Sverige värdesätter våra medarbetare som vår främsta tillgång. Varje medarbetare bidrar med en unik mix av erfarenheter, bakgrunder, perspektiv och upplevelser och tillsammans möjliggör det att vi bättre kan hjälpa den breda mångfalden bland konsumenter runt om i världen och i vår region.\n \nVi arbetar aktivt för att skapa en inkluderande miljö där våra olikheter värdesätts / uppskattas och där alla anställda känner att de tillhör och kan nå sin fulla potential. Oavsett vem de är.\n \nMångfald, rättvisa och inkludering på Johnson & Johnson betyder \"Du tillhör\"!\n \nOm McNeil AB - Ett Johnson & Johnson Företag\nI Helsingborg tillverkas & packas Rhinocort och Nicorette-produkter för den globala marknaden. Förutom produktion har vi även en stor enhet för forskning och utveckling som arbetar inom tre områden: Smoking Cessation, Digestive Health samt Cough & Cold. Vi finns i Helsingborg och med cirka 700 anställda är vi ett av regionens största och viktigaste företag. Läs mer om oss på www.mcneilab.se\n\n\n \nVi Söker Nu Maskinoperatörer Till Vår Produktion\nVill du vara en del av vår fortsatta utveckling mot effektiva och högpresterande avdelningar? För oss på Johnson & Johnson värdesätter vi en hög teamkänsla, som vi ser som den viktigaste pusselbiten för att uppnå de bästa resultaten. Vi följer gällande kollektivavtal och erbjuder attraktiva förmåner såsom t.ex. viss flextid och subventionerad lunch som går att beställa från vår trevliga matsal. Vi söker dig som kan jobba heltid och det förekommer flera olika skiftesformer såsom dagtid, tvåskift, 3 skift, 5 skift, ständigt nattskift och ständig helgskift. Anställningsformen är visstid första 12 månaderna och därefter möjlighet till fast tjänst.\n\n\n \nArbetsuppgifter\nDrift av processutrustning inklusive rengöring av utrustning\nDemontering/montering av utrustning\nProcesskontroll & dokumenthantering\nAvfallshantering och materialbeställning\nFörebyggande underhåll & ständiga förbättringar\nTruckhantering\n\n\n\nKvalifikationer\nGymnasial utbildning (krav)\nGoda kunskaper i svenska språket, verbalt och skriftligt (krav).\nGrundläggande kunskaper i engelska språket, verbalt och skriftligt (krav).\nGrundläggande datorförståelse, t.ex Microsoft Office (krav) samt erfarenhet av PAS-X (meriterande).\nStyrsystem och teknisk kunskap (meriterande)\nFlexibel till att arbeta olika skiftesformer (merit)\nInneha truckkort A2, B1 (meriterande)\n\n \nVad Du Behöver För Att Lyckas\nDu är en lagspelare med ett stort egenansvar. Du är en engagerad person som aktivt vill medverka till förbättring av processer och rutiner. Arbetet kräver att du har förmågan att arbeta noggrant med dina arbetsuppgifter. Du är en resultatinriktad person som sätter värde på att uppnå våra KPIer.\n\n\n \n Ansökan\nÄr du intresserad av tjänsten vill vi veta mer om din bakgrund och vad du kan bidra med. Bifoga ditt CV och personliga brev i ansökan och du kommer få vidare information via mail. Alla ansökanden kommer få återkoppling på sin ansökan. Om du möter kvalifikationerna kommer du inom 14 dagar få inbjudan att göra två digitala för att komma vidare i processen. För din information, som del av rekryteringsprocessen så genomförs en hälsoundersökning samt drogtest för slutkandidater.\nFör fackliga frågor, vänligen kontakta någon av följande: Marigona Bala: IF Metall, mbala1@ITS.JNJ.com. Om du stöter på tekniska problem kopplat till din ansökan kan du få hjälp på denna sida https://www.careers.jnj.com/contactus-faq"
      },
      "headline" : "Maskinoperatör Nicorette & Rhinocort Produktion - McNeil AB",
      "driving_license" : null,
      "employer" : {
        "email" : null,
        "phone_number" : null,
        "organization_number" : "5560632514",
        "name" : "Johnson & Johnson AB",
        "url" : "www.careers.jnj.com",
        "workplace" : "Johnson & Johnson Consumer Health Helsingborg"
      },
      "removed_date" : null,
      "logo_url" : "https://www.arbetsformedlingen.se/rest/arbetsgivare/rest/af/v3/arbetsplatser/87353251/logotyper/logo.png",
      "last_publication_date" : "2022-08-14T23:59:59",
      "number_of_vacancies" : 5,
      "occupation" : {
        "concept_id" : "Xkb2_9Nx_4xR",
        "label" : "Maskinoperatör, läkemedel",
        "legacy_ams_taxonomy_id" : "6409"
      },
      "occupation_group" : {
        "concept_id" : "rxmK_wwM_1NA",
        "label" : "Maskinoperatörer, farmaceutiska produkter",
        "legacy_ams_taxonomy_id" : "8131"
      },
      "employment_type" : {
        "concept_id" : "PFZr_Syz_cUq",
        "label" : "Vanlig anställning",
        "legacy_ams_taxonomy_id" : "1"
      },
      "webpage_url" : "https://arbetsformedlingen.se/platsbanken/annonser/26373137",
      "driving_license_required" : false,
      "application_contacts" : [ ],
      "duration" : {
        "concept_id" : "Xj7x_7yZ_jEn",
        "label" : "3 månader – upp till 6 månader",
        "legacy_ams_taxonomy_id" : "3"
      },
      "nice_to_have" : {
        "education_level" : [ ],
        "work_experiences" : [ ],
        "skills" : [ {
          "concept_id" : "iSWP_AHA_BSj",
          "weight" : 5,
          "label" : "Läkemedelsindustri",
          "legacy_ams_taxonomy_id" : "3598"
        }, {
          "concept_id" : "AP6y_xf5_4WK",
          "weight" : 5,
          "label" : "Livsmedelsindustri",
          "legacy_ams_taxonomy_id" : "3503"
        }, {
          "concept_id" : "w8bU_wHe_omF",
          "weight" : 5,
          "label" : "MS Office",
          "legacy_ams_taxonomy_id" : "608767"
        }, {
          "concept_id" : "ijHY_aHk_ADE",
          "weight" : 5,
          "label" : "Terminal- och lagerarbete",
          "legacy_ams_taxonomy_id" : "5947"
        } ],
        "education" : [ ],
        "languages" : [ ]
      },
      "application_details" : {
        "via_af" : false,
        "email" : null,
        "other" : null,
        "reference" : null,
        "url" : "https://jobs.jnj.com/jobs/2206049292W?lang=en-us&previousLocale=en-US",
        "information" : null
      },
      "source_type" : "VIA_ANNONSERA",
      "application_deadline" : "2022-08-14T23:59:59",
      "external_id" : null,
      "workplace_address" : {
        "coordinates" : [ 12.703007161598103, 56.05562657812657 ],
        "city" : "Helsingborg",
        "postcode" : "25442",
        "municipality" : "Helsingborg",
        "region_concept_id" : "CaRE_1nn_cSU",
        "region" : "Skåne län",
        "country_code" : "199",
        "region_code" : "12",
        "municipality_concept_id" : "qj3q_oXH_MGR",
        "country_concept_id" : "i46j_HmG_v64",
        "municipality_code" : "1283",
        "street_address" : "Norrbroplatsen 2",
        "country" : "Sverige"
      },
      "id" : "26373137",
      "experience_required" : true,
      "working_hours_type" : {
        "concept_id" : "6YE1_gAC_R2G",
        "label" : "Heltid",
        "legacy_ams_taxonomy_id" : "1"
      },
      "access" : null,
      "timestamp" : 1659503260335,
      "must_have" : {
        "education_level" : [ ],
        "work_experiences" : [ ],
        "skills" : [ ],
        "education" : [ ],
        "languages" : [ {
          "concept_id" : "zSLA_vw2_FXN",
          "weight" : 10,
          "label" : "Svenska",
          "legacy_ams_taxonomy_id" : "502"
        }, {
          "concept_id" : "NVxJ_hLg_TYS",
          "weight" : 10,
          "label" : "Engelska",
          "legacy_ams_taxonomy_id" : "283"
        } ]
      },
      "occupation_field" : {
        "concept_id" : "wTEr_CBC_bqh",
        "label" : "Industriell tillverkning",
        "legacy_ams_taxonomy_id" : "9"
      },
      "scope_of_work" : {
        "min" : 0,
        "max" : 100
      },
      "salary_type" : {
        "concept_id" : "oG8G_9cW_nRf",
        "label" : "Fast månads- vecko- eller timlön",
        "legacy_ams_taxonomy_id" : "1"
      },
      "removed" : false,
      "salary_description" : null,
      "access_to_own_car" : false,
      "publication_date" : "2022-08-03T07:04:20"
    },
    "name" : "Maskinoperatör Nicorette & Rhinocort Produktion - McNeil AB",
    "user" : "hannes"
  },
  "sha1" : "ebd0cc66bdc64c17de44eac579a3720755c40112",
  "annotations" : [ {
    "preferred-label" : "Process- och maskinoperatörer",
    "type" : "ssyk-level-2",
    "start-position" : 0,
    "end-position" : 14,
    "concept-id" : "XnLr_FQp_c82",
    "matched-string" : "Maskinoperatör",
    "annotation-id" : 11
  }, {
    "preferred-label" : "Helsingborg",
    "type" : "municipality",
    "start-position" : 1092,
    "end-position" : 1103,
    "concept-id" : "qj3q_oXH_MGR",
    "matched-string" : "Helsingborg",
    "annotation-id" : 12
  }, {
    "preferred-label" : "Helsingborg",
    "type" : "municipality",
    "start-position" : 1355,
    "end-position" : 1366,
    "concept-id" : "qj3q_oXH_MGR",
    "matched-string" : "Helsingborg",
    "annotation-id" : 13
  }, {
    "preferred-label" : "Process- och maskinoperatörer",
    "type" : "ssyk-level-2",
    "start-position" : 1500,
    "end-position" : 1516,
    "concept-id" : "XnLr_FQp_c82",
    "matched-string" : "Maskinoperatörer",
    "annotation-id" : 14
  }, {
    "preferred-label" : "Kollektivavtal",
    "sentiment" : "MUST_HAVE",
    "type" : "skill",
    "start-position" : 1790,
    "end-position" : 1804,
    "concept-id" : "z7wE_9xb_3jX",
    "matched-string" : "kollektivavtal",
    "annotation-id" : 0
  }, {
    "preferred-label" : "Heltid",
    "type" : "worktime-extent",
    "start-position" : 1962,
    "end-position" : 1968,
    "concept-id" : "6YE1_gAC_R2G",
    "matched-string" : "heltid",
    "annotation-id" : 15
  }, {
    "preferred-label" : "Demontering",
    "sentiment" : "MUST_HAVE",
    "type" : "skill",
    "start-position" : 2270,
    "end-position" : 2281,
    "concept-id" : "f8Sz_Xaf_TEU",
    "matched-string" : "demontering",
    "annotation-id" : 1
  }, {
    "preferred-label" : "avfallshantering",
    "sentiment" : "MUST_HAVE",
    "type" : "esco-skill",
    "start-position" : 2342,
    "end-position" : 2358,
    "concept-id" : "gnUk_f4X_HnN",
    "matched-string" : "avfallshantering",
    "annotation-id" : 2
  }, {
    "preferred-label" : "Ständiga förbättringar/Lean",
    "sentiment" : "MUST_HAVE",
    "type" : "skill",
    "start-position" : 2408,
    "end-position" : 2430,
    "concept-id" : "74Mw_JUN_VKx",
    "matched-string" : "ständiga förbättringar",
    "annotation-id" : 3
  }, {
    "preferred-label" : "Gymnasial utbildning",
    "sentiment" : "MUST_HAVE",
    "type" : "sun-education-level-1",
    "start-position" : 2465,
    "end-position" : 2485,
    "concept-id" : "wyLL_K3a_HRC",
    "matched-string" : "gymnasial utbildning",
    "annotation-id" : 4
  }, {
    "preferred-label" : "Svenska språket",
    "sentiment" : "MUST_HAVE",
    "type" : "keyword",
    "start-position" : 2510,
    "end-position" : 2525,
    "concept-id" : "BiGm_58D_SSn",
    "matched-string" : "svenska språket",
    "annotation-id" : 5
  }, {
    "preferred-label" : "Engelska",
    "sentiment" : "MUST_HAVE",
    "type" : "language",
    "start-position" : 2584,
    "end-position" : 2592,
    "concept-id" : "NVxJ_hLg_TYS",
    "matched-string" : "engelska",
    "annotation-id" : 6
  }, {
    "preferred-label" : "MS Office",
    "sentiment" : "MUST_HAVE",
    "type" : "skill",
    "start-position" : 2669,
    "end-position" : 2685,
    "concept-id" : "w8bU_wHe_omF",
    "matched-string" : "microsoft office",
    "annotation-id" : 7
  }, {
    "preferred-label" : "A-truckar",
    "type" : "skill",
    "start-position" : 2848,
    "end-position" : 2850,
    "concept-id" : "Zk4h_jP4_e85",
    "matched-string" : "A2",
    "annotation-id" : 16
  }, {
    "preferred-label" : "B-truckar",
    "type" : "skill",
    "start-position" : 2852,
    "end-position" : 2854,
    "concept-id" : "HeXq_amc_ABd",
    "matched-string" : "B1",
    "annotation-id" : 17
  }, {
    "preferred-label" : "noggrannhet",
    "type" : "esco-skill",
    "start-position" : 3088,
    "end-position" : 3096,
    "concept-id" : "mrsW_EkL_KRD",
    "matched-string" : "noggrant",
    "annotation-id" : 18
  } ],
  "text" : "Maskinoperatör Nicorette & Rhinocort Produktion - McNeil AB\nI mer än 130 år har Johnson & Johnson värnat om mångfald, rättvisa och inkludering. Detta är en stor del av vår företagskultur och inbyggt i hur vi varje dag gör affärer och för dialoger. Vårt åtagande att värna om respekt och mångfald hos de personer och verksamheter som vi arbetar med är starkt integrerat i vårt Credo som är vårt löfte riktat till patienter, medarbetare, samhälle och ägare.\n \nJohnson & Johnson i Sverige värdesätter våra medarbetare som vår främsta tillgång. Varje medarbetare bidrar med en unik mix av erfarenheter, bakgrunder, perspektiv och upplevelser och tillsammans möjliggör det att vi bättre kan hjälpa den breda mångfalden bland konsumenter runt om i världen och i vår region.\n \nVi arbetar aktivt för att skapa en inkluderande miljö där våra olikheter värdesätts / uppskattas och där alla anställda känner att de tillhör och kan nå sin fulla potential. Oavsett vem de är.\n \nMångfald, rättvisa och inkludering på Johnson & Johnson betyder \"Du tillhör\"!\n \nOm McNeil AB - Ett Johnson & Johnson Företag\nI Helsingborg tillverkas & packas Rhinocort och Nicorette-produkter för den globala marknaden. Förutom produktion har vi även en stor enhet för forskning och utveckling som arbetar inom tre områden: Smoking Cessation, Digestive Health samt Cough & Cold. Vi finns i Helsingborg och med cirka 700 anställda är vi ett av regionens största och viktigaste företag. Läs mer om oss på www.mcneilab.se\n\n\n \nVi Söker Nu Maskinoperatörer Till Vår Produktion\nVill du vara en del av vår fortsatta utveckling mot effektiva och högpresterande avdelningar? För oss på Johnson & Johnson värdesätter vi en hög teamkänsla, som vi ser som den viktigaste pusselbiten för att uppnå de bästa resultaten. Vi följer gällande kollektivavtal och erbjuder attraktiva förmåner såsom t.ex. viss flextid och subventionerad lunch som går att beställa från vår trevliga matsal. Vi söker dig som kan jobba heltid och det förekommer flera olika skiftesformer såsom dagtid, tvåskift, 3 skift, 5 skift, ständigt nattskift och ständig helgskift. Anställningsformen är visstid första 12 månaderna och därefter möjlighet till fast tjänst.\n\n\n \nArbetsuppgifter\nDrift av processutrustning inklusive rengöring av utrustning\nDemontering/montering av utrustning\nProcesskontroll & dokumenthantering\nAvfallshantering och materialbeställning\nFörebyggande underhåll & ständiga förbättringar\nTruckhantering\n\n\n\nKvalifikationer\nGymnasial utbildning (krav)\nGoda kunskaper i svenska språket, verbalt och skriftligt (krav).\nGrundläggande kunskaper i engelska språket, verbalt och skriftligt (krav).\nGrundläggande datorförståelse, t.ex Microsoft Office (krav) samt erfarenhet av PAS-X (meriterande).\nStyrsystem och teknisk kunskap (meriterande)\nFlexibel till att arbeta olika skiftesformer (merit)\nInneha truckkort A2, B1 (meriterande)\n\n \nVad Du Behöver För Att Lyckas\nDu är en lagspelare med ett stort egenansvar. Du är en engagerad person som aktivt vill medverka till förbättring av processer och rutiner. Arbetet kräver att du har förmågan att arbeta noggrant med dina arbetsuppgifter. Du är en resultatinriktad person som sätter värde på att uppnå våra KPIer.\n\n\n \n Ansökan\nÄr du intresserad av tjänsten vill vi veta mer om din bakgrund och vad du kan bidra med. Bifoga ditt CV och personliga brev i ansökan och du kommer få vidare information via mail. Alla ansökanden kommer få återkoppling på sin ansökan. Om du möter kvalifikationerna kommer du inom 14 dagar få inbjudan att göra två digitala för att komma vidare i processen. För din information, som del av rekryteringsprocessen så genomförs en hälsoundersökning samt drogtest för slutkandidater.\nFör fackliga frågor, vänligen kontakta någon av följande: Marigona Bala: IF Metall, mbala1@ITS.JNJ.com. Om du stöter på tekniska problem kopplat till din ansökan kan du få hjälp på denna sida https://www.careers.jnj.com/contactus-faq"
}