{
  "meta" : {
    "jobad" : {
      "description" : {
        "requirements" : null,
        "needs" : null,
        "company_information" : null,
        "text_formatted" : "<p><strong>BLÄNKAre: </strong>Händig person som kan montera, hänga och borra?</p><p>Är du <strong>självgående, ambitiös, noggrann och händig</strong>? </p><p>Vi letar inte efter Dig med det perfekta CV:et, branschvanan eller rätta utbildningen - vi letar efter dig som har den rätta inställningen och som vill arbeta extra på BLÄNKA med att hjälpa våra kunder med enklare monteringsjobb och snickeriarbeten.</p><p>Du får dessutom ännu en unik chans att arbeta nära och ibland tillsammans med en mycket erfaren företagsledning med stor kunskap och stort driv.</p><p>Typer av uppdrag: </p><ul><li>Hänga/Borra</li><li>Reparation &amp; fix</li><li>Montera möbler</li><li>Transport och flytt (A till B)</li><li>Trädgårdshjälp/Målning</li></ul><p>Om tjänsten och Dig:</p><ul><li>Du är allmänt händig och tycker om att fixa </li><li>Att sätta upp gardiner, byta beslag och liknande är något du gör med lätthet och glädje.</li><li>Du tycker om att träffa människor och är positiv och glad</li><li>Du har körkort och egen bil.</li><li>Du pratar god svenska.</li></ul><p><strong>Välkommen med din ansökan redan idag till jobb@blaenka.com</strong></p><p><br></p>",
        "conditions" : null,
        "text" : "BLÄNKAre: Händig person som kan montera, hänga och borra?\nÄr du självgående, ambitiös, noggrann och händig? \nVi letar inte efter Dig med det perfekta CV:et, branschvanan eller rätta utbildningen - vi letar efter dig som har den rätta inställningen och som vill arbeta extra på BLÄNKA med att hjälpa våra kunder med enklare monteringsjobb och snickeriarbeten.\nDu får dessutom ännu en unik chans att arbeta nära och ibland tillsammans med en mycket erfaren företagsledning med stor kunskap och stort driv.\nTyper av uppdrag: \nHänga/Borra\nReparation & fix\nMontera möbler\nTransport och flytt (A till B)\nTrädgårdshjälp/Målning\n\nOm tjänsten och Dig:\nDu är allmänt händig och tycker om att fixa \nAtt sätta upp gardiner, byta beslag och liknande är något du gör med lätthet och glädje.\nDu tycker om att träffa människor och är positiv och glad\nDu har körkort och egen bil.\nDu pratar god svenska.\n\nVälkommen med din ansökan redan idag till jobb@blaenka.com"
      },
      "headline" : "BLÄNKAre: Superfixare som kan montera, hänga, borra, m.m.",
      "driving_license" : [ {
        "concept_id" : "VTK8_WRx_GcM",
        "label" : "B",
        "legacy_ams_taxonomy_id" : "3"
      } ],
      "employer" : {
        "email" : null,
        "phone_number" : null,
        "organization_number" : "5593233801",
        "name" : "BLÄNKA AB",
        "url" : "www.blaenka.com",
        "workplace" : "BLÄNKA AB"
      },
      "removed_date" : null,
      "logo_url" : "https://www.arbetsformedlingen.se/rest/arbetsgivare/rest/af/v3/arbetsplatser/88017067/logotyper/logo.png",
      "last_publication_date" : "2022-12-31T23:59:59",
      "number_of_vacancies" : 3,
      "occupation" : {
        "concept_id" : "HdcS_g6a_jPk",
        "label" : "Träarbetare/Snickare, utan yrkesbevis",
        "legacy_ams_taxonomy_id" : "7182"
      },
      "occupation_group" : {
        "concept_id" : "9mJN_VwW_Xjg",
        "label" : "Träarbetare, snickare m.fl.",
        "legacy_ams_taxonomy_id" : "7111"
      },
      "employment_type" : {
        "concept_id" : "1paU_aCR_nGn",
        "label" : "Behovsanställning",
        "legacy_ams_taxonomy_id" : "4"
      },
      "webpage_url" : "https://arbetsformedlingen.se/platsbanken/annonser/26417951",
      "driving_license_required" : true,
      "application_contacts" : [ ],
      "duration" : {
        "concept_id" : null,
        "label" : null,
        "legacy_ams_taxonomy_id" : null
      },
      "nice_to_have" : {
        "education_level" : [ ],
        "work_experiences" : [ ],
        "skills" : [ {
          "concept_id" : "2vrR_rF1_rfe",
          "weight" : 5,
          "label" : "Reparationsvana, inredningssnickerier",
          "legacy_ams_taxonomy_id" : "603838"
        }, {
          "concept_id" : "BZUR_w5p_XJJ",
          "weight" : 5,
          "label" : "Inredning, monteringsvana",
          "legacy_ams_taxonomy_id" : "603027"
        }, {
          "concept_id" : "yZdF_d27_Gow",
          "weight" : 5,
          "label" : "Möbelmontering",
          "legacy_ams_taxonomy_id" : "4099"
        }, {
          "concept_id" : "n5sy_8pT_crR",
          "weight" : 5,
          "label" : "Underhållsarbete, snickeri",
          "legacy_ams_taxonomy_id" : "603744"
        }, {
          "concept_id" : "QDvy_mYm_kSS",
          "weight" : 5,
          "label" : "Diversearbete, bygg",
          "legacy_ams_taxonomy_id" : "607736"
        } ],
        "education" : [ ],
        "languages" : [ {
          "concept_id" : "NVxJ_hLg_TYS",
          "weight" : 5,
          "label" : "Engelska",
          "legacy_ams_taxonomy_id" : "283"
        } ]
      },
      "application_details" : {
        "via_af" : false,
        "email" : "jobb@blaenka.com",
        "other" : null,
        "reference" : "Superfixare",
        "url" : null,
        "information" : null
      },
      "source_type" : "VIA_ANNONSERA",
      "application_deadline" : "2022-12-31T23:59:59",
      "external_id" : null,
      "workplace_address" : {
        "coordinates" : [ 11.962591342791589, 57.56150574163414 ],
        "city" : "BILLDAL",
        "postcode" : "42750",
        "municipality" : "Kungsbacka",
        "region_concept_id" : "wjee_qH2_yb6",
        "region" : "Hallands län",
        "country_code" : "199",
        "region_code" : "13",
        "municipality_concept_id" : "3JKV_KSK_x6z",
        "country_concept_id" : "i46j_HmG_v64",
        "municipality_code" : "1384",
        "street_address" : "Kungsporten 4",
        "country" : "Sverige"
      },
      "id" : "26417951",
      "experience_required" : true,
      "working_hours_type" : {
        "concept_id" : null,
        "label" : null,
        "legacy_ams_taxonomy_id" : null
      },
      "access" : null,
      "timestamp" : 1660711750279,
      "must_have" : {
        "education_level" : [ ],
        "work_experiences" : [ {
          "concept_id" : "HdcS_g6a_jPk",
          "weight" : 10,
          "label" : "Träarbetare, utan yrkesbevis/Snickare, utan yrkesbevis",
          "legacy_ams_taxonomy_id" : "7182"
        } ],
        "skills" : [ ],
        "education" : [ ],
        "languages" : [ {
          "concept_id" : "zSLA_vw2_FXN",
          "weight" : 10,
          "label" : "Svenska",
          "legacy_ams_taxonomy_id" : "502"
        } ]
      },
      "occupation_field" : {
        "concept_id" : "j7Cq_ZJe_GkT",
        "label" : "Bygg och anläggning",
        "legacy_ams_taxonomy_id" : "2"
      },
      "scope_of_work" : {
        "min" : 0,
        "max" : null
      },
      "salary_type" : {
        "concept_id" : "oG8G_9cW_nRf",
        "label" : "Fast månads- vecko- eller timlön",
        "legacy_ams_taxonomy_id" : "1"
      },
      "removed" : false,
      "salary_description" : null,
      "access_to_own_car" : true,
      "publication_date" : "2022-08-17T06:49:10"
    },
    "name" : "BLÄNKAre: Superfixare som kan montera, hänga, borra, m.m.",
    "user" : "hannes"
  },
  "sha1" : "2369ea6639ec15fe214e4f2e1ce69a7362932fc2",
  "annotations" : [ {
    "preferred-label" : "arbeta självständigt",
    "sentiment" : "MUST_HAVE",
    "type" : "esco-skill",
    "start-position" : 122,
    "end-position" : 133,
    "concept-id" : "NyFu_HHd_zhz",
    "matched-string" : "självgående",
    "annotation-id" : 3
  }, {
    "preferred-label" : "noggrannhet",
    "sentiment" : "MUST_HAVE",
    "type" : "esco-skill",
    "start-position" : 145,
    "end-position" : 153,
    "concept-id" : "mrsW_EkL_KRD",
    "matched-string" : "noggrann",
    "annotation-id" : 4
  }, {
    "preferred-label" : "Snickeriarbetare",
    "sentiment" : "NOT_RELEVANT",
    "type" : "keyword",
    "start-position" : 400,
    "end-position" : 415,
    "concept-id" : "jB4B_uED_vQh",
    "matched-string" : "snickeriarbeten",
    "annotation-id" : 5
  }, {
    "preferred-label" : "Möbelmontering",
    "sentiment" : "MUST_HAVE",
    "type" : "skill",
    "start-position" : 610,
    "end-position" : 624,
    "concept-id" : "yZdF_d27_Gow",
    "matched-string" : "Montera möbler",
    "annotation-id" : 6
  }, {
    "preferred-label" : "B",
    "sentiment" : "MUST_HAVE",
    "type" : "driving-licence",
    "start-position" : 900,
    "end-position" : 907,
    "concept-id" : "VTK8_WRx_GcM",
    "matched-string" : "körkort",
    "annotation-id" : 7
  }, {
    "preferred-label" : "Svenska",
    "sentiment" : "MUST_HAVE",
    "type" : "language",
    "start-position" : 936,
    "end-position" : 943,
    "concept-id" : "zSLA_vw2_FXN",
    "matched-string" : "svenska",
    "annotation-id" : 1
  } ],
  "text" : "BLÄNKAre: Superfixare som kan montera, hänga, borra, m.m.\nBLÄNKAre: Händig person som kan montera, hänga och borra?\nÄr du självgående, ambitiös, noggrann och händig? \nVi letar inte efter Dig med det perfekta CV:et, branschvanan eller rätta utbildningen - vi letar efter dig som har den rätta inställningen och som vill arbeta extra på BLÄNKA med att hjälpa våra kunder med enklare monteringsjobb och snickeriarbeten.\nDu får dessutom ännu en unik chans att arbeta nära och ibland tillsammans med en mycket erfaren företagsledning med stor kunskap och stort driv.\nTyper av uppdrag: \nHänga/Borra\nReparation & fix\nMontera möbler\nTransport och flytt (A till B)\nTrädgårdshjälp/Målning\n\nOm tjänsten och Dig:\nDu är allmänt händig och tycker om att fixa \nAtt sätta upp gardiner, byta beslag och liknande är något du gör med lätthet och glädje.\nDu tycker om att träffa människor och är positiv och glad\nDu har körkort och egen bil.\nDu pratar god svenska.\n\nVälkommen med din ansökan redan idag till jobb@blaenka.com"
}