{
  "meta" : {
    "jobad" : {
      "description" : {
        "requirements" : null,
        "needs" : null,
        "company_information" : null,
        "text_formatted" : "<p>Vi söker nu en arbetande gruppledare till vår trädgårdsavdelning! Vi bedömer att cirka 30-40 % av din tid går åt till planering, kundbesök och arbetsledning. Under högsäsong består gruppen av 8 - 12 personer.</p><p>Arbetsuppgifter:</p><ul><li>Besöka kunder för att bedöma tidsåtgång och att beräkna projekt.</li><li>Planera och fördela arbetet för hela trädgårdsgruppen. Deltaga i schemaläggning.</li><li>Uppföljning och kontroll av utförda uppdrag.</li><li>Genomföra inköp av material, verktyg och trädgårdsmaskiner.</li><li>Ge instruktioner och utbildning till personal.</li><li>Deltaga i det dagliga arbetet (60-70 % av arbetstiden).</li></ul><p>Tjänsten ställer stora krav på beslutsfattande och att leda och inspirera gruppen.</p><p>Vår trädgårdsavdelning utgår från Malmö varje dag. För tjänsten krävs minst 3 års erfarenhet av trädgårdsarbete, gärna med arbetsledande funktion</p><p>Oavsett väder arbetar du utomhus, och du får vara fysiskt aktiv hela dagarna, en god fysik är därför ett måste. Kundkontakt är en viktig del i det dagliga arbetet och det är därför är viktigt att du har god social förmåga samt att du tycker om serviceyrket.</p><p><br></p><p>Vi arbetar med löpande urval så ansök redan idag!</p><p>Märk din ansökan med \"gruppledare\".</p><p><br></p><p><br></p><p><em>﻿Om God Service i Sverige AB</em></p><p>God Service växer och vi söker efter personer med både erfarenhet, kompetens och engagemang, som vill vara med och utveckla vår verksamhet. Vi söker dig som vill hjälpa äldre, småbarnsfamiljer, ensamstående föräldrar eller andra som kan ha svårt att få vardagen att gå ihop. God Service erbjuder tjänster till både företag, offentliga verksamheter och privatpersoner inom städ, trädgård och ledsagning. Hos oss får du uppleva det lilla företagets närhet till kunder och kollegor, samtidigt som du får det stora företagets styrka och trygghet.</p><p>God Service i Sverige AB är ett modernt tjänsteföretag som har sin hemmabas i sydvästra Skåne med kontor i Malmö. Vi utför tjänster både för privatpersoner och företag. Vår målsättning är att alltid kunna leverera kundanpassade lösningar till alla slags RUT-tjänster och olika tjänster till företag.</p><p>http://www.godservice.se</p>",
        "conditions" : null,
        "text" : "Vi söker nu en arbetande gruppledare till vår trädgårdsavdelning! Vi bedömer att cirka 30-40 % av din tid går åt till planering, kundbesök och arbetsledning. Under högsäsong består gruppen av 8 - 12 personer.\nArbetsuppgifter:\nBesöka kunder för att bedöma tidsåtgång och att beräkna projekt.\nPlanera och fördela arbetet för hela trädgårdsgruppen. Deltaga i schemaläggning.\nUppföljning och kontroll av utförda uppdrag.\nGenomföra inköp av material, verktyg och trädgårdsmaskiner.\nGe instruktioner och utbildning till personal.\nDeltaga i det dagliga arbetet (60-70 % av arbetstiden).\n\nTjänsten ställer stora krav på beslutsfattande och att leda och inspirera gruppen.\nVår trädgårdsavdelning utgår från Malmö varje dag. För tjänsten krävs minst 3 års erfarenhet av trädgårdsarbete, gärna med arbetsledande funktion\nOavsett väder arbetar du utomhus, och du får vara fysiskt aktiv hela dagarna, en god fysik är därför ett måste. Kundkontakt är en viktig del i det dagliga arbetet och det är därför är viktigt att du har god social förmåga samt att du tycker om serviceyrket.\n\n\nVi arbetar med löpande urval så ansök redan idag!\nMärk din ansökan med \"gruppledare\".\n\n\n\n\n﻿Om God Service i Sverige AB\nGod Service växer och vi söker efter personer med både erfarenhet, kompetens och engagemang, som vill vara med och utveckla vår verksamhet. Vi söker dig som vill hjälpa äldre, småbarnsfamiljer, ensamstående föräldrar eller andra som kan ha svårt att få vardagen att gå ihop. God Service erbjuder tjänster till både företag, offentliga verksamheter och privatpersoner inom städ, trädgård och ledsagning. Hos oss får du uppleva det lilla företagets närhet till kunder och kollegor, samtidigt som du får det stora företagets styrka och trygghet.\nGod Service i Sverige AB är ett modernt tjänsteföretag som har sin hemmabas i sydvästra Skåne med kontor i Malmö. Vi utför tjänster både för privatpersoner och företag. Vår målsättning är att alltid kunna leverera kundanpassade lösningar till alla slags RUT-tjänster och olika tjänster till företag.\nhttp://www.godservice.se"
      },
      "headline" : "Gruppledare till vår trädgårdsavdelning",
      "driving_license" : [ {
        "concept_id" : "VTK8_WRx_GcM",
        "label" : "B",
        "legacy_ams_taxonomy_id" : "3"
      } ],
      "employer" : {
        "email" : null,
        "phone_number" : null,
        "organization_number" : "5567846042",
        "name" : "God Service i Sverige AB",
        "url" : "www.godservice.se",
        "workplace" : "God Service i Sverige AB"
      },
      "removed_date" : null,
      "logo_url" : "https://www.arbetsformedlingen.se/rest/arbetsgivare/rest/af/v3/arbetsplatser/82981860/logotyper/logo.png",
      "last_publication_date" : "2022-08-26T23:59:59",
      "number_of_vacancies" : 1,
      "occupation" : {
        "concept_id" : "QjKb_RaU_KEd",
        "label" : "Arbetsledare,trädgård/Trädgårdsanläggningsförman",
        "legacy_ams_taxonomy_id" : "4563"
      },
      "occupation_group" : {
        "concept_id" : "XBh3_Xrm_C4R",
        "label" : "Trädgårdsanläggare m.fl.",
        "legacy_ams_taxonomy_id" : "6113"
      },
      "employment_type" : {
        "concept_id" : "PFZr_Syz_cUq",
        "label" : "Vanlig anställning",
        "legacy_ams_taxonomy_id" : "1"
      },
      "webpage_url" : "https://arbetsformedlingen.se/platsbanken/annonser/26357400",
      "driving_license_required" : true,
      "application_contacts" : [ {
        "description" : null,
        "email" : "sara.bengtsson@godservice.se",
        "telephone" : "020214200, 0725310012",
        "name" : "Sara Bengtsson",
        "contact_type" : null
      } ],
      "duration" : {
        "concept_id" : "a7uU_j21_mkL",
        "label" : "Tills vidare",
        "legacy_ams_taxonomy_id" : "1"
      },
      "nice_to_have" : {
        "education_level" : [ ],
        "work_experiences" : [ ],
        "skills" : [ {
          "concept_id" : "j1Yr_UhC_X16",
          "weight" : 5,
          "label" : "Arbetsledarerfarenhet",
          "legacy_ams_taxonomy_id" : "1"
        } ],
        "education" : [ ],
        "languages" : [ ]
      },
      "application_details" : {
        "via_af" : false,
        "email" : "gardenfix@godservice.se",
        "other" : null,
        "reference" : "Gruppledare",
        "url" : null,
        "information" : null
      },
      "source_type" : "VIA_ANNONSERA",
      "application_deadline" : "2022-08-26T23:59:59",
      "external_id" : null,
      "workplace_address" : {
        "coordinates" : [ 13.040983937974087, 55.600787628029316 ],
        "city" : "MALMÖ",
        "postcode" : "21228",
        "municipality" : "Malmö",
        "region_concept_id" : "CaRE_1nn_cSU",
        "region" : "Skåne län",
        "country_code" : "199",
        "region_code" : "12",
        "municipality_concept_id" : "oYPt_yRA_Smm",
        "country_concept_id" : "i46j_HmG_v64",
        "municipality_code" : "1280",
        "street_address" : "Sallerupsvägen 92",
        "country" : "Sverige"
      },
      "id" : "26357400",
      "experience_required" : true,
      "working_hours_type" : {
        "concept_id" : "6YE1_gAC_R2G",
        "label" : "Heltid",
        "legacy_ams_taxonomy_id" : "1"
      },
      "access" : null,
      "timestamp" : 1659108070358,
      "must_have" : {
        "education_level" : [ ],
        "work_experiences" : [ {
          "concept_id" : "QjKb_RaU_KEd",
          "weight" : 10,
          "label" : "Arbetsledare, trädgård/Trädgårdsanläggningsförman",
          "legacy_ams_taxonomy_id" : "4563"
        } ],
        "skills" : [ {
          "concept_id" : "AAaS_o41_sEg",
          "weight" : 10,
          "label" : "Trädgårdsskötsel",
          "legacy_ams_taxonomy_id" : "601482"
        } ],
        "education" : [ ],
        "languages" : [ {
          "concept_id" : "zSLA_vw2_FXN",
          "weight" : 10,
          "label" : "Svenska",
          "legacy_ams_taxonomy_id" : "502"
        }, {
          "concept_id" : "NVxJ_hLg_TYS",
          "weight" : 10,
          "label" : "Engelska",
          "legacy_ams_taxonomy_id" : "283"
        } ]
      },
      "occupation_field" : {
        "concept_id" : "VuuL_7CH_adj",
        "label" : "Naturbruk",
        "legacy_ams_taxonomy_id" : "13"
      },
      "scope_of_work" : {
        "min" : 0,
        "max" : 100
      },
      "salary_type" : {
        "concept_id" : "oG8G_9cW_nRf",
        "label" : "Fast månads- vecko- eller timlön",
        "legacy_ams_taxonomy_id" : "1"
      },
      "removed" : false,
      "salary_description" : null,
      "access_to_own_car" : false,
      "publication_date" : "2022-07-29T12:59:15"
    },
    "name" : "Gruppledare till vår trädgårdsavdelning",
    "user" : "kristof.fischer"
  },
  "sha1" : "24920daa8667b45a85559fe34afebf548715a6e9",
  "annotations" : [ {
    "preferred-label" : "Arbetsledare, trädgård/Trädgårdsanläggningsförman",
    "type" : "occupation-name",
    "start-position" : 0,
    "end-position" : 11,
    "concept-id" : "QjKb_RaU_KEd",
    "matched-string" : "Gruppledare",
    "annotation-id" : 5
  }, {
    "preferred-label" : "Arbetsledare, trädgård/Trädgårdsanläggningsförman",
    "type" : "occupation-name",
    "start-position" : 65,
    "end-position" : 76,
    "concept-id" : "QjKb_RaU_KEd",
    "matched-string" : "gruppledare",
    "annotation-id" : 6
  }, {
    "preferred-label" : "fatta beslut",
    "sentiment" : "MUST_HAVE",
    "type" : "esco-skill",
    "start-position" : 652,
    "end-position" : 667,
    "concept-id" : "7akt_v7j_ggK",
    "matched-string" : "beslutsfattande",
    "annotation-id" : 7
  }, {
    "preferred-label" : "leda en grupp",
    "sentiment" : "MUST_HAVE",
    "type" : "esco-skill",
    "start-position" : 676,
    "end-position" : 702,
    "concept-id" : "QZKT_724_B6i",
    "matched-string" : "leda och inspirera gruppen",
    "annotation-id" : 8
  }, {
    "preferred-label" : "Malmö",
    "type" : "municipality",
    "start-position" : 738,
    "end-position" : 743,
    "concept-id" : "oYPt_yRA_Smm",
    "matched-string" : "Malmö",
    "annotation-id" : 9
  }, {
    "preferred-label" : "2-4 års erfarenhet",
    "sentiment" : "MUST_HAVE",
    "type" : "occupation-experience-year",
    "start-position" : 774,
    "end-position" : 796,
    "concept-id" : "RWA2_uu6_udD",
    "matched-string" : "minst 3 års erfarenhet",
    "annotation-id" : 10
  }, {
    "preferred-label" : "Trädgårdsskötsel",
    "sentiment" : "MUST_HAVE",
    "type" : "skill",
    "start-position" : 800,
    "end-position" : 815,
    "concept-id" : "AAaS_o41_sEg",
    "matched-string" : "trädgårdsarbete",
    "annotation-id" : 11
  }, {
    "preferred-label" : "God fysik (tunga lyft)",
    "sentiment" : "MUST_HAVE",
    "type" : "skill",
    "start-position" : 931,
    "end-position" : 940,
    "concept-id" : "rwir_xvu_443",
    "matched-string" : "god fysik",
    "annotation-id" : 12
  } ],
  "text" : "Gruppledare till vår trädgårdsavdelning\nVi söker nu en arbetande gruppledare till vår trädgårdsavdelning! Vi bedömer att cirka 30-40 % av din tid går åt till planering, kundbesök och arbetsledning. Under högsäsong består gruppen av 8 - 12 personer.\nArbetsuppgifter:\nBesöka kunder för att bedöma tidsåtgång och att beräkna projekt.\nPlanera och fördela arbetet för hela trädgårdsgruppen. Deltaga i schemaläggning.\nUppföljning och kontroll av utförda uppdrag.\nGenomföra inköp av material, verktyg och trädgårdsmaskiner.\nGe instruktioner och utbildning till personal.\nDeltaga i det dagliga arbetet (60-70 % av arbetstiden).\n\nTjänsten ställer stora krav på beslutsfattande och att leda och inspirera gruppen.\nVår trädgårdsavdelning utgår från Malmö varje dag. För tjänsten krävs minst 3 års erfarenhet av trädgårdsarbete, gärna med arbetsledande funktion\nOavsett väder arbetar du utomhus, och du får vara fysiskt aktiv hela dagarna, en god fysik är därför ett måste. Kundkontakt är en viktig del i det dagliga arbetet och det är därför är viktigt att du har god social förmåga samt att du tycker om serviceyrket.\n\n\nVi arbetar med löpande urval så ansök redan idag!\nMärk din ansökan med \"gruppledare\".\n\n\n\n\n﻿Om God Service i Sverige AB\nGod Service växer och vi söker efter personer med både erfarenhet, kompetens och engagemang, som vill vara med och utveckla vår verksamhet. Vi söker dig som vill hjälpa äldre, småbarnsfamiljer, ensamstående föräldrar eller andra som kan ha svårt att få vardagen att gå ihop. God Service erbjuder tjänster till både företag, offentliga verksamheter och privatpersoner inom städ, trädgård och ledsagning. Hos oss får du uppleva det lilla företagets närhet till kunder och kollegor, samtidigt som du får det stora företagets styrka och trygghet.\nGod Service i Sverige AB är ett modernt tjänsteföretag som har sin hemmabas i sydvästra Skåne med kontor i Malmö. Vi utför tjänster både för privatpersoner och företag. Vår målsättning är att alltid kunna leverera kundanpassade lösningar till alla slags RUT-tjänster och olika tjänster till företag.\nhttp://www.godservice.se"
}