{
  "meta" : {
    "jobad" : {
      "description" : {
        "requirements" : null,
        "needs" : null,
        "company_information" : null,
        "text_formatted" : "GOveteran har i över 15 år inspirerat människor och företag att se affärsnyttan med personal som har kommit längre i karriären!\n \n\nVi är Sveriges första bemannings- och tjänsteföretag med pensionärer som medarbetare. GOveteran matchar pensionärers kompetens och önskemål om uppdrag med marknadens behov. Vår verksamhet bistår de allt fler pensionärer som vill jobba. \n\nDetta ger dig och din organisation kompetens, erfarenhet, lojalitet och lönsamhet. GOveteran bygger en BRO mellan generationer med erfaren personal 50+ via Bemanning, Rekrytering och Omställning. Vi är över 25 franchisetagare som ger service på 65 orter i Sverige. Från Sundsvall till Malmö.\n\nPå GOveteran skulle vi aldrig drömma om att jämföra oss med rekryterings- och bemanningsbranschens största. Det har redan våra kunder gjort. Vår erfarenhet är att många affärskontakter rullar på slentrianmässigt i samma hjulspår. Därför vill vi bjuda in dig till en annan resa där personal 50+ med kompetens, erfarenhet, lojalitet och lönsamhet ingår i priset. Våra referenser och 10 000-tals andra kunder vet redan vad vi talar om.\r\n\r\nSnickeriarbete men också allmänt hantverksarbete företrädesvis hos privatkunder. Du kommer tillsammans med ansvarig distriktschef överens om vilka uppdrag som passar dig. \n\nArbetsuppgifter\nGOveteran har uppdrag inom allt från att bygga staket och trädäck, bygga uterum, riva och resa mellanväggar, lägga trägolv, bygga kök, sk. ROT-jobb. Uppdragen är många och arbetsuppgifterna är varierande. Ingen dag är den andra lik.\n\nKvalifikationer\nDu behöver vara duktig på att tala svenska för att kunna sköta kontakten med kunden och förstå uppgiften/instruktionen och alla kundens önskemål.\nKörkort och Bil är ett måste.\nEgna verktyg är ett plus.\n\nPersonliga egenskaper\nVi söker en utbildad snickare med minst fem års erfarenhet av snickerier, samt att man under dessa år har räknat på jobb ute hos kund. Arbetet är i hög grad självständigt och ställer krav på att du är självgående, ansvarsfull och noggrann. \n\nKontaktinformation\nGOveteran\n\nArbetsplats\nHospitalsgatan 4\n\n611 32 Nyköping",
        "conditions" : "Deltid 50%. \r\nTillsvidare.",
        "text" : "GOveteran har i över 15 år inspirerat människor och företag att se affärsnyttan med personal som har kommit längre i karriären!\n \n\nVi är Sveriges första bemannings- och tjänsteföretag med pensionärer som medarbetare. GOveteran matchar pensionärers kompetens och önskemål om uppdrag med marknadens behov. Vår verksamhet bistår de allt fler pensionärer som vill jobba. \n\nDetta ger dig och din organisation kompetens, erfarenhet, lojalitet och lönsamhet. GOveteran bygger en BRO mellan generationer med erfaren personal 50+ via Bemanning, Rekrytering och Omställning. Vi är över 25 franchisetagare som ger service på 65 orter i Sverige. Från Sundsvall till Malmö.\n\nPå GOveteran skulle vi aldrig drömma om att jämföra oss med rekryterings- och bemanningsbranschens största. Det har redan våra kunder gjort. Vår erfarenhet är att många affärskontakter rullar på slentrianmässigt i samma hjulspår. Därför vill vi bjuda in dig till en annan resa där personal 50+ med kompetens, erfarenhet, lojalitet och lönsamhet ingår i priset. Våra referenser och 10 000-tals andra kunder vet redan vad vi talar om.\r\n\r\nSnickeriarbete men också allmänt hantverksarbete företrädesvis hos privatkunder. Du kommer tillsammans med ansvarig distriktschef överens om vilka uppdrag som passar dig. \n\nArbetsuppgifter\nGOveteran har uppdrag inom allt från att bygga staket och trädäck, bygga uterum, riva och resa mellanväggar, lägga trägolv, bygga kök, sk. ROT-jobb. Uppdragen är många och arbetsuppgifterna är varierande. Ingen dag är den andra lik.\n\nKvalifikationer\nDu behöver vara duktig på att tala svenska för att kunna sköta kontakten med kunden och förstå uppgiften/instruktionen och alla kundens önskemål.\nKörkort och Bil är ett måste.\nEgna verktyg är ett plus.\n\nPersonliga egenskaper\nVi söker en utbildad snickare med minst fem års erfarenhet av snickerier, samt att man under dessa år har räknat på jobb ute hos kund. Arbetet är i hög grad självständigt och ställer krav på att du är självgående, ansvarsfull och noggrann. \n\nKontaktinformation\nGOveteran\n\nArbetsplats\nHospitalsgatan 4\n\n611 32 Nyköping"
      },
      "headline" : "Senior snickare/hantverkare 50+ Nyköping",
      "driving_license" : null,
      "employer" : {
        "email" : null,
        "phone_number" : null,
        "organization_number" : "9697165240",
        "name" : "Goveteran KB",
        "url" : "http://www.goveteran.se",
        "workplace" : "GOveteran"
      },
      "removed_date" : null,
      "logo_url" : "https://www.arbetsformedlingen.se/rest/arbetsgivare/rest/af/v3/organisation/9697165240/logotyper/logo.png",
      "last_publication_date" : "2022-08-31T23:59:59",
      "number_of_vacancies" : 2,
      "occupation" : {
        "concept_id" : "4Z7F_oBG_vMG",
        "label" : "Träarbetare/Snickare",
        "legacy_ams_taxonomy_id" : "6581"
      },
      "occupation_group" : {
        "concept_id" : "9mJN_VwW_Xjg",
        "label" : "Träarbetare, snickare m.fl.",
        "legacy_ams_taxonomy_id" : "7111"
      },
      "employment_type" : {
        "concept_id" : "PFZr_Syz_cUq",
        "label" : "Vanlig anställning",
        "legacy_ams_taxonomy_id" : "1"
      },
      "webpage_url" : "https://arbetsformedlingen.se/platsbanken/annonser/26362655",
      "driving_license_required" : false,
      "application_contacts" : [ {
        "description" : "GOveteran",
        "email" : null,
        "telephone" : null,
        "name" : null,
        "contact_type" : null
      } ],
      "duration" : {
        "concept_id" : "a7uU_j21_mkL",
        "label" : "Tills vidare",
        "legacy_ams_taxonomy_id" : "1"
      },
      "nice_to_have" : {
        "education_level" : [ ],
        "work_experiences" : [ ],
        "skills" : [ ],
        "education" : [ ],
        "languages" : [ ]
      },
      "application_details" : {
        "via_af" : false,
        "email" : null,
        "other" : null,
        "reference" : "4457170607",
        "url" : "https://candidate.webcruiter.com/cv?advertid=4457170607&language=sv&link_source_id=30",
        "information" : null
      },
      "source_type" : "VIA_PLATSBANKEN_DXA",
      "application_deadline" : "2022-08-31T23:59:59",
      "external_id" : "46-969716-5240-4457170607",
      "workplace_address" : {
        "coordinates" : [ 17.00916, 58.752846 ],
        "city" : null,
        "postcode" : null,
        "municipality" : "Nyköping",
        "region_concept_id" : "s93u_BEb_sx2",
        "region" : "Södermanlands län",
        "country_code" : "199",
        "region_code" : "04",
        "municipality_concept_id" : "KzvD_ePV_DKQ",
        "country_concept_id" : "i46j_HmG_v64",
        "municipality_code" : "0480",
        "street_address" : null,
        "country" : "Sverige"
      },
      "id" : "26362655",
      "experience_required" : true,
      "working_hours_type" : {
        "concept_id" : "947z_JGS_Uk2",
        "label" : "Deltid",
        "legacy_ams_taxonomy_id" : "2"
      },
      "access" : null,
      "timestamp" : 1659084693869,
      "must_have" : {
        "education_level" : [ ],
        "work_experiences" : [ {
          "concept_id" : "4Z7F_oBG_vMG",
          "weight" : 10,
          "label" : "Träarbetare/Snickare",
          "legacy_ams_taxonomy_id" : "6581"
        } ],
        "skills" : [ ],
        "education" : [ ],
        "languages" : [ ]
      },
      "occupation_field" : {
        "concept_id" : "j7Cq_ZJe_GkT",
        "label" : "Bygg och anläggning",
        "legacy_ams_taxonomy_id" : "2"
      },
      "scope_of_work" : {
        "min" : 50,
        "max" : 100
      },
      "salary_type" : {
        "concept_id" : "oG8G_9cW_nRf",
        "label" : "Fast månads- vecko- eller timlön",
        "legacy_ams_taxonomy_id" : "1"
      },
      "removed" : false,
      "salary_description" : ".\r\nFast lön",
      "access_to_own_car" : false,
      "publication_date" : "2022-07-29T10:51:33"
    },
    "name" : "Senior snickare/hantverkare 50+ Nyköping",
    "user" : "hannes"
  },
  "sha1" : "dac87160e032927f2c427697cb854ecc4ac506a3",
  "annotations" : [ {
    "preferred-label" : "snickare",
    "sentiment" : "MUST_HAVE",
    "type" : "esco-occupation",
    "start-position" : 7,
    "end-position" : 15,
    "concept-id" : "qhAJ_Euo_tNx",
    "matched-string" : "snickare",
    "annotation-id" : 0
  }, {
    "preferred-label" : "Hantverk",
    "type" : "occupation-field",
    "start-position" : 16,
    "end-position" : 27,
    "concept-id" : "PaxQ_o1G_wWH",
    "matched-string" : "hantverkare",
    "annotation-id" : 9
  }, {
    "preferred-label" : "Nyköping",
    "type" : "municipality",
    "start-position" : 32,
    "end-position" : 40,
    "concept-id" : "KzvD_ePV_DKQ",
    "matched-string" : "Nyköping",
    "annotation-id" : 10
  }, {
    "preferred-label" : "Sverige",
    "type" : "country",
    "start-position" : 178,
    "end-position" : 186,
    "concept-id" : "i46j_HmG_v64",
    "matched-string" : "Sveriges",
    "annotation-id" : 11
  }, {
    "preferred-label" : "Sverige",
    "type" : "country",
    "start-position" : 666,
    "end-position" : 673,
    "concept-id" : "i46j_HmG_v64",
    "matched-string" : "Sverige",
    "annotation-id" : 12
  }, {
    "preferred-label" : "Sundsvall",
    "type" : "municipality",
    "start-position" : 680,
    "end-position" : 689,
    "concept-id" : "dJbx_FWY_tK6",
    "matched-string" : "Sundsvall",
    "annotation-id" : 13
  }, {
    "preferred-label" : "Malmö",
    "type" : "municipality",
    "start-position" : 695,
    "end-position" : 700,
    "concept-id" : "oYPt_yRA_Smm",
    "matched-string" : "Malmö",
    "annotation-id" : 14
  }, {
    "preferred-label" : "Snickeriarbetare",
    "type" : "keyword",
    "start-position" : 1139,
    "end-position" : 1153,
    "concept-id" : "jB4B_uED_vQh",
    "matched-string" : "Snickeriarbete",
    "annotation-id" : 15
  }, {
    "preferred-label" : "Trägolv",
    "sentiment" : "MUST_HAVE",
    "type" : "skill",
    "start-position" : 1443,
    "end-position" : 1450,
    "concept-id" : "Psdi_otm_PNL",
    "matched-string" : "trägolv",
    "annotation-id" : 4
  }, {
    "preferred-label" : "ROT-jobb",
    "sentiment" : "MUST_HAVE",
    "type" : "skill",
    "start-position" : 1467,
    "end-position" : 1475,
    "concept-id" : "U1ud_XV7_Z8o",
    "matched-string" : "rot-jobb",
    "annotation-id" : 5
  }, {
    "preferred-label" : "Svenska",
    "sentiment" : "MUST_HAVE",
    "type" : "language",
    "start-position" : 1613,
    "end-position" : 1620,
    "concept-id" : "zSLA_vw2_FXN",
    "matched-string" : "svenska",
    "annotation-id" : 6
  }, {
    "preferred-label" : "B",
    "type" : "driving-licence",
    "start-position" : 1724,
    "end-position" : 1731,
    "concept-id" : "VTK8_WRx_GcM",
    "matched-string" : "Körkort",
    "annotation-id" : 16
  }, {
    "preferred-label" : "Verktyg",
    "sentiment" : "MUST_HAVE",
    "type" : "skill",
    "start-position" : 1759,
    "end-position" : 1766,
    "concept-id" : "KG9j_WxP_ym2",
    "matched-string" : "verktyg",
    "annotation-id" : 7
  }, {
    "preferred-label" : "snickare",
    "sentiment" : "MUST_HAVE",
    "type" : "esco-occupation",
    "start-position" : 1824,
    "end-position" : 1832,
    "concept-id" : "qhAJ_Euo_tNx",
    "matched-string" : "snickare",
    "annotation-id" : 8
  } ],
  "text" : "Senior snickare/hantverkare 50+ Nyköping\nGOveteran har i över 15 år inspirerat människor och företag att se affärsnyttan med personal som har kommit längre i karriären!\n \n\nVi är Sveriges första bemannings- och tjänsteföretag med pensionärer som medarbetare. GOveteran matchar pensionärers kompetens och önskemål om uppdrag med marknadens behov. Vår verksamhet bistår de allt fler pensionärer som vill jobba. \n\nDetta ger dig och din organisation kompetens, erfarenhet, lojalitet och lönsamhet. GOveteran bygger en BRO mellan generationer med erfaren personal 50+ via Bemanning, Rekrytering och Omställning. Vi är över 25 franchisetagare som ger service på 65 orter i Sverige. Från Sundsvall till Malmö.\n\nPå GOveteran skulle vi aldrig drömma om att jämföra oss med rekryterings- och bemanningsbranschens största. Det har redan våra kunder gjort. Vår erfarenhet är att många affärskontakter rullar på slentrianmässigt i samma hjulspår. Därför vill vi bjuda in dig till en annan resa där personal 50+ med kompetens, erfarenhet, lojalitet och lönsamhet ingår i priset. Våra referenser och 10 000-tals andra kunder vet redan vad vi talar om.\r\n\r\nSnickeriarbete men också allmänt hantverksarbete företrädesvis hos privatkunder. Du kommer tillsammans med ansvarig distriktschef överens om vilka uppdrag som passar dig. \n\nArbetsuppgifter\nGOveteran har uppdrag inom allt från att bygga staket och trädäck, bygga uterum, riva och resa mellanväggar, lägga trägolv, bygga kök, sk. ROT-jobb. Uppdragen är många och arbetsuppgifterna är varierande. Ingen dag är den andra lik.\n\nKvalifikationer\nDu behöver vara duktig på att tala svenska för att kunna sköta kontakten med kunden och förstå uppgiften/instruktionen och alla kundens önskemål.\nKörkort och Bil är ett måste.\nEgna verktyg är ett plus.\n\nPersonliga egenskaper\nVi söker en utbildad snickare med minst fem års erfarenhet av snickerier, samt att man under dessa år har räknat på jobb ute hos kund. Arbetet är i hög grad självständigt och ställer krav på att du är självgående, ansvarsfull och noggrann. \n\nKontaktinformation\nGOveteran\n\nArbetsplats\nHospitalsgatan 4\n\n611 32 Nyköping"
}