{
  "meta" : {
    "jobad" : {
      "description" : {
        "requirements" : null,
        "needs" : null,
        "company_information" : null,
        "text_formatted" : "Viseo är ett växande bolag med ett positivt arbetsklimat där du får utvecklas från dag 1 och kunna driva spännande skrivprojekt från start till succé. Om du är en person som bara vill komma till jobbet och göra det som behövs är det inte rätt plats för just dig.\n\nVi söker dig som är:\n\n- Ansvarstagande och kan ta eget ansvar för din och företagets utveckling\n- Har grundläggande färdigheter som skribent (utbildning eller kurs)\n- Skicklig på att skriva kortfattade texter och rakt på sak\n\n\nSom content writer hos oss ansvarar du för att:\n\n- Agera som ett viktigt kugghjul för att driva våra projekt i hamn\n- Studera och djupdyka i ämnet i fråga\n- Kontinuerligt utveckla dig själv till ett bättre skrivande\n\n\nVi erbjuder:\n\n- Arbete i en sann remote-kultur. Flera av våra medarbetare befinner sig på andra platser än huvudkontoret i Stockholm t.ex. Bali och Chiang Mai.\n- Ett arbete med intressanta projekt.\n- Viseo tror starkt på frihet under ansvar. Du har möjlighet att jobba hemifrån och även utomlands under vissa perioder.\n- Heltidsarbete\n\n\nVi utrustar dig med de arbetsredskap du behöver för att utföra ditt arbete.\n\nVi är inte jätteintresserade av ett formellt CV utan vi vill främst se vilka typer av texter du har skrivit.",
        "conditions" : "Heltid\r\nTillsvidare",
        "text" : "Viseo är ett växande bolag med ett positivt arbetsklimat där du får utvecklas från dag 1 och kunna driva spännande skrivprojekt från start till succé. Om du är en person som bara vill komma till jobbet och göra det som behövs är det inte rätt plats för just dig.\n\nVi söker dig som är:\n\n- Ansvarstagande och kan ta eget ansvar för din och företagets utveckling\n- Har grundläggande färdigheter som skribent (utbildning eller kurs)\n- Skicklig på att skriva kortfattade texter och rakt på sak\n\n\nSom content writer hos oss ansvarar du för att:\n\n- Agera som ett viktigt kugghjul för att driva våra projekt i hamn\n- Studera och djupdyka i ämnet i fråga\n- Kontinuerligt utveckla dig själv till ett bättre skrivande\n\n\nVi erbjuder:\n\n- Arbete i en sann remote-kultur. Flera av våra medarbetare befinner sig på andra platser än huvudkontoret i Stockholm t.ex. Bali och Chiang Mai.\n- Ett arbete med intressanta projekt.\n- Viseo tror starkt på frihet under ansvar. Du har möjlighet att jobba hemifrån och även utomlands under vissa perioder.\n- Heltidsarbete\n\n\nVi utrustar dig med de arbetsredskap du behöver för att utföra ditt arbete.\n\nVi är inte jätteintresserade av ett formellt CV utan vi vill främst se vilka typer av texter du har skrivit."
      },
      "headline" : "Content Writer med känsla för research",
      "driving_license" : null,
      "employer" : {
        "email" : null,
        "phone_number" : null,
        "organization_number" : "5568408875",
        "name" : "Viseo AB",
        "url" : "https://viseo.se",
        "workplace" : "Viseo"
      },
      "removed_date" : null,
      "logo_url" : "https://www.arbetsformedlingen.se/rest/arbetsgivare/rest/af/v3/organisation/5568408875/logotyper/logo.png",
      "last_publication_date" : "2022-11-27T23:59:59",
      "number_of_vacancies" : 1,
      "occupation" : {
        "concept_id" : "b3Jk_Gfs_oo9",
        "label" : "Webbredaktör",
        "legacy_ams_taxonomy_id" : "6739"
      },
      "occupation_group" : {
        "concept_id" : "SgNH_hag_n9D",
        "label" : "Journalister m.fl.",
        "legacy_ams_taxonomy_id" : "2642"
      },
      "employment_type" : {
        "concept_id" : "PFZr_Syz_cUq",
        "label" : "Vanlig anställning",
        "legacy_ams_taxonomy_id" : "1"
      },
      "webpage_url" : "https://arbetsformedlingen.se/platsbanken/annonser/26202558",
      "driving_license_required" : false,
      "application_contacts" : [ {
        "description" : "Oscar Sandström",
        "email" : "oscar.sandstrom@viseo.se",
        "telephone" : "oscar.sandstrom@viseo.se",
        "name" : null,
        "contact_type" : null
      } ],
      "duration" : {
        "concept_id" : "a7uU_j21_mkL",
        "label" : "Tills vidare",
        "legacy_ams_taxonomy_id" : "1"
      },
      "nice_to_have" : {
        "education_level" : [ ],
        "work_experiences" : [ ],
        "skills" : [ ],
        "education" : [ ],
        "languages" : [ ]
      },
      "application_details" : {
        "via_af" : false,
        "email" : null,
        "other" : null,
        "reference" : null,
        "url" : "https://jobb.viseo.se/jobs/1846024-content-writer-med-kansla-for-research?promotion=429104-arbetsformedlingen",
        "information" : null
      },
      "source_type" : "VIA_PLATSBANKEN_DXA",
      "application_deadline" : "2022-11-27T23:59:59",
      "external_id" : "46-556840-8875-1846024-3",
      "workplace_address" : {
        "coordinates" : [ 18.06858, 59.329323 ],
        "city" : null,
        "postcode" : null,
        "municipality" : "Stockholm",
        "region_concept_id" : "CifL_Rzy_Mku",
        "region" : "Stockholms län",
        "country_code" : "199",
        "region_code" : "01",
        "municipality_concept_id" : "AvNB_uwa_6n6",
        "country_concept_id" : "i46j_HmG_v64",
        "municipality_code" : "0180",
        "street_address" : null,
        "country" : "Sverige"
      },
      "id" : "26202558",
      "experience_required" : true,
      "working_hours_type" : {
        "concept_id" : "6YE1_gAC_R2G",
        "label" : "Heltid",
        "legacy_ams_taxonomy_id" : "1"
      },
      "access" : null,
      "timestamp" : 1654878246758,
      "must_have" : {
        "education_level" : [ ],
        "work_experiences" : [ {
          "concept_id" : "b3Jk_Gfs_oo9",
          "weight" : 10,
          "label" : "Webbredaktör",
          "legacy_ams_taxonomy_id" : "6739"
        } ],
        "skills" : [ ],
        "education" : [ ],
        "languages" : [ ]
      },
      "occupation_field" : {
        "concept_id" : "9puE_nYg_crq",
        "label" : "Kultur, media, design",
        "legacy_ams_taxonomy_id" : "11"
      },
      "scope_of_work" : {
        "min" : 100,
        "max" : 100
      },
      "salary_type" : {
        "concept_id" : "oG8G_9cW_nRf",
        "label" : "Fast månads- vecko- eller timlön",
        "legacy_ams_taxonomy_id" : "1"
      },
      "removed" : false,
      "salary_description" : "Lön enligt överenskommelse",
      "access_to_own_car" : false,
      "publication_date" : "2022-06-10T18:24:06"
    },
    "name" : "Content Writer med känsla för research",
    "user" : "hannes"
  },
  "sha1" : "95aa377877f235257c953268b51fed3a06f52ab9",
  "annotations" : [ {
    "preferred-label" : "Skribent",
    "type" : "keyword",
    "start-position" : 0,
    "end-position" : 14,
    "concept-id" : "bbKc_hAw_snP",
    "matched-string" : "Content Writer",
    "annotation-id" : 2
  }, {
    "preferred-label" : "Research",
    "sentiment" : "MUST_HAVE",
    "type" : "skill",
    "start-position" : 30,
    "end-position" : 38,
    "concept-id" : "FGhF_q98_YE8",
    "matched-string" : "research",
    "annotation-id" : 0
  }, {
    "preferred-label" : "visa ansvarstagande",
    "type" : "esco-skill",
    "start-position" : 327,
    "end-position" : 341,
    "concept-id" : "bcRp_hxV_f5G",
    "matched-string" : "Ansvarstagande",
    "annotation-id" : 3
  }, {
    "preferred-label" : "Skribent",
    "sentiment" : "MUST_HAVE",
    "type" : "keyword",
    "start-position" : 435,
    "end-position" : 443,
    "concept-id" : "bbKc_hAw_snP",
    "matched-string" : "skribent",
    "annotation-id" : 1
  }, {
    "preferred-label" : "Skribent",
    "type" : "keyword",
    "start-position" : 542,
    "end-position" : 548,
    "concept-id" : "bbKc_hAw_snP",
    "matched-string" : "writer",
    "annotation-id" : 4
  }, {
    "preferred-label" : "Stockholm",
    "type" : "municipality",
    "start-position" : 871,
    "end-position" : 880,
    "concept-id" : "AvNB_uwa_6n6",
    "matched-string" : "Stockholm",
    "annotation-id" : 5
  }, {
    "preferred-label" : "Heltid",
    "type" : "worktime-extent",
    "start-position" : 1069,
    "end-position" : 1082,
    "concept-id" : "6YE1_gAC_R2G",
    "matched-string" : "Heltidsarbete",
    "annotation-id" : 6
  } ],
  "text" : "Content Writer med känsla för research\nViseo är ett växande bolag med ett positivt arbetsklimat där du får utvecklas från dag 1 och kunna driva spännande skrivprojekt från start till succé. Om du är en person som bara vill komma till jobbet och göra det som behövs är det inte rätt plats för just dig.\n\nVi söker dig som är:\n\n- Ansvarstagande och kan ta eget ansvar för din och företagets utveckling\n- Har grundläggande färdigheter som skribent (utbildning eller kurs)\n- Skicklig på att skriva kortfattade texter och rakt på sak\n\n\nSom content writer hos oss ansvarar du för att:\n\n- Agera som ett viktigt kugghjul för att driva våra projekt i hamn\n- Studera och djupdyka i ämnet i fråga\n- Kontinuerligt utveckla dig själv till ett bättre skrivande\n\n\nVi erbjuder:\n\n- Arbete i en sann remote-kultur. Flera av våra medarbetare befinner sig på andra platser än huvudkontoret i Stockholm t.ex. Bali och Chiang Mai.\n- Ett arbete med intressanta projekt.\n- Viseo tror starkt på frihet under ansvar. Du har möjlighet att jobba hemifrån och även utomlands under vissa perioder.\n- Heltidsarbete\n\n\nVi utrustar dig med de arbetsredskap du behöver för att utföra ditt arbete.\n\nVi är inte jätteintresserade av ett formellt CV utan vi vill främst se vilka typer av texter du har skrivit."
}