{
  "meta" : {
    "jobad" : {
      "description" : {
        "requirements" : null,
        "needs" : null,
        "company_information" : null,
        "text_formatted" : "Arbetsbeskrivning\nVill du utvecklas i en roll som Kyltekniker och bli en del av ett branschledande företag inom transportkyla? Thermo King expanderar och söker nu Kyltekniker som vill vara med i en spännande expansionsfas. I dina arbetsuppgifter ingår att genomföra service och reparationer av kylaggregat på transportbilar, tungafordon och släp. I dina arbetsuppgifter kommer även installation av kylaggregat att ingå. I arbetet kommer du att ha daglig kontakt med våra kunder och genomföra inbokade samt drop-in jobb. Du kommer till en början arbeta i vår verkstad som är belägen i Helsingborg. Med tiden finns det även möjlighet at få arbeta i fält och utgå från servicebil.\n\nDin Profil\nVi söker dig som har ett tekniskt intresse och som har en stark vilja att utvecklas i rollen. Kanske har du tidigare arbetat som mekaniker eller studerat fordonsmekanik. Du trivs med att arbeta såväl självständigt som i grupp. Vi kommer att lägga stor vikt vid dina personliga egenskaper, som person är du ödmjuk, social, serviceminded och värdesätter att hålla en hög servicegrad gentemot våra kunder.\nB-körkort samt flytande svenska i tal och skrift är krav för tjänsten.\nDu erbjuds en spännande tjänst med mycket utvecklingsmöjligheter. Vi värnar om vår kompetensförsörjning och erbjuder utbildningar löpande. Hos oss har du chansen att få gå en utbildning och bli certifierad Kyltekniker inom tung kyla.\n\n\nOm företaget\nThermo King har sedan länge insett sitt ansvar som branschledande inom transportkyla med att ställa mycket höga miljökrav. Vår ambition berör allt vi gör. Först på marknaden med låg GWP köldmedia R-452A, extremt låg-ljuds alternativ, exceptionellt låga avgasutsläpp och state-of-the-art tillverkningsanläggningar: bara några av milstolparna. Våra kunder behöver veta att de arbetar med den grönaste utrustning på marknaden och inget kommer stoppa oss att förverkliga detta.\n\nKontaktuppgifter\nI denna rekrytering samarbetar vi med Autorekrytering och frågor kring tjänsten besvaras av rekryterare Karl Andersson, karl.andersson@autorekrytering.se.\nUrval sker löpande så skicka in din ansökan redan idag!",
        "conditions" : "Heltid\r\nTillsvidare",
        "text" : "Arbetsbeskrivning\nVill du utvecklas i en roll som Kyltekniker och bli en del av ett branschledande företag inom transportkyla? Thermo King expanderar och söker nu Kyltekniker som vill vara med i en spännande expansionsfas. I dina arbetsuppgifter ingår att genomföra service och reparationer av kylaggregat på transportbilar, tungafordon och släp. I dina arbetsuppgifter kommer även installation av kylaggregat att ingå. I arbetet kommer du att ha daglig kontakt med våra kunder och genomföra inbokade samt drop-in jobb. Du kommer till en början arbeta i vår verkstad som är belägen i Helsingborg. Med tiden finns det även möjlighet at få arbeta i fält och utgå från servicebil.\n\nDin Profil\nVi söker dig som har ett tekniskt intresse och som har en stark vilja att utvecklas i rollen. Kanske har du tidigare arbetat som mekaniker eller studerat fordonsmekanik. Du trivs med att arbeta såväl självständigt som i grupp. Vi kommer att lägga stor vikt vid dina personliga egenskaper, som person är du ödmjuk, social, serviceminded och värdesätter att hålla en hög servicegrad gentemot våra kunder.\nB-körkort samt flytande svenska i tal och skrift är krav för tjänsten.\nDu erbjuds en spännande tjänst med mycket utvecklingsmöjligheter. Vi värnar om vår kompetensförsörjning och erbjuder utbildningar löpande. Hos oss har du chansen att få gå en utbildning och bli certifierad Kyltekniker inom tung kyla.\n\n\nOm företaget\nThermo King har sedan länge insett sitt ansvar som branschledande inom transportkyla med att ställa mycket höga miljökrav. Vår ambition berör allt vi gör. Först på marknaden med låg GWP köldmedia R-452A, extremt låg-ljuds alternativ, exceptionellt låga avgasutsläpp och state-of-the-art tillverkningsanläggningar: bara några av milstolparna. Våra kunder behöver veta att de arbetar med den grönaste utrustning på marknaden och inget kommer stoppa oss att förverkliga detta.\n\nKontaktuppgifter\nI denna rekrytering samarbetar vi med Autorekrytering och frågor kring tjänsten besvaras av rekryterare Karl Andersson, karl.andersson@autorekrytering.se.\nUrval sker löpande så skicka in din ansökan redan idag!"
      },
      "headline" : "Vi söker kyltekniker/mekaniker till Thermo King i Helsingborg",
      "driving_license" : [ {
        "concept_id" : "VTK8_WRx_GcM",
        "label" : "B",
        "legacy_ams_taxonomy_id" : "3"
      } ],
      "employer" : {
        "email" : null,
        "phone_number" : null,
        "organization_number" : "5566839568",
        "name" : "Svensk Autorekrytering AB",
        "url" : "http://www.autorekrytering.se",
        "workplace" : "Svensk Autorekrytering AB"
      },
      "removed_date" : null,
      "logo_url" : "https://www.arbetsformedlingen.se/rest/arbetsgivare/rest/af/v3/organisation/5566839568/logotyper/logo.png",
      "last_publication_date" : "2022-08-31T23:59:59",
      "number_of_vacancies" : 1,
      "occupation" : {
        "concept_id" : "6LYA_Sgu_hsR",
        "label" : "Kyl- och värmepumpstekniker",
        "legacy_ams_taxonomy_id" : "7612"
      },
      "occupation_group" : {
        "concept_id" : "3UzE_P8A_9sS",
        "label" : "Kyl- och värmepumpstekniker m.fl.",
        "legacy_ams_taxonomy_id" : "7126"
      },
      "employment_type" : {
        "concept_id" : "PFZr_Syz_cUq",
        "label" : "Vanlig anställning",
        "legacy_ams_taxonomy_id" : "1"
      },
      "webpage_url" : "https://arbetsformedlingen.se/platsbanken/annonser/26360721",
      "driving_license_required" : true,
      "application_contacts" : [ {
        "description" : "Karl Andersson",
        "email" : "karl.andersson@autorekrytering.se",
        "telephone" : null,
        "name" : null,
        "contact_type" : null
      } ],
      "duration" : {
        "concept_id" : "a7uU_j21_mkL",
        "label" : "Tills vidare",
        "legacy_ams_taxonomy_id" : "1"
      },
      "nice_to_have" : {
        "education_level" : [ ],
        "work_experiences" : [ ],
        "skills" : [ ],
        "education" : [ ],
        "languages" : [ ]
      },
      "application_details" : {
        "via_af" : false,
        "email" : null,
        "other" : null,
        "reference" : "6466",
        "url" : "http://cv-autorekrytering-se.app.intelliplan.eu/JobAd/Show?jaid=6466",
        "information" : null
      },
      "source_type" : "VIA_PLATSBANKEN_DXA",
      "application_deadline" : "2022-08-31T23:59:59",
      "external_id" : "46-556683-9568-6466",
      "workplace_address" : {
        "coordinates" : [ 12.694512, 56.046467 ],
        "city" : null,
        "postcode" : null,
        "municipality" : "Helsingborg",
        "region_concept_id" : "CaRE_1nn_cSU",
        "region" : "Skåne län",
        "country_code" : "199",
        "region_code" : "12",
        "municipality_concept_id" : "qj3q_oXH_MGR",
        "country_concept_id" : "i46j_HmG_v64",
        "municipality_code" : "1283",
        "street_address" : null,
        "country" : "Sverige"
      },
      "id" : "26360721",
      "experience_required" : false,
      "working_hours_type" : {
        "concept_id" : "6YE1_gAC_R2G",
        "label" : "Heltid",
        "legacy_ams_taxonomy_id" : "1"
      },
      "access" : null,
      "timestamp" : 1659013635819,
      "must_have" : {
        "education_level" : [ ],
        "work_experiences" : [ ],
        "skills" : [ ],
        "education" : [ ],
        "languages" : [ ]
      },
      "occupation_field" : {
        "concept_id" : "j7Cq_ZJe_GkT",
        "label" : "Bygg och anläggning",
        "legacy_ams_taxonomy_id" : "2"
      },
      "scope_of_work" : {
        "min" : 100,
        "max" : 100
      },
      "salary_type" : {
        "concept_id" : "oG8G_9cW_nRf",
        "label" : "Fast månads- vecko- eller timlön",
        "legacy_ams_taxonomy_id" : "1"
      },
      "removed" : false,
      "salary_description" : "Fast lön",
      "access_to_own_car" : false,
      "publication_date" : "2022-07-28T15:07:15"
    },
    "name" : "Vi söker kyltekniker/mekaniker till Thermo King i Helsingborg",
    "user" : "hannes"
  },
  "sha1" : "5625d88d843f3fed2610167292ce53933cd3d5fd",
  "annotations" : [ {
    "preferred-label" : "Kylmontör/Kyltekniker",
    "sentiment" : "MUST_HAVE",
    "type" : "occupation-name",
    "start-position" : 9,
    "end-position" : 20,
    "concept-id" : "JM78_Rwi_sHx",
    "matched-string" : "kyltekniker",
    "annotation-id" : 0
  }, {
    "preferred-label" : "Helsingborg",
    "type" : "municipality",
    "start-position" : 50,
    "end-position" : 61,
    "concept-id" : "qj3q_oXH_MGR",
    "matched-string" : "Helsingborg",
    "annotation-id" : 7
  }, {
    "preferred-label" : "Kylmontör/Kyltekniker",
    "sentiment" : "MUST_HAVE",
    "type" : "occupation-name",
    "start-position" : 112,
    "end-position" : 123,
    "concept-id" : "JM78_Rwi_sHx",
    "matched-string" : "kyltekniker",
    "annotation-id" : 1
  }, {
    "preferred-label" : "Kylmontör/Kyltekniker",
    "sentiment" : "MUST_HAVE",
    "type" : "occupation-name",
    "start-position" : 225,
    "end-position" : 236,
    "concept-id" : "JM78_Rwi_sHx",
    "matched-string" : "kyltekniker",
    "annotation-id" : 2
  }, {
    "preferred-label" : "Helsingborg",
    "type" : "municipality",
    "start-position" : 646,
    "end-position" : 657,
    "concept-id" : "qj3q_oXH_MGR",
    "matched-string" : "Helsingborg",
    "annotation-id" : 8
  }, {
    "preferred-label" : "B",
    "type" : "driving-licence",
    "start-position" : 1155,
    "end-position" : 1164,
    "concept-id" : "VTK8_WRx_GcM",
    "matched-string" : "B-körkort",
    "annotation-id" : 9
  }, {
    "preferred-label" : "Svenska",
    "sentiment" : "MUST_HAVE",
    "type" : "language",
    "start-position" : 1179,
    "end-position" : 1186,
    "concept-id" : "zSLA_vw2_FXN",
    "matched-string" : "svenska",
    "annotation-id" : 3
  }, {
    "preferred-label" : "Kylmontör/Kyltekniker",
    "sentiment" : "MUST_HAVE",
    "type" : "occupation-name",
    "start-position" : 1432,
    "end-position" : 1443,
    "concept-id" : "JM78_Rwi_sHx",
    "matched-string" : "kyltekniker",
    "annotation-id" : 4
  } ],
  "text" : "Vi söker kyltekniker/mekaniker till Thermo King i Helsingborg\nArbetsbeskrivning\nVill du utvecklas i en roll som Kyltekniker och bli en del av ett branschledande företag inom transportkyla? Thermo King expanderar och söker nu Kyltekniker som vill vara med i en spännande expansionsfas. I dina arbetsuppgifter ingår att genomföra service och reparationer av kylaggregat på transportbilar, tungafordon och släp. I dina arbetsuppgifter kommer även installation av kylaggregat att ingå. I arbetet kommer du att ha daglig kontakt med våra kunder och genomföra inbokade samt drop-in jobb. Du kommer till en början arbeta i vår verkstad som är belägen i Helsingborg. Med tiden finns det även möjlighet at få arbeta i fält och utgå från servicebil.\n\nDin Profil\nVi söker dig som har ett tekniskt intresse och som har en stark vilja att utvecklas i rollen. Kanske har du tidigare arbetat som mekaniker eller studerat fordonsmekanik. Du trivs med att arbeta såväl självständigt som i grupp. Vi kommer att lägga stor vikt vid dina personliga egenskaper, som person är du ödmjuk, social, serviceminded och värdesätter att hålla en hög servicegrad gentemot våra kunder.\nB-körkort samt flytande svenska i tal och skrift är krav för tjänsten.\nDu erbjuds en spännande tjänst med mycket utvecklingsmöjligheter. Vi värnar om vår kompetensförsörjning och erbjuder utbildningar löpande. Hos oss har du chansen att få gå en utbildning och bli certifierad Kyltekniker inom tung kyla.\n\n\nOm företaget\nThermo King har sedan länge insett sitt ansvar som branschledande inom transportkyla med att ställa mycket höga miljökrav. Vår ambition berör allt vi gör. Först på marknaden med låg GWP köldmedia R-452A, extremt låg-ljuds alternativ, exceptionellt låga avgasutsläpp och state-of-the-art tillverkningsanläggningar: bara några av milstolparna. Våra kunder behöver veta att de arbetar med den grönaste utrustning på marknaden och inget kommer stoppa oss att förverkliga detta.\n\nKontaktuppgifter\nI denna rekrytering samarbetar vi med Autorekrytering och frågor kring tjänsten besvaras av rekryterare Karl Andersson, karl.andersson@autorekrytering.se.\nUrval sker löpande så skicka in din ansökan redan idag!"
}