{
  "meta" : {
    "jobad" : {
      "description" : {
        "requirements" : null,
        "needs" : null,
        "company_information" : null,
        "text_formatted" : "<p>2 stycken Massöser sökes till stor fin salong i Täby. Erfarenhet är viktigt och meriterande, din ålder spelar ingen roll men ha gärna certifikat/diplom med dig.  Vi söker dig som kan arbeta både dagar/kvällar och helger, -allt efter överenskommelse. Väldigt meriterande om du kan svenska och/eller engelska. Arbetsplatsen ligger på Marknadsvägen 263, 18379 Täby (smidigt om du inte bor allt för långt ifrån) -Ring Sally på 070-9429846 om du har några frågor och är nyfiken på arbetet.</p>",
        "conditions" : null,
        "text" : "2 stycken Massöser sökes till stor fin salong i Täby. Erfarenhet är viktigt och meriterande, din ålder spelar ingen roll men ha gärna certifikat/diplom med dig.  Vi söker dig som kan arbeta både dagar/kvällar och helger, -allt efter överenskommelse. Väldigt meriterande om du kan svenska och/eller engelska. Arbetsplatsen ligger på Marknadsvägen 263, 18379 Täby (smidigt om du inte bor allt för långt ifrån) -Ring Sally på 070-9429846 om du har några frågor och är nyfiken på arbetet."
      },
      "headline" : "Thailändsk diplomerad massage",
      "driving_license" : null,
      "employer" : {
        "email" : null,
        "phone_number" : null,
        "organization_number" : "5592290190",
        "name" : "Thai Clinic Nanthawan AB",
        "url" : null,
        "workplace" : "Thai Clinic Nanthawan AB"
      },
      "removed_date" : null,
      "logo_url" : null,
      "last_publication_date" : "2022-08-24T00:00:00",
      "number_of_vacancies" : 2,
      "occupation" : {
        "concept_id" : "mC28_vEv_AVx",
        "label" : "Massör/Massageterapeut",
        "legacy_ams_taxonomy_id" : "6308"
      },
      "occupation_group" : {
        "concept_id" : "uxHV_KXc_PKD",
        "label" : "Massörer och massageterapeuter",
        "legacy_ams_taxonomy_id" : "5143"
      },
      "employment_type" : {
        "concept_id" : "PFZr_Syz_cUq",
        "label" : "Vanlig anställning",
        "legacy_ams_taxonomy_id" : "1"
      },
      "webpage_url" : "https://arbetsformedlingen.se/platsbanken/annonser/26353128",
      "driving_license_required" : false,
      "application_contacts" : [ {
        "description" : null,
        "email" : "sarika18690@gmail.com",
        "telephone" : "0709429846, 0709429846",
        "name" : "Sally Laphat",
        "contact_type" : "sarika18690@gmail.com"
      } ],
      "duration" : {
        "concept_id" : "a7uU_j21_mkL",
        "label" : "Tills vidare",
        "legacy_ams_taxonomy_id" : "1"
      },
      "nice_to_have" : {
        "education_level" : [ ],
        "work_experiences" : [ ],
        "skills" : [ ],
        "education" : [ ],
        "languages" : [ ]
      },
      "application_details" : {
        "via_af" : false,
        "email" : "sarika18690@gmail.com",
        "other" : "0709429846 ",
        "reference" : null,
        "url" : null,
        "information" : null
      },
      "source_type" : "VIA_ANNONSERA",
      "application_deadline" : "2022-08-24T00:00:00",
      "external_id" : null,
      "workplace_address" : {
        "coordinates" : [ 18.08167885105332, 59.447161841931695 ],
        "city" : "TÄBY",
        "postcode" : "18379",
        "municipality" : "Täby",
        "region_concept_id" : "CifL_Rzy_Mku",
        "region" : "Stockholms län",
        "country_code" : "199",
        "region_code" : "01",
        "municipality_concept_id" : "onpA_B5a_zfv",
        "country_concept_id" : "i46j_HmG_v64",
        "municipality_code" : "0160",
        "street_address" : "Marknadsvägen 263",
        "country" : "Sverige"
      },
      "id" : "26353128",
      "experience_required" : true,
      "working_hours_type" : {
        "concept_id" : "6YE1_gAC_R2G",
        "label" : "Heltid",
        "legacy_ams_taxonomy_id" : "1"
      },
      "access" : null,
      "timestamp" : 1658776650275,
      "must_have" : {
        "education_level" : [ ],
        "work_experiences" : [ {
          "concept_id" : "mC28_vEv_AVx",
          "weight" : 10,
          "label" : "Massör/Massageterapeut",
          "legacy_ams_taxonomy_id" : "6308"
        } ],
        "skills" : [ ],
        "education" : [ ],
        "languages" : [ ]
      },
      "occupation_field" : {
        "concept_id" : "Uuf1_GMh_Uvw",
        "label" : "Kropps- och skönhetsvård",
        "legacy_ams_taxonomy_id" : "4"
      },
      "scope_of_work" : {
        "min" : 0,
        "max" : 100
      },
      "salary_type" : {
        "concept_id" : "oG8G_9cW_nRf",
        "label" : "Fast månads- vecko- eller timlön",
        "legacy_ams_taxonomy_id" : "1"
      },
      "removed" : false,
      "salary_description" : null,
      "access_to_own_car" : false,
      "publication_date" : "2022-07-25T21:17:30"
    },
    "name" : "Thailändsk diplomerad massage",
    "user" : "kristof.fischer"
  },
  "sha1" : "9d9958a71400d57ca35bef075415f198277d5bfb",
  "annotations" : [ {
    "preferred-label" : "Massör/Massageterapeut",
    "type" : "occupation-name",
    "start-position" : 40,
    "end-position" : 48,
    "concept-id" : "mC28_vEv_AVx",
    "matched-string" : "Massöser",
    "annotation-id" : 3
  }, {
    "preferred-label" : "Täby",
    "type" : "municipality",
    "start-position" : 78,
    "end-position" : 82,
    "concept-id" : "onpA_B5a_zfv",
    "matched-string" : "Täby",
    "annotation-id" : 4
  }, {
    "preferred-label" : "Certifierad massör",
    "sentiment" : "MUST_HAVE",
    "type" : "skill",
    "start-position" : 164,
    "end-position" : 174,
    "concept-id" : "w8sL_4Wm_sEu",
    "matched-string" : "certifikat",
    "annotation-id" : 0
  }, {
    "preferred-label" : "Diplomerad massör",
    "sentiment" : "MUST_HAVE",
    "type" : "skill",
    "start-position" : 175,
    "end-position" : 181,
    "concept-id" : "wmmQ_vfi_cpK",
    "matched-string" : "diplom",
    "annotation-id" : 5
  }, {
    "preferred-label" : "Svenska",
    "sentiment" : "MUST_HAVE",
    "type" : "language",
    "start-position" : 310,
    "end-position" : 317,
    "concept-id" : "zSLA_vw2_FXN",
    "matched-string" : "svenska",
    "annotation-id" : 1
  }, {
    "preferred-label" : "Engelska",
    "sentiment" : "MUST_HAVE",
    "type" : "language",
    "start-position" : 328,
    "end-position" : 336,
    "concept-id" : "NVxJ_hLg_TYS",
    "matched-string" : "engelska",
    "annotation-id" : 2
  }, {
    "preferred-label" : "Täby",
    "type" : "municipality",
    "start-position" : 387,
    "end-position" : 391,
    "concept-id" : "onpA_B5a_zfv",
    "matched-string" : "Täby",
    "annotation-id" : 6
  } ],
  "text" : "Thailändsk diplomerad massage\n2 stycken Massöser sökes till stor fin salong i Täby. Erfarenhet är viktigt och meriterande, din ålder spelar ingen roll men ha gärna certifikat/diplom med dig.  Vi söker dig som kan arbeta både dagar/kvällar och helger, -allt efter överenskommelse. Väldigt meriterande om du kan svenska och/eller engelska. Arbetsplatsen ligger på Marknadsvägen 263, 18379 Täby (smidigt om du inte bor allt för långt ifrån) -Ring Sally på 070-9429846 om du har några frågor och är nyfiken på arbetet."
}