{
  "meta" : {
    "jobad" : {
      "description" : {
        "requirements" : null,
        "needs" : null,
        "company_information" : null,
        "text_formatted" : "<p>Är du den vi söker?</p><p>Autocars behöver nu förstärka sitt team med en Content Manager som har ett brinnande intresse för bilar, fotografering, film samt redigering.</p><p>Det är många moment kring en bilförsäljning och för att allt ska bli rätt hela vägen så startar alltid processen hos en fotograf / annonsproducent </p><p>Rollen är bred och varierande till sin karaktär, kräver hög arbetskapacitet och förmåga att prioritera saker i rätt ordning.</p><p>Företaget är under kraftig expansion och lägger stor vikt i digitalisering.</p><p>Vi ställer höga krav på bild/filmkvalité samt goda kunskaper i sociala medier. </p><p>Din roll kommer att bestå av sociala medier, fotografering, filmning, redigering samt annonsering. </p><p>Du ska ha god datavana samt erfarenhet av att jobba med olika redigeringsprogram så som Lightroom, Photoshop samt Final Cut Pro alt Premiere PRO. </p><p>Vi söker dig som är utåtriktad och tar stort ansvar för dina arbetsuppgifter. Du ska kunna ta egna initiativ och på egen hand driva ditt arbete framåt. Du är lättlärd och bra på att skapa effektivt samarbete med dina kollegor. Andra egenskaper som vi uppskattar är att du värdesätter god stämning på arbetsplatsen och förstår din egen roll i teamet.</p><p>Krav </p><p>B-körkort</p><p>Goda kunskaper i svenska tal som skrift.</p><p>Anställningen är 100%</p><p>Vi är ett företag som expanderar där du nu har möjlighet att påverka din egen roll samt utveckling i företaget.</p><p>Våren 2022 stod vår nybyggda anläggning klar på bästa AA läge och vi ser fram emot fortsatt expandering.</p><p>Låter detta intressant? Skicka då in din ansökan ihop med CV och gärna bilder eller videopresentation snarast. Ansökningar mottages enbart via mejl.</p><p>Urval sker löpande </p><p>Mail : jobb@autocars.nu</p><p>För frågor angående tjänsten kontakta</p><p>Gustav Karnevi </p><p>0500 400 483</p>",
        "conditions" : null,
        "text" : "Är du den vi söker?\nAutocars behöver nu förstärka sitt team med en Content Manager som har ett brinnande intresse för bilar, fotografering, film samt redigering.\nDet är många moment kring en bilförsäljning och för att allt ska bli rätt hela vägen så startar alltid processen hos en fotograf / annonsproducent \nRollen är bred och varierande till sin karaktär, kräver hög arbetskapacitet och förmåga att prioritera saker i rätt ordning.\nFöretaget är under kraftig expansion och lägger stor vikt i digitalisering.\nVi ställer höga krav på bild/filmkvalité samt goda kunskaper i sociala medier. \nDin roll kommer att bestå av sociala medier, fotografering, filmning, redigering samt annonsering. \nDu ska ha god datavana samt erfarenhet av att jobba med olika redigeringsprogram så som Lightroom, Photoshop samt Final Cut Pro alt Premiere PRO. \nVi söker dig som är utåtriktad och tar stort ansvar för dina arbetsuppgifter. Du ska kunna ta egna initiativ och på egen hand driva ditt arbete framåt. Du är lättlärd och bra på att skapa effektivt samarbete med dina kollegor. Andra egenskaper som vi uppskattar är att du värdesätter god stämning på arbetsplatsen och förstår din egen roll i teamet.\nKrav \nB-körkort\nGoda kunskaper i svenska tal som skrift.\nAnställningen är 100%\nVi är ett företag som expanderar där du nu har möjlighet att påverka din egen roll samt utveckling i företaget.\nVåren 2022 stod vår nybyggda anläggning klar på bästa AA läge och vi ser fram emot fortsatt expandering.\nLåter detta intressant? Skicka då in din ansökan ihop med CV och gärna bilder eller videopresentation snarast. Ansökningar mottages enbart via mejl.\nUrval sker löpande \nMail : jobb@autocars.nu\nFör frågor angående tjänsten kontakta\nGustav Karnevi \n0500 400 483"
      },
      "headline" : "Content Manager / Fotograf",
      "driving_license" : [ {
        "concept_id" : "VTK8_WRx_GcM",
        "label" : "B",
        "legacy_ams_taxonomy_id" : "3"
      } ],
      "employer" : {
        "email" : null,
        "phone_number" : null,
        "organization_number" : "5569417396",
        "name" : "Autocars i Skövde AB",
        "url" : null,
        "workplace" : "Autocars i Skövde AB"
      },
      "removed_date" : null,
      "logo_url" : "https://www.arbetsformedlingen.se/rest/arbetsgivare/rest/af/v3/arbetsplatser/86343723/logotyper/logo.png",
      "last_publication_date" : "2022-07-20T00:00:00",
      "number_of_vacancies" : 1,
      "occupation" : {
        "concept_id" : "1N2U_6xW_Tdx",
        "label" : "Fotograf",
        "legacy_ams_taxonomy_id" : "4790"
      },
      "occupation_group" : {
        "concept_id" : "3J38_DNz_YKK",
        "label" : "Fotografer",
        "legacy_ams_taxonomy_id" : "3431"
      },
      "employment_type" : {
        "concept_id" : "PFZr_Syz_cUq",
        "label" : "Vanlig anställning",
        "legacy_ams_taxonomy_id" : "1"
      },
      "webpage_url" : "https://arbetsformedlingen.se/platsbanken/annonser/26236008",
      "driving_license_required" : true,
      "application_contacts" : [ {
        "description" : null,
        "email" : "jobb@autocars.nu",
        "telephone" : "0500400483",
        "name" : "Gustav Karnevi",
        "contact_type" : null
      } ],
      "duration" : {
        "concept_id" : "a7uU_j21_mkL",
        "label" : "Tills vidare",
        "legacy_ams_taxonomy_id" : "1"
      },
      "nice_to_have" : {
        "education_level" : [ ],
        "work_experiences" : [ ],
        "skills" : [ ],
        "education" : [ ],
        "languages" : [ ]
      },
      "application_details" : {
        "via_af" : false,
        "email" : "jobb@autocars.nu",
        "other" : null,
        "reference" : null,
        "url" : null,
        "information" : null
      },
      "source_type" : "VIA_ANNONSERA",
      "application_deadline" : "2022-07-20T00:00:00",
      "external_id" : null,
      "workplace_address" : {
        "coordinates" : [ 13.872664208223119, 58.41262325547759 ],
        "city" : "Skövde",
        "postcode" : "54139",
        "municipality" : "Skövde",
        "region_concept_id" : "zdoY_6u5_Krt",
        "region" : "Västra Götalands län",
        "country_code" : "199",
        "region_code" : "14",
        "municipality_concept_id" : "fqAy_4ji_Lz2",
        "country_concept_id" : "i46j_HmG_v64",
        "municipality_code" : "1496",
        "street_address" : "Mellomkvarnsvägen 11",
        "country" : "Sverige"
      },
      "id" : "26236008",
      "experience_required" : true,
      "working_hours_type" : {
        "concept_id" : "6YE1_gAC_R2G",
        "label" : "Heltid",
        "legacy_ams_taxonomy_id" : "1"
      },
      "access" : null,
      "timestamp" : 1655718560773,
      "must_have" : {
        "education_level" : [ ],
        "work_experiences" : [ {
          "concept_id" : "1N2U_6xW_Tdx",
          "weight" : 10,
          "label" : "Fotograf",
          "legacy_ams_taxonomy_id" : "4790"
        } ],
        "skills" : [ ],
        "education" : [ ],
        "languages" : [ {
          "concept_id" : "zSLA_vw2_FXN",
          "weight" : 10,
          "label" : "Svenska",
          "legacy_ams_taxonomy_id" : "502"
        } ]
      },
      "occupation_field" : {
        "concept_id" : "9puE_nYg_crq",
        "label" : "Kultur, media, design",
        "legacy_ams_taxonomy_id" : "11"
      },
      "scope_of_work" : {
        "min" : 0,
        "max" : 100
      },
      "salary_type" : {
        "concept_id" : "oG8G_9cW_nRf",
        "label" : "Fast månads- vecko- eller timlön",
        "legacy_ams_taxonomy_id" : "1"
      },
      "removed" : false,
      "salary_description" : null,
      "access_to_own_car" : false,
      "publication_date" : "2022-06-20T11:49:20"
    },
    "name" : "Content Manager / Fotograf",
    "user" : "fisko"
  },
  "sha1" : "96aa62677422b27a2d1d7e80af6e5d882b05a848",
  "annotations" : [ {
    "preferred-label" : "Content manager",
    "sentiment" : "MUST_HAVE",
    "type" : "keyword",
    "start-position" : 0,
    "end-position" : 15,
    "concept-id" : "yDfK_MAc_L1d",
    "matched-string" : "content manager",
    "annotation-id" : 0
  }, {
    "preferred-label" : "Fotograf",
    "sentiment" : "MUST_HAVE",
    "type" : "occupation-name",
    "start-position" : 18,
    "end-position" : 26,
    "concept-id" : "1N2U_6xW_Tdx",
    "matched-string" : "fotograf",
    "annotation-id" : 1
  }, {
    "preferred-label" : "Content manager",
    "sentiment" : "MUST_HAVE",
    "type" : "keyword",
    "start-position" : 94,
    "end-position" : 109,
    "concept-id" : "yDfK_MAc_L1d",
    "matched-string" : "content manager",
    "annotation-id" : 2
  }, {
    "preferred-label" : "Fotograf",
    "sentiment" : "MUST_HAVE",
    "type" : "occupation-name",
    "start-position" : 309,
    "end-position" : 317,
    "concept-id" : "1N2U_6xW_Tdx",
    "matched-string" : "fotograf",
    "annotation-id" : 4
  }, {
    "preferred-label" : "Annonsproducent",
    "sentiment" : "MUST_HAVE",
    "type" : "occupation-name",
    "start-position" : 320,
    "end-position" : 335,
    "concept-id" : "Cya6_5QD_RTL",
    "matched-string" : "annonsproducent",
    "annotation-id" : 5
  }, {
    "preferred-label" : "skapa digitala bilder",
    "sentiment" : "MUST_HAVE",
    "type" : "esco-skill",
    "start-position" : 562,
    "end-position" : 578,
    "concept-id" : "KNi2_PZu_uk1",
    "matched-string" : "bild/filmkvalité",
    "annotation-id" : 8
  }, {
    "preferred-label" : "hålla sig uppdaterad med sociala medier",
    "sentiment" : "MUST_HAVE",
    "type" : "esco-skill",
    "start-position" : 601,
    "end-position" : 615,
    "concept-id" : "1TCA_LMG_Kxr",
    "matched-string" : "sociala medier",
    "annotation-id" : 9
  }, {
    "preferred-label" : "hantering av sociala medier",
    "sentiment" : "MUST_HAVE",
    "type" : "esco-skill",
    "start-position" : 647,
    "end-position" : 661,
    "concept-id" : "MgRt_szJ_YYJ",
    "matched-string" : "sociala medier",
    "annotation-id" : 10
  }, {
    "preferred-label" : "Fotografering",
    "sentiment" : "MUST_HAVE",
    "type" : "skill",
    "start-position" : 663,
    "end-position" : 676,
    "concept-id" : "zpaf_mDu_foK",
    "matched-string" : "fotografering",
    "annotation-id" : 6
  }, {
    "preferred-label" : "Filmning, videoproduktion",
    "sentiment" : "MUST_HAVE",
    "type" : "skill",
    "start-position" : 678,
    "end-position" : 686,
    "concept-id" : "gmVS_wvg_McL",
    "matched-string" : "filmning",
    "annotation-id" : 11
  }, {
    "preferred-label" : "Redigering, rörlig bild",
    "sentiment" : "MUST_HAVE",
    "type" : "skill",
    "start-position" : 688,
    "end-position" : 698,
    "concept-id" : "Eizh_YsE_amu",
    "matched-string" : "redigering",
    "annotation-id" : 12
  }, {
    "preferred-label" : "Annonsproduktion",
    "sentiment" : "MUST_HAVE",
    "type" : "skill",
    "start-position" : 704,
    "end-position" : 715,
    "concept-id" : "nvM6_J6v_qKQ",
    "matched-string" : "annonsering",
    "annotation-id" : 13
  }, {
    "preferred-label" : "använda dator",
    "sentiment" : "MUST_HAVE",
    "type" : "esco-skill",
    "start-position" : 732,
    "end-position" : 740,
    "concept-id" : "HEbR_xrb_MpT",
    "matched-string" : "datavana",
    "annotation-id" : 14
  }, {
    "preferred-label" : "redigeringsprogramvara",
    "sentiment" : "MUST_HAVE",
    "type" : "esco-skill",
    "start-position" : 780,
    "end-position" : 798,
    "concept-id" : "nhKU_6Rj_aqy",
    "matched-string" : "redigeringsprogram",
    "annotation-id" : 15
  }, {
    "preferred-label" : "Adobe Lightroom",
    "sentiment" : "MUST_HAVE",
    "type" : "skill",
    "start-position" : 806,
    "end-position" : 815,
    "concept-id" : "puiy_Nb9_yUF",
    "matched-string" : "Lightroom",
    "annotation-id" : 16
  }, {
    "preferred-label" : "2D-grafik-Adobe Photoshop",
    "sentiment" : "MUST_HAVE",
    "type" : "skill",
    "start-position" : 817,
    "end-position" : 826,
    "concept-id" : "xNyv_PTi_fSa",
    "matched-string" : "Photoshop",
    "annotation-id" : 17
  }, {
    "preferred-label" : "Film/redigering-Apple Final Cut Pro",
    "sentiment" : "MUST_HAVE",
    "type" : "skill",
    "start-position" : 832,
    "end-position" : 845,
    "concept-id" : "VVj2_4Uu_LL9",
    "matched-string" : "Final Cut Pro",
    "annotation-id" : 18
  }, {
    "preferred-label" : "Film/redigering-Adobe Premiere",
    "sentiment" : "MUST_HAVE",
    "type" : "skill",
    "start-position" : 850,
    "end-position" : 862,
    "concept-id" : "GCMj_xLD_mj6",
    "matched-string" : "Premiere PRO",
    "annotation-id" : 19
  }, {
    "preferred-label" : "B",
    "sentiment" : "MUST_HAVE",
    "type" : "driving-licence",
    "start-position" : 1221,
    "end-position" : 1230,
    "concept-id" : "VTK8_WRx_GcM",
    "matched-string" : "B-körkort",
    "annotation-id" : 20
  }, {
    "preferred-label" : "Svenska",
    "sentiment" : "MUST_HAVE",
    "type" : "language",
    "start-position" : 1248,
    "end-position" : 1255,
    "concept-id" : "zSLA_vw2_FXN",
    "matched-string" : "svenska",
    "annotation-id" : 7
  } ],
  "text" : "Content Manager / Fotograf\nÄr du den vi söker?\nAutocars behöver nu förstärka sitt team med en Content Manager som har ett brinnande intresse för bilar, fotografering, film samt redigering.\nDet är många moment kring en bilförsäljning och för att allt ska bli rätt hela vägen så startar alltid processen hos en fotograf / annonsproducent \nRollen är bred och varierande till sin karaktär, kräver hög arbetskapacitet och förmåga att prioritera saker i rätt ordning.\nFöretaget är under kraftig expansion och lägger stor vikt i digitalisering.\nVi ställer höga krav på bild/filmkvalité samt goda kunskaper i sociala medier. \nDin roll kommer att bestå av sociala medier, fotografering, filmning, redigering samt annonsering. \nDu ska ha god datavana samt erfarenhet av att jobba med olika redigeringsprogram så som Lightroom, Photoshop samt Final Cut Pro alt Premiere PRO. \nVi söker dig som är utåtriktad och tar stort ansvar för dina arbetsuppgifter. Du ska kunna ta egna initiativ och på egen hand driva ditt arbete framåt. Du är lättlärd och bra på att skapa effektivt samarbete med dina kollegor. Andra egenskaper som vi uppskattar är att du värdesätter god stämning på arbetsplatsen och förstår din egen roll i teamet.\nKrav \nB-körkort\nGoda kunskaper i svenska tal som skrift.\nAnställningen är 100%\nVi är ett företag som expanderar där du nu har möjlighet att påverka din egen roll samt utveckling i företaget.\nVåren 2022 stod vår nybyggda anläggning klar på bästa AA läge och vi ser fram emot fortsatt expandering.\nLåter detta intressant? Skicka då in din ansökan ihop med CV och gärna bilder eller videopresentation snarast. Ansökningar mottages enbart via mejl.\nUrval sker löpande \nMail : jobb@autocars.nu\nFör frågor angående tjänsten kontakta\nGustav Karnevi \n0500 400 483"
}