{
  "meta" : {
    "jobad" : {
      "description" : {
        "requirements" : null,
        "needs" : null,
        "company_information" : null,
        "text_formatted" : "Vårt arbete gör skillnad i människors vardag! Vi är cirka 7 000 medarbetare och här finns gott om utrymme för dig som vill lyfta tillsammans med oss. Kristianstad är nordöstra Skånes handelscentrum med 85 000 invånare, bara en timmes tågresa från storstadsområdet vid Öresund.\n\nHjälpmedelscentrum Östra Skåne (HÖS) sköter hjälpmedelsförsörjningen för kommunerna Bromölla, Hässleholm, Hörby, Kristianstad, Osby, Simrishamn, Sjöbo, Skurup, Tomelilla, Ystad, Östra Göinge. Vi är en växande verksamhet i ständig utveckling. Vårt arbete och värdegrund baseras på ett professionellt bemötande med god service och ständiga förbättringar. Våra ledstjärnor är respekt, kommunikation och yrkesskicklighet. Nu söker vi tekniker till Hjälpmedelscentrum Östra Skåne.\n\r\n\r\nARBETSUPPGIFTER\nSom tekniker på HÖS arbetar du främst med service, reparationer, rekonditionering och transport av medicintekniska hjälpmedel. Vi arbetar i egna lokaler på Ängamöllan i Kristianstad samt ute hos kunderna, både i boenden och hemma hos användarna över hela östra Skåne.\n\nTjänsten som tekniker på HÖS innebär bland annat reparation, montering och underhåll, men kan även innebära rekonditionering och transport av hjälpmedel. Transporten till hemadresser görs i 3.5 tons lastbilar som får framföras med B-kort. Som tekniker har du ett stort eget ansvar och planerar dina arbeten och/eller rundor själv, men även tillsammans i gruppen, vilket ställer krav på ett bra ordningssinne\n\nI enheten finns det tre olika inriktningar av tekniker.\nUteservice som innebär att man arbetar till största del själv och ansvarar för reparationer, förebyggande underhåll, besiktningar, anpassningar med mera ute hos kunder/användare i östra Skåne.\nTransport/Hemtransport som i huvudsak levererar och hämtar hjälpmedel hemma hos användaren eller i kommunförråd, men det innebär även en del reparationer, förebyggande underhåll och rekonditionering. På hemtransport jobbar man alltid i par medan transport är ensamarbete.\nDen tredje inriktningen är rekonditionering som framför allt rekonditionerar och anpassar hjälpmedel efter beställningar innan de skickas ut, men gruppen utgör även utfyllnad i de två tidigare grupperna vid behov på grund av hög arbetsbelastning, samt planerad och oplanerad frånvaro. Enheten består idag av 16 medarbetare.\n\nSom utetekniker har du ett stort eget ansvar och planerar dina rundor och arbeten själv men även tillsammans i gruppen, vilket ställer krav på ett bra ordningssinne. Du har daglig kontakt med förskrivare, användare och andra personer/funktioner. Avrapportering och informationshämtning gör du i vårt verksamhetssystem.\n\nPå hemtransport jobbar vi i par och har som par ett stort eget ansvar och planerar sina rundor och arbeten som grupp för att optimera, vilket ställer krav på ett bra ordningssinne. Du har daglig kontakt med förskrivare, användare och andra personer/funktioner. Avrapportering och informationshämtning gör du i vårt verksamhetssystem.\n\nPå rekonditionering arbetar du i grupp med att rekonditionera, återställa och anpassa hjälpmedel. Avrapportering och informationshämtning gör du i vårt verksamhetssystem. Tjänsten vi vill tillsätta kommer att ha, som det ser ut nu, rekonditionering som primära inriktning.\n\r\n\r\nKVALIFIKATIONER\nVi söker dig som har godkänd treårig gymnasieutbildning, föredragsvis med en teknisk inriktning. Har du relevant utbildning från högskola anses det meriterande. Vi vill att du har erfarenhet från arbete med kunder och support. Vi ser gärna att du även har erfarenhet inom service, teknik och system. Eftersom arbetet kräver kommunikation och dokumentation förutsätter vi att du har grundläggande datorkunskaper och att du kan kommunicera och formulera dig väl på svenska i tal och skrift.\n\nDu har förmågan att arbeta med andra människor, att lyssna, visa empati och respekt. Du är prestigelös och uppmärksammar och belönar andras bidrag. Du bemöter andra på ett serviceinriktat och tillmötesgående sätt. Arbetet kräver att du har förmågan att följa instruktioner, procedurer, lagstadgade krav och policy, samt förhålla dig till uppsatta tidsplaner. Då Hjälpmedelscentrum verkar i 11 kommuner, som du kommer att besöka, är det ett krav att du har B-körkort för manuell växellåda.\n\nIntervjuer sker löpande så vänta inte med din ansökan. Vi är en mansdominerad arbetsplats och ser gärna kvinnliga sökande.\n\nUnder perioden 220718-220731 är rekryterande chef ej möjlig att nå vid eventuella frågor.\n\r\n\nÖVRIGT\nOmsorgsförvaltningens verksamhet riktar sig till äldre och personer som har behov av funktionsstöd samt till personer med behov av hemsjukvård. Verksamheten är funktionsindelad i fyra verksamhetsområden: stöd i ordinärt boende, stöd i vård- och omsorgsboende, hälso- och sjukvård samt funktionsstöd. I förvaltningen finns också myndighetsenheten, riksgymnasiet och hjälpmedelscentrum i Östra Skåne.\n\nI Kristianstads kommun tillämpar vi heltid för alla, vilket innebär att alla medarbetare med tillsvidareanställning har rätt till heltid och deltid är en möjlighet. Vi tillämpar också rökfri arbetstid. \n\nHar du skyddade personuppgifter skickar du in din ansökan via post märkt med titel och referensnummer. Du kan också lämna din ansökan på Rådhus Skåne. Har du frågor kan nå oss via växeln 044-13 50 00.\n\nHar du frågor kring hur du gör din ansökan, kontakta systemets support på telefon 0771-69 36 93 eller via länken https://zero.comaround.com/sv-se/.",
        "conditions" : "Heltid. \r\nTillsvidareanställning, tillträde: Tillträde enligt överenskommelse. .",
        "text" : "Vårt arbete gör skillnad i människors vardag! Vi är cirka 7 000 medarbetare och här finns gott om utrymme för dig som vill lyfta tillsammans med oss. Kristianstad är nordöstra Skånes handelscentrum med 85 000 invånare, bara en timmes tågresa från storstadsområdet vid Öresund.\n\nHjälpmedelscentrum Östra Skåne (HÖS) sköter hjälpmedelsförsörjningen för kommunerna Bromölla, Hässleholm, Hörby, Kristianstad, Osby, Simrishamn, Sjöbo, Skurup, Tomelilla, Ystad, Östra Göinge. Vi är en växande verksamhet i ständig utveckling. Vårt arbete och värdegrund baseras på ett professionellt bemötande med god service och ständiga förbättringar. Våra ledstjärnor är respekt, kommunikation och yrkesskicklighet. Nu söker vi tekniker till Hjälpmedelscentrum Östra Skåne.\n\r\n\r\nARBETSUPPGIFTER\nSom tekniker på HÖS arbetar du främst med service, reparationer, rekonditionering och transport av medicintekniska hjälpmedel. Vi arbetar i egna lokaler på Ängamöllan i Kristianstad samt ute hos kunderna, både i boenden och hemma hos användarna över hela östra Skåne.\n\nTjänsten som tekniker på HÖS innebär bland annat reparation, montering och underhåll, men kan även innebära rekonditionering och transport av hjälpmedel. Transporten till hemadresser görs i 3.5 tons lastbilar som får framföras med B-kort. Som tekniker har du ett stort eget ansvar och planerar dina arbeten och/eller rundor själv, men även tillsammans i gruppen, vilket ställer krav på ett bra ordningssinne\n\nI enheten finns det tre olika inriktningar av tekniker.\nUteservice som innebär att man arbetar till största del själv och ansvarar för reparationer, förebyggande underhåll, besiktningar, anpassningar med mera ute hos kunder/användare i östra Skåne.\nTransport/Hemtransport som i huvudsak levererar och hämtar hjälpmedel hemma hos användaren eller i kommunförråd, men det innebär även en del reparationer, förebyggande underhåll och rekonditionering. På hemtransport jobbar man alltid i par medan transport är ensamarbete.\nDen tredje inriktningen är rekonditionering som framför allt rekonditionerar och anpassar hjälpmedel efter beställningar innan de skickas ut, men gruppen utgör även utfyllnad i de två tidigare grupperna vid behov på grund av hög arbetsbelastning, samt planerad och oplanerad frånvaro. Enheten består idag av 16 medarbetare.\n\nSom utetekniker har du ett stort eget ansvar och planerar dina rundor och arbeten själv men även tillsammans i gruppen, vilket ställer krav på ett bra ordningssinne. Du har daglig kontakt med förskrivare, användare och andra personer/funktioner. Avrapportering och informationshämtning gör du i vårt verksamhetssystem.\n\nPå hemtransport jobbar vi i par och har som par ett stort eget ansvar och planerar sina rundor och arbeten som grupp för att optimera, vilket ställer krav på ett bra ordningssinne. Du har daglig kontakt med förskrivare, användare och andra personer/funktioner. Avrapportering och informationshämtning gör du i vårt verksamhetssystem.\n\nPå rekonditionering arbetar du i grupp med att rekonditionera, återställa och anpassa hjälpmedel. Avrapportering och informationshämtning gör du i vårt verksamhetssystem. Tjänsten vi vill tillsätta kommer att ha, som det ser ut nu, rekonditionering som primära inriktning.\n\r\n\r\nKVALIFIKATIONER\nVi söker dig som har godkänd treårig gymnasieutbildning, föredragsvis med en teknisk inriktning. Har du relevant utbildning från högskola anses det meriterande. Vi vill att du har erfarenhet från arbete med kunder och support. Vi ser gärna att du även har erfarenhet inom service, teknik och system. Eftersom arbetet kräver kommunikation och dokumentation förutsätter vi att du har grundläggande datorkunskaper och att du kan kommunicera och formulera dig väl på svenska i tal och skrift.\n\nDu har förmågan att arbeta med andra människor, att lyssna, visa empati och respekt. Du är prestigelös och uppmärksammar och belönar andras bidrag. Du bemöter andra på ett serviceinriktat och tillmötesgående sätt. Arbetet kräver att du har förmågan att följa instruktioner, procedurer, lagstadgade krav och policy, samt förhålla dig till uppsatta tidsplaner. Då Hjälpmedelscentrum verkar i 11 kommuner, som du kommer att besöka, är det ett krav att du har B-körkort för manuell växellåda.\n\nIntervjuer sker löpande så vänta inte med din ansökan. Vi är en mansdominerad arbetsplats och ser gärna kvinnliga sökande.\n\nUnder perioden 220718-220731 är rekryterande chef ej möjlig att nå vid eventuella frågor.\n\r\n\nÖVRIGT\nOmsorgsförvaltningens verksamhet riktar sig till äldre och personer som har behov av funktionsstöd samt till personer med behov av hemsjukvård. Verksamheten är funktionsindelad i fyra verksamhetsområden: stöd i ordinärt boende, stöd i vård- och omsorgsboende, hälso- och sjukvård samt funktionsstöd. I förvaltningen finns också myndighetsenheten, riksgymnasiet och hjälpmedelscentrum i Östra Skåne.\n\nI Kristianstads kommun tillämpar vi heltid för alla, vilket innebär att alla medarbetare med tillsvidareanställning har rätt till heltid och deltid är en möjlighet. Vi tillämpar också rökfri arbetstid. \n\nHar du skyddade personuppgifter skickar du in din ansökan via post märkt med titel och referensnummer. Du kan också lämna din ansökan på Rådhus Skåne. Har du frågor kan nå oss via växeln 044-13 50 00.\n\nHar du frågor kring hur du gör din ansökan, kontakta systemets support på telefon 0771-69 36 93 eller via länken https://zero.comaround.com/sv-se/."
      },
      "headline" : "Tekniker, Hjälpmedelscentrum Östra Skåne",
      "driving_license" : [ {
        "concept_id" : "VTK8_WRx_GcM",
        "label" : "B",
        "legacy_ams_taxonomy_id" : "3"
      } ],
      "employer" : {
        "email" : null,
        "phone_number" : null,
        "organization_number" : "2120000951",
        "name" : "Kristianstads kommun",
        "url" : null,
        "workplace" : "Kristianstad kommun, Hjälpmedelscentrum"
      },
      "removed_date" : null,
      "logo_url" : "https://www.arbetsformedlingen.se/rest/arbetsgivare/rest/af/v3/organisation/2120000951/logotyper/logo.png",
      "last_publication_date" : "2022-08-07T23:59:59",
      "number_of_vacancies" : 1,
      "occupation" : {
        "concept_id" : "c8PJ_S6r_Lg2",
        "label" : "Hjälpmedelstekniker",
        "legacy_ams_taxonomy_id" : "5668"
      },
      "occupation_group" : {
        "concept_id" : "e6nk_AGp_y28",
        "label" : "Finmekaniker",
        "legacy_ams_taxonomy_id" : "7311"
      },
      "employment_type" : {
        "concept_id" : "PFZr_Syz_cUq",
        "label" : "Vanlig anställning",
        "legacy_ams_taxonomy_id" : "1"
      },
      "webpage_url" : "https://arbetsformedlingen.se/platsbanken/annonser/26267463",
      "driving_license_required" : true,
      "application_contacts" : [ {
        "description" : "Marcus Rydlund",
        "email" : "marcus.rydlund@kristianstad.se",
        "telephone" : "044134261",
        "name" : null,
        "contact_type" : "Enhetschef"
      } ],
      "duration" : {
        "concept_id" : "a7uU_j21_mkL",
        "label" : "Tills vidare",
        "legacy_ams_taxonomy_id" : "1"
      },
      "nice_to_have" : {
        "education_level" : [ ],
        "work_experiences" : [ ],
        "skills" : [ ],
        "education" : [ ],
        "languages" : [ ]
      },
      "application_details" : {
        "via_af" : false,
        "email" : null,
        "other" : null,
        "reference" : "OMS-2022-153",
        "url" : "https://recruit.visma.com/Public/Apply.aspx?guidAssignment=d8fd5d9b-b00b-47e5-b451-3e5ac15ac5cd&publishCode=AMS&TK=fc7a4dad-b64e-4b11-9e6f-ad884d5598df",
        "information" : null
      },
      "source_type" : "VIA_PLATSBANKEN_DXA",
      "application_deadline" : "2022-08-07T23:59:59",
      "external_id" : "46-212000-0951-D8FD5D9BB00B47E5B4513E5AC15AC5CD",
      "workplace_address" : {
        "coordinates" : [ 14.156678, 56.029392 ],
        "city" : null,
        "postcode" : null,
        "municipality" : "Kristianstad",
        "region_concept_id" : "CaRE_1nn_cSU",
        "region" : "Skåne län",
        "country_code" : "199",
        "region_code" : "12",
        "municipality_concept_id" : "vrvW_sr8_1en",
        "country_concept_id" : "i46j_HmG_v64",
        "municipality_code" : "1290",
        "street_address" : null,
        "country" : "Sverige"
      },
      "id" : "26267463",
      "experience_required" : true,
      "working_hours_type" : {
        "concept_id" : "6YE1_gAC_R2G",
        "label" : "Heltid",
        "legacy_ams_taxonomy_id" : "1"
      },
      "access" : null,
      "timestamp" : 1656416728250,
      "must_have" : {
        "education_level" : [ ],
        "work_experiences" : [ {
          "concept_id" : "c8PJ_S6r_Lg2",
          "weight" : 10,
          "label" : "Hjälpmedelstekniker",
          "legacy_ams_taxonomy_id" : "5668"
        } ],
        "skills" : [ ],
        "education" : [ ],
        "languages" : [ ]
      },
      "occupation_field" : {
        "concept_id" : "PaxQ_o1G_wWH",
        "label" : "Hantverk",
        "legacy_ams_taxonomy_id" : "6"
      },
      "scope_of_work" : {
        "min" : 100,
        "max" : 100
      },
      "salary_type" : {
        "concept_id" : "oG8G_9cW_nRf",
        "label" : "Fast månads- vecko- eller timlön",
        "legacy_ams_taxonomy_id" : "1"
      },
      "removed" : false,
      "salary_description" : "Månadslön",
      "access_to_own_car" : false,
      "publication_date" : "2022-07-18T00:00:00"
    },
    "name" : "Tekniker, Hjälpmedelscentrum Östra Skåne",
    "user" : "kristof.fischer"
  },
  "sha1" : "89c2d04a2a1d9e9a0d154ff43d793ca12247720a",
  "annotations" : [ {
    "preferred-label" : "Hjälpmedelstekniker",
    "type" : "occupation-name",
    "start-position" : 0,
    "end-position" : 8,
    "concept-id" : "c8PJ_S6r_Lg2",
    "matched-string" : "Tekniker",
    "annotation-id" : 26
  }, {
    "preferred-label" : "Skåne län",
    "type" : "region",
    "start-position" : 35,
    "end-position" : 40,
    "concept-id" : "CaRE_1nn_cSU",
    "matched-string" : "Skåne",
    "annotation-id" : 27
  }, {
    "preferred-label" : "Kristianstad",
    "type" : "municipality",
    "start-position" : 191,
    "end-position" : 203,
    "concept-id" : "vrvW_sr8_1en",
    "matched-string" : "Kristianstad",
    "annotation-id" : 12
  }, {
    "preferred-label" : "Bromölla",
    "type" : "municipality",
    "start-position" : 403,
    "end-position" : 411,
    "concept-id" : "WMNK_PXa_Khm",
    "matched-string" : "Bromölla",
    "annotation-id" : 13
  }, {
    "preferred-label" : "Hässleholm",
    "type" : "municipality",
    "start-position" : 413,
    "end-position" : 423,
    "concept-id" : "bP5q_53x_aqJ",
    "matched-string" : "Hässleholm",
    "annotation-id" : 14
  }, {
    "preferred-label" : "Hörby",
    "type" : "municipality",
    "start-position" : 425,
    "end-position" : 430,
    "concept-id" : "autr_KMa_cfp",
    "matched-string" : "Hörby",
    "annotation-id" : 15
  }, {
    "preferred-label" : "Kristianstad",
    "type" : "municipality",
    "start-position" : 432,
    "end-position" : 444,
    "concept-id" : "vrvW_sr8_1en",
    "matched-string" : "Kristianstad",
    "annotation-id" : 16
  }, {
    "preferred-label" : "Osby",
    "type" : "municipality",
    "start-position" : 446,
    "end-position" : 450,
    "concept-id" : "najS_Lvy_mDD",
    "matched-string" : "Osby",
    "annotation-id" : 17
  }, {
    "preferred-label" : "Simrishamn",
    "type" : "municipality",
    "start-position" : 452,
    "end-position" : 462,
    "concept-id" : "dLxo_EpC_oPe",
    "matched-string" : "Simrishamn",
    "annotation-id" : 18
  }, {
    "preferred-label" : "Sjöbo",
    "type" : "municipality",
    "start-position" : 464,
    "end-position" : 469,
    "concept-id" : "P3Cs_1ZP_9XB",
    "matched-string" : "Sjöbo",
    "annotation-id" : 19
  }, {
    "preferred-label" : "Skurup",
    "type" : "municipality",
    "start-position" : 471,
    "end-position" : 477,
    "concept-id" : "oezL_78x_r89",
    "matched-string" : "Skurup",
    "annotation-id" : 20
  }, {
    "preferred-label" : "Tomelilla",
    "type" : "municipality",
    "start-position" : 479,
    "end-position" : 488,
    "concept-id" : "UMev_wGs_9bg",
    "matched-string" : "Tomelilla",
    "annotation-id" : 21
  }, {
    "preferred-label" : "Ystad",
    "type" : "municipality",
    "start-position" : 490,
    "end-position" : 495,
    "concept-id" : "hdYk_hnP_uju",
    "matched-string" : "Ystad",
    "annotation-id" : 22
  }, {
    "preferred-label" : "Östra Göinge",
    "type" : "municipality",
    "start-position" : 497,
    "end-position" : 509,
    "concept-id" : "LTt7_CGG_RUf",
    "matched-string" : "Östra Göinge",
    "annotation-id" : 23
  }, {
    "preferred-label" : "Hjälpmedelstekniker",
    "type" : "occupation-name",
    "start-position" : 749,
    "end-position" : 757,
    "concept-id" : "c8PJ_S6r_Lg2",
    "matched-string" : "tekniker",
    "annotation-id" : 24
  }, {
    "preferred-label" : "Skåne län",
    "type" : "region",
    "start-position" : 788,
    "end-position" : 793,
    "concept-id" : "CaRE_1nn_cSU",
    "matched-string" : "Skåne",
    "annotation-id" : 25
  }, {
    "preferred-label" : "underhåll och reparation",
    "sentiment" : "MUST_HAVE",
    "type" : "esco-skill",
    "start-position" : 866,
    "end-position" : 878,
    "concept-id" : "i19U_G6R_t19",
    "matched-string" : "reparationer",
    "annotation-id" : 28
  }, {
    "preferred-label" : "Rekonditionering",
    "sentiment" : "MUST_HAVE",
    "type" : "skill",
    "start-position" : 880,
    "end-position" : 896,
    "concept-id" : "k9pW_awM_Kmy",
    "matched-string" : "rekonditionering",
    "annotation-id" : 1
  }, {
    "preferred-label" : "transportsätt för gods",
    "sentiment" : "MUST_HAVE",
    "type" : "esco-skill",
    "start-position" : 901,
    "end-position" : 940,
    "concept-id" : "pe1Z_QxT_nrU",
    "matched-string" : "transport av medicintekniska hjälpmedel",
    "annotation-id" : 29
  }, {
    "preferred-label" : "Kristianstad",
    "type" : "municipality",
    "start-position" : 984,
    "end-position" : 996,
    "concept-id" : "vrvW_sr8_1en",
    "matched-string" : "Kristianstad",
    "annotation-id" : 30
  }, {
    "preferred-label" : "Skåne län",
    "type" : "region",
    "start-position" : 1076,
    "end-position" : 1081,
    "concept-id" : "CaRE_1nn_cSU",
    "matched-string" : "Skåne",
    "annotation-id" : 31
  }, {
    "preferred-label" : "underhåll och reparation",
    "sentiment" : "MUST_HAVE",
    "type" : "esco-skill",
    "start-position" : 1133,
    "end-position" : 1143,
    "concept-id" : "i19U_G6R_t19",
    "matched-string" : "reparation",
    "annotation-id" : 32
  }, {
    "preferred-label" : "Montering, mekanik",
    "sentiment" : "MUST_HAVE",
    "type" : "skill",
    "start-position" : 1145,
    "end-position" : 1154,
    "concept-id" : "SMLj_ds3_Qe7",
    "matched-string" : "montering",
    "annotation-id" : 33
  }, {
    "preferred-label" : "underhåll och reparation",
    "sentiment" : "MUST_HAVE",
    "type" : "esco-skill",
    "start-position" : 1159,
    "end-position" : 1168,
    "concept-id" : "i19U_G6R_t19",
    "matched-string" : "underhåll",
    "annotation-id" : 34
  }, {
    "preferred-label" : "Rekonditionering",
    "sentiment" : "MUST_HAVE",
    "type" : "skill",
    "start-position" : 1192,
    "end-position" : 1208,
    "concept-id" : "k9pW_awM_Kmy",
    "matched-string" : "rekonditionering",
    "annotation-id" : 2
  }, {
    "preferred-label" : "visa ansvarstagande",
    "sentiment" : "MUST_HAVE",
    "type" : "esco-skill",
    "start-position" : 2372,
    "end-position" : 2383,
    "concept-id" : "bcRp_hxV_f5G",
    "matched-string" : "eget ansvar",
    "annotation-id" : 35
  }, {
    "preferred-label" : "Gymnasial utbildning, 3 år",
    "sentiment" : "MUST_HAVE",
    "type" : "sun-education-level-2",
    "start-position" : 3316,
    "end-position" : 3342,
    "concept-id" : "7wEe_uui_q7S",
    "matched-string" : "treårig gymnasieutbildning",
    "annotation-id" : 36
  }, {
    "preferred-label" : "Annan utbildning inom teknik och teknisk industri",
    "sentiment" : "MUST_HAVE",
    "type" : "sun-education-field-4",
    "start-position" : 3364,
    "end-position" : 3382,
    "concept-id" : "NKNc_sE8_2ok",
    "matched-string" : "teknisk inriktning",
    "annotation-id" : 38
  }, {
    "preferred-label" : "Universitets- eller högskoleutbildning",
    "sentiment" : "NICE_TO_HAVE",
    "type" : "sni-level-4",
    "start-position" : 3416,
    "end-position" : 3424,
    "concept-id" : "m1vC_Ssq_5Y7",
    "matched-string" : "högskola",
    "annotation-id" : 37
  }, {
    "preferred-label" : "använda dator",
    "sentiment" : "MUST_HAVE",
    "type" : "esco-skill",
    "start-position" : 3683,
    "end-position" : 3697,
    "concept-id" : "HEbR_xrb_MpT",
    "matched-string" : "datorkunskaper",
    "annotation-id" : 39
  }, {
    "preferred-label" : "kommunikation",
    "sentiment" : "MUST_HAVE",
    "type" : "esco-skill",
    "start-position" : 3713,
    "end-position" : 3724,
    "concept-id" : "ahPU_HgE_Jeb",
    "matched-string" : "kommunicera",
    "annotation-id" : 40
  }, {
    "preferred-label" : "Svenska",
    "sentiment" : "MUST_HAVE",
    "type" : "language",
    "start-position" : 3750,
    "end-position" : 3757,
    "concept-id" : "zSLA_vw2_FXN",
    "matched-string" : "svenska",
    "annotation-id" : 8
  }, {
    "preferred-label" : "B",
    "sentiment" : "MUST_HAVE",
    "type" : "driving-licence",
    "start-position" : 4233,
    "end-position" : 4242,
    "concept-id" : "VTK8_WRx_GcM",
    "matched-string" : "B-körkort",
    "annotation-id" : 41
  } ],
  "text" : "Tekniker, Hjälpmedelscentrum Östra Skåne\nVårt arbete gör skillnad i människors vardag! Vi är cirka 7 000 medarbetare och här finns gott om utrymme för dig som vill lyfta tillsammans med oss. Kristianstad är nordöstra Skånes handelscentrum med 85 000 invånare, bara en timmes tågresa från storstadsområdet vid Öresund.\n\nHjälpmedelscentrum Östra Skåne (HÖS) sköter hjälpmedelsförsörjningen för kommunerna Bromölla, Hässleholm, Hörby, Kristianstad, Osby, Simrishamn, Sjöbo, Skurup, Tomelilla, Ystad, Östra Göinge. Vi är en växande verksamhet i ständig utveckling. Vårt arbete och värdegrund baseras på ett professionellt bemötande med god service och ständiga förbättringar. Våra ledstjärnor är respekt, kommunikation och yrkesskicklighet. Nu söker vi tekniker till Hjälpmedelscentrum Östra Skåne.\n\r\n\r\nARBETSUPPGIFTER\nSom tekniker på HÖS arbetar du främst med service, reparationer, rekonditionering och transport av medicintekniska hjälpmedel. Vi arbetar i egna lokaler på Ängamöllan i Kristianstad samt ute hos kunderna, både i boenden och hemma hos användarna över hela östra Skåne.\n\nTjänsten som tekniker på HÖS innebär bland annat reparation, montering och underhåll, men kan även innebära rekonditionering och transport av hjälpmedel. Transporten till hemadresser görs i 3.5 tons lastbilar som får framföras med B-kort. Som tekniker har du ett stort eget ansvar och planerar dina arbeten och/eller rundor själv, men även tillsammans i gruppen, vilket ställer krav på ett bra ordningssinne\n\nI enheten finns det tre olika inriktningar av tekniker.\nUteservice som innebär att man arbetar till största del själv och ansvarar för reparationer, förebyggande underhåll, besiktningar, anpassningar med mera ute hos kunder/användare i östra Skåne.\nTransport/Hemtransport som i huvudsak levererar och hämtar hjälpmedel hemma hos användaren eller i kommunförråd, men det innebär även en del reparationer, förebyggande underhåll och rekonditionering. På hemtransport jobbar man alltid i par medan transport är ensamarbete.\nDen tredje inriktningen är rekonditionering som framför allt rekonditionerar och anpassar hjälpmedel efter beställningar innan de skickas ut, men gruppen utgör även utfyllnad i de två tidigare grupperna vid behov på grund av hög arbetsbelastning, samt planerad och oplanerad frånvaro. Enheten består idag av 16 medarbetare.\n\nSom utetekniker har du ett stort eget ansvar och planerar dina rundor och arbeten själv men även tillsammans i gruppen, vilket ställer krav på ett bra ordningssinne. Du har daglig kontakt med förskrivare, användare och andra personer/funktioner. Avrapportering och informationshämtning gör du i vårt verksamhetssystem.\n\nPå hemtransport jobbar vi i par och har som par ett stort eget ansvar och planerar sina rundor och arbeten som grupp för att optimera, vilket ställer krav på ett bra ordningssinne. Du har daglig kontakt med förskrivare, användare och andra personer/funktioner. Avrapportering och informationshämtning gör du i vårt verksamhetssystem.\n\nPå rekonditionering arbetar du i grupp med att rekonditionera, återställa och anpassa hjälpmedel. Avrapportering och informationshämtning gör du i vårt verksamhetssystem. Tjänsten vi vill tillsätta kommer att ha, som det ser ut nu, rekonditionering som primära inriktning.\n\r\n\r\nKVALIFIKATIONER\nVi söker dig som har godkänd treårig gymnasieutbildning, föredragsvis med en teknisk inriktning. Har du relevant utbildning från högskola anses det meriterande. Vi vill att du har erfarenhet från arbete med kunder och support. Vi ser gärna att du även har erfarenhet inom service, teknik och system. Eftersom arbetet kräver kommunikation och dokumentation förutsätter vi att du har grundläggande datorkunskaper och att du kan kommunicera och formulera dig väl på svenska i tal och skrift.\n\nDu har förmågan att arbeta med andra människor, att lyssna, visa empati och respekt. Du är prestigelös och uppmärksammar och belönar andras bidrag. Du bemöter andra på ett serviceinriktat och tillmötesgående sätt. Arbetet kräver att du har förmågan att följa instruktioner, procedurer, lagstadgade krav och policy, samt förhålla dig till uppsatta tidsplaner. Då Hjälpmedelscentrum verkar i 11 kommuner, som du kommer att besöka, är det ett krav att du har B-körkort för manuell växellåda.\n\nIntervjuer sker löpande så vänta inte med din ansökan. Vi är en mansdominerad arbetsplats och ser gärna kvinnliga sökande.\n\nUnder perioden 220718-220731 är rekryterande chef ej möjlig att nå vid eventuella frågor.\n\r\n\nÖVRIGT\nOmsorgsförvaltningens verksamhet riktar sig till äldre och personer som har behov av funktionsstöd samt till personer med behov av hemsjukvård. Verksamheten är funktionsindelad i fyra verksamhetsområden: stöd i ordinärt boende, stöd i vård- och omsorgsboende, hälso- och sjukvård samt funktionsstöd. I förvaltningen finns också myndighetsenheten, riksgymnasiet och hjälpmedelscentrum i Östra Skåne.\n\nI Kristianstads kommun tillämpar vi heltid för alla, vilket innebär att alla medarbetare med tillsvidareanställning har rätt till heltid och deltid är en möjlighet. Vi tillämpar också rökfri arbetstid. \n\nHar du skyddade personuppgifter skickar du in din ansökan via post märkt med titel och referensnummer. Du kan också lämna din ansökan på Rådhus Skåne. Har du frågor kan nå oss via växeln 044-13 50 00.\n\nHar du frågor kring hur du gör din ansökan, kontakta systemets support på telefon 0771-69 36 93 eller via länken https://zero.comaround.com/sv-se/."
}