{
  "meta" : {
    "jobad" : {
      "description" : {
        "requirements" : null,
        "needs" : null,
        "company_information" : null,
        "text_formatted" : "Örkelljunga är en del av ”Familjen Helsingborg” där 11 kommuner i det expansiva Skåne Nordväst tillsammans arbetar för att gynna den gemensamma regionen. Örkelljunga är en kommun med stabil ekonomi och har idag 10 000 invånare. Örkelljunga kännetecknas av en närhet där ett starkt samarbete och korta beslutsvägar utgör styrkan i den lilla kommunen. Här har du som medarbetare större möjlighet att påverka din personliga utveckling likväl som verksamhetens utveckling i stort. I Örkelljunga kommun arbetar vi med ett professionellt bemötande präglat av våra tre värdeord; kunskap, omtanke och handling. Som en del av Örkelljunga kommun har du möjlighet att arbeta gränsöverskridande och göra skillnad.\r\n\r\nARBETSUPPGIFTER\nUndervisning i åk. 4-6\r\n\r\nKVALIFIKATIONER\nErfarenhet av att arbeta på mellanstadiet. Lärarlegitimation.\r\n\nÖVRIGT\nSom ett led i att bli en mer hälsobringande kommun tillämpar vi rökfri arbetstid. Vi bedriver både jämställdhets och mångfalds främjande insatser. Vi ber dig att söka digitalt för att säkerställa kvalitet och vår hantering av ansökningarna. Vi undanber oss vänligt men bestämt att bli kontaktade av annons och rekryteringsföretag.",
        "conditions" : "Heltid. 100%  Ferietjänst enligt avtal.\r\nTillsvidareanställning, tillträde: 220809 eller enligt överenskommelse. Tillsvidare",
        "text" : "Örkelljunga är en del av ”Familjen Helsingborg” där 11 kommuner i det expansiva Skåne Nordväst tillsammans arbetar för att gynna den gemensamma regionen. Örkelljunga är en kommun med stabil ekonomi och har idag 10 000 invånare. Örkelljunga kännetecknas av en närhet där ett starkt samarbete och korta beslutsvägar utgör styrkan i den lilla kommunen. Här har du som medarbetare större möjlighet att påverka din personliga utveckling likväl som verksamhetens utveckling i stort. I Örkelljunga kommun arbetar vi med ett professionellt bemötande präglat av våra tre värdeord; kunskap, omtanke och handling. Som en del av Örkelljunga kommun har du möjlighet att arbeta gränsöverskridande och göra skillnad.\r\n\r\nARBETSUPPGIFTER\nUndervisning i åk. 4-6\r\n\r\nKVALIFIKATIONER\nErfarenhet av att arbeta på mellanstadiet. Lärarlegitimation.\r\n\nÖVRIGT\nSom ett led i att bli en mer hälsobringande kommun tillämpar vi rökfri arbetstid. Vi bedriver både jämställdhets och mångfalds främjande insatser. Vi ber dig att söka digitalt för att säkerställa kvalitet och vår hantering av ansökningarna. Vi undanber oss vänligt men bestämt att bli kontaktade av annons och rekryteringsföretag."
      },
      "headline" : "Lärare i Sv, So och Sva år 4-6 till Bokelundaskolan",
      "driving_license" : null,
      "employer" : {
        "email" : null,
        "phone_number" : null,
        "organization_number" : "2120000878",
        "name" : "Örkelljunga kommun",
        "url" : null,
        "workplace" : "Örkelljunga kommun, Utbildningsförvaltningen"
      },
      "removed_date" : null,
      "logo_url" : "https://www.arbetsformedlingen.se/rest/arbetsgivare/rest/af/v3/organisation/2120000878/logotyper/logo.png",
      "last_publication_date" : "2022-07-31T23:59:59",
      "number_of_vacancies" : 1,
      "occupation" : {
        "concept_id" : "Nzmh_iTb_z7h",
        "label" : "Lärare i grundskolan, årskurs 4-6",
        "legacy_ams_taxonomy_id" : "7653"
      },
      "occupation_group" : {
        "concept_id" : "oQUQ_D11_HPx",
        "label" : "Grundskollärare",
        "legacy_ams_taxonomy_id" : "2341"
      },
      "employment_type" : {
        "concept_id" : "PFZr_Syz_cUq",
        "label" : "Vanlig anställning",
        "legacy_ams_taxonomy_id" : "1"
      },
      "webpage_url" : "https://arbetsformedlingen.se/platsbanken/annonser/26350436",
      "driving_license_required" : false,
      "application_contacts" : [ {
        "description" : "Martin Johansson",
        "email" : null,
        "telephone" : "0435-55076",
        "name" : null,
        "contact_type" : "Rektor"
      } ],
      "duration" : {
        "concept_id" : "a7uU_j21_mkL",
        "label" : "Tills vidare",
        "legacy_ams_taxonomy_id" : "1"
      },
      "nice_to_have" : {
        "education_level" : [ ],
        "work_experiences" : [ ],
        "skills" : [ ],
        "education" : [ ],
        "languages" : [ ]
      },
      "application_details" : {
        "via_af" : false,
        "email" : null,
        "other" : null,
        "reference" : "A1142848",
        "url" : "https://recruit.visma.com/Public/Apply.aspx?guidAssignment=f7769d25-ce3e-452d-928a-6c814e6f402d&publishCode=AMS&TK=c6d1f0d7-c81a-45ad-a3ca-2ac47e0d1da4",
        "information" : null
      },
      "source_type" : "VIA_PLATSBANKEN_DXA",
      "application_deadline" : "2022-07-31T23:59:59",
      "external_id" : "46-212000-0878-F7769D25CE3E452D928A6C814E6F402D",
      "workplace_address" : {
        "coordinates" : [ 13.278832, 56.283634 ],
        "city" : null,
        "postcode" : null,
        "municipality" : "Örkelljunga",
        "region_concept_id" : "CaRE_1nn_cSU",
        "region" : "Skåne län",
        "country_code" : "199",
        "region_code" : "12",
        "municipality_concept_id" : "nBTS_Nge_dVH",
        "country_concept_id" : "i46j_HmG_v64",
        "municipality_code" : "1257",
        "street_address" : null,
        "country" : "Sverige"
      },
      "id" : "26350436",
      "experience_required" : true,
      "working_hours_type" : {
        "concept_id" : "6YE1_gAC_R2G",
        "label" : "Heltid",
        "legacy_ams_taxonomy_id" : "1"
      },
      "access" : null,
      "timestamp" : 1658737813913,
      "must_have" : {
        "education_level" : [ ],
        "work_experiences" : [ {
          "concept_id" : "Nzmh_iTb_z7h",
          "weight" : 10,
          "label" : "Lärare i grundskolan, årskurs 4-6",
          "legacy_ams_taxonomy_id" : "7653"
        } ],
        "skills" : [ ],
        "education" : [ ],
        "languages" : [ ]
      },
      "occupation_field" : {
        "concept_id" : "MVqp_eS8_kDZ",
        "label" : "Pedagogik",
        "legacy_ams_taxonomy_id" : "15"
      },
      "scope_of_work" : {
        "min" : 100,
        "max" : 100
      },
      "salary_type" : {
        "concept_id" : "oG8G_9cW_nRf",
        "label" : "Fast månads- vecko- eller timlön",
        "legacy_ams_taxonomy_id" : "1"
      },
      "removed" : false,
      "salary_description" : "Enligt avtal.",
      "access_to_own_car" : false,
      "publication_date" : "2022-07-25T10:30:13"
    },
    "name" : "Lärare i Sv, So och Sva år 4-6 till Bokelundaskolan",
    "user" : "kristof.fischer"
  },
  "sha1" : "b142e1264b72aca5154d4981544fc0f765ebec04",
  "annotations" : [ {
    "preferred-label" : "Grundlärare, 4-6",
    "type" : "occupation-name",
    "start-position" : 0,
    "end-position" : 6,
    "concept-id" : "Nzmh_iTb_z7h",
    "matched-string" : "Lärare",
    "annotation-id" : 3
  }, {
    "preferred-label" : "Örkelljunga",
    "type" : "municipality",
    "start-position" : 52,
    "end-position" : 63,
    "concept-id" : "nBTS_Nge_dVH",
    "matched-string" : "Örkelljunga",
    "annotation-id" : 6
  }, {
    "preferred-label" : "Helsingborg",
    "type" : "municipality",
    "start-position" : 87,
    "end-position" : 98,
    "concept-id" : "qj3q_oXH_MGR",
    "matched-string" : "Helsingborg",
    "annotation-id" : 7
  }, {
    "preferred-label" : "Skåne län",
    "type" : "region",
    "start-position" : 132,
    "end-position" : 137,
    "concept-id" : "CaRE_1nn_cSU",
    "matched-string" : "Skåne",
    "annotation-id" : 4
  }, {
    "preferred-label" : "Örkelljunga",
    "type" : "municipality",
    "start-position" : 206,
    "end-position" : 217,
    "concept-id" : "nBTS_Nge_dVH",
    "matched-string" : "Örkelljunga",
    "annotation-id" : 5
  }, {
    "preferred-label" : "Örkelljunga",
    "type" : "municipality",
    "start-position" : 531,
    "end-position" : 542,
    "concept-id" : "nBTS_Nge_dVH",
    "matched-string" : "Örkelljunga",
    "annotation-id" : 8
  }, {
    "preferred-label" : "Örkelljunga",
    "type" : "municipality",
    "start-position" : 669,
    "end-position" : 680,
    "concept-id" : "nBTS_Nge_dVH",
    "matched-string" : "Örkelljunga",
    "annotation-id" : 9
  }, {
    "preferred-label" : null,
    "sentiment" : "MUST_HAVE",
    "type" : "skill",
    "start-position" : 833,
    "end-position" : 856,
    "concept-id" : null,
    "matched-string" : "arbeta på mellanstadiet",
    "annotation-id" : 10
  }, {
    "preferred-label" : "Lärarlegitimation",
    "sentiment" : "MUST_HAVE",
    "type" : "skill",
    "start-position" : 858,
    "end-position" : 875,
    "concept-id" : "yKnk_W7X_Zvk",
    "matched-string" : "lärarlegitimation",
    "annotation-id" : 2
  } ],
  "text" : "Lärare i Sv, So och Sva år 4-6 till Bokelundaskolan\nÖrkelljunga är en del av ”Familjen Helsingborg” där 11 kommuner i det expansiva Skåne Nordväst tillsammans arbetar för att gynna den gemensamma regionen. Örkelljunga är en kommun med stabil ekonomi och har idag 10 000 invånare. Örkelljunga kännetecknas av en närhet där ett starkt samarbete och korta beslutsvägar utgör styrkan i den lilla kommunen. Här har du som medarbetare större möjlighet att påverka din personliga utveckling likväl som verksamhetens utveckling i stort. I Örkelljunga kommun arbetar vi med ett professionellt bemötande präglat av våra tre värdeord; kunskap, omtanke och handling. Som en del av Örkelljunga kommun har du möjlighet att arbeta gränsöverskridande och göra skillnad.\r\n\r\nARBETSUPPGIFTER\nUndervisning i åk. 4-6\r\n\r\nKVALIFIKATIONER\nErfarenhet av att arbeta på mellanstadiet. Lärarlegitimation.\r\n\nÖVRIGT\nSom ett led i att bli en mer hälsobringande kommun tillämpar vi rökfri arbetstid. Vi bedriver både jämställdhets och mångfalds främjande insatser. Vi ber dig att söka digitalt för att säkerställa kvalitet och vår hantering av ansökningarna. Vi undanber oss vänligt men bestämt att bli kontaktade av annons och rekryteringsföretag."
}