{
  "meta" : {
    "jobad" : {
      "description" : {
        "requirements" : null,
        "needs" : null,
        "company_information" : null,
        "text_formatted" : "Arbetar du för att göra alla kunder nöjda, svarar på frågor om olika produkter och tjänster som vi säljer och dessutom bidrar till att vi har kul tillsammans på jobbet - då blir vi mycket glada över att du söker jobbet som Kassamedarbetare. \nI kassan har du äran att träffa de flesta av våra kunder. Du är pricken över i-et som kan se till att alla kunder går nöjda ut genom dörren. Att arbeta i kassan innebär fartfyllda dagar med många olika arbetsuppgifter.\nMen det löser du lätt, eftersom du arbetar systematiskt och inte är rädd för att fatta egna beslut där och då. Du gillar action och tacklar det höga tempot med ett leende, samtidigt som du är utrustad med massa servicekänsla. \nArbetsuppgifter\nDin huvudsakliga arbetsuppgift kommer, tillsammans med dina kollegor, att vara att göra våra kunder 100 % nöjda varje dag - och att ha roligt under tiden!\nHjälpa kunder att hitta sin bästa lösning\nErbjuda och sälja produkter och tjänster\nTräning och utbildning\nAtt arbeta för Elgiganten är både roligt, utmanande och fartfyllt. Den viktigaste uppgiften som medarbetare på Elgiganten är att hitta den perfekta lösningen för våra kunders frågor, utmaningar och önskemål. Det är en enkel match för dig som vill vara bäst i allt du gör och som är resultat- och lösningsorienterad.\nProfil & Bakgrund\nDu älskar att nå dina mål - och när du gör det, vill vi fira det med dig. Är du också snabblärd, nyfiken och kreativ så är du är en väldigt bra kandidat för detta jobb.  \nEtt intresse för de varor och tjänster som vi säljer är en stor fördel, men inte ett krav. Du får en bra introduktion som kommer att förse dig med de kunskaper och expertis som du behöver samt som ger dig rätt förutsättningar att lyckas och trivas.\nArbetsglädje \nHär jobbar ett gäng personer som är drivna och intresserade i kontakt med kunder och kollegor. Vi är ärliga, ödmjuka och lyssnar på kunden och kundens behov. Vi söker en kollega som är en peppande, lojal och hjälpsam person som ställer upp för andra. Som löser problem som uppstår på ett effektivt sätt och håller dig uppdaterad på företagets produkter.\nVår kultur är viktig för oss och i stort sett allt som du gör som medarbetare på Elgiganten genomsyras av våra tre grundstenar: Ansvarstagande, Engagemang och Effektivitet.\nDe som har affärssinne, gillar att tävla och vill bidra till positiva resultat för företaget brukar trivas väl hos oss. Det är personer som gillar att utvecklas och tar sig an sina arbetsuppgifter på ett effektivt, strukturerat och noggrant sätt. Är du en av dem? Då gillar du säkert snabba förändringar och det faller sig naturligt för dig att ta egna initiativ. Vi kommer att ha kul tillsammans! \nUtveckling på Elgiganten\nVårt mål är att bli branschens bästa arbetsgivare och vi tror att vi når dit genom ett gott ledarskap. På Elgiganten skapar en god ledare engagemang, arbetsglädje och motiverade medarbetare med hjälp av en stor portion vanlig snällhet och sunt förnuft. Som stöd finns en stöttande varuhuschef och ett omfattande utbildningsprogram i ledarskap och personlig utveckling.\nHar du massor av energi, är social och är bra på ditt jobb, kan vi garantera att du får både möjligheter och utmaningar hos oss. Vi investerar årligen över 50 mkr och 36.000 kursdagar i att utbilda och träna våra medarbetare inom produktkunskap, försäljning och kundvård.\nElgiganten erbjuder \nAvtalsenlig lön och pension\nGeneröst bonusavtal\nFörmåner inom friskvård och personalköp\nInternt utbildningsprogram för medarbetare och ledare\nGoda karriärmöjligheter\nPå Elgiganten strävar vi efter mångfald och välkomnar därför alla sökanden oavsett kön, ålder eller etnisk bakgrund. Vi tror att detta bidrar till en mer dynamisk arbetsplats där allas unika erfarenheter och kompetenser gör oss bättre.\nAnsökningar utvärderas löpande och hittar vi en passande Gigant kan rekryteringsprocessen gå snabbare än planerat. Frågor om tjänsten besvaras av XX på XXXX@giganten.se.\nTycker du detta låter kul? Då hoppas vi att du vill jobba hos oss! \nVarmt välkommen med din ansökan.\nObservera att vi använder oss av lämplighets- och personlighetstest i vår rekrytering.",
        "conditions" : "Deltid ",
        "text" : "Arbetar du för att göra alla kunder nöjda, svarar på frågor om olika produkter och tjänster som vi säljer och dessutom bidrar till att vi har kul tillsammans på jobbet - då blir vi mycket glada över att du söker jobbet som Kassamedarbetare. \nI kassan har du äran att träffa de flesta av våra kunder. Du är pricken över i-et som kan se till att alla kunder går nöjda ut genom dörren. Att arbeta i kassan innebär fartfyllda dagar med många olika arbetsuppgifter.\nMen det löser du lätt, eftersom du arbetar systematiskt och inte är rädd för att fatta egna beslut där och då. Du gillar action och tacklar det höga tempot med ett leende, samtidigt som du är utrustad med massa servicekänsla. \nArbetsuppgifter\nDin huvudsakliga arbetsuppgift kommer, tillsammans med dina kollegor, att vara att göra våra kunder 100 % nöjda varje dag - och att ha roligt under tiden!\nHjälpa kunder att hitta sin bästa lösning\nErbjuda och sälja produkter och tjänster\nTräning och utbildning\nAtt arbeta för Elgiganten är både roligt, utmanande och fartfyllt. Den viktigaste uppgiften som medarbetare på Elgiganten är att hitta den perfekta lösningen för våra kunders frågor, utmaningar och önskemål. Det är en enkel match för dig som vill vara bäst i allt du gör och som är resultat- och lösningsorienterad.\nProfil & Bakgrund\nDu älskar att nå dina mål - och när du gör det, vill vi fira det med dig. Är du också snabblärd, nyfiken och kreativ så är du är en väldigt bra kandidat för detta jobb.  \nEtt intresse för de varor och tjänster som vi säljer är en stor fördel, men inte ett krav. Du får en bra introduktion som kommer att förse dig med de kunskaper och expertis som du behöver samt som ger dig rätt förutsättningar att lyckas och trivas.\nArbetsglädje \nHär jobbar ett gäng personer som är drivna och intresserade i kontakt med kunder och kollegor. Vi är ärliga, ödmjuka och lyssnar på kunden och kundens behov. Vi söker en kollega som är en peppande, lojal och hjälpsam person som ställer upp för andra. Som löser problem som uppstår på ett effektivt sätt och håller dig uppdaterad på företagets produkter.\nVår kultur är viktig för oss och i stort sett allt som du gör som medarbetare på Elgiganten genomsyras av våra tre grundstenar: Ansvarstagande, Engagemang och Effektivitet.\nDe som har affärssinne, gillar att tävla och vill bidra till positiva resultat för företaget brukar trivas väl hos oss. Det är personer som gillar att utvecklas och tar sig an sina arbetsuppgifter på ett effektivt, strukturerat och noggrant sätt. Är du en av dem? Då gillar du säkert snabba förändringar och det faller sig naturligt för dig att ta egna initiativ. Vi kommer att ha kul tillsammans! \nUtveckling på Elgiganten\nVårt mål är att bli branschens bästa arbetsgivare och vi tror att vi når dit genom ett gott ledarskap. På Elgiganten skapar en god ledare engagemang, arbetsglädje och motiverade medarbetare med hjälp av en stor portion vanlig snällhet och sunt förnuft. Som stöd finns en stöttande varuhuschef och ett omfattande utbildningsprogram i ledarskap och personlig utveckling.\nHar du massor av energi, är social och är bra på ditt jobb, kan vi garantera att du får både möjligheter och utmaningar hos oss. Vi investerar årligen över 50 mkr och 36.000 kursdagar i att utbilda och träna våra medarbetare inom produktkunskap, försäljning och kundvård.\nElgiganten erbjuder \nAvtalsenlig lön och pension\nGeneröst bonusavtal\nFörmåner inom friskvård och personalköp\nInternt utbildningsprogram för medarbetare och ledare\nGoda karriärmöjligheter\nPå Elgiganten strävar vi efter mångfald och välkomnar därför alla sökanden oavsett kön, ålder eller etnisk bakgrund. Vi tror att detta bidrar till en mer dynamisk arbetsplats där allas unika erfarenheter och kompetenser gör oss bättre.\nAnsökningar utvärderas löpande och hittar vi en passande Gigant kan rekryteringsprocessen gå snabbare än planerat. Frågor om tjänsten besvaras av XX på XXXX@giganten.se.\nTycker du detta låter kul? Då hoppas vi att du vill jobba hos oss! \nVarmt välkommen med din ansökan.\nObservera att vi använder oss av lämplighets- och personlighetstest i vår rekrytering."
      },
      "headline" : "Elgiganten Täby Arninge Söker Kassamedarbetare",
      "driving_license" : null,
      "employer" : {
        "email" : null,
        "phone_number" : null,
        "organization_number" : "5564714474",
        "name" : "Elgiganten AB",
        "url" : null,
        "workplace" : "Elgiganten AB"
      },
      "removed_date" : null,
      "logo_url" : "https://www.arbetsformedlingen.se/rest/arbetsgivare/rest/af/v3/organisation/5564714474/logotyper/logo.png",
      "last_publication_date" : "2022-08-31T23:59:59",
      "number_of_vacancies" : 1,
      "occupation" : {
        "concept_id" : "j8X2_KhG_6ty",
        "label" : "Kassapersonal",
        "legacy_ams_taxonomy_id" : "2155"
      },
      "occupation_group" : {
        "concept_id" : "WNVp_RYe_zLX",
        "label" : "Kassapersonal m.fl.",
        "legacy_ams_taxonomy_id" : "5230"
      },
      "employment_type" : {
        "concept_id" : "PFZr_Syz_cUq",
        "label" : "Vanlig anställning",
        "legacy_ams_taxonomy_id" : "1"
      },
      "webpage_url" : "https://arbetsformedlingen.se/platsbanken/annonser/26375266",
      "driving_license_required" : false,
      "application_contacts" : [ ],
      "duration" : {
        "concept_id" : "a7uU_j21_mkL",
        "label" : "Tills vidare",
        "legacy_ams_taxonomy_id" : "1"
      },
      "nice_to_have" : {
        "education_level" : [ ],
        "work_experiences" : [ ],
        "skills" : [ ],
        "education" : [ ],
        "languages" : [ ]
      },
      "application_details" : {
        "via_af" : false,
        "email" : null,
        "other" : null,
        "reference" : "158066",
        "url" : "https://candidate.hr-manager.net/ApplicationInit.aspx?cid=1548&ProjectId=158066&DepartmentId=19525&MediaId=4616&SkipAdvertisement=true",
        "information" : null
      },
      "source_type" : "VIA_PLATSBANKEN_DXA",
      "application_deadline" : "2022-08-31T23:59:59",
      "external_id" : "46-556471-4474-00113559",
      "workplace_address" : {
        "coordinates" : [ 18.07033, 59.4419 ],
        "city" : null,
        "postcode" : null,
        "municipality" : "Täby",
        "region_concept_id" : "CifL_Rzy_Mku",
        "region" : "Stockholms län",
        "country_code" : "199",
        "region_code" : "01",
        "municipality_concept_id" : "onpA_B5a_zfv",
        "country_concept_id" : "i46j_HmG_v64",
        "municipality_code" : "0160",
        "street_address" : null,
        "country" : "Sverige"
      },
      "id" : "26375266",
      "experience_required" : true,
      "working_hours_type" : {
        "concept_id" : "947z_JGS_Uk2",
        "label" : "Deltid",
        "legacy_ams_taxonomy_id" : "2"
      },
      "access" : null,
      "timestamp" : 1659528644117,
      "must_have" : {
        "education_level" : [ ],
        "work_experiences" : [ {
          "concept_id" : "j8X2_KhG_6ty",
          "weight" : 10,
          "label" : "Kassapersonal",
          "legacy_ams_taxonomy_id" : "2155"
        } ],
        "skills" : [ ],
        "education" : [ ],
        "languages" : [ ]
      },
      "occupation_field" : {
        "concept_id" : "RPTn_bxG_ExZ",
        "label" : "Försäljning, inköp, marknadsföring",
        "legacy_ams_taxonomy_id" : "5"
      },
      "scope_of_work" : {
        "min" : 0,
        "max" : 100
      },
      "salary_type" : {
        "concept_id" : "oG8G_9cW_nRf",
        "label" : "Fast månads- vecko- eller timlön",
        "legacy_ams_taxonomy_id" : "1"
      },
      "removed" : false,
      "salary_description" : null,
      "access_to_own_car" : false,
      "publication_date" : "2022-08-03T14:10:44"
    },
    "name" : "Elgiganten Täby Arninge Söker Kassamedarbetare",
    "user" : "hannes"
  },
  "sha1" : "c39fda3dfecd41e0a6b2d82334c099f6378bac01",
  "annotations" : [ {
    "preferred-label" : "Täby",
    "type" : "municipality",
    "start-position" : 11,
    "end-position" : 15,
    "concept-id" : "onpA_B5a_zfv",
    "matched-string" : "Täby",
    "annotation-id" : 5
  }, {
    "preferred-label" : "Kassapersonal",
    "type" : "occupation-name",
    "start-position" : 30,
    "end-position" : 46,
    "concept-id" : "j8X2_KhG_6ty",
    "matched-string" : "Kassamedarbetare",
    "annotation-id" : 6
  }, {
    "preferred-label" : "Kassapersonal m.fl.",
    "type" : "ssyk-level-4",
    "start-position" : 270,
    "end-position" : 286,
    "concept-id" : "WNVp_RYe_zLX",
    "matched-string" : "Kassamedarbetare",
    "annotation-id" : 7
  }, {
    "preferred-label" : "visa ansvarstagande",
    "type" : "esco-skill",
    "start-position" : 2262,
    "end-position" : 2276,
    "concept-id" : "bcRp_hxV_f5G",
    "matched-string" : "Ansvarstagande",
    "annotation-id" : 8
  }, {
    "preferred-label" : "noggrannhet",
    "type" : "esco-skill",
    "start-position" : 2539,
    "end-position" : 2547,
    "concept-id" : "mrsW_EkL_KRD",
    "matched-string" : "noggrant",
    "annotation-id" : 9
  }, {
    "preferred-label" : "Varuhuschef",
    "sentiment" : "MUST_HAVE",
    "type" : "keyword",
    "start-position" : 3012,
    "end-position" : 3023,
    "concept-id" : "yzTF_XQy_haN",
    "matched-string" : "varuhuschef",
    "annotation-id" : 2
  }, {
    "preferred-label" : "personlig utveckling",
    "sentiment" : "MUST_HAVE",
    "type" : "esco-skill",
    "start-position" : 3078,
    "end-position" : 3098,
    "concept-id" : "wkQj_Dah_2GD",
    "matched-string" : "personlig utveckling",
    "annotation-id" : 3
  }, {
    "preferred-label" : "Friskvård",
    "sentiment" : "MUST_HAVE",
    "type" : "keyword",
    "start-position" : 3455,
    "end-position" : 3464,
    "concept-id" : "yoHe_xjK_qjH",
    "matched-string" : "friskvård",
    "annotation-id" : 4
  } ],
  "text" : "Elgiganten Täby Arninge Söker Kassamedarbetare\nArbetar du för att göra alla kunder nöjda, svarar på frågor om olika produkter och tjänster som vi säljer och dessutom bidrar till att vi har kul tillsammans på jobbet - då blir vi mycket glada över att du söker jobbet som Kassamedarbetare. \nI kassan har du äran att träffa de flesta av våra kunder. Du är pricken över i-et som kan se till att alla kunder går nöjda ut genom dörren. Att arbeta i kassan innebär fartfyllda dagar med många olika arbetsuppgifter.\nMen det löser du lätt, eftersom du arbetar systematiskt och inte är rädd för att fatta egna beslut där och då. Du gillar action och tacklar det höga tempot med ett leende, samtidigt som du är utrustad med massa servicekänsla. \nArbetsuppgifter\nDin huvudsakliga arbetsuppgift kommer, tillsammans med dina kollegor, att vara att göra våra kunder 100 % nöjda varje dag - och att ha roligt under tiden!\nHjälpa kunder att hitta sin bästa lösning\nErbjuda och sälja produkter och tjänster\nTräning och utbildning\nAtt arbeta för Elgiganten är både roligt, utmanande och fartfyllt. Den viktigaste uppgiften som medarbetare på Elgiganten är att hitta den perfekta lösningen för våra kunders frågor, utmaningar och önskemål. Det är en enkel match för dig som vill vara bäst i allt du gör och som är resultat- och lösningsorienterad.\nProfil & Bakgrund\nDu älskar att nå dina mål - och när du gör det, vill vi fira det med dig. Är du också snabblärd, nyfiken och kreativ så är du är en väldigt bra kandidat för detta jobb.  \nEtt intresse för de varor och tjänster som vi säljer är en stor fördel, men inte ett krav. Du får en bra introduktion som kommer att förse dig med de kunskaper och expertis som du behöver samt som ger dig rätt förutsättningar att lyckas och trivas.\nArbetsglädje \nHär jobbar ett gäng personer som är drivna och intresserade i kontakt med kunder och kollegor. Vi är ärliga, ödmjuka och lyssnar på kunden och kundens behov. Vi söker en kollega som är en peppande, lojal och hjälpsam person som ställer upp för andra. Som löser problem som uppstår på ett effektivt sätt och håller dig uppdaterad på företagets produkter.\nVår kultur är viktig för oss och i stort sett allt som du gör som medarbetare på Elgiganten genomsyras av våra tre grundstenar: Ansvarstagande, Engagemang och Effektivitet.\nDe som har affärssinne, gillar att tävla och vill bidra till positiva resultat för företaget brukar trivas väl hos oss. Det är personer som gillar att utvecklas och tar sig an sina arbetsuppgifter på ett effektivt, strukturerat och noggrant sätt. Är du en av dem? Då gillar du säkert snabba förändringar och det faller sig naturligt för dig att ta egna initiativ. Vi kommer att ha kul tillsammans! \nUtveckling på Elgiganten\nVårt mål är att bli branschens bästa arbetsgivare och vi tror att vi når dit genom ett gott ledarskap. På Elgiganten skapar en god ledare engagemang, arbetsglädje och motiverade medarbetare med hjälp av en stor portion vanlig snällhet och sunt förnuft. Som stöd finns en stöttande varuhuschef och ett omfattande utbildningsprogram i ledarskap och personlig utveckling.\nHar du massor av energi, är social och är bra på ditt jobb, kan vi garantera att du får både möjligheter och utmaningar hos oss. Vi investerar årligen över 50 mkr och 36.000 kursdagar i att utbilda och träna våra medarbetare inom produktkunskap, försäljning och kundvård.\nElgiganten erbjuder \nAvtalsenlig lön och pension\nGeneröst bonusavtal\nFörmåner inom friskvård och personalköp\nInternt utbildningsprogram för medarbetare och ledare\nGoda karriärmöjligheter\nPå Elgiganten strävar vi efter mångfald och välkomnar därför alla sökanden oavsett kön, ålder eller etnisk bakgrund. Vi tror att detta bidrar till en mer dynamisk arbetsplats där allas unika erfarenheter och kompetenser gör oss bättre.\nAnsökningar utvärderas löpande och hittar vi en passande Gigant kan rekryteringsprocessen gå snabbare än planerat. Frågor om tjänsten besvaras av XX på XXXX@giganten.se.\nTycker du detta låter kul? Då hoppas vi att du vill jobba hos oss! \nVarmt välkommen med din ansökan.\nObservera att vi använder oss av lämplighets- och personlighetstest i vår rekrytering."
}