{
  "meta" : {
    "jobad" : {
      "description" : {
        "requirements" : null,
        "needs" : null,
        "company_information" : null,
        "text_formatted" : "Vill du vara med och skapa framtidens Karlstad? Hos oss i koncernen Karlstads kommun kan du göra skillnad på riktigt. Här är varje medarbetare en viktig del i helheten och tillsammans hjälps vi åt att förverkliga vår vision om &quot;Ett bättre liv i Solstaden&quot;. Kom och väx med oss!\n\n\nBarn- och ungdomsförvaltningen ansvarar för förskola och skola för cirka 13 200 barn och elever och är kommunens största förvaltning med drygt 2 400 medarbetare. Vi har förskolor, familjedaghem, öppna förskolor, förskoleklasser, grundskolor, grundsärskolor, fritidshem och kulturskola och arbetar även med barn- och elevhälsofrågor. Vi rustar barnen för framtiden.\n\n\r\n\r\nBeskrivning\nHar du ett intresse för att laga mat, gillar ordning och reda, samt tycker om att ge god service? Vad bra då är det kanske dig vi letar efter! Vi söker nu vikarier till vår vikariepool inom kök och städ i förskola och skola, där du får ett meningsfullt arbete med ett stort kontaktnät.\r\n\r\nSom vikarie är du viktig för våra yngsta medborgare för att de ska får en trivsam vistelse i våra skolor och förskolor.  I vikariepoolen ersätter du ordinarie personal vid behov, och är därför en viktig pusselbit för att våra verksamheter ska fungera bra. Ibland ersätter du vid enstaka arbetspass med kort varsel och andra gånger under en längre tid.\n\n \n\nArbetsuppgifter\nI vikariepoolen blir du anställd som kock, köksbiträde eller ekonomibiträde (städ).\n\n - Som kock ansvarar du för matlagning, salladsberedning, packning, diskning/städning och egenkontroller i skolköken. För att arbeta som kock behöver du ha en relevant utbildning och dokumenterad erfarenhet från arbete inom kök.\n - Som köksbiträde hjälper du till vid tillagning av frukost, lunch och mellanmål i skolköken. Du ansvarar även över disk, städning i kök och matsal, servering av måltiderna och är delaktig i egenkontroller. Inom äldreomsorgen ingår även kassahantering. För att arbeta som köksbiträde behöver du ha relevant utbildning och/eller dokumenterad erfarenhet från arbete i kök.\n - Som ekonomibiträde (städ) har du en kombinationstjänst mellan städning och enklare hantering av mat. Du arbetar huvudsakligen med att hålla rent på våra förskolor men även i ett mottagningskök där du förbereder frukost, lunch och mellanmål för servering. Utöver detta ansvarar du även för disk, beställning av varor samt är delaktig i egenkontroller. Det är meriterande om du har en städutbildning och/eller har dokumenterad erfarenhet från liknande arbete.\n\n \n\nKvalifikationer\nVi söker dig som har fyllt 18 år och behärskar det svenska språket i både skrift och tal.\n\nFör att lyckas i rollen ser vi att du är serviceinriktad, flexibel i ditt förhållningssätt då du ofta träffar nya personal- och barngrupper, självgående, ordningsam och strukturerad och tar ansvar för dina arbetsuppgifter. Vi lägger stor vikt vid personliga egenskaper och intresse för tjänsten. \n\nSom vikarie behöver du kunna arbeta minst två dagar i veckan vilket även kan innebära arbete på helgerna och dessutom kunna arbeta inom hela Karlstads kommun inklusive våra ytterområden (Molkom, Vålberg, Edsvalla, Väse och Skattkärr).\n\nInnan vi kan erbjuda dig en anställning begär vi att få se ett utdrag från belastningsregistret. Vi rekommenderar att du beställer utdraget i samband att du skickar in din ansökan. Du beställer utdraget här: https://polisen.se/tjanster-tillstand/belastningsregistret/skola-eller-forskola/\n\n\n\nVad kan vi erbjuda dig?\nSom anställd i barn- och ungdomsförvaltningen får du möjlighet att göra våra barn och elevers vardag bättre. Att arbeta i vikariepoolen innebär att du styr själv över när du är tillgänglig för arbete, vilket möjliggör en balans mellan fritid och arbete. Du får anställning hos en trygg arbetsgivare där alla anställda omfattas av kollektivavtal. Om du jobbar i vikariepoolen en längre period finns goda möjligheter till längre vikariat och fasta tjänster. \n\nUtöver detta erbjuds du som arbetar i vikariepoolen förmånen att under 2022 träna och simma helt gratis på kommunens eget friskvårdscenter Haga motion och på Sundstabadet. Bra va?! \n\nFör att kvalitetssäkra rekryteringsprocessen och förenkla kommunikationen med våra sökande ber vi dig skicka in din ansökan digitalt och inte via e-post eller pappersformat. Vi undanber oss alla erbjudanden om annonserings- och rekryteringshjälp i samband med denna annons.\n\n\nHar du skyddade personuppgifter ska du inte registrera dina ansökningshandlingar i vårt rekryteringssystem och inte heller skicka in dem via e-post. Vänd dig istället till kommunens växel 054-540 00 00 för vidare hantering. ",
        "conditions" : "Timanställning. Tillträde: Omgående efter intervju i september\r\nVisstidsanställning till ",
        "text" : "Vill du vara med och skapa framtidens Karlstad? Hos oss i koncernen Karlstads kommun kan du göra skillnad på riktigt. Här är varje medarbetare en viktig del i helheten och tillsammans hjälps vi åt att förverkliga vår vision om \"Ett bättre liv i Solstaden\". Kom och väx med oss!\n\n\nBarn- och ungdomsförvaltningen ansvarar för förskola och skola för cirka 13 200 barn och elever och är kommunens största förvaltning med drygt 2 400 medarbetare. Vi har förskolor, familjedaghem, öppna förskolor, förskoleklasser, grundskolor, grundsärskolor, fritidshem och kulturskola och arbetar även med barn- och elevhälsofrågor. Vi rustar barnen för framtiden.\n\n\r\n\r\nBeskrivning\nHar du ett intresse för att laga mat, gillar ordning och reda, samt tycker om att ge god service? Vad bra då är det kanske dig vi letar efter! Vi söker nu vikarier till vår vikariepool inom kök och städ i förskola och skola, där du får ett meningsfullt arbete med ett stort kontaktnät.\r\n\r\nSom vikarie är du viktig för våra yngsta medborgare för att de ska får en trivsam vistelse i våra skolor och förskolor.  I vikariepoolen ersätter du ordinarie personal vid behov, och är därför en viktig pusselbit för att våra verksamheter ska fungera bra. Ibland ersätter du vid enstaka arbetspass med kort varsel och andra gånger under en längre tid.\n\n \n\nArbetsuppgifter\nI vikariepoolen blir du anställd som kock, köksbiträde eller ekonomibiträde (städ).\n\n - Som kock ansvarar du för matlagning, salladsberedning, packning, diskning/städning och egenkontroller i skolköken. För att arbeta som kock behöver du ha en relevant utbildning och dokumenterad erfarenhet från arbete inom kök.\n - Som köksbiträde hjälper du till vid tillagning av frukost, lunch och mellanmål i skolköken. Du ansvarar även över disk, städning i kök och matsal, servering av måltiderna och är delaktig i egenkontroller. Inom äldreomsorgen ingår även kassahantering. För att arbeta som köksbiträde behöver du ha relevant utbildning och/eller dokumenterad erfarenhet från arbete i kök.\n - Som ekonomibiträde (städ) har du en kombinationstjänst mellan städning och enklare hantering av mat. Du arbetar huvudsakligen med att hålla rent på våra förskolor men även i ett mottagningskök där du förbereder frukost, lunch och mellanmål för servering. Utöver detta ansvarar du även för disk, beställning av varor samt är delaktig i egenkontroller. Det är meriterande om du har en städutbildning och/eller har dokumenterad erfarenhet från liknande arbete.\n\n \n\nKvalifikationer\nVi söker dig som har fyllt 18 år och behärskar det svenska språket i både skrift och tal.\n\nFör att lyckas i rollen ser vi att du är serviceinriktad, flexibel i ditt förhållningssätt då du ofta träffar nya personal- och barngrupper, självgående, ordningsam och strukturerad och tar ansvar för dina arbetsuppgifter. Vi lägger stor vikt vid personliga egenskaper och intresse för tjänsten. \n\nSom vikarie behöver du kunna arbeta minst två dagar i veckan vilket även kan innebära arbete på helgerna och dessutom kunna arbeta inom hela Karlstads kommun inklusive våra ytterområden (Molkom, Vålberg, Edsvalla, Väse och Skattkärr).\n\nInnan vi kan erbjuda dig en anställning begär vi att få se ett utdrag från belastningsregistret. Vi rekommenderar att du beställer utdraget i samband att du skickar in din ansökan. Du beställer utdraget här: https://polisen.se/tjanster-tillstand/belastningsregistret/skola-eller-forskola/\n\n\n\nVad kan vi erbjuda dig?\nSom anställd i barn- och ungdomsförvaltningen får du möjlighet att göra våra barn och elevers vardag bättre. Att arbeta i vikariepoolen innebär att du styr själv över när du är tillgänglig för arbete, vilket möjliggör en balans mellan fritid och arbete. Du får anställning hos en trygg arbetsgivare där alla anställda omfattas av kollektivavtal. Om du jobbar i vikariepoolen en längre period finns goda möjligheter till längre vikariat och fasta tjänster. \n\nUtöver detta erbjuds du som arbetar i vikariepoolen förmånen att under 2022 träna och simma helt gratis på kommunens eget friskvårdscenter Haga motion och på Sundstabadet. Bra va?! \n\nFör att kvalitetssäkra rekryteringsprocessen och förenkla kommunikationen med våra sökande ber vi dig skicka in din ansökan digitalt och inte via e-post eller pappersformat. Vi undanber oss alla erbjudanden om annonserings- och rekryteringshjälp i samband med denna annons.\n\n\nHar du skyddade personuppgifter ska du inte registrera dina ansökningshandlingar i vårt rekryteringssystem och inte heller skicka in dem via e-post. Vänd dig istället till kommunens växel 054-540 00 00 för vidare hantering."
      },
      "headline" : "Vi söker vikarier till kök och städ!",
      "driving_license" : null,
      "employer" : {
        "email" : null,
        "phone_number" : null,
        "organization_number" : "2120001850",
        "name" : "Karlstads kommun",
        "url" : null,
        "workplace" : "Barn- och ungdomsförvaltningen"
      },
      "removed_date" : null,
      "logo_url" : "https://www.arbetsformedlingen.se/rest/arbetsgivare/rest/af/v3/organisation/2120001850/logotyper/logo.png",
      "last_publication_date" : "2022-08-14T23:59:59",
      "number_of_vacancies" : 20,
      "occupation" : {
        "concept_id" : "Kf29_nju_Xd4",
        "label" : "Ekonomibiträde, storhushåll",
        "legacy_ams_taxonomy_id" : "472"
      },
      "occupation_group" : {
        "concept_id" : "tPox_ie4_X9X",
        "label" : "Restaurang- och köksbiträden m.fl.",
        "legacy_ams_taxonomy_id" : "9412"
      },
      "employment_type" : {
        "concept_id" : "PFZr_Syz_cUq",
        "label" : "Vanlig anställning",
        "legacy_ams_taxonomy_id" : "1"
      },
      "webpage_url" : "https://arbetsformedlingen.se/platsbanken/annonser/26259803",
      "driving_license_required" : false,
      "application_contacts" : [ {
        "description" : "Caroline Häggqvist, kostchef",
        "email" : null,
        "telephone" : "054-5402948",
        "name" : null,
        "contact_type" : null
      }, {
        "description" : "Victoria Sundström, enhetschef städ",
        "email" : null,
        "telephone" : "054-5402090",
        "name" : null,
        "contact_type" : null
      }, {
        "description" : "Heléne Andersson, kostchef",
        "email" : null,
        "telephone" : "054-5403365",
        "name" : null,
        "contact_type" : null
      }, {
        "description" : "Emmelie Pedersen, enhetschef städ",
        "email" : null,
        "telephone" : "054-5403119",
        "name" : null,
        "contact_type" : null
      } ],
      "duration" : {
        "concept_id" : "Xj7x_7yZ_jEn",
        "label" : "3 månader – upp till 6 månader",
        "legacy_ams_taxonomy_id" : "3"
      },
      "nice_to_have" : {
        "education_level" : [ ],
        "work_experiences" : [ ],
        "skills" : [ ],
        "education" : [ ],
        "languages" : [ ]
      },
      "application_details" : {
        "via_af" : false,
        "email" : null,
        "other" : null,
        "reference" : null,
        "url" : "https://karlstad.varbi.com/what:job/jobID:519250/type:job/where:1/apply:1",
        "information" : null
      },
      "source_type" : "VIA_PLATSBANKEN_DXA",
      "application_deadline" : "2022-08-14T23:59:59",
      "external_id" : "46-212000-1850-519250",
      "workplace_address" : {
        "coordinates" : [ 13.500804, 59.379135 ],
        "city" : null,
        "postcode" : null,
        "municipality" : "Karlstad",
        "region_concept_id" : "EVVp_h6U_GSZ",
        "region" : "Värmlands län",
        "country_code" : "199",
        "region_code" : "17",
        "municipality_concept_id" : "hRDj_PoV_sFU",
        "country_concept_id" : "i46j_HmG_v64",
        "municipality_code" : "1780",
        "street_address" : null,
        "country" : "Sverige"
      },
      "id" : "26259803",
      "experience_required" : true,
      "working_hours_type" : {
        "concept_id" : "947z_JGS_Uk2",
        "label" : "Deltid",
        "legacy_ams_taxonomy_id" : "2"
      },
      "access" : null,
      "timestamp" : 1656317558287,
      "must_have" : {
        "education_level" : [ ],
        "work_experiences" : [ {
          "concept_id" : "Kf29_nju_Xd4",
          "weight" : 10,
          "label" : "Ekonomibiträde, storhushåll",
          "legacy_ams_taxonomy_id" : "472"
        } ],
        "skills" : [ ],
        "education" : [ ],
        "languages" : [ ]
      },
      "occupation_field" : {
        "concept_id" : "ScKy_FHB_7wT",
        "label" : "Hotell, restaurang, storhushåll",
        "legacy_ams_taxonomy_id" : "7"
      },
      "scope_of_work" : {
        "min" : 0,
        "max" : 100
      },
      "salary_type" : {
        "concept_id" : "oG8G_9cW_nRf",
        "label" : "Fast månads- vecko- eller timlön",
        "legacy_ams_taxonomy_id" : "1"
      },
      "removed" : false,
      "salary_description" : "Timavlönad",
      "access_to_own_car" : false,
      "publication_date" : "2022-07-25T00:00:00"
    },
    "name" : "Vi söker vikarier till kök och städ!",
    "user" : "hannes"
  },
  "sha1" : "849cd89027907917be5f16c8c34491badc7af0e9",
  "annotations" : [ {
    "preferred-label" : "Vikariat",
    "type" : "employment-type",
    "start-position" : 9,
    "end-position" : 17,
    "concept-id" : "gro4_cWF_6D7",
    "matched-string" : "vikarier",
    "annotation-id" : 16
  }, {
    "preferred-label" : "Städa",
    "type" : "keyword",
    "start-position" : 31,
    "end-position" : 35,
    "concept-id" : "r35T_iyj_ueU",
    "matched-string" : "städ",
    "annotation-id" : 19
  }, {
    "preferred-label" : "Karlstad",
    "type" : "municipality",
    "start-position" : 75,
    "end-position" : 83,
    "concept-id" : "hRDj_PoV_sFU",
    "matched-string" : "Karlstad",
    "annotation-id" : 17
  }, {
    "preferred-label" : "Karlstad",
    "type" : "municipality",
    "start-position" : 105,
    "end-position" : 121,
    "concept-id" : "hRDj_PoV_sFU",
    "matched-string" : "Karlstads kommun",
    "annotation-id" : 18
  }, {
    "preferred-label" : "Förskola",
    "sentiment" : "MUST_HAVE",
    "type" : "sun-education-level-3",
    "start-position" : 361,
    "end-position" : 369,
    "concept-id" : "p3Nu_zzc_L7T",
    "matched-string" : "förskola",
    "annotation-id" : 0
  }, {
    "preferred-label" : "Fritidshem",
    "sentiment" : "MUST_HAVE",
    "type" : "skill",
    "start-position" : 575,
    "end-position" : 585,
    "concept-id" : "Aq3e_Bdv_v45",
    "matched-string" : "fritidshem",
    "annotation-id" : 1
  }, {
    "preferred-label" : "Förskola",
    "sentiment" : "MUST_HAVE",
    "type" : "sun-education-level-3",
    "start-position" : 904,
    "end-position" : 912,
    "concept-id" : "p3Nu_zzc_L7T",
    "matched-string" : "förskola",
    "annotation-id" : 2
  }, {
    "preferred-label" : "Personal",
    "sentiment" : "MUST_HAVE",
    "type" : "keyword",
    "start-position" : 1147,
    "end-position" : 1155,
    "concept-id" : "HVxM_6MS_y1c",
    "matched-string" : "personal",
    "annotation-id" : 3
  }, {
    "preferred-label" : "kock",
    "sentiment" : "MUST_HAVE",
    "type" : "esco-occupation",
    "start-position" : 1397,
    "end-position" : 1401,
    "concept-id" : "Ti2H_QoQ_EMX",
    "matched-string" : "kock",
    "annotation-id" : 4
  }, {
    "preferred-label" : "Köksbiträde",
    "sentiment" : "MUST_HAVE",
    "type" : "occupation-name",
    "start-position" : 1403,
    "end-position" : 1414,
    "concept-id" : "oRB5_b7i_Qzv",
    "matched-string" : "köksbiträde",
    "annotation-id" : 5
  }, {
    "preferred-label" : "Ekonomibiträde, storhushåll",
    "type" : "occupation-name",
    "start-position" : 1421,
    "end-position" : 1435,
    "concept-id" : "Kf29_nju_Xd4",
    "matched-string" : "ekonomibiträde",
    "annotation-id" : 20
  }, {
    "preferred-label" : "Städa",
    "type" : "keyword",
    "start-position" : 1437,
    "end-position" : 1441,
    "concept-id" : "r35T_iyj_ueU",
    "matched-string" : "städ",
    "annotation-id" : 29
  }, {
    "preferred-label" : "kock",
    "sentiment" : "MUST_HAVE",
    "type" : "esco-occupation",
    "start-position" : 1452,
    "end-position" : 1456,
    "concept-id" : "Ti2H_QoQ_EMX",
    "matched-string" : "kock",
    "annotation-id" : 6
  }, {
    "preferred-label" : "Salladsberedning",
    "sentiment" : "MUST_HAVE",
    "type" : "skill",
    "start-position" : 1485,
    "end-position" : 1501,
    "concept-id" : "pT39_hq7_jAW",
    "matched-string" : "salladsberedning",
    "annotation-id" : 7
  }, {
    "preferred-label" : "diska",
    "type" : "esco-skill",
    "start-position" : 1513,
    "end-position" : 1521,
    "concept-id" : "Hkh7_SuX_4k1",
    "matched-string" : "diskning",
    "annotation-id" : 21
  }, {
    "preferred-label" : "Städa",
    "type" : "keyword",
    "start-position" : 1522,
    "end-position" : 1530,
    "concept-id" : "r35T_iyj_ueU",
    "matched-string" : "städning",
    "annotation-id" : 22
  }, {
    "preferred-label" : "kock",
    "sentiment" : "MUST_HAVE",
    "type" : "esco-occupation",
    "start-position" : 1582,
    "end-position" : 1586,
    "concept-id" : "Ti2H_QoQ_EMX",
    "matched-string" : "kock",
    "annotation-id" : 8
  }, {
    "preferred-label" : "Köksbiträde",
    "sentiment" : "MUST_HAVE",
    "type" : "occupation-name",
    "start-position" : 1681,
    "end-position" : 1692,
    "concept-id" : "oRB5_b7i_Qzv",
    "matched-string" : "köksbiträde",
    "annotation-id" : 9
  }, {
    "preferred-label" : "diska",
    "type" : "esco-skill",
    "start-position" : 1791,
    "end-position" : 1795,
    "concept-id" : "Hkh7_SuX_4k1",
    "matched-string" : "disk",
    "annotation-id" : 23
  }, {
    "preferred-label" : "Städa",
    "type" : "keyword",
    "start-position" : 1797,
    "end-position" : 1805,
    "concept-id" : "r35T_iyj_ueU",
    "matched-string" : "städning",
    "annotation-id" : 24
  }, {
    "preferred-label" : "Äldreomsorg",
    "type" : "skill",
    "start-position" : 1887,
    "end-position" : 1900,
    "concept-id" : "Yt2Z_1pY_MNz",
    "matched-string" : "äldreomsorgen",
    "annotation-id" : 25
  }, {
    "preferred-label" : "sköta en kassa",
    "type" : "esco-skill",
    "start-position" : 1912,
    "end-position" : 1926,
    "concept-id" : "USNU_LMY_prY",
    "matched-string" : "kassahantering",
    "annotation-id" : 26
  }, {
    "preferred-label" : "Köksbiträde",
    "sentiment" : "MUST_HAVE",
    "type" : "occupation-name",
    "start-position" : 1947,
    "end-position" : 1958,
    "concept-id" : "oRB5_b7i_Qzv",
    "matched-string" : "köksbiträde",
    "annotation-id" : 10
  }, {
    "preferred-label" : "Ekonomibiträde, storhushåll",
    "type" : "occupation-name",
    "start-position" : 2053,
    "end-position" : 2067,
    "concept-id" : "Kf29_nju_Xd4",
    "matched-string" : "ekonomibiträde",
    "annotation-id" : 27
  }, {
    "preferred-label" : "Städa",
    "type" : "keyword",
    "start-position" : 2069,
    "end-position" : 2073,
    "concept-id" : "r35T_iyj_ueU",
    "matched-string" : "städ",
    "annotation-id" : 28
  }, {
    "preferred-label" : "Städa",
    "type" : "keyword",
    "start-position" : 2111,
    "end-position" : 2119,
    "concept-id" : "r35T_iyj_ueU",
    "matched-string" : "städning",
    "annotation-id" : 30
  }, {
    "preferred-label" : "diska",
    "type" : "esco-skill",
    "start-position" : 2338,
    "end-position" : 2342,
    "concept-id" : "Hkh7_SuX_4k1",
    "matched-string" : "disk",
    "annotation-id" : 31
  }, {
    "preferred-label" : "Svenska språket",
    "sentiment" : "MUST_HAVE",
    "type" : "keyword",
    "start-position" : 2578,
    "end-position" : 2593,
    "concept-id" : "BiGm_58D_SSn",
    "matched-string" : "svenska språket",
    "annotation-id" : 11
  }, {
    "preferred-label" : "Personal",
    "sentiment" : "MUST_HAVE",
    "type" : "keyword",
    "start-position" : 2732,
    "end-position" : 2740,
    "concept-id" : "HVxM_6MS_y1c",
    "matched-string" : "personal",
    "annotation-id" : 12
  }, {
    "preferred-label" : "Karlstad",
    "type" : "municipality",
    "start-position" : 3057,
    "end-position" : 3073,
    "concept-id" : "hRDj_PoV_sFU",
    "matched-string" : "Karlstads kommun",
    "annotation-id" : 32
  } ],
  "text" : "Vi söker vikarier till kök och städ!\nVill du vara med och skapa framtidens Karlstad? Hos oss i koncernen Karlstads kommun kan du göra skillnad på riktigt. Här är varje medarbetare en viktig del i helheten och tillsammans hjälps vi åt att förverkliga vår vision om \"Ett bättre liv i Solstaden\". Kom och väx med oss!\n\n\nBarn- och ungdomsförvaltningen ansvarar för förskola och skola för cirka 13 200 barn och elever och är kommunens största förvaltning med drygt 2 400 medarbetare. Vi har förskolor, familjedaghem, öppna förskolor, förskoleklasser, grundskolor, grundsärskolor, fritidshem och kulturskola och arbetar även med barn- och elevhälsofrågor. Vi rustar barnen för framtiden.\n\n\r\n\r\nBeskrivning\nHar du ett intresse för att laga mat, gillar ordning och reda, samt tycker om att ge god service? Vad bra då är det kanske dig vi letar efter! Vi söker nu vikarier till vår vikariepool inom kök och städ i förskola och skola, där du får ett meningsfullt arbete med ett stort kontaktnät.\r\n\r\nSom vikarie är du viktig för våra yngsta medborgare för att de ska får en trivsam vistelse i våra skolor och förskolor.  I vikariepoolen ersätter du ordinarie personal vid behov, och är därför en viktig pusselbit för att våra verksamheter ska fungera bra. Ibland ersätter du vid enstaka arbetspass med kort varsel och andra gånger under en längre tid.\n\n \n\nArbetsuppgifter\nI vikariepoolen blir du anställd som kock, köksbiträde eller ekonomibiträde (städ).\n\n - Som kock ansvarar du för matlagning, salladsberedning, packning, diskning/städning och egenkontroller i skolköken. För att arbeta som kock behöver du ha en relevant utbildning och dokumenterad erfarenhet från arbete inom kök.\n - Som köksbiträde hjälper du till vid tillagning av frukost, lunch och mellanmål i skolköken. Du ansvarar även över disk, städning i kök och matsal, servering av måltiderna och är delaktig i egenkontroller. Inom äldreomsorgen ingår även kassahantering. För att arbeta som köksbiträde behöver du ha relevant utbildning och/eller dokumenterad erfarenhet från arbete i kök.\n - Som ekonomibiträde (städ) har du en kombinationstjänst mellan städning och enklare hantering av mat. Du arbetar huvudsakligen med att hålla rent på våra förskolor men även i ett mottagningskök där du förbereder frukost, lunch och mellanmål för servering. Utöver detta ansvarar du även för disk, beställning av varor samt är delaktig i egenkontroller. Det är meriterande om du har en städutbildning och/eller har dokumenterad erfarenhet från liknande arbete.\n\n \n\nKvalifikationer\nVi söker dig som har fyllt 18 år och behärskar det svenska språket i både skrift och tal.\n\nFör att lyckas i rollen ser vi att du är serviceinriktad, flexibel i ditt förhållningssätt då du ofta träffar nya personal- och barngrupper, självgående, ordningsam och strukturerad och tar ansvar för dina arbetsuppgifter. Vi lägger stor vikt vid personliga egenskaper och intresse för tjänsten. \n\nSom vikarie behöver du kunna arbeta minst två dagar i veckan vilket även kan innebära arbete på helgerna och dessutom kunna arbeta inom hela Karlstads kommun inklusive våra ytterområden (Molkom, Vålberg, Edsvalla, Väse och Skattkärr).\n\nInnan vi kan erbjuda dig en anställning begär vi att få se ett utdrag från belastningsregistret. Vi rekommenderar att du beställer utdraget i samband att du skickar in din ansökan. Du beställer utdraget här: https://polisen.se/tjanster-tillstand/belastningsregistret/skola-eller-forskola/\n\n\n\nVad kan vi erbjuda dig?\nSom anställd i barn- och ungdomsförvaltningen får du möjlighet att göra våra barn och elevers vardag bättre. Att arbeta i vikariepoolen innebär att du styr själv över när du är tillgänglig för arbete, vilket möjliggör en balans mellan fritid och arbete. Du får anställning hos en trygg arbetsgivare där alla anställda omfattas av kollektivavtal. Om du jobbar i vikariepoolen en längre period finns goda möjligheter till längre vikariat och fasta tjänster. \n\nUtöver detta erbjuds du som arbetar i vikariepoolen förmånen att under 2022 träna och simma helt gratis på kommunens eget friskvårdscenter Haga motion och på Sundstabadet. Bra va?! \n\nFör att kvalitetssäkra rekryteringsprocessen och förenkla kommunikationen med våra sökande ber vi dig skicka in din ansökan digitalt och inte via e-post eller pappersformat. Vi undanber oss alla erbjudanden om annonserings- och rekryteringshjälp i samband med denna annons.\n\n\nHar du skyddade personuppgifter ska du inte registrera dina ansökningshandlingar i vårt rekryteringssystem och inte heller skicka in dem via e-post. Vänd dig istället till kommunens växel 054-540 00 00 för vidare hantering."
}