{
  "meta" : {
    "jobad" : {
      "description" : {
        "requirements" : null,
        "needs" : null,
        "company_information" : null,
        "text_formatted" : "Halmstad är en expansiv kommun där vi arbetar för att våra 100 000 kommuninvånare ska trivas och få ut mer av livet. Här finns möjligheterna för dig som vill ha ett meningsfullt arbete och bidra med engagemang och nytänkande. Tillsammans med 9000 kollegor är du med och bygger hemstaden, kunskapsstaden och upplevelsestaden. Läs mer om oss https://www.halmstad.se/intro\n\nKulturförvaltningens verksamheter spänner över ett stort fält och vi tror på att kulturen spelar en viktig roll i samhället och att våra verksamheter gör skillnad för Halmstads kommuns invånare. Med kultur bidrar vi till människors livskvalitet, gemenskap och öppenhet. Kulturförvaltningen svarar för kulturell service i hela Halmstads kommun genom bibliotek, mötesplatser för unga samt konst och kulturverksamhet. Förvaltningen jobbar med delaktighet som centralt verktyg. Här finns prisvinnande bibliotek och på våra mötesplatser utgår vi från att alla unga ska ges möjlighet till en meningsfull fritid. Vi har ett museum med nationell ryktbarhet samt en omfattande samling av offentlig konst i stadsrummet. Vi driver Halmstads nya kulturhus för möten, skapande och upplevelser och hos Dramalogen ges kulturentreprenörer möjlighet att växa. Vi ansvarar även för stöd och bidrag till kulturföreningar och studieförbund samt kommunens medborgarservice. \n\nDu som söker till tjänsten delar kommunens värdegrund – alla som möter kommunens verksamhet ska känna att de har samma möjligheter, rättigheter och skyldigheter.\r\n\r\nARBETSUPPGIFTER\nTill Biblioteken i Halmstad söker vi nu två stycken timanställda bibliotekarier som kan hjälpa till att stötta upp vid sjukfrånvaro. Vi erbjuder ett stimulerande och utvecklande arbete där du tillsammans med andra kunniga kollegor bidrar till en upplevelsebaserad verksamhet. \n\nVi ser biblioteket som det självklara navet i lokalsamhället för medborgarna där vi samtidigt strävar efter att fortsätta utveckla samverkan med civilsamhället, näringslivet och andra lokala aktörer. I ditt arbete är samarbete viktigt, men även förmågan att själv kunna driva och utföra arbetsuppgifter. \n\nDu trivs i mötet med andra och har lätt för att skapa fungerande samarbeten inom och utom biblioteksverksamheten. \n\nDu förväntas vara delaktig och känna ansvar för verksamheten både på din enhet och för avdelningen som helhet.\n\r\n\r\nKVALIFIKATIONER\nVi söker dig som har examen i biblioteks- och informationsvetenskap det är meriterande men inget krav av att ha arbetat som bibliotekarie. \n\nDu är idérik, har ett starkt engagemang och stor initiativförmåga. Du har även god förmåga att kommunicera i tal och skrift. \n\nI bemanning av informationspunkterna är du serviceorienterad och du trivs i rollen som förmedlare i mötet med bibliotekens användare. Du har ett starkt litteratur- och kulturintresse, vilket ger dig god kunskap om samtidens litteratur- och kulturvärld. \nVi lägger stor vikt vid personlig lämplighet.\n\r\n\nÖVRIGT\nFör att kvalitetssäkra rekryteringsprocessen hos Halmstads kommun samt möjliggöra god kommunikation med dig som sökande använder vi e-rekrytering i Visma Recruit.\n\nVi undanber oss alla erbjudanden om annonserings- och rekryteringshjälp i samband med denna annons. \n\nVarmt välkommen med din ansökan!",
        "conditions" : "Timavlönad. Timanställd \r\nTidsbegränsad anställning, tillträde: Tillträde snarast tom 31/1-23, upphör: 2023-01-31  .",
        "text" : "Halmstad är en expansiv kommun där vi arbetar för att våra 100 000 kommuninvånare ska trivas och få ut mer av livet. Här finns möjligheterna för dig som vill ha ett meningsfullt arbete och bidra med engagemang och nytänkande. Tillsammans med 9000 kollegor är du med och bygger hemstaden, kunskapsstaden och upplevelsestaden. Läs mer om oss https://www.halmstad.se/intro\n\nKulturförvaltningens verksamheter spänner över ett stort fält och vi tror på att kulturen spelar en viktig roll i samhället och att våra verksamheter gör skillnad för Halmstads kommuns invånare. Med kultur bidrar vi till människors livskvalitet, gemenskap och öppenhet. Kulturförvaltningen svarar för kulturell service i hela Halmstads kommun genom bibliotek, mötesplatser för unga samt konst och kulturverksamhet. Förvaltningen jobbar med delaktighet som centralt verktyg. Här finns prisvinnande bibliotek och på våra mötesplatser utgår vi från att alla unga ska ges möjlighet till en meningsfull fritid. Vi har ett museum med nationell ryktbarhet samt en omfattande samling av offentlig konst i stadsrummet. Vi driver Halmstads nya kulturhus för möten, skapande och upplevelser och hos Dramalogen ges kulturentreprenörer möjlighet att växa. Vi ansvarar även för stöd och bidrag till kulturföreningar och studieförbund samt kommunens medborgarservice. \n\nDu som söker till tjänsten delar kommunens värdegrund – alla som möter kommunens verksamhet ska känna att de har samma möjligheter, rättigheter och skyldigheter.\r\n\r\nARBETSUPPGIFTER\nTill Biblioteken i Halmstad söker vi nu två stycken timanställda bibliotekarier som kan hjälpa till att stötta upp vid sjukfrånvaro. Vi erbjuder ett stimulerande och utvecklande arbete där du tillsammans med andra kunniga kollegor bidrar till en upplevelsebaserad verksamhet. \n\nVi ser biblioteket som det självklara navet i lokalsamhället för medborgarna där vi samtidigt strävar efter att fortsätta utveckla samverkan med civilsamhället, näringslivet och andra lokala aktörer. I ditt arbete är samarbete viktigt, men även förmågan att själv kunna driva och utföra arbetsuppgifter. \n\nDu trivs i mötet med andra och har lätt för att skapa fungerande samarbeten inom och utom biblioteksverksamheten. \n\nDu förväntas vara delaktig och känna ansvar för verksamheten både på din enhet och för avdelningen som helhet.\n\r\n\r\nKVALIFIKATIONER\nVi söker dig som har examen i biblioteks- och informationsvetenskap det är meriterande men inget krav av att ha arbetat som bibliotekarie. \n\nDu är idérik, har ett starkt engagemang och stor initiativförmåga. Du har även god förmåga att kommunicera i tal och skrift. \n\nI bemanning av informationspunkterna är du serviceorienterad och du trivs i rollen som förmedlare i mötet med bibliotekens användare. Du har ett starkt litteratur- och kulturintresse, vilket ger dig god kunskap om samtidens litteratur- och kulturvärld. \nVi lägger stor vikt vid personlig lämplighet.\n\r\n\nÖVRIGT\nFör att kvalitetssäkra rekryteringsprocessen hos Halmstads kommun samt möjliggöra god kommunikation med dig som sökande använder vi e-rekrytering i Visma Recruit.\n\nVi undanber oss alla erbjudanden om annonserings- och rekryteringshjälp i samband med denna annons. \n\nVarmt välkommen med din ansökan!"
      },
      "headline" : "Timanställda Bibliotekarier ",
      "driving_license" : null,
      "employer" : {
        "email" : null,
        "phone_number" : null,
        "organization_number" : "2120001215",
        "name" : "Halmstads kommun",
        "url" : null,
        "workplace" : "Halmstads kommun, Biblioteken i Halmstad"
      },
      "removed_date" : null,
      "logo_url" : "https://www.arbetsformedlingen.se/rest/arbetsgivare/rest/af/v3/organisation/2120001215/logotyper/logo.png",
      "last_publication_date" : "2022-08-17T23:59:59",
      "number_of_vacancies" : 2,
      "occupation" : {
        "concept_id" : "GujS_MtW_PRH",
        "label" : "Bibliotekarie",
        "legacy_ams_taxonomy_id" : "5899"
      },
      "occupation_group" : {
        "concept_id" : "wVfo_Njx_1rB",
        "label" : "Bibliotekarier och arkivarier",
        "legacy_ams_taxonomy_id" : "2622"
      },
      "employment_type" : {
        "concept_id" : "PFZr_Syz_cUq",
        "label" : "Vanlig anställning",
        "legacy_ams_taxonomy_id" : "1"
      },
      "webpage_url" : "https://arbetsformedlingen.se/platsbanken/annonser/26324572",
      "driving_license_required" : false,
      "application_contacts" : [ {
        "description" : "Finn Axelsson",
        "email" : null,
        "telephone" : null,
        "name" : null,
        "contact_type" : "Enhetschef Medier & IT"
      } ],
      "duration" : {
        "concept_id" : "Xj7x_7yZ_jEn",
        "label" : "3 månader – upp till 6 månader",
        "legacy_ams_taxonomy_id" : "3"
      },
      "nice_to_have" : {
        "education_level" : [ ],
        "work_experiences" : [ ],
        "skills" : [ ],
        "education" : [ ],
        "languages" : [ ]
      },
      "application_details" : {
        "via_af" : false,
        "email" : null,
        "other" : null,
        "reference" : "KN2022/00103",
        "url" : "https://recruit.visma.com/Public/Apply.aspx?guidAssignment=e914f47a-effc-4cf2-baa7-026eed92fe9c&publishCode=AMS&TK=b09bbb53-2900-4e2e-a5ea-f9aafd7d70ea",
        "information" : null
      },
      "source_type" : "VIA_PLATSBANKEN_DXA",
      "application_deadline" : "2022-08-17T23:59:59",
      "external_id" : "46-212000-1215-E914F47AEFFC4CF2BAA7026EED92FE9C",
      "workplace_address" : {
        "coordinates" : [ 12.82, 56.690834 ],
        "city" : null,
        "postcode" : null,
        "municipality" : "Halmstad",
        "region_concept_id" : "wjee_qH2_yb6",
        "region" : "Hallands län",
        "country_code" : "199",
        "region_code" : "13",
        "municipality_concept_id" : "kUQB_KdK_kAh",
        "country_concept_id" : "i46j_HmG_v64",
        "municipality_code" : "1380",
        "street_address" : null,
        "country" : "Sverige"
      },
      "id" : "26324572",
      "experience_required" : true,
      "working_hours_type" : {
        "concept_id" : "947z_JGS_Uk2",
        "label" : "Deltid",
        "legacy_ams_taxonomy_id" : "2"
      },
      "access" : null,
      "timestamp" : 1657719020774,
      "must_have" : {
        "education_level" : [ ],
        "work_experiences" : [ {
          "concept_id" : "GujS_MtW_PRH",
          "weight" : 10,
          "label" : "Bibliotekarie",
          "legacy_ams_taxonomy_id" : "5899"
        } ],
        "skills" : [ ],
        "education" : [ ],
        "languages" : [ ]
      },
      "occupation_field" : {
        "concept_id" : "9puE_nYg_crq",
        "label" : "Kultur, media, design",
        "legacy_ams_taxonomy_id" : "11"
      },
      "scope_of_work" : {
        "min" : 0,
        "max" : 100
      },
      "salary_type" : {
        "concept_id" : "oG8G_9cW_nRf",
        "label" : "Fast månads- vecko- eller timlön",
        "legacy_ams_taxonomy_id" : "1"
      },
      "removed" : false,
      "salary_description" : "Enligt avtal.",
      "access_to_own_car" : false,
      "publication_date" : "2022-07-13T15:30:20"
    },
    "name" : "Timanställda Bibliotekarier ",
    "user" : "kristof.fischer"
  },
  "sha1" : "74da5ab10be0ca7249888e30bd952fc39bdd4258",
  "annotations" : [ {
    "preferred-label" : "Bibliotekarie",
    "type" : "occupation-name",
    "start-position" : 13,
    "end-position" : 27,
    "concept-id" : "GujS_MtW_PRH",
    "matched-string" : "Bibliotekarier",
    "annotation-id" : 10
  }, {
    "preferred-label" : "Halmstad",
    "type" : "municipality",
    "start-position" : 29,
    "end-position" : 37,
    "concept-id" : "kUQB_KdK_kAh",
    "matched-string" : "Halmstad",
    "annotation-id" : 11
  }, {
    "preferred-label" : "Halmstad",
    "type" : "municipality",
    "start-position" : 567,
    "end-position" : 576,
    "concept-id" : "kUQB_KdK_kAh",
    "matched-string" : "Halmstads",
    "annotation-id" : 13
  }, {
    "preferred-label" : "Halmstad",
    "type" : "municipality",
    "start-position" : 726,
    "end-position" : 735,
    "concept-id" : "kUQB_KdK_kAh",
    "matched-string" : "Halmstads",
    "annotation-id" : 12
  }, {
    "preferred-label" : "Halmstad",
    "type" : "municipality",
    "start-position" : 1120,
    "end-position" : 1129,
    "concept-id" : "kUQB_KdK_kAh",
    "matched-string" : "Halmstads",
    "annotation-id" : 14
  }, {
    "preferred-label" : "Halmstad",
    "type" : "municipality",
    "start-position" : 1555,
    "end-position" : 1563,
    "concept-id" : "kUQB_KdK_kAh",
    "matched-string" : "Halmstad",
    "annotation-id" : 15
  }, {
    "preferred-label" : "Bibliotekarie",
    "type" : "occupation-name",
    "start-position" : 1601,
    "end-position" : 1615,
    "concept-id" : "GujS_MtW_PRH",
    "matched-string" : "bibliotekarier",
    "annotation-id" : 16
  }, {
    "preferred-label" : "samarbeta med kolleger",
    "sentiment" : "MUST_HAVE",
    "type" : "esco-skill",
    "start-position" : 2031,
    "end-position" : 2040,
    "concept-id" : "X15R_797_q62",
    "matched-string" : "samarbete",
    "annotation-id" : 17
  }, {
    "preferred-label" : "visa ansvarstagande",
    "sentiment" : "MUST_HAVE",
    "type" : "esco-skill",
    "start-position" : 2273,
    "end-position" : 2279,
    "concept-id" : "bcRp_hxV_f5G",
    "matched-string" : "ansvar",
    "annotation-id" : 18
  }, {
    "preferred-label" : "Yrkesbevis/examen",
    "sentiment" : "MUST_HAVE",
    "type" : "skill-headline",
    "start-position" : 2388,
    "end-position" : 2394,
    "concept-id" : "HjPN_99i_cFD",
    "matched-string" : "examen",
    "annotation-id" : 5
  }, {
    "preferred-label" : "Bibliotekarieutbildning samt biblioteks- och informationsvetenskap",
    "sentiment" : "MUST_HAVE",
    "type" : "sun-education-field-4",
    "start-position" : 2397,
    "end-position" : 2434,
    "concept-id" : "FsKa_aFC_yPT",
    "matched-string" : "biblioteks- och informationsvetenskap",
    "annotation-id" : 6
  }, {
    "preferred-label" : "Bibliotekarie",
    "sentiment" : "NICE_TO_HAVE",
    "type" : "occupation-name",
    "start-position" : 2491,
    "end-position" : 2504,
    "concept-id" : "GujS_MtW_PRH",
    "matched-string" : "bibliotekarie",
    "annotation-id" : 7
  }, {
    "preferred-label" : "kommunikation",
    "sentiment" : "MUST_HAVE",
    "type" : "esco-skill",
    "start-position" : 2587,
    "end-position" : 2614,
    "concept-id" : "ahPU_HgE_Jeb",
    "matched-string" : "god förmåga att kommunicera",
    "annotation-id" : 19
  }, {
    "preferred-label" : "Halmstad",
    "type" : "municipality",
    "start-position" : 2994,
    "end-position" : 3003,
    "concept-id" : "kUQB_KdK_kAh",
    "matched-string" : "Halmstads",
    "annotation-id" : 20
  } ],
  "text" : "Timanställda Bibliotekarier \nHalmstad är en expansiv kommun där vi arbetar för att våra 100 000 kommuninvånare ska trivas och få ut mer av livet. Här finns möjligheterna för dig som vill ha ett meningsfullt arbete och bidra med engagemang och nytänkande. Tillsammans med 9000 kollegor är du med och bygger hemstaden, kunskapsstaden och upplevelsestaden. Läs mer om oss https://www.halmstad.se/intro\n\nKulturförvaltningens verksamheter spänner över ett stort fält och vi tror på att kulturen spelar en viktig roll i samhället och att våra verksamheter gör skillnad för Halmstads kommuns invånare. Med kultur bidrar vi till människors livskvalitet, gemenskap och öppenhet. Kulturförvaltningen svarar för kulturell service i hela Halmstads kommun genom bibliotek, mötesplatser för unga samt konst och kulturverksamhet. Förvaltningen jobbar med delaktighet som centralt verktyg. Här finns prisvinnande bibliotek och på våra mötesplatser utgår vi från att alla unga ska ges möjlighet till en meningsfull fritid. Vi har ett museum med nationell ryktbarhet samt en omfattande samling av offentlig konst i stadsrummet. Vi driver Halmstads nya kulturhus för möten, skapande och upplevelser och hos Dramalogen ges kulturentreprenörer möjlighet att växa. Vi ansvarar även för stöd och bidrag till kulturföreningar och studieförbund samt kommunens medborgarservice. \n\nDu som söker till tjänsten delar kommunens värdegrund – alla som möter kommunens verksamhet ska känna att de har samma möjligheter, rättigheter och skyldigheter.\r\n\r\nARBETSUPPGIFTER\nTill Biblioteken i Halmstad söker vi nu två stycken timanställda bibliotekarier som kan hjälpa till att stötta upp vid sjukfrånvaro. Vi erbjuder ett stimulerande och utvecklande arbete där du tillsammans med andra kunniga kollegor bidrar till en upplevelsebaserad verksamhet. \n\nVi ser biblioteket som det självklara navet i lokalsamhället för medborgarna där vi samtidigt strävar efter att fortsätta utveckla samverkan med civilsamhället, näringslivet och andra lokala aktörer. I ditt arbete är samarbete viktigt, men även förmågan att själv kunna driva och utföra arbetsuppgifter. \n\nDu trivs i mötet med andra och har lätt för att skapa fungerande samarbeten inom och utom biblioteksverksamheten. \n\nDu förväntas vara delaktig och känna ansvar för verksamheten både på din enhet och för avdelningen som helhet.\n\r\n\r\nKVALIFIKATIONER\nVi söker dig som har examen i biblioteks- och informationsvetenskap det är meriterande men inget krav av att ha arbetat som bibliotekarie. \n\nDu är idérik, har ett starkt engagemang och stor initiativförmåga. Du har även god förmåga att kommunicera i tal och skrift. \n\nI bemanning av informationspunkterna är du serviceorienterad och du trivs i rollen som förmedlare i mötet med bibliotekens användare. Du har ett starkt litteratur- och kulturintresse, vilket ger dig god kunskap om samtidens litteratur- och kulturvärld. \nVi lägger stor vikt vid personlig lämplighet.\n\r\n\nÖVRIGT\nFör att kvalitetssäkra rekryteringsprocessen hos Halmstads kommun samt möjliggöra god kommunikation med dig som sökande använder vi e-rekrytering i Visma Recruit.\n\nVi undanber oss alla erbjudanden om annonserings- och rekryteringshjälp i samband med denna annons. \n\nVarmt välkommen med din ansökan!"
}