{
  "meta" : {
    "jobad" : {
      "description" : {
        "requirements" : null,
        "needs" : null,
        "company_information" : null,
        "text_formatted" : "Vi söker en erfaren och engagerad Teknisk Dokumentatör till vår kund utanför Växjö men du kommer sitta remote.\n\nHar du en utbildning och erfarenhet av teknisk dokumentation med mycket bildbehandling? Är du teknikintresserad och är en noggrann och driven lagspelare? Då kan tjänsten som Teknisk dokumentatör vara rätt för dig!\n\nAnsök idag!\n\nDet här är ett konsultuppdrag på heltid med start så snart som möjligt. För rätt person finns goda möjligheter till ett långt uppdrag eller övergång till kund.\n\nDin roll\n\nSom Teknisk dokumentatör så kommer du arbeta tillsammans med konstruktörer och andra nyckelpersoner för att skapa illustrativa dokument kring företagets produkter. Tjänsten kommer främst att supportera en avdelning i Skottland.\n\nDu kommer ansvara för både utformning och innehåll i text och bild.\n\nOm dig\n\nVi söker dig som:\n\n- har utbildning och erfarenhet av att arbeta med dokumentation inom industri\n\n- mycket god datorvana, system och hantering av information.\n\n- meriterande är om du har en teknisk utbildning\n\n- har goda kunskaper i både svenska och engelska, både muntligt och skriftligt\n\n- har erfarenhet av ett eller flera följande program/system:\n\n * Alladin/Uptime\n * Adobe Photoshop\n * Adobe Illustrator\n * PTC Creo\n * Composer\n\nDu är ansvarstagande, kommunikativ och har lätt för att samarbeta.\n\nSom person tror vi att du är driven och effektiv. Du uppskattar att arbeta i ett högt tempo och är inte rädd för att ta för dig. Samtidigt ser vi att du har en god samarbetsförmåga där du trivs med att jobba sammansvetsat med andra. Då du i rollen också hanterar en hel del information och data är det viktigt att du har en god analytisk förmåga samt har ett sinne för ordning och struktur. Vi ser även att du är lösningsinriktad och är nyfiken och hungrig på att lära dig nya saker.\n\nVad kan Jefferson Wells erbjuda dig?\n\nJefferson Wells är specialister på kompetensförsörjning av chefer och specialister inom Ekonomi, HR, Executive, Inköp, Logistik, Marknad, Försäljning och Ingenjörsområdet. Vi är ett av få bolag som samarbetar med företag, myndigheter och organisationer inom privat och offentlig sektor i hela Sverige. Våra konsultchefer har gedigen kunskap inom just ditt område. Som konsult hos oss är din karriär och utveckling alltid i fokus. Vår verksamhet bygger på att våra anställda trivs och utvecklas. Vi erbjuder en trygg anställning med allt vad det innebär: månadslön, kollektivavtal, försäkringar m.m. Läs mer om hur det är att vara konsult på Jefferson Wells: https://www.jeffersonwells.se/sv/karriar/konsult-pa-jefferson-wells \n\nAnsökan\n\nVarmt välkommen med din ansökan genom att registrera ditt CV, urval sker löpande.\n\nSök tjänsten i dag!\n\nHar du frågor är du välkommen att kontakta Daniella Bergström på telefonnummer 0455 - 30 27 88, alternativt per mail till daniella.bergstrom@manpower.se.\n\nFrån vecka 29 kontaktar du Cecilia Lindgren på telefonnummer 035-161 446, alternativt per mail till cecilia.a.lindgren@manpower.se\n\nObservera att vi inte tar emot ansökningar via e-post, utan du söker tjänsten med en registrerad profil på vår hemsida genom att följa ansökningslänken i annonsen. Vi kan komma att tillsätta uppdrag redan innan ansökningstiden passerat, så skicka in din ansökan i dag!",
        "conditions" : "Heltid\r\nTemporary",
        "text" : "Vi söker en erfaren och engagerad Teknisk Dokumentatör till vår kund utanför Växjö men du kommer sitta remote.\n\nHar du en utbildning och erfarenhet av teknisk dokumentation med mycket bildbehandling? Är du teknikintresserad och är en noggrann och driven lagspelare? Då kan tjänsten som Teknisk dokumentatör vara rätt för dig!\n\nAnsök idag!\n\nDet här är ett konsultuppdrag på heltid med start så snart som möjligt. För rätt person finns goda möjligheter till ett långt uppdrag eller övergång till kund.\n\nDin roll\n\nSom Teknisk dokumentatör så kommer du arbeta tillsammans med konstruktörer och andra nyckelpersoner för att skapa illustrativa dokument kring företagets produkter. Tjänsten kommer främst att supportera en avdelning i Skottland.\n\nDu kommer ansvara för både utformning och innehåll i text och bild.\n\nOm dig\n\nVi söker dig som:\n\n- har utbildning och erfarenhet av att arbeta med dokumentation inom industri\n\n- mycket god datorvana, system och hantering av information.\n\n- meriterande är om du har en teknisk utbildning\n\n- har goda kunskaper i både svenska och engelska, både muntligt och skriftligt\n\n- har erfarenhet av ett eller flera följande program/system:\n\n * Alladin/Uptime\n * Adobe Photoshop\n * Adobe Illustrator\n * PTC Creo\n * Composer\n\nDu är ansvarstagande, kommunikativ och har lätt för att samarbeta.\n\nSom person tror vi att du är driven och effektiv. Du uppskattar att arbeta i ett högt tempo och är inte rädd för att ta för dig. Samtidigt ser vi att du har en god samarbetsförmåga där du trivs med att jobba sammansvetsat med andra. Då du i rollen också hanterar en hel del information och data är det viktigt att du har en god analytisk förmåga samt har ett sinne för ordning och struktur. Vi ser även att du är lösningsinriktad och är nyfiken och hungrig på att lära dig nya saker.\n\nVad kan Jefferson Wells erbjuda dig?\n\nJefferson Wells är specialister på kompetensförsörjning av chefer och specialister inom Ekonomi, HR, Executive, Inköp, Logistik, Marknad, Försäljning och Ingenjörsområdet. Vi är ett av få bolag som samarbetar med företag, myndigheter och organisationer inom privat och offentlig sektor i hela Sverige. Våra konsultchefer har gedigen kunskap inom just ditt område. Som konsult hos oss är din karriär och utveckling alltid i fokus. Vår verksamhet bygger på att våra anställda trivs och utvecklas. Vi erbjuder en trygg anställning med allt vad det innebär: månadslön, kollektivavtal, försäkringar m.m. Läs mer om hur det är att vara konsult på Jefferson Wells: https://www.jeffersonwells.se/sv/karriar/konsult-pa-jefferson-wells \n\nAnsökan\n\nVarmt välkommen med din ansökan genom att registrera ditt CV, urval sker löpande.\n\nSök tjänsten i dag!\n\nHar du frågor är du välkommen att kontakta Daniella Bergström på telefonnummer 0455 - 30 27 88, alternativt per mail till daniella.bergstrom@manpower.se.\n\nFrån vecka 29 kontaktar du Cecilia Lindgren på telefonnummer 035-161 446, alternativt per mail till cecilia.a.lindgren@manpower.se\n\nObservera att vi inte tar emot ansökningar via e-post, utan du söker tjänsten med en registrerad profil på vår hemsida genom att följa ansökningslänken i annonsen. Vi kan komma att tillsätta uppdrag redan innan ansökningstiden passerat, så skicka in din ansökan i dag!"
      },
      "headline" : "Teknisk dokumentatör till Volvo CE - DISTANS",
      "driving_license" : null,
      "employer" : {
        "email" : null,
        "phone_number" : null,
        "organization_number" : "5568551104",
        "name" : "Experis AB",
        "url" : null,
        "workplace" : "Jefferson Wells Engineer"
      },
      "removed_date" : null,
      "logo_url" : "https://www.arbetsformedlingen.se/rest/arbetsgivare/rest/af/v3/organisation/5568551104/logotyper/logo.png",
      "last_publication_date" : "2022-07-12T23:59:59",
      "number_of_vacancies" : 1,
      "occupation" : {
        "concept_id" : "oV7J_UML_Zy2",
        "label" : "Formgivare",
        "legacy_ams_taxonomy_id" : "6250"
      },
      "occupation_group" : {
        "concept_id" : "DqLe_pH6_jyj",
        "label" : "Industridesigner",
        "legacy_ams_taxonomy_id" : "2171"
      },
      "employment_type" : {
        "concept_id" : "PFZr_Syz_cUq",
        "label" : "Vanlig anställning",
        "legacy_ams_taxonomy_id" : "1"
      },
      "webpage_url" : "https://arbetsformedlingen.se/platsbanken/annonser/26296341",
      "driving_license_required" : false,
      "application_contacts" : [ {
        "description" : "Daniella Bergström",
        "email" : null,
        "telephone" : null,
        "name" : null,
        "contact_type" : null
      } ],
      "duration" : {
        "concept_id" : "qQUd_4qe_NDT",
        "label" : "6 månader eller längre",
        "legacy_ams_taxonomy_id" : "2"
      },
      "nice_to_have" : {
        "education_level" : [ ],
        "work_experiences" : [ ],
        "skills" : [ ],
        "education" : [ ],
        "languages" : [ ]
      },
      "application_details" : {
        "via_af" : false,
        "email" : null,
        "other" : null,
        "reference" : "1cab7955-b827-",
        "url" : "https://www.aplitrak.com/?adid=REJlcmdzLjI4MzY2LjMxMDFAbWFucG93ZXJncm91cG5vcmRpY3MuYXBsaXRyYWsuY29t",
        "information" : null
      },
      "source_type" : "VIA_PLATSBANKEN_DXA",
      "application_deadline" : "2022-07-12T23:59:59",
      "external_id" : "46-556855-1104-1cab7955-b827-",
      "workplace_address" : {
        "coordinates" : [ 14.805852, 56.879005 ],
        "city" : null,
        "postcode" : null,
        "municipality" : "Växjö",
        "region_concept_id" : "tF3y_MF9_h5G",
        "region" : "Kronobergs län",
        "country_code" : "199",
        "region_code" : "07",
        "municipality_concept_id" : "mmot_H3A_auW",
        "country_concept_id" : "i46j_HmG_v64",
        "municipality_code" : "0780",
        "street_address" : null,
        "country" : "Sverige"
      },
      "id" : "26296341",
      "experience_required" : false,
      "working_hours_type" : {
        "concept_id" : "6YE1_gAC_R2G",
        "label" : "Heltid",
        "legacy_ams_taxonomy_id" : "1"
      },
      "access" : null,
      "timestamp" : 1657028878077,
      "must_have" : {
        "education_level" : [ ],
        "work_experiences" : [ ],
        "skills" : [ ],
        "education" : [ ],
        "languages" : [ ]
      },
      "occupation_field" : {
        "concept_id" : "9puE_nYg_crq",
        "label" : "Kultur, media, design",
        "legacy_ams_taxonomy_id" : "11"
      },
      "scope_of_work" : {
        "min" : 100,
        "max" : 100
      },
      "salary_type" : {
        "concept_id" : "oG8G_9cW_nRf",
        "label" : "Fast månads- vecko- eller timlön",
        "legacy_ams_taxonomy_id" : "1"
      },
      "removed" : false,
      "salary_description" : "Not Specified",
      "access_to_own_car" : false,
      "publication_date" : "2022-07-05T15:47:58"
    },
    "name" : "Teknisk dokumentatör till Volvo CE - DISTANS",
    "user" : "kristof.fischer"
  },
  "sha1" : "1e392120cffc47c1ace75e4d77b0e253ca6ad473",
  "annotations" : [ {
    "preferred-label" : null,
    "type" : "occupation-name",
    "start-position" : 0,
    "end-position" : 20,
    "concept-id" : null,
    "matched-string" : "Teknisk dokumentatör",
    "annotation-id" : 12
  }, {
    "preferred-label" : "Distansarbete",
    "type" : "work-place-environment",
    "start-position" : 37,
    "end-position" : 44,
    "concept-id" : "uwzb_xcR_vxS",
    "matched-string" : "DISTANS",
    "annotation-id" : 13
  }, {
    "preferred-label" : null,
    "type" : "occupation-name",
    "start-position" : 79,
    "end-position" : 99,
    "concept-id" : null,
    "matched-string" : "Teknisk Dokumentatör",
    "annotation-id" : 14
  }, {
    "preferred-label" : "Växjö",
    "type" : "municipality",
    "start-position" : 122,
    "end-position" : 127,
    "concept-id" : "mmot_H3A_auW",
    "matched-string" : "Växjö",
    "annotation-id" : 15
  }, {
    "preferred-label" : "Distansarbete",
    "type" : "work-place-environment",
    "start-position" : 148,
    "end-position" : 154,
    "concept-id" : "uwzb_xcR_vxS",
    "matched-string" : "remote",
    "annotation-id" : 16
  }, {
    "preferred-label" : "Teknisk dokumentation",
    "sentiment" : "MUST_HAVE",
    "type" : "skill",
    "start-position" : 196,
    "end-position" : 217,
    "concept-id" : "AEgv_4gP_ndv",
    "matched-string" : "teknisk dokumentation",
    "annotation-id" : 2
  }, {
    "preferred-label" : "Bildredigering",
    "sentiment" : "MUST_HAVE",
    "type" : "skill",
    "start-position" : 229,
    "end-position" : 243,
    "concept-id" : "eVFF_obx_bKN",
    "matched-string" : "bildbehandling",
    "annotation-id" : 17
  }, {
    "preferred-label" : "noggrannhet",
    "sentiment" : "MUST_HAVE",
    "type" : "esco-skill",
    "start-position" : 279,
    "end-position" : 287,
    "concept-id" : "mrsW_EkL_KRD",
    "matched-string" : "noggrann",
    "annotation-id" : 18
  }, {
    "preferred-label" : null,
    "type" : "occupation-name",
    "start-position" : 331,
    "end-position" : 351,
    "concept-id" : null,
    "matched-string" : "Teknisk dokumentatör",
    "annotation-id" : 19
  }, {
    "preferred-label" : "Heltid",
    "type" : "worktime-extent",
    "start-position" : 418,
    "end-position" : 424,
    "concept-id" : "6YE1_gAC_R2G",
    "matched-string" : "heltid",
    "annotation-id" : 20
  }, {
    "preferred-label" : null,
    "type" : "occupation-name",
    "start-position" : 560,
    "end-position" : 580,
    "concept-id" : null,
    "matched-string" : "Teknisk dokumentatör",
    "annotation-id" : 21
  }, {
    "preferred-label" : "Dokumentation, processindustri",
    "sentiment" : "MUST_HAVE",
    "type" : "skill",
    "start-position" : 931,
    "end-position" : 958,
    "concept-id" : "AiwS_Mhv_ttk",
    "matched-string" : "dokumentation inom industri",
    "annotation-id" : 22
  }, {
    "preferred-label" : "använda dator",
    "sentiment" : "MUST_HAVE",
    "type" : "esco-skill",
    "start-position" : 969,
    "end-position" : 982,
    "concept-id" : "HEbR_xrb_MpT",
    "matched-string" : "god datorvana",
    "annotation-id" : 23
  }, {
    "preferred-label" : "Annan utbildning inom teknik och teknisk industri",
    "sentiment" : "NICE_TO_HAVE",
    "type" : "sun-education-field-4",
    "start-position" : 1052,
    "end-position" : 1070,
    "concept-id" : "NKNc_sE8_2ok",
    "matched-string" : "teknisk utbildning",
    "annotation-id" : 24
  }, {
    "preferred-label" : "Svenska",
    "sentiment" : "MUST_HAVE",
    "type" : "language",
    "start-position" : 1100,
    "end-position" : 1107,
    "concept-id" : "zSLA_vw2_FXN",
    "matched-string" : "svenska",
    "annotation-id" : 6
  }, {
    "preferred-label" : "Engelska",
    "sentiment" : "MUST_HAVE",
    "type" : "language",
    "start-position" : 1112,
    "end-position" : 1120,
    "concept-id" : "NVxJ_hLg_TYS",
    "matched-string" : "engelska",
    "annotation-id" : 7
  }, {
    "preferred-label" : null,
    "sentiment" : "MUST_HAVE",
    "type" : "skill",
    "start-position" : 1217,
    "end-position" : 1224,
    "concept-id" : null,
    "matched-string" : "Alladin",
    "annotation-id" : 25
  }, {
    "preferred-label" : null,
    "sentiment" : "MUST_HAVE",
    "type" : "skill",
    "start-position" : 1225,
    "end-position" : 1231,
    "concept-id" : null,
    "matched-string" : "Uptime",
    "annotation-id" : 26
  }, {
    "preferred-label" : "2D-grafik-Adobe Photoshop",
    "sentiment" : "MUST_HAVE",
    "type" : "skill",
    "start-position" : 1235,
    "end-position" : 1250,
    "concept-id" : "xNyv_PTi_fSa",
    "matched-string" : "Adobe Photoshop",
    "annotation-id" : 27
  }, {
    "preferred-label" : "2D-grafik-Adobe Illustrator",
    "sentiment" : "MUST_HAVE",
    "type" : "skill",
    "start-position" : 1254,
    "end-position" : 1271,
    "concept-id" : "FKub_QFH_Btk",
    "matched-string" : "Adobe Illustrator",
    "annotation-id" : 28
  }, {
    "preferred-label" : null,
    "sentiment" : "MUST_HAVE",
    "type" : "skill",
    "start-position" : 1275,
    "end-position" : 1283,
    "concept-id" : null,
    "matched-string" : "PTC Creo",
    "annotation-id" : 29
  }, {
    "preferred-label" : null,
    "sentiment" : "MUST_HAVE",
    "type" : "skill",
    "start-position" : 1287,
    "end-position" : 1295,
    "concept-id" : null,
    "matched-string" : "Composer",
    "annotation-id" : 30
  }, {
    "preferred-label" : "visa ansvarstagande",
    "sentiment" : "MUST_HAVE",
    "type" : "esco-skill",
    "start-position" : 1303,
    "end-position" : 1317,
    "concept-id" : "bcRp_hxV_f5G",
    "matched-string" : "ansvarstagande",
    "annotation-id" : 31
  }, {
    "preferred-label" : "kommunikation",
    "sentiment" : "MUST_HAVE",
    "type" : "esco-skill",
    "start-position" : 1319,
    "end-position" : 1331,
    "concept-id" : "ahPU_HgE_Jeb",
    "matched-string" : "kommunikativ",
    "annotation-id" : 32
  }, {
    "preferred-label" : "samarbeta med kolleger",
    "sentiment" : "MUST_HAVE",
    "type" : "esco-skill",
    "start-position" : 1353,
    "end-position" : 1362,
    "concept-id" : "X15R_797_q62",
    "matched-string" : "samarbeta",
    "annotation-id" : 33
  }, {
    "preferred-label" : "samarbeta med kolleger",
    "sentiment" : "MUST_HAVE",
    "type" : "esco-skill",
    "start-position" : 1529,
    "end-position" : 1545,
    "concept-id" : "X15R_797_q62",
    "matched-string" : "samarbetsförmåga",
    "annotation-id" : 34
  }, {
    "preferred-label" : "arbeta analytiskt",
    "sentiment" : "MUST_HAVE",
    "type" : "esco-skill",
    "start-position" : 1689,
    "end-position" : 1710,
    "concept-id" : "wLyJ_Zpf_tgC",
    "matched-string" : "god analytisk förmåga",
    "annotation-id" : 35
  }, {
    "preferred-label" : "Lösningsfokuserat arbetssätt",
    "sentiment" : "MUST_HAVE",
    "type" : "skill",
    "start-position" : 1778,
    "end-position" : 1794,
    "concept-id" : "94uF_bkH_QF5",
    "matched-string" : "lösningsinriktad",
    "annotation-id" : 36
  } ],
  "text" : "Teknisk dokumentatör till Volvo CE - DISTANS\nVi söker en erfaren och engagerad Teknisk Dokumentatör till vår kund utanför Växjö men du kommer sitta remote.\n\nHar du en utbildning och erfarenhet av teknisk dokumentation med mycket bildbehandling? Är du teknikintresserad och är en noggrann och driven lagspelare? Då kan tjänsten som Teknisk dokumentatör vara rätt för dig!\n\nAnsök idag!\n\nDet här är ett konsultuppdrag på heltid med start så snart som möjligt. För rätt person finns goda möjligheter till ett långt uppdrag eller övergång till kund.\n\nDin roll\n\nSom Teknisk dokumentatör så kommer du arbeta tillsammans med konstruktörer och andra nyckelpersoner för att skapa illustrativa dokument kring företagets produkter. Tjänsten kommer främst att supportera en avdelning i Skottland.\n\nDu kommer ansvara för både utformning och innehåll i text och bild.\n\nOm dig\n\nVi söker dig som:\n\n- har utbildning och erfarenhet av att arbeta med dokumentation inom industri\n\n- mycket god datorvana, system och hantering av information.\n\n- meriterande är om du har en teknisk utbildning\n\n- har goda kunskaper i både svenska och engelska, både muntligt och skriftligt\n\n- har erfarenhet av ett eller flera följande program/system:\n\n * Alladin/Uptime\n * Adobe Photoshop\n * Adobe Illustrator\n * PTC Creo\n * Composer\n\nDu är ansvarstagande, kommunikativ och har lätt för att samarbeta.\n\nSom person tror vi att du är driven och effektiv. Du uppskattar att arbeta i ett högt tempo och är inte rädd för att ta för dig. Samtidigt ser vi att du har en god samarbetsförmåga där du trivs med att jobba sammansvetsat med andra. Då du i rollen också hanterar en hel del information och data är det viktigt att du har en god analytisk förmåga samt har ett sinne för ordning och struktur. Vi ser även att du är lösningsinriktad och är nyfiken och hungrig på att lära dig nya saker.\n\nVad kan Jefferson Wells erbjuda dig?\n\nJefferson Wells är specialister på kompetensförsörjning av chefer och specialister inom Ekonomi, HR, Executive, Inköp, Logistik, Marknad, Försäljning och Ingenjörsområdet. Vi är ett av få bolag som samarbetar med företag, myndigheter och organisationer inom privat och offentlig sektor i hela Sverige. Våra konsultchefer har gedigen kunskap inom just ditt område. Som konsult hos oss är din karriär och utveckling alltid i fokus. Vår verksamhet bygger på att våra anställda trivs och utvecklas. Vi erbjuder en trygg anställning med allt vad det innebär: månadslön, kollektivavtal, försäkringar m.m. Läs mer om hur det är att vara konsult på Jefferson Wells: https://www.jeffersonwells.se/sv/karriar/konsult-pa-jefferson-wells \n\nAnsökan\n\nVarmt välkommen med din ansökan genom att registrera ditt CV, urval sker löpande.\n\nSök tjänsten i dag!\n\nHar du frågor är du välkommen att kontakta Daniella Bergström på telefonnummer 0455 - 30 27 88, alternativt per mail till daniella.bergstrom@manpower.se.\n\nFrån vecka 29 kontaktar du Cecilia Lindgren på telefonnummer 035-161 446, alternativt per mail till cecilia.a.lindgren@manpower.se\n\nObservera att vi inte tar emot ansökningar via e-post, utan du söker tjänsten med en registrerad profil på vår hemsida genom att följa ansökningslänken i annonsen. Vi kan komma att tillsätta uppdrag redan innan ansökningstiden passerat, så skicka in din ansökan i dag!"
}