{
  "meta" : {
    "jobad" : {
      "description" : {
        "requirements" : null,
        "needs" : null,
        "company_information" : null,
        "text_formatted" : "<p>Warma West Shawarma öppnar ett unikt koncept i Marieberg Galleria I Örebro och söker just nu omgående Restaurangbiträde.  Arbetsuppgifterna kommer variera allt från beredning, servering, ta emot beställningar, kassa samt städning och disk. </p><p>Vi söker dig som är ung och driven i ditt arbete och bidrar med en god utveckling inom arbetsplatser. </p>",
        "conditions" : null,
        "text" : "Warma West Shawarma öppnar ett unikt koncept i Marieberg Galleria I Örebro och söker just nu omgående Restaurangbiträde.  Arbetsuppgifterna kommer variera allt från beredning, servering, ta emot beställningar, kassa samt städning och disk. \nVi söker dig som är ung och driven i ditt arbete och bidrar med en god utveckling inom arbetsplatser."
      },
      "headline" : "Restaurangbiträde Sökes",
      "driving_license" : null,
      "employer" : {
        "email" : null,
        "phone_number" : null,
        "organization_number" : "5590754585",
        "name" : "Scandinavian multi Investment's AB",
        "url" : "restaurangwarma.se",
        "workplace" : "Scandinavian multi Investment's AB"
      },
      "removed_date" : null,
      "logo_url" : "https://www.arbetsformedlingen.se/rest/arbetsgivare/rest/af/v3/arbetsplatser/86185131/logotyper/logo.png",
      "last_publication_date" : "2022-07-28T23:59:59",
      "number_of_vacancies" : 10,
      "occupation" : {
        "concept_id" : "yXRQ_Ad9_E8V",
        "label" : "Restaurangbiträde",
        "legacy_ams_taxonomy_id" : "5555"
      },
      "occupation_group" : {
        "concept_id" : "tPox_ie4_X9X",
        "label" : "Restaurang- och köksbiträden m.fl.",
        "legacy_ams_taxonomy_id" : "9412"
      },
      "employment_type" : {
        "concept_id" : "1paU_aCR_nGn",
        "label" : "Behovsanställning",
        "legacy_ams_taxonomy_id" : "4"
      },
      "webpage_url" : "https://arbetsformedlingen.se/platsbanken/annonser/26264366",
      "driving_license_required" : false,
      "application_contacts" : [ {
        "description" : null,
        "email" : "vd@scand-mi.com",
        "telephone" : "0700746562, 0769127529",
        "name" : "Yahya Al daoudi",
        "contact_type" : "Verkställande direktör"
      } ],
      "duration" : {
        "concept_id" : null,
        "label" : null,
        "legacy_ams_taxonomy_id" : null
      },
      "nice_to_have" : {
        "education_level" : [ ],
        "work_experiences" : [ ],
        "skills" : [ {
          "concept_id" : "Dxqv_2WA_TYt",
          "weight" : 5,
          "label" : "Restaurangkök",
          "legacy_ams_taxonomy_id" : "604218"
        }, {
          "concept_id" : "cjvf_YjZ_UkM",
          "weight" : 5,
          "label" : "Restaurang- och livsmedelsinriktning, undervisning",
          "legacy_ams_taxonomy_id" : "608978"
        } ],
        "education" : [ ],
        "languages" : [ {
          "concept_id" : "NVxJ_hLg_TYS",
          "weight" : 5,
          "label" : "Engelska",
          "legacy_ams_taxonomy_id" : "283"
        } ]
      },
      "application_details" : {
        "via_af" : false,
        "email" : "vd@scand-mi.com",
        "other" : null,
        "reference" : "Warma Restaurangbiträde",
        "url" : null,
        "information" : null
      },
      "source_type" : "VIA_ANNONSERA",
      "application_deadline" : "2022-07-28T23:59:59",
      "external_id" : null,
      "workplace_address" : {
        "coordinates" : [ 15.214893306028705, 59.27626399422596 ],
        "city" : "Örebro",
        "postcode" : "70361",
        "municipality" : "Örebro",
        "region_concept_id" : "xTCk_nT5_Zjm",
        "region" : "Örebro län",
        "country_code" : "199",
        "region_code" : "18",
        "municipality_concept_id" : "kuMn_feU_hXx",
        "country_concept_id" : "i46j_HmG_v64",
        "municipality_code" : "1880",
        "street_address" : "Järntorgsgatan 8 4TR",
        "country" : "Sverige"
      },
      "id" : "26264366",
      "experience_required" : true,
      "working_hours_type" : {
        "concept_id" : null,
        "label" : null,
        "legacy_ams_taxonomy_id" : null
      },
      "access" : null,
      "timestamp" : 1656368710818,
      "must_have" : {
        "education_level" : [ ],
        "work_experiences" : [ {
          "concept_id" : "yXRQ_Ad9_E8V",
          "weight" : 10,
          "label" : "Restaurangbiträde",
          "legacy_ams_taxonomy_id" : "5555"
        } ],
        "skills" : [ ],
        "education" : [ ],
        "languages" : [ {
          "concept_id" : "zSLA_vw2_FXN",
          "weight" : 10,
          "label" : "Svenska",
          "legacy_ams_taxonomy_id" : "502"
        } ]
      },
      "occupation_field" : {
        "concept_id" : "ScKy_FHB_7wT",
        "label" : "Hotell, restaurang, storhushåll",
        "legacy_ams_taxonomy_id" : "7"
      },
      "scope_of_work" : {
        "min" : 0,
        "max" : null
      },
      "salary_type" : {
        "concept_id" : "oG8G_9cW_nRf",
        "label" : "Fast månads- vecko- eller timlön",
        "legacy_ams_taxonomy_id" : "1"
      },
      "removed" : false,
      "salary_description" : null,
      "access_to_own_car" : false,
      "publication_date" : "2022-06-28T00:25:10"
    },
    "name" : "Restaurangbiträde Sökes",
    "user" : "hannes"
  },
  "sha1" : "2aed92af507384817ecdd325075f821ea090630d",
  "annotations" : [ {
    "preferred-label" : "Restaurangbiträde",
    "sentiment" : "MUST_HAVE",
    "type" : "occupation-name",
    "start-position" : 0,
    "end-position" : 17,
    "concept-id" : "yXRQ_Ad9_E8V",
    "matched-string" : "restaurangbiträde",
    "annotation-id" : 0
  }, {
    "preferred-label" : "Örebro",
    "type" : "municipality",
    "start-position" : 92,
    "end-position" : 98,
    "concept-id" : "kuMn_feU_hXx",
    "matched-string" : "Örebro",
    "annotation-id" : 2
  }, {
    "preferred-label" : "Restaurangbiträde",
    "sentiment" : "MUST_HAVE",
    "type" : "occupation-name",
    "start-position" : 126,
    "end-position" : 143,
    "concept-id" : "yXRQ_Ad9_E8V",
    "matched-string" : "restaurangbiträde",
    "annotation-id" : 1
  }, {
    "preferred-label" : "Restaurang, servering",
    "type" : "keyword",
    "start-position" : 200,
    "end-position" : 209,
    "concept-id" : "GqXD_ArB_Mmg",
    "matched-string" : "servering",
    "annotation-id" : 3
  }, {
    "preferred-label" : "sköta en kassaapparat",
    "type" : "esco-skill",
    "start-position" : 234,
    "end-position" : 239,
    "concept-id" : "tG6R_L5T_NTv",
    "matched-string" : "kassa",
    "annotation-id" : 5
  }, {
    "preferred-label" : "Städa",
    "type" : "keyword",
    "start-position" : 245,
    "end-position" : 253,
    "concept-id" : "r35T_iyj_ueU",
    "matched-string" : "städning",
    "annotation-id" : 6
  }, {
    "preferred-label" : "Diskare",
    "type" : "occupation-name",
    "start-position" : 258,
    "end-position" : 262,
    "concept-id" : "pKTY_Kwu_sUw",
    "matched-string" : "disk",
    "annotation-id" : 4
  } ],
  "text" : "Restaurangbiträde Sökes\nWarma West Shawarma öppnar ett unikt koncept i Marieberg Galleria I Örebro och söker just nu omgående Restaurangbiträde.  Arbetsuppgifterna kommer variera allt från beredning, servering, ta emot beställningar, kassa samt städning och disk. \nVi söker dig som är ung och driven i ditt arbete och bidrar med en god utveckling inom arbetsplatser."
}