{
  "meta" : {
    "jobad" : {
      "description" : {
        "requirements" : null,
        "needs" : null,
        "company_information" : null,
        "text_formatted" : "Om företaget\nProtek Norr AB utför kärnborrning för kunder i framför allt gruv- och prospekteringsindustrin. Mer än tjugofem års erfarenhet av kärnborrning, en extremt bred maskinpark och kompetent personal gör Protek till en komplett entreprenör för stora och små projekt oavsett mark- och bergförhållanden. Protek är välkända i branschen och betraktas som en trygg och pålitlig samarbetspartner.\nDet är stor aktivitet i vår region just nu. Därför söker vi nu ett antal maskinoperatörer till våra borriggar. Du kommer  få ett intressant och spännande jobb med givande sociala kontakter i ett väl inarbetat företag baserat på goda värderingar!\nVill du bli en av våra nya kärnborrare ska du läsa vidare i denna annons.\n\nDina arbetsuppgifter\nKärnborrning eller diamantborrning, som det ibland kallas, är en borrteknik som i huvudsak används vid prospektering i befintliga gruvor men även där helt nya fyndigheter ska undersökas. Arbetsuppgifterna består i huvudsak av att producera borrkärnor som sedan skickas på analys. Den största delen arbetstiden är förlagd under jord. Därför är det meriterande ifall du har vana vid att arbeta under jord. \nI dina arbetsuppgifter ingår även service och underhåll av utrustningen samt viss reparation. Du får mycket stor frihet under ansvar i jobbet. Anställningen inleds med en introduktionsperiod som vanligtvis genomförs på den arbetsplats där du sedan kommer att bli placerad under din första tid på Protek. Arbetet bedrivs vanligtvis under sju dagar, med för- och eftermiddagsskift, och sedan 7 dagars ledighet. Det innebär att du är borta från hemmet i sju dagar. Traktamente utgår och Protek ordnar boende. Arbetsområdet är i huvudsak Norr- och Västerbotten men hela Sverige är ditt arbetsfält.\n\nDin bakgrund/Dina egenskaper\nDu behöver inte nödvändigtvis ha erfarenhet av kärnborrning men det är självklart meriterande. Lämplig bakgrund kan vara exempelvis maskinförare, mekaniker men även erfarenhet från arbete i gruva eller service/underhållsarbete kan vara lämplig bakgrund. Du bör ha en ansvarskänsla för både borrning och maskiner, vara noggrann och kunna ta ett personligt ansvar för kvalité och prestation. Du ska ha förmåga att arbeta självständigt men även tillsammans i team. Körkort B är ett krav. Du blir anställd i hemmet och erhåller reseersättning och restidsersättning för resor till och från arbetet.\n\nInformation och kontakt\nI denna rekrytering samarbetar vi med Wikan Personal AB. Ytterligare upplysningar kring tjänsten, vänligen kontakta Kenneth Vidmark, Wikan Personal AB. Ansöker gör du på www.skelleftea.wikan.se\n0910-77 09 81.\nAnsökan \nVi arbetar löpande med inkomna ansökningar. Tjänsterna kan komma att tillsättas innan sista ansökningsdag. Vi arbetar aktivt för en jämställd arbetsplats och välkomnar både kvinnliga och manliga sökande. Annonsen ligger uppe hela året då vi söker ett flertal personer. Urval sker löpande.\nAnställningsform\nProvanställning som övergår till tillsvidareanställning.\n\nOm Wikan Personal\nWikan Personal är ett auktoriserat och etablerat bemannings- och rekryteringsföretag. Med lokal förankring vill vi hjälpa företag och organisationer med kompetent och välmotiverad personal. Wikan har kontor på 15 orter i Sverige, omsätter ca 380 Msek och har omkring 800 anställda. Läs mer på www.wikan.se",
        "conditions" : "Heltid\r\nTillsvidare",
        "text" : "Om företaget\nProtek Norr AB utför kärnborrning för kunder i framför allt gruv- och prospekteringsindustrin. Mer än tjugofem års erfarenhet av kärnborrning, en extremt bred maskinpark och kompetent personal gör Protek till en komplett entreprenör för stora och små projekt oavsett mark- och bergförhållanden. Protek är välkända i branschen och betraktas som en trygg och pålitlig samarbetspartner.\nDet är stor aktivitet i vår region just nu. Därför söker vi nu ett antal maskinoperatörer till våra borriggar. Du kommer  få ett intressant och spännande jobb med givande sociala kontakter i ett väl inarbetat företag baserat på goda värderingar!\nVill du bli en av våra nya kärnborrare ska du läsa vidare i denna annons.\n\nDina arbetsuppgifter\nKärnborrning eller diamantborrning, som det ibland kallas, är en borrteknik som i huvudsak används vid prospektering i befintliga gruvor men även där helt nya fyndigheter ska undersökas. Arbetsuppgifterna består i huvudsak av att producera borrkärnor som sedan skickas på analys. Den största delen arbetstiden är förlagd under jord. Därför är det meriterande ifall du har vana vid att arbeta under jord. \nI dina arbetsuppgifter ingår även service och underhåll av utrustningen samt viss reparation. Du får mycket stor frihet under ansvar i jobbet. Anställningen inleds med en introduktionsperiod som vanligtvis genomförs på den arbetsplats där du sedan kommer att bli placerad under din första tid på Protek. Arbetet bedrivs vanligtvis under sju dagar, med för- och eftermiddagsskift, och sedan 7 dagars ledighet. Det innebär att du är borta från hemmet i sju dagar. Traktamente utgår och Protek ordnar boende. Arbetsområdet är i huvudsak Norr- och Västerbotten men hela Sverige är ditt arbetsfält.\n\nDin bakgrund/Dina egenskaper\nDu behöver inte nödvändigtvis ha erfarenhet av kärnborrning men det är självklart meriterande. Lämplig bakgrund kan vara exempelvis maskinförare, mekaniker men även erfarenhet från arbete i gruva eller service/underhållsarbete kan vara lämplig bakgrund. Du bör ha en ansvarskänsla för både borrning och maskiner, vara noggrann och kunna ta ett personligt ansvar för kvalité och prestation. Du ska ha förmåga att arbeta självständigt men även tillsammans i team. Körkort B är ett krav. Du blir anställd i hemmet och erhåller reseersättning och restidsersättning för resor till och från arbetet.\n\nInformation och kontakt\nI denna rekrytering samarbetar vi med Wikan Personal AB. Ytterligare upplysningar kring tjänsten, vänligen kontakta Kenneth Vidmark, Wikan Personal AB. Ansöker gör du på www.skelleftea.wikan.se\n0910-77 09 81.\nAnsökan \nVi arbetar löpande med inkomna ansökningar. Tjänsterna kan komma att tillsättas innan sista ansökningsdag. Vi arbetar aktivt för en jämställd arbetsplats och välkomnar både kvinnliga och manliga sökande. Annonsen ligger uppe hela året då vi söker ett flertal personer. Urval sker löpande.\nAnställningsform\nProvanställning som övergår till tillsvidareanställning.\n\nOm Wikan Personal\nWikan Personal är ett auktoriserat och etablerat bemannings- och rekryteringsföretag. Med lokal förankring vill vi hjälpa företag och organisationer med kompetent och välmotiverad personal. Wikan har kontor på 15 orter i Sverige, omsätter ca 380 Msek och har omkring 800 anställda. Läs mer på www.wikan.se"
      },
      "headline" : "Vi söker nu kärnborrare/diamantborrare",
      "driving_license" : [ {
        "concept_id" : "VTK8_WRx_GcM",
        "label" : "B",
        "legacy_ams_taxonomy_id" : "3"
      } ],
      "employer" : {
        "email" : null,
        "phone_number" : null,
        "organization_number" : "5568427818",
        "name" : "Wikan Personal AB",
        "url" : "http://www.wikan.se",
        "workplace" : "Wikan Personal Botnia AB"
      },
      "removed_date" : null,
      "logo_url" : "https://www.arbetsformedlingen.se/rest/arbetsgivare/rest/af/v3/organisation/5568427818/logotyper/logo.png",
      "last_publication_date" : "2022-11-30T23:59:59",
      "number_of_vacancies" : 1,
      "occupation" : {
        "concept_id" : "zgfW_Kmq_yct",
        "label" : "Kärnborrare",
        "legacy_ams_taxonomy_id" : "2906"
      },
      "occupation_group" : {
        "concept_id" : "7zKm_4NW_eey",
        "label" : "Brunnsborrare m.fl.",
        "legacy_ams_taxonomy_id" : "8113"
      },
      "employment_type" : {
        "concept_id" : "PFZr_Syz_cUq",
        "label" : "Vanlig anställning",
        "legacy_ams_taxonomy_id" : "1"
      },
      "webpage_url" : "https://arbetsformedlingen.se/platsbanken/annonser/26270734",
      "driving_license_required" : true,
      "application_contacts" : [ {
        "description" : "Kenneth Vidmark",
        "email" : "kenneth@wikan.se",
        "telephone" : "0910-77 09 81",
        "name" : null,
        "contact_type" : null
      } ],
      "duration" : {
        "concept_id" : "a7uU_j21_mkL",
        "label" : "Tills vidare",
        "legacy_ams_taxonomy_id" : "1"
      },
      "nice_to_have" : {
        "education_level" : [ ],
        "work_experiences" : [ ],
        "skills" : [ ],
        "education" : [ ],
        "languages" : [ ]
      },
      "application_details" : {
        "via_af" : false,
        "email" : null,
        "other" : null,
        "reference" : "9763",
        "url" : "http://www.wikan.se/jobb/9763/",
        "information" : null
      },
      "source_type" : "VIA_PLATSBANKEN_DXA",
      "application_deadline" : "2022-11-30T23:59:59",
      "external_id" : "46-556842-7818-9763",
      "workplace_address" : {
        "coordinates" : [ 19.482641, 64.913506 ],
        "city" : null,
        "postcode" : null,
        "municipality" : "Norsjö",
        "region_concept_id" : "g5Tt_CAV_zBd",
        "region" : "Västerbottens län",
        "country_code" : "199",
        "region_code" : "24",
        "municipality_concept_id" : "XmpG_vPQ_K7T",
        "country_concept_id" : "i46j_HmG_v64",
        "municipality_code" : "2417",
        "street_address" : null,
        "country" : "Sverige"
      },
      "id" : "26270734",
      "experience_required" : false,
      "working_hours_type" : {
        "concept_id" : "6YE1_gAC_R2G",
        "label" : "Heltid",
        "legacy_ams_taxonomy_id" : "1"
      },
      "access" : null,
      "timestamp" : 1656489909623,
      "must_have" : {
        "education_level" : [ ],
        "work_experiences" : [ ],
        "skills" : [ ],
        "education" : [ ],
        "languages" : [ ]
      },
      "occupation_field" : {
        "concept_id" : "j7Cq_ZJe_GkT",
        "label" : "Bygg och anläggning",
        "legacy_ams_taxonomy_id" : "2"
      },
      "scope_of_work" : {
        "min" : 100,
        "max" : 100
      },
      "salary_type" : {
        "concept_id" : "oG8G_9cW_nRf",
        "label" : "Fast månads- vecko- eller timlön",
        "legacy_ams_taxonomy_id" : "1"
      },
      "removed" : false,
      "salary_description" : "Fast lön",
      "access_to_own_car" : true,
      "publication_date" : "2022-07-01T00:00:00"
    },
    "name" : "Vi söker nu kärnborrare/diamantborrare",
    "user" : "hannes"
  },
  "sha1" : "703b4d5080808ad1fc2100514e94800a919294bb",
  "annotations" : [ {
    "preferred-label" : "Kärnborrare",
    "sentiment" : "MUST_HAVE",
    "type" : "occupation-name",
    "start-position" : 12,
    "end-position" : 23,
    "concept-id" : "zgfW_Kmq_yct",
    "matched-string" : "kärnborrare",
    "annotation-id" : 0
  }, {
    "preferred-label" : "Diamantborrning",
    "type" : "skill",
    "start-position" : 24,
    "end-position" : 38,
    "concept-id" : "CXCw_BKy_5SE",
    "matched-string" : "diamantborrare",
    "annotation-id" : 18
  }, {
    "preferred-label" : "Kärnborrning",
    "sentiment" : "MUST_HAVE",
    "type" : "skill",
    "start-position" : 73,
    "end-position" : 85,
    "concept-id" : "1tS5_88V_RcA",
    "matched-string" : "kärnborrning",
    "annotation-id" : 1
  }, {
    "preferred-label" : "Kärnborrning",
    "sentiment" : "MUST_HAVE",
    "type" : "skill",
    "start-position" : 181,
    "end-position" : 193,
    "concept-id" : "1tS5_88V_RcA",
    "matched-string" : "kärnborrning",
    "annotation-id" : 2
  }, {
    "preferred-label" : "Personal",
    "sentiment" : "MUST_HAVE",
    "type" : "keyword",
    "start-position" : 236,
    "end-position" : 244,
    "concept-id" : "HVxM_6MS_y1c",
    "matched-string" : "personal",
    "annotation-id" : 3
  }, {
    "preferred-label" : "Mark/infrastruktur-Bentley InRoads Suite",
    "sentiment" : "MUST_HAVE",
    "type" : "skill",
    "start-position" : 319,
    "end-position" : 323,
    "concept-id" : "tCER_yDZ_XnW",
    "matched-string" : "mark",
    "annotation-id" : 4
  }, {
    "preferred-label" : "Kärnborrare",
    "sentiment" : "MUST_HAVE",
    "type" : "occupation-name",
    "start-position" : 709,
    "end-position" : 720,
    "concept-id" : "zgfW_Kmq_yct",
    "matched-string" : "kärnborrare",
    "annotation-id" : 6
  }, {
    "preferred-label" : "Kärnborrning",
    "sentiment" : "MUST_HAVE",
    "type" : "skill",
    "start-position" : 778,
    "end-position" : 790,
    "concept-id" : "1tS5_88V_RcA",
    "matched-string" : "kärnborrning",
    "annotation-id" : 7
  }, {
    "preferred-label" : "Diamantborrning",
    "sentiment" : "MUST_HAVE",
    "type" : "skill",
    "start-position" : 797,
    "end-position" : 812,
    "concept-id" : "CXCw_BKy_5SE",
    "matched-string" : "diamantborrning",
    "annotation-id" : 8
  }, {
    "preferred-label" : "Borrtekniker",
    "type" : "occupation-name",
    "start-position" : 843,
    "end-position" : 853,
    "concept-id" : "usVe_MdP_oJA",
    "matched-string" : "borrteknik",
    "annotation-id" : 19
  }, {
    "preferred-label" : "Sverige",
    "type" : "country",
    "start-position" : 1749,
    "end-position" : 1756,
    "concept-id" : "i46j_HmG_v64",
    "matched-string" : "Sverige",
    "annotation-id" : 20
  }, {
    "preferred-label" : "Kärnborrning",
    "sentiment" : "MUST_HAVE",
    "type" : "skill",
    "start-position" : 1854,
    "end-position" : 1866,
    "concept-id" : "1tS5_88V_RcA",
    "matched-string" : "kärnborrning",
    "annotation-id" : 9
  }, {
    "preferred-label" : "Maskinförare",
    "sentiment" : "MUST_HAVE",
    "type" : "ssyk-level-3",
    "start-position" : 1939,
    "end-position" : 1951,
    "concept-id" : "UbR1_PxX_ntU",
    "matched-string" : "maskinförare",
    "annotation-id" : 10
  }, {
    "preferred-label" : "Borrning, konventionell maskin",
    "type" : "skill",
    "start-position" : 2097,
    "end-position" : 2105,
    "concept-id" : "ZuMC_5GQ_9jw",
    "matched-string" : "borrning",
    "annotation-id" : 21
  }, {
    "preferred-label" : "noggrannhet",
    "type" : "esco-skill",
    "start-position" : 2125,
    "end-position" : 2133,
    "concept-id" : "mrsW_EkL_KRD",
    "matched-string" : "noggrann",
    "annotation-id" : 22
  }, {
    "preferred-label" : "arbeta självständigt",
    "type" : "esco-skill",
    "start-position" : 2219,
    "end-position" : 2239,
    "concept-id" : "NyFu_HHd_zhz",
    "matched-string" : "arbeta självständigt",
    "annotation-id" : 23
  }, {
    "preferred-label" : "B",
    "type" : "driving-licence",
    "start-position" : 2269,
    "end-position" : 2278,
    "concept-id" : "VTK8_WRx_GcM",
    "matched-string" : "Körkort B",
    "annotation-id" : 24
  } ],
  "text" : "Vi söker nu kärnborrare/diamantborrare\nOm företaget\nProtek Norr AB utför kärnborrning för kunder i framför allt gruv- och prospekteringsindustrin. Mer än tjugofem års erfarenhet av kärnborrning, en extremt bred maskinpark och kompetent personal gör Protek till en komplett entreprenör för stora och små projekt oavsett mark- och bergförhållanden. Protek är välkända i branschen och betraktas som en trygg och pålitlig samarbetspartner.\nDet är stor aktivitet i vår region just nu. Därför söker vi nu ett antal maskinoperatörer till våra borriggar. Du kommer  få ett intressant och spännande jobb med givande sociala kontakter i ett väl inarbetat företag baserat på goda värderingar!\nVill du bli en av våra nya kärnborrare ska du läsa vidare i denna annons.\n\nDina arbetsuppgifter\nKärnborrning eller diamantborrning, som det ibland kallas, är en borrteknik som i huvudsak används vid prospektering i befintliga gruvor men även där helt nya fyndigheter ska undersökas. Arbetsuppgifterna består i huvudsak av att producera borrkärnor som sedan skickas på analys. Den största delen arbetstiden är förlagd under jord. Därför är det meriterande ifall du har vana vid att arbeta under jord. \nI dina arbetsuppgifter ingår även service och underhåll av utrustningen samt viss reparation. Du får mycket stor frihet under ansvar i jobbet. Anställningen inleds med en introduktionsperiod som vanligtvis genomförs på den arbetsplats där du sedan kommer att bli placerad under din första tid på Protek. Arbetet bedrivs vanligtvis under sju dagar, med för- och eftermiddagsskift, och sedan 7 dagars ledighet. Det innebär att du är borta från hemmet i sju dagar. Traktamente utgår och Protek ordnar boende. Arbetsområdet är i huvudsak Norr- och Västerbotten men hela Sverige är ditt arbetsfält.\n\nDin bakgrund/Dina egenskaper\nDu behöver inte nödvändigtvis ha erfarenhet av kärnborrning men det är självklart meriterande. Lämplig bakgrund kan vara exempelvis maskinförare, mekaniker men även erfarenhet från arbete i gruva eller service/underhållsarbete kan vara lämplig bakgrund. Du bör ha en ansvarskänsla för både borrning och maskiner, vara noggrann och kunna ta ett personligt ansvar för kvalité och prestation. Du ska ha förmåga att arbeta självständigt men även tillsammans i team. Körkort B är ett krav. Du blir anställd i hemmet och erhåller reseersättning och restidsersättning för resor till och från arbetet.\n\nInformation och kontakt\nI denna rekrytering samarbetar vi med Wikan Personal AB. Ytterligare upplysningar kring tjänsten, vänligen kontakta Kenneth Vidmark, Wikan Personal AB. Ansöker gör du på www.skelleftea.wikan.se\n0910-77 09 81.\nAnsökan \nVi arbetar löpande med inkomna ansökningar. Tjänsterna kan komma att tillsättas innan sista ansökningsdag. Vi arbetar aktivt för en jämställd arbetsplats och välkomnar både kvinnliga och manliga sökande. Annonsen ligger uppe hela året då vi söker ett flertal personer. Urval sker löpande.\nAnställningsform\nProvanställning som övergår till tillsvidareanställning.\n\nOm Wikan Personal\nWikan Personal är ett auktoriserat och etablerat bemannings- och rekryteringsföretag. Med lokal förankring vill vi hjälpa företag och organisationer med kompetent och välmotiverad personal. Wikan har kontor på 15 orter i Sverige, omsätter ca 380 Msek och har omkring 800 anställda. Läs mer på www.wikan.se"
}