{
  "meta" : {
    "jobad" : {
      "description" : {
        "requirements" : null,
        "needs" : null,
        "company_information" : null,
        "text_formatted" : "Ömangruppen drivs av ett starkt miljöengagemang och vet att små åtgärder kan ha stor effekt för att spara energi. Företaget är en komplett leverantör av kvalitativa lösningar, tjänster och koncept som förbättrar byggnaders inomhusklimat. Koncernen Ömangruppen verkar inom områdena energi, miljö och projekt. Ömangruppen är ett värderingsstyrt och ägarlett bolag med 150 medarbetare fördelat på ett 20-tal orter i södra Sverige.\r\n\r\nÄr du en erfaren servicetekniker inom ventilation som är nyfiken på något nytt? Det här är en tjänst för dig som vill du använda och utveckla dina kunskaper inom service, underhåll och felsökning och samtidigt ha ett givande och roligt jobb! Ta chansen att bli en del av vårt team med engagerade och kunniga medarbetare i Skåne.\n\nArbetsbeskrivning: Som OVK-servicetekniker kommer du främst att utföra arbeten hos våra serviceavtalskunder. Våra kunder är både stora och små fastighetsägare, industrier, kommuner och kommersiella fastigheter. Du arbetar självständigt och är engagerad i arbetet där resultatet ute hos våra kunder leder till väl underhållna anläggningar med sänkta energi- och driftkostnader.\n\nDin roll:\n\n- arbeta med besiktning och inspektion av ventilationssystem\n- genomföra felsökningar\n- utföra enklare injusteringar\n- medverka vid planering av förebyggande underhållsarbete\n- uppföljning och återrapportering\n- skapa goda kundkontakter\n- självständigt arbeta och utföra ditt arbete\n- skapa och bibehålla goda kundkontakter\n\nArbetets omfattning: Heltid. Arbetstider vardagar, 07.00 - 16.00. Start enligt överenskommelse. Tjänsten utgår från Malmö men du kommer att arbeta över hela regionen.\n\nVi kan erbjuda dig: Ett spännande, stimulerande och utmanande jobb i en grupp av engagerade och drivna medarbetare. Vi värnar om våra anställdas utveckling och satsar på både interna och externa utbildningar för våra medarbetare. Vi har korta beslutsvägar och du har möjlighet att kunna påverka din vardag. Som anställd hos oss kan du räkna med tryggheter som kollektivavtal, utvecklingsmöjligheter, friskvård och företagshälsovård.\n\nKompetenskrav: Vi söker dig som har minst tre års erfarenhet som OVK-tekniker samt ett brinnande intresse och ett stort driv, som har god teknisk kunskap och erfarenhet från arbete inom ventilationsbranschen. Ett plus om du har kunskaper inom kyla och styr & regler, men det är inget krav. Även utbildning och erfarenhet från VVS-, kyl-, energi- och/eller miljöteknik är meriterande, men inte ett krav.\n\nOVB-behörighet är ett krav.\n\nB-körkort är ett krav.\n\nPersonliga egenskaper: För att lyckas i rollen som servicetekniker vill vi att du är ansvarstagande, ödmjuk, serviceinriktad som person. Du är lyhörd för våra kunders behov och har en förmåga att bygga förtroende hos dem. Du är nyfiken och uppdaterad inom ny teknik och är en kreativ problemlösare. Som person är du målmedveten, strukturerad och självgående och gillar utmaningar. Du drivs av att överträffa kundens förväntningar.\n\nAnsökan\nHar du frågor angående tjänsten är du välkommen att kontakta regionchef Patrik Syde på telefonnummer 0701 90 10 04.\n\nSista ansökningsdag 2022-08-19.\n\nVill du veta mer om hur det är att jobba på Ömangruppen? \nSe våra korta intervjuer där olika medarbetare berättar om hur deras arbetsdagar ser ut och varför de trivs på jobbet. \n\nAlla former för telefonsamtal som inte berör frågor om tjänsten, t ex från rekryterings-/bemanningsföretag/annonssäljare undanbedes.",
        "conditions" : "-\r\n-",
        "text" : "Ömangruppen drivs av ett starkt miljöengagemang och vet att små åtgärder kan ha stor effekt för att spara energi. Företaget är en komplett leverantör av kvalitativa lösningar, tjänster och koncept som förbättrar byggnaders inomhusklimat. Koncernen Ömangruppen verkar inom områdena energi, miljö och projekt. Ömangruppen är ett värderingsstyrt och ägarlett bolag med 150 medarbetare fördelat på ett 20-tal orter i södra Sverige.\r\n\r\nÄr du en erfaren servicetekniker inom ventilation som är nyfiken på något nytt? Det här är en tjänst för dig som vill du använda och utveckla dina kunskaper inom service, underhåll och felsökning och samtidigt ha ett givande och roligt jobb! Ta chansen att bli en del av vårt team med engagerade och kunniga medarbetare i Skåne.\n\nArbetsbeskrivning: Som OVK-servicetekniker kommer du främst att utföra arbeten hos våra serviceavtalskunder. Våra kunder är både stora och små fastighetsägare, industrier, kommuner och kommersiella fastigheter. Du arbetar självständigt och är engagerad i arbetet där resultatet ute hos våra kunder leder till väl underhållna anläggningar med sänkta energi- och driftkostnader.\n\nDin roll:\n\n- arbeta med besiktning och inspektion av ventilationssystem\n- genomföra felsökningar\n- utföra enklare injusteringar\n- medverka vid planering av förebyggande underhållsarbete\n- uppföljning och återrapportering\n- skapa goda kundkontakter\n- självständigt arbeta och utföra ditt arbete\n- skapa och bibehålla goda kundkontakter\n\nArbetets omfattning: Heltid. Arbetstider vardagar, 07.00 - 16.00. Start enligt överenskommelse. Tjänsten utgår från Malmö men du kommer att arbeta över hela regionen.\n\nVi kan erbjuda dig: Ett spännande, stimulerande och utmanande jobb i en grupp av engagerade och drivna medarbetare. Vi värnar om våra anställdas utveckling och satsar på både interna och externa utbildningar för våra medarbetare. Vi har korta beslutsvägar och du har möjlighet att kunna påverka din vardag. Som anställd hos oss kan du räkna med tryggheter som kollektivavtal, utvecklingsmöjligheter, friskvård och företagshälsovård.\n\nKompetenskrav: Vi söker dig som har minst tre års erfarenhet som OVK-tekniker samt ett brinnande intresse och ett stort driv, som har god teknisk kunskap och erfarenhet från arbete inom ventilationsbranschen. Ett plus om du har kunskaper inom kyla och styr & regler, men det är inget krav. Även utbildning och erfarenhet från VVS-, kyl-, energi- och/eller miljöteknik är meriterande, men inte ett krav.\n\nOVB-behörighet är ett krav.\n\nB-körkort är ett krav.\n\nPersonliga egenskaper: För att lyckas i rollen som servicetekniker vill vi att du är ansvarstagande, ödmjuk, serviceinriktad som person. Du är lyhörd för våra kunders behov och har en förmåga att bygga förtroende hos dem. Du är nyfiken och uppdaterad inom ny teknik och är en kreativ problemlösare. Som person är du målmedveten, strukturerad och självgående och gillar utmaningar. Du drivs av att överträffa kundens förväntningar.\n\nAnsökan\nHar du frågor angående tjänsten är du välkommen att kontakta regionchef Patrik Syde på telefonnummer 0701 90 10 04.\n\nSista ansökningsdag 2022-08-19.\n\nVill du veta mer om hur det är att jobba på Ömangruppen? \nSe våra korta intervjuer där olika medarbetare berättar om hur deras arbetsdagar ser ut och varför de trivs på jobbet. \n\nAlla former för telefonsamtal som inte berör frågor om tjänsten, t ex från rekryterings-/bemanningsföretag/annonssäljare undanbedes."
      },
      "headline" : "OVK-servicetekniker till Ömangruppen i Skåne",
      "driving_license" : [ {
        "concept_id" : "VTK8_WRx_GcM",
        "label" : "B",
        "legacy_ams_taxonomy_id" : "3"
      } ],
      "employer" : {
        "email" : null,
        "phone_number" : null,
        "organization_number" : "5564183522",
        "name" : "Ömangruppen Svenska AB",
        "url" : null,
        "workplace" : "Ömangruppen"
      },
      "removed_date" : null,
      "logo_url" : "https://www.arbetsformedlingen.se/rest/arbetsgivare/rest/af/v3/organisation/5564183522/logotyper/logo.png",
      "last_publication_date" : "2022-08-19T23:59:59",
      "number_of_vacancies" : 1,
      "occupation" : {
        "concept_id" : "TEWT_q89_rcn",
        "label" : "Ventilationsmontör",
        "legacy_ams_taxonomy_id" : "7190"
      },
      "occupation_group" : {
        "concept_id" : "fLKb_bJ3_69p",
        "label" : "VVS-montörer m.fl.",
        "legacy_ams_taxonomy_id" : "7125"
      },
      "employment_type" : {
        "concept_id" : "PFZr_Syz_cUq",
        "label" : "Vanlig anställning",
        "legacy_ams_taxonomy_id" : "1"
      },
      "webpage_url" : "https://arbetsformedlingen.se/platsbanken/annonser/26340212",
      "driving_license_required" : true,
      "application_contacts" : [ ],
      "duration" : {
        "concept_id" : "a7uU_j21_mkL",
        "label" : "Tills vidare",
        "legacy_ams_taxonomy_id" : "1"
      },
      "nice_to_have" : {
        "education_level" : [ ],
        "work_experiences" : [ ],
        "skills" : [ ],
        "education" : [ ],
        "languages" : [ ]
      },
      "application_details" : {
        "via_af" : false,
        "email" : null,
        "other" : null,
        "reference" : null,
        "url" : "https://omangruppen.com/lediga-jobb?jobid=210742&ref=platsbanken",
        "information" : null
      },
      "source_type" : "VIA_PLATSBANKEN_DXA",
      "application_deadline" : "2022-08-19T23:59:59",
      "external_id" : "46-556418-3522-wb-210742",
      "workplace_address" : {
        "coordinates" : [ 13.003822, 55.60498 ],
        "city" : null,
        "postcode" : null,
        "municipality" : "Malmö",
        "region_concept_id" : "CaRE_1nn_cSU",
        "region" : "Skåne län",
        "country_code" : "199",
        "region_code" : "12",
        "municipality_concept_id" : "oYPt_yRA_Smm",
        "country_concept_id" : "i46j_HmG_v64",
        "municipality_code" : "1280",
        "street_address" : null,
        "country" : "Sverige"
      },
      "id" : "26340212",
      "experience_required" : true,
      "working_hours_type" : {
        "concept_id" : "6YE1_gAC_R2G",
        "label" : "Heltid",
        "legacy_ams_taxonomy_id" : "1"
      },
      "access" : null,
      "timestamp" : 1658245523626,
      "must_have" : {
        "education_level" : [ ],
        "work_experiences" : [ {
          "concept_id" : "TEWT_q89_rcn",
          "weight" : 10,
          "label" : "Ventilationsmontör",
          "legacy_ams_taxonomy_id" : "7190"
        } ],
        "skills" : [ ],
        "education" : [ ],
        "languages" : [ ]
      },
      "occupation_field" : {
        "concept_id" : "j7Cq_ZJe_GkT",
        "label" : "Bygg och anläggning",
        "legacy_ams_taxonomy_id" : "2"
      },
      "scope_of_work" : {
        "min" : 100,
        "max" : 100
      },
      "salary_type" : {
        "concept_id" : "oG8G_9cW_nRf",
        "label" : "Fast månads- vecko- eller timlön",
        "legacy_ams_taxonomy_id" : "1"
      },
      "removed" : false,
      "salary_description" : "Enligt överenskommelse",
      "access_to_own_car" : false,
      "publication_date" : "2022-07-19T17:45:23"
    },
    "name" : "OVK-servicetekniker till Ömangruppen i Skåne",
    "user" : "hannes"
  },
  "sha1" : "138a41cd1cb1f8de994bae358c181c57497b8c3a",
  "annotations" : [ {
    "preferred-label" : "Besiktningsbehörighet för ventilation/OVK",
    "sentiment" : "MUST_HAVE",
    "type" : "skill",
    "start-position" : 0,
    "end-position" : 3,
    "concept-id" : "CzZc_7tx_B9C",
    "matched-string" : "ovk",
    "annotation-id" : 0
  }, {
    "preferred-label" : "servicetekniker",
    "type" : "esco-occupation",
    "start-position" : 4,
    "end-position" : 19,
    "concept-id" : "8ow6_pyZ_6zC",
    "matched-string" : "servicetekniker",
    "annotation-id" : 8
  }, {
    "preferred-label" : "Skåne län",
    "type" : "region",
    "start-position" : 39,
    "end-position" : 44,
    "concept-id" : "CaRE_1nn_cSU",
    "matched-string" : "Skåne",
    "annotation-id" : 9
  }, {
    "preferred-label" : "Sverige",
    "type" : "country",
    "start-position" : 464,
    "end-position" : 471,
    "concept-id" : "i46j_HmG_v64",
    "matched-string" : "Sverige",
    "annotation-id" : 10
  }, {
    "preferred-label" : "servicetekniker",
    "type" : "esco-occupation",
    "start-position" : 493,
    "end-position" : 508,
    "concept-id" : "8ow6_pyZ_6zC",
    "matched-string" : "servicetekniker",
    "annotation-id" : 11
  }, {
    "preferred-label" : "visa nyfikenhet",
    "type" : "esco-skill",
    "start-position" : 533,
    "end-position" : 540,
    "concept-id" : "mbHa_NFf_vyf",
    "matched-string" : "nyfiken",
    "annotation-id" : 12
  }, {
    "preferred-label" : "Skåne län",
    "type" : "region",
    "start-position" : 798,
    "end-position" : 803,
    "concept-id" : "CaRE_1nn_cSU",
    "matched-string" : "Skåne",
    "annotation-id" : 13
  }, {
    "preferred-label" : "Besiktningsbehörighet för ventilation/OVK",
    "sentiment" : "MUST_HAVE",
    "type" : "skill",
    "start-position" : 829,
    "end-position" : 832,
    "concept-id" : "CzZc_7tx_B9C",
    "matched-string" : "ovk",
    "annotation-id" : 1
  }, {
    "preferred-label" : "servicetekniker",
    "type" : "esco-occupation",
    "start-position" : 833,
    "end-position" : 848,
    "concept-id" : "8ow6_pyZ_6zC",
    "matched-string" : "servicetekniker",
    "annotation-id" : 14
  }, {
    "preferred-label" : "arbeta självständigt",
    "type" : "esco-skill",
    "start-position" : 1020,
    "end-position" : 1041,
    "concept-id" : "NyFu_HHd_zhz",
    "matched-string" : "arbetar självständigt",
    "annotation-id" : 15
  }, {
    "preferred-label" : "ventilationssystem",
    "type" : "esco-skill",
    "start-position" : 1237,
    "end-position" : 1255,
    "concept-id" : "Qq5R_zYK_Lxk",
    "matched-string" : "ventilationssystem",
    "annotation-id" : 16
  }, {
    "preferred-label" : "göra felsökning",
    "type" : "esco-skill",
    "start-position" : 1258,
    "end-position" : 1280,
    "concept-id" : "HqC8_fVY_ACM",
    "matched-string" : "genomföra felsökningar",
    "annotation-id" : 17
  }, {
    "preferred-label" : "arbeta självständigt",
    "type" : "esco-skill",
    "start-position" : 1434,
    "end-position" : 1454,
    "concept-id" : "NyFu_HHd_zhz",
    "matched-string" : "självständigt arbeta",
    "annotation-id" : 18
  }, {
    "preferred-label" : "Heltid",
    "type" : "worktime-extent",
    "start-position" : 1541,
    "end-position" : 1547,
    "concept-id" : "6YE1_gAC_R2G",
    "matched-string" : "Heltid",
    "annotation-id" : 19
  }, {
    "preferred-label" : "Malmö",
    "type" : "municipality",
    "start-position" : 1636,
    "end-position" : 1641,
    "concept-id" : "oYPt_yRA_Smm",
    "matched-string" : "Malmö",
    "annotation-id" : 20
  }, {
    "preferred-label" : "Kollektivavtal",
    "sentiment" : "MUST_HAVE",
    "type" : "skill",
    "start-position" : 2048,
    "end-position" : 2062,
    "concept-id" : "z7wE_9xb_3jX",
    "matched-string" : "kollektivavtal",
    "annotation-id" : 2
  }, {
    "preferred-label" : "Friskvård",
    "sentiment" : "MUST_HAVE",
    "type" : "keyword",
    "start-position" : 2088,
    "end-position" : 2097,
    "concept-id" : "yoHe_xjK_qjH",
    "matched-string" : "friskvård",
    "annotation-id" : 3
  }, {
    "preferred-label" : "Företagshälsovård",
    "sentiment" : "MUST_HAVE",
    "type" : "skill",
    "start-position" : 2102,
    "end-position" : 2119,
    "concept-id" : "ULfW_rVS_Vpr",
    "matched-string" : "företagshälsovård",
    "annotation-id" : 4
  }, {
    "preferred-label" : "Besiktningsbehörighet för ventilation/OVK",
    "sentiment" : "MUST_HAVE",
    "type" : "skill",
    "start-position" : 2187,
    "end-position" : 2190,
    "concept-id" : "CzZc_7tx_B9C",
    "matched-string" : "ovk",
    "annotation-id" : 5
  }, {
    "preferred-label" : "energi",
    "type" : "esco-skill",
    "start-position" : 2460,
    "end-position" : 2466,
    "concept-id" : "cNSw_KWL_Jbv",
    "matched-string" : "energi",
    "annotation-id" : 21
  }, {
    "preferred-label" : "Miljöteknik",
    "sentiment" : "MUST_HAVE",
    "type" : "skill",
    "start-position" : 2478,
    "end-position" : 2489,
    "concept-id" : "S4Ku_uT7_yuV",
    "matched-string" : "miljöteknik",
    "annotation-id" : 6
  }, {
    "preferred-label" : "B",
    "type" : "driving-licence",
    "start-position" : 2555,
    "end-position" : 2564,
    "concept-id" : "VTK8_WRx_GcM",
    "matched-string" : "B-körkort",
    "annotation-id" : 22
  }, {
    "preferred-label" : "visa ansvarstagande",
    "type" : "esco-skill",
    "start-position" : 2664,
    "end-position" : 2678,
    "concept-id" : "bcRp_hxV_f5G",
    "matched-string" : "ansvarstagande",
    "annotation-id" : 23
  } ],
  "text" : "OVK-servicetekniker till Ömangruppen i Skåne\nÖmangruppen drivs av ett starkt miljöengagemang och vet att små åtgärder kan ha stor effekt för att spara energi. Företaget är en komplett leverantör av kvalitativa lösningar, tjänster och koncept som förbättrar byggnaders inomhusklimat. Koncernen Ömangruppen verkar inom områdena energi, miljö och projekt. Ömangruppen är ett värderingsstyrt och ägarlett bolag med 150 medarbetare fördelat på ett 20-tal orter i södra Sverige.\r\n\r\nÄr du en erfaren servicetekniker inom ventilation som är nyfiken på något nytt? Det här är en tjänst för dig som vill du använda och utveckla dina kunskaper inom service, underhåll och felsökning och samtidigt ha ett givande och roligt jobb! Ta chansen att bli en del av vårt team med engagerade och kunniga medarbetare i Skåne.\n\nArbetsbeskrivning: Som OVK-servicetekniker kommer du främst att utföra arbeten hos våra serviceavtalskunder. Våra kunder är både stora och små fastighetsägare, industrier, kommuner och kommersiella fastigheter. Du arbetar självständigt och är engagerad i arbetet där resultatet ute hos våra kunder leder till väl underhållna anläggningar med sänkta energi- och driftkostnader.\n\nDin roll:\n\n- arbeta med besiktning och inspektion av ventilationssystem\n- genomföra felsökningar\n- utföra enklare injusteringar\n- medverka vid planering av förebyggande underhållsarbete\n- uppföljning och återrapportering\n- skapa goda kundkontakter\n- självständigt arbeta och utföra ditt arbete\n- skapa och bibehålla goda kundkontakter\n\nArbetets omfattning: Heltid. Arbetstider vardagar, 07.00 - 16.00. Start enligt överenskommelse. Tjänsten utgår från Malmö men du kommer att arbeta över hela regionen.\n\nVi kan erbjuda dig: Ett spännande, stimulerande och utmanande jobb i en grupp av engagerade och drivna medarbetare. Vi värnar om våra anställdas utveckling och satsar på både interna och externa utbildningar för våra medarbetare. Vi har korta beslutsvägar och du har möjlighet att kunna påverka din vardag. Som anställd hos oss kan du räkna med tryggheter som kollektivavtal, utvecklingsmöjligheter, friskvård och företagshälsovård.\n\nKompetenskrav: Vi söker dig som har minst tre års erfarenhet som OVK-tekniker samt ett brinnande intresse och ett stort driv, som har god teknisk kunskap och erfarenhet från arbete inom ventilationsbranschen. Ett plus om du har kunskaper inom kyla och styr & regler, men det är inget krav. Även utbildning och erfarenhet från VVS-, kyl-, energi- och/eller miljöteknik är meriterande, men inte ett krav.\n\nOVB-behörighet är ett krav.\n\nB-körkort är ett krav.\n\nPersonliga egenskaper: För att lyckas i rollen som servicetekniker vill vi att du är ansvarstagande, ödmjuk, serviceinriktad som person. Du är lyhörd för våra kunders behov och har en förmåga att bygga förtroende hos dem. Du är nyfiken och uppdaterad inom ny teknik och är en kreativ problemlösare. Som person är du målmedveten, strukturerad och självgående och gillar utmaningar. Du drivs av att överträffa kundens förväntningar.\n\nAnsökan\nHar du frågor angående tjänsten är du välkommen att kontakta regionchef Patrik Syde på telefonnummer 0701 90 10 04.\n\nSista ansökningsdag 2022-08-19.\n\nVill du veta mer om hur det är att jobba på Ömangruppen? \nSe våra korta intervjuer där olika medarbetare berättar om hur deras arbetsdagar ser ut och varför de trivs på jobbet. \n\nAlla former för telefonsamtal som inte berör frågor om tjänsten, t ex från rekryterings-/bemanningsföretag/annonssäljare undanbedes."
}