{
  "meta" : {
    "jobad" : {
      "description" : {
        "requirements" : null,
        "needs" : null,
        "company_information" : null,
        "text_formatted" : "<p>Salongen med sina snart 14 år har ett väl upparbetat kundunderlag och gott rykte. Vårt lilla team, förutom massör,  består av hudterapeut, undersköterska samt ägare. Vi trivs fint ihop, hjälps åt och har en härlig stämning.  Så stor vikt läggs på social kompetens.</p><p>Vi har som krav att man är diplomerad massageterapeut med minst några års erfarenhet. God vana i såväl teknik som bemötande av kunden. Positiv, ärlig och lyhörd.</p><p>Lön och försäkringar enligt avtal och överenskommelse.</p><p>Timanställning 50-60%</p><p><br></p><p> </p><p id=\"oppenforalla\">Öppen för alla\nVi fokuserar på din kompetens, inte dina övriga förutsättningar. Vi är öppna för att anpassa rollen eller arbetsplatsen efter dina behov.</p>",
        "conditions" : null,
        "text" : "Salongen med sina snart 14 år har ett väl upparbetat kundunderlag och gott rykte. Vårt lilla team, förutom massör,  består av hudterapeut, undersköterska samt ägare. Vi trivs fint ihop, hjälps åt och har en härlig stämning.  Så stor vikt läggs på social kompetens.\nVi har som krav att man är diplomerad massageterapeut med minst några års erfarenhet. God vana i såväl teknik som bemötande av kunden. Positiv, ärlig och lyhörd.\nLön och försäkringar enligt avtal och överenskommelse.\nTimanställning 50-60%\n\n\n \nÖppen för alla\nVi fokuserar på din kompetens, inte dina övriga förutsättningar. Vi är öppna för att anpassa rollen eller arbetsplatsen efter dina behov."
      },
      "headline" : "Relaxx Floating söker Massageterapeut ",
      "driving_license" : null,
      "employer" : {
        "email" : null,
        "phone_number" : null,
        "organization_number" : "5567653448",
        "name" : "Relaxx Floating Vänersborg AB",
        "url" : "www.relaxxfloating.se",
        "workplace" : "RELAXX FLOATING VÄNERSBORG AB"
      },
      "removed_date" : null,
      "logo_url" : "https://www.arbetsformedlingen.se/rest/arbetsgivare/rest/af/v3/arbetsplatser/83014098/logotyper/logo.png",
      "last_publication_date" : "2022-09-01T00:00:00",
      "number_of_vacancies" : 1,
      "occupation" : {
        "concept_id" : "mC28_vEv_AVx",
        "label" : "Massör/Massageterapeut",
        "legacy_ams_taxonomy_id" : "6308"
      },
      "occupation_group" : {
        "concept_id" : "uxHV_KXc_PKD",
        "label" : "Massörer och massageterapeuter",
        "legacy_ams_taxonomy_id" : "5143"
      },
      "employment_type" : {
        "concept_id" : "PFZr_Syz_cUq",
        "label" : "Vanlig anställning",
        "legacy_ams_taxonomy_id" : "1"
      },
      "webpage_url" : "https://arbetsformedlingen.se/platsbanken/annonser/26372955",
      "driving_license_required" : false,
      "application_contacts" : [ ],
      "duration" : {
        "concept_id" : "a7uU_j21_mkL",
        "label" : "Tills vidare",
        "legacy_ams_taxonomy_id" : "1"
      },
      "nice_to_have" : {
        "education_level" : [ ],
        "work_experiences" : [ ],
        "skills" : [ {
          "concept_id" : "WNdB_GYA_x1T",
          "weight" : 5,
          "label" : "Thaimassage",
          "legacy_ams_taxonomy_id" : "608880"
        }, {
          "concept_id" : "3M7W_Tgq_hRm",
          "weight" : 5,
          "label" : "Taktil stimulering",
          "legacy_ams_taxonomy_id" : "608863"
        } ],
        "education" : [ ],
        "languages" : [ {
          "concept_id" : "NVxJ_hLg_TYS",
          "weight" : 5,
          "label" : "Engelska",
          "legacy_ams_taxonomy_id" : "283"
        } ]
      },
      "application_details" : {
        "via_af" : false,
        "email" : "info@relaxxfloating.se",
        "other" : null,
        "reference" : null,
        "url" : null,
        "information" : null
      },
      "source_type" : "VIA_ANNONSERA",
      "application_deadline" : "2022-09-01T00:00:00",
      "external_id" : null,
      "workplace_address" : {
        "coordinates" : [ 12.317699292613431, 58.359659630826926 ],
        "city" : "VÄNERSBORG",
        "postcode" : "46240",
        "municipality" : "Vänersborg",
        "region_concept_id" : "zdoY_6u5_Krt",
        "region" : "Västra Götalands län",
        "country_code" : "199",
        "region_code" : "14",
        "municipality_concept_id" : "THif_q6H_MjG",
        "country_concept_id" : "i46j_HmG_v64",
        "municipality_code" : "1487",
        "street_address" : "NABBENSBERGSVÄG 2",
        "country" : "Sverige"
      },
      "id" : "26372955",
      "experience_required" : true,
      "working_hours_type" : {
        "concept_id" : "947z_JGS_Uk2",
        "label" : "Deltid",
        "legacy_ams_taxonomy_id" : "2"
      },
      "access" : null,
      "timestamp" : 1659469265291,
      "must_have" : {
        "education_level" : [ ],
        "work_experiences" : [ {
          "concept_id" : "mC28_vEv_AVx",
          "weight" : 10,
          "label" : "Massör/Massageterapeut",
          "legacy_ams_taxonomy_id" : "6308"
        } ],
        "skills" : [ {
          "concept_id" : "YAZS_em1_CWM",
          "weight" : 10,
          "label" : "Diplomerad massageterapeut",
          "legacy_ams_taxonomy_id" : "606028"
        }, {
          "concept_id" : "Gstq_4UH_9na",
          "weight" : 10,
          "label" : "Klassisk massage",
          "legacy_ams_taxonomy_id" : "608819"
        } ],
        "education" : [ ],
        "languages" : [ {
          "concept_id" : "zSLA_vw2_FXN",
          "weight" : 10,
          "label" : "Svenska",
          "legacy_ams_taxonomy_id" : "502"
        } ]
      },
      "occupation_field" : {
        "concept_id" : "Uuf1_GMh_Uvw",
        "label" : "Kropps- och skönhetsvård",
        "legacy_ams_taxonomy_id" : "4"
      },
      "scope_of_work" : {
        "min" : 0,
        "max" : 100
      },
      "salary_type" : {
        "concept_id" : "oG8G_9cW_nRf",
        "label" : "Fast månads- vecko- eller timlön",
        "legacy_ams_taxonomy_id" : "1"
      },
      "removed" : false,
      "salary_description" : null,
      "access_to_own_car" : false,
      "publication_date" : "2022-08-02T21:41:05"
    },
    "name" : "Relaxx Floating söker Massageterapeut ",
    "user" : "kristof.fischer"
  },
  "sha1" : "979f0fc137b88d734a64584753913d2d8540f212",
  "annotations" : [ {
    "preferred-label" : "Massör/Massageterapeut",
    "sentiment" : "MUST_HAVE",
    "type" : "occupation-name",
    "start-position" : 22,
    "end-position" : 37,
    "concept-id" : "mC28_vEv_AVx",
    "matched-string" : "massageterapeut",
    "annotation-id" : 0
  }, {
    "preferred-label" : "Massör/Massageterapeut",
    "sentiment" : "MUST_HAVE",
    "type" : "occupation-name",
    "start-position" : 146,
    "end-position" : 152,
    "concept-id" : "mC28_vEv_AVx",
    "matched-string" : "massör",
    "annotation-id" : 1
  }, {
    "preferred-label" : "Hudterapeut",
    "sentiment" : "MUST_HAVE",
    "type" : "occupation-name",
    "start-position" : 165,
    "end-position" : 176,
    "concept-id" : "zqBJ_sRm_m5Z",
    "matched-string" : "hudterapeut",
    "annotation-id" : 2
  }, {
    "preferred-label" : "Undersköterskor",
    "type" : "ssyk-level-3",
    "start-position" : 178,
    "end-position" : 192,
    "concept-id" : "3EJj_WLs_kgD",
    "matched-string" : "undersköterska",
    "annotation-id" : 5
  }, {
    "preferred-label" : "Massör/Massageterapeut",
    "sentiment" : "MUST_HAVE",
    "type" : "occupation-name",
    "start-position" : 342,
    "end-position" : 357,
    "concept-id" : "mC28_vEv_AVx",
    "matched-string" : "massageterapeut",
    "annotation-id" : 3
  }, {
    "preferred-label" : "1-2 års erfarenhet",
    "sentiment" : "MUST_HAVE",
    "type" : "occupation-experience-year",
    "start-position" : 368,
    "end-position" : 388,
    "concept-id" : "LLnd_5GJ_4ju",
    "matched-string" : "några års erfarenhet",
    "annotation-id" : 6
  }, {
    "preferred-label" : "Deltid",
    "type" : "worktime-extent",
    "start-position" : 536,
    "end-position" : 542,
    "concept-id" : "947z_JGS_Uk2",
    "matched-string" : "50-60%",
    "annotation-id" : 7
  } ],
  "text" : "Relaxx Floating söker Massageterapeut \nSalongen med sina snart 14 år har ett väl upparbetat kundunderlag och gott rykte. Vårt lilla team, förutom massör,  består av hudterapeut, undersköterska samt ägare. Vi trivs fint ihop, hjälps åt och har en härlig stämning.  Så stor vikt läggs på social kompetens.\nVi har som krav att man är diplomerad massageterapeut med minst några års erfarenhet. God vana i såväl teknik som bemötande av kunden. Positiv, ärlig och lyhörd.\nLön och försäkringar enligt avtal och överenskommelse.\nTimanställning 50-60%\n\n\n \nÖppen för alla\nVi fokuserar på din kompetens, inte dina övriga förutsättningar. Vi är öppna för att anpassa rollen eller arbetsplatsen efter dina behov."
}