{
  "meta" : {
    "jobad" : {
      "description" : {
        "requirements" : null,
        "needs" : null,
        "company_information" : null,
        "text_formatted" : "Har du ett stort intresse för mat och vill jobba för ett förmånligt företag under  sommaren 2022? Som processoperatör för Lantmännen Cerealia agerar du nyckelperson i produktionsflödet av några av Sveriges mest folkkära och omtyckta spannmålsprodukter. SÖK NU och var med mitt i processen från jord till bord!\n\nOM TJÄNSTEN \nLantmännen Cerealia ingår i Lantmännen, ett lantbrukskooperativ som ägs av 19 000 svenska lantbrukare, med verksamheter i hela värdekedjan från jord till bord. På Lantmännen Cerealia utvecklar, producerar och marknadsförs ett stort sortiment av hälsosamma och näringsrika produkter med basen i Nordiska spannmål. Med klassiska varumärken som Kungsörnen, AXA och START! har de några av Sveriges mest folkkära och omtyckta produkter.\n\nFör Lantmännen Cerealia i Strängnäs räkning söker nu vi på Academic Work operatörer som, med start i juli, ska bli nyckelpersoner för deras produktionslinje av olika sorters spannmål - från kvarn till paketering.\n\nDu erbjuds\n\n\n* Ett konsultuppdrag på 6 månader (beroende på vilken del av produktionen man opererar).\n* En unik chans att växa professionellt, bygga ditt nätverk och skapa värdefulla kontakter för framtiden.\n\n\nSom konsult för Academic Work erbjuder vi stora möjligheter för dig att växa professionellt, bygga ditt nätverk och skapa värdefulla kontakter för framtiden. Läs mer om vårt konsulterbjudande.\n\nARBETSUPPGIFTER \nPå Lantmännen Cerealia finns det olika avdelningar i produktionen av de spannmålsbaserade produkterna. Det finns först och främst en spannmålssilo och en kvarn som bevarar kontra maler alla grundprodukterna (spannmålen). Därefter hamnar produkten i en mjölsilo innan den går vidare till paketeringsavdelningen där mjölet/ det malda spannmålet portioneras i sina respektive förpackningar och transporteringskärl.\n\nVar och en av dessa avdelningar har en viktig funktion och position i produktionen. Ditt ansvar som operatör är att säkerställa att produktionsprocessen flyter på och går som planerat. Typiska arbetsuppgifter kan vara att städa, köra truck och felsöka maskiner - uppgifterna kan variera beroende på vilken avdelning du ansvarar för.\n\nVI SÖKER DIG SOM \n- Har en god teknisk förståelse och intresse då du kommer att arbeta systembaserat i kombination med handson - arbete i produktionen för att få flödet att fortlöpa dygnet runt.\n- Är uthållig och kan ta ansvar i att upprätthålla regler &amp; riktlinjer avseende hygien och säkerhet.\n- Har en avklarad gymnasial utbildning, gärna med inriktning natur, teknik eller annan som vi bedömer likvärdig.\n\nMeriterande\n\n\n* Har en eftergymnasial examen, exempelvis inom maskinteknik eller naturvetenskap.\n* Har tidigare arbetslivserfarenhet som processopertör från exempelvis branscher inom läkemedel, livmedel, papper, färg eller liknande.\n\n\n#\n\nÖvrig information\n\n\n* Start: Omgående i juli\n* Omfattning: Heltid som konsult med goda möjligheter till direktanställning hos Lantmännen efter 6 månader.\n* Placering: Strängnäs\n\n\nRekryteringsprocessen hanteras av Academic Work och kundens önskemål är att alla frågor rörande tjänsten hanteras av Academic Work.\n\nVi går igenom urvalet löpande och annonsen kan stängas ner innan tjänsten är tillsatt om vi gått över till urvals- och intervjufasen.\n\nINFORMATION OM FÖRETAGET \nLäs mer om företag här!",
        "conditions" : "08:00-17:00",
        "text" : "Har du ett stort intresse för mat och vill jobba för ett förmånligt företag under  sommaren 2022? Som processoperatör för Lantmännen Cerealia agerar du nyckelperson i produktionsflödet av några av Sveriges mest folkkära och omtyckta spannmålsprodukter. SÖK NU och var med mitt i processen från jord till bord!\n\nOM TJÄNSTEN \nLantmännen Cerealia ingår i Lantmännen, ett lantbrukskooperativ som ägs av 19 000 svenska lantbrukare, med verksamheter i hela värdekedjan från jord till bord. På Lantmännen Cerealia utvecklar, producerar och marknadsförs ett stort sortiment av hälsosamma och näringsrika produkter med basen i Nordiska spannmål. Med klassiska varumärken som Kungsörnen, AXA och START! har de några av Sveriges mest folkkära och omtyckta produkter.\n\nFör Lantmännen Cerealia i Strängnäs räkning söker nu vi på Academic Work operatörer som, med start i juli, ska bli nyckelpersoner för deras produktionslinje av olika sorters spannmål - från kvarn till paketering.\n\nDu erbjuds\n\n\n* Ett konsultuppdrag på 6 månader (beroende på vilken del av produktionen man opererar).\n* En unik chans att växa professionellt, bygga ditt nätverk och skapa värdefulla kontakter för framtiden.\n\n\nSom konsult för Academic Work erbjuder vi stora möjligheter för dig att växa professionellt, bygga ditt nätverk och skapa värdefulla kontakter för framtiden. Läs mer om vårt konsulterbjudande.\n\nARBETSUPPGIFTER \nPå Lantmännen Cerealia finns det olika avdelningar i produktionen av de spannmålsbaserade produkterna. Det finns först och främst en spannmålssilo och en kvarn som bevarar kontra maler alla grundprodukterna (spannmålen). Därefter hamnar produkten i en mjölsilo innan den går vidare till paketeringsavdelningen där mjölet/ det malda spannmålet portioneras i sina respektive förpackningar och transporteringskärl.\n\nVar och en av dessa avdelningar har en viktig funktion och position i produktionen. Ditt ansvar som operatör är att säkerställa att produktionsprocessen flyter på och går som planerat. Typiska arbetsuppgifter kan vara att städa, köra truck och felsöka maskiner - uppgifterna kan variera beroende på vilken avdelning du ansvarar för.\n\nVI SÖKER DIG SOM \n- Har en god teknisk förståelse och intresse då du kommer att arbeta systembaserat i kombination med handson - arbete i produktionen för att få flödet att fortlöpa dygnet runt.\n- Är uthållig och kan ta ansvar i att upprätthålla regler & riktlinjer avseende hygien och säkerhet.\n- Har en avklarad gymnasial utbildning, gärna med inriktning natur, teknik eller annan som vi bedömer likvärdig.\n\nMeriterande\n\n\n* Har en eftergymnasial examen, exempelvis inom maskinteknik eller naturvetenskap.\n* Har tidigare arbetslivserfarenhet som processopertör från exempelvis branscher inom läkemedel, livmedel, papper, färg eller liknande.\n\n\n#\n\nÖvrig information\n\n\n* Start: Omgående i juli\n* Omfattning: Heltid som konsult med goda möjligheter till direktanställning hos Lantmännen efter 6 månader.\n* Placering: Strängnäs\n\n\nRekryteringsprocessen hanteras av Academic Work och kundens önskemål är att alla frågor rörande tjänsten hanteras av Academic Work.\n\nVi går igenom urvalet löpande och annonsen kan stängas ner innan tjänsten är tillsatt om vi gått över till urvals- och intervjufasen.\n\nINFORMATION OM FÖRETAGET \nLäs mer om företag här!"
      },
      "headline" : "Operatörer till Lantmännen Cerealia!",
      "driving_license" : null,
      "employer" : {
        "email" : null,
        "phone_number" : null,
        "organization_number" : "5565595450",
        "name" : "Academic Work Sweden AB",
        "url" : "http://www.academicwork.se",
        "workplace" : "Academic Work"
      },
      "removed_date" : null,
      "logo_url" : "https://www.arbetsformedlingen.se/rest/arbetsgivare/rest/af/v3/organisation/5565595450/logotyper/logo.png",
      "last_publication_date" : "2022-08-05T23:59:59",
      "number_of_vacancies" : 1,
      "occupation" : {
        "concept_id" : "Z4Tt_Gwt_NGP",
        "label" : "Maskinoperatör, mekanisk verkstad",
        "legacy_ams_taxonomy_id" : "5305"
      },
      "occupation_group" : {
        "concept_id" : "vaEp_iBS_c5h",
        "label" : "Maskinställare och maskinoperatörer, metallarbete",
        "legacy_ams_taxonomy_id" : "7223"
      },
      "employment_type" : {
        "concept_id" : "PFZr_Syz_cUq",
        "label" : "Vanlig anställning",
        "legacy_ams_taxonomy_id" : "1"
      },
      "webpage_url" : "https://arbetsformedlingen.se/platsbanken/annonser/26294644",
      "driving_license_required" : false,
      "application_contacts" : [ {
        "description" : "Jennifer Lind",
        "email" : null,
        "telephone" : null,
        "name" : null,
        "contact_type" : null
      } ],
      "duration" : {
        "concept_id" : "qQUd_4qe_NDT",
        "label" : "6 månader eller längre",
        "legacy_ams_taxonomy_id" : "2"
      },
      "nice_to_have" : {
        "education_level" : [ ],
        "work_experiences" : [ ],
        "skills" : [ ],
        "education" : [ ],
        "languages" : [ ]
      },
      "application_details" : {
        "via_af" : false,
        "email" : null,
        "other" : null,
        "reference" : "15078219",
        "url" : "http://www.academicwork.se/jobad/operatorer-till-lantmannen-cerealia/15078219?apply=1",
        "information" : null
      },
      "source_type" : "VIA_PLATSBANKEN_DXA",
      "application_deadline" : "2022-08-05T23:59:59",
      "external_id" : "46-556559-5450-15078219",
      "workplace_address" : {
        "coordinates" : [ 17.03212, 59.377453 ],
        "city" : null,
        "postcode" : null,
        "municipality" : "Strängnäs",
        "region_concept_id" : "s93u_BEb_sx2",
        "region" : "Södermanlands län",
        "country_code" : "199",
        "region_code" : "04",
        "municipality_concept_id" : "shnD_RiE_RKL",
        "country_concept_id" : "i46j_HmG_v64",
        "municipality_code" : "0486",
        "street_address" : null,
        "country" : "Sverige"
      },
      "id" : "26294644",
      "experience_required" : true,
      "working_hours_type" : {
        "concept_id" : "6YE1_gAC_R2G",
        "label" : "Heltid",
        "legacy_ams_taxonomy_id" : "1"
      },
      "access" : null,
      "timestamp" : 1657015278468,
      "must_have" : {
        "education_level" : [ ],
        "work_experiences" : [ {
          "concept_id" : "Z4Tt_Gwt_NGP",
          "weight" : 10,
          "label" : "Maskinoperatör, mekanisk verkstad",
          "legacy_ams_taxonomy_id" : "5305"
        } ],
        "skills" : [ ],
        "education" : [ ],
        "languages" : [ ]
      },
      "occupation_field" : {
        "concept_id" : "wTEr_CBC_bqh",
        "label" : "Industriell tillverkning",
        "legacy_ams_taxonomy_id" : "9"
      },
      "scope_of_work" : {
        "min" : 100,
        "max" : 100
      },
      "salary_type" : {
        "concept_id" : "oG8G_9cW_nRf",
        "label" : "Fast månads- vecko- eller timlön",
        "legacy_ams_taxonomy_id" : "1"
      },
      "removed" : false,
      "salary_description" : "Enligt avtal",
      "access_to_own_car" : false,
      "publication_date" : "2022-07-05T12:01:18"
    },
    "name" : "Operatörer till Lantmännen Cerealia!",
    "user" : "hannes"
  },
  "sha1" : "494ec2deb1d66007125ccd109d620e4119590679",
  "annotations" : [ {
    "preferred-label" : "Sverige",
    "type" : "country",
    "start-position" : 234,
    "end-position" : 242,
    "concept-id" : "i46j_HmG_v64",
    "matched-string" : "Sveriges",
    "annotation-id" : 10
  }, {
    "preferred-label" : "Sverige",
    "type" : "country",
    "start-position" : 746,
    "end-position" : 754,
    "concept-id" : "i46j_HmG_v64",
    "matched-string" : "Sveriges",
    "annotation-id" : 11
  }, {
    "preferred-label" : "Emballage/Förpackningar",
    "sentiment" : "MUST_HAVE",
    "type" : "skill",
    "start-position" : 1802,
    "end-position" : 1815,
    "concept-id" : "DTXS_78v_B2p",
    "matched-string" : "förpackningar",
    "annotation-id" : 1
  }, {
    "preferred-label" : "Städa",
    "sentiment" : "MUST_HAVE",
    "type" : "keyword",
    "start-position" : 2064,
    "end-position" : 2069,
    "concept-id" : "r35T_iyj_ueU",
    "matched-string" : "städa",
    "annotation-id" : 2
  }, {
    "preferred-label" : "Truck",
    "sentiment" : "MUST_HAVE",
    "type" : "keyword",
    "start-position" : 2076,
    "end-position" : 2081,
    "concept-id" : "Wz82_4Xv_ZFr",
    "matched-string" : "truck",
    "annotation-id" : 3
  }, {
    "preferred-label" : "göra felsökning",
    "type" : "esco-skill",
    "start-position" : 2086,
    "end-position" : 2093,
    "concept-id" : "HqC8_fVY_ACM",
    "matched-string" : "felsöka",
    "annotation-id" : 12
  }, {
    "preferred-label" : "Gymnasial utbildning",
    "sentiment" : "MUST_HAVE",
    "type" : "sun-education-level-1",
    "start-position" : 2490,
    "end-position" : 2510,
    "concept-id" : "wyLL_K3a_HRC",
    "matched-string" : "gymnasial utbildning",
    "annotation-id" : 4
  }, {
    "preferred-label" : "Gymnasieskolans naturvetenskapliga program",
    "type" : "keyword",
    "start-position" : 2533,
    "end-position" : 2538,
    "concept-id" : "BaGV_FQz_U5R",
    "matched-string" : "natur",
    "annotation-id" : 13
  }, {
    "preferred-label" : "Gymnasieskolans teknikprogram, inriktning teknikvetenskap",
    "type" : "keyword",
    "start-position" : 2540,
    "end-position" : 2546,
    "concept-id" : "hMYG_YRx_hPo",
    "matched-string" : "teknik",
    "annotation-id" : 14
  }, {
    "preferred-label" : "Högskoleutbildning tre år, generell",
    "type" : "sun-education-level-3",
    "start-position" : 2609,
    "end-position" : 2630,
    "concept-id" : "VYJg_tHa_Dsd",
    "matched-string" : "eftergymnasial examen",
    "annotation-id" : 15
  }, {
    "preferred-label" : "maskinteknik",
    "sentiment" : "MUST_HAVE",
    "type" : "esco-skill",
    "start-position" : 2648,
    "end-position" : 2660,
    "concept-id" : "Tr51_FDS_Sfn",
    "matched-string" : "maskinteknik",
    "annotation-id" : 6
  }, {
    "preferred-label" : "Naturvetenskap",
    "sentiment" : "MUST_HAVE",
    "type" : "occupation-field",
    "start-position" : 2667,
    "end-position" : 2681,
    "concept-id" : "kJeN_wmw_9wX",
    "matched-string" : "naturvetenskap",
    "annotation-id" : 7
  }, {
    "preferred-label" : "läkemedelsprocesser",
    "type" : "esco-skill",
    "start-position" : 2769,
    "end-position" : 2778,
    "concept-id" : "qDnn_SjF_Wbm",
    "matched-string" : "läkemedel",
    "annotation-id" : 17
  }, {
    "preferred-label" : "processoperatör, livsmedelsindustri",
    "type" : "esco-occupation",
    "start-position" : 2780,
    "end-position" : 2788,
    "concept-id" : "qYJv_89v_aBc",
    "matched-string" : "livmedel",
    "annotation-id" : 16
  }, {
    "preferred-label" : "Processoperatörer, pappersmassa",
    "type" : "ssyk-level-4",
    "start-position" : 2790,
    "end-position" : 2796,
    "concept-id" : "4obu_LL6_RqJ",
    "matched-string" : "papper",
    "annotation-id" : 18
  }, {
    "preferred-label" : "Färg/Kemikalieprodukter/Tapeter",
    "sentiment" : "MUST_HAVE",
    "type" : "skill",
    "start-position" : 2798,
    "end-position" : 2802,
    "concept-id" : "fyJi_1k3_CdV",
    "matched-string" : "färg",
    "annotation-id" : 9
  }, {
    "preferred-label" : "Heltid",
    "type" : "worktime-extent",
    "start-position" : 2883,
    "end-position" : 2889,
    "concept-id" : "6YE1_gAC_R2G",
    "matched-string" : "Heltid",
    "annotation-id" : 19
  }, {
    "preferred-label" : "Strängnäs",
    "type" : "municipality",
    "start-position" : 2991,
    "end-position" : 3000,
    "concept-id" : "shnD_RiE_RKL",
    "matched-string" : "Strängnäs",
    "annotation-id" : 20
  } ],
  "text" : "Operatörer till Lantmännen Cerealia!\nHar du ett stort intresse för mat och vill jobba för ett förmånligt företag under  sommaren 2022? Som processoperatör för Lantmännen Cerealia agerar du nyckelperson i produktionsflödet av några av Sveriges mest folkkära och omtyckta spannmålsprodukter. SÖK NU och var med mitt i processen från jord till bord!\n\nOM TJÄNSTEN \nLantmännen Cerealia ingår i Lantmännen, ett lantbrukskooperativ som ägs av 19 000 svenska lantbrukare, med verksamheter i hela värdekedjan från jord till bord. På Lantmännen Cerealia utvecklar, producerar och marknadsförs ett stort sortiment av hälsosamma och näringsrika produkter med basen i Nordiska spannmål. Med klassiska varumärken som Kungsörnen, AXA och START! har de några av Sveriges mest folkkära och omtyckta produkter.\n\nFör Lantmännen Cerealia i Strängnäs räkning söker nu vi på Academic Work operatörer som, med start i juli, ska bli nyckelpersoner för deras produktionslinje av olika sorters spannmål - från kvarn till paketering.\n\nDu erbjuds\n\n\n* Ett konsultuppdrag på 6 månader (beroende på vilken del av produktionen man opererar).\n* En unik chans att växa professionellt, bygga ditt nätverk och skapa värdefulla kontakter för framtiden.\n\n\nSom konsult för Academic Work erbjuder vi stora möjligheter för dig att växa professionellt, bygga ditt nätverk och skapa värdefulla kontakter för framtiden. Läs mer om vårt konsulterbjudande.\n\nARBETSUPPGIFTER \nPå Lantmännen Cerealia finns det olika avdelningar i produktionen av de spannmålsbaserade produkterna. Det finns först och främst en spannmålssilo och en kvarn som bevarar kontra maler alla grundprodukterna (spannmålen). Därefter hamnar produkten i en mjölsilo innan den går vidare till paketeringsavdelningen där mjölet/ det malda spannmålet portioneras i sina respektive förpackningar och transporteringskärl.\n\nVar och en av dessa avdelningar har en viktig funktion och position i produktionen. Ditt ansvar som operatör är att säkerställa att produktionsprocessen flyter på och går som planerat. Typiska arbetsuppgifter kan vara att städa, köra truck och felsöka maskiner - uppgifterna kan variera beroende på vilken avdelning du ansvarar för.\n\nVI SÖKER DIG SOM \n- Har en god teknisk förståelse och intresse då du kommer att arbeta systembaserat i kombination med handson - arbete i produktionen för att få flödet att fortlöpa dygnet runt.\n- Är uthållig och kan ta ansvar i att upprätthålla regler & riktlinjer avseende hygien och säkerhet.\n- Har en avklarad gymnasial utbildning, gärna med inriktning natur, teknik eller annan som vi bedömer likvärdig.\n\nMeriterande\n\n\n* Har en eftergymnasial examen, exempelvis inom maskinteknik eller naturvetenskap.\n* Har tidigare arbetslivserfarenhet som processopertör från exempelvis branscher inom läkemedel, livmedel, papper, färg eller liknande.\n\n\n#\n\nÖvrig information\n\n\n* Start: Omgående i juli\n* Omfattning: Heltid som konsult med goda möjligheter till direktanställning hos Lantmännen efter 6 månader.\n* Placering: Strängnäs\n\n\nRekryteringsprocessen hanteras av Academic Work och kundens önskemål är att alla frågor rörande tjänsten hanteras av Academic Work.\n\nVi går igenom urvalet löpande och annonsen kan stängas ner innan tjänsten är tillsatt om vi gått över till urvals- och intervjufasen.\n\nINFORMATION OM FÖRETAGET \nLäs mer om företag här!"
}