{
  "meta" : {
    "jobad" : {
      "description" : {
        "requirements" : null,
        "needs" : null,
        "company_information" : null,
        "text_formatted" : "<p>Fruängens vårdcentral söker nu en distriktssköterska eller sjuksköterska till hemsjukvårdsteamet.</p><p>Fruängens vårdcentral ligger centralt i Fruängen nära tunnelbana och bussar. Vårdcentralen är en del av Praktikertjänst AB.</p><p>Arbetsbeskrivning: Sedvanliga arbetsuppgifter som distriktssköterska i hemsjukvård.</p><p>Stor vikt kommer läggas på personliga egenskaper som att du är serviceinriktad, engagerad, lösningsfokuserad och har god samarbetsförmåga. Du trivs med att vara spindeln i nätet och koordinera arbetet med andra yrkeskategorier.</p><p>Vi erbjuder ett omväxlande, roligt och till stor del självständigt arbete under dagtid. En annan trevlig förmån är friskvårdsbidrag på 5000 kronor per år.</p><p>Heltid eller deltid kan diskuteras. Körkort och körvana är ett krav.</p><p>Vi dokumenterar i TakeCare.</p><p>Välkommen med din ansökan, gärna redan idag via mail lil.ragnerstam@ptj.se eller på telefon 070-7770315. Tjänsten kan komma att tillsättas innan sista ansökningsdatum.</p>",
        "conditions" : null,
        "text" : "Fruängens vårdcentral söker nu en distriktssköterska eller sjuksköterska till hemsjukvårdsteamet.\nFruängens vårdcentral ligger centralt i Fruängen nära tunnelbana och bussar. Vårdcentralen är en del av Praktikertjänst AB.\nArbetsbeskrivning: Sedvanliga arbetsuppgifter som distriktssköterska i hemsjukvård.\nStor vikt kommer läggas på personliga egenskaper som att du är serviceinriktad, engagerad, lösningsfokuserad och har god samarbetsförmåga. Du trivs med att vara spindeln i nätet och koordinera arbetet med andra yrkeskategorier.\nVi erbjuder ett omväxlande, roligt och till stor del självständigt arbete under dagtid. En annan trevlig förmån är friskvårdsbidrag på 5000 kronor per år.\nHeltid eller deltid kan diskuteras. Körkort och körvana är ett krav.\nVi dokumenterar i TakeCare.\nVälkommen med din ansökan, gärna redan idag via mail lil.ragnerstam@ptj.se eller på telefon 070-7770315. Tjänsten kan komma att tillsättas innan sista ansökningsdatum."
      },
      "headline" : "Distriktssköterska till hemsjukvård i Fruängen",
      "driving_license" : [ {
        "concept_id" : "VTK8_WRx_GcM",
        "label" : "B",
        "legacy_ams_taxonomy_id" : "3"
      } ],
      "employer" : {
        "email" : null,
        "phone_number" : null,
        "organization_number" : "5560772419",
        "name" : "Praktikertjänst AB",
        "url" : null,
        "workplace" : "FRUÄNGENS LÄKARHUS"
      },
      "removed_date" : null,
      "logo_url" : "https://www.arbetsformedlingen.se/rest/arbetsgivare/rest/af/v3/arbetsplatser/83513241/logotyper/logo.png",
      "last_publication_date" : "2022-08-31T23:59:59",
      "number_of_vacancies" : 1,
      "occupation" : {
        "concept_id" : "n2Tp_B8E_gED",
        "label" : "Distriktssköterska",
        "legacy_ams_taxonomy_id" : "5760"
      },
      "occupation_group" : {
        "concept_id" : "oj4c_P4b_cja",
        "label" : "Distriktssköterskor",
        "legacy_ams_taxonomy_id" : "2224"
      },
      "employment_type" : {
        "concept_id" : "PFZr_Syz_cUq",
        "label" : "Vanlig anställning",
        "legacy_ams_taxonomy_id" : "1"
      },
      "webpage_url" : "https://arbetsformedlingen.se/platsbanken/annonser/26369188",
      "driving_license_required" : true,
      "application_contacts" : [ {
        "description" : null,
        "email" : "lil.ragnerstam@ptj.se",
        "telephone" : "0707770315",
        "name" : "Lil Ragnerstam",
        "contact_type" : "Verksamhetschef"
      } ],
      "duration" : {
        "concept_id" : "a7uU_j21_mkL",
        "label" : "Tills vidare",
        "legacy_ams_taxonomy_id" : "1"
      },
      "nice_to_have" : {
        "education_level" : [ ],
        "work_experiences" : [ {
          "concept_id" : "n2Tp_B8E_gED",
          "weight" : 5,
          "label" : "Distriktssköterska",
          "legacy_ams_taxonomy_id" : "5760"
        } ],
        "skills" : [ ],
        "education" : [ ],
        "languages" : [ ]
      },
      "application_details" : {
        "via_af" : false,
        "email" : "lil.ragnerstam@ptj.se",
        "other" : null,
        "reference" : null,
        "url" : null,
        "information" : null
      },
      "source_type" : "VIA_ANNONSERA",
      "application_deadline" : "2022-08-31T23:59:59",
      "external_id" : null,
      "workplace_address" : {
        "coordinates" : [ 17.96654544492087, 59.285614626359234 ],
        "city" : "HÄGERSTEN",
        "postcode" : "12952",
        "municipality" : "Stockholm",
        "region_concept_id" : "CifL_Rzy_Mku",
        "region" : "Stockholms län",
        "country_code" : "199",
        "region_code" : "01",
        "municipality_concept_id" : "AvNB_uwa_6n6",
        "country_concept_id" : "i46j_HmG_v64",
        "municipality_code" : "0180",
        "street_address" : "Fruängsgången 2",
        "country" : "Sverige"
      },
      "id" : "26369188",
      "experience_required" : true,
      "working_hours_type" : {
        "concept_id" : "6YE1_gAC_R2G",
        "label" : "Heltid",
        "legacy_ams_taxonomy_id" : "1"
      },
      "access" : null,
      "timestamp" : 1659364590296,
      "must_have" : {
        "education_level" : [ ],
        "work_experiences" : [ ],
        "skills" : [ {
          "concept_id" : "dJa5_Nao_mDS",
          "weight" : 10,
          "label" : "Legitimation som sjuksköterska",
          "legacy_ams_taxonomy_id" : "3430"
        } ],
        "education" : [ ],
        "languages" : [ ]
      },
      "occupation_field" : {
        "concept_id" : "NYW6_mP6_vwf",
        "label" : "Hälso- och sjukvård",
        "legacy_ams_taxonomy_id" : "8"
      },
      "scope_of_work" : {
        "min" : 0,
        "max" : 100
      },
      "salary_type" : {
        "concept_id" : "oG8G_9cW_nRf",
        "label" : "Fast månads- vecko- eller timlön",
        "legacy_ams_taxonomy_id" : "1"
      },
      "removed" : false,
      "salary_description" : null,
      "access_to_own_car" : false,
      "publication_date" : "2022-08-01T16:36:30"
    },
    "name" : "Distriktssköterska till hemsjukvård i Fruängen",
    "user" : "hannes"
  },
  "sha1" : "e9b26f3fb6ffd36cf2f8dd623d93095da4d12034",
  "annotations" : [ {
    "preferred-label" : "Distriktssköterskor",
    "sentiment" : "MUST_HAVE",
    "type" : "ssyk-level-4",
    "start-position" : 0,
    "end-position" : 18,
    "concept-id" : "oj4c_P4b_cja",
    "matched-string" : "distriktssköterska",
    "annotation-id" : 0
  }, {
    "preferred-label" : "Hemsjukvård",
    "sentiment" : "MUST_HAVE",
    "type" : "skill",
    "start-position" : 24,
    "end-position" : 35,
    "concept-id" : "NbjJ_WBY_FoA",
    "matched-string" : "hemsjukvård",
    "annotation-id" : 1
  }, {
    "preferred-label" : "Vårdcentral",
    "sentiment" : "MUST_HAVE",
    "type" : "skill",
    "start-position" : 57,
    "end-position" : 68,
    "concept-id" : "FJjr_4pF_LEY",
    "matched-string" : "vårdcentral",
    "annotation-id" : 2
  }, {
    "preferred-label" : "Distriktssköterskor",
    "sentiment" : "MUST_HAVE",
    "type" : "ssyk-level-4",
    "start-position" : 81,
    "end-position" : 99,
    "concept-id" : "oj4c_P4b_cja",
    "matched-string" : "distriktssköterska",
    "annotation-id" : 3
  }, {
    "preferred-label" : "Sjuksköterskor",
    "sentiment" : "MUST_HAVE",
    "type" : "ssyk-level-3",
    "start-position" : 106,
    "end-position" : 119,
    "concept-id" : "jzaN_Vqk_TP1",
    "matched-string" : "sjuksköterska",
    "annotation-id" : 4
  }, {
    "preferred-label" : "Vårdcentral",
    "sentiment" : "MUST_HAVE",
    "type" : "skill",
    "start-position" : 155,
    "end-position" : 166,
    "concept-id" : "FJjr_4pF_LEY",
    "matched-string" : "vårdcentral",
    "annotation-id" : 5
  }, {
    "preferred-label" : "Distriktssköterskor",
    "sentiment" : "MUST_HAVE",
    "type" : "ssyk-level-4",
    "start-position" : 319,
    "end-position" : 337,
    "concept-id" : "oj4c_P4b_cja",
    "matched-string" : "distriktssköterska",
    "annotation-id" : 6
  }, {
    "preferred-label" : "Hemsjukvård",
    "sentiment" : "MUST_HAVE",
    "type" : "skill",
    "start-position" : 340,
    "end-position" : 351,
    "concept-id" : "NbjJ_WBY_FoA",
    "matched-string" : "hemsjukvård",
    "annotation-id" : 7
  }, {
    "preferred-label" : "arbeta självständigt",
    "type" : "esco-skill",
    "start-position" : 634,
    "end-position" : 654,
    "concept-id" : "NyFu_HHd_zhz",
    "matched-string" : "självständigt arbete",
    "annotation-id" : 8
  }, {
    "preferred-label" : "Heltid/Deltid",
    "type" : "worktime-extent",
    "start-position" : 736,
    "end-position" : 755,
    "concept-id" : "hGCt_6Ni_XPz",
    "matched-string" : "Heltid eller deltid",
    "annotation-id" : 9
  }, {
    "preferred-label" : "körkort",
    "type" : "esco-skill",
    "start-position" : 772,
    "end-position" : 779,
    "concept-id" : "UvDr_eNo_HSQ",
    "matched-string" : "Körkort",
    "annotation-id" : 10
  } ],
  "text" : "Distriktssköterska till hemsjukvård i Fruängen\nFruängens vårdcentral söker nu en distriktssköterska eller sjuksköterska till hemsjukvårdsteamet.\nFruängens vårdcentral ligger centralt i Fruängen nära tunnelbana och bussar. Vårdcentralen är en del av Praktikertjänst AB.\nArbetsbeskrivning: Sedvanliga arbetsuppgifter som distriktssköterska i hemsjukvård.\nStor vikt kommer läggas på personliga egenskaper som att du är serviceinriktad, engagerad, lösningsfokuserad och har god samarbetsförmåga. Du trivs med att vara spindeln i nätet och koordinera arbetet med andra yrkeskategorier.\nVi erbjuder ett omväxlande, roligt och till stor del självständigt arbete under dagtid. En annan trevlig förmån är friskvårdsbidrag på 5000 kronor per år.\nHeltid eller deltid kan diskuteras. Körkort och körvana är ett krav.\nVi dokumenterar i TakeCare.\nVälkommen med din ansökan, gärna redan idag via mail lil.ragnerstam@ptj.se eller på telefon 070-7770315. Tjänsten kan komma att tillsättas innan sista ansökningsdatum."
}