{
  "meta" : {
    "dataset-id" : "myh-spreadsheet-2021",
    "type" : "education-description",
    "dataset-document-id" : "YH00497",
    "user" : "kristof.fischer"
  },
  "sha1" : "117db9e5493ec3b3d7f97b47efdfff2d6722223c",
  "annotations" : [ {
    "preferred-label" : "Elkraftingenjör",
    "sentiment" : "OFFERED",
    "type" : "occupation-name",
    "start-position" : 11,
    "end-position" : 28,
    "concept-id" : "7Yn2_NLJ_oa2",
    "matched-string" : "elkraftingenjörer",
    "annotation-id" : 16
  }, {
    "preferred-label" : "Eltekniker",
    "sentiment" : "MUST_HAVE",
    "type" : "occupation-name",
    "start-position" : 93,
    "end-position" : 103,
    "concept-id" : "aRFB_gjn_92K",
    "matched-string" : "elektriker",
    "annotation-id" : 17
  }, {
    "preferred-label" : "Elkraftingenjör",
    "sentiment" : "OFFERED",
    "type" : "occupation-name",
    "start-position" : 131,
    "end-position" : 146,
    "concept-id" : "7Yn2_NLJ_oa2",
    "matched-string" : "elkraftingenjör",
    "annotation-id" : 0
  }, {
    "preferred-label" : "Eldistributionsnät, underhållsvana",
    "sentiment" : "OFFERED",
    "type" : "skill",
    "start-position" : 179,
    "end-position" : 193,
    "concept-id" : "AcJ9_uCy_S2r",
    "matched-string" : "eldistribution",
    "annotation-id" : 18
  }, {
    "preferred-label" : "elsäkerhetsföreskrifter",
    "sentiment" : "OFFERED",
    "type" : "esco-skill",
    "start-position" : 195,
    "end-position" : 205,
    "concept-id" : "GLB5_KMD_BgY",
    "matched-string" : "elsäkerhet",
    "annotation-id" : 1
  }, {
    "preferred-label" : null,
    "sentiment" : "OFFERED",
    "type" : "skill",
    "start-position" : 210,
    "end-position" : 222,
    "concept-id" : null,
    "matched-string" : "nätplanering",
    "annotation-id" : 19
  }, {
    "preferred-label" : "Elkraftingenjör",
    "sentiment" : "OFFERED",
    "type" : "occupation-name",
    "start-position" : 469,
    "end-position" : 484,
    "concept-id" : "7Yn2_NLJ_oa2",
    "matched-string" : "elkraftingenjör",
    "annotation-id" : 2
  }, {
    "preferred-label" : "Projektering",
    "sentiment" : "OFFERED",
    "type" : "skill",
    "start-position" : 549,
    "end-position" : 561,
    "concept-id" : "zRtu_fYj_XC4",
    "matched-string" : "projektering",
    "annotation-id" : 3
  }, {
    "preferred-label" : "Drift och underhåll av elanläggningar",
    "sentiment" : "OFFERED",
    "type" : "skill",
    "start-position" : 567,
    "end-position" : 580,
    "concept-id" : "caWZ_HUm_yNp",
    "matched-string" : "driftsättning",
    "annotation-id" : 20
  }, {
    "preferred-label" : "Elkraftingenjör",
    "sentiment" : "OFFERED",
    "type" : "occupation-name",
    "start-position" : 738,
    "end-position" : 753,
    "concept-id" : "7Yn2_NLJ_oa2",
    "matched-string" : "elkraftingenjör",
    "annotation-id" : 4
  }, {
    "preferred-label" : "Elingenjör",
    "sentiment" : "OFFERED",
    "type" : "occupation-name",
    "start-position" : 756,
    "end-position" : 766,
    "concept-id" : "kx3b_92W_PuD",
    "matched-string" : "elingenjör",
    "annotation-id" : 5
  }, {
    "preferred-label" : "Elkrafttekniker/Distributionstekniker",
    "sentiment" : "OFFERED",
    "type" : "occupation-name",
    "start-position" : 769,
    "end-position" : 784,
    "concept-id" : "juPt_n2E_aBv",
    "matched-string" : "elkrafttekniker",
    "annotation-id" : 6
  }, {
    "preferred-label" : "Tillsyn av elkraftanläggningar",
    "sentiment" : "OFFERED",
    "type" : "skill",
    "start-position" : 806,
    "end-position" : 871,
    "concept-id" : "xeAT_iPy_tAW",
    "matched-string" : "Utveckling, effektivisering och optimering av elkraftanläggningar",
    "annotation-id" : 21
  }, {
    "preferred-label" : "identifiera förbättringsåtgärder",
    "sentiment" : "OFFERED",
    "type" : "esco-skill",
    "start-position" : 875,
    "end-position" : 934,
    "concept-id" : "QjJV_BxL_p35",
    "matched-string" : "Identifiera och analysera förbättrings-, och problemområden",
    "annotation-id" : 22
  }, {
    "preferred-label" : "hitta lösningar på problem",
    "sentiment" : "OFFERED",
    "type" : "esco-skill",
    "start-position" : 939,
    "end-position" : 956,
    "concept-id" : "WFSY_Bwt_QWE",
    "matched-string" : "föreslå lösningar",
    "annotation-id" : 23
  }, {
    "preferred-label" : "Driftplanering, elkraft",
    "sentiment" : "OFFERED",
    "type" : "skill",
    "start-position" : 1042,
    "end-position" : 1112,
    "concept-id" : "vS5S_ZLN_viA",
    "matched-string" : "Planering, konstruktion och beredning av elnät och elkraftanläggningar",
    "annotation-id" : 24
  }, {
    "preferred-label" : "Driftansvar, elkraft",
    "sentiment" : "OFFERED",
    "type" : "skill",
    "start-position" : 1116,
    "end-position" : 1171,
    "concept-id" : "qAPk_7uX_SAU",
    "matched-string" : "Idrifttagning, drift och service av elkraftanläggningar",
    "annotation-id" : 25
  }, {
    "preferred-label" : "Projektledning, erfarenhet",
    "sentiment" : "OFFERED",
    "type" : "skill",
    "start-position" : 1175,
    "end-position" : 1225,
    "concept-id" : "3TSx_fJE_Z26",
    "matched-string" : "Planera och driva projekt och uppdrag inom elkraft",
    "annotation-id" : 26
  }, {
    "preferred-label" : "Elkraftingenjör",
    "sentiment" : "OFFERED",
    "type" : "occupation-name",
    "start-position" : 1253,
    "end-position" : 1268,
    "concept-id" : "7Yn2_NLJ_oa2",
    "matched-string" : "elkraftingenjör",
    "annotation-id" : 8
  }, {
    "preferred-label" : "Högskoleutbildning, yrkesinriktad, 3 år",
    "sentiment" : "OFFERED",
    "type" : "sun-education-level-3",
    "start-position" : 1275,
    "end-position" : 1298,
    "concept-id" : "9soG_8dX_jNa",
    "matched-string" : "yrkeshögskoleutbildning",
    "annotation-id" : 27
  }, {
    "preferred-label" : "Generering, överföring och distribution av elkraft",
    "sentiment" : "OFFERED",
    "type" : "sni-level-3",
    "start-position" : 1580,
    "end-position" : 1650,
    "concept-id" : "noKz_Bee_ph4",
    "matched-string" : "Anläggningar för prod.&överföring av el samt industriella anläggningar",
    "annotation-id" : 28
  }, {
    "preferred-label" : "Annan utbildning i energi- och elektroteknik",
    "sentiment" : "OFFERED",
    "type" : "sun-education-field-4",
    "start-position" : 1653,
    "end-position" : 1683,
    "concept-id" : "deFk_Dyb_tmV",
    "matched-string" : "Byggteknik för elkrafttekniker",
    "annotation-id" : 29
  }, {
    "preferred-label" : "Elinstallationer",
    "sentiment" : "OFFERED",
    "type" : "sni-level-4",
    "start-position" : 1686,
    "end-position" : 1714,
    "concept-id" : "5Cty_GV5_HCT",
    "matched-string" : "Elinstallationer i byggnader",
    "annotation-id" : 30
  }, {
    "preferred-label" : "Annan utbildning i energi- och elektroteknik",
    "sentiment" : "OFFERED",
    "type" : "sun-education-field-4",
    "start-position" : 1717,
    "end-position" : 1731,
    "concept-id" : "deFk_Dyb_tmV",
    "matched-string" : "elkonstruktion",
    "annotation-id" : 11
  }, {
    "preferred-label" : "Annan utbildning i energi- och elektroteknik",
    "sentiment" : "OFFERED",
    "type" : "sun-education-field-4",
    "start-position" : 1734,
    "end-position" : 1743,
    "concept-id" : "deFk_Dyb_tmV",
    "matched-string" : "Elkraft 2",
    "annotation-id" : 31
  }, {
    "preferred-label" : "Engelska",
    "sentiment" : "OFFERED",
    "type" : "sun-education-field-4",
    "start-position" : 1746,
    "end-position" : 1769,
    "concept-id" : "wC9s_urg_8jY",
    "matched-string" : "Elkraftteknisk engelska",
    "annotation-id" : 32
  }, {
    "preferred-label" : "Annan utbildning i energi- och elektroteknik",
    "sentiment" : "OFFERED",
    "type" : "sun-education-field-4",
    "start-position" : 1772,
    "end-position" : 1794,
    "concept-id" : "deFk_Dyb_tmV",
    "matched-string" : "Elmaskiner -drivsystem",
    "annotation-id" : 33
  }, {
    "preferred-label" : "Annan utbildning i energi- och elektroteknik",
    "sentiment" : "OFFERED",
    "type" : "sun-education-field-4",
    "start-position" : 1797,
    "end-position" : 1823,
    "concept-id" : "deFk_Dyb_tmV",
    "matched-string" : "Elsäkerhet och arbetsmiljö",
    "annotation-id" : 34
  }, {
    "preferred-label" : null,
    "sentiment" : "OFFERED",
    "type" : "sun-education-field-4",
    "start-position" : 1826,
    "end-position" : 1839,
    "concept-id" : null,
    "matched-string" : "Examensarbete",
    "annotation-id" : 35
  }, {
    "preferred-label" : "Annan utbildning i energi- och elektroteknik",
    "sentiment" : "OFFERED",
    "type" : "sun-education-field-4",
    "start-position" : 1842,
    "end-position" : 1864,
    "concept-id" : "deFk_Dyb_tmV",
    "matched-string" : "Högspänningsbehörighet",
    "annotation-id" : 36
  }, {
    "preferred-label" : null,
    "sentiment" : "OFFERED",
    "type" : "sun-education-field-4",
    "start-position" : 1867,
    "comment" : "praktik",
    "end-position" : 1885,
    "concept-id" : null,
    "matched-string" : "Lärande i arbete 1",
    "annotation-id" : 37
  }, {
    "preferred-label" : null,
    "sentiment" : "OFFERED",
    "type" : "sun-education-field-4",
    "start-position" : 1888,
    "end-position" : 1906,
    "concept-id" : null,
    "matched-string" : "Lärande i arbete 2",
    "annotation-id" : 38
  }, {
    "preferred-label" : "Ledarskap, organisation och styrning",
    "sentiment" : "OFFERED",
    "type" : "sun-education-field-4",
    "start-position" : 1909,
    "end-position" : 1924,
    "concept-id" : "AUNw_Uki_1ig",
    "matched-string" : "Projektstyrning",
    "annotation-id" : 39
  }, {
    "preferred-label" : null,
    "sentiment" : "OFFERED",
    "type" : "sun-education-field-4",
    "start-position" : 1927,
    "end-position" : 1948,
    "concept-id" : null,
    "matched-string" : "Regler och standarder",
    "annotation-id" : 40
  }, {
    "preferred-label" : "Matematik",
    "sentiment" : "OFFERED",
    "type" : "sun-education-field-4",
    "start-position" : 1951,
    "end-position" : 1977,
    "concept-id" : "qKRX_KkP_ayX",
    "matched-string" : "Tillämpad elkraftmatematik",
    "annotation-id" : 41
  }, {
    "preferred-label" : "Annan utbildning i energi- och elektroteknik",
    "sentiment" : "OFFERED",
    "type" : "sun-education-field-4",
    "start-position" : 1980,
    "end-position" : 2009,
    "concept-id" : "deFk_Dyb_tmV",
    "matched-string" : "Underhållsteknik inom elkraft",
    "annotation-id" : 42
  }, {
    "preferred-label" : "Annan utbildning i energi- och elektroteknik",
    "sentiment" : "OFFERED",
    "type" : "sun-education-field-4",
    "start-position" : 2012,
    "end-position" : 2046,
    "concept-id" : "deFk_Dyb_tmV",
    "matched-string" : "Övervaknings- och reläskyddssystem",
    "annotation-id" : 43
  } ],
  "text" : "Behovet av elkraftingenjörer är exceptionellt stort nu och framöver. Du som idag arbetar som elektriker kan vidareutbilda dig till elkraftingenjör och öka din kompetens inom bl a eldistribution, elsäkerhet och nätplanering. Eftersom utbildningen är deltid på distans kan du arbeta samtidigt som du studerar. I utbildningen ingår teorikurserna för fullständig auktorisation. Efter utbildningen, som har formats tillsammans med branschen, har du kompetens att arbeta som elkraftingenjör och ha en betydande roll i projektets alla tekniska faser, från projektering till driftsättning inom elkraftsbolag, elnätsbolag eller företag verksamma inom elkraft. Välkommen till en yrkesutbildning som tar dig vidare med full kraft.     YRKESROLLER  -Elkraftingenjör  -Elingenjör  -Elkrafttekniker    ARBETSUPPGIFTER  -Utveckling, effektivisering och optimering av elkraftanläggningar.  -Identifiera och analysera förbättrings-, och problemområden och föreslå lösningar för dessa med utgångspunkt från kvalité-, säkerhet-, -ekonomi och miljöhänseende.   -Planering, konstruktion och beredning av elnät och elkraftanläggningar.  -Idrifttagning, drift och service av elkraftanläggningar.  -Planera och driva projekt och uppdrag inom elkraft.    UTBILDNINGENS UPPLÄGG  Elkraftingenjör är en yrkeshögskoleutbildning på 2,5 år (280 YH-poäng) som genomförs på halvtid på distans med sju obligatoriska träffar. Det innebär att du kan bo var som helst i landet och följa utbildningen från din hemort. Att du kan fortsätta att arbeta parallellt med dina studier ger dig oanade möjligheter.    KURSER  -Anläggningar för prod.&överföring av el samt industriella anläggningar  -Byggteknik för elkrafttekniker  -Elinstallationer i byggnader  -Elkonstruktion  -Elkraft 2  -Elkraftteknisk engelska  -Elmaskiner -drivsystem  -Elsäkerhet och arbetsmiljö  -Examensarbete  -Högspänningsbehörighet  -Lärande i arbete 1  -Lärande i arbete 2  -Projektstyrning  -Regler och standarder  -Tillämpad elkraftmatematik  -Underhållsteknik inom elkraft  -Övervaknings- och reläskyddssystem      "
}