{
  "meta" : {
    "jobad" : {
      "description" : {
        "requirements" : null,
        "needs" : null,
        "company_information" : null,
        "text_formatted" : "Vi söker snötekniker till området Teknisk Service. Har du erfarenhet av teknik eller snöläggning, gillar att jobba i fjällmiljö och vill utvecklas inom området så tror vi detta kan vara en intressant tjänst för dig. Vi ser också att du tycker om att jobba för att ge våra gäster minnesvärda fjällupplevelser. \n\nArbetsuppgifter: \n\nI affärsområdet Lift &amp; Pist ligger Teknisk service där det inom yrkesgruppen Tekniker finns: elektriker, mekaniker, lifttekniker och snötekniker. Som snötekniker arbetar du med service, reparationer, drift och underhåll av snöläggningssystem i anläggningen.\n\nArbetet innebär att snöläggningssystemets material och installationer underhålls och uppdateras. Du kommer att genomföra löpande underhåll och kontroller enligt satta rutiner. Medverkan vid större projekt och underhåll kan förekomma. Under våran snöläggningsperiod jobbar vi även som stöd till själva driften och medarbetarna som lägger snö. Våran arbetsplats är mestadels ute i alla väder.  \r\nDu är flexibel, noggrann och har ett stort tekniskt intresse och kunnande. Du kan arbeta självständigt men även i grupp.  \n\nFörkunskapskrav:\n\n - Körkorts klass B\n - Förarbevis snöskoter, terrängfordon\n\nMeriterande:\n\nTidigare erfarenhet av liknande arbete.\nGrundläggande elutbildning.\nSvetskunskaper.\nStyr- och reglerteknikskunskap.  \n\nAnställningsform:\n\nTillsvidare med 6 månaders provanställning med tillträdde omgående eller enligt överenskommelse \n\nArbetstider:\n Heltid, helgarbete och beredskap är schemalagt, kvällsarbete kan förekomma. \n\nLön: Enligt HRF avtal\n\nAtt få jobba med minnesvärda fjällupplevelser året runt tycker vi är det bästa som finns!\n\nVår personal är vår absolut största tillgång. Ett gemensamt engagemang och en strävan efter att skapa en bra fjällupplevelse för våra gäster är en stor del av vår framgång. Hos oss kan du vara dig själv och ha kul, samtidigt som du levererar ett betydande resultat tillsammans med fantastiska kollegor. \n\nPå SkiStar är vi fler än 500 helårsanställda som tillsammans jobbar med bland annat försäljning, ekonomi, drift, aktiviteter, It, administration, logiförmedling, fastighetsservice och marknadsföring. Under vintersäsong har vi dessutom över 2200 säsongsanställda.",
        "conditions" : "Heltid\r\nTillsvidare",
        "text" : "Vi söker snötekniker till området Teknisk Service. Har du erfarenhet av teknik eller snöläggning, gillar att jobba i fjällmiljö och vill utvecklas inom området så tror vi detta kan vara en intressant tjänst för dig. Vi ser också att du tycker om att jobba för att ge våra gäster minnesvärda fjällupplevelser. \n\nArbetsuppgifter: \n\nI affärsområdet Lift & Pist ligger Teknisk service där det inom yrkesgruppen Tekniker finns: elektriker, mekaniker, lifttekniker och snötekniker. Som snötekniker arbetar du med service, reparationer, drift och underhåll av snöläggningssystem i anläggningen.\n\nArbetet innebär att snöläggningssystemets material och installationer underhålls och uppdateras. Du kommer att genomföra löpande underhåll och kontroller enligt satta rutiner. Medverkan vid större projekt och underhåll kan förekomma. Under våran snöläggningsperiod jobbar vi även som stöd till själva driften och medarbetarna som lägger snö. Våran arbetsplats är mestadels ute i alla väder.  \r\nDu är flexibel, noggrann och har ett stort tekniskt intresse och kunnande. Du kan arbeta självständigt men även i grupp.  \n\nFörkunskapskrav:\n\n - Körkorts klass B\n - Förarbevis snöskoter, terrängfordon\n\nMeriterande:\n\nTidigare erfarenhet av liknande arbete.\nGrundläggande elutbildning.\nSvetskunskaper.\nStyr- och reglerteknikskunskap.  \n\nAnställningsform:\n\nTillsvidare med 6 månaders provanställning med tillträdde omgående eller enligt överenskommelse \n\nArbetstider:\n Heltid, helgarbete och beredskap är schemalagt, kvällsarbete kan förekomma. \n\nLön: Enligt HRF avtal\n\nAtt få jobba med minnesvärda fjällupplevelser året runt tycker vi är det bästa som finns!\n\nVår personal är vår absolut största tillgång. Ett gemensamt engagemang och en strävan efter att skapa en bra fjällupplevelse för våra gäster är en stor del av vår framgång. Hos oss kan du vara dig själv och ha kul, samtidigt som du levererar ett betydande resultat tillsammans med fantastiska kollegor. \n\nPå SkiStar är vi fler än 500 helårsanställda som tillsammans jobbar med bland annat försäljning, ekonomi, drift, aktiviteter, It, administration, logiförmedling, fastighetsservice och marknadsföring. Under vintersäsong har vi dessutom över 2200 säsongsanställda."
      },
      "headline" : "Snötekniker",
      "driving_license" : null,
      "employer" : {
        "email" : null,
        "phone_number" : null,
        "organization_number" : "5560936949",
        "name" : "SkiStar AB",
        "url" : "https://www.skistar.com/sv/",
        "workplace" : "SkiStar AB"
      },
      "removed_date" : null,
      "logo_url" : "https://www.arbetsformedlingen.se/rest/arbetsgivare/rest/af/v3/organisation/5560936949/logotyper/logo.png",
      "last_publication_date" : "2022-08-28T23:59:59",
      "number_of_vacancies" : 1,
      "occupation" : {
        "concept_id" : "1ciU_tMj_Toc",
        "label" : "Verkstadsmekaniker/Verkstadstekniker",
        "legacy_ams_taxonomy_id" : "2930"
      },
      "occupation_group" : {
        "concept_id" : "vaEp_iBS_c5h",
        "label" : "Maskinställare och maskinoperatörer, metallarbete",
        "legacy_ams_taxonomy_id" : "7223"
      },
      "employment_type" : {
        "concept_id" : "PFZr_Syz_cUq",
        "label" : "Vanlig anställning",
        "legacy_ams_taxonomy_id" : "1"
      },
      "webpage_url" : "https://arbetsformedlingen.se/platsbanken/annonser/26372927",
      "driving_license_required" : false,
      "application_contacts" : [ ],
      "duration" : {
        "concept_id" : "a7uU_j21_mkL",
        "label" : "Tills vidare",
        "legacy_ams_taxonomy_id" : "1"
      },
      "nice_to_have" : {
        "education_level" : [ ],
        "work_experiences" : [ ],
        "skills" : [ ],
        "education" : [ ],
        "languages" : [ ]
      },
      "application_details" : {
        "via_af" : false,
        "email" : null,
        "other" : null,
        "reference" : null,
        "url" : "https://emp.jobylon.com/applications/jobs/142922/create/?utm_source=ams&utm_medium=promotionserializer",
        "information" : null
      },
      "source_type" : "VIA_PLATSBANKEN_DXA",
      "application_deadline" : "2022-08-28T23:59:59",
      "external_id" : "46-556093-6949-142922-73310",
      "workplace_address" : {
        "coordinates" : [ 13.081506, 63.399044 ],
        "city" : null,
        "postcode" : null,
        "municipality" : "Åre",
        "region_concept_id" : "65Ms_7r1_RTG",
        "region" : "Jämtlands län",
        "country_code" : "199",
        "region_code" : "23",
        "municipality_concept_id" : "D7ax_CXP_6r1",
        "country_concept_id" : "i46j_HmG_v64",
        "municipality_code" : "2321",
        "street_address" : null,
        "country" : "Sverige"
      },
      "id" : "26372927",
      "experience_required" : true,
      "working_hours_type" : {
        "concept_id" : "6YE1_gAC_R2G",
        "label" : "Heltid",
        "legacy_ams_taxonomy_id" : "1"
      },
      "access" : null,
      "timestamp" : 1659463864073,
      "must_have" : {
        "education_level" : [ ],
        "work_experiences" : [ {
          "concept_id" : "1ciU_tMj_Toc",
          "weight" : 10,
          "label" : "Verkstadsmekaniker/Verkstadstekniker",
          "legacy_ams_taxonomy_id" : "2930"
        } ],
        "skills" : [ ],
        "education" : [ ],
        "languages" : [ ]
      },
      "occupation_field" : {
        "concept_id" : "wTEr_CBC_bqh",
        "label" : "Industriell tillverkning",
        "legacy_ams_taxonomy_id" : "9"
      },
      "scope_of_work" : {
        "min" : 100,
        "max" : 100
      },
      "salary_type" : {
        "concept_id" : "oG8G_9cW_nRf",
        "label" : "Fast månads- vecko- eller timlön",
        "legacy_ams_taxonomy_id" : "1"
      },
      "removed" : false,
      "salary_description" : "Fast månads- vecko- eller timlön",
      "access_to_own_car" : false,
      "publication_date" : "2022-08-02T20:11:04"
    },
    "name" : "Snötekniker",
    "user" : "hannes"
  },
  "sha1" : "81d1de0dc6c3945fda25b254b1a96d4dd6b162c4",
  "annotations" : [ {
    "preferred-label" : "Snötekniker",
    "sentiment" : "MUST_HAVE",
    "type" : "keyword",
    "start-position" : 0,
    "end-position" : 11,
    "concept-id" : "y2Bj_Gxb_nf7",
    "matched-string" : "snötekniker",
    "annotation-id" : 0
  }, {
    "preferred-label" : "Snötekniker",
    "sentiment" : "MUST_HAVE",
    "type" : "keyword",
    "start-position" : 21,
    "end-position" : 32,
    "concept-id" : "y2Bj_Gxb_nf7",
    "matched-string" : "snötekniker",
    "annotation-id" : 1
  }, {
    "preferred-label" : "Liftskötare/Lifttekniker",
    "sentiment" : "MUST_HAVE",
    "type" : "occupation-name",
    "start-position" : 458,
    "end-position" : 470,
    "concept-id" : "PNes_JEh_hiT",
    "matched-string" : "lifttekniker",
    "annotation-id" : 2
  }, {
    "preferred-label" : "Snötekniker",
    "sentiment" : "MUST_HAVE",
    "type" : "keyword",
    "start-position" : 475,
    "end-position" : 486,
    "concept-id" : "y2Bj_Gxb_nf7",
    "matched-string" : "snötekniker",
    "annotation-id" : 3
  }, {
    "preferred-label" : "Snötekniker",
    "sentiment" : "MUST_HAVE",
    "type" : "keyword",
    "start-position" : 492,
    "end-position" : 503,
    "concept-id" : "y2Bj_Gxb_nf7",
    "matched-string" : "snötekniker",
    "annotation-id" : 4
  }, {
    "preferred-label" : "noggrannhet",
    "type" : "esco-skill",
    "start-position" : 1011,
    "end-position" : 1019,
    "concept-id" : "mrsW_EkL_KRD",
    "matched-string" : "noggrann",
    "annotation-id" : 10
  }, {
    "preferred-label" : "arbeta självständigt",
    "type" : "esco-skill",
    "start-position" : 1077,
    "end-position" : 1097,
    "concept-id" : "NyFu_HHd_zhz",
    "matched-string" : "arbeta självständigt",
    "annotation-id" : 11
  }, {
    "preferred-label" : "B",
    "type" : "driving-licence",
    "start-position" : 1140,
    "end-position" : 1156,
    "concept-id" : "VTK8_WRx_GcM",
    "matched-string" : "Körkorts klass B",
    "annotation-id" : 12
  }, {
    "preferred-label" : "Förarbevis för snöskoter",
    "type" : "skill",
    "start-position" : 1160,
    "end-position" : 1180,
    "concept-id" : "BQa2_sAB_euB",
    "matched-string" : "Förarbevis snöskoter",
    "annotation-id" : 13
  }, {
    "preferred-label" : "Godkänd elutbildning",
    "type" : "skill",
    "start-position" : 1251,
    "end-position" : 1277,
    "concept-id" : "bG9S_mns_7q9",
    "matched-string" : "Grundläggande elutbildning",
    "annotation-id" : 14
  }, {
    "preferred-label" : "Allmänna svetskunskaper",
    "type" : "skill",
    "start-position" : 1279,
    "end-position" : 1293,
    "concept-id" : "rdtv_EuD_NfB",
    "matched-string" : "Svetskunskaper",
    "annotation-id" : 15
  }, {
    "preferred-label" : "Styr- och reglerteknik",
    "type" : "skill",
    "start-position" : 1295,
    "end-position" : 1325,
    "concept-id" : "Udbb_Eay_MuR",
    "matched-string" : "Styr- och reglerteknikskunskap",
    "annotation-id" : 16
  }, {
    "preferred-label" : "Tillsvidareanställning (inkl. eventuell provanställning)",
    "type" : "employment-type",
    "start-position" : 1349,
    "end-position" : 1391,
    "concept-id" : "kpPX_CNN_gDU",
    "matched-string" : "Tillsvidare med 6 månaders provanställning",
    "annotation-id" : 17
  }, {
    "preferred-label" : "Heltid",
    "type" : "worktime-extent",
    "start-position" : 1461,
    "end-position" : 1467,
    "concept-id" : "6YE1_gAC_R2G",
    "matched-string" : "Heltid",
    "annotation-id" : 18
  }, {
    "preferred-label" : "Personal",
    "sentiment" : "MUST_HAVE",
    "type" : "keyword",
    "start-position" : 1657,
    "end-position" : 1665,
    "concept-id" : "HVxM_6MS_y1c",
    "matched-string" : "personal",
    "annotation-id" : 5
  }, {
    "preferred-label" : "Ekonomi",
    "sentiment" : "MUST_HAVE",
    "type" : "keyword",
    "start-position" : 2055,
    "end-position" : 2062,
    "concept-id" : "PW4f_bmT_new",
    "matched-string" : "ekonomi",
    "annotation-id" : 6
  }, {
    "preferred-label" : "Data/IT",
    "sentiment" : "MUST_HAVE",
    "type" : "occupation-field",
    "start-position" : 2084,
    "end-position" : 2086,
    "concept-id" : "apaJ_2ja_LuF",
    "matched-string" : "it",
    "annotation-id" : 7
  }, {
    "preferred-label" : "Logiförmedling",
    "sentiment" : "MUST_HAVE",
    "type" : "skill",
    "start-position" : 2104,
    "end-position" : 2118,
    "concept-id" : "SsAP_Wrd_uSs",
    "matched-string" : "logiförmedling",
    "annotation-id" : 8
  }, {
    "preferred-label" : "Marknadsföring",
    "sentiment" : "MUST_HAVE",
    "type" : "sun-education-field-4",
    "start-position" : 2142,
    "end-position" : 2156,
    "concept-id" : "zTc5_e4U_Qsf",
    "matched-string" : "marknadsföring",
    "annotation-id" : 9
  } ],
  "text" : "Snötekniker\nVi söker snötekniker till området Teknisk Service. Har du erfarenhet av teknik eller snöläggning, gillar att jobba i fjällmiljö och vill utvecklas inom området så tror vi detta kan vara en intressant tjänst för dig. Vi ser också att du tycker om att jobba för att ge våra gäster minnesvärda fjällupplevelser. \n\nArbetsuppgifter: \n\nI affärsområdet Lift & Pist ligger Teknisk service där det inom yrkesgruppen Tekniker finns: elektriker, mekaniker, lifttekniker och snötekniker. Som snötekniker arbetar du med service, reparationer, drift och underhåll av snöläggningssystem i anläggningen.\n\nArbetet innebär att snöläggningssystemets material och installationer underhålls och uppdateras. Du kommer att genomföra löpande underhåll och kontroller enligt satta rutiner. Medverkan vid större projekt och underhåll kan förekomma. Under våran snöläggningsperiod jobbar vi även som stöd till själva driften och medarbetarna som lägger snö. Våran arbetsplats är mestadels ute i alla väder.  \r\nDu är flexibel, noggrann och har ett stort tekniskt intresse och kunnande. Du kan arbeta självständigt men även i grupp.  \n\nFörkunskapskrav:\n\n - Körkorts klass B\n - Förarbevis snöskoter, terrängfordon\n\nMeriterande:\n\nTidigare erfarenhet av liknande arbete.\nGrundläggande elutbildning.\nSvetskunskaper.\nStyr- och reglerteknikskunskap.  \n\nAnställningsform:\n\nTillsvidare med 6 månaders provanställning med tillträdde omgående eller enligt överenskommelse \n\nArbetstider:\n Heltid, helgarbete och beredskap är schemalagt, kvällsarbete kan förekomma. \n\nLön: Enligt HRF avtal\n\nAtt få jobba med minnesvärda fjällupplevelser året runt tycker vi är det bästa som finns!\n\nVår personal är vår absolut största tillgång. Ett gemensamt engagemang och en strävan efter att skapa en bra fjällupplevelse för våra gäster är en stor del av vår framgång. Hos oss kan du vara dig själv och ha kul, samtidigt som du levererar ett betydande resultat tillsammans med fantastiska kollegor. \n\nPå SkiStar är vi fler än 500 helårsanställda som tillsammans jobbar med bland annat försäljning, ekonomi, drift, aktiviteter, It, administration, logiförmedling, fastighetsservice och marknadsföring. Under vintersäsong har vi dessutom över 2200 säsongsanställda."
}