{
  "meta" : {
    "jobad" : {
      "description" : {
        "requirements" : null,
        "needs" : null,
        "company_information" : null,
        "text_formatted" : "Vi söker dig som vill jobba som stabsförvaltare på flottiljstaben och som vill ha ett omväxlande och utmanande arbete.\n\nOm enheten\n\nBefattningen ingår i flottiljstaben som består av ca 125 medarbetare. I rollen som stabsförvaltare ingår du tillsammans med stabschef och ställföreträdande stabschef i stabens ledningstriad.\n\nHuvudsakliga arbetsuppgifter\n\n\n• stödja stabschef tillika enhetschef för flottiljstaben\n• koordinera, på uppdrag av stabschefen, flottiljstabens verksamhet i fred så väl som i kris och krig\n• utveckla och producera personalplaner och förslag på stabens organisation utifrån trebefälssystemet\n• utveckla flottiljstabens effektuering av stabens interna processer: planering genomförande och uppföljning\n• utveckla och förvalta flottiljstabens stabsetik\n• sammanhålla och omsätta stabens utvecklingsplan till övningsverksamhet samt planera, förbereda och stödja stabschef i ledning under övning\n• rådgivande funktion inom det mentorerande ledarskapet inom flottiljstaben\n\n \n\nKvalifikationer\n\n\n• Anställd i Försvarsmakten med kontinuerlig tjänstgöring\n\n\n• Godkänd yrkesofficersexamen\n• Förtrogen med Försvarsmaktens stabsarbetsmetodik\n\n\n• Goda kunskaper i svenska och engelska, tal och skrift\n• Körkort B för manuell växellåda\n• Svenskt medborgarskap\n\n Meriterande \n\n\n• Erfarenhet av flygvapnets verksamhet och organisation\n\n Personliga egenskaper  \n\nSom person är du drivande, initiativtagande, organiserad och strukturerad i ditt arbete. För att trivas i rollen är du social och har lätt för att samarbeta. Då det tidvis är hög arbetsbelastning krävs att du är flexibel och stresstålig. Vi ser även att du är en god representant för Försvarsmakten och står bakom Försvarsmaktens värdegrund (se www.forsvarsmakten.se). Stor vikt kommer att läggas vid personlig lämplighet.\n\n \n\nÖvrigt\n\nAnställningsform: Tillsvidare, militär befattning, OR 8\n\nSysselsättningsgrad: Heltid\n Arbetsort: Såtenäs\n Tillträdesdatum: Enligt överenskommelse  \n\nTjänsten innebär krav på fysisk förmåga, genomförande av tjänsteresor, deltagande i utbildning och övning i krigsorganisationen.\n\nKontaktpersoner\n Vill du veta mer om befattningen är du välkommen att kontakta stabschef Jim Hallander, jim.hallander@mil.se\n \n\nFackliga företrädare: \n\nOfficersförbundet OFR/O, Jan Möller, tfn 0704 - 614 400\n Försvarsförbundet OFR/S, Per Gunnarsson, tfn 0510 - 47 77 08\n SACO, Ulf Svensson, tfn 0510 - 47 74 63\n SEKO, Erling Svensson, tfn 072 - 98 11 659\n \n Sista ansökningsdag\n\nVälkommen med din ansökan senast 2022-07-03. Din ansökan ska innehålla CV samt ansökningsbrev där vi vill att du motiverar varför du är lämpad för denna befattning.\n \n\n\n Ansökningar till denna befattning kommer endast tas emot via Försvarsmaktens webbplats. \n--------------------------------------------------------\nInformation om Försvarsmakten och det rekryterande förbandet:\n\nSkaraborgs flygflottilj är en mångsidig och unik flygflottilj. Här finns stridsflyg samt Försvarsmaktens samlade resurs av transport- och specialflyg. Vi genomför grund- och befattningsutbildning av pliktinkallade rekryter samt utbildar alla svenska och utländska Gripenpiloter. Förbandet deltar också i många insatser. I Sverige finns verksamheten på Såtenäs, Malmen, Arlanda och Karlsborg. Utomlands ansvarar vi för Gripensupporten i Thailand samt för den svenska personalen vid det internationella transportflygsamarbetet Heavy Airlift Wing i Ungern.\nLäs gärna mer på https://www.forsvarsmakten.se/f7\n\nVarje dag och varje timme gör våra medarbetare insatser som påverkar andra människors liv, både i stort och smått, och både på hemmaplan och runt om i världen.\n\nI Försvarsmakten finns en stark värdegrund som bygger på öppenhet, resultat och ansvar. Professionell utveckling och personlig hälsa värdesätts och uppmuntras. Det finns goda förutsättningar för intern karriärrörlighet, friskvård samt bra balans mellan arbete och privatliv.\n\nEn anställning hos oss innebär placering i säkerhetsklass. Vanligtvis krävs svenskt medborgarskap.\nSäkerhetsprövning med registerkontroll kommer att genomföras före anställning enligt 3 kap i säkerhetsskyddslagen. Med anställning följer en skyldighet att krigsplaceras. I anställningen ingår även en skyldighet att tjänstgöra utomlands. Innebörden av detta varierar beroende på typ av befattning.\n\nTill ansökan om anställning ska CV och personligt brev bifogas. Om du går vidare i anställningsprocessen ska alltid vidimerade kopior av betyg och intyg uppvisas.\n\nSamtal från externa rekryteringsföretag och säljare undanbedes.",
        "conditions" : "Heltid/\r\nEj specificerat",
        "text" : "Vi söker dig som vill jobba som stabsförvaltare på flottiljstaben och som vill ha ett omväxlande och utmanande arbete.\n\nOm enheten\n\nBefattningen ingår i flottiljstaben som består av ca 125 medarbetare. I rollen som stabsförvaltare ingår du tillsammans med stabschef och ställföreträdande stabschef i stabens ledningstriad.\n\nHuvudsakliga arbetsuppgifter\n\n\n• stödja stabschef tillika enhetschef för flottiljstaben\n• koordinera, på uppdrag av stabschefen, flottiljstabens verksamhet i fred så väl som i kris och krig\n• utveckla och producera personalplaner och förslag på stabens organisation utifrån trebefälssystemet\n• utveckla flottiljstabens effektuering av stabens interna processer: planering genomförande och uppföljning\n• utveckla och förvalta flottiljstabens stabsetik\n• sammanhålla och omsätta stabens utvecklingsplan till övningsverksamhet samt planera, förbereda och stödja stabschef i ledning under övning\n• rådgivande funktion inom det mentorerande ledarskapet inom flottiljstaben\n\n \n\nKvalifikationer\n\n\n• Anställd i Försvarsmakten med kontinuerlig tjänstgöring\n\n\n• Godkänd yrkesofficersexamen\n• Förtrogen med Försvarsmaktens stabsarbetsmetodik\n\n\n• Goda kunskaper i svenska och engelska, tal och skrift\n• Körkort B för manuell växellåda\n• Svenskt medborgarskap\n\n Meriterande \n\n\n• Erfarenhet av flygvapnets verksamhet och organisation\n\n Personliga egenskaper  \n\nSom person är du drivande, initiativtagande, organiserad och strukturerad i ditt arbete. För att trivas i rollen är du social och har lätt för att samarbeta. Då det tidvis är hög arbetsbelastning krävs att du är flexibel och stresstålig. Vi ser även att du är en god representant för Försvarsmakten och står bakom Försvarsmaktens värdegrund (se www.forsvarsmakten.se). Stor vikt kommer att läggas vid personlig lämplighet.\n\n \n\nÖvrigt\n\nAnställningsform: Tillsvidare, militär befattning, OR 8\n\nSysselsättningsgrad: Heltid\n Arbetsort: Såtenäs\n Tillträdesdatum: Enligt överenskommelse  \n\nTjänsten innebär krav på fysisk förmåga, genomförande av tjänsteresor, deltagande i utbildning och övning i krigsorganisationen.\n\nKontaktpersoner\n Vill du veta mer om befattningen är du välkommen att kontakta stabschef Jim Hallander, jim.hallander@mil.se\n \n\nFackliga företrädare: \n\nOfficersförbundet OFR/O, Jan Möller, tfn 0704 - 614 400\n Försvarsförbundet OFR/S, Per Gunnarsson, tfn 0510 - 47 77 08\n SACO, Ulf Svensson, tfn 0510 - 47 74 63\n SEKO, Erling Svensson, tfn 072 - 98 11 659\n \n Sista ansökningsdag\n\nVälkommen med din ansökan senast 2022-07-03. Din ansökan ska innehålla CV samt ansökningsbrev där vi vill att du motiverar varför du är lämpad för denna befattning.\n \n\n\n Ansökningar till denna befattning kommer endast tas emot via Försvarsmaktens webbplats. \n--------------------------------------------------------\nInformation om Försvarsmakten och det rekryterande förbandet:\n\nSkaraborgs flygflottilj är en mångsidig och unik flygflottilj. Här finns stridsflyg samt Försvarsmaktens samlade resurs av transport- och specialflyg. Vi genomför grund- och befattningsutbildning av pliktinkallade rekryter samt utbildar alla svenska och utländska Gripenpiloter. Förbandet deltar också i många insatser. I Sverige finns verksamheten på Såtenäs, Malmen, Arlanda och Karlsborg. Utomlands ansvarar vi för Gripensupporten i Thailand samt för den svenska personalen vid det internationella transportflygsamarbetet Heavy Airlift Wing i Ungern.\nLäs gärna mer på https://www.forsvarsmakten.se/f7\n\nVarje dag och varje timme gör våra medarbetare insatser som påverkar andra människors liv, både i stort och smått, och både på hemmaplan och runt om i världen.\n\nI Försvarsmakten finns en stark värdegrund som bygger på öppenhet, resultat och ansvar. Professionell utveckling och personlig hälsa värdesätts och uppmuntras. Det finns goda förutsättningar för intern karriärrörlighet, friskvård samt bra balans mellan arbete och privatliv.\n\nEn anställning hos oss innebär placering i säkerhetsklass. Vanligtvis krävs svenskt medborgarskap.\nSäkerhetsprövning med registerkontroll kommer att genomföras före anställning enligt 3 kap i säkerhetsskyddslagen. Med anställning följer en skyldighet att krigsplaceras. I anställningen ingår även en skyldighet att tjänstgöra utomlands. Innebörden av detta varierar beroende på typ av befattning.\n\nTill ansökan om anställning ska CV och personligt brev bifogas. Om du går vidare i anställningsprocessen ska alltid vidimerade kopior av betyg och intyg uppvisas.\n\nSamtal från externa rekryteringsföretag och säljare undanbedes."
      },
      "headline" : "Skaraborgs flygflottilj (F 7) söker Stabsförvaltare",
      "driving_license" : null,
      "employer" : {
        "email" : null,
        "phone_number" : null,
        "organization_number" : "2021004615",
        "name" : "Försvarsmakten",
        "url" : "http://www.forsvarsmakten.se/sv/",
        "workplace" : "Försvarsmakten"
      },
      "removed_date" : null,
      "logo_url" : "https://www.arbetsformedlingen.se/rest/arbetsgivare/rest/af/v3/organisation/2021004615/logotyper/logo.png",
      "last_publication_date" : "2022-08-14T23:59:59",
      "number_of_vacancies" : 1,
      "occupation" : {
        "concept_id" : "fsDP_fPf_xfC",
        "label" : "Officer",
        "legacy_ams_taxonomy_id" : "5541"
      },
      "occupation_group" : {
        "concept_id" : "KiVA_anS_RJh",
        "label" : "Officerare",
        "legacy_ams_taxonomy_id" : "0110"
      },
      "employment_type" : {
        "concept_id" : "PFZr_Syz_cUq",
        "label" : "Vanlig anställning",
        "legacy_ams_taxonomy_id" : "1"
      },
      "webpage_url" : "https://arbetsformedlingen.se/platsbanken/annonser/26322156",
      "driving_license_required" : false,
      "application_contacts" : [ ],
      "duration" : {
        "concept_id" : "a7uU_j21_mkL",
        "label" : "Tills vidare",
        "legacy_ams_taxonomy_id" : "1"
      },
      "nice_to_have" : {
        "education_level" : [ ],
        "work_experiences" : [ ],
        "skills" : [ ],
        "education" : [ ],
        "languages" : [ ]
      },
      "application_details" : {
        "via_af" : false,
        "email" : null,
        "other" : null,
        "reference" : null,
        "url" : "https://web103.reachmee.com/ext/I005/333/main?site=2&validator=a75fbd88f1b2a3a49de2af9c8b7bc228&lang=SE&rmpage=job&rmjob=29582",
        "information" : null
      },
      "source_type" : "VIA_PLATSBANKEN_DXA",
      "application_deadline" : "2022-08-14T23:59:59",
      "external_id" : "46-202100-4615-29582",
      "workplace_address" : {
        "coordinates" : [ 13.157077, 58.503506 ],
        "city" : null,
        "postcode" : null,
        "municipality" : "Lidköping",
        "region_concept_id" : "zdoY_6u5_Krt",
        "region" : "Västra Götalands län",
        "country_code" : "199",
        "region_code" : "14",
        "municipality_concept_id" : "FN1Y_asc_D8y",
        "country_concept_id" : "i46j_HmG_v64",
        "municipality_code" : "1494",
        "street_address" : null,
        "country" : "Sverige"
      },
      "id" : "26322156",
      "experience_required" : false,
      "working_hours_type" : {
        "concept_id" : "6YE1_gAC_R2G",
        "label" : "Heltid",
        "legacy_ams_taxonomy_id" : "1"
      },
      "access" : null,
      "timestamp" : 1657696768209,
      "must_have" : {
        "education_level" : [ ],
        "work_experiences" : [ ],
        "skills" : [ ],
        "education" : [ ],
        "languages" : [ ]
      },
      "occupation_field" : {
        "concept_id" : "bH5L_uXD_ZAX",
        "label" : "Militära yrken",
        "legacy_ams_taxonomy_id" : "22"
      },
      "scope_of_work" : {
        "min" : 100,
        "max" : 100
      },
      "salary_type" : {
        "concept_id" : "oG8G_9cW_nRf",
        "label" : "Fast månads- vecko- eller timlön",
        "legacy_ams_taxonomy_id" : "1"
      },
      "removed" : false,
      "salary_description" : ".",
      "access_to_own_car" : false,
      "publication_date" : "2022-07-13T09:19:28"
    },
    "name" : "Skaraborgs flygflottilj (F 7) söker Stabsförvaltare",
    "user" : "hannes"
  },
  "sha1" : "b0776e15b151418e2c0a2b89d913a00918ded7c0",
  "annotations" : [ {
    "preferred-label" : "Försvarsmakten",
    "sentiment" : "MUST_HAVE",
    "type" : "keyword",
    "start-position" : 1079,
    "end-position" : 1093,
    "concept-id" : "GSC3_yU4_K5V",
    "matched-string" : "försvarsmakten",
    "annotation-id" : 0
  }, {
    "preferred-label" : "Yrkesofficer",
    "type" : "keyword",
    "start-position" : 1136,
    "end-position" : 1148,
    "concept-id" : "PPsR_fcZ_JCd",
    "matched-string" : "yrkesofficer",
    "annotation-id" : 15
  }, {
    "preferred-label" : "Försvarsmakten",
    "type" : "keyword",
    "start-position" : 1172,
    "end-position" : 1187,
    "concept-id" : "GSC3_yU4_K5V",
    "matched-string" : "Försvarsmaktens",
    "annotation-id" : 16
  }, {
    "preferred-label" : "Svenska",
    "sentiment" : "MUST_HAVE",
    "type" : "language",
    "start-position" : 1228,
    "end-position" : 1235,
    "concept-id" : "zSLA_vw2_FXN",
    "matched-string" : "svenska",
    "annotation-id" : 1
  }, {
    "preferred-label" : "Engelska",
    "sentiment" : "MUST_HAVE",
    "type" : "language",
    "start-position" : 1240,
    "end-position" : 1248,
    "concept-id" : "NVxJ_hLg_TYS",
    "matched-string" : "engelska",
    "annotation-id" : 2
  }, {
    "preferred-label" : "B",
    "type" : "driving-licence",
    "start-position" : 1267,
    "end-position" : 1276,
    "concept-id" : "VTK8_WRx_GcM",
    "matched-string" : "Körkort B",
    "annotation-id" : 17
  }, {
    "preferred-label" : "Svenskt medborgarskap",
    "sentiment" : "MUST_HAVE",
    "type" : "skill",
    "start-position" : 1301,
    "end-position" : 1322,
    "concept-id" : "chKz_HpD_XL5",
    "matched-string" : "svenskt medborgarskap",
    "annotation-id" : 3
  }, {
    "preferred-label" : "hantera stress",
    "type" : "esco-skill",
    "start-position" : 1648,
    "end-position" : 1659,
    "concept-id" : "z5Zo_DVb_VEK",
    "matched-string" : "stresstålig",
    "annotation-id" : 18
  }, {
    "preferred-label" : "Försvarsmakten",
    "sentiment" : "MUST_HAVE",
    "type" : "keyword",
    "start-position" : 1707,
    "end-position" : 1721,
    "concept-id" : "GSC3_yU4_K5V",
    "matched-string" : "försvarsmakten",
    "annotation-id" : 4
  }, {
    "preferred-label" : "Försvarsmakten",
    "type" : "keyword",
    "start-position" : 1737,
    "end-position" : 1752,
    "concept-id" : "GSC3_yU4_K5V",
    "matched-string" : "Försvarsmaktens",
    "annotation-id" : 19
  }, {
    "preferred-label" : "Tillsvidareanställning (inkl. eventuell provanställning)",
    "type" : "employment-type",
    "start-position" : 1876,
    "end-position" : 1887,
    "concept-id" : "kpPX_CNN_gDU",
    "matched-string" : "Tillsvidare",
    "annotation-id" : 20
  }, {
    "preferred-label" : "Militär",
    "sentiment" : "MUST_HAVE",
    "type" : "keyword",
    "start-position" : 1889,
    "end-position" : 1896,
    "concept-id" : "DwGx_oR9_N4t",
    "matched-string" : "militär",
    "annotation-id" : 5
  }, {
    "preferred-label" : "Heltid",
    "type" : "worktime-extent",
    "start-position" : 1936,
    "end-position" : 1942,
    "concept-id" : "6YE1_gAC_R2G",
    "matched-string" : "Heltid",
    "annotation-id" : 21
  }, {
    "preferred-label" : "Resor i arbetet förekommer",
    "type" : "work-place-environment",
    "start-position" : 2048,
    "end-position" : 2076,
    "concept-id" : "oaM2_JTK_muh",
    "matched-string" : "genomförande av tjänsteresor",
    "annotation-id" : 22
  }, {
    "preferred-label" : "Försvarsmakten",
    "sentiment" : "MUST_HAVE",
    "type" : "keyword",
    "start-position" : 2847,
    "end-position" : 2861,
    "concept-id" : "GSC3_yU4_K5V",
    "matched-string" : "försvarsmakten",
    "annotation-id" : 6
  }, {
    "preferred-label" : "Försvarsmakten",
    "type" : "keyword",
    "start-position" : 2984,
    "end-position" : 2999,
    "concept-id" : "GSC3_yU4_K5V",
    "matched-string" : "Försvarsmaktens",
    "annotation-id" : 23
  }, {
    "preferred-label" : "Försvarsmakten",
    "sentiment" : "MUST_HAVE",
    "type" : "keyword",
    "start-position" : 3663,
    "end-position" : 3677,
    "concept-id" : "GSC3_yU4_K5V",
    "matched-string" : "försvarsmakten",
    "annotation-id" : 9
  }, {
    "preferred-label" : "Svenskt medborgarskap",
    "sentiment" : "MUST_HAVE",
    "type" : "skill",
    "start-position" : 4013,
    "end-position" : 4034,
    "concept-id" : "chKz_HpD_XL5",
    "matched-string" : "svenskt medborgarskap",
    "annotation-id" : 13
  } ],
  "text" : "Skaraborgs flygflottilj (F 7) söker Stabsförvaltare\nVi söker dig som vill jobba som stabsförvaltare på flottiljstaben och som vill ha ett omväxlande och utmanande arbete.\n\nOm enheten\n\nBefattningen ingår i flottiljstaben som består av ca 125 medarbetare. I rollen som stabsförvaltare ingår du tillsammans med stabschef och ställföreträdande stabschef i stabens ledningstriad.\n\nHuvudsakliga arbetsuppgifter\n\n\n• stödja stabschef tillika enhetschef för flottiljstaben\n• koordinera, på uppdrag av stabschefen, flottiljstabens verksamhet i fred så väl som i kris och krig\n• utveckla och producera personalplaner och förslag på stabens organisation utifrån trebefälssystemet\n• utveckla flottiljstabens effektuering av stabens interna processer: planering genomförande och uppföljning\n• utveckla och förvalta flottiljstabens stabsetik\n• sammanhålla och omsätta stabens utvecklingsplan till övningsverksamhet samt planera, förbereda och stödja stabschef i ledning under övning\n• rådgivande funktion inom det mentorerande ledarskapet inom flottiljstaben\n\n \n\nKvalifikationer\n\n\n• Anställd i Försvarsmakten med kontinuerlig tjänstgöring\n\n\n• Godkänd yrkesofficersexamen\n• Förtrogen med Försvarsmaktens stabsarbetsmetodik\n\n\n• Goda kunskaper i svenska och engelska, tal och skrift\n• Körkort B för manuell växellåda\n• Svenskt medborgarskap\n\n Meriterande \n\n\n• Erfarenhet av flygvapnets verksamhet och organisation\n\n Personliga egenskaper  \n\nSom person är du drivande, initiativtagande, organiserad och strukturerad i ditt arbete. För att trivas i rollen är du social och har lätt för att samarbeta. Då det tidvis är hög arbetsbelastning krävs att du är flexibel och stresstålig. Vi ser även att du är en god representant för Försvarsmakten och står bakom Försvarsmaktens värdegrund (se www.forsvarsmakten.se). Stor vikt kommer att läggas vid personlig lämplighet.\n\n \n\nÖvrigt\n\nAnställningsform: Tillsvidare, militär befattning, OR 8\n\nSysselsättningsgrad: Heltid\n Arbetsort: Såtenäs\n Tillträdesdatum: Enligt överenskommelse  \n\nTjänsten innebär krav på fysisk förmåga, genomförande av tjänsteresor, deltagande i utbildning och övning i krigsorganisationen.\n\nKontaktpersoner\n Vill du veta mer om befattningen är du välkommen att kontakta stabschef Jim Hallander, jim.hallander@mil.se\n \n\nFackliga företrädare: \n\nOfficersförbundet OFR/O, Jan Möller, tfn 0704 - 614 400\n Försvarsförbundet OFR/S, Per Gunnarsson, tfn 0510 - 47 77 08\n SACO, Ulf Svensson, tfn 0510 - 47 74 63\n SEKO, Erling Svensson, tfn 072 - 98 11 659\n \n Sista ansökningsdag\n\nVälkommen med din ansökan senast 2022-07-03. Din ansökan ska innehålla CV samt ansökningsbrev där vi vill att du motiverar varför du är lämpad för denna befattning.\n \n\n\n Ansökningar till denna befattning kommer endast tas emot via Försvarsmaktens webbplats. \n--------------------------------------------------------\nInformation om Försvarsmakten och det rekryterande förbandet:\n\nSkaraborgs flygflottilj är en mångsidig och unik flygflottilj. Här finns stridsflyg samt Försvarsmaktens samlade resurs av transport- och specialflyg. Vi genomför grund- och befattningsutbildning av pliktinkallade rekryter samt utbildar alla svenska och utländska Gripenpiloter. Förbandet deltar också i många insatser. I Sverige finns verksamheten på Såtenäs, Malmen, Arlanda och Karlsborg. Utomlands ansvarar vi för Gripensupporten i Thailand samt för den svenska personalen vid det internationella transportflygsamarbetet Heavy Airlift Wing i Ungern.\nLäs gärna mer på https://www.forsvarsmakten.se/f7\n\nVarje dag och varje timme gör våra medarbetare insatser som påverkar andra människors liv, både i stort och smått, och både på hemmaplan och runt om i världen.\n\nI Försvarsmakten finns en stark värdegrund som bygger på öppenhet, resultat och ansvar. Professionell utveckling och personlig hälsa värdesätts och uppmuntras. Det finns goda förutsättningar för intern karriärrörlighet, friskvård samt bra balans mellan arbete och privatliv.\n\nEn anställning hos oss innebär placering i säkerhetsklass. Vanligtvis krävs svenskt medborgarskap.\nSäkerhetsprövning med registerkontroll kommer att genomföras före anställning enligt 3 kap i säkerhetsskyddslagen. Med anställning följer en skyldighet att krigsplaceras. I anställningen ingår även en skyldighet att tjänstgöra utomlands. Innebörden av detta varierar beroende på typ av befattning.\n\nTill ansökan om anställning ska CV och personligt brev bifogas. Om du går vidare i anställningsprocessen ska alltid vidimerade kopior av betyg och intyg uppvisas.\n\nSamtal från externa rekryteringsföretag och säljare undanbedes."
}