{
  "meta" : {
    "jobad" : {
      "description" : {
        "requirements" : null,
        "needs" : null,
        "company_information" : null,
        "text_formatted" : "Utveckla kundupplevelsen för miljontals kunder som Lead Frontend Developer hos Länsförsäkringar AB! \n\nHos det kundägda bank- och försäkringsbolaget Länsförsäkringar blir du, i rollen som Lead Frontend Developer tekniskt ansvarig för vårt frontendramverk och designsystem. Här får du chansen att arbeta i en ledande roll med stort handlingsutrymme och möjligheten att påverka Länsförsäkringars kundupplevelse.\n\nVI ERBJUDER DIG\n\nHos oss står varje medarbetare i fokus samtidigt som vi tillsammans utvecklar Länsförsäkringars digitala kundupplevelse. Vårt ledarskap präglas av förtroende och tillit till individen.\n\nDu får:\n\n • Påverka på riktigt – både din roll och ditt ansvarsområde\n • En händelserik vardag där du har en nyckelroll inom design och kundupplevelse\n • Bygga gränssnitt som möter hundratusentals kunder samtidigt som du agerar länken mellan olika team\n • Arbeta både på distans och från kontoret med flexibla arbetstider. Vi tycker det är viktigt att man, som anställd hos oss, har rätt förutsättningar för att lägga sitt livspussel\n\nDET HÄR GÖR DU HOS OSS\n\nSom Lead Frontend Developer blir du en nyckelperson i våra digitala team. Vi arbetar agilt enligt SAFe och samarbetar tvärfunktionellt. I rollen ansvarar du för att utveckla Länsförsäkringars webbaserade komponentbibliotek, som sammanlänkar designen för all nyutveckling på kundmöteskanaler.\nDu kommer även att:\n\n • Utveckla och förvalta designsystemets CMS\n • Vara länken mellan, och jobba nära, våra interna och externa design- och utvecklingsteam\n • Arbeta med moderna tekniker som React och JavaScript\n • Balansera olika önskemål, stötta och agera bollplank i både implementering och i framtagandet av nya komponenter\n • Arbeta för att göra våra tjänster tillgängliga för alla oavsett funktionsvariationer\n\nDITT TEAM OCH ARBETSPLATS\n\nDu kommer att tillhöra enheten Kund och kanalstöd. Enheten är navet som syr ihop Länsförsäkringars affär med kundens behov. Här finns ett högt engagemang och en stark vilja att möjliggöra bra kundmöten genom kanaler och tjänster som hänger ihop. Vi brinner för kunden och för att skapa den bästa användarupplevelsen. Vi strävar efter ett agilt ledarskap och ger medarbetare ett stort förtroende samt mandat för att nå våra mål. I rollen arbetar du i nära samarbete tillsammans med utvecklingsteamen, design och UX. Länsförsäkringar har sitt kontor på Tegeluddsvägen i Stockholm.\n\nMER OM DIG\n\nVi söker dig som har några års erfarenhet av frontendutveckling och Javascript. Hos oss trivs du som tycker om att samarbeta, är proaktiv och kommer med egna initiativ. Du är målfokuserad och utforskar gärna nya arbetssätt och tekniker för att nå bäst resultat. Vidare förstår du komplexiteten i en större organisation samtidigt som du som person är lösningsfokuserad.\n\nSÅ HÄR FÅR VI KONTAKT\nI den här rekryteringen har vi valt att samarbeta med Ada Digital som strävar efter en transparent, inkluderande och snabbrörlig rekryteringsupplevelse. Vi vill veta mer om dig och din potential! Du söker tjänsten enkelt och behöver inte bifoga några dokument. Det räcker med en motivering till varför du söker tjänsten och om du saknar CV kan du bifoga din LinkedIn-profil. Följ sedan din ansökan live via vår hemsida. Urvalet sker löpande och tjänsten kan bli tillsatt före sista ansökningsdatum. Är du nyfiken och vill veta mer innan du söker? Hör av dig till ansvarig rekryterare. Vi ser fram emot att få kontakt med dig!",
        "conditions" : "Heltid\r\nTillsvidare",
        "text" : "Utveckla kundupplevelsen för miljontals kunder som Lead Frontend Developer hos Länsförsäkringar AB! \n\nHos det kundägda bank- och försäkringsbolaget Länsförsäkringar blir du, i rollen som Lead Frontend Developer tekniskt ansvarig för vårt frontendramverk och designsystem. Här får du chansen att arbeta i en ledande roll med stort handlingsutrymme och möjligheten att påverka Länsförsäkringars kundupplevelse.\n\nVI ERBJUDER DIG\n\nHos oss står varje medarbetare i fokus samtidigt som vi tillsammans utvecklar Länsförsäkringars digitala kundupplevelse. Vårt ledarskap präglas av förtroende och tillit till individen.\n\nDu får:\n\n • Påverka på riktigt – både din roll och ditt ansvarsområde\n • En händelserik vardag där du har en nyckelroll inom design och kundupplevelse\n • Bygga gränssnitt som möter hundratusentals kunder samtidigt som du agerar länken mellan olika team\n • Arbeta både på distans och från kontoret med flexibla arbetstider. Vi tycker det är viktigt att man, som anställd hos oss, har rätt förutsättningar för att lägga sitt livspussel\n\nDET HÄR GÖR DU HOS OSS\n\nSom Lead Frontend Developer blir du en nyckelperson i våra digitala team. Vi arbetar agilt enligt SAFe och samarbetar tvärfunktionellt. I rollen ansvarar du för att utveckla Länsförsäkringars webbaserade komponentbibliotek, som sammanlänkar designen för all nyutveckling på kundmöteskanaler.\nDu kommer även att:\n\n • Utveckla och förvalta designsystemets CMS\n • Vara länken mellan, och jobba nära, våra interna och externa design- och utvecklingsteam\n • Arbeta med moderna tekniker som React och JavaScript\n • Balansera olika önskemål, stötta och agera bollplank i både implementering och i framtagandet av nya komponenter\n • Arbeta för att göra våra tjänster tillgängliga för alla oavsett funktionsvariationer\n\nDITT TEAM OCH ARBETSPLATS\n\nDu kommer att tillhöra enheten Kund och kanalstöd. Enheten är navet som syr ihop Länsförsäkringars affär med kundens behov. Här finns ett högt engagemang och en stark vilja att möjliggöra bra kundmöten genom kanaler och tjänster som hänger ihop. Vi brinner för kunden och för att skapa den bästa användarupplevelsen. Vi strävar efter ett agilt ledarskap och ger medarbetare ett stort förtroende samt mandat för att nå våra mål. I rollen arbetar du i nära samarbete tillsammans med utvecklingsteamen, design och UX. Länsförsäkringar har sitt kontor på Tegeluddsvägen i Stockholm.\n\nMER OM DIG\n\nVi söker dig som har några års erfarenhet av frontendutveckling och Javascript. Hos oss trivs du som tycker om att samarbeta, är proaktiv och kommer med egna initiativ. Du är målfokuserad och utforskar gärna nya arbetssätt och tekniker för att nå bäst resultat. Vidare förstår du komplexiteten i en större organisation samtidigt som du som person är lösningsfokuserad.\n\nSÅ HÄR FÅR VI KONTAKT\nI den här rekryteringen har vi valt att samarbeta med Ada Digital som strävar efter en transparent, inkluderande och snabbrörlig rekryteringsupplevelse. Vi vill veta mer om dig och din potential! Du söker tjänsten enkelt och behöver inte bifoga några dokument. Det räcker med en motivering till varför du söker tjänsten och om du saknar CV kan du bifoga din LinkedIn-profil. Följ sedan din ansökan live via vår hemsida. Urvalet sker löpande och tjänsten kan bli tillsatt före sista ansökningsdatum. Är du nyfiken och vill veta mer innan du söker? Hör av dig till ansvarig rekryterare. Vi ser fram emot att få kontakt med dig!"
      },
      "headline" : "Lead Frontend Developer till Länsförsäkringar AB",
      "driving_license" : null,
      "employer" : {
        "email" : null,
        "phone_number" : null,
        "organization_number" : "5566482781",
        "name" : "Tng Group AB",
        "url" : "https://www.tng.se/",
        "workplace" : "TNG Group AB"
      },
      "removed_date" : null,
      "logo_url" : "https://www.arbetsformedlingen.se/rest/arbetsgivare/rest/af/v3/organisation/5566482781/logotyper/logo.png",
      "last_publication_date" : "2022-08-24T23:59:59",
      "number_of_vacancies" : 1,
      "occupation" : {
        "concept_id" : "GDHs_eoz_uKx",
        "label" : "Frontend-utvecklare",
        "legacy_ams_taxonomy_id" : "7633"
      },
      "occupation_group" : {
        "concept_id" : "DJh5_yyF_hEM",
        "label" : "Mjukvaru- och systemutvecklare m.fl.",
        "legacy_ams_taxonomy_id" : "2512"
      },
      "employment_type" : {
        "concept_id" : "PFZr_Syz_cUq",
        "label" : "Vanlig anställning",
        "legacy_ams_taxonomy_id" : "1"
      },
      "webpage_url" : "https://arbetsformedlingen.se/platsbanken/annonser/26349697",
      "driving_license_required" : false,
      "application_contacts" : [ {
        "description" : "Emil Lindberg",
        "email" : "emil.lindberg@adadigital.se",
        "telephone" : "0737450436",
        "name" : null,
        "contact_type" : "Talent Business Partner"
      } ],
      "duration" : {
        "concept_id" : "a7uU_j21_mkL",
        "label" : "Tills vidare",
        "legacy_ams_taxonomy_id" : "1"
      },
      "nice_to_have" : {
        "education_level" : [ ],
        "work_experiences" : [ ],
        "skills" : [ ],
        "education" : [ ],
        "languages" : [ ]
      },
      "application_details" : {
        "via_af" : false,
        "email" : null,
        "other" : null,
        "reference" : null,
        "url" : "https://adadigital.se/lediga-jobb?jid=F97E2002-46E8-473B-B3E2-A11F40E625BA&src=AMS",
        "information" : null
      },
      "source_type" : "VIA_PLATSBANKEN_DXA",
      "application_deadline" : "2022-08-24T23:59:59",
      "external_id" : "46-556648-2781-0000011095830CC178",
      "workplace_address" : {
        "coordinates" : [ 18.06858, 59.329323 ],
        "city" : null,
        "postcode" : null,
        "municipality" : "Stockholm",
        "region_concept_id" : "CifL_Rzy_Mku",
        "region" : "Stockholms län",
        "country_code" : "199",
        "region_code" : "01",
        "municipality_concept_id" : "AvNB_uwa_6n6",
        "country_concept_id" : "i46j_HmG_v64",
        "municipality_code" : "0180",
        "street_address" : null,
        "country" : "Sverige"
      },
      "id" : "26349697",
      "experience_required" : true,
      "working_hours_type" : {
        "concept_id" : "6YE1_gAC_R2G",
        "label" : "Heltid",
        "legacy_ams_taxonomy_id" : "1"
      },
      "access" : null,
      "timestamp" : 1658730714115,
      "must_have" : {
        "education_level" : [ ],
        "work_experiences" : [ {
          "concept_id" : "GDHs_eoz_uKx",
          "weight" : 10,
          "label" : "Frontend-utvecklare",
          "legacy_ams_taxonomy_id" : "7633"
        } ],
        "skills" : [ ],
        "education" : [ ],
        "languages" : [ ]
      },
      "occupation_field" : {
        "concept_id" : "apaJ_2ja_LuF",
        "label" : "Data/IT",
        "legacy_ams_taxonomy_id" : "3"
      },
      "scope_of_work" : {
        "min" : 100,
        "max" : 100
      },
      "salary_type" : {
        "concept_id" : "oG8G_9cW_nRf",
        "label" : "Fast månads- vecko- eller timlön",
        "legacy_ams_taxonomy_id" : "1"
      },
      "removed" : false,
      "salary_description" : "Fast lön",
      "access_to_own_car" : false,
      "publication_date" : "2022-07-25T08:31:54"
    },
    "name" : "Lead Frontend Developer till Länsförsäkringar AB",
    "user" : "hannes"
  },
  "sha1" : "68c783b691f99b20957fdd7c1ddf7b3150ffb892",
  "annotations" : [ {
    "preferred-label" : "Frontend-utvecklare",
    "type" : "occupation-name",
    "start-position" : 5,
    "end-position" : 23,
    "concept-id" : "GDHs_eoz_uKx",
    "matched-string" : "Frontend Developer",
    "annotation-id" : 6
  }, {
    "preferred-label" : "Frontend-utvecklare",
    "type" : "occupation-name",
    "start-position" : 105,
    "end-position" : 123,
    "concept-id" : "GDHs_eoz_uKx",
    "matched-string" : "Frontend Developer",
    "annotation-id" : 7
  }, {
    "preferred-label" : "Bank",
    "sentiment" : "MUST_HAVE",
    "type" : "keyword",
    "start-position" : 168,
    "end-position" : 172,
    "concept-id" : "xqgq_CRg_5mv",
    "matched-string" : "bank",
    "annotation-id" : 0
  }, {
    "preferred-label" : "Frontend-utvecklare",
    "type" : "occupation-name",
    "start-position" : 241,
    "end-position" : 259,
    "concept-id" : "GDHs_eoz_uKx",
    "matched-string" : "Frontend Developer",
    "annotation-id" : 8
  }, {
    "preferred-label" : "Frontend-utvecklare",
    "type" : "occupation-name",
    "start-position" : 1130,
    "end-position" : 1148,
    "concept-id" : "GDHs_eoz_uKx",
    "matched-string" : "Frontend Developer",
    "annotation-id" : 9
  }, {
    "preferred-label" : "Scaled Agile Framework, SAFe",
    "type" : "skill",
    "start-position" : 1219,
    "end-position" : 1223,
    "concept-id" : "eTW8_AY5_tpe",
    "matched-string" : "SAFe",
    "annotation-id" : 10
  }, {
    "preferred-label" : "VM/CMS, operativsystem",
    "type" : "skill",
    "start-position" : 1475,
    "end-position" : 1478,
    "concept-id" : "ZxHj_Wvj_39H",
    "matched-string" : "CMS",
    "annotation-id" : 11
  }, {
    "preferred-label" : "React native, programmeringsspråk",
    "type" : "skill",
    "start-position" : 1606,
    "end-position" : 1611,
    "concept-id" : "TdnY_1gB_9pZ",
    "matched-string" : "React",
    "annotation-id" : 12
  }, {
    "preferred-label" : "JavaScript, programmeringsspråk",
    "sentiment" : "MUST_HAVE",
    "type" : "skill",
    "start-position" : 1616,
    "end-position" : 1626,
    "concept-id" : "DHhX_uVf_y6X",
    "matched-string" : "javascript",
    "annotation-id" : 1
  }, {
    "preferred-label" : "User experience",
    "type" : "skill",
    "start-position" : 2370,
    "end-position" : 2372,
    "concept-id" : "AdgQ_txR_S3M",
    "matched-string" : "UX",
    "annotation-id" : 15
  }, {
    "preferred-label" : "Kontor",
    "type" : "keyword",
    "start-position" : 2400,
    "end-position" : 2406,
    "concept-id" : "Hyz1_7HF_AkP",
    "matched-string" : "kontor",
    "annotation-id" : 13
  }, {
    "preferred-label" : "Stockholm",
    "type" : "municipality",
    "start-position" : 2427,
    "end-position" : 2436,
    "concept-id" : "AvNB_uwa_6n6",
    "matched-string" : "Stockholm",
    "annotation-id" : 14
  }, {
    "preferred-label" : "Frontend-utvecklare",
    "type" : "occupation-name",
    "start-position" : 2496,
    "end-position" : 2514,
    "concept-id" : "GDHs_eoz_uKx",
    "matched-string" : "frontendutveckling",
    "annotation-id" : 16
  }, {
    "preferred-label" : "JavaScript, programmeringsspråk",
    "sentiment" : "MUST_HAVE",
    "type" : "skill",
    "start-position" : 2519,
    "end-position" : 2529,
    "concept-id" : "DHhX_uVf_y6X",
    "matched-string" : "javascript",
    "annotation-id" : 3
  } ],
  "text" : "Lead Frontend Developer till Länsförsäkringar AB\nUtveckla kundupplevelsen för miljontals kunder som Lead Frontend Developer hos Länsförsäkringar AB! \n\nHos det kundägda bank- och försäkringsbolaget Länsförsäkringar blir du, i rollen som Lead Frontend Developer tekniskt ansvarig för vårt frontendramverk och designsystem. Här får du chansen att arbeta i en ledande roll med stort handlingsutrymme och möjligheten att påverka Länsförsäkringars kundupplevelse.\n\nVI ERBJUDER DIG\n\nHos oss står varje medarbetare i fokus samtidigt som vi tillsammans utvecklar Länsförsäkringars digitala kundupplevelse. Vårt ledarskap präglas av förtroende och tillit till individen.\n\nDu får:\n\n • Påverka på riktigt – både din roll och ditt ansvarsområde\n • En händelserik vardag där du har en nyckelroll inom design och kundupplevelse\n • Bygga gränssnitt som möter hundratusentals kunder samtidigt som du agerar länken mellan olika team\n • Arbeta både på distans och från kontoret med flexibla arbetstider. Vi tycker det är viktigt att man, som anställd hos oss, har rätt förutsättningar för att lägga sitt livspussel\n\nDET HÄR GÖR DU HOS OSS\n\nSom Lead Frontend Developer blir du en nyckelperson i våra digitala team. Vi arbetar agilt enligt SAFe och samarbetar tvärfunktionellt. I rollen ansvarar du för att utveckla Länsförsäkringars webbaserade komponentbibliotek, som sammanlänkar designen för all nyutveckling på kundmöteskanaler.\nDu kommer även att:\n\n • Utveckla och förvalta designsystemets CMS\n • Vara länken mellan, och jobba nära, våra interna och externa design- och utvecklingsteam\n • Arbeta med moderna tekniker som React och JavaScript\n • Balansera olika önskemål, stötta och agera bollplank i både implementering och i framtagandet av nya komponenter\n • Arbeta för att göra våra tjänster tillgängliga för alla oavsett funktionsvariationer\n\nDITT TEAM OCH ARBETSPLATS\n\nDu kommer att tillhöra enheten Kund och kanalstöd. Enheten är navet som syr ihop Länsförsäkringars affär med kundens behov. Här finns ett högt engagemang och en stark vilja att möjliggöra bra kundmöten genom kanaler och tjänster som hänger ihop. Vi brinner för kunden och för att skapa den bästa användarupplevelsen. Vi strävar efter ett agilt ledarskap och ger medarbetare ett stort förtroende samt mandat för att nå våra mål. I rollen arbetar du i nära samarbete tillsammans med utvecklingsteamen, design och UX. Länsförsäkringar har sitt kontor på Tegeluddsvägen i Stockholm.\n\nMER OM DIG\n\nVi söker dig som har några års erfarenhet av frontendutveckling och Javascript. Hos oss trivs du som tycker om att samarbeta, är proaktiv och kommer med egna initiativ. Du är målfokuserad och utforskar gärna nya arbetssätt och tekniker för att nå bäst resultat. Vidare förstår du komplexiteten i en större organisation samtidigt som du som person är lösningsfokuserad.\n\nSÅ HÄR FÅR VI KONTAKT\nI den här rekryteringen har vi valt att samarbeta med Ada Digital som strävar efter en transparent, inkluderande och snabbrörlig rekryteringsupplevelse. Vi vill veta mer om dig och din potential! Du söker tjänsten enkelt och behöver inte bifoga några dokument. Det räcker med en motivering till varför du söker tjänsten och om du saknar CV kan du bifoga din LinkedIn-profil. Följ sedan din ansökan live via vår hemsida. Urvalet sker löpande och tjänsten kan bli tillsatt före sista ansökningsdatum. Är du nyfiken och vill veta mer innan du söker? Hör av dig till ansvarig rekryterare. Vi ser fram emot att få kontakt med dig!"
}