{
  "meta" : {
    "jobad" : {
      "description" : {
        "requirements" : null,
        "needs" : null,
        "company_information" : null,
        "text_formatted" : "Socialstyrelsen arbetar för en ändamålsenlig och strukturerad vård- och omsorgsdokumentation genom bland annat stöd till terminologi och klassificering i vård och omsorgsverksamheter. Enheten för klassifikationer och terminologi förvaltar och utvecklar nationella hälsorelaterade klassifikationer och Socialstyrelsens termbank. Arbetet bidrar till att den information som skapas i vård och omsorg är enhetlig, entydig och jämförbar. Till uppdraget söker vi nu en terminolog.\nVi söker dig som vill\n\n• projektleda begreppsutredningar inom fackområdet vård och omsorg\n• bidra som terminologiskt metodstöd i andra uppdrag på Socialstyrelsen\n• ge råd i terminologiska frågor\n• kvalitetssäkra och vidareutveckla Socialstyrelsens termbank\n• introducera och utbilda inom terminologiläran och de praktiska terminologiska arbetsmetoderna\n• bidra till att förankra och kommunicera mål och resultat från arbetet.\n\n Termbanken bidrar till att den information som skapas i vård och omsorg, eller som beskriver verksamheten, är enhetlig, entydig och jämförbar. Terminologiverksamheten stödjer också myndighetens arbete med bland annat kunskapsstöd, nationell uppföljning, stöd för enhetlig dokumentation i verksamheterna samt myndighetens uppdrag om regelgivning.\n \nArbetet sker enligt terminologiläran och den terminologiska standarden ISO 704:2009. Mål för arbetet är att termbankens innehåll är relevant, förankrat och använt, samt att stödet till användare inom hälso- och sjukvård och socialtjänst uppfattas som behovsorienterat.\nVi söker dig som har:\n\n• akademisk examen med språkvetenskaplig inriktning, som utbildning i lingvistik, svenska eller översättning, språkkonsultutbildning eller annan utbildning som myndigheten bedömer som likvärdig\n• goda kunskaper i svenska och engelska både muntligt och skriftligt.\n\nRollen innebär att du har en mängd kontakter både internt och externt vilket ställer krav på att du kan skapa och underhålla professionella relationer. En stor del av arbetet består i att leda en grupp med experter för att komma fram till ett gemensamt resultat, vilket innebär att du behöver vara pedagogisk och bra på att kommunicera. Det betyder också att du måste ha lätt för att se den större bilden och ta ansvar för att arbetet går i mål. Du besitter ett gott omdöme och en hög grad av personlig mognad. Vid rekryteringen kommer vi att lägga stor vikt vid dina personliga egenskaper.\nDet är dessutom meriterande om du har:\n\n• aktuell erfarenhet av att arbeta med begreppsanalys, definitionsskrivning och termval\n• erfarenhet av projektledning\n• arbetat med informatik\n• arbetat inom offentlig förvaltning\n• kunskap eller erfarenhet från arbete inom vård och omsorg.\n\nAnställningsinformation\nAnställningen är tillsvidare på heltid med provanställning på sex månader. Placeringen är på enheten för klassifikationer och terminologi på avdelningen för register och statistik i Stockholm. Din tjänstetitel är terminolog.\n \nVälkommen med din ansökan senast den 28 augusti. Du behöver inte bifoga något personligt brev men vi ber dig att svara på våra urvalsfrågor. Arbetsprov kan komma att användas i urvalet. Vi planerar att genomföra intervjuer under veckorna 34 och 35.\n \nSocialstyrelsen strävar efter en personalsammansättning som speglar samhällets mångfald. Vi erbjuder ett meningsfullt arbete och många kunniga kollegor som vill bidra till ett viktigt samhällsuppdrag. Vi erbjuder dessutom bra villkor för bland annat friskvård, flexibel arbetstid, semester och pension.\n \nOm du har frågor om tjänsten, kontakta tf enhetschef Magdalena Fresk. Vid frågor om rekryteringsprocessen, kontakta personalspecialist Carolina Alm. Fackliga företrädare är Carl-Erik Flodmark för SACO och Frida Ranft för ST. Samtliga nås på telefonnummer 075-247 30 00.\nOm Socialstyrelsen\n\nGod vård och omsorg bygger på kunskap. Därför finns vi. Socialstyrelsen är Sveriges kunskapsmyndighet för vård och omsorg. Genom samarbete, oberoende experter och pålitlig kunskap styr, stödjer och utvecklar vi hälso- och sjukvården och socialtjänsten. Det gör vi för att människor i Sverige ska få tillgång till god vård och omsorg på lika villkor, oavsett vem man är och var i landet man bor.",
        "conditions" : "Heltid/\r\nEj specificerat",
        "text" : "Socialstyrelsen arbetar för en ändamålsenlig och strukturerad vård- och omsorgsdokumentation genom bland annat stöd till terminologi och klassificering i vård och omsorgsverksamheter. Enheten för klassifikationer och terminologi förvaltar och utvecklar nationella hälsorelaterade klassifikationer och Socialstyrelsens termbank. Arbetet bidrar till att den information som skapas i vård och omsorg är enhetlig, entydig och jämförbar. Till uppdraget söker vi nu en terminolog.\nVi söker dig som vill\n\n• projektleda begreppsutredningar inom fackområdet vård och omsorg\n• bidra som terminologiskt metodstöd i andra uppdrag på Socialstyrelsen\n• ge råd i terminologiska frågor\n• kvalitetssäkra och vidareutveckla Socialstyrelsens termbank\n• introducera och utbilda inom terminologiläran och de praktiska terminologiska arbetsmetoderna\n• bidra till att förankra och kommunicera mål och resultat från arbetet.\n\n Termbanken bidrar till att den information som skapas i vård och omsorg, eller som beskriver verksamheten, är enhetlig, entydig och jämförbar. Terminologiverksamheten stödjer också myndighetens arbete med bland annat kunskapsstöd, nationell uppföljning, stöd för enhetlig dokumentation i verksamheterna samt myndighetens uppdrag om regelgivning.\n \nArbetet sker enligt terminologiläran och den terminologiska standarden ISO 704:2009. Mål för arbetet är att termbankens innehåll är relevant, förankrat och använt, samt att stödet till användare inom hälso- och sjukvård och socialtjänst uppfattas som behovsorienterat.\nVi söker dig som har:\n\n• akademisk examen med språkvetenskaplig inriktning, som utbildning i lingvistik, svenska eller översättning, språkkonsultutbildning eller annan utbildning som myndigheten bedömer som likvärdig\n• goda kunskaper i svenska och engelska både muntligt och skriftligt.\n\nRollen innebär att du har en mängd kontakter både internt och externt vilket ställer krav på att du kan skapa och underhålla professionella relationer. En stor del av arbetet består i att leda en grupp med experter för att komma fram till ett gemensamt resultat, vilket innebär att du behöver vara pedagogisk och bra på att kommunicera. Det betyder också att du måste ha lätt för att se den större bilden och ta ansvar för att arbetet går i mål. Du besitter ett gott omdöme och en hög grad av personlig mognad. Vid rekryteringen kommer vi att lägga stor vikt vid dina personliga egenskaper.\nDet är dessutom meriterande om du har:\n\n• aktuell erfarenhet av att arbeta med begreppsanalys, definitionsskrivning och termval\n• erfarenhet av projektledning\n• arbetat med informatik\n• arbetat inom offentlig förvaltning\n• kunskap eller erfarenhet från arbete inom vård och omsorg.\n\nAnställningsinformation\nAnställningen är tillsvidare på heltid med provanställning på sex månader. Placeringen är på enheten för klassifikationer och terminologi på avdelningen för register och statistik i Stockholm. Din tjänstetitel är terminolog.\n \nVälkommen med din ansökan senast den 28 augusti. Du behöver inte bifoga något personligt brev men vi ber dig att svara på våra urvalsfrågor. Arbetsprov kan komma att användas i urvalet. Vi planerar att genomföra intervjuer under veckorna 34 och 35.\n \nSocialstyrelsen strävar efter en personalsammansättning som speglar samhällets mångfald. Vi erbjuder ett meningsfullt arbete och många kunniga kollegor som vill bidra till ett viktigt samhällsuppdrag. Vi erbjuder dessutom bra villkor för bland annat friskvård, flexibel arbetstid, semester och pension.\n \nOm du har frågor om tjänsten, kontakta tf enhetschef Magdalena Fresk. Vid frågor om rekryteringsprocessen, kontakta personalspecialist Carolina Alm. Fackliga företrädare är Carl-Erik Flodmark för SACO och Frida Ranft för ST. Samtliga nås på telefonnummer 075-247 30 00.\nOm Socialstyrelsen\n\nGod vård och omsorg bygger på kunskap. Därför finns vi. Socialstyrelsen är Sveriges kunskapsmyndighet för vård och omsorg. Genom samarbete, oberoende experter och pålitlig kunskap styr, stödjer och utvecklar vi hälso- och sjukvården och socialtjänsten. Det gör vi för att människor i Sverige ska få tillgång till god vård och omsorg på lika villkor, oavsett vem man är och var i landet man bor."
      },
      "headline" : "Terminolog till Socialstyrelsen",
      "driving_license" : null,
      "employer" : {
        "email" : null,
        "phone_number" : null,
        "organization_number" : "2021000555",
        "name" : "Socialstyrelsen",
        "url" : "http://www.socialstyrelsen.se",
        "workplace" : "Socialstyrelsen"
      },
      "removed_date" : null,
      "logo_url" : null,
      "last_publication_date" : "2022-08-28T23:59:59",
      "number_of_vacancies" : 1,
      "occupation" : {
        "concept_id" : "4bqt_oWT_Jo8",
        "label" : "Lingvist",
        "legacy_ams_taxonomy_id" : "6038"
      },
      "occupation_group" : {
        "concept_id" : "PQDm_Z63_zst",
        "label" : "Översättare, tolkar och lingvister m.fl.",
        "legacy_ams_taxonomy_id" : "2643"
      },
      "employment_type" : {
        "concept_id" : "PFZr_Syz_cUq",
        "label" : "Vanlig anställning",
        "legacy_ams_taxonomy_id" : "1"
      },
      "webpage_url" : "https://arbetsformedlingen.se/platsbanken/annonser/26369302",
      "driving_license_required" : false,
      "application_contacts" : [ ],
      "duration" : {
        "concept_id" : "a7uU_j21_mkL",
        "label" : "Tills vidare",
        "legacy_ams_taxonomy_id" : "1"
      },
      "nice_to_have" : {
        "education_level" : [ ],
        "work_experiences" : [ ],
        "skills" : [ ],
        "education" : [ ],
        "languages" : [ ]
      },
      "application_details" : {
        "via_af" : false,
        "email" : null,
        "other" : null,
        "reference" : null,
        "url" : "https://www.socialstyrelsen.se/om-socialstyrelsen/jobba-hos-oss/lediga-jobb/?rmpage=job&rmjob=2904",
        "information" : null
      },
      "source_type" : "VIA_PLATSBANKEN_DXA",
      "application_deadline" : "2022-08-28T23:59:59",
      "external_id" : "46-202100-0555-2904",
      "workplace_address" : {
        "coordinates" : [ 18.06858, 59.329323 ],
        "city" : null,
        "postcode" : null,
        "municipality" : "Stockholm",
        "region_concept_id" : "CifL_Rzy_Mku",
        "region" : "Stockholms län",
        "country_code" : "199",
        "region_code" : "01",
        "municipality_concept_id" : "AvNB_uwa_6n6",
        "country_concept_id" : "i46j_HmG_v64",
        "municipality_code" : "0180",
        "street_address" : null,
        "country" : "Sverige"
      },
      "id" : "26369302",
      "experience_required" : true,
      "working_hours_type" : {
        "concept_id" : "6YE1_gAC_R2G",
        "label" : "Heltid",
        "legacy_ams_taxonomy_id" : "1"
      },
      "access" : null,
      "timestamp" : 1659365993802,
      "must_have" : {
        "education_level" : [ ],
        "work_experiences" : [ {
          "concept_id" : "4bqt_oWT_Jo8",
          "weight" : 10,
          "label" : "Lingvist",
          "legacy_ams_taxonomy_id" : "6038"
        } ],
        "skills" : [ ],
        "education" : [ ],
        "languages" : [ ]
      },
      "occupation_field" : {
        "concept_id" : "9puE_nYg_crq",
        "label" : "Kultur, media, design",
        "legacy_ams_taxonomy_id" : "11"
      },
      "scope_of_work" : {
        "min" : 100,
        "max" : 100
      },
      "salary_type" : {
        "concept_id" : "oG8G_9cW_nRf",
        "label" : "Fast månads- vecko- eller timlön",
        "legacy_ams_taxonomy_id" : "1"
      },
      "removed" : false,
      "salary_description" : "Månadslön",
      "access_to_own_car" : false,
      "publication_date" : "2022-08-01T16:59:53"
    },
    "name" : "Terminolog till Socialstyrelsen",
    "user" : "hannes"
  },
  "sha1" : "73f0745846747e380e13e10a58657d7ee38ee06d",
  "annotations" : [ {
    "preferred-label" : "Terminolog",
    "sentiment" : "MUST_HAVE",
    "type" : "occupation-name",
    "start-position" : 0,
    "end-position" : 10,
    "concept-id" : "m9vB_abw_GZ3",
    "matched-string" : "terminolog",
    "annotation-id" : 0
  }, {
    "preferred-label" : "terminologi",
    "type" : "esco-skill",
    "start-position" : 153,
    "end-position" : 164,
    "concept-id" : "jddE_6Q2_8L7",
    "matched-string" : "terminologi",
    "annotation-id" : 16
  }, {
    "preferred-label" : "terminologi",
    "type" : "esco-skill",
    "start-position" : 249,
    "end-position" : 260,
    "concept-id" : "jddE_6Q2_8L7",
    "matched-string" : "terminologi",
    "annotation-id" : 17
  }, {
    "preferred-label" : "Terminolog",
    "sentiment" : "MUST_HAVE",
    "type" : "occupation-name",
    "start-position" : 495,
    "end-position" : 505,
    "concept-id" : "m9vB_abw_GZ3",
    "matched-string" : "terminolog",
    "annotation-id" : 1
  }, {
    "preferred-label" : "projektledning",
    "type" : "esco-skill",
    "start-position" : 532,
    "end-position" : 543,
    "concept-id" : "PPNS_ZLX_YsQ",
    "matched-string" : "projektleda",
    "annotation-id" : 18
  }, {
    "preferred-label" : "terminologi",
    "type" : "esco-skill",
    "start-position" : 609,
    "end-position" : 623,
    "concept-id" : "jddE_6Q2_8L7",
    "matched-string" : "terminologiskt",
    "annotation-id" : 19
  }, {
    "preferred-label" : "terminologi",
    "type" : "esco-skill",
    "start-position" : 680,
    "end-position" : 694,
    "concept-id" : "jddE_6Q2_8L7",
    "matched-string" : "terminologiska",
    "annotation-id" : 20
  }, {
    "preferred-label" : "terminologi",
    "type" : "esco-skill",
    "start-position" : 795,
    "end-position" : 811,
    "concept-id" : "jddE_6Q2_8L7",
    "matched-string" : "terminologiläran",
    "annotation-id" : 21
  }, {
    "preferred-label" : "terminologi",
    "type" : "esco-skill",
    "start-position" : 829,
    "end-position" : 843,
    "concept-id" : "jddE_6Q2_8L7",
    "matched-string" : "terminologiska",
    "annotation-id" : 22
  }, {
    "preferred-label" : "terminologi",
    "type" : "esco-skill",
    "start-position" : 1078,
    "end-position" : 1101,
    "concept-id" : "jddE_6Q2_8L7",
    "matched-string" : "Terminologiverksamheten",
    "annotation-id" : 23
  }, {
    "preferred-label" : "Dokumentation",
    "sentiment" : "MUST_HAVE",
    "type" : "keyword",
    "start-position" : 1207,
    "end-position" : 1220,
    "concept-id" : "jodz_kWf_iKx",
    "matched-string" : "dokumentation",
    "annotation-id" : 2
  }, {
    "preferred-label" : "terminologi",
    "type" : "esco-skill",
    "start-position" : 1303,
    "end-position" : 1319,
    "concept-id" : "jddE_6Q2_8L7",
    "matched-string" : "terminologiläran",
    "annotation-id" : 24
  }, {
    "preferred-label" : "terminologi",
    "type" : "esco-skill",
    "start-position" : 1328,
    "end-position" : 1342,
    "concept-id" : "jddE_6Q2_8L7",
    "matched-string" : "terminologiska",
    "annotation-id" : 25
  }, {
    "preferred-label" : "Hälso- och sjukvård",
    "type" : "sni-level-2",
    "start-position" : 1483,
    "end-position" : 1502,
    "concept-id" : "KhNL_Quq_Xjk",
    "matched-string" : "hälso- och sjukvård",
    "annotation-id" : 26
  }, {
    "preferred-label" : "Yrkesbevis/examen",
    "sentiment" : "MUST_HAVE",
    "type" : "skill-headline",
    "start-position" : 1587,
    "end-position" : 1593,
    "concept-id" : "HjPN_99i_cFD",
    "matched-string" : "examen",
    "annotation-id" : 4
  }, {
    "preferred-label" : "Språkvetenskap, allmän",
    "type" : "keyword",
    "start-position" : 1598,
    "end-position" : 1615,
    "concept-id" : "f3A1_T3y_sb5",
    "matched-string" : "språkvetenskaplig",
    "annotation-id" : 27
  }, {
    "preferred-label" : "Lingvistik",
    "sentiment" : "MUST_HAVE",
    "type" : "keyword",
    "start-position" : 1645,
    "end-position" : 1655,
    "concept-id" : "xF6b_7aF_jRy",
    "matched-string" : "lingvistik",
    "annotation-id" : 5
  }, {
    "preferred-label" : "Svenska",
    "sentiment" : "MUST_HAVE",
    "type" : "language",
    "start-position" : 1657,
    "end-position" : 1664,
    "concept-id" : "zSLA_vw2_FXN",
    "matched-string" : "svenska",
    "annotation-id" : 6
  }, {
    "preferred-label" : "Översättning",
    "type" : "keyword",
    "start-position" : 1671,
    "end-position" : 1683,
    "concept-id" : "zabH_MvF_bXB",
    "matched-string" : "översättning",
    "annotation-id" : 28
  }, {
    "preferred-label" : "Språkkonsult",
    "type" : "occupation-name",
    "start-position" : 1685,
    "end-position" : 1697,
    "concept-id" : "arJK_xQM_qou",
    "matched-string" : "språkkonsult",
    "annotation-id" : 29
  }, {
    "preferred-label" : "Svenska",
    "sentiment" : "MUST_HAVE",
    "type" : "language",
    "start-position" : 1788,
    "end-position" : 1795,
    "concept-id" : "zSLA_vw2_FXN",
    "matched-string" : "svenska",
    "annotation-id" : 7
  }, {
    "preferred-label" : "Engelska",
    "sentiment" : "MUST_HAVE",
    "type" : "language",
    "start-position" : 1800,
    "end-position" : 1808,
    "concept-id" : "NVxJ_hLg_TYS",
    "matched-string" : "engelska",
    "annotation-id" : 8
  }, {
    "preferred-label" : "Begreppsanalys",
    "sentiment" : "MUST_HAVE",
    "type" : "skill",
    "start-position" : 2510,
    "end-position" : 2524,
    "concept-id" : "9jJ4_gL1_wjS",
    "matched-string" : "begreppsanalys",
    "annotation-id" : 9
  }, {
    "preferred-label" : "skriva definitioner",
    "type" : "esco-skill",
    "start-position" : 2526,
    "end-position" : 2546,
    "concept-id" : "yLYx_wod_QzF",
    "matched-string" : "definitionsskrivning",
    "annotation-id" : 30
  }, {
    "preferred-label" : "projektledning",
    "type" : "esco-skill",
    "start-position" : 2575,
    "end-position" : 2589,
    "concept-id" : "PPNS_ZLX_YsQ",
    "matched-string" : "projektledning",
    "annotation-id" : 31
  }, {
    "preferred-label" : "Informatik",
    "sentiment" : "MUST_HAVE",
    "type" : "keyword",
    "start-position" : 2604,
    "end-position" : 2614,
    "concept-id" : "jfgc_TbF_1pt",
    "matched-string" : "informatik",
    "annotation-id" : 10
  }, {
    "preferred-label" : "Offentlig förvaltning",
    "sentiment" : "MUST_HAVE",
    "type" : "keyword",
    "start-position" : 2630,
    "end-position" : 2651,
    "concept-id" : "dBcK_fLJ_PEj",
    "matched-string" : "offentlig förvaltning",
    "annotation-id" : 11
  }, {
    "preferred-label" : "Tillsvidareanställning (inkl. eventuell provanställning)",
    "type" : "employment-type",
    "start-position" : 2755,
    "end-position" : 2766,
    "concept-id" : "kpPX_CNN_gDU",
    "matched-string" : "tillsvidare",
    "annotation-id" : 32
  }, {
    "preferred-label" : "Heltid",
    "type" : "worktime-extent",
    "start-position" : 2770,
    "end-position" : 2776,
    "concept-id" : "6YE1_gAC_R2G",
    "matched-string" : "heltid",
    "annotation-id" : 33
  }, {
    "preferred-label" : "terminologi",
    "type" : "esco-skill",
    "start-position" : 2864,
    "end-position" : 2875,
    "concept-id" : "jddE_6Q2_8L7",
    "matched-string" : "terminologi",
    "annotation-id" : 34
  }, {
    "preferred-label" : "Statistik",
    "sentiment" : "MUST_HAVE",
    "type" : "sun-education-field-4",
    "start-position" : 2908,
    "end-position" : 2917,
    "concept-id" : "Duxp_geu_REg",
    "matched-string" : "statistik",
    "annotation-id" : 12
  }, {
    "preferred-label" : "Stockholm",
    "type" : "municipality",
    "start-position" : 2920,
    "end-position" : 2929,
    "concept-id" : "AvNB_uwa_6n6",
    "matched-string" : "Stockholm",
    "annotation-id" : 35
  }, {
    "preferred-label" : "Terminolog",
    "sentiment" : "MUST_HAVE",
    "type" : "occupation-name",
    "start-position" : 2951,
    "end-position" : 2961,
    "concept-id" : "m9vB_abw_GZ3",
    "matched-string" : "terminolog",
    "annotation-id" : 13
  }, {
    "preferred-label" : "Friskvård",
    "sentiment" : "MUST_HAVE",
    "type" : "keyword",
    "start-position" : 3466,
    "end-position" : 3475,
    "concept-id" : "yoHe_xjK_qjH",
    "matched-string" : "friskvård",
    "annotation-id" : 14
  }, {
    "preferred-label" : "Hälso",
    "sentiment" : "MUST_HAVE",
    "type" : "keyword",
    "start-position" : 4022,
    "end-position" : 4027,
    "concept-id" : "5TsD_dN8_Uco",
    "matched-string" : "hälso",
    "annotation-id" : 15
  } ],
  "text" : "Terminolog till Socialstyrelsen\nSocialstyrelsen arbetar för en ändamålsenlig och strukturerad vård- och omsorgsdokumentation genom bland annat stöd till terminologi och klassificering i vård och omsorgsverksamheter. Enheten för klassifikationer och terminologi förvaltar och utvecklar nationella hälsorelaterade klassifikationer och Socialstyrelsens termbank. Arbetet bidrar till att den information som skapas i vård och omsorg är enhetlig, entydig och jämförbar. Till uppdraget söker vi nu en terminolog.\nVi söker dig som vill\n\n• projektleda begreppsutredningar inom fackområdet vård och omsorg\n• bidra som terminologiskt metodstöd i andra uppdrag på Socialstyrelsen\n• ge råd i terminologiska frågor\n• kvalitetssäkra och vidareutveckla Socialstyrelsens termbank\n• introducera och utbilda inom terminologiläran och de praktiska terminologiska arbetsmetoderna\n• bidra till att förankra och kommunicera mål och resultat från arbetet.\n\n Termbanken bidrar till att den information som skapas i vård och omsorg, eller som beskriver verksamheten, är enhetlig, entydig och jämförbar. Terminologiverksamheten stödjer också myndighetens arbete med bland annat kunskapsstöd, nationell uppföljning, stöd för enhetlig dokumentation i verksamheterna samt myndighetens uppdrag om regelgivning.\n \nArbetet sker enligt terminologiläran och den terminologiska standarden ISO 704:2009. Mål för arbetet är att termbankens innehåll är relevant, förankrat och använt, samt att stödet till användare inom hälso- och sjukvård och socialtjänst uppfattas som behovsorienterat.\nVi söker dig som har:\n\n• akademisk examen med språkvetenskaplig inriktning, som utbildning i lingvistik, svenska eller översättning, språkkonsultutbildning eller annan utbildning som myndigheten bedömer som likvärdig\n• goda kunskaper i svenska och engelska både muntligt och skriftligt.\n\nRollen innebär att du har en mängd kontakter både internt och externt vilket ställer krav på att du kan skapa och underhålla professionella relationer. En stor del av arbetet består i att leda en grupp med experter för att komma fram till ett gemensamt resultat, vilket innebär att du behöver vara pedagogisk och bra på att kommunicera. Det betyder också att du måste ha lätt för att se den större bilden och ta ansvar för att arbetet går i mål. Du besitter ett gott omdöme och en hög grad av personlig mognad. Vid rekryteringen kommer vi att lägga stor vikt vid dina personliga egenskaper.\nDet är dessutom meriterande om du har:\n\n• aktuell erfarenhet av att arbeta med begreppsanalys, definitionsskrivning och termval\n• erfarenhet av projektledning\n• arbetat med informatik\n• arbetat inom offentlig förvaltning\n• kunskap eller erfarenhet från arbete inom vård och omsorg.\n\nAnställningsinformation\nAnställningen är tillsvidare på heltid med provanställning på sex månader. Placeringen är på enheten för klassifikationer och terminologi på avdelningen för register och statistik i Stockholm. Din tjänstetitel är terminolog.\n \nVälkommen med din ansökan senast den 28 augusti. Du behöver inte bifoga något personligt brev men vi ber dig att svara på våra urvalsfrågor. Arbetsprov kan komma att användas i urvalet. Vi planerar att genomföra intervjuer under veckorna 34 och 35.\n \nSocialstyrelsen strävar efter en personalsammansättning som speglar samhällets mångfald. Vi erbjuder ett meningsfullt arbete och många kunniga kollegor som vill bidra till ett viktigt samhällsuppdrag. Vi erbjuder dessutom bra villkor för bland annat friskvård, flexibel arbetstid, semester och pension.\n \nOm du har frågor om tjänsten, kontakta tf enhetschef Magdalena Fresk. Vid frågor om rekryteringsprocessen, kontakta personalspecialist Carolina Alm. Fackliga företrädare är Carl-Erik Flodmark för SACO och Frida Ranft för ST. Samtliga nås på telefonnummer 075-247 30 00.\nOm Socialstyrelsen\n\nGod vård och omsorg bygger på kunskap. Därför finns vi. Socialstyrelsen är Sveriges kunskapsmyndighet för vård och omsorg. Genom samarbete, oberoende experter och pålitlig kunskap styr, stödjer och utvecklar vi hälso- och sjukvården och socialtjänsten. Det gör vi för att människor i Sverige ska få tillgång till god vård och omsorg på lika villkor, oavsett vem man är och var i landet man bor."
}