{
  "meta" : {
    "jobad" : {
      "description" : {
        "requirements" : null,
        "needs" : null,
        "company_information" : null,
        "text_formatted" : "<p>På International Färgs moderna fabrik i Angered utanför Göteborg tillverkar vi ytskyddsfärger till broar, vindkraftverk, sportarenor med mera under varumärket International, vi är världsledande inom skyddsfärger. International Färg är sedan 1998 en del av AkzoNobel-koncernen. På anläggningen finns även sälj- och marknadskontor för våra tre affärsområden: Marine &amp; Protective, Yacht och Powder Coatings i Norden. Vi är cirka 150 stolta medarbetare som tillsammans representerar ett stort antal olika nationaliteter, tillsammans arbetar vi för att göra vår värld lite mer färgglad.</p><p><em>Är du praktiskt lagd, har en hög ansvarskänsla och intresserad av ett jobb inom industrin? Då är du kanske vår nästa medarbetare till vår fabrik i Angered!</em></p><p><strong>Vad kommer du att arbeta med?  </strong>                                                                     </p><p>Som produktionspersonal hos oss arbetar du tillsammans i team med att säkerställa att produktionen går så smidigt som möjligt. Du kommer att arbeta med satsning eller tappning av färg, där också viss truckkörning förekommer. </p><p>De huvudsakliga arbetsuppgifterna är:</p><p>• Övervaka maskiner vid tillverkning av målarfärg och åtgärda problematik som kan uppstå.</p><p>• Blanda (satsa) kemiska tillsatser för att tillverka färgen.</p><p>• Tappa upp färg för att färdigställa produkten.</p><p>• Truckkörning, med såväl inkörning av produkter som lastning och lossning.</p><p>Tjänsten är en tillsvidareanställning med provanställning i 6 månader. Du kommer att arbeta 2 -skift och vara placerad på siten i Angered.  </p><p><strong>Vem är du?                                                                                </strong></p><p>För att vara framgångsrik i denna roll krävs att du gillar praktiskt arbete, du drivs av att lösa problem och har ett intresse för industrin. Som person är du positiv, öppen och gillar att arbeta. Arbetet kommer att ske både självständigt och i team, vilket ställer krav på god samarbetsförmåga och initiativtagande. </p><p> Vi ser gärna att du:</p><p>• Har en avslutad gymnasieutbildning med godkända betyg.</p><p>• Gillar att arbeta praktiskt där du får använda kroppen i arbetet.</p><p>• Kunna arbeta i en miljö som ställer hårda krav på säkerhet och miljö.</p><p>• Talar flytande i det svenska språket.</p><p>• Meriterande men inte ett krav är truckkort/tidigare erfarenhet från industrin.</p><p><strong>Vad erbjuder AkzoNobel?  </strong>                                                              </p><p>Hos oss på AkzoNobel möts du av en varm och välkomnande atmosfär, där vi tillsammans arbetar för att ständigt nå målet att vara världsledande inom färg- och ytbehandlingar. Med fokus på mångfald och innovation arbetar vi aktivt med våra medarbetare för att du ska trivas och utvecklas kontinuerligt. Detta ligger även till grund för att vi är utnämnda till ett av Sveriges Karriärföretag 2022. Vi erbjuder dig en internationell arbetsmiljö där du får ta dig an givande och utmanande projekt som vidgar dina sinnen och utmanar din företagsamhet. Du kommer att arbeta med kompetenta och likasinnade kollegor som delar din inställning och entusiasm. Välkommen till oss!</p><p><strong>Din ansökan </strong>                                                                     </p><p>Vi välkomnar människor från alla olika bakgrund som ser hållbarhet, säkerhet och integritet som viktiga principer. Om du har en passion för färg, ta då steget och lämna in din ansökan redan idag för din chans att få jobba tillsammans med oss! </p><p>Vi använder oss av löpande urval och tjänsten kan komma att tillsättas innan sista ansökningsdatum.</p><p>För ytterligare information om tjänsten, vänligen kontakta Ingrid Mattsson, Department Manager, ingrid.mattsson@akzonobel.com</p><p>För mer information om rekryteringsprocessen, vänligen kontakta Ami Sandberg, Talent Acquisition Partner, +46 730 33 69 62.</p>",
        "conditions" : null,
        "text" : "På International Färgs moderna fabrik i Angered utanför Göteborg tillverkar vi ytskyddsfärger till broar, vindkraftverk, sportarenor med mera under varumärket International, vi är världsledande inom skyddsfärger. International Färg är sedan 1998 en del av AkzoNobel-koncernen. På anläggningen finns även sälj- och marknadskontor för våra tre affärsområden: Marine & Protective, Yacht och Powder Coatings i Norden. Vi är cirka 150 stolta medarbetare som tillsammans representerar ett stort antal olika nationaliteter, tillsammans arbetar vi för att göra vår värld lite mer färgglad.\nÄr du praktiskt lagd, har en hög ansvarskänsla och intresserad av ett jobb inom industrin? Då är du kanske vår nästa medarbetare till vår fabrik i Angered!\nVad kommer du att arbeta med?   \nSom produktionspersonal hos oss arbetar du tillsammans i team med att säkerställa att produktionen går så smidigt som möjligt. Du kommer att arbeta med satsning eller tappning av färg, där också viss truckkörning förekommer. \nDe huvudsakliga arbetsuppgifterna är:\n• Övervaka maskiner vid tillverkning av målarfärg och åtgärda problematik som kan uppstå.\n• Blanda (satsa) kemiska tillsatser för att tillverka färgen.\n• Tappa upp färg för att färdigställa produkten.\n• Truckkörning, med såväl inkörning av produkter som lastning och lossning.\nTjänsten är en tillsvidareanställning med provanställning i 6 månader. Du kommer att arbeta 2 -skift och vara placerad på siten i Angered.  \nVem är du?                                                                                \nFör att vara framgångsrik i denna roll krävs att du gillar praktiskt arbete, du drivs av att lösa problem och har ett intresse för industrin. Som person är du positiv, öppen och gillar att arbeta. Arbetet kommer att ske både självständigt och i team, vilket ställer krav på god samarbetsförmåga och initiativtagande. \n Vi ser gärna att du:\n• Har en avslutad gymnasieutbildning med godkända betyg.\n• Gillar att arbeta praktiskt där du får använda kroppen i arbetet.\n• Kunna arbeta i en miljö som ställer hårda krav på säkerhet och miljö.\n• Talar flytande i det svenska språket.\n• Meriterande men inte ett krav är truckkort/tidigare erfarenhet från industrin.\nVad erbjuder AkzoNobel?   \nHos oss på AkzoNobel möts du av en varm och välkomnande atmosfär, där vi tillsammans arbetar för att ständigt nå målet att vara världsledande inom färg- och ytbehandlingar. Med fokus på mångfald och innovation arbetar vi aktivt med våra medarbetare för att du ska trivas och utvecklas kontinuerligt. Detta ligger även till grund för att vi är utnämnda till ett av Sveriges Karriärföretag 2022. Vi erbjuder dig en internationell arbetsmiljö där du får ta dig an givande och utmanande projekt som vidgar dina sinnen och utmanar din företagsamhet. Du kommer att arbeta med kompetenta och likasinnade kollegor som delar din inställning och entusiasm. Välkommen till oss!\nDin ansökan  \nVi välkomnar människor från alla olika bakgrund som ser hållbarhet, säkerhet och integritet som viktiga principer. Om du har en passion för färg, ta då steget och lämna in din ansökan redan idag för din chans att få jobba tillsammans med oss! \nVi använder oss av löpande urval och tjänsten kan komma att tillsättas innan sista ansökningsdatum.\nFör ytterligare information om tjänsten, vänligen kontakta Ingrid Mattsson, Department Manager, ingrid.mattsson@akzonobel.com\nFör mer information om rekryteringsprocessen, vänligen kontakta Ami Sandberg, Talent Acquisition Partner, +46 730 33 69 62."
      },
      "headline" : "Tappare ",
      "driving_license" : null,
      "employer" : {
        "email" : null,
        "phone_number" : null,
        "organization_number" : "5564949666",
        "name" : "International Färg AB",
        "url" : null,
        "workplace" : "International Färg AB"
      },
      "removed_date" : null,
      "logo_url" : "https://www.arbetsformedlingen.se/rest/arbetsgivare/rest/af/v3/arbetsplatser/82388854/logotyper/logo.png",
      "last_publication_date" : "2022-08-23T23:59:59",
      "number_of_vacancies" : 1,
      "occupation" : {
        "concept_id" : "Ym1L_d8s_cad",
        "label" : "Produktionsassistent",
        "legacy_ams_taxonomy_id" : "6168"
      },
      "occupation_group" : {
        "concept_id" : "PH2M_uV4_r72",
        "label" : "Inspicienter och scriptor m.fl.",
        "legacy_ams_taxonomy_id" : "3433"
      },
      "employment_type" : {
        "concept_id" : "PFZr_Syz_cUq",
        "label" : "Vanlig anställning",
        "legacy_ams_taxonomy_id" : "1"
      },
      "webpage_url" : "https://arbetsformedlingen.se/platsbanken/annonser/26354818",
      "driving_license_required" : false,
      "application_contacts" : [ ],
      "duration" : {
        "concept_id" : "a7uU_j21_mkL",
        "label" : "Tills vidare",
        "legacy_ams_taxonomy_id" : "1"
      },
      "nice_to_have" : {
        "education_level" : [ ],
        "work_experiences" : [ {
          "concept_id" : "Ym1L_d8s_cad",
          "weight" : 5,
          "label" : "Produktionsassistent",
          "legacy_ams_taxonomy_id" : "6168"
        } ],
        "skills" : [ {
          "concept_id" : "pGts_PKK_c8W",
          "weight" : 5,
          "label" : "Truckvana",
          "legacy_ams_taxonomy_id" : "601084"
        } ],
        "education" : [ ],
        "languages" : [ {
          "concept_id" : "NVxJ_hLg_TYS",
          "weight" : 5,
          "label" : "Engelska",
          "legacy_ams_taxonomy_id" : "283"
        } ]
      },
      "application_details" : {
        "via_af" : false,
        "email" : null,
        "other" : null,
        "reference" : null,
        "url" : "https://performancemanager5.successfactors.eu/sf/jobreq?jobId=24822&company=akzonobelsP2",
        "information" : null
      },
      "source_type" : "VIA_ANNONSERA",
      "application_deadline" : "2022-08-23T23:59:59",
      "external_id" : null,
      "workplace_address" : {
        "coordinates" : [ 12.04424995736961, 57.79263393863345 ],
        "city" : "GUNNILSE",
        "postcode" : "42422",
        "municipality" : "Göteborg",
        "region_concept_id" : "zdoY_6u5_Krt",
        "region" : "Västra Götalands län",
        "country_code" : "199",
        "region_code" : "14",
        "municipality_concept_id" : "PVZL_BQT_XtL",
        "country_concept_id" : "i46j_HmG_v64",
        "municipality_code" : "1480",
        "street_address" : "HOLMEDALEN 3",
        "country" : "Sverige"
      },
      "id" : "26354818",
      "experience_required" : true,
      "working_hours_type" : {
        "concept_id" : "6YE1_gAC_R2G",
        "label" : "Heltid",
        "legacy_ams_taxonomy_id" : "1"
      },
      "access" : null,
      "timestamp" : 1658833840282,
      "must_have" : {
        "education_level" : [ ],
        "work_experiences" : [ ],
        "skills" : [ ],
        "education" : [ ],
        "languages" : [ {
          "concept_id" : "zSLA_vw2_FXN",
          "weight" : 10,
          "label" : "Svenska",
          "legacy_ams_taxonomy_id" : "502"
        } ]
      },
      "occupation_field" : {
        "concept_id" : "9puE_nYg_crq",
        "label" : "Kultur, media, design",
        "legacy_ams_taxonomy_id" : "11"
      },
      "scope_of_work" : {
        "min" : 0,
        "max" : 100
      },
      "salary_type" : {
        "concept_id" : "oG8G_9cW_nRf",
        "label" : "Fast månads- vecko- eller timlön",
        "legacy_ams_taxonomy_id" : "1"
      },
      "removed" : false,
      "salary_description" : null,
      "access_to_own_car" : false,
      "publication_date" : "2022-07-26T13:10:40"
    },
    "name" : "Tappare ",
    "user" : "kristof.fischer"
  },
  "sha1" : "4a28b19210774631e7c30681263253143cdfe23d",
  "annotations" : [ {
    "preferred-label" : null,
    "type" : "occupation-name",
    "start-position" : 0,
    "end-position" : 7,
    "concept-id" : null,
    "matched-string" : "Tappare",
    "annotation-id" : 12
  }, {
    "preferred-label" : "Göteborg",
    "type" : "municipality",
    "start-position" : 65,
    "end-position" : 73,
    "concept-id" : "PVZL_BQT_XtL",
    "matched-string" : "Göteborg",
    "annotation-id" : 13
  }, {
    "preferred-label" : "Produktionsassistent",
    "type" : "occupation-name",
    "start-position" : 784,
    "end-position" : 803,
    "concept-id" : "Ym1L_d8s_cad",
    "matched-string" : "produktionspersonal",
    "annotation-id" : 14
  }, {
    "preferred-label" : "Färg/Kemikalieprodukter/Tapeter",
    "sentiment" : "MUST_HAVE",
    "type" : "skill",
    "start-position" : 932,
    "end-position" : 963,
    "concept-id" : "fyJi_1k3_CdV",
    "matched-string" : "satsning eller tappning av färg",
    "annotation-id" : 15
  }, {
    "preferred-label" : "Truckvana",
    "sentiment" : "MUST_HAVE",
    "type" : "skill",
    "start-position" : 980,
    "end-position" : 992,
    "concept-id" : "pGts_PKK_c8W",
    "matched-string" : "truckkörning",
    "annotation-id" : 16
  }, {
    "preferred-label" : "Tillsvidareanställning (inkl. eventuell provanställning)",
    "type" : "employment-type",
    "start-position" : 1336,
    "end-position" : 1358,
    "concept-id" : "kpPX_CNN_gDU",
    "matched-string" : "tillsvidareanställning",
    "annotation-id" : 17
  }, {
    "preferred-label" : "Skiftarbete",
    "type" : "work-place-environment",
    "start-position" : 1406,
    "end-position" : 1421,
    "concept-id" : "YnG9_nVP_CsZ",
    "matched-string" : "arbeta 2 -skift",
    "annotation-id" : 18
  }, {
    "preferred-label" : "hitta lösningar på problem",
    "sentiment" : "MUST_HAVE",
    "type" : "esco-skill",
    "start-position" : 1646,
    "end-position" : 1658,
    "concept-id" : "WFSY_Bwt_QWE",
    "matched-string" : "lösa problem",
    "annotation-id" : 19
  }, {
    "preferred-label" : "arbeta självständigt",
    "sentiment" : "MUST_HAVE",
    "type" : "esco-skill",
    "start-position" : 1778,
    "end-position" : 1791,
    "concept-id" : "NyFu_HHd_zhz",
    "matched-string" : "självständigt",
    "annotation-id" : 20
  }, {
    "preferred-label" : "arbeta som ett team",
    "sentiment" : "MUST_HAVE",
    "type" : "esco-skill",
    "start-position" : 1798,
    "end-position" : 1802,
    "concept-id" : "VFVZ_4YG_Ydi",
    "matched-string" : "team",
    "annotation-id" : 21
  }, {
    "preferred-label" : "samarbeta med kolleger",
    "sentiment" : "MUST_HAVE",
    "type" : "esco-skill",
    "start-position" : 1831,
    "end-position" : 1847,
    "concept-id" : "X15R_797_q62",
    "matched-string" : "samarbetsförmåga",
    "annotation-id" : 22
  }, {
    "preferred-label" : "Gymnasial utbildning",
    "sentiment" : "MUST_HAVE",
    "type" : "sni-level-3",
    "start-position" : 1911,
    "end-position" : 1929,
    "concept-id" : "t8bn_FTn_FiG",
    "matched-string" : "gymnasieutbildning",
    "annotation-id" : 23
  }, {
    "preferred-label" : "Svenska",
    "sentiment" : "MUST_HAVE",
    "type" : "language",
    "start-position" : 2113,
    "end-position" : 2128,
    "concept-id" : "zSLA_vw2_FXN",
    "matched-string" : "svenska språket",
    "annotation-id" : 6
  }, {
    "preferred-label" : "Truckvana",
    "sentiment" : "NICE_TO_HAVE",
    "type" : "skill",
    "start-position" : 2165,
    "end-position" : 2174,
    "concept-id" : "pGts_PKK_c8W",
    "matched-string" : "truckkort",
    "annotation-id" : 24
  }, {
    "preferred-label" : "1-2 års erfarenhet",
    "sentiment" : "NICE_TO_HAVE",
    "type" : "occupation-experience-year",
    "start-position" : 2175,
    "end-position" : 2209,
    "concept-id" : "LLnd_5GJ_4ju",
    "matched-string" : "tidigare erfarenhet från industrin",
    "annotation-id" : 25
  } ],
  "text" : "Tappare \nPå International Färgs moderna fabrik i Angered utanför Göteborg tillverkar vi ytskyddsfärger till broar, vindkraftverk, sportarenor med mera under varumärket International, vi är världsledande inom skyddsfärger. International Färg är sedan 1998 en del av AkzoNobel-koncernen. På anläggningen finns även sälj- och marknadskontor för våra tre affärsområden: Marine & Protective, Yacht och Powder Coatings i Norden. Vi är cirka 150 stolta medarbetare som tillsammans representerar ett stort antal olika nationaliteter, tillsammans arbetar vi för att göra vår värld lite mer färgglad.\nÄr du praktiskt lagd, har en hög ansvarskänsla och intresserad av ett jobb inom industrin? Då är du kanske vår nästa medarbetare till vår fabrik i Angered!\nVad kommer du att arbeta med?   \nSom produktionspersonal hos oss arbetar du tillsammans i team med att säkerställa att produktionen går så smidigt som möjligt. Du kommer att arbeta med satsning eller tappning av färg, där också viss truckkörning förekommer. \nDe huvudsakliga arbetsuppgifterna är:\n• Övervaka maskiner vid tillverkning av målarfärg och åtgärda problematik som kan uppstå.\n• Blanda (satsa) kemiska tillsatser för att tillverka färgen.\n• Tappa upp färg för att färdigställa produkten.\n• Truckkörning, med såväl inkörning av produkter som lastning och lossning.\nTjänsten är en tillsvidareanställning med provanställning i 6 månader. Du kommer att arbeta 2 -skift och vara placerad på siten i Angered.  \nVem är du?                                                                                \nFör att vara framgångsrik i denna roll krävs att du gillar praktiskt arbete, du drivs av att lösa problem och har ett intresse för industrin. Som person är du positiv, öppen och gillar att arbeta. Arbetet kommer att ske både självständigt och i team, vilket ställer krav på god samarbetsförmåga och initiativtagande. \n Vi ser gärna att du:\n• Har en avslutad gymnasieutbildning med godkända betyg.\n• Gillar att arbeta praktiskt där du får använda kroppen i arbetet.\n• Kunna arbeta i en miljö som ställer hårda krav på säkerhet och miljö.\n• Talar flytande i det svenska språket.\n• Meriterande men inte ett krav är truckkort/tidigare erfarenhet från industrin.\nVad erbjuder AkzoNobel?   \nHos oss på AkzoNobel möts du av en varm och välkomnande atmosfär, där vi tillsammans arbetar för att ständigt nå målet att vara världsledande inom färg- och ytbehandlingar. Med fokus på mångfald och innovation arbetar vi aktivt med våra medarbetare för att du ska trivas och utvecklas kontinuerligt. Detta ligger även till grund för att vi är utnämnda till ett av Sveriges Karriärföretag 2022. Vi erbjuder dig en internationell arbetsmiljö där du får ta dig an givande och utmanande projekt som vidgar dina sinnen och utmanar din företagsamhet. Du kommer att arbeta med kompetenta och likasinnade kollegor som delar din inställning och entusiasm. Välkommen till oss!\nDin ansökan  \nVi välkomnar människor från alla olika bakgrund som ser hållbarhet, säkerhet och integritet som viktiga principer. Om du har en passion för färg, ta då steget och lämna in din ansökan redan idag för din chans att få jobba tillsammans med oss! \nVi använder oss av löpande urval och tjänsten kan komma att tillsättas innan sista ansökningsdatum.\nFör ytterligare information om tjänsten, vänligen kontakta Ingrid Mattsson, Department Manager, ingrid.mattsson@akzonobel.com\nFör mer information om rekryteringsprocessen, vänligen kontakta Ami Sandberg, Talent Acquisition Partner, +46 730 33 69 62."
}