{
  "meta" : {
    "jobad" : {
      "description" : {
        "requirements" : null,
        "needs" : null,
        "company_information" : null,
        "text_formatted" : "<p>Som instruktör/hästskötare hos oss arbetar du tillsammans med kollegor i ett arbetslag för hästutbildningen. Arbetet innebär till stor del i att instruera elever i olika praktiska moment som t.ex. stallskötsel, hästhantering och anläggningsskötsel.</p><p>Utöver det kommer du även jobba självständigt med dagliga rutiner i skolstallet och häst-anläggningen samt vara delaktig i hästarnas träning och utbildning.</p><p>Hästutbildningen på Lillerud är treårig, med inriktning mot ridning eller trav. Vi har också en Nationell idrottsutbildning i hoppning och dressyr (NIU). Intresset för våra utbildningar är stort, och ca 100 elever läser för närvarande på hästinriktningen. Vi har en fin hästanläggning och i ett lösdriftsstall föder vi upp unghästar av svenskt varmblod, i liten skala.</p><p>Omfattningen är på 100% och helgarbete förekommer.</p><p>Tjänsten är en tillsvidareanställning med tillträde den 5 september 2022 alternativt efter överenskommelse.</p><p>Om dig</p><p>Vi söker dig som är har naturbruksutbildning och hästskötarexamen.</p><p>Meriterande är om du är ridledare eller har motsvarande utbildning samt tidigare arbetslivserfarenhet inom yrket.</p><p>En förutsättning är att du har ett stort intresse för att lära ut och sätter elevens utveckling i första hand.</p><p>Vi tror att du är flexibel, ansvarstagande och har god samarbetsförmåga.</p><p>B-körkort är ett krav.</p><p>Om Lillerudsgymnasiet</p><p>På Lillerud studerar cirka 280 elever. På skolan bedriver vi gymnasieutbildning inom Naturbruksprogrammet med inriktningarna: hästhållning, djurvård, lantbruk och naturvetenskap. Lillerudsgymnasiet är en friskola med riksintag och ungefär 75 % av eleverna bor på skolans elevhem. Det skapar en härlig familjär känsla på skolan.</p><p>Lillerudsgymnasiet ligger vackert beläget 15 km väster om Karlstad. Vi har ett stort skoljordbruk med kor, grisar och får, en komplett  häst-anläggning med två fina ridhus samt ett travstall inne på Färjestads travbana. Vi har även veterinär, hunddagis samt ett smådjurshus med många olika sällskapsdjur.</p><p>Vill du veta mer besök www.lillerud.se eller vår Facebooksida ”Lillerudsgymnasiet”.</p><p>Välkommen med din ansökan.</p><p>Lön:</p><p>Individuell lönesättning tillämpas. Ange löneanspråk.</p><p>Intervjuer kan komma att ske löpande.</p>",
        "conditions" : null,
        "text" : "Som instruktör/hästskötare hos oss arbetar du tillsammans med kollegor i ett arbetslag för hästutbildningen. Arbetet innebär till stor del i att instruera elever i olika praktiska moment som t.ex. stallskötsel, hästhantering och anläggningsskötsel.\nUtöver det kommer du även jobba självständigt med dagliga rutiner i skolstallet och häst-anläggningen samt vara delaktig i hästarnas träning och utbildning.\nHästutbildningen på Lillerud är treårig, med inriktning mot ridning eller trav. Vi har också en Nationell idrottsutbildning i hoppning och dressyr (NIU). Intresset för våra utbildningar är stort, och ca 100 elever läser för närvarande på hästinriktningen. Vi har en fin hästanläggning och i ett lösdriftsstall föder vi upp unghästar av svenskt varmblod, i liten skala.\nOmfattningen är på 100% och helgarbete förekommer.\nTjänsten är en tillsvidareanställning med tillträde den 5 september 2022 alternativt efter överenskommelse.\nOm dig\nVi söker dig som är har naturbruksutbildning och hästskötarexamen.\nMeriterande är om du är ridledare eller har motsvarande utbildning samt tidigare arbetslivserfarenhet inom yrket.\nEn förutsättning är att du har ett stort intresse för att lära ut och sätter elevens utveckling i första hand.\nVi tror att du är flexibel, ansvarstagande och har god samarbetsförmåga.\nB-körkort är ett krav.\nOm Lillerudsgymnasiet\nPå Lillerud studerar cirka 280 elever. På skolan bedriver vi gymnasieutbildning inom Naturbruksprogrammet med inriktningarna: hästhållning, djurvård, lantbruk och naturvetenskap. Lillerudsgymnasiet är en friskola med riksintag och ungefär 75 % av eleverna bor på skolans elevhem. Det skapar en härlig familjär känsla på skolan.\nLillerudsgymnasiet ligger vackert beläget 15 km väster om Karlstad. Vi har ett stort skoljordbruk med kor, grisar och får, en komplett  häst-anläggning med två fina ridhus samt ett travstall inne på Färjestads travbana. Vi har även veterinär, hunddagis samt ett smådjurshus med många olika sällskapsdjur.\nVill du veta mer besök www.lillerud.se eller vår Facebooksida ”Lillerudsgymnasiet”.\nVälkommen med din ansökan.\nLön:\nIndividuell lönesättning tillämpas. Ange löneanspråk.\nIntervjuer kan komma att ske löpande."
      },
      "headline" : "Instruktör-Hästskötare",
      "driving_license" : [ {
        "concept_id" : "VTK8_WRx_GcM",
        "label" : "B",
        "legacy_ams_taxonomy_id" : "3"
      } ],
      "employer" : {
        "email" : null,
        "phone_number" : null,
        "organization_number" : "5566243548",
        "name" : "Lillerudsgymnasiet AB",
        "url" : "www.lillerud.se",
        "workplace" : "LILLERUDSGYMNASIET"
      },
      "removed_date" : null,
      "logo_url" : null,
      "last_publication_date" : "2022-08-21T23:59:59",
      "number_of_vacancies" : 1,
      "occupation" : {
        "concept_id" : "JMd5_2p6_zQt",
        "label" : "Djurskötare, häst",
        "legacy_ams_taxonomy_id" : "6281"
      },
      "occupation_group" : {
        "concept_id" : "KYmy_iqC_xiQ",
        "label" : "Uppfödare och skötare av lantbrukets husdjur",
        "legacy_ams_taxonomy_id" : "6121"
      },
      "employment_type" : {
        "concept_id" : "PFZr_Syz_cUq",
        "label" : "Vanlig anställning",
        "legacy_ams_taxonomy_id" : "1"
      },
      "webpage_url" : "https://arbetsformedlingen.se/platsbanken/annonser/26367981",
      "driving_license_required" : true,
      "application_contacts" : [ {
        "description" : null,
        "email" : "jenny.erixon@lillerud.se",
        "telephone" : "070-650 52 39",
        "name" : "Jenny Erixon",
        "contact_type" : "Stallchef"
      }, {
        "description" : null,
        "email" : "kristian.fjellstrom@lillerud.se",
        "telephone" : "070-328 33 09",
        "name" : "Kristian Fjellström",
        "contact_type" : "Driftchef"
      } ],
      "duration" : {
        "concept_id" : "a7uU_j21_mkL",
        "label" : "Tills vidare",
        "legacy_ams_taxonomy_id" : "1"
      },
      "nice_to_have" : {
        "education_level" : [ ],
        "work_experiences" : [ ],
        "skills" : [ ],
        "education" : [ ],
        "languages" : [ ]
      },
      "application_details" : {
        "via_af" : false,
        "email" : "jobb@lillerud.se",
        "other" : "Lillerudsgymnasiet AB, Lillerud, 664 94  Vålberg",
        "reference" : "Instruktör/Hästskötare",
        "url" : null,
        "information" : null
      },
      "source_type" : "VIA_ANNONSERA",
      "application_deadline" : "2022-08-21T23:59:59",
      "external_id" : null,
      "workplace_address" : {
        "coordinates" : [ null, null ],
        "city" : null,
        "postcode" : null,
        "municipality" : "Karlstad",
        "region_concept_id" : "EVVp_h6U_GSZ",
        "region" : "Värmlands län",
        "country_code" : "199",
        "region_code" : "17",
        "municipality_concept_id" : "hRDj_PoV_sFU",
        "country_concept_id" : "i46j_HmG_v64",
        "municipality_code" : "1780",
        "street_address" : null,
        "country" : "Sverige"
      },
      "id" : "26367981",
      "experience_required" : true,
      "working_hours_type" : {
        "concept_id" : "6YE1_gAC_R2G",
        "label" : "Heltid",
        "legacy_ams_taxonomy_id" : "1"
      },
      "access" : null,
      "timestamp" : 1659355040308,
      "must_have" : {
        "education_level" : [ {
          "concept_id" : "asZm_TEQ_Srk",
          "weight" : 10,
          "label" : "Eftergymnasial utbildning två år eller längre",
          "legacy_ams_taxonomy_id" : "6"
        } ],
        "work_experiences" : [ {
          "concept_id" : "JMd5_2p6_zQt",
          "weight" : 10,
          "label" : "Djurskötare, häst",
          "legacy_ams_taxonomy_id" : "6281"
        } ],
        "skills" : [ ],
        "education" : [ {
          "concept_id" : "tFCz_HSa_jwW",
          "weight" : 10,
          "label" : "Pedagogik och lärarutbildning",
          "legacy_ams_taxonomy_id" : "4"
        } ],
        "languages" : [ ]
      },
      "occupation_field" : {
        "concept_id" : "VuuL_7CH_adj",
        "label" : "Naturbruk",
        "legacy_ams_taxonomy_id" : "13"
      },
      "scope_of_work" : {
        "min" : 0,
        "max" : 100
      },
      "salary_type" : {
        "concept_id" : "oG8G_9cW_nRf",
        "label" : "Fast månads- vecko- eller timlön",
        "legacy_ams_taxonomy_id" : "1"
      },
      "removed" : false,
      "salary_description" : null,
      "access_to_own_car" : false,
      "publication_date" : "2022-08-01T13:57:20"
    },
    "name" : "Instruktör-Hästskötare",
    "user" : "kristof.fischer"
  },
  "sha1" : "4d24f2c7aa290fd713583b10b83d42c9b8a3320d",
  "annotations" : [ {
    "preferred-label" : "Ridinstruktör/Ridlärare",
    "type" : "occupation-name",
    "start-position" : 0,
    "end-position" : 10,
    "concept-id" : "H9ej_iRx_9G6",
    "matched-string" : "Instruktör",
    "annotation-id" : 11
  }, {
    "preferred-label" : "Djurskötare, häst",
    "type" : "occupation-name",
    "start-position" : 11,
    "end-position" : 22,
    "concept-id" : "JMd5_2p6_zQt",
    "matched-string" : "Hästskötare",
    "annotation-id" : 10
  }, {
    "preferred-label" : "Ridinstruktör/Ridlärare",
    "type" : "occupation-name",
    "start-position" : 27,
    "end-position" : 37,
    "concept-id" : "H9ej_iRx_9G6",
    "matched-string" : "instruktör",
    "annotation-id" : 12
  }, {
    "preferred-label" : "Djurskötare, häst",
    "sentiment" : "MUST_HAVE",
    "type" : "occupation-name",
    "start-position" : 38,
    "end-position" : 49,
    "concept-id" : "JMd5_2p6_zQt",
    "matched-string" : "hästskötare",
    "annotation-id" : 1
  }, {
    "preferred-label" : "Heltid",
    "type" : "worktime-extent",
    "start-position" : 817,
    "end-position" : 821,
    "concept-id" : "6YE1_gAC_R2G",
    "matched-string" : "100%",
    "annotation-id" : 13
  }, {
    "preferred-label" : "Tillsvidareanställning (inkl. eventuell provanställning)",
    "type" : "employment-type",
    "start-position" : 864,
    "end-position" : 886,
    "concept-id" : "kpPX_CNN_gDU",
    "matched-string" : "tillsvidareanställning",
    "annotation-id" : 14
  }, {
    "preferred-label" : "Naturbruk, undervisning högskolenivå",
    "sentiment" : "MUST_HAVE",
    "type" : "skill",
    "start-position" : 988,
    "end-position" : 1008,
    "concept-id" : "ddzL_9as_rZt",
    "matched-string" : "naturbruksutbildning",
    "annotation-id" : 15
  }, {
    "preferred-label" : "Diplomerad hästskötare",
    "sentiment" : "MUST_HAVE",
    "type" : "skill",
    "start-position" : 1013,
    "end-position" : 1029,
    "concept-id" : "xW23_QFV_g9F",
    "matched-string" : "hästskötarexamen",
    "annotation-id" : 16
  }, {
    "preferred-label" : "Ridinstruktör/Ridlärare",
    "sentiment" : "NICE_TO_HAVE",
    "type" : "occupation-name",
    "start-position" : 1055,
    "end-position" : 1064,
    "concept-id" : "H9ej_iRx_9G6",
    "matched-string" : "ridledare",
    "annotation-id" : 17
  }, {
    "preferred-label" : "visa ansvarstagande",
    "sentiment" : "MUST_HAVE",
    "type" : "esco-skill",
    "start-position" : 1284,
    "end-position" : 1298,
    "concept-id" : "bcRp_hxV_f5G",
    "matched-string" : "ansvarstagande",
    "annotation-id" : 18
  }, {
    "preferred-label" : "samarbeta med kolleger",
    "sentiment" : "MUST_HAVE",
    "type" : "esco-skill",
    "start-position" : 1307,
    "end-position" : 1327,
    "concept-id" : "X15R_797_q62",
    "matched-string" : "god samarbetsförmåga",
    "annotation-id" : 19
  }, {
    "preferred-label" : "B",
    "sentiment" : "MUST_HAVE",
    "type" : "driving-licence",
    "start-position" : 1329,
    "end-position" : 1338,
    "concept-id" : "VTK8_WRx_GcM",
    "matched-string" : "B-körkort",
    "annotation-id" : 20
  }, {
    "preferred-label" : "Karlstad",
    "type" : "municipality",
    "start-position" : 1760,
    "end-position" : 1768,
    "concept-id" : "hRDj_PoV_sFU",
    "matched-string" : "Karlstad",
    "annotation-id" : 21
  } ],
  "text" : "Instruktör-Hästskötare\nSom instruktör/hästskötare hos oss arbetar du tillsammans med kollegor i ett arbetslag för hästutbildningen. Arbetet innebär till stor del i att instruera elever i olika praktiska moment som t.ex. stallskötsel, hästhantering och anläggningsskötsel.\nUtöver det kommer du även jobba självständigt med dagliga rutiner i skolstallet och häst-anläggningen samt vara delaktig i hästarnas träning och utbildning.\nHästutbildningen på Lillerud är treårig, med inriktning mot ridning eller trav. Vi har också en Nationell idrottsutbildning i hoppning och dressyr (NIU). Intresset för våra utbildningar är stort, och ca 100 elever läser för närvarande på hästinriktningen. Vi har en fin hästanläggning och i ett lösdriftsstall föder vi upp unghästar av svenskt varmblod, i liten skala.\nOmfattningen är på 100% och helgarbete förekommer.\nTjänsten är en tillsvidareanställning med tillträde den 5 september 2022 alternativt efter överenskommelse.\nOm dig\nVi söker dig som är har naturbruksutbildning och hästskötarexamen.\nMeriterande är om du är ridledare eller har motsvarande utbildning samt tidigare arbetslivserfarenhet inom yrket.\nEn förutsättning är att du har ett stort intresse för att lära ut och sätter elevens utveckling i första hand.\nVi tror att du är flexibel, ansvarstagande och har god samarbetsförmåga.\nB-körkort är ett krav.\nOm Lillerudsgymnasiet\nPå Lillerud studerar cirka 280 elever. På skolan bedriver vi gymnasieutbildning inom Naturbruksprogrammet med inriktningarna: hästhållning, djurvård, lantbruk och naturvetenskap. Lillerudsgymnasiet är en friskola med riksintag och ungefär 75 % av eleverna bor på skolans elevhem. Det skapar en härlig familjär känsla på skolan.\nLillerudsgymnasiet ligger vackert beläget 15 km väster om Karlstad. Vi har ett stort skoljordbruk med kor, grisar och får, en komplett  häst-anläggning med två fina ridhus samt ett travstall inne på Färjestads travbana. Vi har även veterinär, hunddagis samt ett smådjurshus med många olika sällskapsdjur.\nVill du veta mer besök www.lillerud.se eller vår Facebooksida ”Lillerudsgymnasiet”.\nVälkommen med din ansökan.\nLön:\nIndividuell lönesättning tillämpas. Ange löneanspråk.\nIntervjuer kan komma att ske löpande."
}