{
  "meta" : {
    "jobad" : {
      "description" : {
        "requirements" : null,
        "needs" : null,
        "company_information" : null,
        "text_formatted" : "vid Studentavdelningen. (Sista ansökningsdag: 2022-08-01) Förlängd ansökningstid t.o.m.: 2022-08-14.\n\nStudentavdelningen är en del av universitetsförvaltningen med uppdrag att ge stöd och service till studenter samt handlägga studentärenden. Studentavdelningen ger även verksamhetsstöd och rådgivning till institutioner och universitetsledning. Inom avdelningen arbetar totalt ca 120 personer och verksamheten bedrivs i Studenthuset på universitetsområdet.\n\nDenna anställning kommer vara placerad vid Sektionen för vägledning och internationalisering. Gruppen för stöd till internationalisering handlägger internationella frågor och mobilitet inom utbildningsområdet på Stockholms universitet samt ger stöd till ökad internationalisering vid universitetet. Gruppen ansvarar bl.a. för universitetets centrala utbytesavtal och nätverk och samordnar internationella utbildningsprogram, bland annat Erasmus+.\n\nStockholms universitet inledde 2020 ett projekt för att digitalisera handläggningen av internationell mobilitet genom att etablera universitetsgemensamma rutiner och processer med systemstöd. Vi söker nu en systemförvaltare för fortsatt arbete med projektet och implementering av systemet, samt i ett senare skede, för förvaltning av systemet.\n\nArbetsuppgifter\nDe huvudsakliga arbetsuppgifterna är att fortsätta det påbörjade arbetet med att utveckla och konfigurera digitala processer och strukturer vad gäller handläggning och administration av student-, lärar- och personalmobilitet. I uppgifterna ingår att fungera som support till användare internt, att hålla i internutbildningar i systemet, samt att vara universitetets kontaktperson gentemot leverantören.\n\nArbetet utförs i nära samarbete med kollegor inom avdelningen och innebär både kontakter internt på universitetet och med externa parter. Viss annan handläggning inom gruppens ansvarsområden kan också ingå i anställningen liksom uppföljning och utvärdering.\n\nKvalifikationer\nVi söker dig med relevant akademisk examen och erfarenhet av arbete i relationella databaser och ansökningsprocesser. Vi ser gärna att du har erfarenhet av både implementering av stödsystem och systemförvaltning. Erfarenhet av Mobility Online eller andra mobilitetssystem som t.ex. MoveON är  meriterande. Kunskap om- och erfarenhet av andra utbildningsadministrativa system och processer, gärna kopplade till studentmobilitet inom universitet/högskola, är önskvärt. \n\nDu har förmåga att skapa, implementera och utveckla effektiva och kvalitetssäkrade arbetsprocesser för internationell mobilitet. Mycket god administrativ förmåga är ett krav liksom utmärkta kunskaper i svenska och engelska i tal och skrift. Du är van att arbeta i Office-paketet och att ta egna initiativ, arbeta självständigt och strukturerat. Du har lätt att förmedla information och känner dig trygg med att framträda inför små och stora grupper.\n\nVidare har du lätt för att samarbeta, är serviceinriktad och har ansvarskänsla. Vi söker dig som motiveras av att utforma, utveckla och identifiera lösningar för komplexa processer i ett system med stor flexibilitet. Stor vikt kommer att fästas vid personlig lämplighet.\n\nAnställningsvillkor\nAnställningen avser heltid och gäller tills vidare med sex månaders provanställning. Stockholms universitet tillämpar individuell lönesättning, ange därför gärna löneanspråk. Tillträde snarast.\n\nStockholms universitet strävar efter att vara en arbetsplats som är fri från diskriminering och ger lika möjligheter för alla.\n\nKontakt\nNärmare information om anställningen lämnas av Sektionschef Marie Nordström, tfn 08-16 37 38, marie.nordstrom@su.se och Internationell handläggare Joakim Hellberg, tfn 08-16 40 44, joakim.hellberg@su.se. \n\nFackliga företrädare\nIngrid Lander (Saco-S), tfn 0708-16 26 64, saco@saco.su.se, Alejandra Pizarro Carrasco (Fackförbundet ST/Lärarförbundet), tfn 08-16 34 89, alejandra@st.su.se, samt seko@seko.su.se (SEKO).\n\nAnsökan\nDu söker anställningen via Stockholms universitets rekryteringssystem. Du som sökande ansvarar för att ansökan är komplett i enlighet med annonsen och att den är universitetet tillhanda senast sista ansökningsdag.\n\nBifoga endast personligt brev och CV. Kopior på betyg och intyg tar du med vid en eventuell intervju.\n\nAnvisningar för sökande finns på webbsidan: att söka en anställning.\n\nVälkommen med din ansökan!\n\n\nStockholms universitet bidrar till det hållbara demokratiska samhällets utveckling genom kunskap, upplysning och sanningssökande.",
        "conditions" : "Heltid/\r\nEj specificerat",
        "text" : "vid Studentavdelningen. (Sista ansökningsdag: 2022-08-01) Förlängd ansökningstid t.o.m.: 2022-08-14.\n\nStudentavdelningen är en del av universitetsförvaltningen med uppdrag att ge stöd och service till studenter samt handlägga studentärenden. Studentavdelningen ger även verksamhetsstöd och rådgivning till institutioner och universitetsledning. Inom avdelningen arbetar totalt ca 120 personer och verksamheten bedrivs i Studenthuset på universitetsområdet.\n\nDenna anställning kommer vara placerad vid Sektionen för vägledning och internationalisering. Gruppen för stöd till internationalisering handlägger internationella frågor och mobilitet inom utbildningsområdet på Stockholms universitet samt ger stöd till ökad internationalisering vid universitetet. Gruppen ansvarar bl.a. för universitetets centrala utbytesavtal och nätverk och samordnar internationella utbildningsprogram, bland annat Erasmus+.\n\nStockholms universitet inledde 2020 ett projekt för att digitalisera handläggningen av internationell mobilitet genom att etablera universitetsgemensamma rutiner och processer med systemstöd. Vi söker nu en systemförvaltare för fortsatt arbete med projektet och implementering av systemet, samt i ett senare skede, för förvaltning av systemet.\n\nArbetsuppgifter\nDe huvudsakliga arbetsuppgifterna är att fortsätta det påbörjade arbetet med att utveckla och konfigurera digitala processer och strukturer vad gäller handläggning och administration av student-, lärar- och personalmobilitet. I uppgifterna ingår att fungera som support till användare internt, att hålla i internutbildningar i systemet, samt att vara universitetets kontaktperson gentemot leverantören.\n\nArbetet utförs i nära samarbete med kollegor inom avdelningen och innebär både kontakter internt på universitetet och med externa parter. Viss annan handläggning inom gruppens ansvarsområden kan också ingå i anställningen liksom uppföljning och utvärdering.\n\nKvalifikationer\nVi söker dig med relevant akademisk examen och erfarenhet av arbete i relationella databaser och ansökningsprocesser. Vi ser gärna att du har erfarenhet av både implementering av stödsystem och systemförvaltning. Erfarenhet av Mobility Online eller andra mobilitetssystem som t.ex. MoveON är  meriterande. Kunskap om- och erfarenhet av andra utbildningsadministrativa system och processer, gärna kopplade till studentmobilitet inom universitet/högskola, är önskvärt. \n\nDu har förmåga att skapa, implementera och utveckla effektiva och kvalitetssäkrade arbetsprocesser för internationell mobilitet. Mycket god administrativ förmåga är ett krav liksom utmärkta kunskaper i svenska och engelska i tal och skrift. Du är van att arbeta i Office-paketet och att ta egna initiativ, arbeta självständigt och strukturerat. Du har lätt att förmedla information och känner dig trygg med att framträda inför små och stora grupper.\n\nVidare har du lätt för att samarbeta, är serviceinriktad och har ansvarskänsla. Vi söker dig som motiveras av att utforma, utveckla och identifiera lösningar för komplexa processer i ett system med stor flexibilitet. Stor vikt kommer att fästas vid personlig lämplighet.\n\nAnställningsvillkor\nAnställningen avser heltid och gäller tills vidare med sex månaders provanställning. Stockholms universitet tillämpar individuell lönesättning, ange därför gärna löneanspråk. Tillträde snarast.\n\nStockholms universitet strävar efter att vara en arbetsplats som är fri från diskriminering och ger lika möjligheter för alla.\n\nKontakt\nNärmare information om anställningen lämnas av Sektionschef Marie Nordström, tfn 08-16 37 38, marie.nordstrom@su.se och Internationell handläggare Joakim Hellberg, tfn 08-16 40 44, joakim.hellberg@su.se. \n\nFackliga företrädare\nIngrid Lander (Saco-S), tfn 0708-16 26 64, saco@saco.su.se, Alejandra Pizarro Carrasco (Fackförbundet ST/Lärarförbundet), tfn 08-16 34 89, alejandra@st.su.se, samt seko@seko.su.se (SEKO).\n\nAnsökan\nDu söker anställningen via Stockholms universitets rekryteringssystem. Du som sökande ansvarar för att ansökan är komplett i enlighet med annonsen och att den är universitetet tillhanda senast sista ansökningsdag.\n\nBifoga endast personligt brev och CV. Kopior på betyg och intyg tar du med vid en eventuell intervju.\n\nAnvisningar för sökande finns på webbsidan: att söka en anställning.\n\nVälkommen med din ansökan!\n\n\nStockholms universitet bidrar till det hållbara demokratiska samhällets utveckling genom kunskap, upplysning och sanningssökande."
      },
      "headline" : "Systemförvaltare",
      "driving_license" : null,
      "employer" : {
        "email" : null,
        "phone_number" : null,
        "organization_number" : "2021003062",
        "name" : "Stockholms Universitet",
        "url" : "http://www.su.se",
        "workplace" : "Stockholms universitet"
      },
      "removed_date" : null,
      "logo_url" : "https://www.arbetsformedlingen.se/rest/arbetsgivare/rest/af/v3/organisation/2021003062/logotyper/logo.png",
      "last_publication_date" : "2022-08-14T23:59:59",
      "number_of_vacancies" : 1,
      "occupation" : {
        "concept_id" : "nFJR_WkF_ir7",
        "label" : "Systemförvaltare",
        "legacy_ams_taxonomy_id" : "2919"
      },
      "occupation_group" : {
        "concept_id" : "cBBa_ngH_fCx",
        "label" : "Systemförvaltare m.fl.",
        "legacy_ams_taxonomy_id" : "2515"
      },
      "employment_type" : {
        "concept_id" : "PFZr_Syz_cUq",
        "label" : "Vanlig anställning",
        "legacy_ams_taxonomy_id" : "1"
      },
      "webpage_url" : "https://arbetsformedlingen.se/platsbanken/annonser/26346338",
      "driving_license_required" : false,
      "application_contacts" : [ ],
      "duration" : {
        "concept_id" : "a7uU_j21_mkL",
        "label" : "Tills vidare",
        "legacy_ams_taxonomy_id" : "1"
      },
      "nice_to_have" : {
        "education_level" : [ ],
        "work_experiences" : [ ],
        "skills" : [ ],
        "education" : [ ],
        "languages" : [ ]
      },
      "application_details" : {
        "via_af" : false,
        "email" : null,
        "other" : null,
        "reference" : null,
        "url" : "https://www.su.se/om-universitetet/jobba-p%C3%A5-su/lediga-jobb?rmpage=job&rmjob=18499",
        "information" : null
      },
      "source_type" : "VIA_PLATSBANKEN_DXA",
      "application_deadline" : "2022-08-14T23:59:59",
      "external_id" : "46-202100-3062-18499",
      "workplace_address" : {
        "coordinates" : [ 18.06858, 59.329323 ],
        "city" : null,
        "postcode" : null,
        "municipality" : "Stockholm",
        "region_concept_id" : "CifL_Rzy_Mku",
        "region" : "Stockholms län",
        "country_code" : "199",
        "region_code" : "01",
        "municipality_concept_id" : "AvNB_uwa_6n6",
        "country_concept_id" : "i46j_HmG_v64",
        "municipality_code" : "0180",
        "street_address" : null,
        "country" : "Sverige"
      },
      "id" : "26346338",
      "experience_required" : true,
      "working_hours_type" : {
        "concept_id" : "6YE1_gAC_R2G",
        "label" : "Heltid",
        "legacy_ams_taxonomy_id" : "1"
      },
      "access" : null,
      "timestamp" : 1658475853668,
      "must_have" : {
        "education_level" : [ ],
        "work_experiences" : [ {
          "concept_id" : "nFJR_WkF_ir7",
          "weight" : 10,
          "label" : "Systemförvaltare",
          "legacy_ams_taxonomy_id" : "2919"
        } ],
        "skills" : [ ],
        "education" : [ ],
        "languages" : [ ]
      },
      "occupation_field" : {
        "concept_id" : "apaJ_2ja_LuF",
        "label" : "Data/IT",
        "legacy_ams_taxonomy_id" : "3"
      },
      "scope_of_work" : {
        "min" : 100,
        "max" : 100
      },
      "salary_type" : {
        "concept_id" : "oG8G_9cW_nRf",
        "label" : "Fast månads- vecko- eller timlön",
        "legacy_ams_taxonomy_id" : "1"
      },
      "removed" : false,
      "salary_description" : "Individuell lönesättning.",
      "access_to_own_car" : false,
      "publication_date" : "2022-07-22T09:44:13"
    },
    "name" : "Systemförvaltare",
    "user" : "hannes"
  },
  "sha1" : "b1dbebfa389cf885a3b8851e42452662ef9cdb5c",
  "annotations" : [ {
    "preferred-label" : "Systemförvaltare",
    "sentiment" : "MUST_HAVE",
    "type" : "forecast-occupation",
    "start-position" : 0,
    "end-position" : 16,
    "concept-id" : "rno7_MFk_voB",
    "matched-string" : "systemförvaltare",
    "annotation-id" : 0
  }, {
    "preferred-label" : "Internationella frågor",
    "sentiment" : "MUST_HAVE",
    "type" : "skill",
    "start-position" : 623,
    "end-position" : 645,
    "concept-id" : "cRpm_EWm_dK5",
    "matched-string" : "internationella frågor",
    "annotation-id" : 1
  }, {
    "preferred-label" : "Stockholm",
    "type" : "municipality",
    "start-position" : 687,
    "end-position" : 697,
    "concept-id" : "AvNB_uwa_6n6",
    "matched-string" : "Stockholms",
    "annotation-id" : 8
  }, {
    "preferred-label" : "Stockholm",
    "type" : "municipality",
    "start-position" : 923,
    "end-position" : 933,
    "concept-id" : "AvNB_uwa_6n6",
    "matched-string" : "Stockholms",
    "annotation-id" : 9
  }, {
    "preferred-label" : "Systemförvaltare",
    "sentiment" : "MUST_HAVE",
    "type" : "forecast-occupation",
    "start-position" : 1130,
    "end-position" : 1146,
    "concept-id" : "rno7_MFk_voB",
    "matched-string" : "systemförvaltare",
    "annotation-id" : 2
  }, {
    "preferred-label" : "Supportfunktion",
    "type" : "keyword",
    "start-position" : 1546,
    "end-position" : 1553,
    "concept-id" : "3ejN_ycL_sdm",
    "matched-string" : "support",
    "annotation-id" : 10
  }, {
    "preferred-label" : "samarbeta med kolleger",
    "type" : "esco-skill",
    "start-position" : 1710,
    "end-position" : 1732,
    "concept-id" : "X15R_797_q62",
    "matched-string" : "samarbete med kollegor",
    "annotation-id" : 11
  }, {
    "preferred-label" : "Yrkesbevis/examen",
    "sentiment" : "MUST_HAVE",
    "type" : "skill-headline",
    "start-position" : 1999,
    "end-position" : 2005,
    "concept-id" : "HjPN_99i_cFD",
    "matched-string" : "examen",
    "annotation-id" : 3
  }, {
    "preferred-label" : "Databaser",
    "sentiment" : "MUST_HAVE",
    "type" : "skill-headline",
    "start-position" : 2046,
    "end-position" : 2055,
    "concept-id" : "Uj5W_dft_Ssg",
    "matched-string" : "databaser",
    "annotation-id" : 4
  }, {
    "preferred-label" : "Systemförvaltning",
    "sentiment" : "MUST_HAVE",
    "type" : "skill",
    "start-position" : 2157,
    "end-position" : 2174,
    "concept-id" : "4f1v_w91_qVM",
    "matched-string" : "systemförvaltning",
    "annotation-id" : 5
  }, {
    "preferred-label" : "Svenska",
    "sentiment" : "MUST_HAVE",
    "type" : "language",
    "start-position" : 2634,
    "end-position" : 2641,
    "concept-id" : "zSLA_vw2_FXN",
    "matched-string" : "svenska",
    "annotation-id" : 6
  }, {
    "preferred-label" : "Engelska",
    "sentiment" : "MUST_HAVE",
    "type" : "language",
    "start-position" : 2646,
    "end-position" : 2654,
    "concept-id" : "NVxJ_hLg_TYS",
    "matched-string" : "engelska",
    "annotation-id" : 7
  }, {
    "preferred-label" : "MS Office",
    "type" : "skill",
    "start-position" : 2696,
    "end-position" : 2710,
    "concept-id" : "w8bU_wHe_omF",
    "matched-string" : "Office-paketet",
    "annotation-id" : 12
  }, {
    "preferred-label" : "arbeta självständigt",
    "type" : "esco-skill",
    "start-position" : 2738,
    "end-position" : 2758,
    "concept-id" : "NyFu_HHd_zhz",
    "matched-string" : "arbeta självständigt",
    "annotation-id" : 13
  }, {
    "preferred-label" : "Heltid",
    "type" : "worktime-extent",
    "start-position" : 3195,
    "end-position" : 3201,
    "concept-id" : "6YE1_gAC_R2G",
    "matched-string" : "heltid",
    "annotation-id" : 14
  }, {
    "preferred-label" : "Tillsvidareanställning (inkl. eventuell provanställning)",
    "type" : "employment-type",
    "start-position" : 3213,
    "end-position" : 3258,
    "concept-id" : "kpPX_CNN_gDU",
    "matched-string" : "tills vidare med sex månaders provanställning",
    "annotation-id" : 15
  } ],
  "text" : "Systemförvaltare\nvid Studentavdelningen. (Sista ansökningsdag: 2022-08-01) Förlängd ansökningstid t.o.m.: 2022-08-14.\n\nStudentavdelningen är en del av universitetsförvaltningen med uppdrag att ge stöd och service till studenter samt handlägga studentärenden. Studentavdelningen ger även verksamhetsstöd och rådgivning till institutioner och universitetsledning. Inom avdelningen arbetar totalt ca 120 personer och verksamheten bedrivs i Studenthuset på universitetsområdet.\n\nDenna anställning kommer vara placerad vid Sektionen för vägledning och internationalisering. Gruppen för stöd till internationalisering handlägger internationella frågor och mobilitet inom utbildningsområdet på Stockholms universitet samt ger stöd till ökad internationalisering vid universitetet. Gruppen ansvarar bl.a. för universitetets centrala utbytesavtal och nätverk och samordnar internationella utbildningsprogram, bland annat Erasmus+.\n\nStockholms universitet inledde 2020 ett projekt för att digitalisera handläggningen av internationell mobilitet genom att etablera universitetsgemensamma rutiner och processer med systemstöd. Vi söker nu en systemförvaltare för fortsatt arbete med projektet och implementering av systemet, samt i ett senare skede, för förvaltning av systemet.\n\nArbetsuppgifter\nDe huvudsakliga arbetsuppgifterna är att fortsätta det påbörjade arbetet med att utveckla och konfigurera digitala processer och strukturer vad gäller handläggning och administration av student-, lärar- och personalmobilitet. I uppgifterna ingår att fungera som support till användare internt, att hålla i internutbildningar i systemet, samt att vara universitetets kontaktperson gentemot leverantören.\n\nArbetet utförs i nära samarbete med kollegor inom avdelningen och innebär både kontakter internt på universitetet och med externa parter. Viss annan handläggning inom gruppens ansvarsområden kan också ingå i anställningen liksom uppföljning och utvärdering.\n\nKvalifikationer\nVi söker dig med relevant akademisk examen och erfarenhet av arbete i relationella databaser och ansökningsprocesser. Vi ser gärna att du har erfarenhet av både implementering av stödsystem och systemförvaltning. Erfarenhet av Mobility Online eller andra mobilitetssystem som t.ex. MoveON är  meriterande. Kunskap om- och erfarenhet av andra utbildningsadministrativa system och processer, gärna kopplade till studentmobilitet inom universitet/högskola, är önskvärt. \n\nDu har förmåga att skapa, implementera och utveckla effektiva och kvalitetssäkrade arbetsprocesser för internationell mobilitet. Mycket god administrativ förmåga är ett krav liksom utmärkta kunskaper i svenska och engelska i tal och skrift. Du är van att arbeta i Office-paketet och att ta egna initiativ, arbeta självständigt och strukturerat. Du har lätt att förmedla information och känner dig trygg med att framträda inför små och stora grupper.\n\nVidare har du lätt för att samarbeta, är serviceinriktad och har ansvarskänsla. Vi söker dig som motiveras av att utforma, utveckla och identifiera lösningar för komplexa processer i ett system med stor flexibilitet. Stor vikt kommer att fästas vid personlig lämplighet.\n\nAnställningsvillkor\nAnställningen avser heltid och gäller tills vidare med sex månaders provanställning. Stockholms universitet tillämpar individuell lönesättning, ange därför gärna löneanspråk. Tillträde snarast.\n\nStockholms universitet strävar efter att vara en arbetsplats som är fri från diskriminering och ger lika möjligheter för alla.\n\nKontakt\nNärmare information om anställningen lämnas av Sektionschef Marie Nordström, tfn 08-16 37 38, marie.nordstrom@su.se och Internationell handläggare Joakim Hellberg, tfn 08-16 40 44, joakim.hellberg@su.se. \n\nFackliga företrädare\nIngrid Lander (Saco-S), tfn 0708-16 26 64, saco@saco.su.se, Alejandra Pizarro Carrasco (Fackförbundet ST/Lärarförbundet), tfn 08-16 34 89, alejandra@st.su.se, samt seko@seko.su.se (SEKO).\n\nAnsökan\nDu söker anställningen via Stockholms universitets rekryteringssystem. Du som sökande ansvarar för att ansökan är komplett i enlighet med annonsen och att den är universitetet tillhanda senast sista ansökningsdag.\n\nBifoga endast personligt brev och CV. Kopior på betyg och intyg tar du med vid en eventuell intervju.\n\nAnvisningar för sökande finns på webbsidan: att söka en anställning.\n\nVälkommen med din ansökan!\n\n\nStockholms universitet bidrar till det hållbara demokratiska samhällets utveckling genom kunskap, upplysning och sanningssökande."
}