{
  "meta" : {
    "jobad" : {
      "description" : {
        "requirements" : null,
        "needs" : null,
        "company_information" : null,
        "text_formatted" : "Om tjänsten\nSom komminister i Melleruds pastorat kommer du att arbeta med sedvanliga prästuppgifter som döpa, konfirmera, viga och begrava. Du kommer ansvara för gudstjänster och kyrkliga handlingar i kyrkorna och vara ute på byn tillsammans med andra komministrar i pastoratet. I arbetet har du möjlighet att påverka och forma verksamheten så att den motsvarar de förväntningar som finns på oss som en del av Svenska kyrkan.\n\nVi arbetar både på vardagar och söndagar, och verksamheten bedrivs i samtliga fyra församlingar. Organisationen genomgår en indelningsändring och har nyligen anställt en ny kyrkoherde.\n\nOm dig\nVi ser att du är trygg, väl förankrad och grundad i din kristna tro och gärna bygger relationer med andra. Du gillar att jobba både självständigt och i grupp, och är precis som vi måna om att bygga en god arbetsplats och en levande församling. Vi söker dig som är öppen för utveckling och förändringar i arbetet, arbetar flexibelt och prestigelöst, är lyhörd och social samt är bra på planering och struktur.\n\nDu är prästvigd i svenska kyrkan. Även har du tidigare erfarenhet från att leda gudstjänster, predika evangeliet och vara med och utveckla ett rikt och varierat gudstjänstliv.\n\nTjänsten kräver att du har körkort och tillgång till egen bil.\n\nOm oss\nMelleruds pastorat är en glesbygdsförsamling i Karlstad stift som ligger i natursköna Dalsland. Kommunen har goda kommunikationer till Karlstad, Trollhättan och Göteborg. I Mellerud bor ca 10 000 invånare och ca 65% är kyrkotillhöriga. I pastoratet finns fyra församlingar och elva kyrkor. Pastoratet har ett rikt arbete som riktar sig till olika åldrar som vi vill fortsätta att utveckla. Arbetslaget består av 30 personer och vi har ett nära samarbete med ideella. Vi arbetar gärna tillsammans i team.\n\nOm processen\nI den här rekryteringen samarbetar vi med Testhuset. Om du har frågor är du välkommen att kontakta Bengt Libäck på 070-594 72 77 eller Josefine Appel på 076-017 40 25\n\nDu är varmt välkommen in med din ansökan senast den 15 augusti.",
        "conditions" : "Heltid\r\nAnställningstid enligt överenskommelse",
        "text" : "Om tjänsten\nSom komminister i Melleruds pastorat kommer du att arbeta med sedvanliga prästuppgifter som döpa, konfirmera, viga och begrava. Du kommer ansvara för gudstjänster och kyrkliga handlingar i kyrkorna och vara ute på byn tillsammans med andra komministrar i pastoratet. I arbetet har du möjlighet att påverka och forma verksamheten så att den motsvarar de förväntningar som finns på oss som en del av Svenska kyrkan.\n\nVi arbetar både på vardagar och söndagar, och verksamheten bedrivs i samtliga fyra församlingar. Organisationen genomgår en indelningsändring och har nyligen anställt en ny kyrkoherde.\n\nOm dig\nVi ser att du är trygg, väl förankrad och grundad i din kristna tro och gärna bygger relationer med andra. Du gillar att jobba både självständigt och i grupp, och är precis som vi måna om att bygga en god arbetsplats och en levande församling. Vi söker dig som är öppen för utveckling och förändringar i arbetet, arbetar flexibelt och prestigelöst, är lyhörd och social samt är bra på planering och struktur.\n\nDu är prästvigd i svenska kyrkan. Även har du tidigare erfarenhet från att leda gudstjänster, predika evangeliet och vara med och utveckla ett rikt och varierat gudstjänstliv.\n\nTjänsten kräver att du har körkort och tillgång till egen bil.\n\nOm oss\nMelleruds pastorat är en glesbygdsförsamling i Karlstad stift som ligger i natursköna Dalsland. Kommunen har goda kommunikationer till Karlstad, Trollhättan och Göteborg. I Mellerud bor ca 10 000 invånare och ca 65% är kyrkotillhöriga. I pastoratet finns fyra församlingar och elva kyrkor. Pastoratet har ett rikt arbete som riktar sig till olika åldrar som vi vill fortsätta att utveckla. Arbetslaget består av 30 personer och vi har ett nära samarbete med ideella. Vi arbetar gärna tillsammans i team.\n\nOm processen\nI den här rekryteringen samarbetar vi med Testhuset. Om du har frågor är du välkommen att kontakta Bengt Libäck på 070-594 72 77 eller Josefine Appel på 076-017 40 25\n\nDu är varmt välkommen in med din ansökan senast den 15 augusti."
      },
      "headline" : "Komminister - Mellerud pastorat",
      "driving_license" : null,
      "employer" : {
        "email" : null,
        "phone_number" : null,
        "organization_number" : "5568740491",
        "name" : "Testhuset Urval & Utveckling AB",
        "url" : "https://testhuset.com/",
        "workplace" : "Testhuset"
      },
      "removed_date" : null,
      "logo_url" : "https://www.arbetsformedlingen.se/rest/arbetsgivare/rest/af/v3/organisation/5568740491/logotyper/logo.png",
      "last_publication_date" : "2022-08-15T23:59:59",
      "number_of_vacancies" : 1,
      "occupation" : {
        "concept_id" : "jQKk_Wzd_pvu",
        "label" : "Komminister",
        "legacy_ams_taxonomy_id" : "2113"
      },
      "occupation_group" : {
        "concept_id" : "2L2s_EU8_PzR",
        "label" : "Präster",
        "legacy_ams_taxonomy_id" : "2671"
      },
      "employment_type" : {
        "concept_id" : "PFZr_Syz_cUq",
        "label" : "Vanlig anställning",
        "legacy_ams_taxonomy_id" : "1"
      },
      "webpage_url" : "https://arbetsformedlingen.se/platsbanken/annonser/26365526",
      "driving_license_required" : false,
      "application_contacts" : [ {
        "description" : "Bengt Libäck",
        "email" : "bengt.liback@testhuset.com",
        "telephone" : "070 594 72 77",
        "name" : null,
        "contact_type" : null
      } ],
      "duration" : {
        "concept_id" : "a7uU_j21_mkL",
        "label" : "Tills vidare",
        "legacy_ams_taxonomy_id" : "1"
      },
      "nice_to_have" : {
        "education_level" : [ ],
        "work_experiences" : [ ],
        "skills" : [ ],
        "education" : [ ],
        "languages" : [ ]
      },
      "application_details" : {
        "via_af" : false,
        "email" : null,
        "other" : null,
        "reference" : null,
        "url" : "https://testhuset.teamtailor.com/jobs/1898533-komminister-mellerud-pastorat?promotion=442228-arbetsformedlingen",
        "information" : null
      },
      "source_type" : "VIA_PLATSBANKEN_DXA",
      "application_deadline" : "2022-08-15T23:59:59",
      "external_id" : "46-556874-0491-1898533-2",
      "workplace_address" : {
        "coordinates" : [ 12.451842, 58.702568 ],
        "city" : null,
        "postcode" : null,
        "municipality" : "Mellerud",
        "region_concept_id" : "zdoY_6u5_Krt",
        "region" : "Västra Götalands län",
        "country_code" : "199",
        "region_code" : "14",
        "municipality_concept_id" : "tt1B_7rH_vhG",
        "country_concept_id" : "i46j_HmG_v64",
        "municipality_code" : "1461",
        "street_address" : null,
        "country" : "Sverige"
      },
      "id" : "26365526",
      "experience_required" : true,
      "working_hours_type" : {
        "concept_id" : "6YE1_gAC_R2G",
        "label" : "Heltid",
        "legacy_ams_taxonomy_id" : "1"
      },
      "access" : null,
      "timestamp" : 1659336104977,
      "must_have" : {
        "education_level" : [ ],
        "work_experiences" : [ {
          "concept_id" : "jQKk_Wzd_pvu",
          "weight" : 10,
          "label" : "Komminister",
          "legacy_ams_taxonomy_id" : "2113"
        } ],
        "skills" : [ ],
        "education" : [ ],
        "languages" : [ ]
      },
      "occupation_field" : {
        "concept_id" : "GazW_2TU_kJw",
        "label" : "Yrken med social inriktning",
        "legacy_ams_taxonomy_id" : "16"
      },
      "scope_of_work" : {
        "min" : 100,
        "max" : 100
      },
      "salary_type" : {
        "concept_id" : "oG8G_9cW_nRf",
        "label" : "Fast månads- vecko- eller timlön",
        "legacy_ams_taxonomy_id" : "1"
      },
      "removed" : false,
      "salary_description" : "Lön enligt överenskommelse",
      "access_to_own_car" : false,
      "publication_date" : "2022-08-01T08:41:44"
    },
    "name" : "Komminister - Mellerud pastorat",
    "user" : "hannes"
  },
  "sha1" : "c3923247c457e7e3bdef96db49ec33a4fd04776e",
  "annotations" : [ {
    "preferred-label" : "Komminister",
    "sentiment" : "MUST_HAVE",
    "type" : "occupation-name",
    "start-position" : 0,
    "end-position" : 11,
    "concept-id" : "jQKk_Wzd_pvu",
    "matched-string" : "komminister",
    "annotation-id" : 0
  }, {
    "preferred-label" : "Mellerud",
    "type" : "municipality",
    "start-position" : 14,
    "end-position" : 22,
    "concept-id" : "tt1B_7rH_vhG",
    "matched-string" : "Mellerud",
    "annotation-id" : 9
  }, {
    "preferred-label" : "Komminister",
    "sentiment" : "MUST_HAVE",
    "type" : "occupation-name",
    "start-position" : 48,
    "end-position" : 59,
    "concept-id" : "jQKk_Wzd_pvu",
    "matched-string" : "komminister",
    "annotation-id" : 1
  }, {
    "preferred-label" : "Mellerud",
    "type" : "municipality",
    "start-position" : 62,
    "end-position" : 71,
    "concept-id" : "tt1B_7rH_vhG",
    "matched-string" : "Melleruds",
    "annotation-id" : 10
  }, {
    "preferred-label" : "förrätta vigsel",
    "type" : "esco-skill",
    "start-position" : 154,
    "end-position" : 158,
    "concept-id" : "Ve1E_y5o_QP9",
    "matched-string" : "viga",
    "annotation-id" : 13
  }, {
    "preferred-label" : "förrätta gudstjänst",
    "type" : "esco-skill",
    "start-position" : 194,
    "end-position" : 206,
    "concept-id" : "B7SE_Bgb_8yx",
    "matched-string" : "gudstjänster",
    "annotation-id" : 14
  }, {
    "preferred-label" : "Komminister",
    "type" : "occupation-name",
    "start-position" : 284,
    "end-position" : 296,
    "concept-id" : "jQKk_Wzd_pvu",
    "matched-string" : "komministrar",
    "annotation-id" : 15
  }, {
    "preferred-label" : "Kyrkan",
    "sentiment" : "MUST_HAVE",
    "type" : "keyword",
    "start-position" : 450,
    "end-position" : 456,
    "concept-id" : "h4LF_GE3_FGu",
    "matched-string" : "kyrkan",
    "annotation-id" : 3
  }, {
    "preferred-label" : "Kyrkoherde",
    "sentiment" : "MUST_HAVE",
    "type" : "occupation-name",
    "start-position" : 632,
    "end-position" : 642,
    "concept-id" : "rMfT_rsj_WQv",
    "matched-string" : "kyrkoherde",
    "annotation-id" : 4
  }, {
    "preferred-label" : "arbeta självständigt",
    "type" : "esco-skill",
    "start-position" : 773,
    "end-position" : 778,
    "concept-id" : "NyFu_HHd_zhz",
    "matched-string" : "jobba",
    "annotation-id" : 17
  }, {
    "preferred-label" : "arbeta självständigt",
    "type" : "esco-skill",
    "start-position" : 784,
    "end-position" : 797,
    "concept-id" : "NyFu_HHd_zhz",
    "matched-string" : "självständigt",
    "annotation-id" : 16
  }, {
    "preferred-label" : "Församling",
    "sentiment" : "MUST_HAVE",
    "type" : "keyword",
    "start-position" : 884,
    "end-position" : 894,
    "concept-id" : "rfGv_wrD_n9x",
    "matched-string" : "församling",
    "annotation-id" : 5
  }, {
    "preferred-label" : "Prästvigd",
    "sentiment" : "MUST_HAVE",
    "type" : "skill",
    "start-position" : 1068,
    "end-position" : 1077,
    "concept-id" : "Qcej_yyR_HG3",
    "matched-string" : "prästvigd",
    "annotation-id" : 6
  }, {
    "preferred-label" : "Kyrkan",
    "sentiment" : "MUST_HAVE",
    "type" : "keyword",
    "start-position" : 1088,
    "end-position" : 1094,
    "concept-id" : "h4LF_GE3_FGu",
    "matched-string" : "kyrkan",
    "annotation-id" : 8
  }, {
    "preferred-label" : "förrätta gudstjänst",
    "type" : "esco-skill",
    "start-position" : 1137,
    "end-position" : 1154,
    "concept-id" : "B7SE_Bgb_8yx",
    "matched-string" : "leda gudstjänster",
    "annotation-id" : 18
  }, {
    "preferred-label" : "körkort",
    "type" : "esco-skill",
    "start-position" : 1266,
    "end-position" : 1273,
    "concept-id" : "UvDr_eNo_HSQ",
    "matched-string" : "körkort",
    "annotation-id" : 19
  }, {
    "preferred-label" : "Mellerud",
    "type" : "municipality",
    "start-position" : 1310,
    "end-position" : 1319,
    "concept-id" : "tt1B_7rH_vhG",
    "matched-string" : "Melleruds",
    "annotation-id" : 11
  }, {
    "preferred-label" : "Karlstad",
    "type" : "municipality",
    "start-position" : 1357,
    "end-position" : 1365,
    "concept-id" : "hRDj_PoV_sFU",
    "matched-string" : "Karlstad",
    "annotation-id" : 12
  } ],
  "text" : "Komminister - Mellerud pastorat\nOm tjänsten\nSom komminister i Melleruds pastorat kommer du att arbeta med sedvanliga prästuppgifter som döpa, konfirmera, viga och begrava. Du kommer ansvara för gudstjänster och kyrkliga handlingar i kyrkorna och vara ute på byn tillsammans med andra komministrar i pastoratet. I arbetet har du möjlighet att påverka och forma verksamheten så att den motsvarar de förväntningar som finns på oss som en del av Svenska kyrkan.\n\nVi arbetar både på vardagar och söndagar, och verksamheten bedrivs i samtliga fyra församlingar. Organisationen genomgår en indelningsändring och har nyligen anställt en ny kyrkoherde.\n\nOm dig\nVi ser att du är trygg, väl förankrad och grundad i din kristna tro och gärna bygger relationer med andra. Du gillar att jobba både självständigt och i grupp, och är precis som vi måna om att bygga en god arbetsplats och en levande församling. Vi söker dig som är öppen för utveckling och förändringar i arbetet, arbetar flexibelt och prestigelöst, är lyhörd och social samt är bra på planering och struktur.\n\nDu är prästvigd i svenska kyrkan. Även har du tidigare erfarenhet från att leda gudstjänster, predika evangeliet och vara med och utveckla ett rikt och varierat gudstjänstliv.\n\nTjänsten kräver att du har körkort och tillgång till egen bil.\n\nOm oss\nMelleruds pastorat är en glesbygdsförsamling i Karlstad stift som ligger i natursköna Dalsland. Kommunen har goda kommunikationer till Karlstad, Trollhättan och Göteborg. I Mellerud bor ca 10 000 invånare och ca 65% är kyrkotillhöriga. I pastoratet finns fyra församlingar och elva kyrkor. Pastoratet har ett rikt arbete som riktar sig till olika åldrar som vi vill fortsätta att utveckla. Arbetslaget består av 30 personer och vi har ett nära samarbete med ideella. Vi arbetar gärna tillsammans i team.\n\nOm processen\nI den här rekryteringen samarbetar vi med Testhuset. Om du har frågor är du välkommen att kontakta Bengt Libäck på 070-594 72 77 eller Josefine Appel på 076-017 40 25\n\nDu är varmt välkommen in med din ansökan senast den 15 augusti."
}