{
  "meta" : {
    "jobad" : {
      "description" : {
        "requirements" : null,
        "needs" : null,
        "company_information" : null,
        "text_formatted" : "<p>Familjetandläkarna är ett snabbt växande företag som erbjuder högkvalitativ tandvård för hela familjen. Vi söker dig som är legitimerad tandhygienist med minst 2 års arbetslivserfarenhet.</p><p>Vi söker dig som sätter högt värde på kvalité och service. Du är social och har förmågan att kombinera högkvalitativ tandvård med ett bra patientbemötande. Samtidigt som du alltid eftersträvar att ge dina patienter bästa möjliga vård, är du självklart även en trevlig kollega att ha i teamet och du bidrar med en positiv arbetsanda. Ditt arbete ska hålla hög odontologisk kvalitet för att tillsammans med resten av teamet skapa den bästa möjliga vården för våra patienter. Du behöver också ha mycket goda kunskaper i svenska språket och gärna erfarenhet av journalsystemet Opus.</p><p>Arbetsomfattning är tänkt vara 50% per vecka. Det kan dock diskuteras. </p><p>Urval sker löpande och tillsättning av tjänsten kan komma att ske innan sista ansökningsdag. Vi ser fram emot din ansökan!</p><p id=\"oppenforalla\">Öppen för alla\nVi fokuserar på din kompetens, inte dina övriga förutsättningar. Vi är öppna för att anpassa rollen eller arbetsplatsen efter dina behov.</p>",
        "conditions" : null,
        "text" : "Familjetandläkarna är ett snabbt växande företag som erbjuder högkvalitativ tandvård för hela familjen. Vi söker dig som är legitimerad tandhygienist med minst 2 års arbetslivserfarenhet.\nVi söker dig som sätter högt värde på kvalité och service. Du är social och har förmågan att kombinera högkvalitativ tandvård med ett bra patientbemötande. Samtidigt som du alltid eftersträvar att ge dina patienter bästa möjliga vård, är du självklart även en trevlig kollega att ha i teamet och du bidrar med en positiv arbetsanda. Ditt arbete ska hålla hög odontologisk kvalitet för att tillsammans med resten av teamet skapa den bästa möjliga vården för våra patienter. Du behöver också ha mycket goda kunskaper i svenska språket och gärna erfarenhet av journalsystemet Opus.\nArbetsomfattning är tänkt vara 50% per vecka. Det kan dock diskuteras. \nUrval sker löpande och tillsättning av tjänsten kan komma att ske innan sista ansökningsdag. Vi ser fram emot din ansökan!\nÖppen för alla\nVi fokuserar på din kompetens, inte dina övriga förutsättningar. Vi är öppna för att anpassa rollen eller arbetsplatsen efter dina behov."
      },
      "headline" : "Tandhygienist till Järfälla Familjetandläkarna",
      "driving_license" : null,
      "employer" : {
        "email" : null,
        "phone_number" : null,
        "organization_number" : "5590644935",
        "name" : "Järfälla Familjetandläkarna AB",
        "url" : "https://familjetandlakarna.se",
        "workplace" : "Järfälla Familjetandläkarna AB"
      },
      "removed_date" : null,
      "logo_url" : "https://www.arbetsformedlingen.se/rest/arbetsgivare/rest/af/v3/arbetsplatser/86178701/logotyper/logo.png",
      "last_publication_date" : "2022-09-15T23:59:59",
      "number_of_vacancies" : 1,
      "occupation" : {
        "concept_id" : "TPRY_Wze_q6x",
        "label" : "Tandhygienist",
        "legacy_ams_taxonomy_id" : "5723"
      },
      "occupation_group" : {
        "concept_id" : "4F9o_Jzv_Pwz",
        "label" : "Tandhygienister",
        "legacy_ams_taxonomy_id" : "3250"
      },
      "employment_type" : {
        "concept_id" : "PFZr_Syz_cUq",
        "label" : "Vanlig anställning",
        "legacy_ams_taxonomy_id" : "1"
      },
      "webpage_url" : "https://arbetsformedlingen.se/platsbanken/annonser/26412865",
      "driving_license_required" : false,
      "application_contacts" : [ ],
      "duration" : {
        "concept_id" : "a7uU_j21_mkL",
        "label" : "Tills vidare",
        "legacy_ams_taxonomy_id" : "1"
      },
      "nice_to_have" : {
        "education_level" : [ ],
        "work_experiences" : [ ],
        "skills" : [ ],
        "education" : [ ],
        "languages" : [ ]
      },
      "application_details" : {
        "via_af" : false,
        "email" : "rekrytering@familjetandlakarna.se",
        "other" : null,
        "reference" : "Tandhygienist",
        "url" : null,
        "information" : null
      },
      "source_type" : "VIA_ANNONSERA",
      "application_deadline" : "2022-09-15T23:59:59",
      "external_id" : null,
      "workplace_address" : {
        "coordinates" : [ 17.84097667764997, 59.40757143051165 ],
        "city" : "Järfälla",
        "postcode" : "17541",
        "municipality" : "Järfälla",
        "region_concept_id" : "CifL_Rzy_Mku",
        "region" : "Stockholms län",
        "country_code" : "199",
        "region_code" : "01",
        "municipality_concept_id" : "qm5H_jsD_fUF",
        "country_concept_id" : "i46j_HmG_v64",
        "municipality_code" : "0123",
        "street_address" : "Nettovägen 1",
        "country" : "Sverige"
      },
      "id" : "26412865",
      "experience_required" : true,
      "working_hours_type" : {
        "concept_id" : "947z_JGS_Uk2",
        "label" : "Deltid",
        "legacy_ams_taxonomy_id" : "2"
      },
      "access" : null,
      "timestamp" : 1660631340274,
      "must_have" : {
        "education_level" : [ {
          "concept_id" : "asZm_TEQ_Srk",
          "weight" : 10,
          "label" : "Eftergymnasial utbildning två år eller längre",
          "legacy_ams_taxonomy_id" : "6"
        } ],
        "work_experiences" : [ {
          "concept_id" : "TPRY_Wze_q6x",
          "weight" : 10,
          "label" : "Tandhygienist",
          "legacy_ams_taxonomy_id" : "5723"
        } ],
        "skills" : [ ],
        "education" : [ {
          "concept_id" : "z5Xu_PfE_R8p",
          "weight" : 10,
          "label" : "Hälso- och sjukvård",
          "legacy_ams_taxonomy_id" : "20"
        } ],
        "languages" : [ {
          "concept_id" : "zSLA_vw2_FXN",
          "weight" : 10,
          "label" : "Svenska",
          "legacy_ams_taxonomy_id" : "502"
        } ]
      },
      "occupation_field" : {
        "concept_id" : "NYW6_mP6_vwf",
        "label" : "Hälso- och sjukvård",
        "legacy_ams_taxonomy_id" : "8"
      },
      "scope_of_work" : {
        "min" : 0,
        "max" : 100
      },
      "salary_type" : {
        "concept_id" : "asrX_9Df_ukn",
        "label" : "Fast och rörlig lön",
        "legacy_ams_taxonomy_id" : "7"
      },
      "removed" : false,
      "salary_description" : null,
      "access_to_own_car" : false,
      "publication_date" : "2022-08-16T08:29:00"
    },
    "name" : "Tandhygienist till Järfälla Familjetandläkarna",
    "user" : "hannes"
  },
  "sha1" : "d4197504d38818699de691325c0e7344ca03a38a",
  "annotations" : [ {
    "preferred-label" : "Tandhygienist",
    "sentiment" : "MUST_HAVE",
    "type" : "occupation-name",
    "start-position" : 0,
    "end-position" : 13,
    "concept-id" : "TPRY_Wze_q6x",
    "matched-string" : "tandhygienist",
    "annotation-id" : 0
  }, {
    "preferred-label" : "Järfälla",
    "sentiment" : "NOT_RELEVANT",
    "type" : "municipality",
    "start-position" : 19,
    "end-position" : 27,
    "concept-id" : "qm5H_jsD_fUF",
    "matched-string" : "Järfälla",
    "annotation-id" : 5
  }, {
    "preferred-label" : "Tandvård",
    "sentiment" : "NOT_RELEVANT",
    "type" : "keyword",
    "start-position" : 123,
    "end-position" : 131,
    "concept-id" : "ba6n_RTw_PEr",
    "matched-string" : "tandvård",
    "annotation-id" : 1
  }, {
    "preferred-label" : "Tandhygienist",
    "sentiment" : "MUST_HAVE",
    "type" : "occupation-name",
    "start-position" : 183,
    "end-position" : 196,
    "concept-id" : "TPRY_Wze_q6x",
    "matched-string" : "tandhygienist",
    "annotation-id" : 2
  }, {
    "preferred-label" : "2-4 års erfarenhet",
    "sentiment" : "MUST_HAVE",
    "type" : "occupation-experience-year",
    "start-position" : 207,
    "end-position" : 233,
    "concept-id" : "RWA2_uu6_udD",
    "matched-string" : "2 års arbetslivserfarenhet",
    "annotation-id" : 6
  }, {
    "preferred-label" : "Tandvård",
    "sentiment" : "MUST_HAVE",
    "type" : "keyword",
    "start-position" : 352,
    "end-position" : 360,
    "concept-id" : "ba6n_RTw_PEr",
    "matched-string" : "tandvård",
    "annotation-id" : 3
  }, {
    "preferred-label" : "Svenska språket",
    "sentiment" : "MUST_HAVE",
    "type" : "keyword",
    "start-position" : 752,
    "end-position" : 767,
    "concept-id" : "BiGm_58D_SSn",
    "matched-string" : "svenska språket",
    "annotation-id" : 4
  }, {
    "preferred-label" : "Deltid",
    "sentiment" : "OFFERED",
    "type" : "worktime-extent",
    "start-position" : 845,
    "end-position" : 848,
    "concept-id" : "947z_JGS_Uk2",
    "matched-string" : "50%",
    "annotation-id" : 7
  } ],
  "text" : "Tandhygienist till Järfälla Familjetandläkarna\nFamiljetandläkarna är ett snabbt växande företag som erbjuder högkvalitativ tandvård för hela familjen. Vi söker dig som är legitimerad tandhygienist med minst 2 års arbetslivserfarenhet.\nVi söker dig som sätter högt värde på kvalité och service. Du är social och har förmågan att kombinera högkvalitativ tandvård med ett bra patientbemötande. Samtidigt som du alltid eftersträvar att ge dina patienter bästa möjliga vård, är du självklart även en trevlig kollega att ha i teamet och du bidrar med en positiv arbetsanda. Ditt arbete ska hålla hög odontologisk kvalitet för att tillsammans med resten av teamet skapa den bästa möjliga vården för våra patienter. Du behöver också ha mycket goda kunskaper i svenska språket och gärna erfarenhet av journalsystemet Opus.\nArbetsomfattning är tänkt vara 50% per vecka. Det kan dock diskuteras. \nUrval sker löpande och tillsättning av tjänsten kan komma att ske innan sista ansökningsdag. Vi ser fram emot din ansökan!\nÖppen för alla\nVi fokuserar på din kompetens, inte dina övriga förutsättningar. Vi är öppna för att anpassa rollen eller arbetsplatsen efter dina behov."
}