{
  "meta" : {
    "jobad" : {
      "description" : {
        "requirements" : null,
        "needs" : null,
        "company_information" : null,
        "text_formatted" : "Kunnig, erfaren, pålitlig administrativ kökschef för en tillsvidareanställning med tjänstgöring i Sälen under vinterhalvåret och Öland under sommartid - rena rama drömjobbet!!\n\nUtmärkelsebelönade Restaurang Lammet & Grisen erbjuder nu ett stimulerande administrativt kökschefsjobb i ett av Sveriges mest kända restaurangföretag. Du bör älska ditt arbete, men också innebörden av att vara i svenska fjällen med snö och friluftsliv halvårsvis och på de Ölandska vidderna under sommarmånaderna.\n\nTJÄNST\nAdministrativ Kökschef med möjlighet till tillsvidareanställning. Du är en av två kökschefer där DU är administrativt ansvarig och din kollega kreativt ansvarig samt har arbetsledningsansvar. Ni jobbar som ett starkt team. Flytande svenska är nödvändig för tjänsten.\n\nIndividuell lön. Du arbetar januari-april i Sälen samt juni-augusti på Öland med normal veckovila och har semester samt betald ledighet maj, september och oktober. Körkort och bil är nödvändigt.\n\nRekryteringen går via Watersheds, men du anställs direkt av Restaurang Lammet & Grisen.\n\nSTART/BOSTAD\n1 november 2022, gärna tidigare. Riktgt bra boende hjälper vi till med. Hyran beror på boendeformen.\n\nPROFIL\nDu har tidigare erfarenhet som kökschef med huvudansvar för administration. Du har därför god insikt i schemaläggning, beställningar, kunskap i köksekonomi samt gillar att leda, coacha och utveckla ett köksteam. I tjänsten kommer du givetvis även att jobba med att skapa nya rätter, skriva recept samt menyer. I Sälen är du även schemalagd i vår fantastiska butik några timmar i veckan.\n\nVi jobbar väldigt mycket med mat och dryck i kombination så du kommer tillsammans med vår huvudsommelier sätta riktigt bra smakkombinationer. Ett genuint matintresse är en given förutsättning för att du ska fungera och trivas hos oss. Du bör ha kunskap om HACCP och gilla hög nivå på kökshygien.\n\nArbetsteamet består av 12 st kockar/köksbiträden, 2 köksmästare, 2 souschefer samt 2 diskare. Vi månar om att man hjälps man åt som ett team.\n\nVÅRA VÄRDERINGAR\nVårt hållbarhetstänkande genomsyrar hela verksamheten - personal, gäster och samhälle.\n\nDet yttrar sig i att vi skapar förutsättningar för att t ex våra anställda varje arbetsdag sitter ner och äter riktigt bra och vällagad mat, men även att vi väljer lokalproducerat, sparar på miljön och bidrar till att de småskaliga jordbruken, tillverkarna och producenterna i Sälen och på Öland kan verka med produkter i världsklass! Vi ser ständigt över energiförsörjningen, ventilation, värmeåtervinning m m - vi tar vårt ansvar och det är därför viktigt att du som kökschef har en samsyn och vidareförmedlar den till alla personal.\n\nLAMMET & GRISEN\n\nVi har en lång historia av att servera helstekt lamm och gris - som trancheras av våra kockar framför gästerna. Gästerna väljer mellan en uppsjö av tillbehör, varma som kalla, lagade på lokal och regionala råvaror. Vårt koncept finns även i vegetarisk eller vegansk version. I Sälen har vi även en butik och gedigen vinkällare. Läs gärna mer innan intervjun på www.lammet.nu.\n\n\n\nANSÖKAN\nVi tar bara emot ansökningar genom vårt rekryteringsverktyg (inte mail!). Svara på alla frågor och se till att du är anträffbar via mail så snart vi kallar till intervju.",
        "conditions" : "Heltid\r\nAnställningstid enligt överenskommelse",
        "text" : "Kunnig, erfaren, pålitlig administrativ kökschef för en tillsvidareanställning med tjänstgöring i Sälen under vinterhalvåret och Öland under sommartid - rena rama drömjobbet!!\n\nUtmärkelsebelönade Restaurang Lammet & Grisen erbjuder nu ett stimulerande administrativt kökschefsjobb i ett av Sveriges mest kända restaurangföretag. Du bör älska ditt arbete, men också innebörden av att vara i svenska fjällen med snö och friluftsliv halvårsvis och på de Ölandska vidderna under sommarmånaderna.\n\nTJÄNST\nAdministrativ Kökschef med möjlighet till tillsvidareanställning. Du är en av två kökschefer där DU är administrativt ansvarig och din kollega kreativt ansvarig samt har arbetsledningsansvar. Ni jobbar som ett starkt team. Flytande svenska är nödvändig för tjänsten.\n\nIndividuell lön. Du arbetar januari-april i Sälen samt juni-augusti på Öland med normal veckovila och har semester samt betald ledighet maj, september och oktober. Körkort och bil är nödvändigt.\n\nRekryteringen går via Watersheds, men du anställs direkt av Restaurang Lammet & Grisen.\n\nSTART/BOSTAD\n1 november 2022, gärna tidigare. Riktgt bra boende hjälper vi till med. Hyran beror på boendeformen.\n\nPROFIL\nDu har tidigare erfarenhet som kökschef med huvudansvar för administration. Du har därför god insikt i schemaläggning, beställningar, kunskap i köksekonomi samt gillar att leda, coacha och utveckla ett köksteam. I tjänsten kommer du givetvis även att jobba med att skapa nya rätter, skriva recept samt menyer. I Sälen är du även schemalagd i vår fantastiska butik några timmar i veckan.\n\nVi jobbar väldigt mycket med mat och dryck i kombination så du kommer tillsammans med vår huvudsommelier sätta riktigt bra smakkombinationer. Ett genuint matintresse är en given förutsättning för att du ska fungera och trivas hos oss. Du bör ha kunskap om HACCP och gilla hög nivå på kökshygien.\n\nArbetsteamet består av 12 st kockar/köksbiträden, 2 köksmästare, 2 souschefer samt 2 diskare. Vi månar om att man hjälps man åt som ett team.\n\nVÅRA VÄRDERINGAR\nVårt hållbarhetstänkande genomsyrar hela verksamheten - personal, gäster och samhälle.\n\nDet yttrar sig i att vi skapar förutsättningar för att t ex våra anställda varje arbetsdag sitter ner och äter riktigt bra och vällagad mat, men även att vi väljer lokalproducerat, sparar på miljön och bidrar till att de småskaliga jordbruken, tillverkarna och producenterna i Sälen och på Öland kan verka med produkter i världsklass! Vi ser ständigt över energiförsörjningen, ventilation, värmeåtervinning m m - vi tar vårt ansvar och det är därför viktigt att du som kökschef har en samsyn och vidareförmedlar den till alla personal.\n\nLAMMET & GRISEN\n\nVi har en lång historia av att servera helstekt lamm och gris - som trancheras av våra kockar framför gästerna. Gästerna väljer mellan en uppsjö av tillbehör, varma som kalla, lagade på lokal och regionala råvaror. Vårt koncept finns även i vegetarisk eller vegansk version. I Sälen har vi även en butik och gedigen vinkällare. Läs gärna mer innan intervjun på www.lammet.nu.\n\n\n\nANSÖKAN\nVi tar bara emot ansökningar genom vårt rekryteringsverktyg (inte mail!). Svara på alla frågor och se till att du är anträffbar via mail så snart vi kallar till intervju."
      },
      "headline" : "Söker du jobb som Administrativ Kökschef är detta tjänsten med stort T! ...",
      "driving_license" : null,
      "employer" : {
        "email" : null,
        "phone_number" : null,
        "organization_number" : "5568460066",
        "name" : "Watersheds AB",
        "url" : null,
        "workplace" : "Watersheds "
      },
      "removed_date" : null,
      "logo_url" : "https://www.arbetsformedlingen.se/rest/arbetsgivare/rest/af/v3/organisation/5568460066/logotyper/logo.png",
      "last_publication_date" : "2022-08-31T23:59:59",
      "number_of_vacancies" : 1,
      "occupation" : {
        "concept_id" : "otpy_PEs_Cjn",
        "label" : "Chefskock",
        "legacy_ams_taxonomy_id" : "217"
      },
      "occupation_group" : {
        "concept_id" : "XGyi_i4B_ME7",
        "label" : "Köksmästare och souschefer",
        "legacy_ams_taxonomy_id" : "3451"
      },
      "employment_type" : {
        "concept_id" : "PFZr_Syz_cUq",
        "label" : "Vanlig anställning",
        "legacy_ams_taxonomy_id" : "1"
      },
      "webpage_url" : "https://arbetsformedlingen.se/platsbanken/annonser/26379510",
      "driving_license_required" : false,
      "application_contacts" : [ {
        "description" : "Tina Wedholm",
        "email" : "tina.wedholm@watersheds.se",
        "telephone" : "+46 70 670 20 30",
        "name" : null,
        "contact_type" : null
      } ],
      "duration" : {
        "concept_id" : "a7uU_j21_mkL",
        "label" : "Tills vidare",
        "legacy_ams_taxonomy_id" : "1"
      },
      "nice_to_have" : {
        "education_level" : [ ],
        "work_experiences" : [ ],
        "skills" : [ ],
        "education" : [ ],
        "languages" : [ ]
      },
      "application_details" : {
        "via_af" : false,
        "email" : null,
        "other" : null,
        "reference" : null,
        "url" : "https://framtid.watersheds.se/jobs/1955241-soker-du-jobb-som-administrativ-kokschef-ar-detta-tjansten-med-stort-t-restaurang-lammet-grisen-till?promotion=458960-arbetsformedlingen",
        "information" : null
      },
      "source_type" : "VIA_PLATSBANKEN_DXA",
      "application_deadline" : "2022-08-31T23:59:59",
      "external_id" : "46-556846-0066-1955241-5",
      "workplace_address" : {
        "coordinates" : [ null, null ],
        "city" : null,
        "postcode" : null,
        "municipality" : null,
        "region_concept_id" : null,
        "region" : null,
        "country_code" : "199",
        "region_code" : null,
        "municipality_concept_id" : null,
        "country_concept_id" : "i46j_HmG_v64",
        "municipality_code" : null,
        "street_address" : null,
        "country" : "Sverige"
      },
      "id" : "26379510",
      "experience_required" : true,
      "working_hours_type" : {
        "concept_id" : "6YE1_gAC_R2G",
        "label" : "Heltid",
        "legacy_ams_taxonomy_id" : "1"
      },
      "access" : null,
      "timestamp" : 1659681497220,
      "must_have" : {
        "education_level" : [ ],
        "work_experiences" : [ {
          "concept_id" : "otpy_PEs_Cjn",
          "weight" : 10,
          "label" : "Chefskock",
          "legacy_ams_taxonomy_id" : "217"
        } ],
        "skills" : [ ],
        "education" : [ ],
        "languages" : [ ]
      },
      "occupation_field" : {
        "concept_id" : "ScKy_FHB_7wT",
        "label" : "Hotell, restaurang, storhushåll",
        "legacy_ams_taxonomy_id" : "7"
      },
      "scope_of_work" : {
        "min" : 100,
        "max" : 100
      },
      "salary_type" : {
        "concept_id" : "oG8G_9cW_nRf",
        "label" : "Fast månads- vecko- eller timlön",
        "legacy_ams_taxonomy_id" : "1"
      },
      "removed" : false,
      "salary_description" : "Lön enligt överenskommelse",
      "access_to_own_car" : false,
      "publication_date" : "2022-08-05T08:38:17"
    },
    "name" : "Söker du jobb som Administrativ Kökschef är detta tjänsten med stort T! ...",
    "user" : "hannes"
  },
  "sha1" : "56714b7f950a1369d1332ba3707b158bcea498eb",
  "annotations" : [ {
    "preferred-label" : "Administrativ kökschef",
    "sentiment" : "MUST_HAVE",
    "type" : "keyword",
    "start-position" : 18,
    "end-position" : 40,
    "concept-id" : "84Jy_YeX_gky",
    "matched-string" : "administrativ kökschef",
    "annotation-id" : 0
  }, {
    "preferred-label" : "Administrativ kökschef",
    "sentiment" : "MUST_HAVE",
    "type" : "keyword",
    "start-position" : 102,
    "end-position" : 124,
    "concept-id" : "84Jy_YeX_gky",
    "matched-string" : "administrativ kökschef",
    "annotation-id" : 1
  }, {
    "preferred-label" : "Tillsvidareanställning (inkl. eventuell provanställning)",
    "type" : "employment-type",
    "start-position" : 132,
    "end-position" : 154,
    "concept-id" : "kpPX_CNN_gDU",
    "matched-string" : "tillsvidareanställning",
    "annotation-id" : 17
  }, {
    "preferred-label" : "Restaurang",
    "sentiment" : "MUST_HAVE",
    "type" : "keyword",
    "start-position" : 272,
    "end-position" : 282,
    "concept-id" : "o2Cg_3Ap_qvK",
    "matched-string" : "restaurang",
    "annotation-id" : 2
  }, {
    "preferred-label" : "Kökschef",
    "type" : "occupation-name",
    "start-position" : 343,
    "end-position" : 356,
    "concept-id" : "kntm_Uen_7Bn",
    "matched-string" : "kökschefsjobb",
    "annotation-id" : 18
  }, {
    "preferred-label" : "Svenska",
    "sentiment" : "MUST_HAVE",
    "type" : "language",
    "start-position" : 466,
    "end-position" : 473,
    "concept-id" : "zSLA_vw2_FXN",
    "matched-string" : "svenska",
    "annotation-id" : 3
  }, {
    "preferred-label" : "Friluftsliv",
    "sentiment" : "MUST_HAVE",
    "type" : "keyword",
    "start-position" : 494,
    "end-position" : 505,
    "concept-id" : "B7hB_AUU_7eC",
    "matched-string" : "friluftsliv",
    "annotation-id" : 4
  }, {
    "preferred-label" : "Administrativ kökschef",
    "sentiment" : "MUST_HAVE",
    "type" : "keyword",
    "start-position" : 576,
    "end-position" : 598,
    "concept-id" : "84Jy_YeX_gky",
    "matched-string" : "administrativ kökschef",
    "annotation-id" : 5
  }, {
    "preferred-label" : "Tillsvidareanställning (inkl. eventuell provanställning)",
    "type" : "employment-type",
    "start-position" : 618,
    "end-position" : 640,
    "concept-id" : "kpPX_CNN_gDU",
    "matched-string" : "tillsvidareanställning",
    "annotation-id" : 19
  }, {
    "preferred-label" : "Kökschef",
    "type" : "occupation-name",
    "start-position" : 658,
    "end-position" : 668,
    "concept-id" : "kntm_Uen_7Bn",
    "matched-string" : "kökschefer",
    "annotation-id" : 20
  }, {
    "preferred-label" : "Svenska",
    "sentiment" : "MUST_HAVE",
    "type" : "language",
    "start-position" : 808,
    "end-position" : 815,
    "concept-id" : "zSLA_vw2_FXN",
    "matched-string" : "svenska",
    "annotation-id" : 6
  }, {
    "preferred-label" : "körkort",
    "type" : "esco-skill",
    "start-position" : 1008,
    "end-position" : 1015,
    "concept-id" : "UvDr_eNo_HSQ",
    "matched-string" : "Körkort",
    "annotation-id" : 21
  }, {
    "preferred-label" : "Restaurang",
    "sentiment" : "MUST_HAVE",
    "type" : "keyword",
    "start-position" : 1100,
    "end-position" : 1110,
    "concept-id" : "o2Cg_3Ap_qvK",
    "matched-string" : "restaurang",
    "annotation-id" : 7
  }, {
    "preferred-label" : "Kökschef",
    "sentiment" : "MUST_HAVE",
    "type" : "occupation-name",
    "start-position" : 1282,
    "end-position" : 1290,
    "concept-id" : "kntm_Uen_7Bn",
    "matched-string" : "kökschef",
    "annotation-id" : 8
  }, {
    "preferred-label" : "Butik",
    "sentiment" : "MUST_HAVE",
    "type" : "keyword",
    "start-position" : 1609,
    "end-position" : 1614,
    "concept-id" : "xLsd_zjY_5wr",
    "matched-string" : "butik",
    "annotation-id" : 9
  }, {
    "preferred-label" : "Kock",
    "type" : "keyword",
    "start-position" : 1965,
    "end-position" : 1971,
    "concept-id" : "RTQf_1Qm_YhD",
    "matched-string" : "kockar",
    "annotation-id" : 22
  }, {
    "preferred-label" : "Köksbiträde",
    "type" : "occupation-name",
    "start-position" : 1972,
    "end-position" : 1984,
    "concept-id" : "oRB5_b7i_Qzv",
    "matched-string" : "köksbiträden",
    "annotation-id" : 23
  }, {
    "preferred-label" : "köksmästare",
    "sentiment" : "MUST_HAVE",
    "type" : "esco-occupation",
    "start-position" : 1988,
    "end-position" : 1999,
    "concept-id" : "tNA4_ywP_j5q",
    "matched-string" : "köksmästare",
    "annotation-id" : 10
  }, {
    "preferred-label" : "Souschef",
    "type" : "occupation-name",
    "start-position" : 2003,
    "end-position" : 2013,
    "concept-id" : "iugg_Qq9_QHH",
    "matched-string" : "souschefer",
    "annotation-id" : 24
  }, {
    "preferred-label" : "Diskare",
    "sentiment" : "MUST_HAVE",
    "type" : "occupation-name",
    "start-position" : 2021,
    "end-position" : 2028,
    "concept-id" : "pKTY_Kwu_sUw",
    "matched-string" : "diskare",
    "annotation-id" : 11
  }, {
    "preferred-label" : "Personal",
    "sentiment" : "MUST_HAVE",
    "type" : "keyword",
    "start-position" : 2152,
    "end-position" : 2160,
    "concept-id" : "HVxM_6MS_y1c",
    "matched-string" : "personal",
    "annotation-id" : 12
  }, {
    "preferred-label" : "Kökschef",
    "sentiment" : "MUST_HAVE",
    "type" : "occupation-name",
    "start-position" : 2653,
    "end-position" : 2661,
    "concept-id" : "kntm_Uen_7Bn",
    "matched-string" : "kökschef",
    "annotation-id" : 13
  }, {
    "preferred-label" : "Personal",
    "sentiment" : "MUST_HAVE",
    "type" : "keyword",
    "start-position" : 2710,
    "end-position" : 2718,
    "concept-id" : "HVxM_6MS_y1c",
    "matched-string" : "personal",
    "annotation-id" : 14
  }, {
    "preferred-label" : "Butik",
    "sentiment" : "MUST_HAVE",
    "type" : "keyword",
    "start-position" : 3036,
    "end-position" : 3041,
    "concept-id" : "xLsd_zjY_5wr",
    "matched-string" : "butik",
    "annotation-id" : 16
  } ],
  "text" : "Söker du jobb som Administrativ Kökschef är detta tjänsten med stort T! ...\nKunnig, erfaren, pålitlig administrativ kökschef för en tillsvidareanställning med tjänstgöring i Sälen under vinterhalvåret och Öland under sommartid - rena rama drömjobbet!!\n\nUtmärkelsebelönade Restaurang Lammet & Grisen erbjuder nu ett stimulerande administrativt kökschefsjobb i ett av Sveriges mest kända restaurangföretag. Du bör älska ditt arbete, men också innebörden av att vara i svenska fjällen med snö och friluftsliv halvårsvis och på de Ölandska vidderna under sommarmånaderna.\n\nTJÄNST\nAdministrativ Kökschef med möjlighet till tillsvidareanställning. Du är en av två kökschefer där DU är administrativt ansvarig och din kollega kreativt ansvarig samt har arbetsledningsansvar. Ni jobbar som ett starkt team. Flytande svenska är nödvändig för tjänsten.\n\nIndividuell lön. Du arbetar januari-april i Sälen samt juni-augusti på Öland med normal veckovila och har semester samt betald ledighet maj, september och oktober. Körkort och bil är nödvändigt.\n\nRekryteringen går via Watersheds, men du anställs direkt av Restaurang Lammet & Grisen.\n\nSTART/BOSTAD\n1 november 2022, gärna tidigare. Riktgt bra boende hjälper vi till med. Hyran beror på boendeformen.\n\nPROFIL\nDu har tidigare erfarenhet som kökschef med huvudansvar för administration. Du har därför god insikt i schemaläggning, beställningar, kunskap i köksekonomi samt gillar att leda, coacha och utveckla ett köksteam. I tjänsten kommer du givetvis även att jobba med att skapa nya rätter, skriva recept samt menyer. I Sälen är du även schemalagd i vår fantastiska butik några timmar i veckan.\n\nVi jobbar väldigt mycket med mat och dryck i kombination så du kommer tillsammans med vår huvudsommelier sätta riktigt bra smakkombinationer. Ett genuint matintresse är en given förutsättning för att du ska fungera och trivas hos oss. Du bör ha kunskap om HACCP och gilla hög nivå på kökshygien.\n\nArbetsteamet består av 12 st kockar/köksbiträden, 2 köksmästare, 2 souschefer samt 2 diskare. Vi månar om att man hjälps man åt som ett team.\n\nVÅRA VÄRDERINGAR\nVårt hållbarhetstänkande genomsyrar hela verksamheten - personal, gäster och samhälle.\n\nDet yttrar sig i att vi skapar förutsättningar för att t ex våra anställda varje arbetsdag sitter ner och äter riktigt bra och vällagad mat, men även att vi väljer lokalproducerat, sparar på miljön och bidrar till att de småskaliga jordbruken, tillverkarna och producenterna i Sälen och på Öland kan verka med produkter i världsklass! Vi ser ständigt över energiförsörjningen, ventilation, värmeåtervinning m m - vi tar vårt ansvar och det är därför viktigt att du som kökschef har en samsyn och vidareförmedlar den till alla personal.\n\nLAMMET & GRISEN\n\nVi har en lång historia av att servera helstekt lamm och gris - som trancheras av våra kockar framför gästerna. Gästerna väljer mellan en uppsjö av tillbehör, varma som kalla, lagade på lokal och regionala råvaror. Vårt koncept finns även i vegetarisk eller vegansk version. I Sälen har vi även en butik och gedigen vinkällare. Läs gärna mer innan intervjun på www.lammet.nu.\n\n\n\nANSÖKAN\nVi tar bara emot ansökningar genom vårt rekryteringsverktyg (inte mail!). Svara på alla frågor och se till att du är anträffbar via mail så snart vi kallar till intervju."
}