{
  "meta" : {
    "jobad" : {
      "description" : {
        "requirements" : null,
        "needs" : null,
        "company_information" : null,
        "text_formatted" : "Skandia i Stockholm söker en Dynamics-utvecklare som vill vara en del av vår satsning inom Dynamics 365 Customer Engagement!  \n\nSom Dynamics-utvecklare hos Skandia i Stockholm får du jobba nära verksamheten, med verksamhetskritiska system och komplex affärslogik. Vi är inne i en stor satsning på Dynamics 365 och har en expansiv handlingsplan för nya funktioner i plattformen de kommande åren. Med vår platta organisation och korta beslutsvägar är det inte långt från idé till verklighet, så här finns det stora möjligheter för dig att påverka vägen framåt!\n\nDitt anställningserbjudande\n\n • Möjligheten att jobba i en roll med många kontaktytor, där du har ett tätt samarbete med både verksamheten och arkitekter/utvecklare i flera olika team\n • En chef som kommer ge dig stort förtroende och handlingsutrymme samt säkerställa din personliga utveckling\n • En arbetsgivare som värnar om balans mellan privatliv och arbetsliv med fina personalförmåner; försäkringar, ränteförmåner, subventionerade luncher, gym i huset m.m.\n\nDina arbetsuppgifter\n\nDu kommer att tillhöra ett av våra team inom kundområdet. Teamet är centralt för Skandias satsningar inom Dynamics 365 och arbetar med allt från kravförståelse, design, implementation och test i en miljö med högt i tak och en god sammanhållning.\nDu kommer bland annat att:\n\n • Utveckla och konfigurera lösningar som bygger på Dynamics 365\n • Programmera med C#, TypeScript och React samt jobba med enhetstestning\n • Delta i design av nya lösningar och bidra till en långsiktigt hållbar arkitektur i applikationerna\n • Bidra till Skandias förflyttning till molnet\n • Se till att vi fortsatt befinner oss i teknikens framkant\n\nVidare kommer du att stötta andra team som vill implementera lösningar i plattformen. Genom ett gott samarbete med andra arkitekter och utvecklare säkerställer du att det finns en gemensam struktur på Skandia. Du kommer även få möjlighet att medverka till övriga medarbetares kompetensutveckling inom Dynamics 365 och Power Platform.\n\nVärt att veta\n\nDitt närmaste team består av Utvecklare, Mjukvaruarkitekt, Testare, Scrum Master, Systemansvarig och Produktägare. Vi jobbar enligt ramverket SAFe (Scaled Agile Framework) med aktiviteter som sprintplanering, daglig standup, review och retro. Vi jobbar även med Mob-programmering, Innovation Days och Hackathons för att främja kompetensutveckling och kompetensöverföring mellan kollegor. Kontoret är beläget i centrala Stockholm, på Kungsholmen. Vi har ett flexibelt arbetssätt och du har möjlighet att arbeta hemifrån delar av veckan.\n\nVåra förväntningar\n\nVi testar nya vägar tillsammans, och söker dig som är nyfiken och vill vara med i vår utveckling framåt! Ett nära och bra samarbete är något som genomsyrar kulturen i teamet, därför trivs du i en miljö där du får samarbeta med andra för att lösa problem och nå gemensamma mål. Du motiveras av att arbeta nära verksamheten och är intresserad av att sätta dig in i användarnas behov för att hitta de bästa möjliga lösningarna.\n\nDu har tidigare erfarenhet av Dynamics 365 Customer Engagement och Power Platform. Du har även programmerat med C# och är intresserad av att lära dig TypeScript och React. Du kommunicerar på svenska i tal och skrift.\n\nVarmt välkommen med din ansökan!\n\nIntresserad?\nI den här rekryteringen har vi valt att samarbeta med Ada Digital som strävar efter en transparent, inkluderande och snabbrörlig rekryteringsupplevelse. Vi vill veta mer om dig och din potential! Du söker tjänsten enkelt och behöver inte bifoga några dokument. Det räcker med en motivering till varför du söker tjänsten och om du saknar CV kan du bifoga din LinkedIn-profil. Följ sedan din ansökan live via vår hemsida. Urvalet sker löpande och tjänsten kan bli tillsatt före sista ansökningsdatum. Är du nyfiken och vill veta mer innan du söker? Hör av dig till ansvarig rekryterare. Vi ser fram emot att få kontakt med dig!",
        "conditions" : "Heltid\r\nTillsvidare",
        "text" : "Skandia i Stockholm söker en Dynamics-utvecklare som vill vara en del av vår satsning inom Dynamics 365 Customer Engagement!  \n\nSom Dynamics-utvecklare hos Skandia i Stockholm får du jobba nära verksamheten, med verksamhetskritiska system och komplex affärslogik. Vi är inne i en stor satsning på Dynamics 365 och har en expansiv handlingsplan för nya funktioner i plattformen de kommande åren. Med vår platta organisation och korta beslutsvägar är det inte långt från idé till verklighet, så här finns det stora möjligheter för dig att påverka vägen framåt!\n\nDitt anställningserbjudande\n\n • Möjligheten att jobba i en roll med många kontaktytor, där du har ett tätt samarbete med både verksamheten och arkitekter/utvecklare i flera olika team\n • En chef som kommer ge dig stort förtroende och handlingsutrymme samt säkerställa din personliga utveckling\n • En arbetsgivare som värnar om balans mellan privatliv och arbetsliv med fina personalförmåner; försäkringar, ränteförmåner, subventionerade luncher, gym i huset m.m.\n\nDina arbetsuppgifter\n\nDu kommer att tillhöra ett av våra team inom kundområdet. Teamet är centralt för Skandias satsningar inom Dynamics 365 och arbetar med allt från kravförståelse, design, implementation och test i en miljö med högt i tak och en god sammanhållning.\nDu kommer bland annat att:\n\n • Utveckla och konfigurera lösningar som bygger på Dynamics 365\n • Programmera med C#, TypeScript och React samt jobba med enhetstestning\n • Delta i design av nya lösningar och bidra till en långsiktigt hållbar arkitektur i applikationerna\n • Bidra till Skandias förflyttning till molnet\n • Se till att vi fortsatt befinner oss i teknikens framkant\n\nVidare kommer du att stötta andra team som vill implementera lösningar i plattformen. Genom ett gott samarbete med andra arkitekter och utvecklare säkerställer du att det finns en gemensam struktur på Skandia. Du kommer även få möjlighet att medverka till övriga medarbetares kompetensutveckling inom Dynamics 365 och Power Platform.\n\nVärt att veta\n\nDitt närmaste team består av Utvecklare, Mjukvaruarkitekt, Testare, Scrum Master, Systemansvarig och Produktägare. Vi jobbar enligt ramverket SAFe (Scaled Agile Framework) med aktiviteter som sprintplanering, daglig standup, review och retro. Vi jobbar även med Mob-programmering, Innovation Days och Hackathons för att främja kompetensutveckling och kompetensöverföring mellan kollegor. Kontoret är beläget i centrala Stockholm, på Kungsholmen. Vi har ett flexibelt arbetssätt och du har möjlighet att arbeta hemifrån delar av veckan.\n\nVåra förväntningar\n\nVi testar nya vägar tillsammans, och söker dig som är nyfiken och vill vara med i vår utveckling framåt! Ett nära och bra samarbete är något som genomsyrar kulturen i teamet, därför trivs du i en miljö där du får samarbeta med andra för att lösa problem och nå gemensamma mål. Du motiveras av att arbeta nära verksamheten och är intresserad av att sätta dig in i användarnas behov för att hitta de bästa möjliga lösningarna.\n\nDu har tidigare erfarenhet av Dynamics 365 Customer Engagement och Power Platform. Du har även programmerat med C# och är intresserad av att lära dig TypeScript och React. Du kommunicerar på svenska i tal och skrift.\n\nVarmt välkommen med din ansökan!\n\nIntresserad?\nI den här rekryteringen har vi valt att samarbeta med Ada Digital som strävar efter en transparent, inkluderande och snabbrörlig rekryteringsupplevelse. Vi vill veta mer om dig och din potential! Du söker tjänsten enkelt och behöver inte bifoga några dokument. Det räcker med en motivering till varför du söker tjänsten och om du saknar CV kan du bifoga din LinkedIn-profil. Följ sedan din ansökan live via vår hemsida. Urvalet sker löpande och tjänsten kan bli tillsatt före sista ansökningsdatum. Är du nyfiken och vill veta mer innan du söker? Hör av dig till ansvarig rekryterare. Vi ser fram emot att få kontakt med dig!"
      },
      "headline" : "Dynamics-utvecklare till Skandia i Stockholm",
      "driving_license" : null,
      "employer" : {
        "email" : null,
        "phone_number" : null,
        "organization_number" : "5566482781",
        "name" : "Tng Group AB",
        "url" : "https://www.tng.se/",
        "workplace" : "TNG Group AB"
      },
      "removed_date" : null,
      "logo_url" : "https://www.arbetsformedlingen.se/rest/arbetsgivare/rest/af/v3/organisation/5566482781/logotyper/logo.png",
      "last_publication_date" : "2022-07-20T23:59:59",
      "number_of_vacancies" : 1,
      "occupation" : {
        "concept_id" : "fg7B_yov_smw",
        "label" : "Systemutvecklare/Programmerare",
        "legacy_ams_taxonomy_id" : "2419"
      },
      "occupation_group" : {
        "concept_id" : "DJh5_yyF_hEM",
        "label" : "Mjukvaru- och systemutvecklare m.fl.",
        "legacy_ams_taxonomy_id" : "2512"
      },
      "employment_type" : {
        "concept_id" : "PFZr_Syz_cUq",
        "label" : "Vanlig anställning",
        "legacy_ams_taxonomy_id" : "1"
      },
      "webpage_url" : "https://arbetsformedlingen.se/platsbanken/annonser/26234704",
      "driving_license_required" : false,
      "application_contacts" : [ {
        "description" : "Erika Ekestam",
        "email" : "erika.ekestam@adadigital.se",
        "telephone" : "0702444717",
        "name" : null,
        "contact_type" : "Talent Business Partner"
      } ],
      "duration" : {
        "concept_id" : "a7uU_j21_mkL",
        "label" : "Tills vidare",
        "legacy_ams_taxonomy_id" : "1"
      },
      "nice_to_have" : {
        "education_level" : [ ],
        "work_experiences" : [ ],
        "skills" : [ ],
        "education" : [ ],
        "languages" : [ ]
      },
      "application_details" : {
        "via_af" : false,
        "email" : null,
        "other" : null,
        "reference" : null,
        "url" : "https://adadigital.se/lediga-jobb?jid=D826976F-E6B4-4EA4-839A-18A584363CE2&src=AMS",
        "information" : null
      },
      "source_type" : "VIA_PLATSBANKEN_DXA",
      "application_deadline" : "2022-07-20T23:59:59",
      "external_id" : "46-556648-2781-000001029327FF616B",
      "workplace_address" : {
        "coordinates" : [ 18.06858, 59.329323 ],
        "city" : null,
        "postcode" : null,
        "municipality" : "Stockholm",
        "region_concept_id" : "CifL_Rzy_Mku",
        "region" : "Stockholms län",
        "country_code" : "199",
        "region_code" : "01",
        "municipality_concept_id" : "AvNB_uwa_6n6",
        "country_concept_id" : "i46j_HmG_v64",
        "municipality_code" : "0180",
        "street_address" : null,
        "country" : "Sverige"
      },
      "id" : "26234704",
      "experience_required" : true,
      "working_hours_type" : {
        "concept_id" : "6YE1_gAC_R2G",
        "label" : "Heltid",
        "legacy_ams_taxonomy_id" : "1"
      },
      "access" : null,
      "timestamp" : 1655712118186,
      "must_have" : {
        "education_level" : [ ],
        "work_experiences" : [ {
          "concept_id" : "fg7B_yov_smw",
          "weight" : 10,
          "label" : "Systemutvecklare/Programmerare",
          "legacy_ams_taxonomy_id" : "2419"
        } ],
        "skills" : [ ],
        "education" : [ ],
        "languages" : [ ]
      },
      "occupation_field" : {
        "concept_id" : "apaJ_2ja_LuF",
        "label" : "Data/IT",
        "legacy_ams_taxonomy_id" : "3"
      },
      "scope_of_work" : {
        "min" : 100,
        "max" : 100
      },
      "salary_type" : {
        "concept_id" : "oG8G_9cW_nRf",
        "label" : "Fast månads- vecko- eller timlön",
        "legacy_ams_taxonomy_id" : "1"
      },
      "removed" : false,
      "salary_description" : "Fast lön",
      "access_to_own_car" : false,
      "publication_date" : "2022-06-20T10:01:58"
    },
    "name" : "Dynamics-utvecklare till Skandia i Stockholm",
    "user" : "fisko"
  },
  "sha1" : "8c9eda81355e9c43bfd84154f461375e65715fed",
  "annotations" : [ {
    "preferred-label" : "Affärssystem, produktkunskap",
    "sentiment" : "MUST_HAVE",
    "type" : "skill",
    "start-position" : 1417,
    "end-position" : 1429,
    "concept-id" : "AzHc_kX3_veu",
    "matched-string" : "Dynamics 365",
    "annotation-id" : 12
  }, {
    "preferred-label" : "C#, programmeringsspråk",
    "sentiment" : "MUST_HAVE",
    "type" : "skill",
    "start-position" : 1449,
    "end-position" : 1451,
    "concept-id" : "jBKc_5Yx_Y6T",
    "matched-string" : "C#",
    "annotation-id" : 13
  }, {
    "preferred-label" : "TypeScript, programmeringsspråk",
    "sentiment" : "MUST_HAVE",
    "type" : "skill",
    "start-position" : 1453,
    "end-position" : 1463,
    "concept-id" : "USj9_RR6_Q1z",
    "matched-string" : "typescript",
    "annotation-id" : 3
  }, {
    "preferred-label" : "React native, programmeringsspråk",
    "sentiment" : "MUST_HAVE",
    "type" : "skill",
    "start-position" : 1468,
    "end-position" : 1473,
    "concept-id" : "TdnY_1gB_9pZ",
    "matched-string" : "React",
    "annotation-id" : 14
  }, {
    "preferred-label" : "Mjukvaruutveckling",
    "sentiment" : "MUST_HAVE",
    "type" : "skill",
    "start-position" : 1489,
    "end-position" : 1503,
    "concept-id" : "A5HJ_aMw_BQt",
    "matched-string" : "enhetstestning",
    "annotation-id" : 15
  }, {
    "preferred-label" : "Mjukvaruutvecklare",
    "type" : "occupation-name",
    "start-position" : 2095,
    "end-position" : 2105,
    "concept-id" : "rQds_YGd_quU",
    "matched-string" : "Utvecklare",
    "annotation-id" : 16
  }, {
    "preferred-label" : "IT-arkitekt/Lösningsarkitekt",
    "type" : "occupation-name",
    "start-position" : 2107,
    "end-position" : 2123,
    "concept-id" : "uyJg_i94_xmr",
    "matched-string" : "Mjukvaruarkitekt",
    "annotation-id" : 17
  }, {
    "preferred-label" : "Scrum master",
    "sentiment" : "MUST_HAVE",
    "type" : "occupation-name",
    "start-position" : 2134,
    "end-position" : 2146,
    "concept-id" : "1UTZ_bS9_kUD",
    "matched-string" : "scrum master",
    "annotation-id" : 4
  }, {
    "preferred-label" : "Systemansvarig",
    "sentiment" : "MUST_HAVE",
    "type" : "occupation-name",
    "start-position" : 2148,
    "end-position" : 2162,
    "concept-id" : "wNG8_Rsg_RQc",
    "matched-string" : "systemansvarig",
    "annotation-id" : 5
  }, {
    "preferred-label" : "Customer Relationship Management/CRM",
    "sentiment" : "MUST_HAVE",
    "type" : "skill",
    "start-position" : 3079,
    "end-position" : 3111,
    "concept-id" : "dQre_aBF_3dE",
    "matched-string" : "Dynamics 365 Customer Engagement",
    "annotation-id" : 18
  }, {
    "preferred-label" : "Affärssystem, produktkunskap",
    "sentiment" : "MUST_HAVE",
    "type" : "skill",
    "start-position" : 3116,
    "end-position" : 3130,
    "concept-id" : "AzHc_kX3_veu",
    "matched-string" : "Power Platform",
    "annotation-id" : 19
  }, {
    "preferred-label" : "C#, programmeringsspråk",
    "sentiment" : "MUST_HAVE",
    "type" : "skill",
    "start-position" : 3161,
    "end-position" : 3163,
    "concept-id" : "jBKc_5Yx_Y6T",
    "matched-string" : "C#",
    "annotation-id" : 20
  }, {
    "preferred-label" : "Svenska",
    "sentiment" : "MUST_HAVE",
    "type" : "language",
    "start-position" : 3240,
    "end-position" : 3247,
    "concept-id" : "zSLA_vw2_FXN",
    "matched-string" : "svenska",
    "annotation-id" : 9
  } ],
  "text" : "Dynamics-utvecklare till Skandia i Stockholm\nSkandia i Stockholm söker en Dynamics-utvecklare som vill vara en del av vår satsning inom Dynamics 365 Customer Engagement!  \n\nSom Dynamics-utvecklare hos Skandia i Stockholm får du jobba nära verksamheten, med verksamhetskritiska system och komplex affärslogik. Vi är inne i en stor satsning på Dynamics 365 och har en expansiv handlingsplan för nya funktioner i plattformen de kommande åren. Med vår platta organisation och korta beslutsvägar är det inte långt från idé till verklighet, så här finns det stora möjligheter för dig att påverka vägen framåt!\n\nDitt anställningserbjudande\n\n • Möjligheten att jobba i en roll med många kontaktytor, där du har ett tätt samarbete med både verksamheten och arkitekter/utvecklare i flera olika team\n • En chef som kommer ge dig stort förtroende och handlingsutrymme samt säkerställa din personliga utveckling\n • En arbetsgivare som värnar om balans mellan privatliv och arbetsliv med fina personalförmåner; försäkringar, ränteförmåner, subventionerade luncher, gym i huset m.m.\n\nDina arbetsuppgifter\n\nDu kommer att tillhöra ett av våra team inom kundområdet. Teamet är centralt för Skandias satsningar inom Dynamics 365 och arbetar med allt från kravförståelse, design, implementation och test i en miljö med högt i tak och en god sammanhållning.\nDu kommer bland annat att:\n\n • Utveckla och konfigurera lösningar som bygger på Dynamics 365\n • Programmera med C#, TypeScript och React samt jobba med enhetstestning\n • Delta i design av nya lösningar och bidra till en långsiktigt hållbar arkitektur i applikationerna\n • Bidra till Skandias förflyttning till molnet\n • Se till att vi fortsatt befinner oss i teknikens framkant\n\nVidare kommer du att stötta andra team som vill implementera lösningar i plattformen. Genom ett gott samarbete med andra arkitekter och utvecklare säkerställer du att det finns en gemensam struktur på Skandia. Du kommer även få möjlighet att medverka till övriga medarbetares kompetensutveckling inom Dynamics 365 och Power Platform.\n\nVärt att veta\n\nDitt närmaste team består av Utvecklare, Mjukvaruarkitekt, Testare, Scrum Master, Systemansvarig och Produktägare. Vi jobbar enligt ramverket SAFe (Scaled Agile Framework) med aktiviteter som sprintplanering, daglig standup, review och retro. Vi jobbar även med Mob-programmering, Innovation Days och Hackathons för att främja kompetensutveckling och kompetensöverföring mellan kollegor. Kontoret är beläget i centrala Stockholm, på Kungsholmen. Vi har ett flexibelt arbetssätt och du har möjlighet att arbeta hemifrån delar av veckan.\n\nVåra förväntningar\n\nVi testar nya vägar tillsammans, och söker dig som är nyfiken och vill vara med i vår utveckling framåt! Ett nära och bra samarbete är något som genomsyrar kulturen i teamet, därför trivs du i en miljö där du får samarbeta med andra för att lösa problem och nå gemensamma mål. Du motiveras av att arbeta nära verksamheten och är intresserad av att sätta dig in i användarnas behov för att hitta de bästa möjliga lösningarna.\n\nDu har tidigare erfarenhet av Dynamics 365 Customer Engagement och Power Platform. Du har även programmerat med C# och är intresserad av att lära dig TypeScript och React. Du kommunicerar på svenska i tal och skrift.\n\nVarmt välkommen med din ansökan!\n\nIntresserad?\nI den här rekryteringen har vi valt att samarbeta med Ada Digital som strävar efter en transparent, inkluderande och snabbrörlig rekryteringsupplevelse. Vi vill veta mer om dig och din potential! Du söker tjänsten enkelt och behöver inte bifoga några dokument. Det räcker med en motivering till varför du söker tjänsten och om du saknar CV kan du bifoga din LinkedIn-profil. Följ sedan din ansökan live via vår hemsida. Urvalet sker löpande och tjänsten kan bli tillsatt före sista ansökningsdatum. Är du nyfiken och vill veta mer innan du söker? Hör av dig till ansvarig rekryterare. Vi ser fram emot att få kontakt med dig!"
}