{
  "meta" : {
    "jobad" : {
      "description" : {
        "requirements" : null,
        "needs" : null,
        "company_information" : null,
        "text_formatted" : "Det här är ett jobb för dig som är driven, vill utvecklas i din yrkesroll och bidra till hälsa och livskvalitet för dem som bor hos oss. Här får du jobba självständigt och ha frihet att utforma dina arbetsdagar. Du får bra arbetstider med tjänstgöring dagtid, helgfri måndag till fredag.\n\nHär är några av höjdpunkterna i vårt erbjudande till dig:\n\n\n\n- Hög kvalitet och stöd av tydliga rutiner: Lättillämpliga rutiner, styrdokument, checklistor och kvalitetsledningssystem ger dig ett omfattande stöd i arbetet.\n\n\n- Kompetensutveckling: Du har tillgång till Vardagas interna utbildningsorganisation  Lära (https://lara.se/) med en mängd kurser. Du har också möjlighet att ansöka om utbildningstjänst för att bli specialistsjuksköterska.\n\n\n- Karriärmöjligheter: Som sjuksköterska kan du gå vidare och bli enhetschef eller verksamhetschef för ett boende.\n\n\n- Bra ledning och korta beslutsvägar: Din chef finns nära till hands för stöd och för att bolla idéer. En av boendets sjuksköterskor sitter också alltid med i den lokala ledningsgruppen.\n\n\n- Gemenskap och stöd: Du jobbar nära sjuksköterskekollegor, gruppchefer och omvårdnadspersonal. Inom Vardaga finns ett nationellt nätverk för sjuksköterskor för att utväxla inspiration och kunskap.\n\n\n- Förmånsportal med rabatter: Köp till exempel biobiljetter och resor med kollektivtrafik till bra priser.\n\n\nHöjdpunkterna är baserade på svar från Vardagas 180 sjuksköterskor som listat sina bästa argument för att jobba hos oss.  Läs mer om deras svar här (https://vardaga.teamtailor.com/pages/kampanjsida-for-sjukskoterskor).\n\nOm rollen\nDu är spindeln i nätet kring de boendes hälso- och sjukvårdsinsatser och jobbar för att ge livskvalitet. Du ansvarar för att medicinska ordinationer följs. Regelbundet genomför du riskbedömningar och uppföljningar för att säkerställa god kvalitet i verksamheten.\n\nSamarbete och stöd\nDu ingår i ett team med omsorgspersonal, sjuksköterskor, arbetsterapeut och fysioterapeut. En viktig roll för dig är att coacha och utbilda omsorgspersonalen så att ni tillsammans ger varje boende ett så gott liv som möjligt. I detta jobbar du nära boendets gruppchefer som är ansvariga för omsorgspersonalen. Våra gruppchefer coachar också och jobbar tillsammans med teamen i det dagliga arbetet.\n\nVi satsar på ledarskapsutveckling för dig som sjuksköterska. En kurs vi kan erbjuda dig att gå är ”Att leda utan att vara chef”.\n\nLära känna de boende\nAtt förstå de boendes önskemål och se små förändring i deras hälsa och sjukdomstillstånd är många gånger avgörande för korrekta bedömningar och beslut.\n\nTydliga rutiner\nFör att skapa trygghet och tydlighet för dig som sjuksköterska finns ett omfattande stöd i form av praktiska och lättillämpliga rutiner, styrdokument och checklistor. Vårt kvalitetsledningssystem heter Qualimax och är branschledande.\n\nSom ny sjuksköterska hos oss deltar du i vårt digitala introduktionsprogram tillsammans med din mentor för att säkerställa att du får en tydlig introduktion med målet att snabbt komma in i arbetet och våra rutiner.\n\nBra samarbete är det allra viktigaste.\" - Annelie Stavås, sjuksköterska och gruppchef, Göteborg\n\nOm Villa Vikhem\nVilla Vikhem är ett boende i Vikhemsområdet i Staffanstorp. På enheten finns det tre plan med två avdelningar per plan. 40 platser med inriktning särskilt boende och 19 platser för korttid/växelvård. På Villa Vikhem har vi inriktning träning och djur. Vi har möjlighet för träning både inomhus och utomhus. De som bor på särskilt boende har möjlighet att flytta in med sitt djur. Vi samarbetar även med externa aktörer och lägger stor vikt vid att den som bor hos oss ska uppleva en meningsfull vardag som till exempel kan bestå av arrangerade aktiviteter eller en stund med sin kontaktperson.\n\nHos oss på Vardaga får du också engagerade kollegor och duktiga chefer, utbildningar, karriärmöjligheter samt flera förmåner\n\nUng Omsorg\nVi har ett  samarbete med företaget Ung Omsorg (https://www.vardaga.se/var-aldreomsorg/ung-omsorg-pa-vara-boenden/). Det innebär att ett team av ungdomar i åldrarna 14-18 år besöker oss på helger och lov.  Ung Omsorg gör olika aktiviteter tillsammans med oss som arbetar här, för att sätta guldkant på tillvaron för de boende.\n\nDjur i omsorgen\nHär arbetar vi med djur i vården och vi har regelbundna besök av terapidjur.\n\nDin erfarenhet och kunskap\nDu är legitimerad sjuksköterska och vi ser gärna att du har arbetat några år inom äldreomsorgen. Våra boende är ofta multisjuka och det kräver att du har både översiktliga kunskaper kring olika sjukdomar och tillstånd samt ett intresse för den åldrande människan. God datorvana samt erfarenhet av dokumentation är viktigt.\n\nVi önskar att du\n\n- gillar att jobba självständigt och att ha friheten att utforma dina arbetsdagar\n\n\n- är trygg i din roll som sjuksköterska och kan fatta snabba beslut och föra en diskussion med ansvarig läkare\n\n\n- tar egna initiativ, har skinn på näsan och vågar ta för dig\n\n\n- tycker om att ha en ledarroll och stötta att dina kollegor\n- är van att strukturera och organisera ditt arbete.\n\n\nJag har alltid blivit trodd och satsad på och när man har idéer så lyssnar arbetsgivaren. \" - Mårten Hedberg, Medicinskt ansvarig sjuksköterska, Stockholm\n\nÖvrigt\nLön: Vi tillämpar individuell lönesättning\nTillträdesdatum: Enligt överenskommelse\nSista ansökningsdag: 2022-09-01\nHar du frågor? Kontakta gärna: Selma Sehic 076-0023795 eller selma.sehic@vardaga.se. Observera att det inte går att ansöka via E-post. Vi tillämpar 6 månaders provanställning.\n\nOm du vill veta mer om hur det är att jobba på Vardaga så läs gärna mer och träffa några av våra medarbetare  här.  (https://vardaga.teamtailor.com/)\n\nFacklig kontakt: Vårdförbundet, Hampus Kalpakas, Mobil: 076-621 73 30,  Mail: vardforbundet@ambea.se\n\nAnsökan\nVälkommen att ansöka via knappen ”Skicka ansökan” nedan. Vänta inte med att ansöka då vi gör urval löpande.\n\nPå Vardagas drygt 100 boenden runt om i Sverige erbjuder vi en äldreomsorg där varje dag är lika viktig. Hos oss möter du expertis och trygghet på varje äldreboende, korttidsboende, i hemtjänst och dagverksamhet. Vi ska vara kvalitetsledande i allt vi gör och vår vision är att göra världen lite bättre, en människa i taget. Våra medarbetare arbetar med varje individs livskvalitet och trygghet i fokus. Vardaga ingår i företagsgruppen Ambea.  (http://www.vardaga.se/) www.vardaga.se (http://www.vardaga.se)",
        "conditions" : "Heltid\r\n100",
        "text" : "Det här är ett jobb för dig som är driven, vill utvecklas i din yrkesroll och bidra till hälsa och livskvalitet för dem som bor hos oss. Här får du jobba självständigt och ha frihet att utforma dina arbetsdagar. Du får bra arbetstider med tjänstgöring dagtid, helgfri måndag till fredag.\n\nHär är några av höjdpunkterna i vårt erbjudande till dig:\n\n\n\n- Hög kvalitet och stöd av tydliga rutiner: Lättillämpliga rutiner, styrdokument, checklistor och kvalitetsledningssystem ger dig ett omfattande stöd i arbetet.\n\n\n- Kompetensutveckling: Du har tillgång till Vardagas interna utbildningsorganisation  Lära (https://lara.se/) med en mängd kurser. Du har också möjlighet att ansöka om utbildningstjänst för att bli specialistsjuksköterska.\n\n\n- Karriärmöjligheter: Som sjuksköterska kan du gå vidare och bli enhetschef eller verksamhetschef för ett boende.\n\n\n- Bra ledning och korta beslutsvägar: Din chef finns nära till hands för stöd och för att bolla idéer. En av boendets sjuksköterskor sitter också alltid med i den lokala ledningsgruppen.\n\n\n- Gemenskap och stöd: Du jobbar nära sjuksköterskekollegor, gruppchefer och omvårdnadspersonal. Inom Vardaga finns ett nationellt nätverk för sjuksköterskor för att utväxla inspiration och kunskap.\n\n\n- Förmånsportal med rabatter: Köp till exempel biobiljetter och resor med kollektivtrafik till bra priser.\n\n\nHöjdpunkterna är baserade på svar från Vardagas 180 sjuksköterskor som listat sina bästa argument för att jobba hos oss.  Läs mer om deras svar här (https://vardaga.teamtailor.com/pages/kampanjsida-for-sjukskoterskor).\n\nOm rollen\nDu är spindeln i nätet kring de boendes hälso- och sjukvårdsinsatser och jobbar för att ge livskvalitet. Du ansvarar för att medicinska ordinationer följs. Regelbundet genomför du riskbedömningar och uppföljningar för att säkerställa god kvalitet i verksamheten.\n\nSamarbete och stöd\nDu ingår i ett team med omsorgspersonal, sjuksköterskor, arbetsterapeut och fysioterapeut. En viktig roll för dig är att coacha och utbilda omsorgspersonalen så att ni tillsammans ger varje boende ett så gott liv som möjligt. I detta jobbar du nära boendets gruppchefer som är ansvariga för omsorgspersonalen. Våra gruppchefer coachar också och jobbar tillsammans med teamen i det dagliga arbetet.\n\nVi satsar på ledarskapsutveckling för dig som sjuksköterska. En kurs vi kan erbjuda dig att gå är ”Att leda utan att vara chef”.\n\nLära känna de boende\nAtt förstå de boendes önskemål och se små förändring i deras hälsa och sjukdomstillstånd är många gånger avgörande för korrekta bedömningar och beslut.\n\nTydliga rutiner\nFör att skapa trygghet och tydlighet för dig som sjuksköterska finns ett omfattande stöd i form av praktiska och lättillämpliga rutiner, styrdokument och checklistor. Vårt kvalitetsledningssystem heter Qualimax och är branschledande.\n\nSom ny sjuksköterska hos oss deltar du i vårt digitala introduktionsprogram tillsammans med din mentor för att säkerställa att du får en tydlig introduktion med målet att snabbt komma in i arbetet och våra rutiner.\n\nBra samarbete är det allra viktigaste.\" - Annelie Stavås, sjuksköterska och gruppchef, Göteborg\n\nOm Villa Vikhem\nVilla Vikhem är ett boende i Vikhemsområdet i Staffanstorp. På enheten finns det tre plan med två avdelningar per plan. 40 platser med inriktning särskilt boende och 19 platser för korttid/växelvård. På Villa Vikhem har vi inriktning träning och djur. Vi har möjlighet för träning både inomhus och utomhus. De som bor på särskilt boende har möjlighet att flytta in med sitt djur. Vi samarbetar även med externa aktörer och lägger stor vikt vid att den som bor hos oss ska uppleva en meningsfull vardag som till exempel kan bestå av arrangerade aktiviteter eller en stund med sin kontaktperson.\n\nHos oss på Vardaga får du också engagerade kollegor och duktiga chefer, utbildningar, karriärmöjligheter samt flera förmåner\n\nUng Omsorg\nVi har ett  samarbete med företaget Ung Omsorg (https://www.vardaga.se/var-aldreomsorg/ung-omsorg-pa-vara-boenden/). Det innebär att ett team av ungdomar i åldrarna 14-18 år besöker oss på helger och lov.  Ung Omsorg gör olika aktiviteter tillsammans med oss som arbetar här, för att sätta guldkant på tillvaron för de boende.\n\nDjur i omsorgen\nHär arbetar vi med djur i vården och vi har regelbundna besök av terapidjur.\n\nDin erfarenhet och kunskap\nDu är legitimerad sjuksköterska och vi ser gärna att du har arbetat några år inom äldreomsorgen. Våra boende är ofta multisjuka och det kräver att du har både översiktliga kunskaper kring olika sjukdomar och tillstånd samt ett intresse för den åldrande människan. God datorvana samt erfarenhet av dokumentation är viktigt.\n\nVi önskar att du\n\n- gillar att jobba självständigt och att ha friheten att utforma dina arbetsdagar\n\n\n- är trygg i din roll som sjuksköterska och kan fatta snabba beslut och föra en diskussion med ansvarig läkare\n\n\n- tar egna initiativ, har skinn på näsan och vågar ta för dig\n\n\n- tycker om att ha en ledarroll och stötta att dina kollegor\n- är van att strukturera och organisera ditt arbete.\n\n\nJag har alltid blivit trodd och satsad på och när man har idéer så lyssnar arbetsgivaren. \" - Mårten Hedberg, Medicinskt ansvarig sjuksköterska, Stockholm\n\nÖvrigt\nLön: Vi tillämpar individuell lönesättning\nTillträdesdatum: Enligt överenskommelse\nSista ansökningsdag: 2022-09-01\nHar du frågor? Kontakta gärna: Selma Sehic 076-0023795 eller selma.sehic@vardaga.se. Observera att det inte går att ansöka via E-post. Vi tillämpar 6 månaders provanställning.\n\nOm du vill veta mer om hur det är att jobba på Vardaga så läs gärna mer och träffa några av våra medarbetare  här.  (https://vardaga.teamtailor.com/)\n\nFacklig kontakt: Vårdförbundet, Hampus Kalpakas, Mobil: 076-621 73 30,  Mail: vardforbundet@ambea.se\n\nAnsökan\nVälkommen att ansöka via knappen ”Skicka ansökan” nedan. Vänta inte med att ansöka då vi gör urval löpande.\n\nPå Vardagas drygt 100 boenden runt om i Sverige erbjuder vi en äldreomsorg där varje dag är lika viktig. Hos oss möter du expertis och trygghet på varje äldreboende, korttidsboende, i hemtjänst och dagverksamhet. Vi ska vara kvalitetsledande i allt vi gör och vår vision är att göra världen lite bättre, en människa i taget. Våra medarbetare arbetar med varje individs livskvalitet och trygghet i fokus. Vardaga ingår i företagsgruppen Ambea.  (http://www.vardaga.se/) www.vardaga.se (http://www.vardaga.se)"
      },
      "headline" : "Sjuksköterska till Villa Vikhem i Staffanstorp",
      "driving_license" : null,
      "employer" : {
        "email" : null,
        "phone_number" : null,
        "organization_number" : "5564699105",
        "name" : "Vardaga AB",
        "url" : null,
        "workplace" : "Vardaga"
      },
      "removed_date" : null,
      "logo_url" : "https://www.arbetsformedlingen.se/rest/arbetsgivare/rest/af/v3/organisation/5564699105/logotyper/logo.png",
      "last_publication_date" : "2022-08-09T23:59:59",
      "number_of_vacancies" : 1,
      "occupation" : {
        "concept_id" : "bXNH_MNX_dUR",
        "label" : "Sjuksköterska, grundutbildad",
        "legacy_ams_taxonomy_id" : "7296"
      },
      "occupation_group" : {
        "concept_id" : "Z8ci_bBE_tmx",
        "label" : "Grundutbildade sjuksköterskor",
        "legacy_ams_taxonomy_id" : "2221"
      },
      "employment_type" : {
        "concept_id" : "PFZr_Syz_cUq",
        "label" : "Vanlig anställning",
        "legacy_ams_taxonomy_id" : "1"
      },
      "webpage_url" : "https://arbetsformedlingen.se/platsbanken/annonser/26369632",
      "driving_license_required" : false,
      "application_contacts" : [ {
        "description" : "Selma Sehic",
        "email" : "selma.sehic@vardaga.se",
        "telephone" : null,
        "name" : null,
        "contact_type" : null
      } ],
      "duration" : {
        "concept_id" : "a7uU_j21_mkL",
        "label" : "Tills vidare",
        "legacy_ams_taxonomy_id" : "1"
      },
      "nice_to_have" : {
        "education_level" : [ ],
        "work_experiences" : [ ],
        "skills" : [ ],
        "education" : [ ],
        "languages" : [ ]
      },
      "application_details" : {
        "via_af" : false,
        "email" : null,
        "other" : null,
        "reference" : null,
        "url" : "https://vardaga.teamtailor.com/jobs/1604686-sjukskoterska-till-villa-vikhem-i-staffanstorp?promotion=357830-arbetsformedlingen",
        "information" : null
      },
      "source_type" : "VIA_PLATSBANKEN_DXA",
      "application_deadline" : "2022-08-09T23:59:59",
      "external_id" : "46-556469-9105-1604686-2",
      "workplace_address" : {
        "coordinates" : [ 13.212229, 55.641064 ],
        "city" : null,
        "postcode" : null,
        "municipality" : "Staffanstorp",
        "region_concept_id" : "CaRE_1nn_cSU",
        "region" : "Skåne län",
        "country_code" : "199",
        "region_code" : "12",
        "municipality_concept_id" : "vBrj_bov_KEX",
        "country_concept_id" : "i46j_HmG_v64",
        "municipality_code" : "1230",
        "street_address" : null,
        "country" : "Sverige"
      },
      "id" : "26369632",
      "experience_required" : true,
      "working_hours_type" : {
        "concept_id" : "6YE1_gAC_R2G",
        "label" : "Heltid",
        "legacy_ams_taxonomy_id" : "1"
      },
      "access" : null,
      "timestamp" : 1659379184762,
      "must_have" : {
        "education_level" : [ ],
        "work_experiences" : [ {
          "concept_id" : "bXNH_MNX_dUR",
          "weight" : 10,
          "label" : "Sjuksköterska, grundutbildad",
          "legacy_ams_taxonomy_id" : "7296"
        } ],
        "skills" : [ ],
        "education" : [ ],
        "languages" : [ ]
      },
      "occupation_field" : {
        "concept_id" : "NYW6_mP6_vwf",
        "label" : "Hälso- och sjukvård",
        "legacy_ams_taxonomy_id" : "8"
      },
      "scope_of_work" : {
        "min" : 100,
        "max" : 100
      },
      "salary_type" : {
        "concept_id" : "oG8G_9cW_nRf",
        "label" : "Fast månads- vecko- eller timlön",
        "legacy_ams_taxonomy_id" : "1"
      },
      "removed" : false,
      "salary_description" : "Lön enligt överenskommelse",
      "access_to_own_car" : false,
      "publication_date" : "2022-08-01T20:39:44"
    },
    "name" : "Sjuksköterska till Villa Vikhem i Staffanstorp",
    "user" : "hannes"
  },
  "sha1" : "7f354e85c4c1c912bb8387362188caf4f56e2deb",
  "annotations" : [ {
    "preferred-label" : "Sjuksköterskor",
    "sentiment" : "MUST_HAVE",
    "type" : "ssyk-level-3",
    "start-position" : 0,
    "end-position" : 13,
    "concept-id" : "jzaN_Vqk_TP1",
    "matched-string" : "sjuksköterska",
    "annotation-id" : 0
  }, {
    "preferred-label" : "Staffanstorp",
    "type" : "municipality",
    "start-position" : 34,
    "end-position" : 46,
    "concept-id" : "vBrj_bov_KEX",
    "matched-string" : "Staffanstorp",
    "annotation-id" : 35
  }, {
    "preferred-label" : "Hälsa",
    "sentiment" : "MUST_HAVE",
    "type" : "keyword",
    "start-position" : 136,
    "end-position" : 141,
    "concept-id" : "Abys_5p1_Cnq",
    "matched-string" : "hälsa",
    "annotation-id" : 1
  }, {
    "preferred-label" : "arbeta självständigt",
    "type" : "esco-skill",
    "start-position" : 195,
    "end-position" : 214,
    "concept-id" : "NyFu_HHd_zhz",
    "matched-string" : "jobba självständigt",
    "annotation-id" : 36
  }, {
    "preferred-label" : "specialistsjuksköterska",
    "type" : "esco-occupation",
    "start-position" : 758,
    "end-position" : 781,
    "concept-id" : "nSDW_Veb_hNi",
    "matched-string" : "specialistsjuksköterska",
    "annotation-id" : 37
  }, {
    "preferred-label" : "Sjuksköterskor",
    "sentiment" : "MUST_HAVE",
    "type" : "ssyk-level-3",
    "start-position" : 811,
    "end-position" : 824,
    "concept-id" : "jzaN_Vqk_TP1",
    "matched-string" : "sjuksköterska",
    "annotation-id" : 2
  }, {
    "preferred-label" : "Sjuksköterskor",
    "sentiment" : "MUST_HAVE",
    "type" : "ssyk-level-3",
    "start-position" : 1019,
    "end-position" : 1033,
    "concept-id" : "jzaN_Vqk_TP1",
    "matched-string" : "sjuksköterskor",
    "annotation-id" : 3
  }, {
    "preferred-label" : "Sjuksköterskor",
    "sentiment" : "MUST_HAVE",
    "type" : "ssyk-level-3",
    "start-position" : 1232,
    "end-position" : 1246,
    "concept-id" : "jzaN_Vqk_TP1",
    "matched-string" : "sjuksköterskor",
    "annotation-id" : 4
  }, {
    "preferred-label" : "Kollektivtrafik",
    "sentiment" : "MUST_HAVE",
    "type" : "sni-level-4",
    "start-position" : 1364,
    "end-position" : 1379,
    "concept-id" : "XVG5_tVe_RFd",
    "matched-string" : "kollektivtrafik",
    "annotation-id" : 6
  }, {
    "preferred-label" : "Sjuksköterskor",
    "sentiment" : "MUST_HAVE",
    "type" : "ssyk-level-3",
    "start-position" : 1451,
    "end-position" : 1465,
    "concept-id" : "jzaN_Vqk_TP1",
    "matched-string" : "sjuksköterskor",
    "annotation-id" : 7
  }, {
    "preferred-label" : "Hälso- och sjukvård",
    "type" : "sni-level-2",
    "start-position" : 1669,
    "end-position" : 1697,
    "concept-id" : "KhNL_Quq_Xjk",
    "matched-string" : "hälso- och sjukvårdsinsatser",
    "annotation-id" : 38
  }, {
    "preferred-label" : "Sjuksköterskor",
    "sentiment" : "MUST_HAVE",
    "type" : "ssyk-level-3",
    "start-position" : 1953,
    "end-position" : 1967,
    "concept-id" : "jzaN_Vqk_TP1",
    "matched-string" : "sjuksköterskor",
    "annotation-id" : 10
  }, {
    "preferred-label" : "Arbetsterapeut",
    "sentiment" : "MUST_HAVE",
    "type" : "occupation-name",
    "start-position" : 1969,
    "end-position" : 1983,
    "concept-id" : "heGV_uHh_o8W",
    "matched-string" : "arbetsterapeut",
    "annotation-id" : 11
  }, {
    "preferred-label" : "Fysioterapeut/Sjukgymnast",
    "sentiment" : "MUST_HAVE",
    "type" : "occupation-name",
    "start-position" : 1988,
    "end-position" : 2001,
    "concept-id" : "raVz_oTw_N3e",
    "matched-string" : "fysioterapeut",
    "annotation-id" : 12
  }, {
    "preferred-label" : "Ledarskapsutveckling",
    "sentiment" : "MUST_HAVE",
    "type" : "skill",
    "start-position" : 2324,
    "end-position" : 2344,
    "concept-id" : "hcdL_zcK_zgq",
    "matched-string" : "ledarskapsutveckling",
    "annotation-id" : 13
  }, {
    "preferred-label" : "Sjuksköterskor",
    "sentiment" : "MUST_HAVE",
    "type" : "ssyk-level-3",
    "start-position" : 2357,
    "end-position" : 2370,
    "concept-id" : "jzaN_Vqk_TP1",
    "matched-string" : "sjuksköterska",
    "annotation-id" : 14
  }, {
    "preferred-label" : "Hälsa",
    "sentiment" : "MUST_HAVE",
    "type" : "keyword",
    "start-position" : 2523,
    "end-position" : 2528,
    "concept-id" : "Abys_5p1_Cnq",
    "matched-string" : "hälsa",
    "annotation-id" : 15
  }, {
    "preferred-label" : "Sjuksköterskor",
    "sentiment" : "MUST_HAVE",
    "type" : "ssyk-level-3",
    "start-position" : 2680,
    "end-position" : 2693,
    "concept-id" : "jzaN_Vqk_TP1",
    "matched-string" : "sjuksköterska",
    "annotation-id" : 16
  }, {
    "preferred-label" : "Sjuksköterskor",
    "sentiment" : "MUST_HAVE",
    "type" : "ssyk-level-3",
    "start-position" : 2873,
    "end-position" : 2886,
    "concept-id" : "jzaN_Vqk_TP1",
    "matched-string" : "sjuksköterska",
    "annotation-id" : 17
  }, {
    "preferred-label" : "Sjuksköterskor",
    "sentiment" : "MUST_HAVE",
    "type" : "ssyk-level-3",
    "start-position" : 3140,
    "end-position" : 3153,
    "concept-id" : "jzaN_Vqk_TP1",
    "matched-string" : "sjuksköterska",
    "annotation-id" : 18
  }, {
    "preferred-label" : "Sjukhem/Särskilt boende",
    "sentiment" : "MUST_HAVE",
    "type" : "skill",
    "start-position" : 3341,
    "end-position" : 3356,
    "concept-id" : "ZpXZ_PG5_B9s",
    "matched-string" : "särskilt boende",
    "annotation-id" : 19
  }, {
    "preferred-label" : "Träning",
    "sentiment" : "MUST_HAVE",
    "type" : "keyword",
    "start-position" : 3429,
    "end-position" : 3436,
    "concept-id" : "n19Z_hzx_Apu",
    "matched-string" : "träning",
    "annotation-id" : 20
  }, {
    "preferred-label" : "Djur",
    "sentiment" : "MUST_HAVE",
    "type" : "keyword",
    "start-position" : 3441,
    "end-position" : 3445,
    "concept-id" : "tcCL_d5A_iF4",
    "matched-string" : "djur",
    "annotation-id" : 21
  }, {
    "preferred-label" : "Träning",
    "sentiment" : "MUST_HAVE",
    "type" : "keyword",
    "start-position" : 3468,
    "end-position" : 3475,
    "concept-id" : "n19Z_hzx_Apu",
    "matched-string" : "träning",
    "annotation-id" : 22
  }, {
    "preferred-label" : "Sjukhem/Särskilt boende",
    "sentiment" : "MUST_HAVE",
    "type" : "skill",
    "start-position" : 3516,
    "end-position" : 3531,
    "concept-id" : "ZpXZ_PG5_B9s",
    "matched-string" : "särskilt boende",
    "annotation-id" : 23
  }, {
    "preferred-label" : "Djur",
    "sentiment" : "MUST_HAVE",
    "type" : "keyword",
    "start-position" : 3569,
    "end-position" : 3573,
    "concept-id" : "tcCL_d5A_iF4",
    "matched-string" : "djur",
    "annotation-id" : 24
  }, {
    "preferred-label" : "Djur",
    "sentiment" : "MUST_HAVE",
    "type" : "keyword",
    "start-position" : 4255,
    "end-position" : 4259,
    "concept-id" : "tcCL_d5A_iF4",
    "matched-string" : "djur",
    "annotation-id" : 25
  }, {
    "preferred-label" : "Djur",
    "sentiment" : "MUST_HAVE",
    "type" : "keyword",
    "start-position" : 4290,
    "end-position" : 4294,
    "concept-id" : "tcCL_d5A_iF4",
    "matched-string" : "djur",
    "annotation-id" : 26
  }, {
    "preferred-label" : "Sjuksköterskor",
    "sentiment" : "MUST_HAVE",
    "type" : "ssyk-level-3",
    "start-position" : 4394,
    "end-position" : 4407,
    "concept-id" : "jzaN_Vqk_TP1",
    "matched-string" : "sjuksköterska",
    "annotation-id" : 27
  }, {
    "preferred-label" : "Äldreomsorg",
    "type" : "skill",
    "start-position" : 4458,
    "end-position" : 4471,
    "concept-id" : "Yt2Z_1pY_MNz",
    "matched-string" : "äldreomsorgen",
    "annotation-id" : 39
  }, {
    "preferred-label" : "Dokumentation",
    "sentiment" : "MUST_HAVE",
    "type" : "keyword",
    "start-position" : 4673,
    "end-position" : 4686,
    "concept-id" : "jodz_kWf_iKx",
    "matched-string" : "dokumentation",
    "annotation-id" : 28
  }, {
    "preferred-label" : "arbeta självständigt",
    "type" : "esco-skill",
    "start-position" : 4731,
    "end-position" : 4750,
    "concept-id" : "NyFu_HHd_zhz",
    "matched-string" : "jobba självständigt",
    "annotation-id" : 40
  }, {
    "preferred-label" : "Sjuksköterskor",
    "sentiment" : "MUST_HAVE",
    "type" : "ssyk-level-3",
    "start-position" : 4828,
    "end-position" : 4841,
    "concept-id" : "jzaN_Vqk_TP1",
    "matched-string" : "sjuksköterska",
    "annotation-id" : 29
  }, {
    "preferred-label" : "läkare",
    "sentiment" : "MUST_HAVE",
    "type" : "esco-occupation",
    "start-position" : 4906,
    "end-position" : 4912,
    "concept-id" : "snUT_QSf_LG9",
    "matched-string" : "läkare",
    "annotation-id" : 30
  }, {
    "preferred-label" : "Medicinskt ansvarig sjuksköterska/MAS",
    "sentiment" : "MUST_HAVE",
    "type" : "occupation-name",
    "start-position" : 5205,
    "end-position" : 5238,
    "concept-id" : "hbyN_1pA_VxX",
    "matched-string" : "medicinskt ansvarig sjuksköterska",
    "annotation-id" : 32
  }, {
    "preferred-label" : "Stockholm",
    "type" : "municipality",
    "start-position" : 5240,
    "end-position" : 5249,
    "concept-id" : "AvNB_uwa_6n6",
    "matched-string" : "Stockholm",
    "annotation-id" : 41
  }, {
    "preferred-label" : "Hemtjänst",
    "sentiment" : "MUST_HAVE",
    "type" : "skill",
    "start-position" : 6104,
    "end-position" : 6113,
    "concept-id" : "xowU_8Wu_K7C",
    "matched-string" : "hemtjänst",
    "annotation-id" : 34
  } ],
  "text" : "Sjuksköterska till Villa Vikhem i Staffanstorp\nDet här är ett jobb för dig som är driven, vill utvecklas i din yrkesroll och bidra till hälsa och livskvalitet för dem som bor hos oss. Här får du jobba självständigt och ha frihet att utforma dina arbetsdagar. Du får bra arbetstider med tjänstgöring dagtid, helgfri måndag till fredag.\n\nHär är några av höjdpunkterna i vårt erbjudande till dig:\n\n\n\n- Hög kvalitet och stöd av tydliga rutiner: Lättillämpliga rutiner, styrdokument, checklistor och kvalitetsledningssystem ger dig ett omfattande stöd i arbetet.\n\n\n- Kompetensutveckling: Du har tillgång till Vardagas interna utbildningsorganisation  Lära (https://lara.se/) med en mängd kurser. Du har också möjlighet att ansöka om utbildningstjänst för att bli specialistsjuksköterska.\n\n\n- Karriärmöjligheter: Som sjuksköterska kan du gå vidare och bli enhetschef eller verksamhetschef för ett boende.\n\n\n- Bra ledning och korta beslutsvägar: Din chef finns nära till hands för stöd och för att bolla idéer. En av boendets sjuksköterskor sitter också alltid med i den lokala ledningsgruppen.\n\n\n- Gemenskap och stöd: Du jobbar nära sjuksköterskekollegor, gruppchefer och omvårdnadspersonal. Inom Vardaga finns ett nationellt nätverk för sjuksköterskor för att utväxla inspiration och kunskap.\n\n\n- Förmånsportal med rabatter: Köp till exempel biobiljetter och resor med kollektivtrafik till bra priser.\n\n\nHöjdpunkterna är baserade på svar från Vardagas 180 sjuksköterskor som listat sina bästa argument för att jobba hos oss.  Läs mer om deras svar här (https://vardaga.teamtailor.com/pages/kampanjsida-for-sjukskoterskor).\n\nOm rollen\nDu är spindeln i nätet kring de boendes hälso- och sjukvårdsinsatser och jobbar för att ge livskvalitet. Du ansvarar för att medicinska ordinationer följs. Regelbundet genomför du riskbedömningar och uppföljningar för att säkerställa god kvalitet i verksamheten.\n\nSamarbete och stöd\nDu ingår i ett team med omsorgspersonal, sjuksköterskor, arbetsterapeut och fysioterapeut. En viktig roll för dig är att coacha och utbilda omsorgspersonalen så att ni tillsammans ger varje boende ett så gott liv som möjligt. I detta jobbar du nära boendets gruppchefer som är ansvariga för omsorgspersonalen. Våra gruppchefer coachar också och jobbar tillsammans med teamen i det dagliga arbetet.\n\nVi satsar på ledarskapsutveckling för dig som sjuksköterska. En kurs vi kan erbjuda dig att gå är ”Att leda utan att vara chef”.\n\nLära känna de boende\nAtt förstå de boendes önskemål och se små förändring i deras hälsa och sjukdomstillstånd är många gånger avgörande för korrekta bedömningar och beslut.\n\nTydliga rutiner\nFör att skapa trygghet och tydlighet för dig som sjuksköterska finns ett omfattande stöd i form av praktiska och lättillämpliga rutiner, styrdokument och checklistor. Vårt kvalitetsledningssystem heter Qualimax och är branschledande.\n\nSom ny sjuksköterska hos oss deltar du i vårt digitala introduktionsprogram tillsammans med din mentor för att säkerställa att du får en tydlig introduktion med målet att snabbt komma in i arbetet och våra rutiner.\n\nBra samarbete är det allra viktigaste.\" - Annelie Stavås, sjuksköterska och gruppchef, Göteborg\n\nOm Villa Vikhem\nVilla Vikhem är ett boende i Vikhemsområdet i Staffanstorp. På enheten finns det tre plan med två avdelningar per plan. 40 platser med inriktning särskilt boende och 19 platser för korttid/växelvård. På Villa Vikhem har vi inriktning träning och djur. Vi har möjlighet för träning både inomhus och utomhus. De som bor på särskilt boende har möjlighet att flytta in med sitt djur. Vi samarbetar även med externa aktörer och lägger stor vikt vid att den som bor hos oss ska uppleva en meningsfull vardag som till exempel kan bestå av arrangerade aktiviteter eller en stund med sin kontaktperson.\n\nHos oss på Vardaga får du också engagerade kollegor och duktiga chefer, utbildningar, karriärmöjligheter samt flera förmåner\n\nUng Omsorg\nVi har ett  samarbete med företaget Ung Omsorg (https://www.vardaga.se/var-aldreomsorg/ung-omsorg-pa-vara-boenden/). Det innebär att ett team av ungdomar i åldrarna 14-18 år besöker oss på helger och lov.  Ung Omsorg gör olika aktiviteter tillsammans med oss som arbetar här, för att sätta guldkant på tillvaron för de boende.\n\nDjur i omsorgen\nHär arbetar vi med djur i vården och vi har regelbundna besök av terapidjur.\n\nDin erfarenhet och kunskap\nDu är legitimerad sjuksköterska och vi ser gärna att du har arbetat några år inom äldreomsorgen. Våra boende är ofta multisjuka och det kräver att du har både översiktliga kunskaper kring olika sjukdomar och tillstånd samt ett intresse för den åldrande människan. God datorvana samt erfarenhet av dokumentation är viktigt.\n\nVi önskar att du\n\n- gillar att jobba självständigt och att ha friheten att utforma dina arbetsdagar\n\n\n- är trygg i din roll som sjuksköterska och kan fatta snabba beslut och föra en diskussion med ansvarig läkare\n\n\n- tar egna initiativ, har skinn på näsan och vågar ta för dig\n\n\n- tycker om att ha en ledarroll och stötta att dina kollegor\n- är van att strukturera och organisera ditt arbete.\n\n\nJag har alltid blivit trodd och satsad på och när man har idéer så lyssnar arbetsgivaren. \" - Mårten Hedberg, Medicinskt ansvarig sjuksköterska, Stockholm\n\nÖvrigt\nLön: Vi tillämpar individuell lönesättning\nTillträdesdatum: Enligt överenskommelse\nSista ansökningsdag: 2022-09-01\nHar du frågor? Kontakta gärna: Selma Sehic 076-0023795 eller selma.sehic@vardaga.se. Observera att det inte går att ansöka via E-post. Vi tillämpar 6 månaders provanställning.\n\nOm du vill veta mer om hur det är att jobba på Vardaga så läs gärna mer och träffa några av våra medarbetare  här.  (https://vardaga.teamtailor.com/)\n\nFacklig kontakt: Vårdförbundet, Hampus Kalpakas, Mobil: 076-621 73 30,  Mail: vardforbundet@ambea.se\n\nAnsökan\nVälkommen att ansöka via knappen ”Skicka ansökan” nedan. Vänta inte med att ansöka då vi gör urval löpande.\n\nPå Vardagas drygt 100 boenden runt om i Sverige erbjuder vi en äldreomsorg där varje dag är lika viktig. Hos oss möter du expertis och trygghet på varje äldreboende, korttidsboende, i hemtjänst och dagverksamhet. Vi ska vara kvalitetsledande i allt vi gör och vår vision är att göra världen lite bättre, en människa i taget. Våra medarbetare arbetar med varje individs livskvalitet och trygghet i fokus. Vardaga ingår i företagsgruppen Ambea.  (http://www.vardaga.se/) www.vardaga.se (http://www.vardaga.se)"
}