{
  "meta" : {
    "jobad" : {
      "description" : {
        "requirements" : null,
        "needs" : null,
        "company_information" : null,
        "text_formatted" : "Beskrivning\nJust nu söker vi efter städpersonalen med erfarenhet av kontorsstädning! \nTjänsten är deltid men kan leda till heltidsanställning.\r\n\r\nSom medarbetare inom lokalvård så kommer du att ingå i en arbetsgrupp som underhåller en offentlig lokal. Du kommer att arbeta med den dagliga underhållsstädningen. Arbetet inleds med introduktion samt arbetsbeskrivning vad som skall göras i varje område.\n\nArbetsuppgifter\nTjänsten innebär städning av klinik i Helsingborg enligt arbetsbeskrivning och introduktion med Arbetsledare på plats.  \n\nKvalifikationer\nVi söker dig som har ett brinnande intresse och engagemang för service och vet hur olika typer av människor skall bemötas. Som person är du social, utåtriktad, flexibel och du utför ditt jobb med god kvalité. Att forma ditt eget och gruppens arbete ser du som en självklarhet. Du strävar efter att göra ett noggrant arbete med ett bra bemötande där nöjd kund är i fokus.\nErfarenhet från andra serviceyrken eller det som arbetsgivaren bedömer som likvärdig är meriterande. \nDu har lätt att uttrycka dig i både svenskt tal och skrift.\n\nVillkor\nAnställning med timlön enligt vårt Kollektivavtal ",
        "conditions" : "Heltid/Deltid. 50%\r\nTillsvidareanställning",
        "text" : "Beskrivning\nJust nu söker vi efter städpersonalen med erfarenhet av kontorsstädning! \nTjänsten är deltid men kan leda till heltidsanställning.\r\n\r\nSom medarbetare inom lokalvård så kommer du att ingå i en arbetsgrupp som underhåller en offentlig lokal. Du kommer att arbeta med den dagliga underhållsstädningen. Arbetet inleds med introduktion samt arbetsbeskrivning vad som skall göras i varje område.\n\nArbetsuppgifter\nTjänsten innebär städning av klinik i Helsingborg enligt arbetsbeskrivning och introduktion med Arbetsledare på plats.  \n\nKvalifikationer\nVi söker dig som har ett brinnande intresse och engagemang för service och vet hur olika typer av människor skall bemötas. Som person är du social, utåtriktad, flexibel och du utför ditt jobb med god kvalité. Att forma ditt eget och gruppens arbete ser du som en självklarhet. Du strävar efter att göra ett noggrant arbete med ett bra bemötande där nöjd kund är i fokus.\nErfarenhet från andra serviceyrken eller det som arbetsgivaren bedömer som likvärdig är meriterande. \nDu har lätt att uttrycka dig i både svenskt tal och skrift.\n\nVillkor\nAnställning med timlön enligt vårt Kollektivavtal"
      },
      "headline" : "Lokalvårdare - kontorsstädning Helsingborg (deltid)",
      "driving_license" : [ {
        "concept_id" : "VTK8_WRx_GcM",
        "label" : "B",
        "legacy_ams_taxonomy_id" : "3"
      } ],
      "employer" : {
        "email" : null,
        "phone_number" : null,
        "organization_number" : "5591351860",
        "name" : "Kleni Förvaltning Personal Management AB",
        "url" : null,
        "workplace" : "Kleni Förvaltning Personal Management AB"
      },
      "removed_date" : null,
      "logo_url" : null,
      "last_publication_date" : "2022-08-28T23:59:59",
      "number_of_vacancies" : 2,
      "occupation" : {
        "concept_id" : "dYo1_D8c_87U",
        "label" : "Städare/Lokalvårdare",
        "legacy_ams_taxonomy_id" : "464"
      },
      "occupation_group" : {
        "concept_id" : "Z6TY_xDf_Yup",
        "label" : "Städare",
        "legacy_ams_taxonomy_id" : "9111"
      },
      "employment_type" : {
        "concept_id" : "PFZr_Syz_cUq",
        "label" : "Vanlig anställning",
        "legacy_ams_taxonomy_id" : "1"
      },
      "webpage_url" : "https://arbetsformedlingen.se/platsbanken/annonser/26360750",
      "driving_license_required" : true,
      "application_contacts" : [ ],
      "duration" : {
        "concept_id" : "a7uU_j21_mkL",
        "label" : "Tills vidare",
        "legacy_ams_taxonomy_id" : "1"
      },
      "nice_to_have" : {
        "education_level" : [ ],
        "work_experiences" : [ ],
        "skills" : [ ],
        "education" : [ ],
        "languages" : [ ]
      },
      "application_details" : {
        "via_af" : false,
        "email" : null,
        "other" : null,
        "reference" : "2022/11",
        "url" : "https://kleniforvaltning.varbi.com/what:job/jobID:532265/type:job/where:1/apply:1",
        "information" : null
      },
      "source_type" : "VIA_PLATSBANKEN_DXA",
      "application_deadline" : "2022-08-28T23:59:59",
      "external_id" : "46-559135-1860-532265",
      "workplace_address" : {
        "coordinates" : [ 12.694512, 56.046467 ],
        "city" : null,
        "postcode" : null,
        "municipality" : "Helsingborg",
        "region_concept_id" : "CaRE_1nn_cSU",
        "region" : "Skåne län",
        "country_code" : "199",
        "region_code" : "12",
        "municipality_concept_id" : "qj3q_oXH_MGR",
        "country_concept_id" : "i46j_HmG_v64",
        "municipality_code" : "1283",
        "street_address" : null,
        "country" : "Sverige"
      },
      "id" : "26360750",
      "experience_required" : true,
      "working_hours_type" : {
        "concept_id" : "947z_JGS_Uk2",
        "label" : "Deltid",
        "legacy_ams_taxonomy_id" : "2"
      },
      "access" : null,
      "timestamp" : 1659013887110,
      "must_have" : {
        "education_level" : [ ],
        "work_experiences" : [ {
          "concept_id" : "dYo1_D8c_87U",
          "weight" : 10,
          "label" : "Städare/Lokalvårdare",
          "legacy_ams_taxonomy_id" : "464"
        } ],
        "skills" : [ ],
        "education" : [ ],
        "languages" : [ ]
      },
      "occupation_field" : {
        "concept_id" : "whao_Q6A_ScE",
        "label" : "Sanering och renhållning",
        "legacy_ams_taxonomy_id" : "12"
      },
      "scope_of_work" : {
        "min" : 50,
        "max" : 100
      },
      "salary_type" : {
        "concept_id" : "oG8G_9cW_nRf",
        "label" : "Fast månads- vecko- eller timlön",
        "legacy_ams_taxonomy_id" : "1"
      },
      "removed" : false,
      "salary_description" : "Timlön",
      "access_to_own_car" : false,
      "publication_date" : "2022-07-28T15:11:27"
    },
    "name" : "Lokalvårdare - kontorsstädning Helsingborg (deltid)",
    "user" : "kristof.fischer"
  },
  "sha1" : "6012bb99437a37072046ea1278ba27a5ff3aedff",
  "annotations" : [ {
    "preferred-label" : "Städare/Lokalvårdare",
    "sentiment" : "MUST_HAVE",
    "type" : "occupation-name",
    "start-position" : 0,
    "end-position" : 12,
    "concept-id" : "dYo1_D8c_87U",
    "matched-string" : "lokalvårdare",
    "annotation-id" : 0
  }, {
    "preferred-label" : "Kontorsstädning",
    "sentiment" : "MUST_HAVE",
    "type" : "skill",
    "start-position" : 15,
    "end-position" : 30,
    "concept-id" : "beHF_mum_ANM",
    "matched-string" : "kontorsstädning",
    "annotation-id" : 1
  }, {
    "preferred-label" : "Helsingborg",
    "type" : "municipality",
    "start-position" : 31,
    "end-position" : 42,
    "concept-id" : "qj3q_oXH_MGR",
    "matched-string" : "Helsingborg",
    "annotation-id" : 6
  }, {
    "preferred-label" : "Deltid",
    "type" : "worktime-extent",
    "start-position" : 44,
    "end-position" : 50,
    "concept-id" : "947z_JGS_Uk2",
    "matched-string" : "deltid",
    "annotation-id" : 7
  }, {
    "preferred-label" : "Kontorsstädning",
    "sentiment" : "MUST_HAVE",
    "type" : "skill",
    "start-position" : 120,
    "end-position" : 135,
    "concept-id" : "beHF_mum_ANM",
    "matched-string" : "kontorsstädning",
    "annotation-id" : 2
  }, {
    "preferred-label" : "Deltid",
    "type" : "worktime-extent",
    "start-position" : 150,
    "end-position" : 156,
    "concept-id" : "947z_JGS_Uk2",
    "matched-string" : "deltid",
    "annotation-id" : 8
  }, {
    "preferred-label" : "Heltid",
    "type" : "worktime-extent",
    "start-position" : 175,
    "end-position" : 193,
    "concept-id" : "6YE1_gAC_R2G",
    "matched-string" : "heltidsanställning",
    "annotation-id" : 9
  }, {
    "preferred-label" : "Städare/Lokalvårdare",
    "type" : "occupation-name",
    "start-position" : 202,
    "end-position" : 228,
    "concept-id" : "dYo1_D8c_87U",
    "matched-string" : "medarbetare inom lokalvård",
    "annotation-id" : 10
  }, {
    "preferred-label" : "ansvara för städning",
    "sentiment" : "MUST_HAVE",
    "type" : "esco-skill",
    "start-position" : 341,
    "end-position" : 361,
    "concept-id" : "2pc1_7xW_uYA",
    "matched-string" : "underhållsstädningen",
    "annotation-id" : 11
  }, {
    "preferred-label" : "städa allmänna områden",
    "sentiment" : "MUST_HAVE",
    "type" : "esco-skill",
    "start-position" : 488,
    "end-position" : 506,
    "concept-id" : "RaLb_LLV_Mtp",
    "matched-string" : "städning av klinik",
    "annotation-id" : 13
  }, {
    "preferred-label" : "Helsingborg",
    "type" : "municipality",
    "start-position" : 509,
    "end-position" : 520,
    "concept-id" : "qj3q_oXH_MGR",
    "matched-string" : "Helsingborg",
    "annotation-id" : 12
  }, {
    "preferred-label" : "noggrannhet",
    "sentiment" : "MUST_HAVE",
    "type" : "esco-skill",
    "start-position" : 916,
    "end-position" : 924,
    "concept-id" : "mrsW_EkL_KRD",
    "matched-string" : "noggrant",
    "annotation-id" : 14
  }, {
    "preferred-label" : null,
    "sentiment" : "NICE_TO_HAVE",
    "type" : "skill",
    "start-position" : 980,
    "end-position" : 1014,
    "concept-id" : null,
    "matched-string" : "Erfarenhet från andra serviceyrken",
    "annotation-id" : 15
  }, {
    "preferred-label" : "Svenska",
    "sentiment" : "MUST_HAVE",
    "type" : "language",
    "start-position" : 1118,
    "end-position" : 1125,
    "concept-id" : "zSLA_vw2_FXN",
    "matched-string" : "svenskt",
    "annotation-id" : 16
  } ],
  "text" : "Lokalvårdare - kontorsstädning Helsingborg (deltid)\nBeskrivning\nJust nu söker vi efter städpersonalen med erfarenhet av kontorsstädning! \nTjänsten är deltid men kan leda till heltidsanställning.\r\n\r\nSom medarbetare inom lokalvård så kommer du att ingå i en arbetsgrupp som underhåller en offentlig lokal. Du kommer att arbeta med den dagliga underhållsstädningen. Arbetet inleds med introduktion samt arbetsbeskrivning vad som skall göras i varje område.\n\nArbetsuppgifter\nTjänsten innebär städning av klinik i Helsingborg enligt arbetsbeskrivning och introduktion med Arbetsledare på plats.  \n\nKvalifikationer\nVi söker dig som har ett brinnande intresse och engagemang för service och vet hur olika typer av människor skall bemötas. Som person är du social, utåtriktad, flexibel och du utför ditt jobb med god kvalité. Att forma ditt eget och gruppens arbete ser du som en självklarhet. Du strävar efter att göra ett noggrant arbete med ett bra bemötande där nöjd kund är i fokus.\nErfarenhet från andra serviceyrken eller det som arbetsgivaren bedömer som likvärdig är meriterande. \nDu har lätt att uttrycka dig i både svenskt tal och skrift.\n\nVillkor\nAnställning med timlön enligt vårt Kollektivavtal"
}