{
  "meta" : {
    "jobad" : {
      "description" : {
        "requirements" : null,
        "needs" : null,
        "company_information" : null,
        "text_formatted" : "<p>Vi söker nu duktiga lokalvårdare/städare som vill jobba deltid på 75%, med att utföra städningar hemma hos privatpersoner.</p><p>Vi ser att du har tidigare erfarenhet inom privathemsstädning, samt att du talar och förstår antingen svenska eller engelska obehindrat. Det är viktigt att du har god social förmåga samt att du tycker om serviceyrket.</p><p>För denna tjänsten krävs att man har B-körkort för att kunna ta sig fram mellan våra kunder som är belägna i västra Skåne.</p><p>Hos oss arbetar man oftast ensam hos privatpersoner och på större städningar arbetar ni i grupp.</p><p><br></p><p><em>Om God Service i Sverige AB</em></p><p>God Service växer och vi söker efter personer med både erfarenhet, kompetens och engagemang, som vill vara med och utveckla vår verksamhet. Vi söker dig som vill hjälpa äldre, småbarnsfamiljer, ensamstående föräldrar eller andra som kan ha svårt att få vardagen att gå ihop. God Service erbjuder tjänster till både företag, offentliga verksamheter och privatpersoner inom städ, trädgård och ledsagning. Hos oss får du uppleva det lilla företagets närhet till kunder och kollegor, samtidigt som du får det stora företagets styrka och trygghet.</p><p>God Service i Sverige AB är ett modernt tjänsteföretag som har sin hemmabas i sydvästra Skåne med kontor i Malmö. Vi utför tjänster både för privatpersoner och företag. Vår målsättning är att alltid kunna leverera kundanpassade lösningar till alla slags RUT-tjänster och olika tjänster till företag.</p><p>http://www.godservice.se</p>",
        "conditions" : null,
        "text" : "Vi söker nu duktiga lokalvårdare/städare som vill jobba deltid på 75%, med att utföra städningar hemma hos privatpersoner.\nVi ser att du har tidigare erfarenhet inom privathemsstädning, samt att du talar och förstår antingen svenska eller engelska obehindrat. Det är viktigt att du har god social förmåga samt att du tycker om serviceyrket.\nFör denna tjänsten krävs att man har B-körkort för att kunna ta sig fram mellan våra kunder som är belägna i västra Skåne.\nHos oss arbetar man oftast ensam hos privatpersoner och på större städningar arbetar ni i grupp.\n\n\nOm God Service i Sverige AB\nGod Service växer och vi söker efter personer med både erfarenhet, kompetens och engagemang, som vill vara med och utveckla vår verksamhet. Vi söker dig som vill hjälpa äldre, småbarnsfamiljer, ensamstående föräldrar eller andra som kan ha svårt att få vardagen att gå ihop. God Service erbjuder tjänster till både företag, offentliga verksamheter och privatpersoner inom städ, trädgård och ledsagning. Hos oss får du uppleva det lilla företagets närhet till kunder och kollegor, samtidigt som du får det stora företagets styrka och trygghet.\nGod Service i Sverige AB är ett modernt tjänsteföretag som har sin hemmabas i sydvästra Skåne med kontor i Malmö. Vi utför tjänster både för privatpersoner och företag. Vår målsättning är att alltid kunna leverera kundanpassade lösningar till alla slags RUT-tjänster och olika tjänster till företag.\nhttp://www.godservice.se"
      },
      "headline" : "Lokalvårdare till Burlöv med omnejd",
      "driving_license" : [ {
        "concept_id" : "VTK8_WRx_GcM",
        "label" : "B",
        "legacy_ams_taxonomy_id" : "3"
      } ],
      "employer" : {
        "email" : null,
        "phone_number" : null,
        "organization_number" : "5567846042",
        "name" : "God Service i Sverige AB",
        "url" : "http://www.godservice.se",
        "workplace" : "God Service i Sverige AB"
      },
      "removed_date" : null,
      "logo_url" : "https://www.arbetsformedlingen.se/rest/arbetsgivare/rest/af/v3/arbetsplatser/82981860/logotyper/logo.png",
      "last_publication_date" : "2022-08-24T23:59:59",
      "number_of_vacancies" : 1,
      "occupation" : {
        "concept_id" : "dYo1_D8c_87U",
        "label" : "Städare/Lokalvårdare",
        "legacy_ams_taxonomy_id" : "464"
      },
      "occupation_group" : {
        "concept_id" : "Z6TY_xDf_Yup",
        "label" : "Städare",
        "legacy_ams_taxonomy_id" : "9111"
      },
      "employment_type" : {
        "concept_id" : "PFZr_Syz_cUq",
        "label" : "Vanlig anställning",
        "legacy_ams_taxonomy_id" : "1"
      },
      "webpage_url" : "https://arbetsformedlingen.se/platsbanken/annonser/26351009",
      "driving_license_required" : true,
      "application_contacts" : [ {
        "description" : null,
        "email" : "sara.bengtsson@godservice.se",
        "telephone" : null,
        "name" : "Sara Bengtsson",
        "contact_type" : null
      } ],
      "duration" : {
        "concept_id" : "a7uU_j21_mkL",
        "label" : "Tills vidare",
        "legacy_ams_taxonomy_id" : "1"
      },
      "nice_to_have" : {
        "education_level" : [ ],
        "work_experiences" : [ ],
        "skills" : [ {
          "concept_id" : "x3Z7_Bhq_oFv",
          "weight" : 5,
          "label" : "Privathemsstädning",
          "legacy_ams_taxonomy_id" : "603790"
        } ],
        "education" : [ ],
        "languages" : [ {
          "concept_id" : "zSLA_vw2_FXN",
          "weight" : 5,
          "label" : "Svenska",
          "legacy_ams_taxonomy_id" : "502"
        } ]
      },
      "application_details" : {
        "via_af" : false,
        "email" : "jobb@godservice.se",
        "other" : null,
        "reference" : "Lokalvårdare Burlöv/Arlöv ",
        "url" : "http://godservice.se/sok-jobb/",
        "information" : null
      },
      "source_type" : "VIA_ANNONSERA",
      "application_deadline" : "2022-08-24T23:59:59",
      "external_id" : null,
      "workplace_address" : {
        "coordinates" : [ 13.077552736154784, 55.636321182484686 ],
        "city" : "ARLÖV",
        "postcode" : "23234",
        "municipality" : "Burlöv",
        "region_concept_id" : "CaRE_1nn_cSU",
        "region" : "Skåne län",
        "country_code" : "199",
        "region_code" : "12",
        "municipality_concept_id" : "64g5_Lio_aMU",
        "country_concept_id" : "i46j_HmG_v64",
        "municipality_code" : "1231",
        "street_address" : null,
        "country" : "Sverige"
      },
      "id" : "26351009",
      "experience_required" : true,
      "working_hours_type" : {
        "concept_id" : "947z_JGS_Uk2",
        "label" : "Deltid",
        "legacy_ams_taxonomy_id" : "2"
      },
      "access" : null,
      "timestamp" : 1658742910274,
      "must_have" : {
        "education_level" : [ ],
        "work_experiences" : [ {
          "concept_id" : "dYo1_D8c_87U",
          "weight" : 10,
          "label" : "Städare/Lokalvårdare",
          "legacy_ams_taxonomy_id" : "464"
        } ],
        "skills" : [ ],
        "education" : [ ],
        "languages" : [ {
          "concept_id" : "NVxJ_hLg_TYS",
          "weight" : 10,
          "label" : "Engelska",
          "legacy_ams_taxonomy_id" : "283"
        } ]
      },
      "occupation_field" : {
        "concept_id" : "whao_Q6A_ScE",
        "label" : "Sanering och renhållning",
        "legacy_ams_taxonomy_id" : "12"
      },
      "scope_of_work" : {
        "min" : 0,
        "max" : 100
      },
      "salary_type" : {
        "concept_id" : "oG8G_9cW_nRf",
        "label" : "Fast månads- vecko- eller timlön",
        "legacy_ams_taxonomy_id" : "1"
      },
      "removed" : false,
      "salary_description" : null,
      "access_to_own_car" : false,
      "publication_date" : "2022-07-25T11:55:10"
    },
    "name" : "Lokalvårdare till Burlöv med omnejd",
    "user" : "kristof.fischer"
  },
  "sha1" : "7393eb74dbdf15c48efbdbefa6880c76c4a0971c",
  "annotations" : [ {
    "preferred-label" : "Städare/Lokalvårdare",
    "sentiment" : "MUST_HAVE",
    "type" : "occupation-name",
    "start-position" : 0,
    "end-position" : 12,
    "concept-id" : "dYo1_D8c_87U",
    "matched-string" : "lokalvårdare",
    "annotation-id" : 0
  }, {
    "preferred-label" : "Burlöv",
    "type" : "municipality",
    "start-position" : 18,
    "end-position" : 24,
    "concept-id" : "64g5_Lio_aMU",
    "matched-string" : "Burlöv",
    "annotation-id" : 8
  }, {
    "preferred-label" : "Städare/Lokalvårdare",
    "sentiment" : "MUST_HAVE",
    "type" : "occupation-name",
    "start-position" : 56,
    "end-position" : 68,
    "concept-id" : "dYo1_D8c_87U",
    "matched-string" : "lokalvårdare",
    "annotation-id" : 1
  }, {
    "preferred-label" : "Städare/Lokalvårdare",
    "sentiment" : "MUST_HAVE",
    "type" : "occupation-name",
    "start-position" : 69,
    "end-position" : 76,
    "concept-id" : "dYo1_D8c_87U",
    "matched-string" : "städare",
    "annotation-id" : 2
  }, {
    "preferred-label" : "Deltid",
    "type" : "worktime-extent",
    "start-position" : 92,
    "end-position" : 98,
    "concept-id" : "947z_JGS_Uk2",
    "matched-string" : "deltid",
    "annotation-id" : 9
  }, {
    "preferred-label" : "Privathemsstädning",
    "sentiment" : "MUST_HAVE",
    "type" : "skill",
    "start-position" : 202,
    "end-position" : 220,
    "concept-id" : "x3Z7_Bhq_oFv",
    "matched-string" : "privathemsstädning",
    "annotation-id" : 3
  }, {
    "preferred-label" : "Svenska",
    "sentiment" : "MUST_HAVE",
    "type" : "language",
    "start-position" : 261,
    "end-position" : 268,
    "concept-id" : "zSLA_vw2_FXN",
    "matched-string" : "svenska",
    "annotation-id" : 4
  }, {
    "preferred-label" : "Engelska",
    "sentiment" : "MUST_HAVE",
    "type" : "language",
    "start-position" : 275,
    "end-position" : 283,
    "concept-id" : "NVxJ_hLg_TYS",
    "matched-string" : "engelska",
    "annotation-id" : 5
  }, {
    "preferred-label" : "B",
    "sentiment" : "MUST_HAVE",
    "type" : "driving-licence",
    "start-position" : 414,
    "end-position" : 423,
    "concept-id" : "VTK8_WRx_GcM",
    "matched-string" : "B-körkort",
    "annotation-id" : 10
  }, {
    "preferred-label" : "Skåne län",
    "type" : "region",
    "start-position" : 493,
    "end-position" : 498,
    "concept-id" : "CaRE_1nn_cSU",
    "matched-string" : "Skåne",
    "annotation-id" : 11
  } ],
  "text" : "Lokalvårdare till Burlöv med omnejd\nVi söker nu duktiga lokalvårdare/städare som vill jobba deltid på 75%, med att utföra städningar hemma hos privatpersoner.\nVi ser att du har tidigare erfarenhet inom privathemsstädning, samt att du talar och förstår antingen svenska eller engelska obehindrat. Det är viktigt att du har god social förmåga samt att du tycker om serviceyrket.\nFör denna tjänsten krävs att man har B-körkort för att kunna ta sig fram mellan våra kunder som är belägna i västra Skåne.\nHos oss arbetar man oftast ensam hos privatpersoner och på större städningar arbetar ni i grupp.\n\n\nOm God Service i Sverige AB\nGod Service växer och vi söker efter personer med både erfarenhet, kompetens och engagemang, som vill vara med och utveckla vår verksamhet. Vi söker dig som vill hjälpa äldre, småbarnsfamiljer, ensamstående föräldrar eller andra som kan ha svårt att få vardagen att gå ihop. God Service erbjuder tjänster till både företag, offentliga verksamheter och privatpersoner inom städ, trädgård och ledsagning. Hos oss får du uppleva det lilla företagets närhet till kunder och kollegor, samtidigt som du får det stora företagets styrka och trygghet.\nGod Service i Sverige AB är ett modernt tjänsteföretag som har sin hemmabas i sydvästra Skåne med kontor i Malmö. Vi utför tjänster både för privatpersoner och företag. Vår målsättning är att alltid kunna leverera kundanpassade lösningar till alla slags RUT-tjänster och olika tjänster till företag.\nhttp://www.godservice.se"
}