{
  "meta" : {
    "jobad" : {
      "description" : {
        "requirements" : null,
        "needs" : null,
        "company_information" : null,
        "text_formatted" : "Om tjänsten\n\nVi söker nu en erfaren svetsare till vår kund i Kungsbacka, \n\nBor du i närregionen är det bra. \n\nArbetsuppgifterna innebär manuell svetsning i MIG/ TIG Elektroder i svart och rostfritt material. Även tillverkning av maskiner, polymermaskiner och dekantercentrifuger ingår. Materialet som ska svetsas är mellan 2-10 mm tjockt. \n\nArbetstider: Dagtid \nStart: Omgående\n\n\n\nDin profil\nÖnskemål/krav \n\nLicens för MIG/MAG och TIG \n\n\nSom person vill vi att du är ansvarstagande, målinriktad, flexibel, positiv, ordningsam och har en god samarbetsförmåga eftersom arbetet sker ute hos våra kunder.\nVi arbetar löpande med inkomna ansökningar och kontaktar endast de som motsvarar ansökningskraven.\n\nVälkommen med din ansökan idag!\n\nOm Ikett Personalpartner AB\nIkett Personalpartner AB är ett auktoriserat bemanningsföretag som arbetar med uthyrning och rekrytering av kvalificerad kollektivpersonal och tjänstemän. Främst inom yrkesområdena industri, el, bygg och administration. \n\nSom konsult hos Ikett har du möjligheten att söka lokala arbeten och researbeten i Sverige samt Norge. Vi arbetar kontinuerligt för att du och kunden ska trivas så bra som möjligt med varandra och för att era önskemål ska tillgodoses. \n\nIkett är medlem i Almega Kompetensföretagen och har kollektivavtal med LO, Unionen och Akademikerförbunden. Ikett är certifierat enligt ISO 9001.\n\nMålet med vårt arbete är nöjda kunder och skickliga medarbetare som trivs. Detta vill vi uppnå genom kvalitet, kompetens och effektivitet.\n\nFör mer information och nyheter, följ oss gärna på: \nFacebook: www.facebook.com/ikettpersonalpartner \nLinkedIn: www.linkedin.com/company/ikett-personalpartner-ab-as",
        "conditions" : "Heltid\r\nTillsvidare",
        "text" : "Om tjänsten\n\nVi söker nu en erfaren svetsare till vår kund i Kungsbacka, \n\nBor du i närregionen är det bra. \n\nArbetsuppgifterna innebär manuell svetsning i MIG/ TIG Elektroder i svart och rostfritt material. Även tillverkning av maskiner, polymermaskiner och dekantercentrifuger ingår. Materialet som ska svetsas är mellan 2-10 mm tjockt. \n\nArbetstider: Dagtid \nStart: Omgående\n\n\n\nDin profil\nÖnskemål/krav \n\nLicens för MIG/MAG och TIG \n\n\nSom person vill vi att du är ansvarstagande, målinriktad, flexibel, positiv, ordningsam och har en god samarbetsförmåga eftersom arbetet sker ute hos våra kunder.\nVi arbetar löpande med inkomna ansökningar och kontaktar endast de som motsvarar ansökningskraven.\n\nVälkommen med din ansökan idag!\n\nOm Ikett Personalpartner AB\nIkett Personalpartner AB är ett auktoriserat bemanningsföretag som arbetar med uthyrning och rekrytering av kvalificerad kollektivpersonal och tjänstemän. Främst inom yrkesområdena industri, el, bygg och administration. \n\nSom konsult hos Ikett har du möjligheten att söka lokala arbeten och researbeten i Sverige samt Norge. Vi arbetar kontinuerligt för att du och kunden ska trivas så bra som möjligt med varandra och för att era önskemål ska tillgodoses. \n\nIkett är medlem i Almega Kompetensföretagen och har kollektivavtal med LO, Unionen och Akademikerförbunden. Ikett är certifierat enligt ISO 9001.\n\nMålet med vårt arbete är nöjda kunder och skickliga medarbetare som trivs. Detta vill vi uppnå genom kvalitet, kompetens och effektivitet.\n\nFör mer information och nyheter, följ oss gärna på: \nFacebook: www.facebook.com/ikettpersonalpartner \nLinkedIn: www.linkedin.com/company/ikett-personalpartner-ab-as"
      },
      "headline" : "MIG/ TIG Svetsare",
      "driving_license" : [ {
        "concept_id" : "VTK8_WRx_GcM",
        "label" : "B",
        "legacy_ams_taxonomy_id" : "3"
      } ],
      "employer" : {
        "email" : null,
        "phone_number" : null,
        "organization_number" : "5562711134",
        "name" : "Ikett Personalpartner AB",
        "url" : "http://www.ikett.com/",
        "workplace" : "Ikett Personalpartner AB"
      },
      "removed_date" : null,
      "logo_url" : "https://www.arbetsformedlingen.se/rest/arbetsgivare/rest/af/v3/organisation/5562711134/logotyper/logo.png",
      "last_publication_date" : "2022-08-07T23:59:59",
      "number_of_vacancies" : 1,
      "occupation" : {
        "concept_id" : "wf1E_nWA_EJp",
        "label" : "Svetsare, manuell",
        "legacy_ams_taxonomy_id" : "5945"
      },
      "occupation_group" : {
        "concept_id" : "wQ1E_Bzk_ZyA",
        "label" : "Svetsare och gasskärare",
        "legacy_ams_taxonomy_id" : "7212"
      },
      "employment_type" : {
        "concept_id" : "PFZr_Syz_cUq",
        "label" : "Vanlig anställning",
        "legacy_ams_taxonomy_id" : "1"
      },
      "webpage_url" : "https://arbetsformedlingen.se/platsbanken/annonser/26313092",
      "driving_license_required" : true,
      "application_contacts" : [ {
        "description" : "Elin  Voss",
        "email" : "elin.voss@ikett.com",
        "telephone" : null,
        "name" : null,
        "contact_type" : null
      } ],
      "duration" : {
        "concept_id" : "a7uU_j21_mkL",
        "label" : "Tills vidare",
        "legacy_ams_taxonomy_id" : "1"
      },
      "nice_to_have" : {
        "education_level" : [ ],
        "work_experiences" : [ ],
        "skills" : [ ],
        "education" : [ ],
        "languages" : [ ]
      },
      "application_details" : {
        "via_af" : false,
        "email" : null,
        "other" : null,
        "reference" : "14724",
        "url" : "https://www.ikett.com/lediga-jobb?jaid=14724",
        "information" : null
      },
      "source_type" : "VIA_PLATSBANKEN_DXA",
      "application_deadline" : "2022-08-07T23:59:59",
      "external_id" : "46-556271-1134-14724",
      "workplace_address" : {
        "coordinates" : [ 12.076193, 57.48749 ],
        "city" : null,
        "postcode" : null,
        "municipality" : "Kungsbacka",
        "region_concept_id" : "wjee_qH2_yb6",
        "region" : "Hallands län",
        "country_code" : "199",
        "region_code" : "13",
        "municipality_concept_id" : "3JKV_KSK_x6z",
        "country_concept_id" : "i46j_HmG_v64",
        "municipality_code" : "1384",
        "street_address" : null,
        "country" : "Sverige"
      },
      "id" : "26313092",
      "experience_required" : true,
      "working_hours_type" : {
        "concept_id" : "6YE1_gAC_R2G",
        "label" : "Heltid",
        "legacy_ams_taxonomy_id" : "1"
      },
      "access" : null,
      "timestamp" : 1657518328161,
      "must_have" : {
        "education_level" : [ ],
        "work_experiences" : [ {
          "concept_id" : "wf1E_nWA_EJp",
          "weight" : 10,
          "label" : "Svetsare, manuell",
          "legacy_ams_taxonomy_id" : "5945"
        } ],
        "skills" : [ ],
        "education" : [ ],
        "languages" : [ ]
      },
      "occupation_field" : {
        "concept_id" : "wTEr_CBC_bqh",
        "label" : "Industriell tillverkning",
        "legacy_ams_taxonomy_id" : "9"
      },
      "scope_of_work" : {
        "min" : 100,
        "max" : 100
      },
      "salary_type" : {
        "concept_id" : "oG8G_9cW_nRf",
        "label" : "Fast månads- vecko- eller timlön",
        "legacy_ams_taxonomy_id" : "1"
      },
      "removed" : false,
      "salary_description" : "Fast lön",
      "access_to_own_car" : false,
      "publication_date" : "2022-07-11T07:45:28"
    },
    "name" : "MIG/ TIG Svetsare",
    "user" : "hannes"
  },
  "sha1" : "19772c5efda0de8216168a19292e2c8b80eae35b",
  "annotations" : [ {
    "preferred-label" : "MIG-svetsning",
    "type" : "skill",
    "start-position" : 0,
    "end-position" : 3,
    "concept-id" : "Q1D1_Pdc_rnT",
    "matched-string" : "MIG",
    "annotation-id" : 6
  }, {
    "preferred-label" : "TIG-svetsning",
    "type" : "skill",
    "start-position" : 5,
    "end-position" : 8,
    "concept-id" : "WBnc_JXj_MvY",
    "matched-string" : "TIG",
    "annotation-id" : 7
  }, {
    "preferred-label" : "Svetsare",
    "sentiment" : "MUST_HAVE",
    "type" : "keyword",
    "start-position" : 9,
    "end-position" : 17,
    "concept-id" : "ouXc_F9J_bAC",
    "matched-string" : "svetsare",
    "annotation-id" : 0
  }, {
    "preferred-label" : "Svetsare",
    "sentiment" : "MUST_HAVE",
    "type" : "keyword",
    "start-position" : 54,
    "end-position" : 62,
    "concept-id" : "ouXc_F9J_bAC",
    "matched-string" : "svetsare",
    "annotation-id" : 1
  }, {
    "preferred-label" : "Kungsbacka",
    "type" : "municipality",
    "start-position" : 79,
    "end-position" : 89,
    "concept-id" : "3JKV_KSK_x6z",
    "matched-string" : "Kungsbacka",
    "annotation-id" : 8
  }, {
    "preferred-label" : "MIG-svetsning",
    "type" : "skill",
    "start-position" : 174,
    "end-position" : 177,
    "concept-id" : "Q1D1_Pdc_rnT",
    "matched-string" : "MIG",
    "annotation-id" : 9
  }, {
    "preferred-label" : "TIG-svetsning",
    "type" : "skill",
    "start-position" : 179,
    "end-position" : 182,
    "concept-id" : "WBnc_JXj_MvY",
    "matched-string" : "TIG",
    "annotation-id" : 10
  }, {
    "preferred-label" : "Tillverkning",
    "sentiment" : "MUST_HAVE",
    "type" : "sni-level-1",
    "start-position" : 231,
    "end-position" : 243,
    "concept-id" : "trPt_iHy_oFP",
    "matched-string" : "tillverkning",
    "annotation-id" : 2
  }, {
    "preferred-label" : "maskiner",
    "type" : "esco-skill",
    "start-position" : 247,
    "end-position" : 255,
    "concept-id" : "Ka3C_YyD_qTA",
    "matched-string" : "maskiner",
    "annotation-id" : 11
  }, {
    "preferred-label" : "MIG-svetsning",
    "type" : "skill",
    "start-position" : 437,
    "end-position" : 440,
    "concept-id" : "Q1D1_Pdc_rnT",
    "matched-string" : "MIG",
    "annotation-id" : 12
  }, {
    "preferred-label" : "MAG-svetsning",
    "type" : "skill",
    "start-position" : 441,
    "end-position" : 444,
    "concept-id" : "NH9n_Snj_CNM",
    "matched-string" : "MAG",
    "annotation-id" : 13
  }, {
    "preferred-label" : "TIG-svetsning",
    "type" : "skill",
    "start-position" : 449,
    "end-position" : 452,
    "concept-id" : "WBnc_JXj_MvY",
    "matched-string" : "TIG",
    "annotation-id" : 14
  }, {
    "preferred-label" : "visa ansvarstagande",
    "type" : "esco-skill",
    "start-position" : 485,
    "end-position" : 499,
    "concept-id" : "bcRp_hxV_f5G",
    "matched-string" : "ansvarstagande",
    "annotation-id" : 15
  }, {
    "preferred-label" : "Kollektivavtal",
    "sentiment" : "MUST_HAVE",
    "type" : "skill",
    "start-position" : 1291,
    "end-position" : 1305,
    "concept-id" : "z7wE_9xb_3jX",
    "matched-string" : "kollektivavtal",
    "annotation-id" : 3
  } ],
  "text" : "MIG/ TIG Svetsare\nOm tjänsten\n\nVi söker nu en erfaren svetsare till vår kund i Kungsbacka, \n\nBor du i närregionen är det bra. \n\nArbetsuppgifterna innebär manuell svetsning i MIG/ TIG Elektroder i svart och rostfritt material. Även tillverkning av maskiner, polymermaskiner och dekantercentrifuger ingår. Materialet som ska svetsas är mellan 2-10 mm tjockt. \n\nArbetstider: Dagtid \nStart: Omgående\n\n\n\nDin profil\nÖnskemål/krav \n\nLicens för MIG/MAG och TIG \n\n\nSom person vill vi att du är ansvarstagande, målinriktad, flexibel, positiv, ordningsam och har en god samarbetsförmåga eftersom arbetet sker ute hos våra kunder.\nVi arbetar löpande med inkomna ansökningar och kontaktar endast de som motsvarar ansökningskraven.\n\nVälkommen med din ansökan idag!\n\nOm Ikett Personalpartner AB\nIkett Personalpartner AB är ett auktoriserat bemanningsföretag som arbetar med uthyrning och rekrytering av kvalificerad kollektivpersonal och tjänstemän. Främst inom yrkesområdena industri, el, bygg och administration. \n\nSom konsult hos Ikett har du möjligheten att söka lokala arbeten och researbeten i Sverige samt Norge. Vi arbetar kontinuerligt för att du och kunden ska trivas så bra som möjligt med varandra och för att era önskemål ska tillgodoses. \n\nIkett är medlem i Almega Kompetensföretagen och har kollektivavtal med LO, Unionen och Akademikerförbunden. Ikett är certifierat enligt ISO 9001.\n\nMålet med vårt arbete är nöjda kunder och skickliga medarbetare som trivs. Detta vill vi uppnå genom kvalitet, kompetens och effektivitet.\n\nFör mer information och nyheter, följ oss gärna på: \nFacebook: www.facebook.com/ikettpersonalpartner \nLinkedIn: www.linkedin.com/company/ikett-personalpartner-ab-as"
}