{
  "meta" : {
    "jobad" : {
      "description" : {
        "requirements" : null,
        "needs" : null,
        "company_information" : null,
        "text_formatted" : "<p>Önskar du att jobba i en kreativt inspirerande salong med härliga kollegor, utbildningar, bra arbetstider, attraktiv lönenivå, kollektivavtal och fast kundkrets?</p><p>Vi söker just dig som kan berika vår salong, Vassa Saxar i Nya Hovås utanför Göteborg, med ditt leende och kunskap.</p><p>Vi söker en utbildad frisör.</p><p>www.vassasaxar.eu</p><p>Instagramkonto: vassasaxar</p><p>Skicka ditt CV och personliga brev till Monica på        monica.horder@telia.com</p>",
        "conditions" : null,
        "text" : "Önskar du att jobba i en kreativt inspirerande salong med härliga kollegor, utbildningar, bra arbetstider, attraktiv lönenivå, kollektivavtal och fast kundkrets?\nVi söker just dig som kan berika vår salong, Vassa Saxar i Nya Hovås utanför Göteborg, med ditt leende och kunskap.\nVi söker en utbildad frisör.\nwww.vassasaxar.eu\nInstagramkonto: vassasaxar\nSkicka ditt CV och personliga brev till Monica på        monica.horder@telia.com"
      },
      "headline" : "Utbildad frisör med teamkänsla",
      "driving_license" : null,
      "employer" : {
        "email" : null,
        "phone_number" : null,
        "organization_number" : "5568267537",
        "name" : "Vassa Saxar i Hovås AB",
        "url" : "www.vassasaxar.eu",
        "workplace" : "Vassa Saxar i Hovås AB"
      },
      "removed_date" : null,
      "logo_url" : null,
      "last_publication_date" : "2022-09-25T23:59:59",
      "number_of_vacancies" : 1,
      "occupation" : {
        "concept_id" : "tuoE_9Nj_fAS",
        "label" : "Frisör",
        "legacy_ams_taxonomy_id" : "5491"
      },
      "occupation_group" : {
        "concept_id" : "LyBp_bY6_bZK",
        "label" : "Frisörer",
        "legacy_ams_taxonomy_id" : "5141"
      },
      "employment_type" : {
        "concept_id" : "PFZr_Syz_cUq",
        "label" : "Vanlig anställning",
        "legacy_ams_taxonomy_id" : "1"
      },
      "webpage_url" : "https://arbetsformedlingen.se/platsbanken/annonser/26333559",
      "driving_license_required" : false,
      "application_contacts" : [ ],
      "duration" : {
        "concept_id" : "a7uU_j21_mkL",
        "label" : "Tills vidare",
        "legacy_ams_taxonomy_id" : "1"
      },
      "nice_to_have" : {
        "education_level" : [ ],
        "work_experiences" : [ ],
        "skills" : [ {
          "concept_id" : "YcrR_5QB_3XL",
          "weight" : 5,
          "label" : "Gesällbrev, frisör",
          "legacy_ams_taxonomy_id" : "601067"
        } ],
        "education" : [ ],
        "languages" : [ {
          "concept_id" : "NVxJ_hLg_TYS",
          "weight" : 5,
          "label" : "Engelska",
          "legacy_ams_taxonomy_id" : "283"
        } ]
      },
      "application_details" : {
        "via_af" : false,
        "email" : "monica.horder@telia.com",
        "other" : null,
        "reference" : "Vassa Saxar",
        "url" : null,
        "information" : null
      },
      "source_type" : "VIA_ANNONSERA",
      "application_deadline" : "2022-09-25T23:59:59",
      "external_id" : null,
      "workplace_address" : {
        "coordinates" : [ 11.951711780686434, 57.598118387174175 ],
        "city" : "Hovås",
        "postcode" : "43653",
        "municipality" : "Göteborg",
        "region_concept_id" : "zdoY_6u5_Krt",
        "region" : "Västra Götalands län",
        "country_code" : "199",
        "region_code" : "14",
        "municipality_concept_id" : "PVZL_BQT_XtL",
        "country_concept_id" : "i46j_HmG_v64",
        "municipality_code" : "1480",
        "street_address" : "Krogabäcksvägen 24",
        "country" : "Sverige"
      },
      "id" : "26333559",
      "experience_required" : true,
      "working_hours_type" : {
        "concept_id" : "6YE1_gAC_R2G",
        "label" : "Heltid",
        "legacy_ams_taxonomy_id" : "1"
      },
      "access" : null,
      "timestamp" : 1658084035280,
      "must_have" : {
        "education_level" : [ ],
        "work_experiences" : [ {
          "concept_id" : "tuoE_9Nj_fAS",
          "weight" : 10,
          "label" : "Frisör",
          "legacy_ams_taxonomy_id" : "5491"
        } ],
        "skills" : [ ],
        "education" : [ ],
        "languages" : [ {
          "concept_id" : "zSLA_vw2_FXN",
          "weight" : 10,
          "label" : "Svenska",
          "legacy_ams_taxonomy_id" : "502"
        } ]
      },
      "occupation_field" : {
        "concept_id" : "Uuf1_GMh_Uvw",
        "label" : "Kropps- och skönhetsvård",
        "legacy_ams_taxonomy_id" : "4"
      },
      "scope_of_work" : {
        "min" : 0,
        "max" : 100
      },
      "salary_type" : {
        "concept_id" : "asrX_9Df_ukn",
        "label" : "Fast och rörlig lön",
        "legacy_ams_taxonomy_id" : "7"
      },
      "removed" : false,
      "salary_description" : null,
      "access_to_own_car" : false,
      "publication_date" : "2022-07-17T20:53:55"
    },
    "name" : "Utbildad frisör med teamkänsla",
    "user" : "kristof.fischer"
  },
  "sha1" : "5b2e97082696c0e380c79454a170b6301bfe440a",
  "annotations" : [ {
    "preferred-label" : "Frisör",
    "sentiment" : "MUST_HAVE",
    "type" : "occupation-name",
    "start-position" : 9,
    "end-position" : 15,
    "concept-id" : "tuoE_9Nj_fAS",
    "matched-string" : "frisör",
    "annotation-id" : 0
  }, {
    "preferred-label" : "Göteborg",
    "type" : "municipality",
    "start-position" : 270,
    "end-position" : 278,
    "concept-id" : "PVZL_BQT_XtL",
    "matched-string" : "Göteborg",
    "annotation-id" : 4
  }, {
    "preferred-label" : "Frisör",
    "sentiment" : "MUST_HAVE",
    "type" : "occupation-name",
    "start-position" : 330,
    "end-position" : 336,
    "concept-id" : "tuoE_9Nj_fAS",
    "matched-string" : "frisör",
    "annotation-id" : 2
  } ],
  "text" : "Utbildad frisör med teamkänsla\nÖnskar du att jobba i en kreativt inspirerande salong med härliga kollegor, utbildningar, bra arbetstider, attraktiv lönenivå, kollektivavtal och fast kundkrets?\nVi söker just dig som kan berika vår salong, Vassa Saxar i Nya Hovås utanför Göteborg, med ditt leende och kunskap.\nVi söker en utbildad frisör.\nwww.vassasaxar.eu\nInstagramkonto: vassasaxar\nSkicka ditt CV och personliga brev till Monica på        monica.horder@telia.com"
}