{
  "meta" : {
    "jobad" : {
      "description" : {
        "requirements" : null,
        "needs" : null,
        "company_information" : null,
        "text_formatted" : "Pizza Hut rekryterar: Servitris som skapar god stämning\n\r\n\r\n1958 grundade Bröderna Frank och Dan Carney från Kansas Pizza Hut. De lånade 600 dollar av sin mamma och de slog upp dörrarna till sin första restaurang i Wichita. Det blev succé. Idag finns vi, Pizza Hut, i över 100 länder. Ett starkt varumärke, känt för sina spännande smaker och unika deg, som inte serveras någon annanstans. Vill du vara med och fortsätta succén och lära dig att tillaga en äkta Pan Pizza?\n\nVi söker dig som har en naturlig fallenhet för service i världsklass. Du söker en arbetsplats med med härliga och glada kollegor, ett varumärke som klingar kvalitet&nbsp;och&nbsp;unika kunderbjudanden som våra pizzor. Helt enkelt en arbetsplats att trivas på och längta till.&nbsp;Med stolhet levererar du ut varje tallrik med någon av våra omtalade och efterfrågade rätter. Du sprudlar och har en speciell förmåga att skapa en god atmosfär både hos våra glada&nbsp;gäster och dina fina kollegor. Med ett leende och split vision har du i \"din\" matsal överblick över dina gäster oavsett hur många de är.\n\nDu är noggrann och ansvarstagande samt behärskar svenska språket i både tal och skrift. Dina&nbsp;arbetstider varierar med betoning på kvällar och helger. Det är meriterande, men inget krav, att du har tidigare erfarenhet av restaurangarbete eller restaurangutbildning.\n\nDina arbetsuppgifter blir bordsservering, kassahantering, planering av ditt arbete och att hålla matsalen ren och prydlig.\n\nVi erbjuder en trevlig arbetsplats med härliga kollegor, givande utbildningar och mycket goda utvecklingsmöjligheter. Förutom lön enligt HRF gröna avtal, erbjuder vi friskvårdsbidrag till våra medarbetare.\n\nVälkommen att göra din ansökan redan idag!\n\n[youtube LzQocnMEXZU]\n\nPå Pizza Hut bakar vi äkta Pan Pizza, det berömda originalet och vår stolthet från 1958. Som pizzaexperter serverar vi naturligtvis också tunn surdeg, San Fransisco Style pizza och världens ostigaste Cheesy crust\n\nVarje vardag vid lunch dukar vi upp vår populära pizza- och gröna sköna salladsbuffé. Resten av dagen och kvällen erbjuder vi även en välsmakande meny med godsaker som pasta, vitlöksbröd, härliga sides, läckra desserter och vår uppskattade mjukglassbar. Givetvis har vi även fullständiga rättigheter med öl och vin. Pizza lovers eller inte, våra restauranger erbjuder något för alla.\n\nVarmt välkommen - familj, vänner eller i eget sällskap!",
        "conditions" : "Deltid\r\nTillsvidare",
        "text" : "Pizza Hut rekryterar: Servitris som skapar god stämning\n\r\n\r\n1958 grundade Bröderna Frank och Dan Carney från Kansas Pizza Hut. De lånade 600 dollar av sin mamma och de slog upp dörrarna till sin första restaurang i Wichita. Det blev succé. Idag finns vi, Pizza Hut, i över 100 länder. Ett starkt varumärke, känt för sina spännande smaker och unika deg, som inte serveras någon annanstans. Vill du vara med och fortsätta succén och lära dig att tillaga en äkta Pan Pizza?\n\nVi söker dig som har en naturlig fallenhet för service i världsklass. Du söker en arbetsplats med med härliga och glada kollegor, ett varumärke som klingar kvalitet och unika kunderbjudanden som våra pizzor. Helt enkelt en arbetsplats att trivas på och längta till. Med stolhet levererar du ut varje tallrik med någon av våra omtalade och efterfrågade rätter. Du sprudlar och har en speciell förmåga att skapa en god atmosfär både hos våra glada gäster och dina fina kollegor. Med ett leende och split vision har du i \"din\" matsal överblick över dina gäster oavsett hur många de är.\n\nDu är noggrann och ansvarstagande samt behärskar svenska språket i både tal och skrift. Dina arbetstider varierar med betoning på kvällar och helger. Det är meriterande, men inget krav, att du har tidigare erfarenhet av restaurangarbete eller restaurangutbildning.\n\nDina arbetsuppgifter blir bordsservering, kassahantering, planering av ditt arbete och att hålla matsalen ren och prydlig.\n\nVi erbjuder en trevlig arbetsplats med härliga kollegor, givande utbildningar och mycket goda utvecklingsmöjligheter. Förutom lön enligt HRF gröna avtal, erbjuder vi friskvårdsbidrag till våra medarbetare.\n\nVälkommen att göra din ansökan redan idag!\n\n[youtube LzQocnMEXZU]\n\nPå Pizza Hut bakar vi äkta Pan Pizza, det berömda originalet och vår stolthet från 1958. Som pizzaexperter serverar vi naturligtvis också tunn surdeg, San Fransisco Style pizza och världens ostigaste Cheesy crust\n\nVarje vardag vid lunch dukar vi upp vår populära pizza- och gröna sköna salladsbuffé. Resten av dagen och kvällen erbjuder vi även en välsmakande meny med godsaker som pasta, vitlöksbröd, härliga sides, läckra desserter och vår uppskattade mjukglassbar. Givetvis har vi även fullständiga rättigheter med öl och vin. Pizza lovers eller inte, våra restauranger erbjuder något för alla.\n\nVarmt välkommen - familj, vänner eller i eget sällskap!"
      },
      "headline" : "Servitris som skapar god stämning på Pizza Hut",
      "driving_license" : null,
      "employer" : {
        "email" : null,
        "phone_number" : null,
        "organization_number" : "5569715963",
        "name" : "Happyr AB",
        "url" : "http://www.pizzahut.se",
        "workplace" : "Pizza Hut"
      },
      "removed_date" : null,
      "logo_url" : "https://www.arbetsformedlingen.se/rest/arbetsgivare/rest/af/v3/organisation/5569715963/logotyper/logo.png",
      "last_publication_date" : "2022-08-16T23:59:59",
      "number_of_vacancies" : 1,
      "occupation" : {
        "concept_id" : "yXRQ_Ad9_E8V",
        "label" : "Restaurangbiträde",
        "legacy_ams_taxonomy_id" : "5555"
      },
      "occupation_group" : {
        "concept_id" : "tPox_ie4_X9X",
        "label" : "Restaurang- och köksbiträden m.fl.",
        "legacy_ams_taxonomy_id" : "9412"
      },
      "employment_type" : {
        "concept_id" : "PFZr_Syz_cUq",
        "label" : "Vanlig anställning",
        "legacy_ams_taxonomy_id" : "1"
      },
      "webpage_url" : "https://arbetsformedlingen.se/platsbanken/annonser/26389525",
      "driving_license_required" : false,
      "application_contacts" : [ {
        "description" : "Pizza Hut",
        "email" : null,
        "telephone" : null,
        "name" : null,
        "contact_type" : null
      } ],
      "duration" : {
        "concept_id" : "a7uU_j21_mkL",
        "label" : "Tills vidare",
        "legacy_ams_taxonomy_id" : "1"
      },
      "nice_to_have" : {
        "education_level" : [ ],
        "work_experiences" : [ ],
        "skills" : [ ],
        "education" : [ ],
        "languages" : [ ]
      },
      "application_details" : {
        "via_af" : false,
        "email" : null,
        "other" : null,
        "reference" : null,
        "url" : "https://fairrecruiting.se/pizza-hut/job/26942-servitris-som-skapar-god-stamning_filmstaden-sergel?ref=arbetsformedlingen.se",
        "information" : null
      },
      "source_type" : "VIA_PLATSBANKEN_DXA",
      "application_deadline" : "2022-08-16T23:59:59",
      "external_id" : "46-556971-5963-26942",
      "workplace_address" : {
        "coordinates" : [ 18.06858, 59.329323 ],
        "city" : null,
        "postcode" : null,
        "municipality" : "Stockholm",
        "region_concept_id" : "CifL_Rzy_Mku",
        "region" : "Stockholms län",
        "country_code" : "199",
        "region_code" : "01",
        "municipality_concept_id" : "AvNB_uwa_6n6",
        "country_concept_id" : "i46j_HmG_v64",
        "municipality_code" : "0180",
        "street_address" : null,
        "country" : "Sverige"
      },
      "id" : "26389525",
      "experience_required" : true,
      "working_hours_type" : {
        "concept_id" : "947z_JGS_Uk2",
        "label" : "Deltid",
        "legacy_ams_taxonomy_id" : "2"
      },
      "access" : null,
      "timestamp" : 1660028734956,
      "must_have" : {
        "education_level" : [ ],
        "work_experiences" : [ {
          "concept_id" : "yXRQ_Ad9_E8V",
          "weight" : 10,
          "label" : "Restaurangbiträde",
          "legacy_ams_taxonomy_id" : "5555"
        } ],
        "skills" : [ ],
        "education" : [ ],
        "languages" : [ ]
      },
      "occupation_field" : {
        "concept_id" : "ScKy_FHB_7wT",
        "label" : "Hotell, restaurang, storhushåll",
        "legacy_ams_taxonomy_id" : "7"
      },
      "scope_of_work" : {
        "min" : 0,
        "max" : 100
      },
      "salary_type" : {
        "concept_id" : "oG8G_9cW_nRf",
        "label" : "Fast månads- vecko- eller timlön",
        "legacy_ams_taxonomy_id" : "1"
      },
      "removed" : false,
      "salary_description" : "Månadslön",
      "access_to_own_car" : false,
      "publication_date" : "2022-08-09T09:05:18"
    },
    "name" : "Servitris som skapar god stämning på Pizza Hut",
    "user" : "hannes"
  },
  "sha1" : "bdbbcb0a5fc74289b11ebbae9ff569b4584808bd",
  "annotations" : [ {
    "preferred-label" : "Servitör/Servitris",
    "sentiment" : "MUST_HAVE",
    "type" : "occupation-name",
    "start-position" : 0,
    "end-position" : 9,
    "concept-id" : "rGGf_KLs_To7",
    "matched-string" : "servitris",
    "annotation-id" : 0
  }, {
    "preferred-label" : "Pizza",
    "sentiment" : "MUST_HAVE",
    "type" : "keyword",
    "start-position" : 37,
    "end-position" : 42,
    "concept-id" : "aoCa_BaF_g6Z",
    "matched-string" : "pizza",
    "annotation-id" : 1
  }, {
    "preferred-label" : "Pizza",
    "sentiment" : "MUST_HAVE",
    "type" : "keyword",
    "start-position" : 47,
    "end-position" : 52,
    "concept-id" : "aoCa_BaF_g6Z",
    "matched-string" : "pizza",
    "annotation-id" : 2
  }, {
    "preferred-label" : "Servitör/Servitris",
    "sentiment" : "MUST_HAVE",
    "type" : "occupation-name",
    "start-position" : 69,
    "end-position" : 78,
    "concept-id" : "rGGf_KLs_To7",
    "matched-string" : "servitris",
    "annotation-id" : 3
  }, {
    "preferred-label" : "Pizza",
    "sentiment" : "MUST_HAVE",
    "type" : "keyword",
    "start-position" : 163,
    "end-position" : 168,
    "concept-id" : "aoCa_BaF_g6Z",
    "matched-string" : "pizza",
    "annotation-id" : 4
  }, {
    "preferred-label" : "Restaurang",
    "sentiment" : "MUST_HAVE",
    "type" : "keyword",
    "start-position" : 249,
    "end-position" : 259,
    "concept-id" : "o2Cg_3Ap_qvK",
    "matched-string" : "restaurang",
    "annotation-id" : 5
  }, {
    "preferred-label" : "Pizza",
    "sentiment" : "MUST_HAVE",
    "type" : "keyword",
    "start-position" : 302,
    "end-position" : 307,
    "concept-id" : "aoCa_BaF_g6Z",
    "matched-string" : "pizza",
    "annotation-id" : 6
  }, {
    "preferred-label" : "Pizza",
    "sentiment" : "MUST_HAVE",
    "type" : "keyword",
    "start-position" : 511,
    "end-position" : 516,
    "concept-id" : "aoCa_BaF_g6Z",
    "matched-string" : "pizza",
    "annotation-id" : 7
  }, {
    "preferred-label" : "noggrannhet",
    "type" : "esco-skill",
    "start-position" : 1109,
    "end-position" : 1117,
    "concept-id" : "mrsW_EkL_KRD",
    "matched-string" : "noggrann",
    "annotation-id" : 17
  }, {
    "preferred-label" : "visa ansvarstagande",
    "type" : "esco-skill",
    "start-position" : 1122,
    "end-position" : 1136,
    "concept-id" : "bcRp_hxV_f5G",
    "matched-string" : "ansvarstagande",
    "annotation-id" : 18
  }, {
    "preferred-label" : "Svenska språket",
    "sentiment" : "MUST_HAVE",
    "type" : "keyword",
    "start-position" : 1152,
    "end-position" : 1167,
    "concept-id" : "BiGm_58D_SSn",
    "matched-string" : "svenska språket",
    "annotation-id" : 8
  }, {
    "preferred-label" : "Restaurangutbildning",
    "sentiment" : "MUST_HAVE",
    "type" : "keyword",
    "start-position" : 1346,
    "end-position" : 1366,
    "concept-id" : "QZWP_ef1_KWF",
    "matched-string" : "restaurangutbildning",
    "annotation-id" : 9
  }, {
    "preferred-label" : "Bordsservering",
    "sentiment" : "MUST_HAVE",
    "type" : "skill",
    "start-position" : 1395,
    "end-position" : 1409,
    "concept-id" : "5fAq_Squ_o7p",
    "matched-string" : "bordsservering",
    "annotation-id" : 10
  }, {
    "preferred-label" : "sköta en kassa",
    "type" : "esco-skill",
    "start-position" : 1411,
    "end-position" : 1425,
    "concept-id" : "USNU_LMY_prY",
    "matched-string" : "kassahantering",
    "annotation-id" : 19
  }, {
    "preferred-label" : "Pizza",
    "sentiment" : "MUST_HAVE",
    "type" : "keyword",
    "start-position" : 1770,
    "end-position" : 1775,
    "concept-id" : "aoCa_BaF_g6Z",
    "matched-string" : "pizza",
    "annotation-id" : 11
  }, {
    "preferred-label" : "Pizza",
    "sentiment" : "MUST_HAVE",
    "type" : "keyword",
    "start-position" : 1798,
    "end-position" : 1803,
    "concept-id" : "aoCa_BaF_g6Z",
    "matched-string" : "pizza",
    "annotation-id" : 12
  }, {
    "preferred-label" : "Pizza",
    "sentiment" : "MUST_HAVE",
    "type" : "keyword",
    "start-position" : 1938,
    "end-position" : 1943,
    "concept-id" : "aoCa_BaF_g6Z",
    "matched-string" : "pizza",
    "annotation-id" : 13
  }, {
    "preferred-label" : "Pizza",
    "sentiment" : "MUST_HAVE",
    "type" : "keyword",
    "start-position" : 2030,
    "end-position" : 2035,
    "concept-id" : "aoCa_BaF_g6Z",
    "matched-string" : "pizza",
    "annotation-id" : 14
  }, {
    "preferred-label" : "Sprit/Vin",
    "sentiment" : "MUST_HAVE",
    "type" : "skill",
    "start-position" : 2292,
    "end-position" : 2295,
    "concept-id" : "S4vL_AVu_s6q",
    "matched-string" : "vin",
    "annotation-id" : 15
  }, {
    "preferred-label" : "Pizza",
    "sentiment" : "MUST_HAVE",
    "type" : "keyword",
    "start-position" : 2297,
    "end-position" : 2302,
    "concept-id" : "aoCa_BaF_g6Z",
    "matched-string" : "pizza",
    "annotation-id" : 16
  } ],
  "text" : "Servitris som skapar god stämning på Pizza Hut\nPizza Hut rekryterar: Servitris som skapar god stämning\n\r\n\r\n1958 grundade Bröderna Frank och Dan Carney från Kansas Pizza Hut. De lånade 600 dollar av sin mamma och de slog upp dörrarna till sin första restaurang i Wichita. Det blev succé. Idag finns vi, Pizza Hut, i över 100 länder. Ett starkt varumärke, känt för sina spännande smaker och unika deg, som inte serveras någon annanstans. Vill du vara med och fortsätta succén och lära dig att tillaga en äkta Pan Pizza?\n\nVi söker dig som har en naturlig fallenhet för service i världsklass. Du söker en arbetsplats med med härliga och glada kollegor, ett varumärke som klingar kvalitet och unika kunderbjudanden som våra pizzor. Helt enkelt en arbetsplats att trivas på och längta till. Med stolhet levererar du ut varje tallrik med någon av våra omtalade och efterfrågade rätter. Du sprudlar och har en speciell förmåga att skapa en god atmosfär både hos våra glada gäster och dina fina kollegor. Med ett leende och split vision har du i \"din\" matsal överblick över dina gäster oavsett hur många de är.\n\nDu är noggrann och ansvarstagande samt behärskar svenska språket i både tal och skrift. Dina arbetstider varierar med betoning på kvällar och helger. Det är meriterande, men inget krav, att du har tidigare erfarenhet av restaurangarbete eller restaurangutbildning.\n\nDina arbetsuppgifter blir bordsservering, kassahantering, planering av ditt arbete och att hålla matsalen ren och prydlig.\n\nVi erbjuder en trevlig arbetsplats med härliga kollegor, givande utbildningar och mycket goda utvecklingsmöjligheter. Förutom lön enligt HRF gröna avtal, erbjuder vi friskvårdsbidrag till våra medarbetare.\n\nVälkommen att göra din ansökan redan idag!\n\n[youtube LzQocnMEXZU]\n\nPå Pizza Hut bakar vi äkta Pan Pizza, det berömda originalet och vår stolthet från 1958. Som pizzaexperter serverar vi naturligtvis också tunn surdeg, San Fransisco Style pizza och världens ostigaste Cheesy crust\n\nVarje vardag vid lunch dukar vi upp vår populära pizza- och gröna sköna salladsbuffé. Resten av dagen och kvällen erbjuder vi även en välsmakande meny med godsaker som pasta, vitlöksbröd, härliga sides, läckra desserter och vår uppskattade mjukglassbar. Givetvis har vi även fullständiga rättigheter med öl och vin. Pizza lovers eller inte, våra restauranger erbjuder något för alla.\n\nVarmt välkommen - familj, vänner eller i eget sällskap!"
}