{
  "meta" : {
    "jobad" : {
      "description" : {
        "requirements" : null,
        "needs" : null,
        "company_information" : null,
        "text_formatted" : "<p><br></p><p><strong>Company Description</strong></p><p>At Bosch, we shape the future by inventing high-quality technologies and services that spark enthusiasm and enrich people’s lives. Our promise to our associates is rock-solid: we grow together, we enjoy our work, and we inspire each other. Join in and feel the difference.</p><p>Bosch R&amp;D Center Lund stands for modern development in cutting edge technology in the areas of connectivity, security, mobility solutions and AI. We are growing rapidly and looking for people to join us on our mission to become the Bosch Group’s 1st address for secure connected mobility solutions. We are working on a range of interesting projects, with a particular focus on software development for the automotive industry, electrical bicycles and Internet of Things.</p><p><br></p><p><strong>Job Description</strong></p><p>In the eBike Systems business unit, we develop innovative products and services that make eBiking even more fascinating - from highly efficient drive systems over the first series-produced ABS for pedelecs to smart connectivity solutions. For sustainable mobility that's fun.</p><ul><li>You will be part of the future of biking and support in creating backend services for eBikes using Go.</li><li>You bring in your ideas to define the best practices and apply them to the daily work of the team.</li><li>You take ownership of the end-to-end lifecycle of your applications.</li><li>You collaborate with cross-functional teams to define, design, and ship new features that cyclists love.</li><li>You will find yourself collaborating with teams of developers, designers, researchers, and marketing experts who focus on building, scaling, and operating high class digital services in the context of biking.</li><li>You continuously discover, evaluate, and implement new technologies to maximize development and testing efficiency.</li></ul><p><br></p><p><strong>Qualifications</strong></p><ul><li><strong>Education:</strong> University studies (master's degree/diploma/PhD) in computer science or a comparable subject.</li><li><strong>Experience and Knowledge:</strong> Deep knowledge of Go/Golang and experience as a backend developer or full stack developer. Familiarity with Docker.</li><li><strong>Working Practice:</strong> Agile mindset, self-motivated, self-organized, team player and out of the box thinking.</li><li><strong>Enthusiasm:</strong> Passion for biking.</li><li><strong>Languages: </strong>Business fluent in English.</li></ul><p><br></p><p><strong>Additional Information</strong></p><p><strong>Bosch offers you:</strong></p><ul><li>Flexibility in your work- work time and working from home.</li><li>An agile development environment that is trust-based.</li><li>Room for creativity and initiatives.</li><li>Internal and external training opportunities as well as continuous learning.</li><li>Internal career opportunities.</li><li>Collective agreement .</li><li>Benefits and services: health checks, employee discounts, sports and health opportunities, wellness contribution, work-life balance.</li><li>Easy access to local public transport, urban infrastructures, rural surroundings, and catering facilities.</li></ul><p><strong>Why do our employees enjoy working at Bosch R&amp;D Center Lund?</strong></p><p>Working in our teams allows you to collaborate with, and learn from, other skilled developers in a dynamic environment where many different technologies come together.</p><p>Diversity is our strength! At Bosch we look at diversity in gender, generation, nationalities, and culture as our advantage. We believe mixed teams to be more successful because they utilize the potential offered by different perspectives and solution strategies. We therefore promote mixed teams at all levels and draw on the entire talent pool.</p><p><br></p>",
        "conditions" : null,
        "text" : "Company Description\nAt Bosch, we shape the future by inventing high-quality technologies and services that spark enthusiasm and enrich people’s lives. Our promise to our associates is rock-solid: we grow together, we enjoy our work, and we inspire each other. Join in and feel the difference.\nBosch R&D Center Lund stands for modern development in cutting edge technology in the areas of connectivity, security, mobility solutions and AI. We are growing rapidly and looking for people to join us on our mission to become the Bosch Group’s 1st address for secure connected mobility solutions. We are working on a range of interesting projects, with a particular focus on software development for the automotive industry, electrical bicycles and Internet of Things.\n\n\nJob Description\nIn the eBike Systems business unit, we develop innovative products and services that make eBiking even more fascinating - from highly efficient drive systems over the first series-produced ABS for pedelecs to smart connectivity solutions. For sustainable mobility that's fun.\nYou will be part of the future of biking and support in creating backend services for eBikes using Go.\nYou bring in your ideas to define the best practices and apply them to the daily work of the team.\nYou take ownership of the end-to-end lifecycle of your applications.\nYou collaborate with cross-functional teams to define, design, and ship new features that cyclists love.\nYou will find yourself collaborating with teams of developers, designers, researchers, and marketing experts who focus on building, scaling, and operating high class digital services in the context of biking.\nYou continuously discover, evaluate, and implement new technologies to maximize development and testing efficiency.\n\n\n\nQualifications\nEducation: University studies (master's degree/diploma/PhD) in computer science or a comparable subject.\nExperience and Knowledge: Deep knowledge of Go/Golang and experience as a backend developer or full stack developer. Familiarity with Docker.\nWorking Practice: Agile mindset, self-motivated, self-organized, team player and out of the box thinking.\nEnthusiasm: Passion for biking.\nLanguages: Business fluent in English.\n\n\n\nAdditional Information\nBosch offers you:\nFlexibility in your work- work time and working from home.\nAn agile development environment that is trust-based.\nRoom for creativity and initiatives.\nInternal and external training opportunities as well as continuous learning.\nInternal career opportunities.\nCollective agreement .\nBenefits and services: health checks, employee discounts, sports and health opportunities, wellness contribution, work-life balance.\nEasy access to local public transport, urban infrastructures, rural surroundings, and catering facilities.\n\nWhy do our employees enjoy working at Bosch R&D Center Lund?\nWorking in our teams allows you to collaborate with, and learn from, other skilled developers in a dynamic environment where many different technologies come together.\nDiversity is our strength! At Bosch we look at diversity in gender, generation, nationalities, and culture as our advantage. We believe mixed teams to be more successful because they utilize the potential offered by different perspectives and solution strategies. We therefore promote mixed teams at all levels and draw on the entire talent pool."
      },
      "headline" : "Go Developer for Bosch eBike Systems",
      "driving_license" : null,
      "employer" : {
        "email" : null,
        "phone_number" : null,
        "organization_number" : "5560471194",
        "name" : "Robert Bosch AB",
        "url" : null,
        "workplace" : "Robert Bosch AB"
      },
      "removed_date" : null,
      "logo_url" : null,
      "last_publication_date" : "2022-07-29T00:00:00",
      "number_of_vacancies" : 1,
      "occupation" : {
        "concept_id" : "rQds_YGd_quU",
        "label" : "Mjukvaruutvecklare",
        "legacy_ams_taxonomy_id" : "80"
      },
      "occupation_group" : {
        "concept_id" : "DJh5_yyF_hEM",
        "label" : "Mjukvaru- och systemutvecklare m.fl.",
        "legacy_ams_taxonomy_id" : "2512"
      },
      "employment_type" : {
        "concept_id" : "PFZr_Syz_cUq",
        "label" : "Vanlig anställning",
        "legacy_ams_taxonomy_id" : "1"
      },
      "webpage_url" : "https://arbetsformedlingen.se/platsbanken/annonser/26270073",
      "driving_license_required" : false,
      "application_contacts" : [ ],
      "duration" : {
        "concept_id" : "a7uU_j21_mkL",
        "label" : "Tills vidare",
        "legacy_ams_taxonomy_id" : "1"
      },
      "nice_to_have" : {
        "education_level" : [ ],
        "work_experiences" : [ ],
        "skills" : [ ],
        "education" : [ ],
        "languages" : [ ]
      },
      "application_details" : {
        "via_af" : false,
        "email" : null,
        "other" : null,
        "reference" : null,
        "url" : "https://jobs.smartrecruiters.com/BoschGroup/743999835277630-go-developer-for-bosch-ebike-systems",
        "information" : null
      },
      "source_type" : "VIA_ANNONSERA",
      "application_deadline" : "2022-07-29T00:00:00",
      "external_id" : null,
      "workplace_address" : {
        "coordinates" : [ 13.214003682815326, 55.711863118919126 ],
        "city" : "LUND",
        "postcode" : "22363",
        "municipality" : "Lund",
        "region_concept_id" : "CaRE_1nn_cSU",
        "region" : "Skåne län",
        "country_code" : "199",
        "region_code" : "12",
        "municipality_concept_id" : "muSY_tsR_vDZ",
        "country_concept_id" : "i46j_HmG_v64",
        "municipality_code" : "1281",
        "street_address" : "Scheelevägen 15A Plan 2 och",
        "country" : "Sverige"
      },
      "id" : "26270073",
      "experience_required" : true,
      "working_hours_type" : {
        "concept_id" : "6YE1_gAC_R2G",
        "label" : "Heltid",
        "legacy_ams_taxonomy_id" : "1"
      },
      "access" : null,
      "timestamp" : 1656485135796,
      "must_have" : {
        "education_level" : [ ],
        "work_experiences" : [ ],
        "skills" : [ ],
        "education" : [ ],
        "languages" : [ ]
      },
      "occupation_field" : {
        "concept_id" : "apaJ_2ja_LuF",
        "label" : "Data/IT",
        "legacy_ams_taxonomy_id" : "3"
      },
      "scope_of_work" : {
        "min" : 0,
        "max" : 100
      },
      "salary_type" : {
        "concept_id" : "oG8G_9cW_nRf",
        "label" : "Fast månads- vecko- eller timlön",
        "legacy_ams_taxonomy_id" : "1"
      },
      "removed" : false,
      "salary_description" : null,
      "access_to_own_car" : false,
      "publication_date" : "2022-06-29T08:45:35"
    },
    "name" : "Go Developer for Bosch eBike Systems",
    "user" : "hannes"
  },
  "sha1" : "11bb563691e291e8e0039203d2602725a587b9a5",
  "annotations" : [ {
    "preferred-label" : "Teknologi",
    "type" : "keyword",
    "start-position" : 113,
    "end-position" : 125,
    "concept-id" : "KQjv_TUZ_Hy9",
    "matched-string" : "technologies",
    "annotation-id" : 13
  }, {
    "preferred-label" : "Lund",
    "type" : "municipality",
    "start-position" : 347,
    "end-position" : 351,
    "concept-id" : "muSY_tsR_vDZ",
    "matched-string" : "Lund",
    "annotation-id" : 14
  }, {
    "preferred-label" : "Teknologi",
    "type" : "keyword",
    "start-position" : 398,
    "end-position" : 408,
    "concept-id" : "KQjv_TUZ_Hy9",
    "matched-string" : "technology",
    "annotation-id" : 15
  }, {
    "preferred-label" : "Artificial Intelligence/Artificiell intelligens/AI",
    "sentiment" : "MUST_HAVE",
    "type" : "skill",
    "start-position" : 472,
    "end-position" : 474,
    "concept-id" : "SaTd_K5z_ex1",
    "matched-string" : "ai",
    "annotation-id" : 3
  }, {
    "preferred-label" : "Mjukvaruutveckling",
    "type" : "skill",
    "start-position" : 707,
    "end-position" : 727,
    "concept-id" : "A5HJ_aMw_BQt",
    "matched-string" : "software development",
    "annotation-id" : 16
  }, {
    "preferred-label" : "Automotive/Fordonsindustri",
    "sentiment" : "MUST_HAVE",
    "type" : "skill",
    "start-position" : 736,
    "end-position" : 746,
    "concept-id" : "jnLy_6Ns_KpH",
    "matched-string" : "automotive",
    "annotation-id" : 5
  }, {
    "preferred-label" : "elcyklar",
    "type" : "esco-skill",
    "start-position" : 757,
    "end-position" : 776,
    "concept-id" : "dcke_BL4_RvK",
    "matched-string" : "electrical bicycles",
    "annotation-id" : 17
  }, {
    "preferred-label" : "Internet of things/IoT",
    "sentiment" : "MUST_HAVE",
    "type" : "skill",
    "start-position" : 781,
    "end-position" : 799,
    "concept-id" : "v1kW_h4M_Kej",
    "matched-string" : "internet of things",
    "annotation-id" : 6
  }, {
    "preferred-label" : "Backend-utvecklare",
    "type" : "occupation-name",
    "start-position" : 1160,
    "end-position" : 1167,
    "concept-id" : "7wdX_4rv_33z",
    "matched-string" : "backend",
    "annotation-id" : 18
  }, {
    "preferred-label" : "Högskoleutbildning, generell, 5 år eller längre",
    "type" : "sun-education-level-3",
    "start-position" : 1845,
    "end-position" : 1860,
    "concept-id" : "mJj4_3Dz_V2z",
    "matched-string" : "master's degree",
    "annotation-id" : 19
  }, {
    "preferred-label" : "Doktorsexamen, tekniska ämnen",
    "type" : "skill",
    "start-position" : 1869,
    "end-position" : 1872,
    "concept-id" : "SYis_puJ_kXV",
    "matched-string" : "PhD",
    "annotation-id" : 20
  }, {
    "preferred-label" : "Backend-utvecklare",
    "type" : "occupation-name",
    "start-position" : 1993,
    "end-position" : 2010,
    "concept-id" : "7wdX_4rv_33z",
    "matched-string" : "backend developer",
    "annotation-id" : 21
  }, {
    "preferred-label" : "Docker, container-plattform",
    "sentiment" : "MUST_HAVE",
    "type" : "skill",
    "start-position" : 2053,
    "end-position" : 2059,
    "concept-id" : "ZipR_ckJ_YQC",
    "matched-string" : "docker",
    "annotation-id" : 8
  }, {
    "preferred-label" : "Engelska",
    "type" : "language",
    "start-position" : 2229,
    "end-position" : 2236,
    "concept-id" : "NVxJ_hLg_TYS",
    "matched-string" : "English",
    "annotation-id" : 22
  }, {
    "preferred-label" : "agil utveckling",
    "type" : "esco-skill",
    "start-position" : 2344,
    "end-position" : 2361,
    "concept-id" : "azwQ_pDo_Dur",
    "matched-string" : "agile development",
    "annotation-id" : 23
  }, {
    "preferred-label" : "Training",
    "sentiment" : "MUST_HAVE",
    "type" : "keyword",
    "start-position" : 2454,
    "end-position" : 2462,
    "concept-id" : "sJdm_Mbx_qz4",
    "matched-string" : "training",
    "annotation-id" : 9
  }, {
    "preferred-label" : "Lund",
    "type" : "municipality",
    "start-position" : 2859,
    "end-position" : 2863,
    "concept-id" : "muSY_tsR_vDZ",
    "matched-string" : "Lund",
    "annotation-id" : 24
  } ],
  "text" : "Go Developer for Bosch eBike Systems\nCompany Description\nAt Bosch, we shape the future by inventing high-quality technologies and services that spark enthusiasm and enrich people’s lives. Our promise to our associates is rock-solid: we grow together, we enjoy our work, and we inspire each other. Join in and feel the difference.\nBosch R&D Center Lund stands for modern development in cutting edge technology in the areas of connectivity, security, mobility solutions and AI. We are growing rapidly and looking for people to join us on our mission to become the Bosch Group’s 1st address for secure connected mobility solutions. We are working on a range of interesting projects, with a particular focus on software development for the automotive industry, electrical bicycles and Internet of Things.\n\n\nJob Description\nIn the eBike Systems business unit, we develop innovative products and services that make eBiking even more fascinating - from highly efficient drive systems over the first series-produced ABS for pedelecs to smart connectivity solutions. For sustainable mobility that's fun.\nYou will be part of the future of biking and support in creating backend services for eBikes using Go.\nYou bring in your ideas to define the best practices and apply them to the daily work of the team.\nYou take ownership of the end-to-end lifecycle of your applications.\nYou collaborate with cross-functional teams to define, design, and ship new features that cyclists love.\nYou will find yourself collaborating with teams of developers, designers, researchers, and marketing experts who focus on building, scaling, and operating high class digital services in the context of biking.\nYou continuously discover, evaluate, and implement new technologies to maximize development and testing efficiency.\n\n\n\nQualifications\nEducation: University studies (master's degree/diploma/PhD) in computer science or a comparable subject.\nExperience and Knowledge: Deep knowledge of Go/Golang and experience as a backend developer or full stack developer. Familiarity with Docker.\nWorking Practice: Agile mindset, self-motivated, self-organized, team player and out of the box thinking.\nEnthusiasm: Passion for biking.\nLanguages: Business fluent in English.\n\n\n\nAdditional Information\nBosch offers you:\nFlexibility in your work- work time and working from home.\nAn agile development environment that is trust-based.\nRoom for creativity and initiatives.\nInternal and external training opportunities as well as continuous learning.\nInternal career opportunities.\nCollective agreement .\nBenefits and services: health checks, employee discounts, sports and health opportunities, wellness contribution, work-life balance.\nEasy access to local public transport, urban infrastructures, rural surroundings, and catering facilities.\n\nWhy do our employees enjoy working at Bosch R&D Center Lund?\nWorking in our teams allows you to collaborate with, and learn from, other skilled developers in a dynamic environment where many different technologies come together.\nDiversity is our strength! At Bosch we look at diversity in gender, generation, nationalities, and culture as our advantage. We believe mixed teams to be more successful because they utilize the potential offered by different perspectives and solution strategies. We therefore promote mixed teams at all levels and draw on the entire talent pool."
}