{
  "meta" : {
    "jobad" : {
      "description" : {
        "requirements" : null,
        "needs" : null,
        "company_information" : null,
        "text_formatted" : "<p>Vi är en  inarbetat och väl etablerad salong, som funnits i 25 år. Vi söker en duktig massör som trivs att jobba i en Spa miljö. Medicinsk massage är en extra merit. Det är väldigt viktigt att du Kan ta människor på ett fint och lyhört sätt, när det är en viktig del i vårt koncept. </p><p>Vi är många som jobbar under ett och samma tak, och vi hjälps åt att hålla fint efter kunder och i våra behandlingsrum. Så viktigt att du kan samarbeta, och trivs att jobba med arbetskamrater. </p><p>Har du rätt utbildning och känner att du skulle passa in hos oss? </p><p>Till att börja med är det en vid behovs tjänst som förmodligen kan utökas när behovet i dag är väldigt stort hos oss.</p>",
        "conditions" : null,
        "text" : "Vi är en  inarbetat och väl etablerad salong, som funnits i 25 år. Vi söker en duktig massör som trivs att jobba i en Spa miljö. Medicinsk massage är en extra merit. Det är väldigt viktigt att du Kan ta människor på ett fint och lyhört sätt, när det är en viktig del i vårt koncept. \nVi är många som jobbar under ett och samma tak, och vi hjälps åt att hålla fint efter kunder och i våra behandlingsrum. Så viktigt att du kan samarbeta, och trivs att jobba med arbetskamrater. \nHar du rätt utbildning och känner att du skulle passa in hos oss? \nTill att börja med är det en vid behovs tjänst som förmodligen kan utökas när behovet i dag är väldigt stort hos oss."
      },
      "headline" : "Medicinsk Massör",
      "driving_license" : null,
      "employer" : {
        "email" : null,
        "phone_number" : null,
        "organization_number" : "5565296919",
        "name" : "Wilma, Cristin AB",
        "url" : "www.wilma.se",
        "workplace" : "WILMA CRISTIN AB"
      },
      "removed_date" : null,
      "logo_url" : "https://www.arbetsformedlingen.se/rest/arbetsgivare/rest/af/v3/arbetsplatser/81854106/logotyper/logo.png",
      "last_publication_date" : "2022-08-23T00:00:00",
      "number_of_vacancies" : 1,
      "occupation" : {
        "concept_id" : "mC28_vEv_AVx",
        "label" : "Massör/Massageterapeut",
        "legacy_ams_taxonomy_id" : "6308"
      },
      "occupation_group" : {
        "concept_id" : "uxHV_KXc_PKD",
        "label" : "Massörer och massageterapeuter",
        "legacy_ams_taxonomy_id" : "5143"
      },
      "employment_type" : {
        "concept_id" : "1paU_aCR_nGn",
        "label" : "Behovsanställning",
        "legacy_ams_taxonomy_id" : "4"
      },
      "webpage_url" : "https://arbetsformedlingen.se/platsbanken/annonser/26349252",
      "driving_license_required" : false,
      "application_contacts" : [ ],
      "duration" : {
        "concept_id" : null,
        "label" : null,
        "legacy_ams_taxonomy_id" : null
      },
      "nice_to_have" : {
        "education_level" : [ ],
        "work_experiences" : [ {
          "concept_id" : "mC28_vEv_AVx",
          "weight" : 5,
          "label" : "Massör/Massageterapeut",
          "legacy_ams_taxonomy_id" : "6308"
        } ],
        "skills" : [ ],
        "education" : [ ],
        "languages" : [ ]
      },
      "application_details" : {
        "via_af" : false,
        "email" : "salongwilma@gmail.com",
        "other" : null,
        "reference" : "Massör ",
        "url" : null,
        "information" : null
      },
      "source_type" : "VIA_ANNONSERA",
      "application_deadline" : "2022-08-23T00:00:00",
      "external_id" : null,
      "workplace_address" : {
        "coordinates" : [ 20.261696641175984, 63.826938092597544 ],
        "city" : "UMEÅ",
        "postcode" : "90327",
        "municipality" : "Umeå",
        "region_concept_id" : "g5Tt_CAV_zBd",
        "region" : "Västerbottens län",
        "country_code" : "199",
        "region_code" : "24",
        "municipality_concept_id" : "QiGt_BLu_amP",
        "country_concept_id" : "i46j_HmG_v64",
        "municipality_code" : "2480",
        "street_address" : "SKOLGATAN 56",
        "country" : "Sverige"
      },
      "id" : "26349252",
      "experience_required" : true,
      "working_hours_type" : {
        "concept_id" : null,
        "label" : null,
        "legacy_ams_taxonomy_id" : null
      },
      "access" : null,
      "timestamp" : 1658661565271,
      "must_have" : {
        "education_level" : [ ],
        "work_experiences" : [ ],
        "skills" : [ ],
        "education" : [ ],
        "languages" : [ {
          "concept_id" : "zSLA_vw2_FXN",
          "weight" : 10,
          "label" : "Svenska",
          "legacy_ams_taxonomy_id" : "502"
        } ]
      },
      "occupation_field" : {
        "concept_id" : "Uuf1_GMh_Uvw",
        "label" : "Kropps- och skönhetsvård",
        "legacy_ams_taxonomy_id" : "4"
      },
      "scope_of_work" : {
        "min" : 0,
        "max" : null
      },
      "salary_type" : {
        "concept_id" : "oG8G_9cW_nRf",
        "label" : "Fast månads- vecko- eller timlön",
        "legacy_ams_taxonomy_id" : "1"
      },
      "removed" : false,
      "salary_description" : null,
      "access_to_own_car" : false,
      "publication_date" : "2022-07-24T13:19:25"
    },
    "name" : "Medicinsk Massör",
    "user" : "kristof.fischer"
  },
  "sha1" : "d09493a8e0e5211b2adf68bc6dec6142410ea1ad",
  "annotations" : [ {
    "preferred-label" : "Massör/Massageterapeut",
    "sentiment" : "MUST_HAVE",
    "type" : "occupation-name",
    "start-position" : 10,
    "end-position" : 16,
    "concept-id" : "mC28_vEv_AVx",
    "matched-string" : "massör",
    "annotation-id" : 0
  }, {
    "preferred-label" : "Massör/Massageterapeut",
    "sentiment" : "MUST_HAVE",
    "type" : "occupation-name",
    "start-position" : 103,
    "end-position" : 109,
    "concept-id" : "mC28_vEv_AVx",
    "matched-string" : "massör",
    "annotation-id" : 1
  }, {
    "preferred-label" : "Medicinsk massage",
    "sentiment" : "NICE_TO_HAVE",
    "type" : "skill",
    "start-position" : 146,
    "end-position" : 163,
    "concept-id" : "RWnc_ghf_C2s",
    "matched-string" : "medicinsk massage",
    "annotation-id" : 2
  }, {
    "preferred-label" : "samarbeta med kolleger",
    "sentiment" : "MUST_HAVE",
    "type" : "esco-skill",
    "start-position" : 443,
    "end-position" : 452,
    "concept-id" : "X15R_797_q62",
    "matched-string" : "samarbeta",
    "annotation-id" : 3
  }, {
    "preferred-label" : "Behovsanställning",
    "type" : "employment-type",
    "start-position" : 591,
    "end-position" : 608,
    "concept-id" : "1paU_aCR_nGn",
    "matched-string" : "vid behovs tjänst",
    "annotation-id" : 4
  } ],
  "text" : "Medicinsk Massör\nVi är en  inarbetat och väl etablerad salong, som funnits i 25 år. Vi söker en duktig massör som trivs att jobba i en Spa miljö. Medicinsk massage är en extra merit. Det är väldigt viktigt att du Kan ta människor på ett fint och lyhört sätt, när det är en viktig del i vårt koncept. \nVi är många som jobbar under ett och samma tak, och vi hjälps åt att hålla fint efter kunder och i våra behandlingsrum. Så viktigt att du kan samarbeta, och trivs att jobba med arbetskamrater. \nHar du rätt utbildning och känner att du skulle passa in hos oss? \nTill att börja med är det en vid behovs tjänst som förmodligen kan utökas när behovet i dag är väldigt stort hos oss."
}