{
  "meta" : {
    "jobad" : {
      "description" : {
        "requirements" : null,
        "needs" : null,
        "company_information" : null,
        "text_formatted" : "<p>Vi är ett fransk inspirerat bageri och konditori med produktion på Arlanda. Nu söker vi en bagare som vill jobba med söta bröd och kavlade degar.</p><p>Vi bakar allt vårt matbröd och söta bröd från grunden. Vi använder ekologiskt mjöl och mjöl från små kvarnar, smör och kryddor av högsta kvalitet.</p><p>Inga brödmixer, margarin eller konserveringsmedel.</p><p>Tjänsten är 100% , dagtid och kvällstid med arbete varannan helg.</p><p>Vi ser gärna att du som söker har erfarenhet från liknande bageri / konditori.</p><p>Tillträde enligt överenskommelse.</p><p><br></p><p><br></p>",
        "conditions" : null,
        "text" : "Vi är ett fransk inspirerat bageri och konditori med produktion på Arlanda. Nu söker vi en bagare som vill jobba med söta bröd och kavlade degar.\nVi bakar allt vårt matbröd och söta bröd från grunden. Vi använder ekologiskt mjöl och mjöl från små kvarnar, smör och kryddor av högsta kvalitet.\nInga brödmixer, margarin eller konserveringsmedel.\nTjänsten är 100% , dagtid och kvällstid med arbete varannan helg.\nVi ser gärna att du som söker har erfarenhet från liknande bageri / konditori.\nTillträde enligt överenskommelse."
      },
      "headline" : "Bagare",
      "driving_license" : null,
      "employer" : {
        "email" : null,
        "phone_number" : null,
        "organization_number" : "5569066409",
        "name" : "R.C Bageri AB",
        "url" : null,
        "workplace" : "R C Bageri AB"
      },
      "removed_date" : null,
      "logo_url" : null,
      "last_publication_date" : "2022-07-21T23:59:59",
      "number_of_vacancies" : 1,
      "occupation" : {
        "concept_id" : "XugJ_6hw_wVV",
        "label" : "Bagare/Konditor",
        "legacy_ams_taxonomy_id" : "5504"
      },
      "occupation_group" : {
        "concept_id" : "5qT8_z9d_8rw",
        "label" : "Bagare och konditorer",
        "legacy_ams_taxonomy_id" : "7612"
      },
      "employment_type" : {
        "concept_id" : "PFZr_Syz_cUq",
        "label" : "Vanlig anställning",
        "legacy_ams_taxonomy_id" : "1"
      },
      "webpage_url" : "https://arbetsformedlingen.se/platsbanken/annonser/26242197",
      "driving_license_required" : false,
      "application_contacts" : [ ],
      "duration" : {
        "concept_id" : "a7uU_j21_mkL",
        "label" : "Tills vidare",
        "legacy_ams_taxonomy_id" : "1"
      },
      "nice_to_have" : {
        "education_level" : [ ],
        "work_experiences" : [ ],
        "skills" : [ ],
        "education" : [ ],
        "languages" : [ ]
      },
      "application_details" : {
        "via_af" : false,
        "email" : "rcchocolat@icloud.com",
        "other" : null,
        "reference" : null,
        "url" : null,
        "information" : null
      },
      "source_type" : "VIA_ANNONSERA",
      "application_deadline" : "2022-07-21T23:59:59",
      "external_id" : null,
      "workplace_address" : {
        "coordinates" : [ 17.94265996308138, 59.647130896398465 ],
        "city" : "Stockholm-Arlanda",
        "postcode" : "19060",
        "municipality" : "Sigtuna",
        "region_concept_id" : "CifL_Rzy_Mku",
        "region" : "Stockholms län",
        "country_code" : "199",
        "region_code" : "01",
        "municipality_concept_id" : "8ryy_X54_xJj",
        "country_concept_id" : "i46j_HmG_v64",
        "municipality_code" : "0191",
        "street_address" : "Sky City Skybridge",
        "country" : "Sverige"
      },
      "id" : "26242197",
      "experience_required" : true,
      "working_hours_type" : {
        "concept_id" : "6YE1_gAC_R2G",
        "label" : "Heltid",
        "legacy_ams_taxonomy_id" : "1"
      },
      "access" : null,
      "timestamp" : 1655805545781,
      "must_have" : {
        "education_level" : [ ],
        "work_experiences" : [ {
          "concept_id" : "XugJ_6hw_wVV",
          "weight" : 10,
          "label" : "Bagare/Konditor",
          "legacy_ams_taxonomy_id" : "5504"
        } ],
        "skills" : [ ],
        "education" : [ ],
        "languages" : [ {
          "concept_id" : "NVxJ_hLg_TYS",
          "weight" : 10,
          "label" : "Engelska",
          "legacy_ams_taxonomy_id" : "283"
        } ]
      },
      "occupation_field" : {
        "concept_id" : "PaxQ_o1G_wWH",
        "label" : "Hantverk",
        "legacy_ams_taxonomy_id" : "6"
      },
      "scope_of_work" : {
        "min" : 0,
        "max" : 100
      },
      "salary_type" : {
        "concept_id" : "oG8G_9cW_nRf",
        "label" : "Fast månads- vecko- eller timlön",
        "legacy_ams_taxonomy_id" : "1"
      },
      "removed" : false,
      "salary_description" : null,
      "access_to_own_car" : false,
      "publication_date" : "2022-06-21T11:59:05"
    },
    "name" : "Bagare",
    "user" : "hannes"
  },
  "sha1" : "200f97de8a9bac8299712b657eef23e041c7f5de",
  "annotations" : [ {
    "preferred-label" : "bagare",
    "sentiment" : "MUST_HAVE",
    "type" : "esco-occupation",
    "start-position" : 0,
    "end-position" : 6,
    "concept-id" : "Zo8A_5ML_j3t",
    "matched-string" : "bagare",
    "annotation-id" : 0
  }, {
    "preferred-label" : "Bageri och konditori",
    "type" : "keyword",
    "start-position" : 35,
    "end-position" : 55,
    "concept-id" : "4t2m_4Dj_ksJ",
    "matched-string" : "bageri och konditori",
    "annotation-id" : 4
  }, {
    "preferred-label" : "bagare",
    "sentiment" : "MUST_HAVE",
    "type" : "esco-occupation",
    "start-position" : 98,
    "end-position" : 104,
    "concept-id" : "Zo8A_5ML_j3t",
    "matched-string" : "bagare",
    "annotation-id" : 2
  }, {
    "preferred-label" : "Matbröd",
    "sentiment" : "MUST_HAVE",
    "type" : "skill",
    "start-position" : 172,
    "end-position" : 179,
    "concept-id" : "gzxa_drN_Uud",
    "matched-string" : "matbröd",
    "annotation-id" : 3
  }, {
    "preferred-label" : "Heltid",
    "type" : "worktime-extent",
    "start-position" : 363,
    "end-position" : 367,
    "concept-id" : "6YE1_gAC_R2G",
    "matched-string" : "100%",
    "annotation-id" : 5
  }, {
    "preferred-label" : "Bageri och konditori",
    "type" : "keyword",
    "start-position" : 476,
    "end-position" : 494,
    "concept-id" : "4t2m_4Dj_ksJ",
    "matched-string" : "bageri / konditori",
    "annotation-id" : 6
  } ],
  "text" : "Bagare\nVi är ett fransk inspirerat bageri och konditori med produktion på Arlanda. Nu söker vi en bagare som vill jobba med söta bröd och kavlade degar.\nVi bakar allt vårt matbröd och söta bröd från grunden. Vi använder ekologiskt mjöl och mjöl från små kvarnar, smör och kryddor av högsta kvalitet.\nInga brödmixer, margarin eller konserveringsmedel.\nTjänsten är 100% , dagtid och kvällstid med arbete varannan helg.\nVi ser gärna att du som söker har erfarenhet från liknande bageri / konditori.\nTillträde enligt överenskommelse."
}