{
  "meta" : {
    "jobad" : {
      "description" : {
        "requirements" : null,
        "needs" : null,
        "company_information" : null,
        "text_formatted" : "<p><em>Tycker du att det är kul med människor, service och försäljning? Vill du bidra till att ännu fler kan handla bra och hållbar mat? Bra! Då tror vi att du kommer att gilla att jobba hos oss. Willys är ett framgångsrikt företag med ett tydligt koncept där vi tillsammans arbetar för att alla ska kunna äta det de vill. Varje dag. Nu behöver vi fler härliga medarbetare som kan hjälpa oss bli ännu bättre.</em></p><p> </p><p><strong>Huvudsakliga arbetsuppgifter</strong></p><p>Som Butiksmedarbetare får du ta stort eget ansvar för att våra kunder enkelt ska kunna hitta det de söker. Du ska se till att våra hyllor är välfyllda och att det är rent och snyggt i vår butik. Tillsammans med dina kollegor ska du ha fokus på positivt kundbemötande, försäljning och se till att vi håller högsta kvalitet. Du blir en viktig del i kedjan mot en inspirerande butiksupplevelse. I utbyte kan vi lova goda utvecklingsmöjligheter i en organisation där vi vågar tänka i nya banor. Nu söker vi dig som vill bli en del av vårt härliga gäng på Willys Skövde Stallsiken. Tjänsterna avser tillsvidareanställning på 26 timmar i veckan, provanställning tillämpas. Arbetstiderna är schemalagda under dagtid, kvällar och helger.</p><p><strong>Det här förväntar vi oss</strong></p><p>För oss är mångfald en affärsmöjlighet. Medarbetarnas breda kunskaper, kompetenser och perspektiv skapar nya möjligheter och genererar bättre beslut. Vi uppmuntrar därför en mångfald av sökande till alla våra tjänster. Att du är matintresserad, tycker om att jobba med kunder och försäljning är en förutsättning för rollen. För att trivas hos oss ska du även ha lätt för att jobba i team, vara noggrann och kvalitetsmedveten. Dessutom ska du gilla när tempot är högt. Tillsammans med dina kollegor ska du sköta den dagliga driften av butiken. Det innebär exempelvis att du är service- och försäljningsinriktad, men även att du har sinne för såväl detaljer som helhet. </p><p><br></p><p>Om du vill veta mer om vad tjänsten innebär, kontakta Mattias Magnusson, mattias.magnusson@willys.se. Vi ser gärna att du vid intresse skickar din ansökan så snart som möjligt, då tjänsten kan komma att tillsättas före sista ansökningsdag den 2022-07-29. Vi tar endast emot ansökningar via våra jobbsidor.</p><p><br></p><p><br></p><p>Om Willys</p><p>I över 40 år har vi hjälpt att sätta bra mat på fler middagsbord genom vår affärsidé: Sveriges billigaste matkasse. Något som genomsyrar allt vi gör. Idag har vi mer än 220 butiker från Kalix i norr till Trelleborg i söder och under 2021 omsatte vi över 32 miljarder. Tillsammans med bland annat Hemköp och Dagab ingår vi i Axfood – ett av de största företagen inom svensk dagligvaruhandel. Hos oss finns det gott om möjlighet att växa och utvecklas.</p>",
        "conditions" : null,
        "text" : "Tycker du att det är kul med människor, service och försäljning? Vill du bidra till att ännu fler kan handla bra och hållbar mat? Bra! Då tror vi att du kommer att gilla att jobba hos oss. Willys är ett framgångsrikt företag med ett tydligt koncept där vi tillsammans arbetar för att alla ska kunna äta det de vill. Varje dag. Nu behöver vi fler härliga medarbetare som kan hjälpa oss bli ännu bättre.\n \nHuvudsakliga arbetsuppgifter\nSom Butiksmedarbetare får du ta stort eget ansvar för att våra kunder enkelt ska kunna hitta det de söker. Du ska se till att våra hyllor är välfyllda och att det är rent och snyggt i vår butik. Tillsammans med dina kollegor ska du ha fokus på positivt kundbemötande, försäljning och se till att vi håller högsta kvalitet. Du blir en viktig del i kedjan mot en inspirerande butiksupplevelse. I utbyte kan vi lova goda utvecklingsmöjligheter i en organisation där vi vågar tänka i nya banor. Nu söker vi dig som vill bli en del av vårt härliga gäng på Willys Skövde Stallsiken. Tjänsterna avser tillsvidareanställning på 26 timmar i veckan, provanställning tillämpas. Arbetstiderna är schemalagda under dagtid, kvällar och helger.\nDet här förväntar vi oss\nFör oss är mångfald en affärsmöjlighet. Medarbetarnas breda kunskaper, kompetenser och perspektiv skapar nya möjligheter och genererar bättre beslut. Vi uppmuntrar därför en mångfald av sökande till alla våra tjänster. Att du är matintresserad, tycker om att jobba med kunder och försäljning är en förutsättning för rollen. För att trivas hos oss ska du även ha lätt för att jobba i team, vara noggrann och kvalitetsmedveten. Dessutom ska du gilla när tempot är högt. Tillsammans med dina kollegor ska du sköta den dagliga driften av butiken. Det innebär exempelvis att du är service- och försäljningsinriktad, men även att du har sinne för såväl detaljer som helhet. \n\n\nOm du vill veta mer om vad tjänsten innebär, kontakta Mattias Magnusson, mattias.magnusson@willys.se. Vi ser gärna att du vid intresse skickar din ansökan så snart som möjligt, då tjänsten kan komma att tillsättas före sista ansökningsdag den 2022-07-29. Vi tar endast emot ansökningar via våra jobbsidor.\n\n\n\n\nOm Willys\nI över 40 år har vi hjälpt att sätta bra mat på fler middagsbord genom vår affärsidé: Sveriges billigaste matkasse. Något som genomsyrar allt vi gör. Idag har vi mer än 220 butiker från Kalix i norr till Trelleborg i söder och under 2021 omsatte vi över 32 miljarder. Tillsammans med bland annat Hemköp och Dagab ingår vi i Axfood – ett av de största företagen inom svensk dagligvaruhandel. Hos oss finns det gott om möjlighet att växa och utvecklas."
      },
      "headline" : "Butiksmedarbetare Willys Skövde Stallsiken",
      "driving_license" : null,
      "employer" : {
        "email" : null,
        "phone_number" : null,
        "organization_number" : "5561632232",
        "name" : "Willy:S AB",
        "url" : null,
        "workplace" : "Willys Skövde Stallsiken"
      },
      "removed_date" : null,
      "logo_url" : "https://www.arbetsformedlingen.se/rest/arbetsgivare/rest/af/v3/arbetsplatser/82172803/logotyper/logo.png",
      "last_publication_date" : "2022-07-29T00:00:00",
      "number_of_vacancies" : 7,
      "occupation" : {
        "concept_id" : "pBhS_6fg_727",
        "label" : "Butikssäljare/Medarbetare, dagligvaror",
        "legacy_ams_taxonomy_id" : "2284"
      },
      "occupation_group" : {
        "concept_id" : "s1Qk_o98_2o1",
        "label" : "Butikssäljare, dagligvaror",
        "legacy_ams_taxonomy_id" : "5222"
      },
      "employment_type" : {
        "concept_id" : "PFZr_Syz_cUq",
        "label" : "Vanlig anställning",
        "legacy_ams_taxonomy_id" : "1"
      },
      "webpage_url" : "https://arbetsformedlingen.se/platsbanken/annonser/26331812",
      "driving_license_required" : false,
      "application_contacts" : [ ],
      "duration" : {
        "concept_id" : "a7uU_j21_mkL",
        "label" : "Tills vidare",
        "legacy_ams_taxonomy_id" : "1"
      },
      "nice_to_have" : {
        "education_level" : [ ],
        "work_experiences" : [ ],
        "skills" : [ ],
        "education" : [ ],
        "languages" : [ ]
      },
      "application_details" : {
        "via_af" : false,
        "email" : null,
        "other" : null,
        "reference" : null,
        "url" : "https://jobb.axfood.se/job-invite/7212/",
        "information" : null
      },
      "source_type" : "VIA_ANNONSERA",
      "application_deadline" : "2022-07-29T00:00:00",
      "external_id" : null,
      "workplace_address" : {
        "coordinates" : [ 13.881536991568888, 58.41132657674066 ],
        "city" : "SKÖVDE",
        "postcode" : "54166",
        "municipality" : "Skövde",
        "region_concept_id" : "zdoY_6u5_Krt",
        "region" : "Västra Götalands län",
        "country_code" : "199",
        "region_code" : "14",
        "municipality_concept_id" : "fqAy_4ji_Lz2",
        "country_concept_id" : "i46j_HmG_v64",
        "municipality_code" : "1496",
        "street_address" : "Jonstorpsgatan 25",
        "country" : "Sverige"
      },
      "id" : "26331812",
      "experience_required" : true,
      "working_hours_type" : {
        "concept_id" : "947z_JGS_Uk2",
        "label" : "Deltid",
        "legacy_ams_taxonomy_id" : "2"
      },
      "access" : null,
      "timestamp" : 1657889115273,
      "must_have" : {
        "education_level" : [ ],
        "work_experiences" : [ ],
        "skills" : [ ],
        "education" : [ ],
        "languages" : [ {
          "concept_id" : "zSLA_vw2_FXN",
          "weight" : 10,
          "label" : "Svenska",
          "legacy_ams_taxonomy_id" : "502"
        } ]
      },
      "occupation_field" : {
        "concept_id" : "RPTn_bxG_ExZ",
        "label" : "Försäljning, inköp, marknadsföring",
        "legacy_ams_taxonomy_id" : "5"
      },
      "scope_of_work" : {
        "min" : 0,
        "max" : 100
      },
      "salary_type" : {
        "concept_id" : "oG8G_9cW_nRf",
        "label" : "Fast månads- vecko- eller timlön",
        "legacy_ams_taxonomy_id" : "1"
      },
      "removed" : false,
      "salary_description" : null,
      "access_to_own_car" : false,
      "publication_date" : "2022-07-15T14:45:15"
    },
    "name" : "Butiksmedarbetare Willys Skövde Stallsiken",
    "user" : "hannes"
  },
  "sha1" : "a13a255e00951e73b1f710edafe37850403a6c6b",
  "annotations" : [ {
    "preferred-label" : "Butiksmedarbetare",
    "sentiment" : "MUST_HAVE",
    "type" : "keyword",
    "start-position" : 0,
    "end-position" : 17,
    "concept-id" : "ifET_wHx_6w5",
    "matched-string" : "butiksmedarbetare",
    "annotation-id" : 0
  }, {
    "preferred-label" : "Willys",
    "sentiment" : "MUST_HAVE",
    "type" : "keyword",
    "start-position" : 18,
    "end-position" : 24,
    "concept-id" : "YZZx_2rH_qHf",
    "matched-string" : "willys",
    "annotation-id" : 1
  }, {
    "preferred-label" : "Skövde",
    "type" : "municipality",
    "start-position" : 25,
    "end-position" : 31,
    "concept-id" : "fqAy_4ji_Lz2",
    "matched-string" : "Skövde",
    "annotation-id" : 8
  }, {
    "preferred-label" : "Willys",
    "sentiment" : "MUST_HAVE",
    "type" : "keyword",
    "start-position" : 232,
    "end-position" : 238,
    "concept-id" : "YZZx_2rH_qHf",
    "matched-string" : "willys",
    "annotation-id" : 2
  }, {
    "preferred-label" : "Butiksmedarbetare",
    "sentiment" : "MUST_HAVE",
    "type" : "keyword",
    "start-position" : 480,
    "end-position" : 497,
    "concept-id" : "ifET_wHx_6w5",
    "matched-string" : "butiksmedarbetare",
    "annotation-id" : 3
  }, {
    "preferred-label" : "Butik",
    "sentiment" : "MUST_HAVE",
    "type" : "keyword",
    "start-position" : 664,
    "end-position" : 669,
    "concept-id" : "xLsd_zjY_5wr",
    "matched-string" : "butik",
    "annotation-id" : 4
  }, {
    "preferred-label" : "Willys",
    "sentiment" : "MUST_HAVE",
    "type" : "keyword",
    "start-position" : 1027,
    "end-position" : 1033,
    "concept-id" : "YZZx_2rH_qHf",
    "matched-string" : "willys",
    "annotation-id" : 5
  }, {
    "preferred-label" : "Skövde",
    "type" : "municipality",
    "start-position" : 1034,
    "end-position" : 1040,
    "concept-id" : "fqAy_4ji_Lz2",
    "matched-string" : "Skövde",
    "annotation-id" : 9
  }, {
    "preferred-label" : "Tillsvidareanställning (inkl. eventuell provanställning)",
    "type" : "employment-type",
    "start-position" : 1070,
    "end-position" : 1092,
    "concept-id" : "kpPX_CNN_gDU",
    "matched-string" : "tillsvidareanställning",
    "annotation-id" : 10
  }, {
    "preferred-label" : "Heltid",
    "type" : "worktime-extent",
    "start-position" : 1096,
    "end-position" : 1114,
    "concept-id" : "6YE1_gAC_R2G",
    "matched-string" : "26 timmar i veckan",
    "annotation-id" : 11
  }, {
    "preferred-label" : "noggrannhet",
    "type" : "esco-skill",
    "start-position" : 1625,
    "end-position" : 1633,
    "concept-id" : "mrsW_EkL_KRD",
    "matched-string" : "noggrann",
    "annotation-id" : 12
  }, {
    "preferred-label" : "Willys",
    "sentiment" : "MUST_HAVE",
    "type" : "keyword",
    "start-position" : 2215,
    "end-position" : 2221,
    "concept-id" : "YZZx_2rH_qHf",
    "matched-string" : "willys",
    "annotation-id" : 7
  } ],
  "text" : "Butiksmedarbetare Willys Skövde Stallsiken\nTycker du att det är kul med människor, service och försäljning? Vill du bidra till att ännu fler kan handla bra och hållbar mat? Bra! Då tror vi att du kommer att gilla att jobba hos oss. Willys är ett framgångsrikt företag med ett tydligt koncept där vi tillsammans arbetar för att alla ska kunna äta det de vill. Varje dag. Nu behöver vi fler härliga medarbetare som kan hjälpa oss bli ännu bättre.\n \nHuvudsakliga arbetsuppgifter\nSom Butiksmedarbetare får du ta stort eget ansvar för att våra kunder enkelt ska kunna hitta det de söker. Du ska se till att våra hyllor är välfyllda och att det är rent och snyggt i vår butik. Tillsammans med dina kollegor ska du ha fokus på positivt kundbemötande, försäljning och se till att vi håller högsta kvalitet. Du blir en viktig del i kedjan mot en inspirerande butiksupplevelse. I utbyte kan vi lova goda utvecklingsmöjligheter i en organisation där vi vågar tänka i nya banor. Nu söker vi dig som vill bli en del av vårt härliga gäng på Willys Skövde Stallsiken. Tjänsterna avser tillsvidareanställning på 26 timmar i veckan, provanställning tillämpas. Arbetstiderna är schemalagda under dagtid, kvällar och helger.\nDet här förväntar vi oss\nFör oss är mångfald en affärsmöjlighet. Medarbetarnas breda kunskaper, kompetenser och perspektiv skapar nya möjligheter och genererar bättre beslut. Vi uppmuntrar därför en mångfald av sökande till alla våra tjänster. Att du är matintresserad, tycker om att jobba med kunder och försäljning är en förutsättning för rollen. För att trivas hos oss ska du även ha lätt för att jobba i team, vara noggrann och kvalitetsmedveten. Dessutom ska du gilla när tempot är högt. Tillsammans med dina kollegor ska du sköta den dagliga driften av butiken. Det innebär exempelvis att du är service- och försäljningsinriktad, men även att du har sinne för såväl detaljer som helhet. \n\n\nOm du vill veta mer om vad tjänsten innebär, kontakta Mattias Magnusson, mattias.magnusson@willys.se. Vi ser gärna att du vid intresse skickar din ansökan så snart som möjligt, då tjänsten kan komma att tillsättas före sista ansökningsdag den 2022-07-29. Vi tar endast emot ansökningar via våra jobbsidor.\n\n\n\n\nOm Willys\nI över 40 år har vi hjälpt att sätta bra mat på fler middagsbord genom vår affärsidé: Sveriges billigaste matkasse. Något som genomsyrar allt vi gör. Idag har vi mer än 220 butiker från Kalix i norr till Trelleborg i söder och under 2021 omsatte vi över 32 miljarder. Tillsammans med bland annat Hemköp och Dagab ingår vi i Axfood – ett av de största företagen inom svensk dagligvaruhandel. Hos oss finns det gott om möjlighet att växa och utvecklas."
}