{
  "meta" : {
    "jobad" : {
      "description" : {
        "requirements" : null,
        "needs" : null,
        "company_information" : null,
        "text_formatted" : "<p>Vi söker en person som är intresserad av matlagning, medföljande köksarbete.</p><p>Intresserad, passionerad person som är lättlärd, snabb och arbetsvillig.</p><p>Plus om man har nystartsjobb eller liknande</p>",
        "conditions" : null,
        "text" : "Vi söker en person som är intresserad av matlagning, medföljande köksarbete.\nIntresserad, passionerad person som är lättlärd, snabb och arbetsvillig.\nPlus om man har nystartsjobb eller liknande"
      },
      "headline" : "Köksbiträde",
      "driving_license" : null,
      "employer" : {
        "email" : null,
        "phone_number" : null,
        "organization_number" : "5590204896",
        "name" : "Franco Rustique AB",
        "url" : null,
        "workplace" : "Franco Rustique"
      },
      "removed_date" : null,
      "logo_url" : null,
      "last_publication_date" : "2022-09-08T00:00:00",
      "number_of_vacancies" : 2,
      "occupation" : {
        "concept_id" : "oRB5_b7i_Qzv",
        "label" : "Köksbiträde",
        "legacy_ams_taxonomy_id" : "483"
      },
      "occupation_group" : {
        "concept_id" : "tPox_ie4_X9X",
        "label" : "Restaurang- och köksbiträden m.fl.",
        "legacy_ams_taxonomy_id" : "9412"
      },
      "employment_type" : {
        "concept_id" : "PFZr_Syz_cUq",
        "label" : "Vanlig anställning",
        "legacy_ams_taxonomy_id" : "1"
      },
      "webpage_url" : "https://arbetsformedlingen.se/platsbanken/annonser/26389309",
      "driving_license_required" : false,
      "application_contacts" : [ ],
      "duration" : {
        "concept_id" : "a7uU_j21_mkL",
        "label" : "Tills vidare",
        "legacy_ams_taxonomy_id" : "1"
      },
      "nice_to_have" : {
        "education_level" : [ ],
        "work_experiences" : [ {
          "concept_id" : "oRB5_b7i_Qzv",
          "weight" : 5,
          "label" : "Köksbiträde",
          "legacy_ams_taxonomy_id" : "483"
        } ],
        "skills" : [ ],
        "education" : [ ],
        "languages" : [ ]
      },
      "application_details" : {
        "via_af" : false,
        "email" : "aframchamun@live.se",
        "other" : null,
        "reference" : "Köksbiträde",
        "url" : null,
        "information" : null
      },
      "source_type" : "VIA_ANNONSERA",
      "application_deadline" : "2022-09-08T00:00:00",
      "external_id" : null,
      "workplace_address" : {
        "coordinates" : [ 18.09167411020445, 59.33852726095696 ],
        "city" : "STOCKHOLM",
        "postcode" : "11520",
        "municipality" : "Stockholm",
        "region_concept_id" : "CifL_Rzy_Mku",
        "region" : "Stockholms län",
        "country_code" : "199",
        "region_code" : "01",
        "municipality_concept_id" : "AvNB_uwa_6n6",
        "country_concept_id" : "i46j_HmG_v64",
        "municipality_code" : "0180",
        "street_address" : "Franzengatan 74",
        "country" : "Sverige"
      },
      "id" : "26389309",
      "experience_required" : true,
      "working_hours_type" : {
        "concept_id" : "6YE1_gAC_R2G",
        "label" : "Heltid",
        "legacy_ams_taxonomy_id" : "1"
      },
      "access" : null,
      "timestamp" : 1660027505279,
      "must_have" : {
        "education_level" : [ ],
        "work_experiences" : [ ],
        "skills" : [ ],
        "education" : [ ],
        "languages" : [ ]
      },
      "occupation_field" : {
        "concept_id" : "ScKy_FHB_7wT",
        "label" : "Hotell, restaurang, storhushåll",
        "legacy_ams_taxonomy_id" : "7"
      },
      "scope_of_work" : {
        "min" : 0,
        "max" : 100
      },
      "salary_type" : {
        "concept_id" : "oG8G_9cW_nRf",
        "label" : "Fast månads- vecko- eller timlön",
        "legacy_ams_taxonomy_id" : "1"
      },
      "removed" : false,
      "salary_description" : null,
      "access_to_own_car" : false,
      "publication_date" : "2022-08-09T08:45:05"
    },
    "name" : "Köksbiträde",
    "user" : "hannes"
  },
  "sha1" : "b9928614494b57f923477010f7d925d17c865367",
  "annotations" : [ {
    "preferred-label" : "Köksbiträde",
    "sentiment" : "MUST_HAVE",
    "type" : "occupation-name",
    "start-position" : 0,
    "end-position" : 11,
    "concept-id" : "oRB5_b7i_Qzv",
    "matched-string" : "köksbiträde",
    "annotation-id" : 0
  }, {
    "preferred-label" : "Nystartsjobb",
    "type" : "unemployment-type",
    "start-position" : 178,
    "end-position" : 190,
    "concept-id" : "gXTZ_8H8_iXA",
    "matched-string" : "nystartsjobb",
    "annotation-id" : 1
  } ],
  "text" : "Köksbiträde\nVi söker en person som är intresserad av matlagning, medföljande köksarbete.\nIntresserad, passionerad person som är lättlärd, snabb och arbetsvillig.\nPlus om man har nystartsjobb eller liknande"
}