{
  "meta" : {
    "jobad" : {
      "description" : {
        "requirements" : null,
        "needs" : null,
        "company_information" : null,
        "text_formatted" : "Supervision & Development tillhör underhållsorganisationen på SAAB, Aeronautics. Vi finns i Tannefors, Linköping. Vi utför service och underhållsarbeten på markutrustningar som framför allt används i vår provverksamhet och i vår produktion.\n \n\nVårt arbete är både fritt och krävande men samtidigt väldigt stimulerande då vi tar fram lösningar och hjälpmedel för verksamhetens väldigt olika behov.\n \n\nVi är idag en grupp på tolv personer som jobbar tätt, oftast i par.\n\nSocialkompetens och professionellt uppträdande är viktigare för oss än utbildning. Verkstadsteknisk eller Fordonsteknisk utbildning, erfarenhet från montagearbete, hydraulik, el är meriterande. Det finns ingen enskild utbildning för de arbetsuppgifter vi utför. Den person vi väljer kommer att utbildas internt och externt om så krävs. Vi lägger stor vikt vid personsäkerhet och förutsättningsskapande utbildningar för verksamhetens behov.\n\n \n\nI vårt arbete behöver man vara lösningsorienterad. Det vill säga att se och förebygga eventuella problem och därmed förhindra tillbud och eller onödiga stopp. Då arbete ibland behöver utföras i krävande miljöer eller specifika instruktioner krävs noggrannhet, flexibilitet samt disciplin. I delar av vårt arbete gäller det att det blir rätt direkt. Man har t.ex. bara ett provföremål, då gäller det att tänka igenom sin uppgift och göra allting rätt.\n \n\nArbetstiden är normalt dagtid men andra arbetstider kan förekomma periodvis oftast i samband med olika projekt eller underhållsstopp.\n\nÄven resor i tjänsten inom och utom Sveriges gränser kan förekomma.\n\n \n\nBefattningen kräver att du genomgår och godkänns enligt var tid gällande bestämmelser för säkerhetsskydd. För befattningar där Saab har krav på säkerhetsklassinplacering kan, i förekommande fall, medföra krav på visst medborgarskap.\n \n\nI denna rekrytering sammarbetar Saab & Skill. Urval påbörjas efter semestern runt V.33. Vid frågor kontakta Frida Jakobson, Frida.Jakobsson@skill.se",
        "conditions" : "Heltid\r\nPermanent",
        "text" : "Supervision & Development tillhör underhållsorganisationen på SAAB, Aeronautics. Vi finns i Tannefors, Linköping. Vi utför service och underhållsarbeten på markutrustningar som framför allt används i vår provverksamhet och i vår produktion.\n \n\nVårt arbete är både fritt och krävande men samtidigt väldigt stimulerande då vi tar fram lösningar och hjälpmedel för verksamhetens väldigt olika behov.\n \n\nVi är idag en grupp på tolv personer som jobbar tätt, oftast i par.\n\nSocialkompetens och professionellt uppträdande är viktigare för oss än utbildning. Verkstadsteknisk eller Fordonsteknisk utbildning, erfarenhet från montagearbete, hydraulik, el är meriterande. Det finns ingen enskild utbildning för de arbetsuppgifter vi utför. Den person vi väljer kommer att utbildas internt och externt om så krävs. Vi lägger stor vikt vid personsäkerhet och förutsättningsskapande utbildningar för verksamhetens behov.\n\n \n\nI vårt arbete behöver man vara lösningsorienterad. Det vill säga att se och förebygga eventuella problem och därmed förhindra tillbud och eller onödiga stopp. Då arbete ibland behöver utföras i krävande miljöer eller specifika instruktioner krävs noggrannhet, flexibilitet samt disciplin. I delar av vårt arbete gäller det att det blir rätt direkt. Man har t.ex. bara ett provföremål, då gäller det att tänka igenom sin uppgift och göra allting rätt.\n \n\nArbetstiden är normalt dagtid men andra arbetstider kan förekomma periodvis oftast i samband med olika projekt eller underhållsstopp.\n\nÄven resor i tjänsten inom och utom Sveriges gränser kan förekomma.\n\n \n\nBefattningen kräver att du genomgår och godkänns enligt var tid gällande bestämmelser för säkerhetsskydd. För befattningar där Saab har krav på säkerhetsklassinplacering kan, i förekommande fall, medföra krav på visst medborgarskap.\n \n\nI denna rekrytering sammarbetar Saab & Skill. Urval påbörjas efter semestern runt V.33. Vid frågor kontakta Frida Jakobson, Frida.Jakobsson@skill.se"
      },
      "headline" : "Montör till Supervision & Development på Saab Aeronautics.",
      "driving_license" : null,
      "employer" : {
        "email" : null,
        "phone_number" : null,
        "organization_number" : "5560360793",
        "name" : "SAAB AB",
        "url" : null,
        "workplace" : "Saab AB"
      },
      "removed_date" : null,
      "logo_url" : "https://www.arbetsformedlingen.se/rest/arbetsgivare/rest/af/v3/organisation/5560360793/logotyper/logo.png",
      "last_publication_date" : "2022-08-23T23:59:59",
      "number_of_vacancies" : 1,
      "occupation" : {
        "concept_id" : "GaiH_Bzd_mU5",
        "label" : "Elektronikmontör",
        "legacy_ams_taxonomy_id" : "307"
      },
      "occupation_group" : {
        "concept_id" : "SgAJ_DW2_FN5",
        "label" : "Montörer, elektrisk och elektronisk utrustning",
        "legacy_ams_taxonomy_id" : "8212"
      },
      "employment_type" : {
        "concept_id" : "PFZr_Syz_cUq",
        "label" : "Vanlig anställning",
        "legacy_ams_taxonomy_id" : "1"
      },
      "webpage_url" : "https://arbetsformedlingen.se/platsbanken/annonser/26293920",
      "driving_license_required" : false,
      "application_contacts" : [ {
        "description" : "Saab AB",
        "email" : null,
        "telephone" : "072142 04 12",
        "name" : null,
        "contact_type" : null
      } ],
      "duration" : {
        "concept_id" : "a7uU_j21_mkL",
        "label" : "Tills vidare",
        "legacy_ams_taxonomy_id" : "1"
      },
      "nice_to_have" : {
        "education_level" : [ ],
        "work_experiences" : [ ],
        "skills" : [ ],
        "education" : [ ],
        "languages" : [ ]
      },
      "application_details" : {
        "via_af" : false,
        "email" : null,
        "other" : null,
        "reference" : "REQ_13710",
        "url" : "https://www.aplitrak.com/?adid=Zmpha29ic3Nvbi4wMDUyMy4zMTAxQHNhYWIuYXBsaXRyYWsuY29t",
        "information" : null
      },
      "source_type" : "VIA_PLATSBANKEN_DXA",
      "application_deadline" : "2022-08-23T23:59:59",
      "external_id" : "46-556036-0793-REQ_13710",
      "workplace_address" : {
        "coordinates" : [ 15.621373, 58.41081 ],
        "city" : null,
        "postcode" : null,
        "municipality" : "Linköping",
        "region_concept_id" : "oLT3_Q9p_3nn",
        "region" : "Östergötlands län",
        "country_code" : "199",
        "region_code" : "05",
        "municipality_concept_id" : "bm2x_1mr_Qhx",
        "country_concept_id" : "i46j_HmG_v64",
        "municipality_code" : "0580",
        "street_address" : null,
        "country" : "Sverige"
      },
      "id" : "26293920",
      "experience_required" : false,
      "working_hours_type" : {
        "concept_id" : "6YE1_gAC_R2G",
        "label" : "Heltid",
        "legacy_ams_taxonomy_id" : "1"
      },
      "access" : null,
      "timestamp" : 1657020741494,
      "must_have" : {
        "education_level" : [ ],
        "work_experiences" : [ ],
        "skills" : [ ],
        "education" : [ ],
        "languages" : [ ]
      },
      "occupation_field" : {
        "concept_id" : "wTEr_CBC_bqh",
        "label" : "Industriell tillverkning",
        "legacy_ams_taxonomy_id" : "9"
      },
      "scope_of_work" : {
        "min" : 100,
        "max" : 100
      },
      "salary_type" : {
        "concept_id" : "oG8G_9cW_nRf",
        "label" : "Fast månads- vecko- eller timlön",
        "legacy_ams_taxonomy_id" : "1"
      },
      "removed" : false,
      "salary_description" : "Not Specified",
      "access_to_own_car" : false,
      "publication_date" : "2022-07-05T10:54:48"
    },
    "name" : "Montör till Supervision & Development på Saab Aeronautics.",
    "user" : "hannes"
  },
  "sha1" : "e88069eb88efa167d13689aca62fbc1862588ade",
  "annotations" : [ {
    "preferred-label" : "Montörer",
    "type" : "ssyk-level-3",
    "start-position" : 0,
    "end-position" : 6,
    "concept-id" : "Wz8B_WeK_vUB",
    "matched-string" : "Montör",
    "annotation-id" : 2
  }, {
    "preferred-label" : "Linköping",
    "type" : "municipality",
    "start-position" : 162,
    "end-position" : 171,
    "concept-id" : "bm2x_1mr_Qhx",
    "matched-string" : "Linköping",
    "annotation-id" : 3
  }, {
    "preferred-label" : "hydraulik",
    "sentiment" : "MUST_HAVE",
    "type" : "esco-skill",
    "start-position" : 692,
    "end-position" : 701,
    "concept-id" : "zwYL_deZ_JXX",
    "matched-string" : "hydraulik",
    "annotation-id" : 0
  }, {
    "preferred-label" : "noggrannhet",
    "type" : "esco-skill",
    "start-position" : 1219,
    "end-position" : 1230,
    "concept-id" : "mrsW_EkL_KRD",
    "matched-string" : "noggrannhet",
    "annotation-id" : 4
  }, {
    "preferred-label" : "Resor i arbetet förekommer",
    "type" : "work-place-environment",
    "start-position" : 1566,
    "end-position" : 1582,
    "concept-id" : "oaM2_JTK_muh",
    "matched-string" : "resor i tjänsten",
    "annotation-id" : 5
  }, {
    "preferred-label" : "Resor i arbetet förekommer",
    "type" : "work-place-environment",
    "start-position" : 1618,
    "end-position" : 1627,
    "concept-id" : "oaM2_JTK_muh",
    "matched-string" : "förekomma",
    "annotation-id" : 6
  } ],
  "text" : "Montör till Supervision & Development på Saab Aeronautics.\nSupervision & Development tillhör underhållsorganisationen på SAAB, Aeronautics. Vi finns i Tannefors, Linköping. Vi utför service och underhållsarbeten på markutrustningar som framför allt används i vår provverksamhet och i vår produktion.\n \n\nVårt arbete är både fritt och krävande men samtidigt väldigt stimulerande då vi tar fram lösningar och hjälpmedel för verksamhetens väldigt olika behov.\n \n\nVi är idag en grupp på tolv personer som jobbar tätt, oftast i par.\n\nSocialkompetens och professionellt uppträdande är viktigare för oss än utbildning. Verkstadsteknisk eller Fordonsteknisk utbildning, erfarenhet från montagearbete, hydraulik, el är meriterande. Det finns ingen enskild utbildning för de arbetsuppgifter vi utför. Den person vi väljer kommer att utbildas internt och externt om så krävs. Vi lägger stor vikt vid personsäkerhet och förutsättningsskapande utbildningar för verksamhetens behov.\n\n \n\nI vårt arbete behöver man vara lösningsorienterad. Det vill säga att se och förebygga eventuella problem och därmed förhindra tillbud och eller onödiga stopp. Då arbete ibland behöver utföras i krävande miljöer eller specifika instruktioner krävs noggrannhet, flexibilitet samt disciplin. I delar av vårt arbete gäller det att det blir rätt direkt. Man har t.ex. bara ett provföremål, då gäller det att tänka igenom sin uppgift och göra allting rätt.\n \n\nArbetstiden är normalt dagtid men andra arbetstider kan förekomma periodvis oftast i samband med olika projekt eller underhållsstopp.\n\nÄven resor i tjänsten inom och utom Sveriges gränser kan förekomma.\n\n \n\nBefattningen kräver att du genomgår och godkänns enligt var tid gällande bestämmelser för säkerhetsskydd. För befattningar där Saab har krav på säkerhetsklassinplacering kan, i förekommande fall, medföra krav på visst medborgarskap.\n \n\nI denna rekrytering sammarbetar Saab & Skill. Urval påbörjas efter semestern runt V.33. Vid frågor kontakta Frida Jakobson, Frida.Jakobsson@skill.se"
}