{
  "meta" : {
    "jobad" : {
      "description" : {
        "requirements" : null,
        "needs" : null,
        "company_information" : null,
        "text_formatted" : "Göteborgs universitet möter samhällets utmaningar med mångsidig kunskap. 56 000 studenter och 6 600 medarbetare gör universitetet till en stor och inspirerande arbetsplats. Stark forskning och attraktiva utbildningar lockar forskare och studenter från hela världen. Med ny kunskap och nya perspektiv bidrar Göteborgs universitet till en bättre framtid.\n\nCentrum för digital humaniora (CDH) söker en forskningsingenjör/utvecklare med inriktning mot simulering, visualisering och dataanalys. CDH är en dynamisk arbetsplats där alla medarbetare har goda möjligheter att påverka verksamheten. Arbetsuppgifterna är omväxlande och som forskningsingenjör ges du många möjligheter till nya ämneskunskaper och fördjupning. Du ges ett stort utrymme för personlig utveckling och egna initiativ. Vi ser fram emot att välkomna dig till vårt arbetslag – besök gärna vår webbsida https://www.gu.se/digital-humaniora och forskningsportal https://dh.gu.se/ för mer information om oss!\n\nCDH är en tvärvetenskaplig forskningsinfrastruktur som etablerades 2015. CDH är öppet för forskare, lärare och doktorander vid Göteborgs universitet såväl som vid andra svenska och internationella lärosäten, forskningsinstitutioner och kulturarvsorganisationer.\n\nFörutom sakkunskap inom flera humanistiska discipliner, besitter vi expertis inom digital teknik- och metodutveckling, datahantering och digital kunskapsteori. Mer specifika områden inkluderar: Digital text- och datautvinning, textanalys, spatiotemporal datavisualisering, 3D-visualiseringar (objekt och rumsliga sammanhang), AI och bildigenkänning, virtual- och augmented reality-simulering, agentbaserade simuleringar, modellering av historiska miljöer, kritisk digital humaniora, arkiv- och gränssnittsdesign, informationsmodellering och datahantering för humanister, nätverks- och klusteranalys samt statistisk analys för humanister.  \n\nCDH erbjuder en öppen och dynamisk forskningsmiljö som gör det möjligt för våra användare att kombinera traditionella och nya metoder och interagera med andra discipliner. Vi erbjuder forskare och andra anställda metodstöd, utbildning i bland annat programmering, datahantering, digital textanalys och geografiska informationssystem (GIS) genom kurser och handledning, seminarieserier och workshops. Vi är också en mötesplats för kontakt och samarbeten mellan akademi och aktörer inom kulturarvssektorn och andra externa aktörer.  \n\n \n\nÄmne\nSimulering, datavisualisering, data science, maskininlärning, arkeologi, digital humaniora, digitalt kulturarv. \n\n \n\nArbetsuppgifter \nDen sökande ska bidra med kompetens inom simulering, visualisering och datahantering i forskningsprogrammet Maritime Encounters (finansierat av Riksbankens Jubileumsfond). I projektet fokuserar ett internationellt tvärvetenskapligt team på havets betydelse för långväga kontakter och utveckling av kulturer. För mer information om forskningsprogrammet: https://www.gu.se/forskning/maritima-moten \n\nArbetsuppgifterna består dels av att vidareutveckla ett verktyg (https://voyager.dh.gu.se/) för agentbaserad simulering av havsrutter i tid och rum. Dels består arbetsuppgifterna av att analysera data samt visualisera och kommunicera resultat tillsammans med forskare. Den sökande förväntas också delta i Centrum för digital humanioras utveckling och stärka befintliga infrastrukturer för forskning på digitalt kulturarv. Tjänsten omfattar att arbeta i en internationell, kreativ och tvärvetenskaplig forskningsmiljö med regelbundna möten, workshops och seminarier.   \n\nTjänsten innebär många möjligheter till nya ämneskunskaper och fördjupning, och ett stort utrymme för personlig utveckling och egna initiativ. \n\n \n\nFör övrig information, kvalifikationer och behörighetskrav och för att söka tjänsten se den fullständiga annonsen på www.gu.se\n\n\nUniversitetet arbetar aktivt för en arbetsmiljö med jämställda förhållanden och sätter värde på de kvalitéer mångfald tillför verksamheten. \n\nUniversitetet tillämpar individuell lönesättning. \n\nEnligt Riksarkivets föreskrifter är universitetet skyldigt att förvara ansökningshandlingar i två år efter tillsättningsbeslutet. Om du som sökande till en anställning särskilt begär tillbaka dina handlingar återsänds de när de två åren har förflutit, i annat fall kommer de att gallras ut. \n\nTill bemannings- och rekryteringsföretag och till dig som är försäljare: Göteborgs universitet anlitar upphandlad annonsbyrå i samband med rekrytering av personal. Vi undanber oss vänligen men bestämt direktkontakt med bemannings- och rekryteringsföretag samt försäljare av jobbannonser.",
        "conditions" : "Heltid/\r\nEj specificerat",
        "text" : "Göteborgs universitet möter samhällets utmaningar med mångsidig kunskap. 56 000 studenter och 6 600 medarbetare gör universitetet till en stor och inspirerande arbetsplats. Stark forskning och attraktiva utbildningar lockar forskare och studenter från hela världen. Med ny kunskap och nya perspektiv bidrar Göteborgs universitet till en bättre framtid.\n\nCentrum för digital humaniora (CDH) söker en forskningsingenjör/utvecklare med inriktning mot simulering, visualisering och dataanalys. CDH är en dynamisk arbetsplats där alla medarbetare har goda möjligheter att påverka verksamheten. Arbetsuppgifterna är omväxlande och som forskningsingenjör ges du många möjligheter till nya ämneskunskaper och fördjupning. Du ges ett stort utrymme för personlig utveckling och egna initiativ. Vi ser fram emot att välkomna dig till vårt arbetslag – besök gärna vår webbsida https://www.gu.se/digital-humaniora och forskningsportal https://dh.gu.se/ för mer information om oss!\n\nCDH är en tvärvetenskaplig forskningsinfrastruktur som etablerades 2015. CDH är öppet för forskare, lärare och doktorander vid Göteborgs universitet såväl som vid andra svenska och internationella lärosäten, forskningsinstitutioner och kulturarvsorganisationer.\n\nFörutom sakkunskap inom flera humanistiska discipliner, besitter vi expertis inom digital teknik- och metodutveckling, datahantering och digital kunskapsteori. Mer specifika områden inkluderar: Digital text- och datautvinning, textanalys, spatiotemporal datavisualisering, 3D-visualiseringar (objekt och rumsliga sammanhang), AI och bildigenkänning, virtual- och augmented reality-simulering, agentbaserade simuleringar, modellering av historiska miljöer, kritisk digital humaniora, arkiv- och gränssnittsdesign, informationsmodellering och datahantering för humanister, nätverks- och klusteranalys samt statistisk analys för humanister.  \n\nCDH erbjuder en öppen och dynamisk forskningsmiljö som gör det möjligt för våra användare att kombinera traditionella och nya metoder och interagera med andra discipliner. Vi erbjuder forskare och andra anställda metodstöd, utbildning i bland annat programmering, datahantering, digital textanalys och geografiska informationssystem (GIS) genom kurser och handledning, seminarieserier och workshops. Vi är också en mötesplats för kontakt och samarbeten mellan akademi och aktörer inom kulturarvssektorn och andra externa aktörer.  \n\n \n\nÄmne\nSimulering, datavisualisering, data science, maskininlärning, arkeologi, digital humaniora, digitalt kulturarv. \n\n \n\nArbetsuppgifter \nDen sökande ska bidra med kompetens inom simulering, visualisering och datahantering i forskningsprogrammet Maritime Encounters (finansierat av Riksbankens Jubileumsfond). I projektet fokuserar ett internationellt tvärvetenskapligt team på havets betydelse för långväga kontakter och utveckling av kulturer. För mer information om forskningsprogrammet: https://www.gu.se/forskning/maritima-moten \n\nArbetsuppgifterna består dels av att vidareutveckla ett verktyg (https://voyager.dh.gu.se/) för agentbaserad simulering av havsrutter i tid och rum. Dels består arbetsuppgifterna av att analysera data samt visualisera och kommunicera resultat tillsammans med forskare. Den sökande förväntas också delta i Centrum för digital humanioras utveckling och stärka befintliga infrastrukturer för forskning på digitalt kulturarv. Tjänsten omfattar att arbeta i en internationell, kreativ och tvärvetenskaplig forskningsmiljö med regelbundna möten, workshops och seminarier.   \n\nTjänsten innebär många möjligheter till nya ämneskunskaper och fördjupning, och ett stort utrymme för personlig utveckling och egna initiativ. \n\n \n\nFör övrig information, kvalifikationer och behörighetskrav och för att söka tjänsten se den fullständiga annonsen på www.gu.se\n\n\nUniversitetet arbetar aktivt för en arbetsmiljö med jämställda förhållanden och sätter värde på de kvalitéer mångfald tillför verksamheten. \n\nUniversitetet tillämpar individuell lönesättning. \n\nEnligt Riksarkivets föreskrifter är universitetet skyldigt att förvara ansökningshandlingar i två år efter tillsättningsbeslutet. Om du som sökande till en anställning särskilt begär tillbaka dina handlingar återsänds de när de två åren har förflutit, i annat fall kommer de att gallras ut. \n\nTill bemannings- och rekryteringsföretag och till dig som är försäljare: Göteborgs universitet anlitar upphandlad annonsbyrå i samband med rekrytering av personal. Vi undanber oss vänligen men bestämt direktkontakt med bemannings- och rekryteringsföretag samt försäljare av jobbannonser."
      },
      "headline" : "Forskningsingenjör (utvecklare) med inriktning mot simulering, visuali",
      "driving_license" : null,
      "employer" : {
        "email" : null,
        "phone_number" : null,
        "organization_number" : "2021003153",
        "name" : "Göteborgs Universitet",
        "url" : "http://www.gu.se/",
        "workplace" : "Göteborgs universitet"
      },
      "removed_date" : null,
      "logo_url" : "https://www.arbetsformedlingen.se/rest/arbetsgivare/rest/af/v3/organisation/2021003153/logotyper/logo.png",
      "last_publication_date" : "2022-08-15T23:59:59",
      "number_of_vacancies" : 1,
      "occupation" : {
        "concept_id" : "7pWL_NSY_Sap",
        "label" : "Forskningsingenjör, maskin",
        "legacy_ams_taxonomy_id" : "353"
      },
      "occupation_group" : {
        "concept_id" : "PRQn_9yw_NJA",
        "label" : "Civilingenjörsyrken inom maskinteknik",
        "legacy_ams_taxonomy_id" : "2144"
      },
      "employment_type" : {
        "concept_id" : "PFZr_Syz_cUq",
        "label" : "Vanlig anställning",
        "legacy_ams_taxonomy_id" : "1"
      },
      "webpage_url" : "https://arbetsformedlingen.se/platsbanken/annonser/26324486",
      "driving_license_required" : false,
      "application_contacts" : [ ],
      "duration" : {
        "concept_id" : "a7uU_j21_mkL",
        "label" : "Tills vidare",
        "legacy_ams_taxonomy_id" : "1"
      },
      "nice_to_have" : {
        "education_level" : [ ],
        "work_experiences" : [ ],
        "skills" : [ ],
        "education" : [ ],
        "languages" : [ ]
      },
      "application_details" : {
        "via_af" : false,
        "email" : null,
        "other" : null,
        "reference" : null,
        "url" : "https://web103.reachmee.com/ext/I005/1035/main?site=6&lang=SE&validator=3038fcf1516ea1184a6da70a891f87da&rmpage=job&rmjob=26754",
        "information" : null
      },
      "source_type" : "VIA_PLATSBANKEN_DXA",
      "application_deadline" : "2022-08-15T23:59:59",
      "external_id" : "46-202100-3153-26754",
      "workplace_address" : {
        "coordinates" : [ 11.97456, 57.70887 ],
        "city" : null,
        "postcode" : null,
        "municipality" : "Göteborg",
        "region_concept_id" : "zdoY_6u5_Krt",
        "region" : "Västra Götalands län",
        "country_code" : "199",
        "region_code" : "14",
        "municipality_concept_id" : "PVZL_BQT_XtL",
        "country_concept_id" : "i46j_HmG_v64",
        "municipality_code" : "1480",
        "street_address" : null,
        "country" : "Sverige"
      },
      "id" : "26324486",
      "experience_required" : true,
      "working_hours_type" : {
        "concept_id" : "6YE1_gAC_R2G",
        "label" : "Heltid",
        "legacy_ams_taxonomy_id" : "1"
      },
      "access" : null,
      "timestamp" : 1657717928078,
      "must_have" : {
        "education_level" : [ ],
        "work_experiences" : [ {
          "concept_id" : "7pWL_NSY_Sap",
          "weight" : 10,
          "label" : "Forskningsingenjör, maskin",
          "legacy_ams_taxonomy_id" : "353"
        } ],
        "skills" : [ ],
        "education" : [ ],
        "languages" : [ ]
      },
      "occupation_field" : {
        "concept_id" : "6Hq3_tKo_V57",
        "label" : "Yrken med teknisk inriktning",
        "legacy_ams_taxonomy_id" : "18"
      },
      "scope_of_work" : {
        "min" : 100,
        "max" : 100
      },
      "salary_type" : {
        "concept_id" : "oG8G_9cW_nRf",
        "label" : "Fast månads- vecko- eller timlön",
        "legacy_ams_taxonomy_id" : "1"
      },
      "removed" : false,
      "salary_description" : "Göteborgs universitet tillämpar individuell lönesättning",
      "access_to_own_car" : false,
      "publication_date" : "2022-07-13T15:12:08"
    },
    "name" : "Forskningsingenjör (utvecklare) med inriktning mot simulering, visuali",
    "user" : "hannes"
  },
  "sha1" : "bcb467e62aae98fd5f6e9220ffcc7becf07de9c9",
  "annotations" : [ {
    "preferred-label" : "forskningsingenjör",
    "type" : "esco-occupation",
    "start-position" : 0,
    "end-position" : 18,
    "concept-id" : "kPr4_vVD_esk",
    "matched-string" : "Forskningsingenjör",
    "annotation-id" : 24
  }, {
    "preferred-label" : "Humaniora, allmän utbildning",
    "type" : "sun-education-field-4",
    "start-position" : 445,
    "end-position" : 454,
    "concept-id" : "cbDD_fBj_sFS",
    "matched-string" : "humaniora",
    "annotation-id" : 25
  }, {
    "preferred-label" : "forskningsingenjör",
    "type" : "esco-occupation",
    "start-position" : 470,
    "end-position" : 488,
    "concept-id" : "kPr4_vVD_esk",
    "matched-string" : "forskningsingenjör",
    "annotation-id" : 26
  }, {
    "preferred-label" : "Dataanalys",
    "sentiment" : "MUST_HAVE",
    "type" : "skill",
    "start-position" : 549,
    "end-position" : 559,
    "concept-id" : "5Gmv_EZs_BPe",
    "matched-string" : "dataanalys",
    "annotation-id" : 1
  }, {
    "preferred-label" : "forskningsingenjör",
    "type" : "esco-occupation",
    "start-position" : 700,
    "end-position" : 718,
    "concept-id" : "kPr4_vVD_esk",
    "matched-string" : "forskningsingenjör",
    "annotation-id" : 27
  }, {
    "preferred-label" : "personlig utveckling",
    "sentiment" : "MUST_HAVE",
    "type" : "esco-skill",
    "start-position" : 814,
    "end-position" : 834,
    "concept-id" : "wkQj_Dah_2GD",
    "matched-string" : "personlig utveckling",
    "annotation-id" : 2
  }, {
    "preferred-label" : "Doktorander",
    "sentiment" : "MUST_HAVE",
    "type" : "ssyk-level-4",
    "start-position" : 1151,
    "end-position" : 1162,
    "concept-id" : "NNK9_F1o_pK5",
    "matched-string" : "doktorander",
    "annotation-id" : 4
  }, {
    "preferred-label" : "Svenska",
    "sentiment" : "MUST_HAVE",
    "type" : "language",
    "start-position" : 1209,
    "end-position" : 1216,
    "concept-id" : "zSLA_vw2_FXN",
    "matched-string" : "svenska",
    "annotation-id" : 5
  }, {
    "preferred-label" : "datautvinning",
    "type" : "esco-skill",
    "start-position" : 1515,
    "end-position" : 1528,
    "concept-id" : "DA6d_Ww2_q3T",
    "matched-string" : "datautvinning",
    "annotation-id" : 28
  }, {
    "preferred-label" : "Textanalys",
    "sentiment" : "MUST_HAVE",
    "type" : "skill",
    "start-position" : 1530,
    "end-position" : 1540,
    "concept-id" : "xBPm_pm2_s95",
    "matched-string" : "textanalys",
    "annotation-id" : 6
  }, {
    "preferred-label" : "3d-visualiserare",
    "type" : "keyword",
    "start-position" : 1576,
    "end-position" : 1594,
    "concept-id" : "dwck_5Tf_yYy",
    "matched-string" : "3D-visualiseringar",
    "annotation-id" : 29
  }, {
    "preferred-label" : "Artificial Intelligence/Artificiell intelligens/AI",
    "sentiment" : "MUST_HAVE",
    "type" : "skill",
    "start-position" : 1629,
    "end-position" : 1631,
    "concept-id" : "SaTd_K5z_ex1",
    "matched-string" : "ai",
    "annotation-id" : 7
  }, {
    "preferred-label" : "Virtual reality/VR",
    "type" : "skill",
    "start-position" : 1653,
    "end-position" : 1660,
    "concept-id" : "NfDv_1zP_NsD",
    "matched-string" : "virtual",
    "annotation-id" : 30
  }, {
    "preferred-label" : "Augmented reality/AR",
    "sentiment" : "MUST_HAVE",
    "type" : "skill",
    "start-position" : 1666,
    "end-position" : 1683,
    "concept-id" : "hY1R_jKB_zNr",
    "matched-string" : "augmented reality",
    "annotation-id" : 8
  }, {
    "preferred-label" : "Informationsmodellering",
    "sentiment" : "MUST_HAVE",
    "type" : "skill",
    "start-position" : 1816,
    "end-position" : 1839,
    "concept-id" : "5JuE_fKM_Bqn",
    "matched-string" : "informationsmodellering",
    "annotation-id" : 10
  }, {
    "preferred-label" : "Programmering",
    "sentiment" : "MUST_HAVE",
    "type" : "skill",
    "start-position" : 2193,
    "end-position" : 2206,
    "concept-id" : "iUew_moc_BRk",
    "matched-string" : "programmering",
    "annotation-id" : 11
  }, {
    "preferred-label" : "Textanalys",
    "sentiment" : "MUST_HAVE",
    "type" : "skill",
    "start-position" : 2231,
    "end-position" : 2241,
    "concept-id" : "xBPm_pm2_s95",
    "matched-string" : "textanalys",
    "annotation-id" : 12
  }, {
    "preferred-label" : "Informationssystem",
    "sentiment" : "MUST_HAVE",
    "type" : "keyword",
    "start-position" : 2258,
    "end-position" : 2276,
    "concept-id" : "qd4t_Uom_HpT",
    "matched-string" : "informationssystem",
    "annotation-id" : 13
  }, {
    "preferred-label" : "Geografiskt informationssystem/GIS",
    "sentiment" : "MUST_HAVE",
    "type" : "skill",
    "start-position" : 2278,
    "end-position" : 2281,
    "concept-id" : "CWfM_RL9_V4t",
    "matched-string" : "gis",
    "annotation-id" : 14
  }, {
    "preferred-label" : "Machine learning/Maskininlärning",
    "sentiment" : "MUST_HAVE",
    "type" : "skill",
    "start-position" : 2530,
    "end-position" : 2545,
    "concept-id" : "XEhm_7YA_qKM",
    "matched-string" : "maskininlärning",
    "annotation-id" : 16
  }, {
    "preferred-label" : "Arkeologi",
    "sentiment" : "MUST_HAVE",
    "type" : "keyword",
    "start-position" : 2547,
    "end-position" : 2556,
    "concept-id" : "zgrV_Scj_4DA",
    "matched-string" : "arkeologi",
    "annotation-id" : 17
  }, {
    "preferred-label" : "Data/IT",
    "sentiment" : "MUST_HAVE",
    "type" : "occupation-field",
    "start-position" : 3213,
    "end-position" : 3217,
    "concept-id" : "apaJ_2ja_LuF",
    "matched-string" : "data",
    "annotation-id" : 20
  }, {
    "preferred-label" : "personlig utveckling",
    "sentiment" : "MUST_HAVE",
    "type" : "esco-skill",
    "start-position" : 3689,
    "end-position" : 3709,
    "concept-id" : "wkQj_Dah_2GD",
    "matched-string" : "personlig utveckling",
    "annotation-id" : 21
  }, {
    "preferred-label" : "arbetsmiljö",
    "sentiment" : "MUST_HAVE",
    "type" : "esco-skill",
    "start-position" : 3900,
    "end-position" : 3911,
    "concept-id" : "zdQY_QJh_nUH",
    "matched-string" : "arbetsmiljö",
    "annotation-id" : 22
  } ],
  "text" : "Forskningsingenjör (utvecklare) med inriktning mot simulering, visuali\nGöteborgs universitet möter samhällets utmaningar med mångsidig kunskap. 56 000 studenter och 6 600 medarbetare gör universitetet till en stor och inspirerande arbetsplats. Stark forskning och attraktiva utbildningar lockar forskare och studenter från hela världen. Med ny kunskap och nya perspektiv bidrar Göteborgs universitet till en bättre framtid.\n\nCentrum för digital humaniora (CDH) söker en forskningsingenjör/utvecklare med inriktning mot simulering, visualisering och dataanalys. CDH är en dynamisk arbetsplats där alla medarbetare har goda möjligheter att påverka verksamheten. Arbetsuppgifterna är omväxlande och som forskningsingenjör ges du många möjligheter till nya ämneskunskaper och fördjupning. Du ges ett stort utrymme för personlig utveckling och egna initiativ. Vi ser fram emot att välkomna dig till vårt arbetslag – besök gärna vår webbsida https://www.gu.se/digital-humaniora och forskningsportal https://dh.gu.se/ för mer information om oss!\n\nCDH är en tvärvetenskaplig forskningsinfrastruktur som etablerades 2015. CDH är öppet för forskare, lärare och doktorander vid Göteborgs universitet såväl som vid andra svenska och internationella lärosäten, forskningsinstitutioner och kulturarvsorganisationer.\n\nFörutom sakkunskap inom flera humanistiska discipliner, besitter vi expertis inom digital teknik- och metodutveckling, datahantering och digital kunskapsteori. Mer specifika områden inkluderar: Digital text- och datautvinning, textanalys, spatiotemporal datavisualisering, 3D-visualiseringar (objekt och rumsliga sammanhang), AI och bildigenkänning, virtual- och augmented reality-simulering, agentbaserade simuleringar, modellering av historiska miljöer, kritisk digital humaniora, arkiv- och gränssnittsdesign, informationsmodellering och datahantering för humanister, nätverks- och klusteranalys samt statistisk analys för humanister.  \n\nCDH erbjuder en öppen och dynamisk forskningsmiljö som gör det möjligt för våra användare att kombinera traditionella och nya metoder och interagera med andra discipliner. Vi erbjuder forskare och andra anställda metodstöd, utbildning i bland annat programmering, datahantering, digital textanalys och geografiska informationssystem (GIS) genom kurser och handledning, seminarieserier och workshops. Vi är också en mötesplats för kontakt och samarbeten mellan akademi och aktörer inom kulturarvssektorn och andra externa aktörer.  \n\n \n\nÄmne\nSimulering, datavisualisering, data science, maskininlärning, arkeologi, digital humaniora, digitalt kulturarv. \n\n \n\nArbetsuppgifter \nDen sökande ska bidra med kompetens inom simulering, visualisering och datahantering i forskningsprogrammet Maritime Encounters (finansierat av Riksbankens Jubileumsfond). I projektet fokuserar ett internationellt tvärvetenskapligt team på havets betydelse för långväga kontakter och utveckling av kulturer. För mer information om forskningsprogrammet: https://www.gu.se/forskning/maritima-moten \n\nArbetsuppgifterna består dels av att vidareutveckla ett verktyg (https://voyager.dh.gu.se/) för agentbaserad simulering av havsrutter i tid och rum. Dels består arbetsuppgifterna av att analysera data samt visualisera och kommunicera resultat tillsammans med forskare. Den sökande förväntas också delta i Centrum för digital humanioras utveckling och stärka befintliga infrastrukturer för forskning på digitalt kulturarv. Tjänsten omfattar att arbeta i en internationell, kreativ och tvärvetenskaplig forskningsmiljö med regelbundna möten, workshops och seminarier.   \n\nTjänsten innebär många möjligheter till nya ämneskunskaper och fördjupning, och ett stort utrymme för personlig utveckling och egna initiativ. \n\n \n\nFör övrig information, kvalifikationer och behörighetskrav och för att söka tjänsten se den fullständiga annonsen på www.gu.se\n\n\nUniversitetet arbetar aktivt för en arbetsmiljö med jämställda förhållanden och sätter värde på de kvalitéer mångfald tillför verksamheten. \n\nUniversitetet tillämpar individuell lönesättning. \n\nEnligt Riksarkivets föreskrifter är universitetet skyldigt att förvara ansökningshandlingar i två år efter tillsättningsbeslutet. Om du som sökande till en anställning särskilt begär tillbaka dina handlingar återsänds de när de två åren har förflutit, i annat fall kommer de att gallras ut. \n\nTill bemannings- och rekryteringsföretag och till dig som är försäljare: Göteborgs universitet anlitar upphandlad annonsbyrå i samband med rekrytering av personal. Vi undanber oss vänligen men bestämt direktkontakt med bemannings- och rekryteringsföretag samt försäljare av jobbannonser."
}