{
  "meta" : {
    "jobad" : {
      "description" : {
        "requirements" : null,
        "needs" : null,
        "company_information" : null,
        "text_formatted" : "<p>Nu har ni en unik möjlighet att arbeta på Mekopartner som är partner till Mekonomen bilverkstad . Vi söker en Bilrekonditionerare som kan få fastanställning efter provanställning. Hör av er på mejl        norremark@mekopartner.se          eller   ring        0762881848</p>",
        "conditions" : null,
        "text" : "Nu har ni en unik möjlighet att arbeta på Mekopartner som är partner till Mekonomen bilverkstad . Vi söker en Bilrekonditionerare som kan få fastanställning efter provanställning. Hör av er på mejl        norremark@mekopartner.se          eller   ring        0762881848"
      },
      "headline" : "Bilrekonditionerare",
      "driving_license" : null,
      "employer" : {
        "email" : null,
        "phone_number" : null,
        "organization_number" : "5592728769",
        "name" : "Mekoexpertens Växjö AB",
        "url" : null,
        "workplace" : "Mekoexpertens Växjö AB"
      },
      "removed_date" : null,
      "logo_url" : null,
      "last_publication_date" : "2022-08-31T00:00:00",
      "number_of_vacancies" : 1,
      "occupation" : {
        "concept_id" : "gP3r_Q2H_ht9",
        "label" : "Bilrekonditionerare",
        "legacy_ams_taxonomy_id" : "396"
      },
      "occupation_group" : {
        "concept_id" : "FjdF_H2e_tAG",
        "label" : "Bilrekonditionerare, fönsterputsare m.fl.",
        "legacy_ams_taxonomy_id" : "9120"
      },
      "employment_type" : {
        "concept_id" : "PFZr_Syz_cUq",
        "label" : "Vanlig anställning",
        "legacy_ams_taxonomy_id" : "1"
      },
      "webpage_url" : "https://arbetsformedlingen.se/platsbanken/annonser/26322483",
      "driving_license_required" : false,
      "application_contacts" : [ ],
      "duration" : {
        "concept_id" : "a7uU_j21_mkL",
        "label" : "Tills vidare",
        "legacy_ams_taxonomy_id" : "1"
      },
      "nice_to_have" : {
        "education_level" : [ ],
        "work_experiences" : [ {
          "concept_id" : "gP3r_Q2H_ht9",
          "weight" : 5,
          "label" : "Bilrekonditionerare",
          "legacy_ams_taxonomy_id" : "396"
        } ],
        "skills" : [ ],
        "education" : [ ],
        "languages" : [ ]
      },
      "application_details" : {
        "via_af" : false,
        "email" : "norremark@mekopartner.se",
        "other" : null,
        "reference" : null,
        "url" : null,
        "information" : null
      },
      "source_type" : "VIA_ANNONSERA",
      "application_deadline" : "2022-08-31T00:00:00",
      "external_id" : null,
      "workplace_address" : {
        "coordinates" : [ 14.825948530345991, 56.899420936524194 ],
        "city" : "Växjö",
        "postcode" : "35245",
        "municipality" : "Växjö",
        "region_concept_id" : "tF3y_MF9_h5G",
        "region" : "Kronobergs län",
        "country_code" : "199",
        "region_code" : "07",
        "municipality_concept_id" : "mmot_H3A_auW",
        "country_concept_id" : "i46j_HmG_v64",
        "municipality_code" : "0780",
        "street_address" : "Erik Norbergs Väg 5",
        "country" : "Sverige"
      },
      "id" : "26322483",
      "experience_required" : true,
      "working_hours_type" : {
        "concept_id" : "6YE1_gAC_R2G",
        "label" : "Heltid",
        "legacy_ams_taxonomy_id" : "1"
      },
      "access" : null,
      "timestamp" : 1657699240272,
      "must_have" : {
        "education_level" : [ ],
        "work_experiences" : [ ],
        "skills" : [ ],
        "education" : [ ],
        "languages" : [ ]
      },
      "occupation_field" : {
        "concept_id" : "whao_Q6A_ScE",
        "label" : "Sanering och renhållning",
        "legacy_ams_taxonomy_id" : "12"
      },
      "scope_of_work" : {
        "min" : 0,
        "max" : 100
      },
      "salary_type" : {
        "concept_id" : "oG8G_9cW_nRf",
        "label" : "Fast månads- vecko- eller timlön",
        "legacy_ams_taxonomy_id" : "1"
      },
      "removed" : false,
      "salary_description" : null,
      "access_to_own_car" : false,
      "publication_date" : "2022-07-13T10:00:40"
    },
    "name" : "Bilrekonditionerare",
    "user" : "kristof.fischer"
  },
  "sha1" : "d0a6d172c4a3cc49c4b4d209440b72f7d360821e",
  "annotations" : [ {
    "preferred-label" : "Bilrekonditionerare",
    "sentiment" : "MUST_HAVE",
    "type" : "occupation-name",
    "start-position" : 0,
    "end-position" : 19,
    "concept-id" : "gP3r_Q2H_ht9",
    "matched-string" : "bilrekonditionerare",
    "annotation-id" : 0
  }, {
    "preferred-label" : "Bilrekonditionerare",
    "sentiment" : "MUST_HAVE",
    "type" : "occupation-name",
    "start-position" : 130,
    "end-position" : 149,
    "concept-id" : "gP3r_Q2H_ht9",
    "matched-string" : "bilrekonditionerare",
    "annotation-id" : 1
  }, {
    "preferred-label" : "Vanlig anställning",
    "type" : "employment-type",
    "start-position" : 161,
    "end-position" : 176,
    "concept-id" : "PFZr_Syz_cUq",
    "matched-string" : "fastanställning",
    "annotation-id" : 2
  } ],
  "text" : "Bilrekonditionerare\nNu har ni en unik möjlighet att arbeta på Mekopartner som är partner till Mekonomen bilverkstad . Vi söker en Bilrekonditionerare som kan få fastanställning efter provanställning. Hör av er på mejl        norremark@mekopartner.se          eller   ring        0762881848"
}