{
  "meta" : {
    "jobad" : {
      "description" : {
        "requirements" : null,
        "needs" : null,
        "company_information" : null,
        "text_formatted" : "<p>Hej</p><p>Vi behöver en Turkiska kock med Ala carte rätter</p><p>är du intresserad ring eller emaila för mer info.</p><p><br></p>",
        "conditions" : null,
        "text" : "Hej\nVi behöver en Turkiska kock med Ala carte rätter\när du intresserad ring eller emaila för mer info."
      },
      "headline" : "Ala carte kock",
      "driving_license" : null,
      "employer" : {
        "email" : null,
        "phone_number" : null,
        "organization_number" : null,
        "name" : "Hassan, Jan Abdulljabar",
        "url" : null,
        "workplace" : "Hassan Jan Abdulljabar"
      },
      "removed_date" : null,
      "logo_url" : null,
      "last_publication_date" : "2022-08-31T00:00:00",
      "number_of_vacancies" : 1,
      "occupation" : {
        "concept_id" : "oRB5_b7i_Qzv",
        "label" : "Köksbiträde",
        "legacy_ams_taxonomy_id" : "483"
      },
      "occupation_group" : {
        "concept_id" : "tPox_ie4_X9X",
        "label" : "Restaurang- och köksbiträden m.fl.",
        "legacy_ams_taxonomy_id" : "9412"
      },
      "employment_type" : {
        "concept_id" : "PFZr_Syz_cUq",
        "label" : "Vanlig anställning",
        "legacy_ams_taxonomy_id" : "1"
      },
      "webpage_url" : "https://arbetsformedlingen.se/platsbanken/annonser/26368188",
      "driving_license_required" : false,
      "application_contacts" : [ ],
      "duration" : {
        "concept_id" : "a7uU_j21_mkL",
        "label" : "Tills vidare",
        "legacy_ams_taxonomy_id" : "1"
      },
      "nice_to_have" : {
        "education_level" : [ ],
        "work_experiences" : [ {
          "concept_id" : "oRB5_b7i_Qzv",
          "weight" : 5,
          "label" : "Köksbiträde",
          "legacy_ams_taxonomy_id" : "483"
        } ],
        "skills" : [ ],
        "education" : [ ],
        "languages" : [ ]
      },
      "application_details" : {
        "via_af" : false,
        "email" : "janhssan@incloud.com",
        "other" : null,
        "reference" : null,
        "url" : null,
        "information" : null
      },
      "source_type" : "VIA_ANNONSERA",
      "application_deadline" : "2022-08-31T00:00:00",
      "external_id" : null,
      "workplace_address" : {
        "coordinates" : [ 17.16221613263027, 60.67365649219153 ],
        "city" : "Gävle",
        "postcode" : "80284",
        "municipality" : "Gävle",
        "region_concept_id" : "zupA_8Nt_xcD",
        "region" : "Gävleborgs län",
        "country_code" : "199",
        "region_code" : "21",
        "municipality_concept_id" : "qk8Y_2b6_82D",
        "country_concept_id" : "i46j_HmG_v64",
        "municipality_code" : "2180",
        "street_address" : "Första Tvärgatan 18",
        "country" : "Sverige"
      },
      "id" : "26368188",
      "experience_required" : true,
      "working_hours_type" : {
        "concept_id" : "6YE1_gAC_R2G",
        "label" : "Heltid",
        "legacy_ams_taxonomy_id" : "1"
      },
      "access" : null,
      "timestamp" : 1659355410293,
      "must_have" : {
        "education_level" : [ ],
        "work_experiences" : [ ],
        "skills" : [ ],
        "education" : [ ],
        "languages" : [ ]
      },
      "occupation_field" : {
        "concept_id" : "ScKy_FHB_7wT",
        "label" : "Hotell, restaurang, storhushåll",
        "legacy_ams_taxonomy_id" : "7"
      },
      "scope_of_work" : {
        "min" : 0,
        "max" : 100
      },
      "salary_type" : {
        "concept_id" : "oG8G_9cW_nRf",
        "label" : "Fast månads- vecko- eller timlön",
        "legacy_ams_taxonomy_id" : "1"
      },
      "removed" : false,
      "salary_description" : null,
      "access_to_own_car" : false,
      "publication_date" : "2022-08-01T14:03:30"
    },
    "name" : "Ala carte kock",
    "user" : "hannes"
  },
  "sha1" : "237498055d8f41b36f9dd657004250efbc5aa899",
  "annotations" : [ {
    "preferred-label" : "À la carte kock",
    "type" : "keyword",
    "start-position" : 0,
    "end-position" : 14,
    "concept-id" : "HDtc_qrc_esL",
    "matched-string" : "Ala carte kock",
    "annotation-id" : 3
  }, {
    "preferred-label" : "Turkiskt kök",
    "sentiment" : "MUST_HAVE",
    "type" : "skill",
    "start-position" : 33,
    "end-position" : 41,
    "concept-id" : "hpHC_KHL_su1",
    "matched-string" : "turkiska",
    "annotation-id" : 1
  }, {
    "preferred-label" : "kock",
    "sentiment" : "MUST_HAVE",
    "type" : "esco-occupation",
    "start-position" : 42,
    "end-position" : 46,
    "concept-id" : "Ti2H_QoQ_EMX",
    "matched-string" : "kock",
    "annotation-id" : 2
  }, {
    "preferred-label" : "A la carte",
    "type" : "skill",
    "start-position" : 51,
    "end-position" : 60,
    "concept-id" : "Bb4Q_Vou_pbq",
    "matched-string" : "Ala carte",
    "annotation-id" : 4
  } ],
  "text" : "Ala carte kock\nHej\nVi behöver en Turkiska kock med Ala carte rätter\när du intresserad ring eller emaila för mer info."
}