{
  "meta" : {
    "jobad" : {
      "description" : {
        "requirements" : null,
        "needs" : null,
        "company_information" : null,
        "text_formatted" : "<p>Byabani Bygg AB är en byggentreprenör med fokus på reparation och renovering av fastigheter och lägenheter för privatpersoner.</p><p>Nu söker vi plattsättare och snickare för en anställning i företaget. Minst ett års erfarenhet krävs. B-körkort är ett krav.</p><p>Dina arbetsuppgifter:</p><p>Du kommer att arbeta med alla förekommande arbetsuppgifter inom tillbyggnader och renovering. Arbetsområdet är främst i Skåne.</p><p>Vi erbjuder dig ett varierat jobb i ett nytt företag med en växande kundkrets.</p><p>Din bakgrund/Dina egenskaper:</p><p>Vi söker personer med ett stort intresse för bygg, där vi uppskattar en bred kompetens inom området men specifik kunskap om plattsättning och/eller snickeri.</p><p>Som person är du självgående och du är också social och fungerar bra med våra kunder. Du är bra på att planera och ta ansvar för din arbetsdag.</p><p>Vi ser gärna att du har arbetslivserfarenhet av liknande arbetsuppgifter. Yrkesbevis är inte ett krav till denna tjänst, men ses som meriterande.</p><p>Anställningen är inledningsvis en provanställning men om det fungerar bra vill vi gärna gå över till en tillsvidareanställning.</p><p>Välkommen med din ansökan. Sista ansökningsdag är den 10 augusti.</p><p>Vi tar emot din ansökan via e-post info@byabanibygg.se. Vid frågor är du välkommen att ta kontakt med Sven Tariq Jakobsen på 076-1899072</p>",
        "conditions" : null,
        "text" : "Byabani Bygg AB är en byggentreprenör med fokus på reparation och renovering av fastigheter och lägenheter för privatpersoner.\nNu söker vi plattsättare och snickare för en anställning i företaget. Minst ett års erfarenhet krävs. B-körkort är ett krav.\nDina arbetsuppgifter:\nDu kommer att arbeta med alla förekommande arbetsuppgifter inom tillbyggnader och renovering. Arbetsområdet är främst i Skåne.\nVi erbjuder dig ett varierat jobb i ett nytt företag med en växande kundkrets.\nDin bakgrund/Dina egenskaper:\nVi söker personer med ett stort intresse för bygg, där vi uppskattar en bred kompetens inom området men specifik kunskap om plattsättning och/eller snickeri.\nSom person är du självgående och du är också social och fungerar bra med våra kunder. Du är bra på att planera och ta ansvar för din arbetsdag.\nVi ser gärna att du har arbetslivserfarenhet av liknande arbetsuppgifter. Yrkesbevis är inte ett krav till denna tjänst, men ses som meriterande.\nAnställningen är inledningsvis en provanställning men om det fungerar bra vill vi gärna gå över till en tillsvidareanställning.\nVälkommen med din ansökan. Sista ansökningsdag är den 10 augusti.\nVi tar emot din ansökan via e-post info@byabanibygg.se. Vid frågor är du välkommen att ta kontakt med Sven Tariq Jakobsen på 076-1899072"
      },
      "headline" : "Plattsättare och snickare i Malmötrakten",
      "driving_license" : [ {
        "concept_id" : "VTK8_WRx_GcM",
        "label" : "B",
        "legacy_ams_taxonomy_id" : "3"
      } ],
      "employer" : {
        "email" : null,
        "phone_number" : null,
        "organization_number" : "5592530249",
        "name" : "Byabani Bygg AB",
        "url" : "www.byabanibygg.se",
        "workplace" : "Byabani Bygg AB"
      },
      "removed_date" : null,
      "logo_url" : "https://www.arbetsformedlingen.se/rest/arbetsgivare/rest/af/v3/arbetsplatser/87810809/logotyper/logo.png",
      "last_publication_date" : "2022-08-10T23:59:59",
      "number_of_vacancies" : 1,
      "occupation" : {
        "concept_id" : "Qv4e_brq_Ca5",
        "label" : "Plattsättare",
        "legacy_ams_taxonomy_id" : "6407"
      },
      "occupation_group" : {
        "concept_id" : "NnB3_eWH_auo",
        "label" : "Murare m.fl.",
        "legacy_ams_taxonomy_id" : "7112"
      },
      "employment_type" : {
        "concept_id" : "PFZr_Syz_cUq",
        "label" : "Vanlig anställning",
        "legacy_ams_taxonomy_id" : "1"
      },
      "webpage_url" : "https://arbetsformedlingen.se/platsbanken/annonser/26361397",
      "driving_license_required" : true,
      "application_contacts" : [ {
        "description" : null,
        "email" : "info@byabanibygg.se",
        "telephone" : "076-1899072",
        "name" : "Sven Tariq Jakobsen",
        "contact_type" : null
      } ],
      "duration" : {
        "concept_id" : "a7uU_j21_mkL",
        "label" : "Tills vidare",
        "legacy_ams_taxonomy_id" : "1"
      },
      "nice_to_have" : {
        "education_level" : [ ],
        "work_experiences" : [ {
          "concept_id" : "Qv4e_brq_Ca5",
          "weight" : 5,
          "label" : "Plattsättare",
          "legacy_ams_taxonomy_id" : "6407"
        } ],
        "skills" : [ ],
        "education" : [ ],
        "languages" : [ ]
      },
      "application_details" : {
        "via_af" : false,
        "email" : "info@byabanibygg.se",
        "other" : null,
        "reference" : "Ansökan byggnadsarbetare",
        "url" : null,
        "information" : null
      },
      "source_type" : "VIA_ANNONSERA",
      "application_deadline" : "2022-08-10T23:59:59",
      "external_id" : null,
      "workplace_address" : {
        "coordinates" : [ 13.075561786474879, 55.53492728837081 ],
        "city" : "Oxie",
        "postcode" : "23843",
        "municipality" : "Malmö",
        "region_concept_id" : "CaRE_1nn_cSU",
        "region" : "Skåne län",
        "country_code" : "199",
        "region_code" : "12",
        "municipality_concept_id" : "oYPt_yRA_Smm",
        "country_concept_id" : "i46j_HmG_v64",
        "municipality_code" : "1280",
        "street_address" : "Käglingevägen 122",
        "country" : "Sverige"
      },
      "id" : "26361397",
      "experience_required" : true,
      "working_hours_type" : {
        "concept_id" : "6YE1_gAC_R2G",
        "label" : "Heltid",
        "legacy_ams_taxonomy_id" : "1"
      },
      "access" : null,
      "timestamp" : 1659038305292,
      "must_have" : {
        "education_level" : [ ],
        "work_experiences" : [ ],
        "skills" : [ ],
        "education" : [ ],
        "languages" : [ ]
      },
      "occupation_field" : {
        "concept_id" : "j7Cq_ZJe_GkT",
        "label" : "Bygg och anläggning",
        "legacy_ams_taxonomy_id" : "2"
      },
      "scope_of_work" : {
        "min" : 0,
        "max" : 100
      },
      "salary_type" : {
        "concept_id" : "oG8G_9cW_nRf",
        "label" : "Fast månads- vecko- eller timlön",
        "legacy_ams_taxonomy_id" : "1"
      },
      "removed" : false,
      "salary_description" : null,
      "access_to_own_car" : false,
      "publication_date" : "2022-07-28T21:58:25"
    },
    "name" : "Plattsättare och snickare i Malmötrakten",
    "user" : "hannes"
  },
  "sha1" : "080e6227ba83db80de7ce21c56b3138df0a69cb9",
  "annotations" : [ {
    "preferred-label" : "Plattsättare",
    "sentiment" : "MUST_HAVE",
    "type" : "occupation-name",
    "start-position" : 0,
    "end-position" : 12,
    "concept-id" : "Qv4e_brq_Ca5",
    "matched-string" : "plattsättare",
    "annotation-id" : 0
  }, {
    "preferred-label" : "snickare",
    "sentiment" : "MUST_HAVE",
    "type" : "esco-occupation",
    "start-position" : 17,
    "end-position" : 25,
    "concept-id" : "qhAJ_Euo_tNx",
    "matched-string" : "snickare",
    "annotation-id" : 1
  }, {
    "preferred-label" : "Malmö",
    "type" : "municipality",
    "start-position" : 28,
    "end-position" : 40,
    "concept-id" : "oYPt_yRA_Smm",
    "matched-string" : "Malmötrakten",
    "annotation-id" : 6
  }, {
    "preferred-label" : "Plattsättare",
    "sentiment" : "MUST_HAVE",
    "type" : "occupation-name",
    "start-position" : 180,
    "end-position" : 192,
    "concept-id" : "Qv4e_brq_Ca5",
    "matched-string" : "plattsättare",
    "annotation-id" : 2
  }, {
    "preferred-label" : "snickare",
    "sentiment" : "MUST_HAVE",
    "type" : "esco-occupation",
    "start-position" : 197,
    "end-position" : 205,
    "concept-id" : "qhAJ_Euo_tNx",
    "matched-string" : "snickare",
    "annotation-id" : 3
  }, {
    "preferred-label" : "1-2 års erfarenhet",
    "type" : "occupation-experience-year",
    "start-position" : 244,
    "end-position" : 262,
    "concept-id" : "LLnd_5GJ_4ju",
    "matched-string" : "ett års erfarenhet",
    "annotation-id" : 8
  }, {
    "preferred-label" : "B",
    "type" : "driving-licence",
    "start-position" : 270,
    "end-position" : 279,
    "concept-id" : "VTK8_WRx_GcM",
    "matched-string" : "B-körkort",
    "annotation-id" : 7
  }, {
    "preferred-label" : "Skåne län",
    "type" : "region",
    "start-position" : 435,
    "end-position" : 440,
    "concept-id" : "CaRE_1nn_cSU",
    "matched-string" : "Skåne",
    "annotation-id" : 9
  }, {
    "preferred-label" : "Plattsättning",
    "sentiment" : "MUST_HAVE",
    "type" : "skill",
    "start-position" : 675,
    "end-position" : 688,
    "concept-id" : "ZzuK_jNE_XCG",
    "matched-string" : "plattsättning",
    "annotation-id" : 4
  }, {
    "preferred-label" : "arbeta självständigt",
    "type" : "esco-skill",
    "start-position" : 726,
    "end-position" : 737,
    "concept-id" : "NyFu_HHd_zhz",
    "matched-string" : "självgående",
    "annotation-id" : 10
  }, {
    "preferred-label" : "Yrkesbevis/examen",
    "sentiment" : "MUST_HAVE",
    "type" : "skill-headline",
    "start-position" : 927,
    "end-position" : 937,
    "concept-id" : "HjPN_99i_cFD",
    "matched-string" : "yrkesbevis",
    "annotation-id" : 5
  }, {
    "preferred-label" : "Tillsvidareanställning (inkl. eventuell provanställning)",
    "type" : "employment-type",
    "start-position" : 1103,
    "end-position" : 1125,
    "concept-id" : "kpPX_CNN_gDU",
    "matched-string" : "tillsvidareanställning",
    "annotation-id" : 11
  } ],
  "text" : "Plattsättare och snickare i Malmötrakten\nByabani Bygg AB är en byggentreprenör med fokus på reparation och renovering av fastigheter och lägenheter för privatpersoner.\nNu söker vi plattsättare och snickare för en anställning i företaget. Minst ett års erfarenhet krävs. B-körkort är ett krav.\nDina arbetsuppgifter:\nDu kommer att arbeta med alla förekommande arbetsuppgifter inom tillbyggnader och renovering. Arbetsområdet är främst i Skåne.\nVi erbjuder dig ett varierat jobb i ett nytt företag med en växande kundkrets.\nDin bakgrund/Dina egenskaper:\nVi söker personer med ett stort intresse för bygg, där vi uppskattar en bred kompetens inom området men specifik kunskap om plattsättning och/eller snickeri.\nSom person är du självgående och du är också social och fungerar bra med våra kunder. Du är bra på att planera och ta ansvar för din arbetsdag.\nVi ser gärna att du har arbetslivserfarenhet av liknande arbetsuppgifter. Yrkesbevis är inte ett krav till denna tjänst, men ses som meriterande.\nAnställningen är inledningsvis en provanställning men om det fungerar bra vill vi gärna gå över till en tillsvidareanställning.\nVälkommen med din ansökan. Sista ansökningsdag är den 10 augusti.\nVi tar emot din ansökan via e-post info@byabanibygg.se. Vid frågor är du välkommen att ta kontakt med Sven Tariq Jakobsen på 076-1899072"
}