{
  "meta" : {
    "jobad" : {
      "description" : {
        "requirements" : null,
        "needs" : null,
        "company_information" : null,
        "text_formatted" : "Vill du bidra till bättre affärer i Nacka? Nu har du chansen att bli en del av en kompetent, utvecklingsorienterad och effektiv inköpsavdelning!\n\n\nDitt uppdrag\n\nNu har du möjligheten att få utvecklas inom inköpsområdet tillsammans med ett härligt gäng i Nacka Kommun.\r\n\r\nNacka arbetar kategoristyrt och har flera stora, spännande upphandlingar på gång. Nu söker vi dig som vill vara med på vår utvecklingsresa för att skapa framtidens Nacka. Läs gärna mer om enheten och hur vi arbetar här: https://www.nacka.se/medarbetare/enheter/inkopsenheten/om-enheten/\n\nI rollen som inköpare arbetar du kategoribaserat och stödjs vid behov av en kategoriansvarig. Du kommer arbeta med att genomföra inköpsprojekt med olika komplexitet inom flera områden - alltid i nära samverkan med verksamheten.\n\nDu får en viktig roll för att driva inköpsprocessen samt de kommersiella aspekterna av de affärer kommunen gör i enlighet med LOU. Du jobbar projektorienterat tillsammans med ansvariga chefer, projektledare och andra medarbetare inom kommunen. I ditt uppdrag ingår;\n\n - Kravspecifikation, marknadsanalys och att driva upphandlingarna.\n - Att delta i leverans- och leverantörsuppföljningsprocesserna.\n - Utveckla affärsmässigheten och de kommersiella aspekterna ute i verksamheterna.\n\nMålet är att Nacka göra goda affärer i enlighet med LOU som bidrar till Nackas utveckling.\n\nSom inköpare blir du en del av inköpsenheten, som är ett härligt, positivt team på 18 personer med höga ambitioner. Din närmsta chef blir inköpschef Sebastian Nordgren, som har gedigen erfarenhet av inköpsverksamhet både i privat och offentlig sektor.\n\n\nÄr det här du?\n\n\nVi söker dig som har erfarenhet av att arbeta med offentliga inköp gärna i en politiskt styrd eller större organisation och som stimuleras av mångfalden i både frågeställningar och metoder för att kunna bidra till kommunens affärer och att utveckla samhället. Du har relevant akademisk utbildning och med största sannolikhet har du arbetat med inköp i minst 2-3 år i privat och/eller offentlig sektor. Du bör ha erfarenhet av att genomföra upphandlingar i enlighet med LOU. Nu har du chansen att få vara en del i att bygga och skapa framtidens Nacka.\n\nDina personliga egenskaper\nFör att lyckas ser vi gärna att du har ett genuint intresse för inköparens roll som affärspartner. Vi fäster stor vikt vid dina personliga egenskaper och söker dig som;\n\n - Är målinriktad och har hög egen drivkraft.\n - Är kommunikativ och har fallenhet för att bygga relationer.\n - Har god samarbetsförmåga.\n - Är serviceinriktad och delar med dig av din kunskap.\n\n \n\nVi erbjuder \nVi erbjuder dig att få vara med på en spännande resa, där du får möjlighet att arbeta i en bred självständig roll. I Nacka får du arbeta i en kommun som vill vara bäst i Sverige på att vara kommun, och som har öppenhet och mångfald som sin vision och en grundläggande värdering att lita på människors kunskap, vilja och förmåga.\n\nBlir du vår nya kollega så erbjuder vi dig: gym i huset, friskvårdsersättning, förmånscykelserbjudande samt möjlighet att växla semesterersättning mot fler semesterdagar. Arbetsplatsen ligger i Nacka stadshus i öppna, ljusa lokaler, granne med Nacka forum och 15 min med buss från Slussen och 20 minuter från Gustavsberg.\n\n\nIntresserad? \n\nTjänsten är en tillsvidareanställning på heltid med tillträde enligt överenskommelse. Provanställning kan komma att tillämpas.\n\nOm du vill bli en del av Nacka kommun, tveka inte att skicka in din ansökan! Vill du veta mer om tjänsten är du välkommen att kontakta mig på:\n\nsebastian.nordgren@nacka.se, 070 431 91 60 https://www.linkedin.com/in/sebastian-nordgren-189264/\n\nUrvalet kommer att ske löpande och denna tjänst kan komma att tillsättas före ansökningstidens utgång. Sista ansökningsdag är 2022-08-21.\n\n\n\n\n\nVi ser fram emot att få din ansökan!\n\n \n\nNacka är en av Sveriges mest attraktiva och välrenommerade kommuner. Med fokus på mål, resultat, hållbart medarbetarengagemang och ständig utveckling strävar Nacka efter att bli bäst på att vara kommun. Nacka kommun är arbetsgivaren för dig som med stor frihet förnyar och gör skillnad.\n\n\n\nInför rekryteringsarbetet har Nacka kommun tagit ställning till rekryteringskanaler och marknadsföring. Vi undanber oss därför kontakt med mediasäljare, rekryteringssajter och liknande.",
        "conditions" : "100%. Tillträde: Enligt överenskommelse\r\nTillsvidareanställning",
        "text" : "Vill du bidra till bättre affärer i Nacka? Nu har du chansen att bli en del av en kompetent, utvecklingsorienterad och effektiv inköpsavdelning!\n\n\nDitt uppdrag\n\nNu har du möjligheten att få utvecklas inom inköpsområdet tillsammans med ett härligt gäng i Nacka Kommun.\r\n\r\nNacka arbetar kategoristyrt och har flera stora, spännande upphandlingar på gång. Nu söker vi dig som vill vara med på vår utvecklingsresa för att skapa framtidens Nacka. Läs gärna mer om enheten och hur vi arbetar här: https://www.nacka.se/medarbetare/enheter/inkopsenheten/om-enheten/\n\nI rollen som inköpare arbetar du kategoribaserat och stödjs vid behov av en kategoriansvarig. Du kommer arbeta med att genomföra inköpsprojekt med olika komplexitet inom flera områden - alltid i nära samverkan med verksamheten.\n\nDu får en viktig roll för att driva inköpsprocessen samt de kommersiella aspekterna av de affärer kommunen gör i enlighet med LOU. Du jobbar projektorienterat tillsammans med ansvariga chefer, projektledare och andra medarbetare inom kommunen. I ditt uppdrag ingår;\n\n - Kravspecifikation, marknadsanalys och att driva upphandlingarna.\n - Att delta i leverans- och leverantörsuppföljningsprocesserna.\n - Utveckla affärsmässigheten och de kommersiella aspekterna ute i verksamheterna.\n\nMålet är att Nacka göra goda affärer i enlighet med LOU som bidrar till Nackas utveckling.\n\nSom inköpare blir du en del av inköpsenheten, som är ett härligt, positivt team på 18 personer med höga ambitioner. Din närmsta chef blir inköpschef Sebastian Nordgren, som har gedigen erfarenhet av inköpsverksamhet både i privat och offentlig sektor.\n\n\nÄr det här du?\n\n\nVi söker dig som har erfarenhet av att arbeta med offentliga inköp gärna i en politiskt styrd eller större organisation och som stimuleras av mångfalden i både frågeställningar och metoder för att kunna bidra till kommunens affärer och att utveckla samhället. Du har relevant akademisk utbildning och med största sannolikhet har du arbetat med inköp i minst 2-3 år i privat och/eller offentlig sektor. Du bör ha erfarenhet av att genomföra upphandlingar i enlighet med LOU. Nu har du chansen att få vara en del i att bygga och skapa framtidens Nacka.\n\nDina personliga egenskaper\nFör att lyckas ser vi gärna att du har ett genuint intresse för inköparens roll som affärspartner. Vi fäster stor vikt vid dina personliga egenskaper och söker dig som;\n\n - Är målinriktad och har hög egen drivkraft.\n - Är kommunikativ och har fallenhet för att bygga relationer.\n - Har god samarbetsförmåga.\n - Är serviceinriktad och delar med dig av din kunskap.\n\n \n\nVi erbjuder \nVi erbjuder dig att få vara med på en spännande resa, där du får möjlighet att arbeta i en bred självständig roll. I Nacka får du arbeta i en kommun som vill vara bäst i Sverige på att vara kommun, och som har öppenhet och mångfald som sin vision och en grundläggande värdering att lita på människors kunskap, vilja och förmåga.\n\nBlir du vår nya kollega så erbjuder vi dig: gym i huset, friskvårdsersättning, förmånscykelserbjudande samt möjlighet att växla semesterersättning mot fler semesterdagar. Arbetsplatsen ligger i Nacka stadshus i öppna, ljusa lokaler, granne med Nacka forum och 15 min med buss från Slussen och 20 minuter från Gustavsberg.\n\n\nIntresserad? \n\nTjänsten är en tillsvidareanställning på heltid med tillträde enligt överenskommelse. Provanställning kan komma att tillämpas.\n\nOm du vill bli en del av Nacka kommun, tveka inte att skicka in din ansökan! Vill du veta mer om tjänsten är du välkommen att kontakta mig på:\n\nsebastian.nordgren@nacka.se, 070 431 91 60 https://www.linkedin.com/in/sebastian-nordgren-189264/\n\nUrvalet kommer att ske löpande och denna tjänst kan komma att tillsättas före ansökningstidens utgång. Sista ansökningsdag är 2022-08-21.\n\n\n\n\n\nVi ser fram emot att få din ansökan!\n\n \n\nNacka är en av Sveriges mest attraktiva och välrenommerade kommuner. Med fokus på mål, resultat, hållbart medarbetarengagemang och ständig utveckling strävar Nacka efter att bli bäst på att vara kommun. Nacka kommun är arbetsgivaren för dig som med stor frihet förnyar och gör skillnad.\n\n\n\nInför rekryteringsarbetet har Nacka kommun tagit ställning till rekryteringskanaler och marknadsföring. Vi undanber oss därför kontakt med mediasäljare, rekryteringssajter och liknande."
      },
      "headline" : "Inköpare som vill utvecklas i Nacka kommun!",
      "driving_license" : null,
      "employer" : {
        "email" : null,
        "phone_number" : null,
        "organization_number" : "2120000167",
        "name" : "Nacka kommun",
        "url" : null,
        "workplace" : "Nacka kommun, inköpsenheten"
      },
      "removed_date" : null,
      "logo_url" : "https://www.arbetsformedlingen.se/rest/arbetsgivare/rest/af/v3/organisation/2120000167/logotyper/logo.png",
      "last_publication_date" : "2022-08-21T23:59:59",
      "number_of_vacancies" : 1,
      "occupation" : {
        "concept_id" : "KVVN_sqH_Wpz",
        "label" : "Inköpare",
        "legacy_ams_taxonomy_id" : "5915"
      },
      "occupation_group" : {
        "concept_id" : "85cq_6uK_4cK",
        "label" : "Inköpare och upphandlare",
        "legacy_ams_taxonomy_id" : "3323"
      },
      "employment_type" : {
        "concept_id" : "PFZr_Syz_cUq",
        "label" : "Vanlig anställning",
        "legacy_ams_taxonomy_id" : "1"
      },
      "webpage_url" : "https://arbetsformedlingen.se/platsbanken/annonser/26270662",
      "driving_license_required" : false,
      "application_contacts" : [ ],
      "duration" : {
        "concept_id" : "a7uU_j21_mkL",
        "label" : "Tills vidare",
        "legacy_ams_taxonomy_id" : "1"
      },
      "nice_to_have" : {
        "education_level" : [ ],
        "work_experiences" : [ ],
        "skills" : [ ],
        "education" : [ ],
        "languages" : [ ]
      },
      "application_details" : {
        "via_af" : false,
        "email" : null,
        "other" : null,
        "reference" : "2022/514",
        "url" : "https://nacka.varbi.com/se/what:job/jobID:526536/type:job/where:1/apply:1",
        "information" : null
      },
      "source_type" : "VIA_PLATSBANKEN_DXA",
      "application_deadline" : "2022-08-21T23:59:59",
      "external_id" : "46-212000-0167-526536",
      "workplace_address" : {
        "coordinates" : [ 18.156042, 59.307903 ],
        "city" : null,
        "postcode" : null,
        "municipality" : "Nacka",
        "region_concept_id" : "CifL_Rzy_Mku",
        "region" : "Stockholms län",
        "country_code" : "199",
        "region_code" : "01",
        "municipality_concept_id" : "aYA7_PpG_BqP",
        "country_concept_id" : "i46j_HmG_v64",
        "municipality_code" : "0182",
        "street_address" : null,
        "country" : "Sverige"
      },
      "id" : "26270662",
      "experience_required" : true,
      "working_hours_type" : {
        "concept_id" : "6YE1_gAC_R2G",
        "label" : "Heltid",
        "legacy_ams_taxonomy_id" : "1"
      },
      "access" : null,
      "timestamp" : 1656489198326,
      "must_have" : {
        "education_level" : [ ],
        "work_experiences" : [ {
          "concept_id" : "KVVN_sqH_Wpz",
          "weight" : 10,
          "label" : "Inköpare",
          "legacy_ams_taxonomy_id" : "5915"
        } ],
        "skills" : [ ],
        "education" : [ ],
        "languages" : [ ]
      },
      "occupation_field" : {
        "concept_id" : "RPTn_bxG_ExZ",
        "label" : "Försäljning, inköp, marknadsföring",
        "legacy_ams_taxonomy_id" : "5"
      },
      "scope_of_work" : {
        "min" : 100,
        "max" : 100
      },
      "salary_type" : {
        "concept_id" : "oG8G_9cW_nRf",
        "label" : "Fast månads- vecko- eller timlön",
        "legacy_ams_taxonomy_id" : "1"
      },
      "removed" : false,
      "salary_description" : "Månadslön",
      "access_to_own_car" : false,
      "publication_date" : "2022-08-01T00:00:00"
    },
    "name" : "Inköpare som vill utvecklas i Nacka kommun!",
    "user" : "kristof.fischer"
  },
  "sha1" : "0cf9536fe21388929b227f00698922a078c0cae8",
  "annotations" : [ {
    "preferred-label" : "Inköpare",
    "sentiment" : "MUST_HAVE",
    "type" : "occupation-name",
    "start-position" : 0,
    "end-position" : 8,
    "concept-id" : "KVVN_sqH_Wpz",
    "matched-string" : "inköpare",
    "annotation-id" : 0
  }, {
    "preferred-label" : "Nacka",
    "type" : "municipality",
    "start-position" : 30,
    "end-position" : 35,
    "concept-id" : "aYA7_PpG_BqP",
    "matched-string" : "Nacka",
    "annotation-id" : 9
  }, {
    "preferred-label" : "Nacka",
    "type" : "municipality",
    "start-position" : 80,
    "end-position" : 85,
    "concept-id" : "aYA7_PpG_BqP",
    "matched-string" : "Nacka",
    "annotation-id" : 10
  }, {
    "preferred-label" : "Nacka",
    "type" : "municipality",
    "start-position" : 298,
    "end-position" : 303,
    "concept-id" : "aYA7_PpG_BqP",
    "matched-string" : "Nacka",
    "annotation-id" : 11
  }, {
    "preferred-label" : "Nacka",
    "type" : "municipality",
    "start-position" : 315,
    "end-position" : 320,
    "concept-id" : "aYA7_PpG_BqP",
    "matched-string" : "Nacka",
    "annotation-id" : 12
  }, {
    "preferred-label" : "Nacka",
    "type" : "municipality",
    "start-position" : 479,
    "end-position" : 484,
    "concept-id" : "aYA7_PpG_BqP",
    "matched-string" : "Nacka",
    "annotation-id" : 13
  }, {
    "preferred-label" : "Inköpare",
    "sentiment" : "MUST_HAVE",
    "type" : "occupation-name",
    "start-position" : 616,
    "end-position" : 624,
    "concept-id" : "KVVN_sqH_Wpz",
    "matched-string" : "inköpare",
    "annotation-id" : 1
  }, {
    "preferred-label" : "Kategorichef/Kategoriansvarig",
    "sentiment" : "MUST_HAVE",
    "type" : "occupation-name",
    "start-position" : 679,
    "end-position" : 695,
    "concept-id" : "xQP2_w9J_jbZ",
    "matched-string" : "kategoriansvarig",
    "annotation-id" : 2
  }, {
    "preferred-label" : "Nacka",
    "type" : "municipality",
    "start-position" : 1329,
    "end-position" : 1334,
    "concept-id" : "aYA7_PpG_BqP",
    "matched-string" : "Nacka",
    "annotation-id" : 14
  }, {
    "preferred-label" : "Nacka",
    "type" : "municipality",
    "start-position" : 1388,
    "end-position" : 1394,
    "concept-id" : "aYA7_PpG_BqP",
    "matched-string" : "Nackas",
    "annotation-id" : 15
  }, {
    "preferred-label" : "Inköpare",
    "sentiment" : "MUST_HAVE",
    "type" : "occupation-name",
    "start-position" : 1412,
    "end-position" : 1420,
    "concept-id" : "KVVN_sqH_Wpz",
    "matched-string" : "inköpare",
    "annotation-id" : 4
  }, {
    "preferred-label" : "Inköpschef",
    "type" : "occupation-name",
    "start-position" : 1546,
    "end-position" : 1556,
    "concept-id" : "EbSk_Hv8_qog",
    "matched-string" : "inköpschef",
    "annotation-id" : 16
  }, {
    "preferred-label" : "Inköpsvana",
    "sentiment" : "MUST_HAVE",
    "type" : "skill",
    "start-position" : 1700,
    "end-position" : 1745,
    "concept-id" : "eKuz_edm_kmi",
    "matched-string" : "erfarenhet av att arbeta med offentliga inköp",
    "annotation-id" : 17
  }, {
    "preferred-label" : "Universitets- eller högskoleutbildning",
    "sentiment" : "MUST_HAVE",
    "type" : "sni-level-4",
    "start-position" : 1955,
    "end-position" : 1975,
    "concept-id" : "m1vC_Ssq_5Y7",
    "matched-string" : "akademisk utbildning",
    "annotation-id" : 18
  }, {
    "preferred-label" : "2-4 års erfarenhet",
    "sentiment" : "MUST_HAVE",
    "type" : "occupation-experience-year",
    "start-position" : 2031,
    "end-position" : 2043,
    "concept-id" : "RWA2_uu6_udD",
    "matched-string" : "minst 2-3 år",
    "annotation-id" : 19
  }, {
    "preferred-label" : "utföra upphandlingsprocesser",
    "sentiment" : "MUST_HAVE",
    "type" : "esco-skill",
    "start-position" : 2091,
    "end-position" : 2132,
    "concept-id" : "DFY6_CRj_i2N",
    "matched-string" : "erfarenhet av att genomföra upphandlingar",
    "annotation-id" : 20
  }, {
    "preferred-label" : "Nacka",
    "type" : "municipality",
    "start-position" : 2223,
    "end-position" : 2228,
    "concept-id" : "aYA7_PpG_BqP",
    "matched-string" : "Nacka",
    "annotation-id" : 21
  }, {
    "preferred-label" : "Kommunikationsförmåga - Inköpare",
    "sentiment" : "MUST_HAVE",
    "type" : "swedish-retail-and-wholesale-council-skill",
    "start-position" : 2480,
    "end-position" : 2492,
    "concept-id" : "ZTEB_W6w_oWP",
    "matched-string" : "kommunikativ",
    "annotation-id" : 22
  }, {
    "preferred-label" : "upprätthålla arbetsmässiga relationer",
    "sentiment" : "MUST_HAVE",
    "type" : "esco-skill",
    "start-position" : 2519,
    "end-position" : 2535,
    "concept-id" : "FSSe_5dD_kXc",
    "matched-string" : "bygga relationer",
    "annotation-id" : 23
  }, {
    "preferred-label" : "Samarbetsförmåga - Inköpare",
    "sentiment" : "MUST_HAVE",
    "type" : "swedish-retail-and-wholesale-council-skill",
    "start-position" : 2548,
    "end-position" : 2564,
    "concept-id" : "n4qM_KrG_9dq",
    "matched-string" : "samarbetsförmåga",
    "annotation-id" : 24
  }, {
    "preferred-label" : "Serviceinriktad - Inköpsassistent",
    "sentiment" : "MUST_HAVE",
    "type" : "swedish-retail-and-wholesale-council-skill",
    "start-position" : 2572,
    "end-position" : 2587,
    "concept-id" : "bbwa_gDs_oc7",
    "matched-string" : "serviceinriktad",
    "annotation-id" : 25
  }, {
    "preferred-label" : "Nacka",
    "type" : "municipality",
    "start-position" : 2756,
    "end-position" : 2761,
    "concept-id" : "aYA7_PpG_BqP",
    "matched-string" : "Nacka",
    "annotation-id" : 26
  }, {
    "preferred-label" : "Sverige",
    "type" : "country",
    "start-position" : 2809,
    "end-position" : 2816,
    "concept-id" : "i46j_HmG_v64",
    "matched-string" : "Sverige",
    "annotation-id" : 27
  }, {
    "preferred-label" : "Nacka",
    "type" : "municipality",
    "start-position" : 3163,
    "end-position" : 3168,
    "concept-id" : "aYA7_PpG_BqP",
    "matched-string" : "Nacka",
    "annotation-id" : 28
  }, {
    "preferred-label" : "Nacka",
    "type" : "municipality",
    "start-position" : 3213,
    "end-position" : 3218,
    "concept-id" : "aYA7_PpG_BqP",
    "matched-string" : "Nacka",
    "annotation-id" : 29
  }, {
    "preferred-label" : "Tillsvidareanställning (inkl. eventuell provanställning)",
    "type" : "employment-type",
    "start-position" : 3323,
    "end-position" : 3345,
    "concept-id" : "kpPX_CNN_gDU",
    "matched-string" : "tillsvidareanställning",
    "annotation-id" : 30
  }, {
    "preferred-label" : "Heltid",
    "type" : "worktime-extent",
    "start-position" : 3349,
    "end-position" : 3355,
    "concept-id" : "6YE1_gAC_R2G",
    "matched-string" : "heltid",
    "annotation-id" : 31
  }, {
    "preferred-label" : "Nacka",
    "type" : "municipality",
    "start-position" : 3461,
    "end-position" : 3466,
    "concept-id" : "aYA7_PpG_BqP",
    "matched-string" : "Nacka",
    "annotation-id" : 32
  } ],
  "text" : "Inköpare som vill utvecklas i Nacka kommun!\nVill du bidra till bättre affärer i Nacka? Nu har du chansen att bli en del av en kompetent, utvecklingsorienterad och effektiv inköpsavdelning!\n\n\nDitt uppdrag\n\nNu har du möjligheten att få utvecklas inom inköpsområdet tillsammans med ett härligt gäng i Nacka Kommun.\r\n\r\nNacka arbetar kategoristyrt och har flera stora, spännande upphandlingar på gång. Nu söker vi dig som vill vara med på vår utvecklingsresa för att skapa framtidens Nacka. Läs gärna mer om enheten och hur vi arbetar här: https://www.nacka.se/medarbetare/enheter/inkopsenheten/om-enheten/\n\nI rollen som inköpare arbetar du kategoribaserat och stödjs vid behov av en kategoriansvarig. Du kommer arbeta med att genomföra inköpsprojekt med olika komplexitet inom flera områden - alltid i nära samverkan med verksamheten.\n\nDu får en viktig roll för att driva inköpsprocessen samt de kommersiella aspekterna av de affärer kommunen gör i enlighet med LOU. Du jobbar projektorienterat tillsammans med ansvariga chefer, projektledare och andra medarbetare inom kommunen. I ditt uppdrag ingår;\n\n - Kravspecifikation, marknadsanalys och att driva upphandlingarna.\n - Att delta i leverans- och leverantörsuppföljningsprocesserna.\n - Utveckla affärsmässigheten och de kommersiella aspekterna ute i verksamheterna.\n\nMålet är att Nacka göra goda affärer i enlighet med LOU som bidrar till Nackas utveckling.\n\nSom inköpare blir du en del av inköpsenheten, som är ett härligt, positivt team på 18 personer med höga ambitioner. Din närmsta chef blir inköpschef Sebastian Nordgren, som har gedigen erfarenhet av inköpsverksamhet både i privat och offentlig sektor.\n\n\nÄr det här du?\n\n\nVi söker dig som har erfarenhet av att arbeta med offentliga inköp gärna i en politiskt styrd eller större organisation och som stimuleras av mångfalden i både frågeställningar och metoder för att kunna bidra till kommunens affärer och att utveckla samhället. Du har relevant akademisk utbildning och med största sannolikhet har du arbetat med inköp i minst 2-3 år i privat och/eller offentlig sektor. Du bör ha erfarenhet av att genomföra upphandlingar i enlighet med LOU. Nu har du chansen att få vara en del i att bygga och skapa framtidens Nacka.\n\nDina personliga egenskaper\nFör att lyckas ser vi gärna att du har ett genuint intresse för inköparens roll som affärspartner. Vi fäster stor vikt vid dina personliga egenskaper och söker dig som;\n\n - Är målinriktad och har hög egen drivkraft.\n - Är kommunikativ och har fallenhet för att bygga relationer.\n - Har god samarbetsförmåga.\n - Är serviceinriktad och delar med dig av din kunskap.\n\n \n\nVi erbjuder \nVi erbjuder dig att få vara med på en spännande resa, där du får möjlighet att arbeta i en bred självständig roll. I Nacka får du arbeta i en kommun som vill vara bäst i Sverige på att vara kommun, och som har öppenhet och mångfald som sin vision och en grundläggande värdering att lita på människors kunskap, vilja och förmåga.\n\nBlir du vår nya kollega så erbjuder vi dig: gym i huset, friskvårdsersättning, förmånscykelserbjudande samt möjlighet att växla semesterersättning mot fler semesterdagar. Arbetsplatsen ligger i Nacka stadshus i öppna, ljusa lokaler, granne med Nacka forum och 15 min med buss från Slussen och 20 minuter från Gustavsberg.\n\n\nIntresserad? \n\nTjänsten är en tillsvidareanställning på heltid med tillträde enligt överenskommelse. Provanställning kan komma att tillämpas.\n\nOm du vill bli en del av Nacka kommun, tveka inte att skicka in din ansökan! Vill du veta mer om tjänsten är du välkommen att kontakta mig på:\n\nsebastian.nordgren@nacka.se, 070 431 91 60 https://www.linkedin.com/in/sebastian-nordgren-189264/\n\nUrvalet kommer att ske löpande och denna tjänst kan komma att tillsättas före ansökningstidens utgång. Sista ansökningsdag är 2022-08-21.\n\n\n\n\n\nVi ser fram emot att få din ansökan!\n\n \n\nNacka är en av Sveriges mest attraktiva och välrenommerade kommuner. Med fokus på mål, resultat, hållbart medarbetarengagemang och ständig utveckling strävar Nacka efter att bli bäst på att vara kommun. Nacka kommun är arbetsgivaren för dig som med stor frihet förnyar och gör skillnad.\n\n\n\nInför rekryteringsarbetet har Nacka kommun tagit ställning till rekryteringskanaler och marknadsföring. Vi undanber oss därför kontakt med mediasäljare, rekryteringssajter och liknande."
}