{
  "meta" : {
    "jobad" : {
      "description" : {
        "requirements" : null,
        "needs" : null,
        "company_information" : null,
        "text_formatted" : "<p><strong>Telefonförsäljare</strong></p><p>Uniq Dialog är ett callcenter med mångårig erfarenhet inom branschen och vi har varit aktiva i Malmö sedan 2007. Nu har vi öppnat upp ett nytt kontor i Lund och därför söker vi förstärkning till vårt fantastiska försäljningsteam. Vi garanterar att du kommer trivas tillsammans med oss på kontoret och att du alltid kommer arbeta med välkända svenska varumärken.</p><p><strong>Arbetsuppgifter</strong></p><p>Du kommer arbeta med försäljning via telefon mot nya och befintliga kunder.</p><p><br></p><p><strong> Vad vi kan erbjuda dig:</strong></p><p>- Bra och varierande arbetstider.</p><p>- Centralt belägen och fräsch arbetsplats</p><p>- Stöd, feedback och coachning</p><p>- Garantilön, provision och <strong>lön varje fredag</strong></p><p>- En trivsam och professionell arbetsmiljö</p><p>- Möjligheter till fortsatt utveckling inom företaget</p><p><br></p><p><strong>Vi söker dig som:</strong></p><p>- Tycker att försäljning är kul</p><p>- Orädd för att ta kontakt med nya kunder</p><p>- Ser utmaningar som något positivt</p><p>- Värdesätter kvalité</p><p>- Trivs med att jobba mot uppsatta mål</p><p><br></p><p>Tidigare service- eller försäljningserfarenhet är meriterande men absolut inget krav. Vi ser det däremot som en självklarhet att du är punktlig, ordningsam och tycker om att arbeta med försäljning.</p><p>Våra arbetspass är måndag-torsdag 12:30-17:00 och 16:45-21:00 samt söndag 12:30-16:45.</p><p>Du bokar själv ditt schema enkelt på vår hemsida med vilka kvällar och helger du vill jobba. Du får jobba hur mycket du vill utifrån de pass som vi erbjuder men minst tre pass i veckan, och hos oss får du även lön <strong>varje fredag</strong>.</p><p>Som anställd hos oss påbörjar du din anställning med tre introduktionsdagar där vi kombinerar teori med praktik och du kommer att få lära dig allt du behöver för att sälja på alla typer av kundunderlag. Vi som arbetar här är måna om att nya kollegor som börjar hos oss ska trivas och få den hjälp som behövs för att lyckas riktigt bra! Vi erbjuder alla verktyg som du behöver i form av utbildning, kontinuerlig coachning och säljtävlingar.</p><p><br></p><p>Passar du in på ovan så vill vi gärna träffa dig! Skicka in din ansökan redan idag då vi tillämpar löpande rekrytering.</p><p><br></p><p><strong>Varaktighet</strong></p><p>Tillsvidare</p><p><strong>Lön</strong></p><p>Fast garantilön + provision</p><p><strong>Besöksadress</strong></p><p>Lund</p><p><strong>Telefon</strong></p><p>040 – 608 58 00</p>",
        "conditions" : null,
        "text" : "Telefonförsäljare\nUniq Dialog är ett callcenter med mångårig erfarenhet inom branschen och vi har varit aktiva i Malmö sedan 2007. Nu har vi öppnat upp ett nytt kontor i Lund och därför söker vi förstärkning till vårt fantastiska försäljningsteam. Vi garanterar att du kommer trivas tillsammans med oss på kontoret och att du alltid kommer arbeta med välkända svenska varumärken.\nArbetsuppgifter\nDu kommer arbeta med försäljning via telefon mot nya och befintliga kunder.\n\n\n Vad vi kan erbjuda dig:\n- Bra och varierande arbetstider.\n- Centralt belägen och fräsch arbetsplats\n- Stöd, feedback och coachning\n- Garantilön, provision och lön varje fredag\n- En trivsam och professionell arbetsmiljö\n- Möjligheter till fortsatt utveckling inom företaget\n\n\nVi söker dig som:\n- Tycker att försäljning är kul\n- Orädd för att ta kontakt med nya kunder\n- Ser utmaningar som något positivt\n- Värdesätter kvalité\n- Trivs med att jobba mot uppsatta mål\n\n\nTidigare service- eller försäljningserfarenhet är meriterande men absolut inget krav. Vi ser det däremot som en självklarhet att du är punktlig, ordningsam och tycker om att arbeta med försäljning.\nVåra arbetspass är måndag-torsdag 12:30-17:00 och 16:45-21:00 samt söndag 12:30-16:45.\nDu bokar själv ditt schema enkelt på vår hemsida med vilka kvällar och helger du vill jobba. Du får jobba hur mycket du vill utifrån de pass som vi erbjuder men minst tre pass i veckan, och hos oss får du även lön varje fredag.\nSom anställd hos oss påbörjar du din anställning med tre introduktionsdagar där vi kombinerar teori med praktik och du kommer att få lära dig allt du behöver för att sälja på alla typer av kundunderlag. Vi som arbetar här är måna om att nya kollegor som börjar hos oss ska trivas och få den hjälp som behövs för att lyckas riktigt bra! Vi erbjuder alla verktyg som du behöver i form av utbildning, kontinuerlig coachning och säljtävlingar.\n\n\nPassar du in på ovan så vill vi gärna träffa dig! Skicka in din ansökan redan idag då vi tillämpar löpande rekrytering.\n\n\nVaraktighet\nTillsvidare\nLön\nFast garantilön + provision\nBesöksadress\nLund\nTelefon\n040 – 608 58 00"
      },
      "headline" : "Extrajobba som säljare i Lund och få lön varje fredag!",
      "driving_license" : null,
      "employer" : {
        "email" : null,
        "phone_number" : null,
        "organization_number" : "5567316616",
        "name" : "Uniq Dialog i Malmö AB",
        "url" : "https://uniqdialog.teamtailor.com/jobs/1458297-innesaljare-deltid-lund",
        "workplace" : "UNIQ DIALOG I MALMÖ AB"
      },
      "removed_date" : null,
      "logo_url" : "https://www.arbetsformedlingen.se/rest/arbetsgivare/rest/af/v3/arbetsplatser/82614908/logotyper/logo.png",
      "last_publication_date" : "2022-09-02T23:59:59",
      "number_of_vacancies" : 5,
      "occupation" : {
        "concept_id" : "WZ2C_vH9_8ek",
        "label" : "Telefonförsäljare",
        "legacy_ams_taxonomy_id" : "7468"
      },
      "occupation_group" : {
        "concept_id" : "PxXc_16t_oZo",
        "label" : "Telefonförsäljare m.fl.",
        "legacy_ams_taxonomy_id" : "5242"
      },
      "employment_type" : {
        "concept_id" : "1paU_aCR_nGn",
        "label" : "Behovsanställning",
        "legacy_ams_taxonomy_id" : "4"
      },
      "webpage_url" : "https://arbetsformedlingen.se/platsbanken/annonser/26375291",
      "driving_license_required" : false,
      "application_contacts" : [ ],
      "duration" : {
        "concept_id" : null,
        "label" : null,
        "legacy_ams_taxonomy_id" : null
      },
      "nice_to_have" : {
        "education_level" : [ ],
        "work_experiences" : [ ],
        "skills" : [ ],
        "education" : [ ],
        "languages" : [ ]
      },
      "application_details" : {
        "via_af" : false,
        "email" : null,
        "other" : null,
        "reference" : "Deltid Lund",
        "url" : "https://uniqdialog.teamtailor.com/jobs/1458297-innesaljare-deltid-lund",
        "information" : null
      },
      "source_type" : "VIA_ANNONSERA",
      "application_deadline" : "2022-09-02T23:59:59",
      "external_id" : null,
      "workplace_address" : {
        "coordinates" : [ 13.009050613842115, 55.581449347964 ],
        "city" : "MALMÖ",
        "postcode" : "21431",
        "municipality" : "Malmö",
        "region_concept_id" : "CaRE_1nn_cSU",
        "region" : "Skåne län",
        "country_code" : "199",
        "region_code" : "12",
        "municipality_concept_id" : "oYPt_yRA_Smm",
        "country_concept_id" : "i46j_HmG_v64",
        "municipality_code" : "1280",
        "street_address" : "FOSIEVÄGEN 6",
        "country" : "Sverige"
      },
      "id" : "26375291",
      "experience_required" : false,
      "working_hours_type" : {
        "concept_id" : null,
        "label" : null,
        "legacy_ams_taxonomy_id" : null
      },
      "access" : null,
      "timestamp" : 1659528875282,
      "must_have" : {
        "education_level" : [ ],
        "work_experiences" : [ ],
        "skills" : [ ],
        "education" : [ ],
        "languages" : [ {
          "concept_id" : "zSLA_vw2_FXN",
          "weight" : 10,
          "label" : "Svenska",
          "legacy_ams_taxonomy_id" : "502"
        } ]
      },
      "occupation_field" : {
        "concept_id" : "RPTn_bxG_ExZ",
        "label" : "Försäljning, inköp, marknadsföring",
        "legacy_ams_taxonomy_id" : "5"
      },
      "scope_of_work" : {
        "min" : 0,
        "max" : null
      },
      "salary_type" : {
        "concept_id" : "asrX_9Df_ukn",
        "label" : "Fast och rörlig lön",
        "legacy_ams_taxonomy_id" : "7"
      },
      "removed" : false,
      "salary_description" : null,
      "access_to_own_car" : false,
      "publication_date" : "2022-08-03T14:14:35"
    },
    "name" : "Extrajobba som säljare i Lund och få lön varje fredag!",
    "user" : "hannes"
  },
  "sha1" : "b245bbd1dbb7ed1763bd6ae334ff23b9d506ba7f",
  "annotations" : [ {
    "preferred-label" : "Säljare",
    "sentiment" : "MUST_HAVE",
    "type" : "keyword",
    "start-position" : 15,
    "end-position" : 22,
    "concept-id" : "rDcj_Tao_TJJ",
    "matched-string" : "säljare",
    "annotation-id" : 0
  }, {
    "preferred-label" : "Lund",
    "type" : "municipality",
    "start-position" : 25,
    "end-position" : 29,
    "concept-id" : "muSY_tsR_vDZ",
    "matched-string" : "Lund",
    "annotation-id" : 8
  }, {
    "preferred-label" : "Telefonförsäljare",
    "sentiment" : "MUST_HAVE",
    "type" : "occupation-name",
    "start-position" : 55,
    "end-position" : 72,
    "concept-id" : "WZ2C_vH9_8ek",
    "matched-string" : "telefonförsäljare",
    "annotation-id" : 1
  }, {
    "preferred-label" : "Callcenterverksamhet",
    "type" : "sni-level-5",
    "start-position" : 92,
    "end-position" : 102,
    "concept-id" : "ts2b_arL_dvv",
    "matched-string" : "callcenter",
    "annotation-id" : 9
  }, {
    "preferred-label" : "Malmö",
    "type" : "municipality",
    "start-position" : 168,
    "end-position" : 173,
    "concept-id" : "oYPt_yRA_Smm",
    "matched-string" : "Malmö",
    "annotation-id" : 10
  }, {
    "preferred-label" : "Kontor",
    "sentiment" : "MUST_HAVE",
    "type" : "keyword",
    "start-position" : 216,
    "end-position" : 222,
    "concept-id" : "Hyz1_7HF_AkP",
    "matched-string" : "kontor",
    "annotation-id" : 2
  }, {
    "preferred-label" : "Lund",
    "type" : "municipality",
    "start-position" : 225,
    "end-position" : 229,
    "concept-id" : "muSY_tsR_vDZ",
    "matched-string" : "Lund",
    "annotation-id" : 11
  }, {
    "preferred-label" : "Coaching/Coachning",
    "sentiment" : "MUST_HAVE",
    "type" : "skill",
    "start-position" : 651,
    "end-position" : 660,
    "concept-id" : "91Ef_58Y_jX4",
    "matched-string" : "coachning",
    "annotation-id" : 4
  }, {
    "preferred-label" : "Rörlig ackords- eller provisionslön",
    "type" : "wage-type",
    "start-position" : 675,
    "end-position" : 692,
    "concept-id" : "vVtj_qm6_GQu",
    "matched-string" : "provision och lön",
    "annotation-id" : 12
  }, {
    "preferred-label" : "arbetsmiljö",
    "sentiment" : "MUST_HAVE",
    "type" : "esco-skill",
    "start-position" : 737,
    "end-position" : 748,
    "concept-id" : "zdQY_QJh_nUH",
    "matched-string" : "arbetsmiljö",
    "annotation-id" : 5
  }, {
    "preferred-label" : "Försäljning, inköp, marknadsföring",
    "type" : "occupation-field",
    "start-position" : 836,
    "end-position" : 847,
    "concept-id" : "RPTn_bxG_ExZ",
    "matched-string" : "försäljning",
    "annotation-id" : 13
  }, {
    "preferred-label" : "Försäljning, inköp, marknadsföring",
    "type" : "occupation-field",
    "start-position" : 1181,
    "end-position" : 1192,
    "concept-id" : "RPTn_bxG_ExZ",
    "matched-string" : "försäljning",
    "annotation-id" : 14
  }, {
    "preferred-label" : "Verktyg",
    "sentiment" : "MUST_HAVE",
    "type" : "skill",
    "start-position" : 1862,
    "end-position" : 1869,
    "concept-id" : "KG9j_WxP_ym2",
    "matched-string" : "verktyg",
    "annotation-id" : 6
  }, {
    "preferred-label" : "Coaching/Coachning",
    "sentiment" : "MUST_HAVE",
    "type" : "skill",
    "start-position" : 1920,
    "end-position" : 1929,
    "concept-id" : "91Ef_58Y_jX4",
    "matched-string" : "coachning",
    "annotation-id" : 7
  }, {
    "preferred-label" : "Tillsvidareanställning (inkl. eventuell provanställning)",
    "type" : "employment-type",
    "start-position" : 2085,
    "end-position" : 2096,
    "concept-id" : "kpPX_CNN_gDU",
    "matched-string" : "Tillsvidare",
    "annotation-id" : 15
  }, {
    "preferred-label" : "Rörlig ackords- eller provisionslön",
    "type" : "wage-type",
    "start-position" : 2119,
    "end-position" : 2128,
    "concept-id" : "vVtj_qm6_GQu",
    "matched-string" : "provision",
    "annotation-id" : 16
  }, {
    "preferred-label" : "Lund",
    "type" : "municipality",
    "start-position" : 2142,
    "end-position" : 2146,
    "concept-id" : "muSY_tsR_vDZ",
    "matched-string" : "Lund",
    "annotation-id" : 17
  } ],
  "text" : "Extrajobba som säljare i Lund och få lön varje fredag!\nTelefonförsäljare\nUniq Dialog är ett callcenter med mångårig erfarenhet inom branschen och vi har varit aktiva i Malmö sedan 2007. Nu har vi öppnat upp ett nytt kontor i Lund och därför söker vi förstärkning till vårt fantastiska försäljningsteam. Vi garanterar att du kommer trivas tillsammans med oss på kontoret och att du alltid kommer arbeta med välkända svenska varumärken.\nArbetsuppgifter\nDu kommer arbeta med försäljning via telefon mot nya och befintliga kunder.\n\n\n Vad vi kan erbjuda dig:\n- Bra och varierande arbetstider.\n- Centralt belägen och fräsch arbetsplats\n- Stöd, feedback och coachning\n- Garantilön, provision och lön varje fredag\n- En trivsam och professionell arbetsmiljö\n- Möjligheter till fortsatt utveckling inom företaget\n\n\nVi söker dig som:\n- Tycker att försäljning är kul\n- Orädd för att ta kontakt med nya kunder\n- Ser utmaningar som något positivt\n- Värdesätter kvalité\n- Trivs med att jobba mot uppsatta mål\n\n\nTidigare service- eller försäljningserfarenhet är meriterande men absolut inget krav. Vi ser det däremot som en självklarhet att du är punktlig, ordningsam och tycker om att arbeta med försäljning.\nVåra arbetspass är måndag-torsdag 12:30-17:00 och 16:45-21:00 samt söndag 12:30-16:45.\nDu bokar själv ditt schema enkelt på vår hemsida med vilka kvällar och helger du vill jobba. Du får jobba hur mycket du vill utifrån de pass som vi erbjuder men minst tre pass i veckan, och hos oss får du även lön varje fredag.\nSom anställd hos oss påbörjar du din anställning med tre introduktionsdagar där vi kombinerar teori med praktik och du kommer att få lära dig allt du behöver för att sälja på alla typer av kundunderlag. Vi som arbetar här är måna om att nya kollegor som börjar hos oss ska trivas och få den hjälp som behövs för att lyckas riktigt bra! Vi erbjuder alla verktyg som du behöver i form av utbildning, kontinuerlig coachning och säljtävlingar.\n\n\nPassar du in på ovan så vill vi gärna träffa dig! Skicka in din ansökan redan idag då vi tillämpar löpande rekrytering.\n\n\nVaraktighet\nTillsvidare\nLön\nFast garantilön + provision\nBesöksadress\nLund\nTelefon\n040 – 608 58 00"
}