{
  "meta" : {
    "jobad" : {
      "description" : {
        "requirements" : null,
        "needs" : null,
        "company_information" : null,
        "text_formatted" : "<p>Du ska vara utbildad kock eller ha dokumenterad erfarenhet av arbete som kock i minst 1 år. Du ska klara av hög arbetsbelastning då det stundtals är högt tempo.</p><p>Du ska ha förmåga att arbeta självständigt utifrån den meny vi har tagit fram.</p>",
        "conditions" : null,
        "text" : "Du ska vara utbildad kock eller ha dokumenterad erfarenhet av arbete som kock i minst 1 år. Du ska klara av hög arbetsbelastning då det stundtals är högt tempo.\nDu ska ha förmåga att arbeta självständigt utifrån den meny vi har tagit fram."
      },
      "headline" : "Kock",
      "driving_license" : null,
      "employer" : {
        "email" : null,
        "phone_number" : null,
        "organization_number" : "5590598644",
        "name" : "Ha Long AB",
        "url" : null,
        "workplace" : "Ha Long AB"
      },
      "removed_date" : null,
      "logo_url" : null,
      "last_publication_date" : "2022-09-03T23:59:59",
      "number_of_vacancies" : 2,
      "occupation" : {
        "concept_id" : "Vg3d_Azf_p5Y",
        "label" : "Kock, storhushåll",
        "legacy_ams_taxonomy_id" : "7664"
      },
      "occupation_group" : {
        "concept_id" : "BStc_SJh_DKG",
        "label" : "Kockar och kallskänkor",
        "legacy_ams_taxonomy_id" : "5120"
      },
      "employment_type" : {
        "concept_id" : "PFZr_Syz_cUq",
        "label" : "Vanlig anställning",
        "legacy_ams_taxonomy_id" : "1"
      },
      "webpage_url" : "https://arbetsformedlingen.se/platsbanken/annonser/26378912",
      "driving_license_required" : false,
      "application_contacts" : [ {
        "description" : null,
        "email" : "halongskok@hotmail.com",
        "telephone" : "0731418919, 0731418919",
        "name" : "Marie Vu",
        "contact_type" : "Ägare"
      } ],
      "duration" : {
        "concept_id" : "a7uU_j21_mkL",
        "label" : "Tills vidare",
        "legacy_ams_taxonomy_id" : "1"
      },
      "nice_to_have" : {
        "education_level" : [ ],
        "work_experiences" : [ ],
        "skills" : [ ],
        "education" : [ ],
        "languages" : [ ]
      },
      "application_details" : {
        "via_af" : false,
        "email" : "halongskok@hotmail.com",
        "other" : null,
        "reference" : null,
        "url" : null,
        "information" : null
      },
      "source_type" : "VIA_ANNONSERA",
      "application_deadline" : "2022-09-03T23:59:59",
      "external_id" : null,
      "workplace_address" : {
        "coordinates" : [ 13.148352508135591, 58.508034439049155 ],
        "city" : "Lidköping",
        "postcode" : "53130",
        "municipality" : "Lidköping",
        "region_concept_id" : "zdoY_6u5_Krt",
        "region" : "Västra Götalands län",
        "country_code" : "199",
        "region_code" : "14",
        "municipality_concept_id" : "FN1Y_asc_D8y",
        "country_concept_id" : "i46j_HmG_v64",
        "municipality_code" : "1494",
        "street_address" : "Läckögatan 10",
        "country" : "Sverige"
      },
      "id" : "26378912",
      "experience_required" : true,
      "working_hours_type" : {
        "concept_id" : "6YE1_gAC_R2G",
        "label" : "Heltid",
        "legacy_ams_taxonomy_id" : "1"
      },
      "access" : null,
      "timestamp" : 1659624675301,
      "must_have" : {
        "education_level" : [ ],
        "work_experiences" : [ ],
        "skills" : [ ],
        "education" : [ ],
        "languages" : [ ]
      },
      "occupation_field" : {
        "concept_id" : "ScKy_FHB_7wT",
        "label" : "Hotell, restaurang, storhushåll",
        "legacy_ams_taxonomy_id" : "7"
      },
      "scope_of_work" : {
        "min" : 0,
        "max" : 100
      },
      "salary_type" : {
        "concept_id" : "oG8G_9cW_nRf",
        "label" : "Fast månads- vecko- eller timlön",
        "legacy_ams_taxonomy_id" : "1"
      },
      "removed" : false,
      "salary_description" : null,
      "access_to_own_car" : false,
      "publication_date" : "2022-08-04T16:39:30"
    },
    "name" : "Kock",
    "user" : "hannes"
  },
  "sha1" : "dbd9af373f346d045f57cb1dba87b2cd3c014527",
  "annotations" : [ {
    "preferred-label" : "kock",
    "sentiment" : "MUST_HAVE",
    "type" : "esco-occupation",
    "start-position" : 0,
    "end-position" : 4,
    "concept-id" : "Ti2H_QoQ_EMX",
    "matched-string" : "kock",
    "annotation-id" : 0
  }, {
    "preferred-label" : "kock",
    "sentiment" : "MUST_HAVE",
    "type" : "esco-occupation",
    "start-position" : 26,
    "end-position" : 30,
    "concept-id" : "Ti2H_QoQ_EMX",
    "matched-string" : "kock",
    "annotation-id" : 1
  }, {
    "preferred-label" : "kock",
    "sentiment" : "MUST_HAVE",
    "type" : "esco-occupation",
    "start-position" : 78,
    "end-position" : 82,
    "concept-id" : "Ti2H_QoQ_EMX",
    "matched-string" : "kock",
    "annotation-id" : 2
  }, {
    "preferred-label" : "arbeta självständigt",
    "type" : "esco-skill",
    "start-position" : 188,
    "end-position" : 208,
    "concept-id" : "NyFu_HHd_zhz",
    "matched-string" : "arbeta självständigt",
    "annotation-id" : 3
  } ],
  "text" : "Kock\nDu ska vara utbildad kock eller ha dokumenterad erfarenhet av arbete som kock i minst 1 år. Du ska klara av hög arbetsbelastning då det stundtals är högt tempo.\nDu ska ha förmåga att arbeta självständigt utifrån den meny vi har tagit fram."
}