{
  "meta" : {
    "description" : "",
    "ssyk-level-4-kod" : "[\"7212\"]",
    "name" : "Industritekniskutbildning - Svets MMA",
    "type" : "AUB",
    "utbildningsid" : "124519",
    "ssyk-level-4-namn" : "[\"Svetsare och gasskärare\"]"
  },
  "sha1" : "68d6e78bd535384d5e9d2767985537e5888102ac",
  "annotations" : [ {
    "preferred-label" : "Svetsare",
    "sentiment" : "OFFERED",
    "type" : "keyword",
    "start-position" : 4,
    "comment" : "Återkom till denna. Kan kopplas mot flera begrepp. ",
    "end-position" : 12,
    "concept-id" : "ouXc_F9J_bAC",
    "matched-string" : "svetsare",
    "annotation-id" : 0
  }, {
    "preferred-label" : "Rörläggning",
    "sentiment" : "OFFERED",
    "type" : "skill",
    "start-position" : 238,
    "end-position" : 263,
    "concept-id" : "NFVU_tyu_JsA",
    "matched-string" : "installation av rörsystem",
    "annotation-id" : 6
  }, {
    "preferred-label" : "Byggnadssmide",
    "sentiment" : "OFFERED",
    "type" : "skill",
    "start-position" : 296,
    "end-position" : 308,
    "concept-id" : "UHKN_Nqw_6Z5",
    "matched-string" : "smidesarbete",
    "annotation-id" : 5
  }, {
    "preferred-label" : "Svetsare",
    "sentiment" : "OFFERED",
    "type" : "keyword",
    "start-position" : 322,
    "end-position" : 330,
    "concept-id" : "ouXc_F9J_bAC",
    "matched-string" : "svetsare",
    "annotation-id" : 1
  }, {
    "preferred-label" : "Automatsvetsning",
    "sentiment" : "OFFERED",
    "type" : "skill",
    "start-position" : 381,
    "end-position" : 403,
    "concept-id" : "vt7F_XTv_7ED",
    "matched-string" : "automatisk svetsmaskin",
    "annotation-id" : 7
  }, {
    "preferred-label" : "Tunnvägg (rörsvets, gods max 2 mm.)",
    "sentiment" : "OFFERED",
    "type" : "skill",
    "start-position" : 418,
    "comment" : "Stämmer denna? Hittade ingen annan kompetens kring rörsvets.",
    "end-position" : 450,
    "concept-id" : "bdHi_zUS_xqV",
    "matched-string" : "specialsvetsning av rörledningar",
    "annotation-id" : 8
  }, {
    "preferred-label" : "Tryckkärl",
    "sentiment" : "OFFERED",
    "type" : "skill",
    "start-position" : 455,
    "end-position" : 464,
    "concept-id" : "fBgY_UWc_49v",
    "matched-string" : "tryckkärl",
    "annotation-id" : 2
  }, {
    "preferred-label" : "Svetsare",
    "sentiment" : "OFFERED",
    "type" : "keyword",
    "start-position" : 499,
    "comment" : "Återkom till denna. Kan kopplas mot flera begrepp. ",
    "end-position" : 507,
    "concept-id" : "ouXc_F9J_bAC",
    "matched-string" : "svetsare",
    "annotation-id" : 3
  }, {
    "preferred-label" : "EN 287-1, 111 MMA, Metallbågsvetsning/ISO 9696-1",
    "sentiment" : "OFFERED",
    "type" : "skill",
    "start-position" : 641,
    "end-position" : 644,
    "concept-id" : "rqTb_HvR_RR3",
    "matched-string" : "MMA",
    "annotation-id" : 9
  }, {
    "preferred-label" : "EN 287-1, 111 MMA, Metallbågsvetsning/ISO 9696-1",
    "type" : "skill",
    "start-position" : 645,
    "end-position" : 671,
    "concept-id" : "rqTb_HvR_RR3",
    "matched-string" : "manuell metallbågsvetsning",
    "annotation-id" : 10
  }, {
    "preferred-label" : "IW (International Welder), certifikat",
    "sentiment" : "OFFERED",
    "type" : "skill",
    "start-position" : 757,
    "end-position" : 759,
    "concept-id" : "aNcD_UfW_vYN",
    "matched-string" : "iw",
    "annotation-id" : 4
  }, {
    "preferred-label" : null,
    "type" : "skill",
    "start-position" : 899,
    "comment" : "Vi har flera sorters materialkunskaper idag. Bör kunna kopplas mot dessa. Avvaktar. ",
    "end-position" : 911,
    "concept-id" : null,
    "matched-string" : "materiallära",
    "annotation-id" : 11
  }, {
    "preferred-label" : "EN 287-1, 111 MMA, Metallbågsvetsning/ISO 9696-1",
    "sentiment" : "OFFERED",
    "type" : "skill",
    "start-position" : 979,
    "end-position" : 982,
    "concept-id" : "rqTb_HvR_RR3",
    "matched-string" : "MMA",
    "annotation-id" : 12
  } ],
  "text" : "Som Svetsare är du anställd inom verkstadsindustrin, vid bygg- och anläggningsföretag, vid entreprenadföretag samt som underhålls- och reparationspersonal vid olika industrier. Du kan arbeta exempelvis vid broanläggningar, husbyggen, vid installation av rörsystem inom processindustrin eller vid smidesarbete. Arbetet som svetsare kan innebära allt från rutinbetonad skötsel av en automatisk svetsmaskin till krävande specialsvetsning av rörledningar och tryckkärl.\r\n\r\nDet är en stor efterfrågan på svetsare då inte tillräckligt många har utbildats. Fortsatt efterfrågan på både kort och lång sikt.\r\nUtbildningens inriktning är svetsmetoden MMA(manuell metallbågsvetsning) och är inriktad på käl- plåt- och rörsvetsning. Målet med utbildningen är att uppnå IW diplom på minst en av nivåerna.\r\nUtbildningen består av både praktiska och teoretiska moment. De teoretiska momenten innehåller exempelvis materiallära och under de praktiska momenten får du fördjupa dig i svetsmetoden MMA.\r\nUtbildningen sker i nära samarbete med branschen och en del av utbildningen gör du på ett företag för att få kännedom om hur det fungerar i branschen."
}