{
  "meta" : {
    "jobad" : {
      "description" : {
        "requirements" : null,
        "needs" : null,
        "company_information" : null,
        "text_formatted" : "<p>Fotograf, ett drömyrke för dig?</p><p>Vi söker nu fler fotografer till vår fotografkår i norra Stockholm med omnejd. Exakta Photo är Sveriges bästa skolfotoleverantör med mer än 60 års erfarenhet. Exakta Photo finns i hela Sverige och tillsammans fotograferar vi 900 000 elever varje år.</p><p>Vi söker dig med ett genuint fotointresse som vill kombinera det med ett kul arbete bland barn och ungdomar. Vi värdesätter dina goda egenskaper som social förmåga, och att kunna jobba med eget ansvar under ordning och reda. Men även en estetisk \"blick\" för bild och form. Erfarenhet från barn- och ungdomsverksamhet är en stor merit.</p><p>Du kommer att få tillgång till en digital fotoutrustning, vilket kräver god datorvana. Vi erbjuder dig en professionell fotoutbildning v33 i Nyköping men även en onlinekurs innan skolstarten i augusti.</p><p>Tjänsten kräver att du har körkort samt tillgång till bil.</p><p><br></p><p>Arbetsperiod i första hand augusti till oktober/november med möjlighet till förlängning.</p><p>Tidigare branscherfarenhet inom foto/skolfoto är inget krav men är självklart en merit. Vi ser gärna ett samarbete med redan etablerade fotografer.</p><p>Passa på att söka till vår glada fotografkår och berätta lite om dig själv samt bifoga ditt Cv och några bilder. (Eller länk).</p><p>Välkommen med din ansökan!</p>",
        "conditions" : null,
        "text" : "Fotograf, ett drömyrke för dig?\nVi söker nu fler fotografer till vår fotografkår i norra Stockholm med omnejd. Exakta Photo är Sveriges bästa skolfotoleverantör med mer än 60 års erfarenhet. Exakta Photo finns i hela Sverige och tillsammans fotograferar vi 900 000 elever varje år.\nVi söker dig med ett genuint fotointresse som vill kombinera det med ett kul arbete bland barn och ungdomar. Vi värdesätter dina goda egenskaper som social förmåga, och att kunna jobba med eget ansvar under ordning och reda. Men även en estetisk \"blick\" för bild och form. Erfarenhet från barn- och ungdomsverksamhet är en stor merit.\nDu kommer att få tillgång till en digital fotoutrustning, vilket kräver god datorvana. Vi erbjuder dig en professionell fotoutbildning v33 i Nyköping men även en onlinekurs innan skolstarten i augusti.\nTjänsten kräver att du har körkort samt tillgång till bil.\n\n\nArbetsperiod i första hand augusti till oktober/november med möjlighet till förlängning.\nTidigare branscherfarenhet inom foto/skolfoto är inget krav men är självklart en merit. Vi ser gärna ett samarbete med redan etablerade fotografer.\nPassa på att söka till vår glada fotografkår och berätta lite om dig själv samt bifoga ditt Cv och några bilder. (Eller länk).\nVälkommen med din ansökan!"
      },
      "headline" : "Vi söker Stockholms trevligaste fotografer!",
      "driving_license" : [ {
        "concept_id" : "VTK8_WRx_GcM",
        "label" : "B",
        "legacy_ams_taxonomy_id" : "3"
      } ],
      "employer" : {
        "email" : null,
        "phone_number" : null,
        "organization_number" : "5592593866",
        "name" : "Exakta Photo AB",
        "url" : null,
        "workplace" : "Exakta Photo AB"
      },
      "removed_date" : null,
      "logo_url" : "https://www.arbetsformedlingen.se/rest/arbetsgivare/rest/af/v3/arbetsplatser/88076681/logotyper/logo.png",
      "last_publication_date" : "2022-08-26T23:59:59",
      "number_of_vacancies" : 10,
      "occupation" : {
        "concept_id" : "1N2U_6xW_Tdx",
        "label" : "Fotograf",
        "legacy_ams_taxonomy_id" : "4790"
      },
      "occupation_group" : {
        "concept_id" : "3J38_DNz_YKK",
        "label" : "Fotografer",
        "legacy_ams_taxonomy_id" : "3431"
      },
      "employment_type" : {
        "concept_id" : "PFZr_Syz_cUq",
        "label" : "Vanlig anställning",
        "legacy_ams_taxonomy_id" : "1"
      },
      "webpage_url" : "https://arbetsformedlingen.se/platsbanken/annonser/26369233",
      "driving_license_required" : true,
      "application_contacts" : [ {
        "description" : null,
        "email" : "thomas.attervall@exaktaphoto.se",
        "telephone" : "0706-10 97 66",
        "name" : "Thomas Attervall",
        "contact_type" : "Fotoansvarig"
      } ],
      "duration" : {
        "concept_id" : "Sy9J_aRd_ALx",
        "label" : "11 dagar - upp till 3 månader",
        "legacy_ams_taxonomy_id" : "7"
      },
      "nice_to_have" : {
        "education_level" : [ ],
        "work_experiences" : [ ],
        "skills" : [ {
          "concept_id" : "2gv8_SfE_iXr",
          "weight" : 5,
          "label" : "Ateljéfotografering/Studiofotografering",
          "legacy_ams_taxonomy_id" : "608046"
        } ],
        "education" : [ ],
        "languages" : [ ]
      },
      "application_details" : {
        "via_af" : false,
        "email" : null,
        "other" : null,
        "reference" : "Skolfotograf 2022",
        "url" : "https://jobb.exaktafoto.se/",
        "information" : null
      },
      "source_type" : "VIA_ANNONSERA",
      "application_deadline" : "2022-08-26T23:59:59",
      "external_id" : null,
      "workplace_address" : {
        "coordinates" : [ 17.019493846677484, 58.74588766519288 ],
        "city" : "Nyköping",
        "postcode" : "61135",
        "municipality" : "Nyköping",
        "region_concept_id" : "s93u_BEb_sx2",
        "region" : "Södermanlands län",
        "country_code" : "199",
        "region_code" : "04",
        "municipality_concept_id" : "KzvD_ePV_DKQ",
        "country_concept_id" : "i46j_HmG_v64",
        "municipality_code" : "0480",
        "street_address" : "Östra Längdgatan 7",
        "country" : "Sverige"
      },
      "id" : "26369233",
      "experience_required" : false,
      "working_hours_type" : {
        "concept_id" : "6YE1_gAC_R2G",
        "label" : "Heltid",
        "legacy_ams_taxonomy_id" : "1"
      },
      "access" : null,
      "timestamp" : 1659364985315,
      "must_have" : {
        "education_level" : [ ],
        "work_experiences" : [ ],
        "skills" : [ {
          "concept_id" : "UdXV_fqG_jWu",
          "weight" : 10,
          "label" : "Fotografering, digitalkamera",
          "legacy_ams_taxonomy_id" : "606876"
        } ],
        "education" : [ ],
        "languages" : [ {
          "concept_id" : "zSLA_vw2_FXN",
          "weight" : 10,
          "label" : "Svenska",
          "legacy_ams_taxonomy_id" : "502"
        } ]
      },
      "occupation_field" : {
        "concept_id" : "9puE_nYg_crq",
        "label" : "Kultur, media, design",
        "legacy_ams_taxonomy_id" : "11"
      },
      "scope_of_work" : {
        "min" : 0,
        "max" : 100
      },
      "salary_type" : {
        "concept_id" : "oG8G_9cW_nRf",
        "label" : "Fast månads- vecko- eller timlön",
        "legacy_ams_taxonomy_id" : "1"
      },
      "removed" : false,
      "salary_description" : null,
      "access_to_own_car" : false,
      "publication_date" : "2022-08-01T16:43:05"
    },
    "name" : "Vi söker Stockholms trevligaste fotografer!",
    "user" : "hannes"
  },
  "sha1" : "1750dd4a9ce77da2674770438286e2a06b29c1ad",
  "annotations" : [ {
    "preferred-label" : "Stockholm",
    "type" : "municipality",
    "start-position" : 9,
    "end-position" : 19,
    "concept-id" : "AvNB_uwa_6n6",
    "matched-string" : "Stockholms",
    "annotation-id" : 6
  }, {
    "preferred-label" : "Fotografer",
    "sentiment" : "MUST_HAVE",
    "type" : "isco-level-4",
    "start-position" : 32,
    "end-position" : 42,
    "concept-id" : "bou8_sMv_sdv",
    "matched-string" : "fotografer",
    "annotation-id" : 0
  }, {
    "preferred-label" : "fotograf",
    "sentiment" : "MUST_HAVE",
    "type" : "esco-occupation",
    "start-position" : 44,
    "end-position" : 52,
    "concept-id" : "X1AG_Jya_y93",
    "matched-string" : "fotograf",
    "annotation-id" : 1
  }, {
    "preferred-label" : "Fotografer",
    "sentiment" : "MUST_HAVE",
    "type" : "isco-level-4",
    "start-position" : 93,
    "end-position" : 103,
    "concept-id" : "bou8_sMv_sdv",
    "matched-string" : "fotografer",
    "annotation-id" : 2
  }, {
    "preferred-label" : "Stockholm",
    "type" : "municipality",
    "start-position" : 133,
    "end-position" : 142,
    "concept-id" : "AvNB_uwa_6n6",
    "matched-string" : "Stockholm",
    "annotation-id" : 7
  }, {
    "preferred-label" : "Sverige",
    "type" : "country",
    "start-position" : 171,
    "end-position" : 179,
    "concept-id" : "i46j_HmG_v64",
    "matched-string" : "Sveriges",
    "annotation-id" : 8
  }, {
    "preferred-label" : "Sverige",
    "type" : "country",
    "start-position" : 261,
    "end-position" : 268,
    "concept-id" : "i46j_HmG_v64",
    "matched-string" : "Sverige",
    "annotation-id" : 9
  }, {
    "preferred-label" : "Ungdomsverksamhet",
    "sentiment" : "MUST_HAVE",
    "type" : "skill",
    "start-position" : 625,
    "end-position" : 642,
    "concept-id" : "kb9z_LG1_CZE",
    "matched-string" : "ungdomsverksamhet",
    "annotation-id" : 3
  }, {
    "preferred-label" : "Fotoutbildning",
    "sentiment" : "MUST_HAVE",
    "type" : "keyword",
    "start-position" : 781,
    "end-position" : 795,
    "concept-id" : "xee7_wWq_j8S",
    "matched-string" : "fotoutbildning",
    "annotation-id" : 4
  }, {
    "preferred-label" : "körkort",
    "type" : "esco-skill",
    "start-position" : 890,
    "end-position" : 897,
    "concept-id" : "UvDr_eNo_HSQ",
    "matched-string" : "körkort",
    "annotation-id" : 10
  }, {
    "preferred-label" : "Fotografer",
    "sentiment" : "MUST_HAVE",
    "type" : "isco-level-4",
    "start-position" : 1149,
    "end-position" : 1159,
    "concept-id" : "bou8_sMv_sdv",
    "matched-string" : "fotografer",
    "annotation-id" : 5
  } ],
  "text" : "Vi söker Stockholms trevligaste fotografer!\nFotograf, ett drömyrke för dig?\nVi söker nu fler fotografer till vår fotografkår i norra Stockholm med omnejd. Exakta Photo är Sveriges bästa skolfotoleverantör med mer än 60 års erfarenhet. Exakta Photo finns i hela Sverige och tillsammans fotograferar vi 900 000 elever varje år.\nVi söker dig med ett genuint fotointresse som vill kombinera det med ett kul arbete bland barn och ungdomar. Vi värdesätter dina goda egenskaper som social förmåga, och att kunna jobba med eget ansvar under ordning och reda. Men även en estetisk \"blick\" för bild och form. Erfarenhet från barn- och ungdomsverksamhet är en stor merit.\nDu kommer att få tillgång till en digital fotoutrustning, vilket kräver god datorvana. Vi erbjuder dig en professionell fotoutbildning v33 i Nyköping men även en onlinekurs innan skolstarten i augusti.\nTjänsten kräver att du har körkort samt tillgång till bil.\n\n\nArbetsperiod i första hand augusti till oktober/november med möjlighet till förlängning.\nTidigare branscherfarenhet inom foto/skolfoto är inget krav men är självklart en merit. Vi ser gärna ett samarbete med redan etablerade fotografer.\nPassa på att söka till vår glada fotografkår och berätta lite om dig själv samt bifoga ditt Cv och några bilder. (Eller länk).\nVälkommen med din ansökan!"
}