{
  "meta" : {
    "jobad" : {
      "description" : {
        "requirements" : null,
        "needs" : null,
        "company_information" : null,
        "text_formatted" : "Om företaget\nVi söker nu en maskinoperatör/slipare till vår kund som är ledande inom glasindustrin med säte i Göteborg. Tjänsten är ett 6 månaders konsultuppdrag, med goda chanser att bli överrekryterad till kund därefter. Vår kund söker dig som har tidigare erfarenhet som maskinoperatör, trivs med att jobba självständigt och är öppen för nya utmaningar. \n\nLåter detta som något för dig? Läs vidare och sök tjänsten redan idag!\n\nDina arbetsuppgifter\nSom maskinoperatör/slipare hos vår kund kommer en central arbetsuppgift vara att övervaka maskiner som slipar glasrutor. Arbetet kan innebära lyft av tunga glasskivor. Det kommer vara ditt och en kollegas ansvar att se till att glasskivor slipas enligt order. Arbetet kommer till stor del vara självständigt. Du kommer jobba dagtid på vardagar och bli en del av ett bra team.\n\nDin profil\nFör att ta dig an denna roll ser vi att du har tidigare erfarenhet som maskinoperatör. Vi tror att du kanske även har jobbat med fräs, svarv, NCC eller enklare maskinhantering. Har du jobbat inom glasbranschen tidigare så är detta ett plus. Du har inget emot tunga lyft i arbetet. Vidare ser vi att du:\n\n•\tTrivs i en självständig roll\n•\tJobbar kvalitativt och noggrant\n•\tKommunicerar obehindrat på svenska i tal och skrift\n\nHar du truckkort och/eller traverskort så är detta meriterande. Vi söker dig som kan börja omgående, med hänsyn till eventuell uppsägningstid. \n\n\nOm oss\nDenna rekrytering sker i samarbete med rekryterings- och bemanningsföretaget Söder &amp; Co. Söder &amp; Co är ett auktoriserat rekryterings- och bemanningsföretag som har varit verksamt sedan 1999. Vi skapar karriärmöjligheter för människor och kostnadseffektivitet för företag. Vi tror på långsiktiga relationer och arbetar därför engagerat med en lokal och personlig närhet till våra kunder, konsulter och kandidater.\n\nSöder &amp; Co ska bidra till ett inkluderande samhälle där människor utmanas, har framtidstro och känner sig delaktiga. Hos oss gör människor skillnad. Som anställd hos oss på Söder &amp; Co arbetar du som konsult på uppdrag ute hos våra kunder. För oss är det av största vikt att du känner dig trygg i din anställning. Genom att vi är ett auktoriserat bemanningsföretag, ställer det krav på oss som arbetsgivare och det gör att du som konsult kan känna dig säker på att vi följer de kollektivavtal som är framförhandlade av parterna. Genom våra ledord långsiktighet, engagemang, enkelhet och förtroende ser vi till att du blir en trygg och nöjd medarbetare. Välkommen att bli en av oss i vårt härliga Söder &amp; Co-team.",
        "conditions" : "Heltid\r\nTillsvidare",
        "text" : "Om företaget\nVi söker nu en maskinoperatör/slipare till vår kund som är ledande inom glasindustrin med säte i Göteborg. Tjänsten är ett 6 månaders konsultuppdrag, med goda chanser att bli överrekryterad till kund därefter. Vår kund söker dig som har tidigare erfarenhet som maskinoperatör, trivs med att jobba självständigt och är öppen för nya utmaningar. \n\nLåter detta som något för dig? Läs vidare och sök tjänsten redan idag!\n\nDina arbetsuppgifter\nSom maskinoperatör/slipare hos vår kund kommer en central arbetsuppgift vara att övervaka maskiner som slipar glasrutor. Arbetet kan innebära lyft av tunga glasskivor. Det kommer vara ditt och en kollegas ansvar att se till att glasskivor slipas enligt order. Arbetet kommer till stor del vara självständigt. Du kommer jobba dagtid på vardagar och bli en del av ett bra team.\n\nDin profil\nFör att ta dig an denna roll ser vi att du har tidigare erfarenhet som maskinoperatör. Vi tror att du kanske även har jobbat med fräs, svarv, NCC eller enklare maskinhantering. Har du jobbat inom glasbranschen tidigare så är detta ett plus. Du har inget emot tunga lyft i arbetet. Vidare ser vi att du:\n\n•\tTrivs i en självständig roll\n•\tJobbar kvalitativt och noggrant\n•\tKommunicerar obehindrat på svenska i tal och skrift\n\nHar du truckkort och/eller traverskort så är detta meriterande. Vi söker dig som kan börja omgående, med hänsyn till eventuell uppsägningstid. \n\n\nOm oss\nDenna rekrytering sker i samarbete med rekryterings- och bemanningsföretaget Söder & Co. Söder & Co är ett auktoriserat rekryterings- och bemanningsföretag som har varit verksamt sedan 1999. Vi skapar karriärmöjligheter för människor och kostnadseffektivitet för företag. Vi tror på långsiktiga relationer och arbetar därför engagerat med en lokal och personlig närhet till våra kunder, konsulter och kandidater.\n\nSöder & Co ska bidra till ett inkluderande samhälle där människor utmanas, har framtidstro och känner sig delaktiga. Hos oss gör människor skillnad. Som anställd hos oss på Söder & Co arbetar du som konsult på uppdrag ute hos våra kunder. För oss är det av största vikt att du känner dig trygg i din anställning. Genom att vi är ett auktoriserat bemanningsföretag, ställer det krav på oss som arbetsgivare och det gör att du som konsult kan känna dig säker på att vi följer de kollektivavtal som är framförhandlade av parterna. Genom våra ledord långsiktighet, engagemang, enkelhet och förtroende ser vi till att du blir en trygg och nöjd medarbetare. Välkommen att bli en av oss i vårt härliga Söder & Co-team."
      },
      "headline" : "Vår kund inom glasindustrin söker en maskinoperatör",
      "driving_license" : null,
      "employer" : {
        "email" : null,
        "phone_number" : null,
        "organization_number" : "5566843107",
        "name" : "AB Söder & Co Consulting",
        "url" : "http://www.soderco.se/",
        "workplace" : "Söder & Co Göteborg AB"
      },
      "removed_date" : null,
      "logo_url" : "https://www.arbetsformedlingen.se/rest/arbetsgivare/rest/af/v3/organisation/5566843107/logotyper/logo.png",
      "last_publication_date" : "2022-08-15T23:59:59",
      "number_of_vacancies" : 1,
      "occupation" : {
        "concept_id" : "wLS3_Jw6_htW",
        "label" : "Glasslipare",
        "legacy_ams_taxonomy_id" : "3926"
      },
      "occupation_group" : {
        "concept_id" : "aKdV_u7V_R5j",
        "label" : "Musikinstrumentmakare och övriga konsthantverkare",
        "legacy_ams_taxonomy_id" : "7319"
      },
      "employment_type" : {
        "concept_id" : "PFZr_Syz_cUq",
        "label" : "Vanlig anställning",
        "legacy_ams_taxonomy_id" : "1"
      },
      "webpage_url" : "https://arbetsformedlingen.se/platsbanken/annonser/26342122",
      "driving_license_required" : false,
      "application_contacts" : [ {
        "description" : "Olivia King",
        "email" : null,
        "telephone" : null,
        "name" : null,
        "contact_type" : null
      } ],
      "duration" : {
        "concept_id" : "a7uU_j21_mkL",
        "label" : "Tills vidare",
        "legacy_ams_taxonomy_id" : "1"
      },
      "nice_to_have" : {
        "education_level" : [ ],
        "work_experiences" : [ ],
        "skills" : [ ],
        "education" : [ ],
        "languages" : [ ]
      },
      "application_details" : {
        "via_af" : false,
        "email" : null,
        "other" : null,
        "reference" : "5992",
        "url" : "http://soderco.se/jobb/visa?jaid=5992",
        "information" : null
      },
      "source_type" : "VIA_PLATSBANKEN_DXA",
      "application_deadline" : "2022-08-15T23:59:59",
      "external_id" : "46-556684-3107-5992",
      "workplace_address" : {
        "coordinates" : [ 11.97456, 57.70887 ],
        "city" : null,
        "postcode" : null,
        "municipality" : "Göteborg",
        "region_concept_id" : "zdoY_6u5_Krt",
        "region" : "Västra Götalands län",
        "country_code" : "199",
        "region_code" : "14",
        "municipality_concept_id" : "PVZL_BQT_XtL",
        "country_concept_id" : "i46j_HmG_v64",
        "municipality_code" : "1480",
        "street_address" : null,
        "country" : "Sverige"
      },
      "id" : "26342122",
      "experience_required" : true,
      "working_hours_type" : {
        "concept_id" : "6YE1_gAC_R2G",
        "label" : "Heltid",
        "legacy_ams_taxonomy_id" : "1"
      },
      "access" : null,
      "timestamp" : 1658319154980,
      "must_have" : {
        "education_level" : [ ],
        "work_experiences" : [ {
          "concept_id" : "wLS3_Jw6_htW",
          "weight" : 10,
          "label" : "Glasslipare",
          "legacy_ams_taxonomy_id" : "3926"
        } ],
        "skills" : [ ],
        "education" : [ ],
        "languages" : [ ]
      },
      "occupation_field" : {
        "concept_id" : "PaxQ_o1G_wWH",
        "label" : "Hantverk",
        "legacy_ams_taxonomy_id" : "6"
      },
      "scope_of_work" : {
        "min" : 100,
        "max" : 100
      },
      "salary_type" : {
        "concept_id" : "oG8G_9cW_nRf",
        "label" : "Fast månads- vecko- eller timlön",
        "legacy_ams_taxonomy_id" : "1"
      },
      "removed" : false,
      "salary_description" : "Fast lön",
      "access_to_own_car" : false,
      "publication_date" : "2022-07-20T14:12:34"
    },
    "name" : "Vår kund inom glasindustrin söker en maskinoperatör",
    "user" : "kristof.fischer"
  },
  "sha1" : "b9a1935b0afa050c55d30d1d96ce68b5ad2a14fb",
  "annotations" : [ {
    "preferred-label" : "Maskinoperatör, mekanisk verkstad",
    "type" : "occupation-name",
    "start-position" : 37,
    "end-position" : 51,
    "concept-id" : "Z4Tt_Gwt_NGP",
    "matched-string" : "maskinoperatör",
    "annotation-id" : 2
  }, {
    "preferred-label" : "Maskinoperatör, mekanisk verkstad",
    "type" : "occupation-name",
    "start-position" : 80,
    "end-position" : 94,
    "concept-id" : "Z4Tt_Gwt_NGP",
    "matched-string" : "maskinoperatör",
    "annotation-id" : 3
  }, {
    "preferred-label" : "Glasslipare",
    "type" : "occupation-name",
    "start-position" : 95,
    "end-position" : 102,
    "concept-id" : "wLS3_Jw6_htW",
    "matched-string" : "slipare",
    "annotation-id" : 4
  }, {
    "preferred-label" : "Göteborg",
    "type" : "municipality",
    "start-position" : 162,
    "end-position" : 170,
    "concept-id" : "PVZL_BQT_XtL",
    "matched-string" : "Göteborg",
    "annotation-id" : 5
  }, {
    "preferred-label" : "Maskinoperatör, mekanisk verkstad",
    "type" : "occupation-name",
    "start-position" : 326,
    "end-position" : 340,
    "concept-id" : "Z4Tt_Gwt_NGP",
    "matched-string" : "maskinoperatör",
    "annotation-id" : 7
  }, {
    "preferred-label" : "arbeta självständigt",
    "sentiment" : "MUST_HAVE",
    "type" : "esco-skill",
    "start-position" : 362,
    "end-position" : 375,
    "concept-id" : "NyFu_HHd_zhz",
    "matched-string" : "självständigt",
    "annotation-id" : 6
  }, {
    "preferred-label" : "Maskinoperatör, mekanisk verkstad",
    "type" : "occupation-name",
    "start-position" : 508,
    "end-position" : 522,
    "concept-id" : "Z4Tt_Gwt_NGP",
    "matched-string" : "maskinoperatör",
    "annotation-id" : 8
  }, {
    "preferred-label" : "Glasslipare",
    "type" : "occupation-name",
    "start-position" : 523,
    "end-position" : 530,
    "concept-id" : "wLS3_Jw6_htW",
    "matched-string" : "slipare",
    "annotation-id" : 9
  }, {
    "preferred-label" : "övervaka maskinaktivitet",
    "sentiment" : "MUST_HAVE",
    "type" : "esco-skill",
    "start-position" : 585,
    "end-position" : 602,
    "concept-id" : "57eS_U77_gX8",
    "matched-string" : "övervaka maskiner",
    "annotation-id" : 10
  }, {
    "preferred-label" : "lyfta tunga föremål",
    "sentiment" : "MUST_HAVE",
    "type" : "esco-skill",
    "start-position" : 646,
    "end-position" : 670,
    "concept-id" : "qAwJ_wS7_3qr",
    "matched-string" : "lyft av tunga glasskivor",
    "annotation-id" : 11
  }, {
    "preferred-label" : "Maskinoperatör, mekanisk verkstad",
    "type" : "occupation-name",
    "start-position" : 963,
    "end-position" : 977,
    "concept-id" : "Z4Tt_Gwt_NGP",
    "matched-string" : "maskinoperatör",
    "annotation-id" : 12
  }, {
    "preferred-label" : "Fräsning, konventionell maskin",
    "sentiment" : "MUST_HAVE",
    "type" : "skill",
    "start-position" : 1021,
    "end-position" : 1025,
    "concept-id" : "ZqZp_rib_2PF",
    "matched-string" : "fräs",
    "annotation-id" : 13
  }, {
    "preferred-label" : "Svarvning, konventionell maskin",
    "sentiment" : "MUST_HAVE",
    "type" : "skill",
    "start-position" : 1027,
    "end-position" : 1032,
    "concept-id" : "EGCS_78o_x3F",
    "matched-string" : "svarv",
    "annotation-id" : 14
  }, {
    "preferred-label" : null,
    "sentiment" : "MUST_HAVE",
    "type" : "skill",
    "start-position" : 1034,
    "end-position" : 1037,
    "concept-id" : null,
    "matched-string" : "NCC",
    "annotation-id" : 15
  }, {
    "preferred-label" : null,
    "sentiment" : "NICE_TO_HAVE",
    "type" : "skill",
    "start-position" : 1076,
    "end-position" : 1110,
    "concept-id" : null,
    "matched-string" : "jobbat inom glasbranschen tidigare",
    "annotation-id" : 16
  }, {
    "preferred-label" : "lyfta tunga föremål",
    "sentiment" : "MUST_HAVE",
    "type" : "esco-skill",
    "start-position" : 1151,
    "end-position" : 1161,
    "concept-id" : "qAwJ_wS7_3qr",
    "matched-string" : "tunga lyft",
    "annotation-id" : 17
  }, {
    "preferred-label" : "arbeta självständigt",
    "sentiment" : "MUST_HAVE",
    "type" : "esco-skill",
    "start-position" : 1209,
    "end-position" : 1221,
    "concept-id" : "NyFu_HHd_zhz",
    "matched-string" : "självständig",
    "annotation-id" : 18
  }, {
    "preferred-label" : "noggrannhet",
    "sentiment" : "MUST_HAVE",
    "type" : "esco-skill",
    "start-position" : 1252,
    "end-position" : 1260,
    "concept-id" : "mrsW_EkL_KRD",
    "matched-string" : "noggrant",
    "annotation-id" : 19
  }, {
    "preferred-label" : "Svenska",
    "sentiment" : "MUST_HAVE",
    "type" : "language",
    "start-position" : 1290,
    "end-position" : 1297,
    "concept-id" : "zSLA_vw2_FXN",
    "matched-string" : "svenska",
    "annotation-id" : 0
  }, {
    "preferred-label" : "Truckvana",
    "sentiment" : "NICE_TO_HAVE",
    "type" : "skill",
    "start-position" : 1323,
    "end-position" : 1332,
    "concept-id" : "pGts_PKK_c8W",
    "matched-string" : "truckkort",
    "annotation-id" : 20
  }, {
    "preferred-label" : "Traverskörning",
    "sentiment" : "NICE_TO_HAVE",
    "type" : "skill",
    "start-position" : 1343,
    "end-position" : 1354,
    "concept-id" : "LhvF_NZc_r6N",
    "matched-string" : "traverskort",
    "annotation-id" : 21
  } ],
  "text" : "Vår kund inom glasindustrin söker en maskinoperatör\nOm företaget\nVi söker nu en maskinoperatör/slipare till vår kund som är ledande inom glasindustrin med säte i Göteborg. Tjänsten är ett 6 månaders konsultuppdrag, med goda chanser att bli överrekryterad till kund därefter. Vår kund söker dig som har tidigare erfarenhet som maskinoperatör, trivs med att jobba självständigt och är öppen för nya utmaningar. \n\nLåter detta som något för dig? Läs vidare och sök tjänsten redan idag!\n\nDina arbetsuppgifter\nSom maskinoperatör/slipare hos vår kund kommer en central arbetsuppgift vara att övervaka maskiner som slipar glasrutor. Arbetet kan innebära lyft av tunga glasskivor. Det kommer vara ditt och en kollegas ansvar att se till att glasskivor slipas enligt order. Arbetet kommer till stor del vara självständigt. Du kommer jobba dagtid på vardagar och bli en del av ett bra team.\n\nDin profil\nFör att ta dig an denna roll ser vi att du har tidigare erfarenhet som maskinoperatör. Vi tror att du kanske även har jobbat med fräs, svarv, NCC eller enklare maskinhantering. Har du jobbat inom glasbranschen tidigare så är detta ett plus. Du har inget emot tunga lyft i arbetet. Vidare ser vi att du:\n\n•\tTrivs i en självständig roll\n•\tJobbar kvalitativt och noggrant\n•\tKommunicerar obehindrat på svenska i tal och skrift\n\nHar du truckkort och/eller traverskort så är detta meriterande. Vi söker dig som kan börja omgående, med hänsyn till eventuell uppsägningstid. \n\n\nOm oss\nDenna rekrytering sker i samarbete med rekryterings- och bemanningsföretaget Söder & Co. Söder & Co är ett auktoriserat rekryterings- och bemanningsföretag som har varit verksamt sedan 1999. Vi skapar karriärmöjligheter för människor och kostnadseffektivitet för företag. Vi tror på långsiktiga relationer och arbetar därför engagerat med en lokal och personlig närhet till våra kunder, konsulter och kandidater.\n\nSöder & Co ska bidra till ett inkluderande samhälle där människor utmanas, har framtidstro och känner sig delaktiga. Hos oss gör människor skillnad. Som anställd hos oss på Söder & Co arbetar du som konsult på uppdrag ute hos våra kunder. För oss är det av största vikt att du känner dig trygg i din anställning. Genom att vi är ett auktoriserat bemanningsföretag, ställer det krav på oss som arbetsgivare och det gör att du som konsult kan känna dig säker på att vi följer de kollektivavtal som är framförhandlade av parterna. Genom våra ledord långsiktighet, engagemang, enkelhet och förtroende ser vi till att du blir en trygg och nöjd medarbetare. Välkommen att bli en av oss i vårt härliga Söder & Co-team."
}