{
  "meta" : {
    "dataset-id" : "myh-spreadsheet-2021",
    "type" : "education-description",
    "dataset-document-id" : "YH00696",
    "user" : "hannes"
  },
  "sha1" : "44869c5e4c9440d21166f3a89d19a6954d4cd0b5",
  "annotations" : [ {
    "preferred-label" : "Försäkringsrådgivare/Försäkringssäljare",
    "sentiment" : "OFFERED",
    "type" : "occupation-name",
    "start-position" : 13,
    "end-position" : 33,
    "concept-id" : "1oPB_E5L_n8e",
    "matched-string" : "försäkringsrådgivare",
    "annotation-id" : 0
  }, {
    "preferred-label" : "Skadereglerare",
    "sentiment" : "OFFERED",
    "type" : "occupation-name",
    "start-position" : 34,
    "end-position" : 48,
    "concept-id" : "4HnZ_K23_35y",
    "matched-string" : "skadereglerare",
    "annotation-id" : 1
  }, {
    "preferred-label" : "Riskbedömare",
    "sentiment" : "OFFERED",
    "type" : "occupation-name",
    "start-position" : 49,
    "end-position" : 61,
    "concept-id" : "FBaw_Y6d_74f",
    "matched-string" : "riskbedömare",
    "annotation-id" : 2
  }, {
    "preferred-label" : "Försäkringsrådgivare/Försäkringssäljare",
    "sentiment" : "NOT_RELEVANT",
    "type" : "occupation-name",
    "start-position" : 188,
    "end-position" : 208,
    "concept-id" : "1oPB_E5L_n8e",
    "matched-string" : "försäkringsrådgivare",
    "annotation-id" : 3
  }, {
    "preferred-label" : "Skadereglerare",
    "sentiment" : "NOT_RELEVANT",
    "type" : "occupation-name",
    "start-position" : 310,
    "end-position" : 324,
    "concept-id" : "4HnZ_K23_35y",
    "matched-string" : "skadereglerare",
    "annotation-id" : 4
  }, {
    "preferred-label" : "Riskbedömare",
    "sentiment" : "NOT_RELEVANT",
    "type" : "occupation-name",
    "start-position" : 383,
    "end-position" : 395,
    "concept-id" : "FBaw_Y6d_74f",
    "matched-string" : "riskbedömare",
    "annotation-id" : 5
  }, {
    "preferred-label" : "Underwriter",
    "sentiment" : "NOT_RELEVANT",
    "type" : "occupation-name",
    "start-position" : 397,
    "end-position" : 408,
    "concept-id" : "bXhQ_wQa_GE7",
    "matched-string" : "underwriter",
    "annotation-id" : 6
  }, {
    "preferred-label" : "Försäkringsförmedlare/Försäkringsmäklare",
    "sentiment" : "NOT_RELEVANT",
    "type" : "occupation-name",
    "start-position" : 899,
    "end-position" : 920,
    "concept-id" : "nGhU_Rre_m4P",
    "matched-string" : "försäkringsförmedlare",
    "annotation-id" : 7
  }, {
    "preferred-label" : "Administratör/Administrativ assistent",
    "sentiment" : "NOT_RELEVANT",
    "type" : "occupation-name",
    "start-position" : 980,
    "end-position" : 993,
    "concept-id" : "s5pR_WNm_R8W",
    "matched-string" : "administratör",
    "annotation-id" : 8
  }, {
    "preferred-label" : "Skadereglerare",
    "sentiment" : "NOT_RELEVANT",
    "type" : "occupation-name",
    "start-position" : 1026,
    "end-position" : 1040,
    "concept-id" : "4HnZ_K23_35y",
    "matched-string" : "skadereglerare",
    "annotation-id" : 9
  }, {
    "preferred-label" : "Riskbedömare",
    "sentiment" : "NOT_RELEVANT",
    "type" : "occupation-name",
    "start-position" : 1045,
    "end-position" : 1057,
    "concept-id" : "FBaw_Y6d_74f",
    "matched-string" : "riskbedömare",
    "annotation-id" : 10
  }, {
    "preferred-label" : "Underwriter",
    "sentiment" : "NOT_RELEVANT",
    "type" : "occupation-name",
    "start-position" : 1058,
    "end-position" : 1069,
    "concept-id" : "bXhQ_wQa_GE7",
    "matched-string" : "underwriter",
    "annotation-id" : 11
  }, {
    "preferred-label" : "Finansiering",
    "sentiment" : "NOT_RELEVANT",
    "type" : "skill",
    "start-position" : 1136,
    "end-position" : 1148,
    "concept-id" : "cRLv_eAB_8eH",
    "matched-string" : "finansiering",
    "annotation-id" : 12
  }, {
    "preferred-label" : "Stockholm",
    "sentiment" : "NOT_RELEVANT",
    "type" : "municipality",
    "start-position" : 1237,
    "end-position" : 1246,
    "concept-id" : "AvNB_uwa_6n6",
    "matched-string" : "Stockholm",
    "annotation-id" : 19
  }, {
    "preferred-label" : "Säljare",
    "sentiment" : "OFFERED",
    "type" : "keyword",
    "start-position" : 1442,
    "end-position" : 1449,
    "concept-id" : "rDcj_Tao_TJJ",
    "matched-string" : "säljare",
    "annotation-id" : 13
  }, {
    "preferred-label" : "Försäkringsförmedlare/Försäkringsmäklare",
    "sentiment" : "OFFERED",
    "type" : "occupation-name",
    "start-position" : 1634,
    "end-position" : 1657,
    "concept-id" : "nGhU_Rre_m4P",
    "matched-string" : "Försäkringsförmedlarens",
    "annotation-id" : 20
  }, {
    "preferred-label" : "Risk management",
    "sentiment" : "OFFERED",
    "type" : "skill",
    "start-position" : 1675,
    "end-position" : 1690,
    "concept-id" : "bHQT_Bhn_w3S",
    "matched-string" : "risk management",
    "annotation-id" : 14
  }, {
    "preferred-label" : "Ekonomi",
    "sentiment" : "OFFERED",
    "type" : "keyword",
    "start-position" : 2085,
    "end-position" : 2092,
    "concept-id" : "PW4f_bmT_new",
    "matched-string" : "ekonomi",
    "annotation-id" : 15
  }, {
    "preferred-label" : "Engelska",
    "sentiment" : "OFFERED",
    "type" : "sun-education-field-4",
    "start-position" : 2094,
    "end-position" : 2102,
    "concept-id" : "wC9s_urg_8jY",
    "matched-string" : "engelska",
    "annotation-id" : 16
  }, {
    "preferred-label" : "Juridik",
    "sentiment" : "OFFERED",
    "type" : "keyword",
    "start-position" : 2176,
    "end-position" : 2183,
    "concept-id" : "Z9ZH_7XU_Kkb",
    "matched-string" : "juridik",
    "annotation-id" : 17
  }, {
    "preferred-label" : "Risk management",
    "sentiment" : "OFFERED",
    "type" : "skill",
    "start-position" : 2351,
    "end-position" : 2366,
    "concept-id" : "bHQT_Bhn_w3S",
    "matched-string" : "risk management",
    "annotation-id" : 18
  } ],
  "text" : "Utbildningen Försäkringsrådgivare/Skadereglerare/Riskbedömare är sedan många år etablerad och en av de viktigaste utbildningarna för den som vill göra karriär inom försäkringsområdet.  En försäkringsrådgivare arbetar med att ge privatpersoner eller företag råd när det gäller olika försäkringslösningar och en skadereglerare hanterar olika skador som den försäkrade råkat ut för. En riskbedömare, underwriter, arbetar med att bedöma risker.    Utbildningen kännetecknas av att det är marknadens mest omfattande utbildning.  Den har en integrerad praktik på ledande bolag i försäkringsbranschen. Utbildningen uppfyller Finansinspektionens teoretiska krav för att kunna bli förmedlare, som tidigare kallades mäklare.    FEI samarbetar med InsureSec och i utbildningen finns det möjlighet att mot en avgift göra InsureSecs licenstest som ett bevis på att utbildningen producerar kunniga och kompetenta försäkringsförmedlare.    Exempel på befattningar på kommande yrkesroll kan vara administratör, rådgivare, förmedlarassistent, skadereglerare och riskbedömare/underwriter.    Omfattning: 80 veckor varav 24 veckor Lärande I Arbete (LIA)  Finansiering: Avgiftsfri utbildning som berättigar till studiemedel från CSN  Var? Kammakargatan 5 i Stockholm och via FEIFLEX  Kontakt: Maila gärna frågor till oss på yh@fei.se    Utbildningens mål  Målet med utbildningen är att du efter fullgjord utbildning framgångsrikt ska kunna arbeta som rådgivare, säljare eller handläggare i försäkringsbranschen. Efter avslutad utbildning ska den studerande ha:  • kunskaper i Finansinspektionens och InsureSecs regelverk, försäkringsjuridiska regelverk, Försäkringsförmedlarens roll och ansvar, Risk Management och skadereglering  • färdigheter att utreda kunders risksituation och försäkringsbehov samt presentera förslag på lämpliga försäkringslösningar  • kompetenser lämna besked om vilka akuta åtgärder som bör vidtas vid skada samt utreda vilken ersättning som ska lämnas ur försäkringen  • färdigheter i att hantera administrationen vid utbetalning från liv- och pensions- försäkringar    Kurser:  Ekonomi  Engelska  Examensarbete  Försäkringsförmedlarens roll och ansvar samt compliance  Juridik  Kundkommunikation och säljteknik  Liv- och pensionsförsäkring  Liv- och pensionsförsäkring, fördjupning  Lärande i Arbete  Omvärlds- och samhällsekonomisk bevakning  Risk Management  Sakförsäkring företag  Sakförsäkring person\n"
}