{
  "meta" : {
    "jobad" : {
      "description" : {
        "requirements" : null,
        "needs" : null,
        "company_information" : null,
        "text_formatted" : "<p>We are searching for a sushi chef that will complete our brigade, right now we are searching for one chef and we can provide living accomidation to the job</p><p id=\"oppenforalla\">Öppen för alla\nVi fokuserar på din kompetens, inte dina övriga förutsättningar. Vi är öppna för att anpassa rollen eller arbetsplatsen efter dina behov.</p>",
        "conditions" : null,
        "text" : "We are searching for a sushi chef that will complete our brigade, right now we are searching for one chef and we can provide living accomidation to the job\nÖppen för alla\nVi fokuserar på din kompetens, inte dina övriga förutsättningar. Vi är öppna för att anpassa rollen eller arbetsplatsen efter dina behov."
      },
      "headline" : "Sushi kock",
      "driving_license" : null,
      "employer" : {
        "email" : null,
        "phone_number" : null,
        "organization_number" : "5567373393",
        "name" : "Yinjer AB",
        "url" : null,
        "workplace" : "Yinjer AB"
      },
      "removed_date" : null,
      "logo_url" : null,
      "last_publication_date" : "2022-08-18T00:00:00",
      "number_of_vacancies" : 1,
      "occupation" : {
        "concept_id" : "JbJw_as4_S93",
        "label" : "Kock, à la carte",
        "legacy_ams_taxonomy_id" : "7663"
      },
      "occupation_group" : {
        "concept_id" : "BStc_SJh_DKG",
        "label" : "Kockar och kallskänkor",
        "legacy_ams_taxonomy_id" : "5120"
      },
      "employment_type" : {
        "concept_id" : "PFZr_Syz_cUq",
        "label" : "Vanlig anställning",
        "legacy_ams_taxonomy_id" : "1"
      },
      "webpage_url" : "https://arbetsformedlingen.se/platsbanken/annonser/26378751",
      "driving_license_required" : false,
      "application_contacts" : [ ],
      "duration" : {
        "concept_id" : "qQUd_4qe_NDT",
        "label" : "6 månader eller längre",
        "legacy_ams_taxonomy_id" : "2"
      },
      "nice_to_have" : {
        "education_level" : [ ],
        "work_experiences" : [ {
          "concept_id" : "JbJw_as4_S93",
          "weight" : 5,
          "label" : "Kock, à la carte",
          "legacy_ams_taxonomy_id" : "7663"
        } ],
        "skills" : [ ],
        "education" : [ ],
        "languages" : [ {
          "concept_id" : "NVxJ_hLg_TYS",
          "weight" : 5,
          "label" : "Engelska",
          "legacy_ams_taxonomy_id" : "283"
        }, {
          "concept_id" : "pgjM_8KQ_RZT",
          "weight" : 5,
          "label" : "Kinesiska",
          "legacy_ams_taxonomy_id" : "339"
        }, {
          "concept_id" : "zSLA_vw2_FXN",
          "weight" : 5,
          "label" : "Svenska",
          "legacy_ams_taxonomy_id" : "502"
        } ]
      },
      "application_details" : {
        "via_af" : false,
        "email" : "sammurai.se@hotmail.com",
        "other" : null,
        "reference" : null,
        "url" : null,
        "information" : null
      },
      "source_type" : "VIA_ANNONSERA",
      "application_deadline" : "2022-08-18T00:00:00",
      "external_id" : null,
      "workplace_address" : {
        "coordinates" : [ 14.639301517166968, 63.17580326947448 ],
        "city" : "Östersund",
        "postcode" : "83134",
        "municipality" : "Östersund",
        "region_concept_id" : "65Ms_7r1_RTG",
        "region" : "Jämtlands län",
        "country_code" : "199",
        "region_code" : "23",
        "municipality_concept_id" : "Vt7P_856_WZS",
        "country_concept_id" : "i46j_HmG_v64",
        "municipality_code" : "2380",
        "street_address" : "Gustav III:s Torg 2",
        "country" : "Sverige"
      },
      "id" : "26378751",
      "experience_required" : true,
      "working_hours_type" : {
        "concept_id" : "6YE1_gAC_R2G",
        "label" : "Heltid",
        "legacy_ams_taxonomy_id" : "1"
      },
      "access" : null,
      "timestamp" : 1659621270266,
      "must_have" : {
        "education_level" : [ ],
        "work_experiences" : [ ],
        "skills" : [ ],
        "education" : [ ],
        "languages" : [ ]
      },
      "occupation_field" : {
        "concept_id" : "ScKy_FHB_7wT",
        "label" : "Hotell, restaurang, storhushåll",
        "legacy_ams_taxonomy_id" : "7"
      },
      "scope_of_work" : {
        "min" : 0,
        "max" : 100
      },
      "salary_type" : {
        "concept_id" : "oG8G_9cW_nRf",
        "label" : "Fast månads- vecko- eller timlön",
        "legacy_ams_taxonomy_id" : "1"
      },
      "removed" : false,
      "salary_description" : null,
      "access_to_own_car" : false,
      "publication_date" : "2022-08-04T15:54:30"
    },
    "name" : "Sushi kock",
    "user" : "hannes"
  },
  "sha1" : "6bb888819d8670d37c3359f2080c72c26e6e50e4",
  "annotations" : [ {
    "preferred-label" : "Sushikock",
    "type" : "keyword",
    "start-position" : 0,
    "end-position" : 10,
    "concept-id" : "YYSm_Pv3_znL",
    "matched-string" : "Sushi kock",
    "annotation-id" : 4
  }, {
    "preferred-label" : "Sushikock",
    "type" : "keyword",
    "start-position" : 34,
    "end-position" : 44,
    "concept-id" : "YYSm_Pv3_znL",
    "matched-string" : "sushi chef",
    "annotation-id" : 5
  } ],
  "text" : "Sushi kock\nWe are searching for a sushi chef that will complete our brigade, right now we are searching for one chef and we can provide living accomidation to the job\nÖppen för alla\nVi fokuserar på din kompetens, inte dina övriga förutsättningar. Vi är öppna för att anpassa rollen eller arbetsplatsen efter dina behov."
}