{
  "meta" : {
    "jobad" : {
      "description" : {
        "requirements" : null,
        "needs" : null,
        "company_information" : null,
        "text_formatted" : "Utvecklare Magento till eComero\nNyfiken på att lära dig jobba i en av världens ledande lösningar, tillsammans med utvecklare från Microsoft och Adobe?\n\nVälkommen att göra avtryck inom e-commerce hos eComero!\n\nArbetsbeskrivning\nSom systemutvecklare hos eComero tar du plats i en fartfylld och entreprenörsdriven miljö, där du kan utvecklas både själv och tillsammans med ett fantastiskt kompetent och kunnigt team.\n\nI rollen som systemutvecklare inom e-commerce arbetar du bland annat med att utveckla mjukvara och webbapplikationer, analysera och uppdatera existerande mjukvara, samt designa skalbar och testbar kod. Du hittar och eliminerar buggar som om du aldrig gjort något annat.\n\nHos oss driver du utvecklingsuppdrag från start till mål, samt arbetar tillsammans med team och projektledare i större projekt och uppdrag. Arbetet innefattar både front-end och back-end, med fokus på back-end. Här kommer du att utveckla system med de senaste teknikerna inom cloud och webbutveckling.\n\neComero är en Officiell Magento Business Solution Partner, och vi ger dig även möjligheten att certifiera dig. Tillsammans håller vi alltid en hög lägstanivå och går i god för vår kvalitet mot kund!\n\nLär känna eComero\nGrundat av två entreprenörer med 20års erfarenhet av e-handel, och sedan 2019 partner till Adobe och Microsoft. Vi har haft en fantastisk tillväxt med många spännande konton som vi jobbar mot. På vårt kontor i Göteborg sker allt utvecklingsarbete - men våra kunder befinner sig i hela Sverige. Vi levererar de e-handels- och affärssystem som kunderna använder för att sälja för hundratals miljoner över hela världen, och de är beroende av vår tekniska expertis för att lyckas. Många av våra kunder är välkända e-handelsföretag, så vi har höga krav på oss att leverera enligt bästa praxis.\n\neComero är ett entreprenörsdrivet företag med senior kompetens och know-how i e-handelsbranschen.\nDet betyder att du kan gå hur långt som helst om du har vilja, kompetens och uthållighet.\n\nVill du sätta avtryck i e-handelsvärlden? Välkommen till Göteborg!\n\nBesök eComero på webben:\nwww.ecomero.com (http://www.ecomero.com)\n\nDu som Utvecklare\nFör att lyckas och trivas i rollen känner du sannolikt igen dig i beskrivningen av en noggrann och strukturerad analytiker som ser möjligheter, men även begränsningar och skapar lösningar för allt du får framför dig. Dina kollegor uppskattar att ha dig som en del av teamet och du bidrar med såväl god energi som ett driv att utveckla och utvecklas.\n\nDu värdesätter att kunna lära dig nya saker i ditt arbete och att arbeta agilt.\n\nFör rollen ser vi gärna att du har eftergymnasial utbildning inom IT.\nDu bör ha erfarenhet av Linux-system, PHP och MySQL, och gärna även inom just området e-handel.\n\nSammanfattning\nFör rollen krävs:\n Eftergymnasial utbildning inom IT\n Linux\n PHP\n MySQL\n God svenska och engelska\n\nMeriterande erfarenheter:\n Magento 2 (Adobe Commerce)\n React (Next.js, Material UI)\n CSS, HTML\n Versionshantering (Git)\n Nginx\n\nVälkommen till eComero!\n\nTjänsten\nFast anställning, tills vidare.\nStart omgående enligt överenskommelse.\n\nOrt\nGöteborg\n\nDin ansökan\nAnsöker gör du med CV och personligt brev.\nVi ser fram emot att få lära känna dig närmre.\n\nOm du har frågor om ansökan kan du kontakta\nKitty Frejd, 0733 - 40 43 30 eller maila till kitty@engqvistzimmerman.se\n\nMed anledning av GDPR tar vi inte emot ansökningar via mail.\n\nTidsplan\nVi vill ha din ansökan så fort som möjligt då ansökningar hanteras löpande.\n\nVarmt välkommen med din ansökan! ",
        "conditions" : "Heltid\r\nAnställningstid enligt överenskommelse",
        "text" : "Utvecklare Magento till eComero\nNyfiken på att lära dig jobba i en av världens ledande lösningar, tillsammans med utvecklare från Microsoft och Adobe?\n\nVälkommen att göra avtryck inom e-commerce hos eComero!\n\nArbetsbeskrivning\nSom systemutvecklare hos eComero tar du plats i en fartfylld och entreprenörsdriven miljö, där du kan utvecklas både själv och tillsammans med ett fantastiskt kompetent och kunnigt team.\n\nI rollen som systemutvecklare inom e-commerce arbetar du bland annat med att utveckla mjukvara och webbapplikationer, analysera och uppdatera existerande mjukvara, samt designa skalbar och testbar kod. Du hittar och eliminerar buggar som om du aldrig gjort något annat.\n\nHos oss driver du utvecklingsuppdrag från start till mål, samt arbetar tillsammans med team och projektledare i större projekt och uppdrag. Arbetet innefattar både front-end och back-end, med fokus på back-end. Här kommer du att utveckla system med de senaste teknikerna inom cloud och webbutveckling.\n\neComero är en Officiell Magento Business Solution Partner, och vi ger dig även möjligheten att certifiera dig. Tillsammans håller vi alltid en hög lägstanivå och går i god för vår kvalitet mot kund!\n\nLär känna eComero\nGrundat av två entreprenörer med 20års erfarenhet av e-handel, och sedan 2019 partner till Adobe och Microsoft. Vi har haft en fantastisk tillväxt med många spännande konton som vi jobbar mot. På vårt kontor i Göteborg sker allt utvecklingsarbete - men våra kunder befinner sig i hela Sverige. Vi levererar de e-handels- och affärssystem som kunderna använder för att sälja för hundratals miljoner över hela världen, och de är beroende av vår tekniska expertis för att lyckas. Många av våra kunder är välkända e-handelsföretag, så vi har höga krav på oss att leverera enligt bästa praxis.\n\neComero är ett entreprenörsdrivet företag med senior kompetens och know-how i e-handelsbranschen.\nDet betyder att du kan gå hur långt som helst om du har vilja, kompetens och uthållighet.\n\nVill du sätta avtryck i e-handelsvärlden? Välkommen till Göteborg!\n\nBesök eComero på webben:\nwww.ecomero.com (http://www.ecomero.com)\n\nDu som Utvecklare\nFör att lyckas och trivas i rollen känner du sannolikt igen dig i beskrivningen av en noggrann och strukturerad analytiker som ser möjligheter, men även begränsningar och skapar lösningar för allt du får framför dig. Dina kollegor uppskattar att ha dig som en del av teamet och du bidrar med såväl god energi som ett driv att utveckla och utvecklas.\n\nDu värdesätter att kunna lära dig nya saker i ditt arbete och att arbeta agilt.\n\nFör rollen ser vi gärna att du har eftergymnasial utbildning inom IT.\nDu bör ha erfarenhet av Linux-system, PHP och MySQL, och gärna även inom just området e-handel.\n\nSammanfattning\nFör rollen krävs:\n Eftergymnasial utbildning inom IT\n Linux\n PHP\n MySQL\n God svenska och engelska\n\nMeriterande erfarenheter:\n Magento 2 (Adobe Commerce)\n React (Next.js, Material UI)\n CSS, HTML\n Versionshantering (Git)\n Nginx\n\nVälkommen till eComero!\n\nTjänsten\nFast anställning, tills vidare.\nStart omgående enligt överenskommelse.\n\nOrt\nGöteborg\n\nDin ansökan\nAnsöker gör du med CV och personligt brev.\nVi ser fram emot att få lära känna dig närmre.\n\nOm du har frågor om ansökan kan du kontakta\nKitty Frejd, 0733 - 40 43 30 eller maila till kitty@engqvistzimmerman.se\n\nMed anledning av GDPR tar vi inte emot ansökningar via mail.\n\nTidsplan\nVi vill ha din ansökan så fort som möjligt då ansökningar hanteras löpande.\n\nVarmt välkommen med din ansökan!"
      },
      "headline" : "Utvecklare Magento till eComero",
      "driving_license" : null,
      "employer" : {
        "email" : null,
        "phone_number" : null,
        "organization_number" : "5591606370",
        "name" : "Engqvist & Zimmerman HR Partner AB",
        "url" : "https://www.engqvistzimmerman.se",
        "workplace" : "Engqvist & Zimmerman HR Partner "
      },
      "removed_date" : null,
      "logo_url" : "https://www.arbetsformedlingen.se/rest/arbetsgivare/rest/af/v3/organisation/5591606370/logotyper/logo.png",
      "last_publication_date" : "2022-08-31T23:59:59",
      "number_of_vacancies" : 1,
      "occupation" : {
        "concept_id" : "fg7B_yov_smw",
        "label" : "Systemutvecklare/Programmerare",
        "legacy_ams_taxonomy_id" : "2419"
      },
      "occupation_group" : {
        "concept_id" : "DJh5_yyF_hEM",
        "label" : "Mjukvaru- och systemutvecklare m.fl.",
        "legacy_ams_taxonomy_id" : "2512"
      },
      "employment_type" : {
        "concept_id" : "PFZr_Syz_cUq",
        "label" : "Vanlig anställning",
        "legacy_ams_taxonomy_id" : "1"
      },
      "webpage_url" : "https://arbetsformedlingen.se/platsbanken/annonser/26383226",
      "driving_license_required" : false,
      "application_contacts" : [ {
        "description" : "Kitty Frejd",
        "email" : "kitty@engqvistzimmerman.se",
        "telephone" : "0733 40 43 30",
        "name" : null,
        "contact_type" : null
      } ],
      "duration" : {
        "concept_id" : "a7uU_j21_mkL",
        "label" : "Tills vidare",
        "legacy_ams_taxonomy_id" : "1"
      },
      "nice_to_have" : {
        "education_level" : [ ],
        "work_experiences" : [ ],
        "skills" : [ ],
        "education" : [ ],
        "languages" : [ ]
      },
      "application_details" : {
        "via_af" : false,
        "email" : null,
        "other" : null,
        "reference" : null,
        "url" : "https://jobb.engqvistzimmerman.se/jobs/1695906-utvecklare-magento-till-ecomero?promotion=387677-arbetsformedlingen",
        "information" : null
      },
      "source_type" : "VIA_PLATSBANKEN_DXA",
      "application_deadline" : "2022-08-31T23:59:59",
      "external_id" : "46-559160-6370-1695906-4",
      "workplace_address" : {
        "coordinates" : [ 11.97456, 57.70887 ],
        "city" : null,
        "postcode" : null,
        "municipality" : "Göteborg",
        "region_concept_id" : "zdoY_6u5_Krt",
        "region" : "Västra Götalands län",
        "country_code" : "199",
        "region_code" : "14",
        "municipality_concept_id" : "PVZL_BQT_XtL",
        "country_concept_id" : "i46j_HmG_v64",
        "municipality_code" : "1480",
        "street_address" : null,
        "country" : "Sverige"
      },
      "id" : "26383226",
      "experience_required" : true,
      "working_hours_type" : {
        "concept_id" : "6YE1_gAC_R2G",
        "label" : "Heltid",
        "legacy_ams_taxonomy_id" : "1"
      },
      "access" : null,
      "timestamp" : 1659936537338,
      "must_have" : {
        "education_level" : [ ],
        "work_experiences" : [ {
          "concept_id" : "fg7B_yov_smw",
          "weight" : 10,
          "label" : "Systemutvecklare/Programmerare",
          "legacy_ams_taxonomy_id" : "2419"
        } ],
        "skills" : [ ],
        "education" : [ ],
        "languages" : [ ]
      },
      "occupation_field" : {
        "concept_id" : "apaJ_2ja_LuF",
        "label" : "Data/IT",
        "legacy_ams_taxonomy_id" : "3"
      },
      "scope_of_work" : {
        "min" : 100,
        "max" : 100
      },
      "salary_type" : {
        "concept_id" : "oG8G_9cW_nRf",
        "label" : "Fast månads- vecko- eller timlön",
        "legacy_ams_taxonomy_id" : "1"
      },
      "removed" : false,
      "salary_description" : "Lön enligt överenskommelse",
      "access_to_own_car" : false,
      "publication_date" : "2022-08-08T07:28:57"
    },
    "name" : "Utvecklare Magento till eComero",
    "user" : "kristof.fischer"
  },
  "sha1" : "82c1e2cc2d8419815d4d6fe20828d2434b242b50",
  "annotations" : [ {
    "preferred-label" : "Systemutvecklare/Programmerare",
    "type" : "occupation-name",
    "start-position" : 0,
    "end-position" : 10,
    "concept-id" : "fg7B_yov_smw",
    "matched-string" : "Utvecklare",
    "annotation-id" : 25
  }, {
    "preferred-label" : "Systemutvecklare/Programmerare",
    "type" : "occupation-name",
    "start-position" : 32,
    "end-position" : 42,
    "concept-id" : "fg7B_yov_smw",
    "matched-string" : "Utvecklare",
    "annotation-id" : 26
  }, {
    "preferred-label" : "Systemutvecklare/Programmerare",
    "sentiment" : "MUST_HAVE",
    "type" : "occupation-name",
    "start-position" : 263,
    "end-position" : 279,
    "concept-id" : "fg7B_yov_smw",
    "matched-string" : "systemutvecklare",
    "annotation-id" : 0
  }, {
    "preferred-label" : "Systemutvecklare/Programmerare",
    "sentiment" : "MUST_HAVE",
    "type" : "occupation-name",
    "start-position" : 460,
    "end-position" : 476,
    "concept-id" : "fg7B_yov_smw",
    "matched-string" : "systemutvecklare",
    "annotation-id" : 1
  }, {
    "preferred-label" : "Göteborg",
    "type" : "municipality",
    "start-position" : 1449,
    "end-position" : 1457,
    "concept-id" : "PVZL_BQT_XtL",
    "matched-string" : "Göteborg",
    "annotation-id" : 27
  }, {
    "preferred-label" : "Sverige",
    "type" : "country",
    "start-position" : 1524,
    "end-position" : 1531,
    "concept-id" : "i46j_HmG_v64",
    "matched-string" : "Sverige",
    "annotation-id" : 28
  }, {
    "preferred-label" : "Göteborg",
    "type" : "municipality",
    "start-position" : 2075,
    "end-position" : 2083,
    "concept-id" : "PVZL_BQT_XtL",
    "matched-string" : "Göteborg",
    "annotation-id" : 29
  }, {
    "preferred-label" : "noggrannhet",
    "sentiment" : "MUST_HAVE",
    "type" : "esco-skill",
    "start-position" : 2257,
    "end-position" : 2265,
    "concept-id" : "mrsW_EkL_KRD",
    "matched-string" : "noggrann",
    "annotation-id" : 30
  }, {
    "preferred-label" : "Eftergymnasial utbildning",
    "sentiment" : "MUST_HAVE",
    "type" : "sni-level-3",
    "start-position" : 2638,
    "end-position" : 2663,
    "concept-id" : "bg6r_KVf_KNN",
    "matched-string" : "eftergymnasial utbildning",
    "annotation-id" : 8
  }, {
    "preferred-label" : "Data/IT",
    "sentiment" : "MUST_HAVE",
    "type" : "occupation-field",
    "start-position" : 2669,
    "end-position" : 2671,
    "concept-id" : "apaJ_2ja_LuF",
    "matched-string" : "it",
    "annotation-id" : 9
  }, {
    "preferred-label" : "Linux, operativsystem",
    "sentiment" : "MUST_HAVE",
    "type" : "skill",
    "start-position" : 2697,
    "end-position" : 2702,
    "concept-id" : "z52H_f4y_4ZA",
    "matched-string" : "linux",
    "annotation-id" : 10
  }, {
    "preferred-label" : "PHP, programmeringsspråk",
    "sentiment" : "MUST_HAVE",
    "type" : "skill",
    "start-position" : 2711,
    "end-position" : 2714,
    "concept-id" : "e4tA_b22_rfY",
    "matched-string" : "php",
    "annotation-id" : 11
  }, {
    "preferred-label" : "MySQL, databashanterare",
    "sentiment" : "MUST_HAVE",
    "type" : "skill",
    "start-position" : 2719,
    "end-position" : 2724,
    "concept-id" : "Egmd_U5i_sRA",
    "matched-string" : "mysql",
    "annotation-id" : 12
  }, {
    "preferred-label" : "e-handelssystem",
    "sentiment" : "MUST_HAVE",
    "type" : "esco-skill",
    "start-position" : 2759,
    "end-position" : 2767,
    "concept-id" : "YLA4_7bs_vpX",
    "matched-string" : "e-handel",
    "annotation-id" : 13
  }, {
    "preferred-label" : "Eftergymnasial utbildning",
    "sentiment" : "MUST_HAVE",
    "type" : "sni-level-3",
    "start-position" : 2804,
    "end-position" : 2829,
    "concept-id" : "bg6r_KVf_KNN",
    "matched-string" : "eftergymnasial utbildning",
    "annotation-id" : 14
  }, {
    "preferred-label" : "Data/IT",
    "sentiment" : "MUST_HAVE",
    "type" : "occupation-field",
    "start-position" : 2835,
    "end-position" : 2837,
    "concept-id" : "apaJ_2ja_LuF",
    "matched-string" : "it",
    "annotation-id" : 15
  }, {
    "preferred-label" : "Linux, operativsystem",
    "sentiment" : "MUST_HAVE",
    "type" : "skill",
    "start-position" : 2839,
    "end-position" : 2844,
    "concept-id" : "z52H_f4y_4ZA",
    "matched-string" : "linux",
    "annotation-id" : 16
  }, {
    "preferred-label" : "PHP, programmeringsspråk",
    "sentiment" : "MUST_HAVE",
    "type" : "skill",
    "start-position" : 2846,
    "end-position" : 2849,
    "concept-id" : "e4tA_b22_rfY",
    "matched-string" : "php",
    "annotation-id" : 17
  }, {
    "preferred-label" : "MySQL",
    "sentiment" : "MUST_HAVE",
    "type" : "esco-skill",
    "start-position" : 2851,
    "end-position" : 2856,
    "concept-id" : "eF8Z_oLZ_mgy",
    "matched-string" : "mysql",
    "annotation-id" : 18
  }, {
    "preferred-label" : "Svenska",
    "sentiment" : "MUST_HAVE",
    "type" : "language",
    "start-position" : 2862,
    "end-position" : 2869,
    "concept-id" : "zSLA_vw2_FXN",
    "matched-string" : "svenska",
    "annotation-id" : 19
  }, {
    "preferred-label" : "Engelska",
    "sentiment" : "MUST_HAVE",
    "type" : "language",
    "start-position" : 2874,
    "end-position" : 2882,
    "concept-id" : "NVxJ_hLg_TYS",
    "matched-string" : "engelska",
    "annotation-id" : 20
  }, {
    "preferred-label" : null,
    "sentiment" : "NICE_TO_HAVE",
    "type" : "skill",
    "start-position" : 2911,
    "end-position" : 2920,
    "concept-id" : null,
    "matched-string" : "Magento 2",
    "annotation-id" : 31
  }, {
    "preferred-label" : "React native, programmeringsspråk",
    "sentiment" : "NICE_TO_HAVE",
    "type" : "skill",
    "start-position" : 2939,
    "end-position" : 2944,
    "concept-id" : "TdnY_1gB_9pZ",
    "matched-string" : "React",
    "annotation-id" : 32
  }, {
    "preferred-label" : null,
    "sentiment" : "NICE_TO_HAVE",
    "type" : "skill",
    "start-position" : 2946,
    "end-position" : 2953,
    "concept-id" : null,
    "matched-string" : "Next.js",
    "annotation-id" : 33
  }, {
    "preferred-label" : null,
    "sentiment" : "NICE_TO_HAVE",
    "type" : "skill",
    "start-position" : 2955,
    "end-position" : 2966,
    "concept-id" : null,
    "matched-string" : "Material UI",
    "annotation-id" : 34
  }, {
    "preferred-label" : "CSS, programmeringsspråk",
    "sentiment" : "NICE_TO_HAVE",
    "type" : "skill",
    "start-position" : 2969,
    "end-position" : 2972,
    "concept-id" : "euH8_yAp_hiG",
    "matched-string" : "css",
    "annotation-id" : 21
  }, {
    "preferred-label" : "HTML, programmeringsspråk",
    "sentiment" : "NICE_TO_HAVE",
    "type" : "skill",
    "start-position" : 2974,
    "end-position" : 2978,
    "concept-id" : "K8eq_sEz_eXV",
    "matched-string" : "html",
    "annotation-id" : 22
  }, {
    "preferred-label" : "Git, versionshanteringssystem",
    "sentiment" : "NICE_TO_HAVE",
    "type" : "skill",
    "start-position" : 2999,
    "end-position" : 3002,
    "concept-id" : "2REh_Drn_nsh",
    "matched-string" : "git",
    "annotation-id" : 23
  }, {
    "preferred-label" : null,
    "sentiment" : "NICE_TO_HAVE",
    "type" : "skill",
    "start-position" : 3005,
    "end-position" : 3010,
    "concept-id" : null,
    "matched-string" : "Nginx",
    "annotation-id" : 35
  }, {
    "preferred-label" : "Tillsvidareanställning (inkl. eventuell provanställning)",
    "type" : "employment-type",
    "start-position" : 3064,
    "end-position" : 3076,
    "concept-id" : "kpPX_CNN_gDU",
    "matched-string" : "tills vidare",
    "annotation-id" : 36
  }, {
    "preferred-label" : "Göteborg",
    "type" : "municipality",
    "start-position" : 3122,
    "end-position" : 3130,
    "concept-id" : "PVZL_BQT_XtL",
    "matched-string" : "Göteborg",
    "annotation-id" : 37
  } ],
  "text" : "Utvecklare Magento till eComero\nUtvecklare Magento till eComero\nNyfiken på att lära dig jobba i en av världens ledande lösningar, tillsammans med utvecklare från Microsoft och Adobe?\n\nVälkommen att göra avtryck inom e-commerce hos eComero!\n\nArbetsbeskrivning\nSom systemutvecklare hos eComero tar du plats i en fartfylld och entreprenörsdriven miljö, där du kan utvecklas både själv och tillsammans med ett fantastiskt kompetent och kunnigt team.\n\nI rollen som systemutvecklare inom e-commerce arbetar du bland annat med att utveckla mjukvara och webbapplikationer, analysera och uppdatera existerande mjukvara, samt designa skalbar och testbar kod. Du hittar och eliminerar buggar som om du aldrig gjort något annat.\n\nHos oss driver du utvecklingsuppdrag från start till mål, samt arbetar tillsammans med team och projektledare i större projekt och uppdrag. Arbetet innefattar både front-end och back-end, med fokus på back-end. Här kommer du att utveckla system med de senaste teknikerna inom cloud och webbutveckling.\n\neComero är en Officiell Magento Business Solution Partner, och vi ger dig även möjligheten att certifiera dig. Tillsammans håller vi alltid en hög lägstanivå och går i god för vår kvalitet mot kund!\n\nLär känna eComero\nGrundat av två entreprenörer med 20års erfarenhet av e-handel, och sedan 2019 partner till Adobe och Microsoft. Vi har haft en fantastisk tillväxt med många spännande konton som vi jobbar mot. På vårt kontor i Göteborg sker allt utvecklingsarbete - men våra kunder befinner sig i hela Sverige. Vi levererar de e-handels- och affärssystem som kunderna använder för att sälja för hundratals miljoner över hela världen, och de är beroende av vår tekniska expertis för att lyckas. Många av våra kunder är välkända e-handelsföretag, så vi har höga krav på oss att leverera enligt bästa praxis.\n\neComero är ett entreprenörsdrivet företag med senior kompetens och know-how i e-handelsbranschen.\nDet betyder att du kan gå hur långt som helst om du har vilja, kompetens och uthållighet.\n\nVill du sätta avtryck i e-handelsvärlden? Välkommen till Göteborg!\n\nBesök eComero på webben:\nwww.ecomero.com (http://www.ecomero.com)\n\nDu som Utvecklare\nFör att lyckas och trivas i rollen känner du sannolikt igen dig i beskrivningen av en noggrann och strukturerad analytiker som ser möjligheter, men även begränsningar och skapar lösningar för allt du får framför dig. Dina kollegor uppskattar att ha dig som en del av teamet och du bidrar med såväl god energi som ett driv att utveckla och utvecklas.\n\nDu värdesätter att kunna lära dig nya saker i ditt arbete och att arbeta agilt.\n\nFör rollen ser vi gärna att du har eftergymnasial utbildning inom IT.\nDu bör ha erfarenhet av Linux-system, PHP och MySQL, och gärna även inom just området e-handel.\n\nSammanfattning\nFör rollen krävs:\n Eftergymnasial utbildning inom IT\n Linux\n PHP\n MySQL\n God svenska och engelska\n\nMeriterande erfarenheter:\n Magento 2 (Adobe Commerce)\n React (Next.js, Material UI)\n CSS, HTML\n Versionshantering (Git)\n Nginx\n\nVälkommen till eComero!\n\nTjänsten\nFast anställning, tills vidare.\nStart omgående enligt överenskommelse.\n\nOrt\nGöteborg\n\nDin ansökan\nAnsöker gör du med CV och personligt brev.\nVi ser fram emot att få lära känna dig närmre.\n\nOm du har frågor om ansökan kan du kontakta\nKitty Frejd, 0733 - 40 43 30 eller maila till kitty@engqvistzimmerman.se\n\nMed anledning av GDPR tar vi inte emot ansökningar via mail.\n\nTidsplan\nVi vill ha din ansökan så fort som möjligt då ansökningar hanteras löpande.\n\nVarmt välkommen med din ansökan!"
}