{
  "meta" : {
    "jobad" : {
      "description" : {
        "requirements" : null,
        "needs" : null,
        "company_information" : null,
        "text_formatted" : "Förvaltningsrätten i Stockholm är en modern och utvecklingsinriktad arbetsplats med engagerade medarbetare. Verksamheten kännetecknas av hög kvalitet och effektiv handläggning, som i huvudsak sker digitalt. \n\nFörvaltningsrätten i Stockholm är landets största domstol och en av landets fyra migrationsdomstolar. Vi är ca 500 medarbetare och våra största måltyper är migrationsmål, biståndsmål, socialförsäkringsmål och skattemål. Här kan du, tillsammans med kollegor med många kompetenser och bakgrunder, utvecklas och utmanas i ditt arbete. \n\n\n\nHär gör du skillnad varje dag!\n\n\r\n\r\nArbetsbeskrivning \nVi söker en arkivarie som ska arbeta i vår arkivgrupp tillsammans med handläggarchef, arkivsamordnare, arkivarier, arkivassistenter och domstolshandläggare.\r\n\r\nSom arkivarie på domstolen arbetar du med att omhänderta, arkivera och gallra arkivhandlingar i enlighet med gällande regelverk, du kommer att hantera både pappershandlingar och digitala handlingar. Du kommer att arbeta med att uppdatera tillämpningsbeslut och rutiner samt andra styrdokument. Du kommer även att hantera förfrågningar och utlämnande av allmänna handlingar samt vara ett internt stöd i arkivfrågor. Vi har nyligen infört e-arkiv och du kommer att vara delaktig i därtill hörande frågor och i andra utvecklingsarbeten inom arkivområdet.\n\n \n\nKvalifikationer\nDu ska ha relevant akademisk utbildning som inkluderar arkiv- och informationsvetenskap med minst 40 p/60 hp.\n\nVi söker dig som har erfarenhet av arkivarbete på myndighet och har aktuella och dokumenterade kunskaper i arkiv-, offentlighets- och sekretesslagstiftningen. Du ska även vara väl insatt i Riksarkivets föreskrifter.\n\nDu har goda IT-kunskaper och erfarenhet av elektronisk informationshantering och digitalt bevarande. Det är meriterande med erfarenhet av arbete med e-arkiv. Vi ser gärna att du arbetat med framtagande av styrdokument och/eller rutindokument inom arkivområdet.\n\nSom arkivarie är du driven och prioriterar att uppnå mål och att få arbetet slutfört på ett strukturerat och noggrant sätt. Du är även lösningsorienterad, intresserad av utvecklingsarbete och att effektivisera arbetssätt. Du tar snabbt in ny kunskap och använder tidigare kunskap på ett flexibelt sätt.\n\nDu är van vid att samarbeta och förhåller dig till andra på ett öppet och accepterande sätt. Du uttrycker dig väl i tal och skrift, har gott omdöme och ser till helheten.\n\nVi fäster stor vikt vid personliga egenskaper och testning kommer därför att genomföras som ett första steg i rekryteringsprocessen.\n\n \n\nAnställning\nTillsvidareanställning, sex månaders provanställning.\n\nTillträde sker efter överenskommelse.\n\nEn anställning som arkivarie hos oss kan innebära placering i säkerhetsklass.\n\nÖvrigt\nI samband med att ansökan skickas in så bjuds du in till att genomföra tester. För att vara aktuell i denna rekryteringsprocess ska du genomföra testerna senast den 29 augusti 2022.\n\n\n\nLäs mer om Förvaltningsrätten i Stockholm: http://www.forvaltningsrattenistockholm.domstol.se/\n\n\n\nTill bemannings- och rekryteringsföretag och till dig som är försäljare:\n\nVi undanber oss vänligen men bestämt direktkontakt med bemannings- och rekryteringsföretag samt försäljare av ytterligare jobbannonser.",
        "conditions" : "100 %. Tillträde: Enligt överenskommelse\r\nProvanställning t.o.m. ",
        "text" : "Förvaltningsrätten i Stockholm är en modern och utvecklingsinriktad arbetsplats med engagerade medarbetare. Verksamheten kännetecknas av hög kvalitet och effektiv handläggning, som i huvudsak sker digitalt. \n\nFörvaltningsrätten i Stockholm är landets största domstol och en av landets fyra migrationsdomstolar. Vi är ca 500 medarbetare och våra största måltyper är migrationsmål, biståndsmål, socialförsäkringsmål och skattemål. Här kan du, tillsammans med kollegor med många kompetenser och bakgrunder, utvecklas och utmanas i ditt arbete. \n\n\n\nHär gör du skillnad varje dag!\n\n\r\n\r\nArbetsbeskrivning \nVi söker en arkivarie som ska arbeta i vår arkivgrupp tillsammans med handläggarchef, arkivsamordnare, arkivarier, arkivassistenter och domstolshandläggare.\r\n\r\nSom arkivarie på domstolen arbetar du med att omhänderta, arkivera och gallra arkivhandlingar i enlighet med gällande regelverk, du kommer att hantera både pappershandlingar och digitala handlingar. Du kommer att arbeta med att uppdatera tillämpningsbeslut och rutiner samt andra styrdokument. Du kommer även att hantera förfrågningar och utlämnande av allmänna handlingar samt vara ett internt stöd i arkivfrågor. Vi har nyligen infört e-arkiv och du kommer att vara delaktig i därtill hörande frågor och i andra utvecklingsarbeten inom arkivområdet.\n\n \n\nKvalifikationer\nDu ska ha relevant akademisk utbildning som inkluderar arkiv- och informationsvetenskap med minst 40 p/60 hp.\n\nVi söker dig som har erfarenhet av arkivarbete på myndighet och har aktuella och dokumenterade kunskaper i arkiv-, offentlighets- och sekretesslagstiftningen. Du ska även vara väl insatt i Riksarkivets föreskrifter.\n\nDu har goda IT-kunskaper och erfarenhet av elektronisk informationshantering och digitalt bevarande. Det är meriterande med erfarenhet av arbete med e-arkiv. Vi ser gärna att du arbetat med framtagande av styrdokument och/eller rutindokument inom arkivområdet.\n\nSom arkivarie är du driven och prioriterar att uppnå mål och att få arbetet slutfört på ett strukturerat och noggrant sätt. Du är även lösningsorienterad, intresserad av utvecklingsarbete och att effektivisera arbetssätt. Du tar snabbt in ny kunskap och använder tidigare kunskap på ett flexibelt sätt.\n\nDu är van vid att samarbeta och förhåller dig till andra på ett öppet och accepterande sätt. Du uttrycker dig väl i tal och skrift, har gott omdöme och ser till helheten.\n\nVi fäster stor vikt vid personliga egenskaper och testning kommer därför att genomföras som ett första steg i rekryteringsprocessen.\n\n \n\nAnställning\nTillsvidareanställning, sex månaders provanställning.\n\nTillträde sker efter överenskommelse.\n\nEn anställning som arkivarie hos oss kan innebära placering i säkerhetsklass.\n\nÖvrigt\nI samband med att ansökan skickas in så bjuds du in till att genomföra tester. För att vara aktuell i denna rekryteringsprocess ska du genomföra testerna senast den 29 augusti 2022.\n\n\n\nLäs mer om Förvaltningsrätten i Stockholm: http://www.forvaltningsrattenistockholm.domstol.se/\n\n\n\nTill bemannings- och rekryteringsföretag och till dig som är försäljare:\n\nVi undanber oss vänligen men bestämt direktkontakt med bemannings- och rekryteringsföretag samt försäljare av ytterligare jobbannonser."
      },
      "headline" : "Arkivarie till Förvaltningsrätten i Stockholm",
      "driving_license" : null,
      "employer" : {
        "email" : null,
        "phone_number" : null,
        "organization_number" : "2021002742",
        "name" : "Sveriges Domstolar",
        "url" : null,
        "workplace" : "Förvaltningsrätten i Stockholm"
      },
      "removed_date" : null,
      "logo_url" : "https://www.arbetsformedlingen.se/rest/arbetsgivare/rest/af/v3/organisation/2021002742/logotyper/logo.png",
      "last_publication_date" : "2022-08-28T23:59:59",
      "number_of_vacancies" : 1,
      "occupation" : {
        "concept_id" : "E7nX_ux2_hF9",
        "label" : "Arkivarie",
        "legacy_ams_taxonomy_id" : "5898"
      },
      "occupation_group" : {
        "concept_id" : "wVfo_Njx_1rB",
        "label" : "Bibliotekarier och arkivarier",
        "legacy_ams_taxonomy_id" : "2622"
      },
      "employment_type" : {
        "concept_id" : "PFZr_Syz_cUq",
        "label" : "Vanlig anställning",
        "legacy_ams_taxonomy_id" : "1"
      },
      "webpage_url" : "https://arbetsformedlingen.se/platsbanken/annonser/26425587",
      "driving_license_required" : false,
      "application_contacts" : [ {
        "description" : "Maria Askersjö, HR-specialist",
        "email" : null,
        "telephone" : "08-56168339",
        "name" : null,
        "contact_type" : null
      }, {
        "description" : "Sussie Holm, biträdande målkanslichef",
        "email" : null,
        "telephone" : "08-56168016",
        "name" : null,
        "contact_type" : null
      } ],
      "duration" : {
        "concept_id" : "qQUd_4qe_NDT",
        "label" : "6 månader eller längre",
        "legacy_ams_taxonomy_id" : "2"
      },
      "nice_to_have" : {
        "education_level" : [ ],
        "work_experiences" : [ ],
        "skills" : [ ],
        "education" : [ ],
        "languages" : [ ]
      },
      "application_details" : {
        "via_af" : false,
        "email" : null,
        "other" : null,
        "reference" : "FST 2022/396",
        "url" : "https://sverigesdomstolar.varbi.com/what:job/jobID:533300/type:job/where:1/apply:1",
        "information" : null
      },
      "source_type" : "VIA_PLATSBANKEN_DXA",
      "application_deadline" : "2022-08-28T23:59:59",
      "external_id" : "46-202100-2742-533300-1",
      "workplace_address" : {
        "coordinates" : [ 18.06858, 59.329323 ],
        "city" : null,
        "postcode" : null,
        "municipality" : "Stockholm",
        "region_concept_id" : "CifL_Rzy_Mku",
        "region" : "Stockholms län",
        "country_code" : "199",
        "region_code" : "01",
        "municipality_concept_id" : "AvNB_uwa_6n6",
        "country_concept_id" : "i46j_HmG_v64",
        "municipality_code" : "0180",
        "street_address" : null,
        "country" : "Sverige"
      },
      "id" : "26425587",
      "experience_required" : true,
      "working_hours_type" : {
        "concept_id" : "6YE1_gAC_R2G",
        "label" : "Heltid",
        "legacy_ams_taxonomy_id" : "1"
      },
      "access" : null,
      "timestamp" : 1660819092993,
      "must_have" : {
        "education_level" : [ ],
        "work_experiences" : [ {
          "concept_id" : "E7nX_ux2_hF9",
          "weight" : 10,
          "label" : "Arkivarie",
          "legacy_ams_taxonomy_id" : "5898"
        } ],
        "skills" : [ ],
        "education" : [ ],
        "languages" : [ ]
      },
      "occupation_field" : {
        "concept_id" : "9puE_nYg_crq",
        "label" : "Kultur, media, design",
        "legacy_ams_taxonomy_id" : "11"
      },
      "scope_of_work" : {
        "min" : 100,
        "max" : 100
      },
      "salary_type" : {
        "concept_id" : "oG8G_9cW_nRf",
        "label" : "Fast månads- vecko- eller timlön",
        "legacy_ams_taxonomy_id" : "1"
      },
      "removed" : false,
      "salary_description" : "Månadslön, individuell lönesättning tillämpas",
      "access_to_own_car" : false,
      "publication_date" : "2022-08-18T12:38:12"
    },
    "name" : "Arkivarie till Förvaltningsrätten i Stockholm",
    "user" : "hannes"
  },
  "sha1" : "757108aa5634f4038c5cde1ae74044a0e32697a8",
  "annotations" : [ {
    "preferred-label" : "Arkivarie",
    "sentiment" : "MUST_HAVE",
    "type" : "occupation-name",
    "start-position" : 0,
    "end-position" : 9,
    "concept-id" : "E7nX_ux2_hF9",
    "matched-string" : "arkivarie",
    "annotation-id" : 0
  }, {
    "preferred-label" : "Stockholm",
    "sentiment" : "NOT_RELEVANT",
    "type" : "municipality",
    "start-position" : 36,
    "end-position" : 45,
    "concept-id" : "AvNB_uwa_6n6",
    "matched-string" : "Stockholm",
    "annotation-id" : 8
  }, {
    "preferred-label" : "Stockholm",
    "sentiment" : "NOT_RELEVANT",
    "type" : "municipality",
    "start-position" : 67,
    "end-position" : 76,
    "concept-id" : "AvNB_uwa_6n6",
    "matched-string" : "Stockholm",
    "annotation-id" : 9
  }, {
    "preferred-label" : "Stockholm",
    "sentiment" : "NOT_RELEVANT",
    "type" : "municipality",
    "start-position" : 276,
    "end-position" : 285,
    "concept-id" : "AvNB_uwa_6n6",
    "matched-string" : "Stockholm",
    "annotation-id" : 10
  }, {
    "preferred-label" : "Arkivarie",
    "sentiment" : "MUST_HAVE",
    "type" : "occupation-name",
    "start-position" : 658,
    "end-position" : 667,
    "concept-id" : "E7nX_ux2_hF9",
    "matched-string" : "arkivarie",
    "annotation-id" : 1
  }, {
    "preferred-label" : "Arkivarie",
    "sentiment" : "NOT_RELEVANT",
    "type" : "occupation-name",
    "start-position" : 749,
    "end-position" : 759,
    "concept-id" : "E7nX_ux2_hF9",
    "matched-string" : "arkivarier",
    "annotation-id" : 11
  }, {
    "preferred-label" : "Arkivassistent",
    "sentiment" : "NOT_RELEVANT",
    "type" : "occupation-name",
    "start-position" : 761,
    "end-position" : 777,
    "concept-id" : "kxKW_LiD_FuW",
    "matched-string" : "arkivassistenter",
    "annotation-id" : 12
  }, {
    "preferred-label" : "domstolshandläggare",
    "sentiment" : "NOT_RELEVANT",
    "type" : "esco-occupation",
    "start-position" : 782,
    "end-position" : 801,
    "concept-id" : "uqo4_cVk_1Cn",
    "matched-string" : "domstolshandläggare",
    "annotation-id" : 2
  }, {
    "preferred-label" : "Arkivarie",
    "sentiment" : "MUST_HAVE",
    "type" : "occupation-name",
    "start-position" : 810,
    "end-position" : 819,
    "concept-id" : "E7nX_ux2_hF9",
    "matched-string" : "arkivarie",
    "annotation-id" : 3
  }, {
    "preferred-label" : "Arkivvetenskap",
    "sentiment" : "NOT_RELEVANT",
    "type" : "keyword",
    "start-position" : 1433,
    "end-position" : 1438,
    "concept-id" : "qTjY_Xjh_6UA",
    "matched-string" : "arkiv",
    "annotation-id" : 14
  }, {
    "preferred-label" : "Dokumentations- och informationsvetenskap",
    "sentiment" : "MUST_HAVE",
    "type" : "sun-education-field-4",
    "start-position" : 1444,
    "end-position" : 1465,
    "concept-id" : "eaWv_6EA_ZG2",
    "matched-string" : "informationsvetenskap",
    "annotation-id" : 13
  }, {
    "preferred-label" : "Data/IT",
    "sentiment" : "MUST_HAVE",
    "type" : "occupation-field",
    "start-position" : 1718,
    "end-position" : 1720,
    "concept-id" : "apaJ_2ja_LuF",
    "matched-string" : "it",
    "annotation-id" : 4
  }, {
    "preferred-label" : "Arkivarie",
    "sentiment" : "MUST_HAVE",
    "type" : "occupation-name",
    "start-position" : 1972,
    "end-position" : 1981,
    "concept-id" : "E7nX_ux2_hF9",
    "matched-string" : "arkivarie",
    "annotation-id" : 5
  }, {
    "preferred-label" : "noggrannhet",
    "sentiment" : "MUST_HAVE",
    "type" : "esco-skill",
    "start-position" : 2077,
    "end-position" : 2085,
    "concept-id" : "mrsW_EkL_KRD",
    "matched-string" : "noggrant",
    "annotation-id" : 15
  }, {
    "preferred-label" : "Utvecklingsarbete",
    "sentiment" : "MUST_HAVE",
    "type" : "skill",
    "start-position" : 2138,
    "end-position" : 2155,
    "concept-id" : "LsGo_Kh2_3kH",
    "matched-string" : "utvecklingsarbete",
    "annotation-id" : 6
  }, {
    "preferred-label" : "Tillsvidareanställning (inkl. eventuell provanställning)",
    "sentiment" : "OFFERED",
    "type" : "employment-type",
    "start-position" : 2593,
    "end-position" : 2645,
    "concept-id" : "kpPX_CNN_gDU",
    "matched-string" : "Tillsvidareanställning, sex månaders provanställning",
    "annotation-id" : 16
  }, {
    "preferred-label" : "Arkivarie",
    "sentiment" : "MUST_HAVE",
    "type" : "occupation-name",
    "start-position" : 2706,
    "end-position" : 2715,
    "concept-id" : "E7nX_ux2_hF9",
    "matched-string" : "arkivarie",
    "annotation-id" : 7
  } ],
  "text" : "Arkivarie till Förvaltningsrätten i Stockholm\nFörvaltningsrätten i Stockholm är en modern och utvecklingsinriktad arbetsplats med engagerade medarbetare. Verksamheten kännetecknas av hög kvalitet och effektiv handläggning, som i huvudsak sker digitalt. \n\nFörvaltningsrätten i Stockholm är landets största domstol och en av landets fyra migrationsdomstolar. Vi är ca 500 medarbetare och våra största måltyper är migrationsmål, biståndsmål, socialförsäkringsmål och skattemål. Här kan du, tillsammans med kollegor med många kompetenser och bakgrunder, utvecklas och utmanas i ditt arbete. \n\n\n\nHär gör du skillnad varje dag!\n\n\r\n\r\nArbetsbeskrivning \nVi söker en arkivarie som ska arbeta i vår arkivgrupp tillsammans med handläggarchef, arkivsamordnare, arkivarier, arkivassistenter och domstolshandläggare.\r\n\r\nSom arkivarie på domstolen arbetar du med att omhänderta, arkivera och gallra arkivhandlingar i enlighet med gällande regelverk, du kommer att hantera både pappershandlingar och digitala handlingar. Du kommer att arbeta med att uppdatera tillämpningsbeslut och rutiner samt andra styrdokument. Du kommer även att hantera förfrågningar och utlämnande av allmänna handlingar samt vara ett internt stöd i arkivfrågor. Vi har nyligen infört e-arkiv och du kommer att vara delaktig i därtill hörande frågor och i andra utvecklingsarbeten inom arkivområdet.\n\n \n\nKvalifikationer\nDu ska ha relevant akademisk utbildning som inkluderar arkiv- och informationsvetenskap med minst 40 p/60 hp.\n\nVi söker dig som har erfarenhet av arkivarbete på myndighet och har aktuella och dokumenterade kunskaper i arkiv-, offentlighets- och sekretesslagstiftningen. Du ska även vara väl insatt i Riksarkivets föreskrifter.\n\nDu har goda IT-kunskaper och erfarenhet av elektronisk informationshantering och digitalt bevarande. Det är meriterande med erfarenhet av arbete med e-arkiv. Vi ser gärna att du arbetat med framtagande av styrdokument och/eller rutindokument inom arkivområdet.\n\nSom arkivarie är du driven och prioriterar att uppnå mål och att få arbetet slutfört på ett strukturerat och noggrant sätt. Du är även lösningsorienterad, intresserad av utvecklingsarbete och att effektivisera arbetssätt. Du tar snabbt in ny kunskap och använder tidigare kunskap på ett flexibelt sätt.\n\nDu är van vid att samarbeta och förhåller dig till andra på ett öppet och accepterande sätt. Du uttrycker dig väl i tal och skrift, har gott omdöme och ser till helheten.\n\nVi fäster stor vikt vid personliga egenskaper och testning kommer därför att genomföras som ett första steg i rekryteringsprocessen.\n\n \n\nAnställning\nTillsvidareanställning, sex månaders provanställning.\n\nTillträde sker efter överenskommelse.\n\nEn anställning som arkivarie hos oss kan innebära placering i säkerhetsklass.\n\nÖvrigt\nI samband med att ansökan skickas in så bjuds du in till att genomföra tester. För att vara aktuell i denna rekryteringsprocess ska du genomföra testerna senast den 29 augusti 2022.\n\n\n\nLäs mer om Förvaltningsrätten i Stockholm: http://www.forvaltningsrattenistockholm.domstol.se/\n\n\n\nTill bemannings- och rekryteringsföretag och till dig som är försäljare:\n\nVi undanber oss vänligen men bestämt direktkontakt med bemannings- och rekryteringsföretag samt försäljare av ytterligare jobbannonser."
}