{
  "meta" : {
    "jobad" : {
      "description" : {
        "requirements" : null,
        "needs" : null,
        "company_information" : null,
        "text_formatted" : "<p>Hej!</p><p>Restaurang Havet är en lunchrestaurang i Saluhallen Briggen som serverar klassisk svensk husmanskost.</p><p>Vi söker nu en erfaren kock som vill bli en viktig del i vårt team. Arbetstiden är 08:00-16:00 måndag till fredag.</p><p>Du är en positiv och självgående person som har goda kunskaper från det svenska köket. Som person skall du vara stresstålig och samarbetsvillig. Du bör ha en stor dos kärlek för det svenska köket, vara noggrann och punktlig.</p><p> I dina arbetsuppgifter ingår bland annat:</p><p>• Menyplanering</p><p>• Matlagning</p><p>• Portionering</p><p> </p><p>Kvalifikationer / Krav</p><p>• Utbildad kock med yrkesvana</p><p> </p><p>Tjänsten är en tillsvidaretjänst på 100%</p><p>Lön enligt överenskommelse.</p><p>Vänta inte med din ansökan! Alla ansökningar kommer att behandlas löpande så skicka in din ansökan så snart som möjligt.</p>",
        "conditions" : null,
        "text" : "Hej!\nRestaurang Havet är en lunchrestaurang i Saluhallen Briggen som serverar klassisk svensk husmanskost.\nVi söker nu en erfaren kock som vill bli en viktig del i vårt team. Arbetstiden är 08:00-16:00 måndag till fredag.\nDu är en positiv och självgående person som har goda kunskaper från det svenska köket. Som person skall du vara stresstålig och samarbetsvillig. Du bör ha en stor dos kärlek för det svenska köket, vara noggrann och punktlig.\n I dina arbetsuppgifter ingår bland annat:\n• Menyplanering\n• Matlagning\n• Portionering\n \nKvalifikationer / Krav\n• Utbildad kock med yrkesvana\n \nTjänsten är en tillsvidaretjänst på 100%\nLön enligt överenskommelse.\nVänta inte med din ansökan! Alla ansökningar kommer att behandlas löpande så skicka in din ansökan så snart som möjligt."
      },
      "headline" : "Kock sökes till populär lunchrestaurang.",
      "driving_license" : null,
      "employer" : {
        "email" : null,
        "phone_number" : null,
        "organization_number" : "9697398494",
        "name" : "Havets L & B HB",
        "url" : null,
        "workplace" : "Saluhallen Briggen"
      },
      "removed_date" : null,
      "logo_url" : null,
      "last_publication_date" : "2022-08-08T23:59:59",
      "number_of_vacancies" : 2,
      "occupation" : {
        "concept_id" : "JbJw_as4_S93",
        "label" : "Kock, à la carte",
        "legacy_ams_taxonomy_id" : "7663"
      },
      "occupation_group" : {
        "concept_id" : "BStc_SJh_DKG",
        "label" : "Kockar och kallskänkor",
        "legacy_ams_taxonomy_id" : "5120"
      },
      "employment_type" : {
        "concept_id" : "PFZr_Syz_cUq",
        "label" : "Vanlig anställning",
        "legacy_ams_taxonomy_id" : "1"
      },
      "webpage_url" : "https://arbetsformedlingen.se/platsbanken/annonser/26349483",
      "driving_license_required" : false,
      "application_contacts" : [ ],
      "duration" : {
        "concept_id" : "a7uU_j21_mkL",
        "label" : "Tills vidare",
        "legacy_ams_taxonomy_id" : "1"
      },
      "nice_to_have" : {
        "education_level" : [ ],
        "work_experiences" : [ ],
        "skills" : [ ],
        "education" : [ ],
        "languages" : [ ]
      },
      "application_details" : {
        "via_af" : false,
        "email" : "havetslb@gmail.com",
        "other" : null,
        "reference" : null,
        "url" : null,
        "information" : null
      },
      "source_type" : "VIA_ANNONSERA",
      "application_deadline" : "2022-08-08T23:59:59",
      "external_id" : null,
      "workplace_address" : {
        "coordinates" : [ 11.949824400601395, 57.698285795596085 ],
        "city" : "GÖTEBORG",
        "postcode" : "41306",
        "municipality" : "Göteborg",
        "region_concept_id" : "zdoY_6u5_Krt",
        "region" : "Västra Götalands län",
        "country_code" : "199",
        "region_code" : "14",
        "municipality_concept_id" : "PVZL_BQT_XtL",
        "country_concept_id" : "i46j_HmG_v64",
        "municipality_code" : "1480",
        "street_address" : "Nordhemsgatan 28",
        "country" : "Sverige"
      },
      "id" : "26349483",
      "experience_required" : true,
      "working_hours_type" : {
        "concept_id" : "6YE1_gAC_R2G",
        "label" : "Heltid",
        "legacy_ams_taxonomy_id" : "1"
      },
      "access" : null,
      "timestamp" : 1658701240285,
      "must_have" : {
        "education_level" : [ ],
        "work_experiences" : [ {
          "concept_id" : "JbJw_as4_S93",
          "weight" : 10,
          "label" : "Kock, à la carte",
          "legacy_ams_taxonomy_id" : "7663"
        } ],
        "skills" : [ ],
        "education" : [ ],
        "languages" : [ ]
      },
      "occupation_field" : {
        "concept_id" : "ScKy_FHB_7wT",
        "label" : "Hotell, restaurang, storhushåll",
        "legacy_ams_taxonomy_id" : "7"
      },
      "scope_of_work" : {
        "min" : 0,
        "max" : 100
      },
      "salary_type" : {
        "concept_id" : "oG8G_9cW_nRf",
        "label" : "Fast månads- vecko- eller timlön",
        "legacy_ams_taxonomy_id" : "1"
      },
      "removed" : false,
      "salary_description" : null,
      "access_to_own_car" : false,
      "publication_date" : "2022-07-25T00:20:40"
    },
    "name" : "Kock sökes till populär lunchrestaurang.",
    "user" : "hannes"
  },
  "sha1" : "b8e8a46f7464ff3662beeacd1396d78ef8a8c3ee",
  "annotations" : [ {
    "preferred-label" : "kock",
    "sentiment" : "MUST_HAVE",
    "type" : "esco-occupation",
    "start-position" : 0,
    "end-position" : 4,
    "concept-id" : "Ti2H_QoQ_EMX",
    "matched-string" : "kock",
    "annotation-id" : 0
  }, {
    "preferred-label" : "Restaurang",
    "sentiment" : "MUST_HAVE",
    "type" : "keyword",
    "start-position" : 46,
    "end-position" : 56,
    "concept-id" : "o2Cg_3Ap_qvK",
    "matched-string" : "restaurang",
    "annotation-id" : 1
  }, {
    "preferred-label" : "Husmanskost",
    "sentiment" : "MUST_HAVE",
    "type" : "skill",
    "start-position" : 135,
    "end-position" : 146,
    "concept-id" : "HfAs_ZWA_Jvv",
    "matched-string" : "husmanskost",
    "annotation-id" : 2
  }, {
    "preferred-label" : "kock",
    "sentiment" : "MUST_HAVE",
    "type" : "esco-occupation",
    "start-position" : 171,
    "end-position" : 175,
    "concept-id" : "Ti2H_QoQ_EMX",
    "matched-string" : "kock",
    "annotation-id" : 3
  }, {
    "preferred-label" : "Svenska",
    "sentiment" : "MUST_HAVE",
    "type" : "language",
    "start-position" : 335,
    "end-position" : 342,
    "concept-id" : "zSLA_vw2_FXN",
    "matched-string" : "svenska",
    "annotation-id" : 4
  }, {
    "preferred-label" : "Svenska",
    "sentiment" : "MUST_HAVE",
    "type" : "language",
    "start-position" : 445,
    "end-position" : 452,
    "concept-id" : "zSLA_vw2_FXN",
    "matched-string" : "svenska",
    "annotation-id" : 6
  }, {
    "preferred-label" : "noggrannhet",
    "type" : "esco-skill",
    "start-position" : 465,
    "end-position" : 473,
    "concept-id" : "mrsW_EkL_KRD",
    "matched-string" : "noggrann",
    "annotation-id" : 9
  }, {
    "preferred-label" : "komponera menyer",
    "type" : "esco-skill",
    "start-position" : 533,
    "end-position" : 546,
    "concept-id" : "XyXa_Cd6_6AU",
    "matched-string" : "Menyplanering",
    "annotation-id" : 10
  }, {
    "preferred-label" : "Portionering",
    "sentiment" : "MUST_HAVE",
    "type" : "skill",
    "start-position" : 562,
    "end-position" : 574,
    "concept-id" : "XCMK_vWW_njd",
    "matched-string" : "portionering",
    "annotation-id" : 7
  }, {
    "preferred-label" : "kock",
    "sentiment" : "MUST_HAVE",
    "type" : "esco-occupation",
    "start-position" : 611,
    "end-position" : 615,
    "concept-id" : "Ti2H_QoQ_EMX",
    "matched-string" : "kock",
    "annotation-id" : 8
  }, {
    "preferred-label" : "Tillsvidareanställning (inkl. eventuell provanställning)",
    "type" : "employment-type",
    "start-position" : 647,
    "end-position" : 664,
    "concept-id" : "kpPX_CNN_gDU",
    "matched-string" : "tillsvidaretjänst",
    "annotation-id" : 12
  }, {
    "preferred-label" : "Heltid",
    "type" : "worktime-extent",
    "start-position" : 668,
    "end-position" : 672,
    "concept-id" : "6YE1_gAC_R2G",
    "matched-string" : "100%",
    "annotation-id" : 11
  } ],
  "text" : "Kock sökes till populär lunchrestaurang.\nHej!\nRestaurang Havet är en lunchrestaurang i Saluhallen Briggen som serverar klassisk svensk husmanskost.\nVi söker nu en erfaren kock som vill bli en viktig del i vårt team. Arbetstiden är 08:00-16:00 måndag till fredag.\nDu är en positiv och självgående person som har goda kunskaper från det svenska köket. Som person skall du vara stresstålig och samarbetsvillig. Du bör ha en stor dos kärlek för det svenska köket, vara noggrann och punktlig.\n I dina arbetsuppgifter ingår bland annat:\n• Menyplanering\n• Matlagning\n• Portionering\n \nKvalifikationer / Krav\n• Utbildad kock med yrkesvana\n \nTjänsten är en tillsvidaretjänst på 100%\nLön enligt överenskommelse.\nVänta inte med din ansökan! Alla ansökningar kommer att behandlas löpande så skicka in din ansökan så snart som möjligt."
}