{
  "meta" : {
    "jobad" : {
      "description" : {
        "requirements" : null,
        "needs" : null,
        "company_information" : null,
        "text_formatted" : "Just nu söker vi söker kockar till våra restauranger, bland annat till Lisebergs Wärdshus, Tyrolen, Järnvägsrestaurangen, 1923, The Green Room, Hamnkrogen och Personalrestaurangen Köket.\r\n\r\nLiseberg kan erbjuda dig en annorlunda och positiv arbetsmiljö med närhet till glädje och skratt, möten med förväntansfulla gäster, och lön enligt avtal.\n\nHär på Liseberg får du vara dig själv då vi respekterar och uppskattar varandras olikheter och många Lisebergare tycker att gemenskapen med arbetskamraterna är något av det allra bästa med att arbeta på Liseberg! \n\nArbetsuppgifter och kvalifikationer\nVåra köksmästare är duktiga ledare och förebilder. Vi arbetar aktivt med hållbarhetsfrågan och har flera KRAV-märkta restauranger och en matsmart personalrestaurang. Du behöver relevant yrkeserfarenhet. Har du restaurangutbildning är det en merit. \n\nHar du inte utbildning men har ett brinnande intresse för matlagning? Inga problem! Skicka in en ansökan så lära vi dig det du behöver kunna. \n\nDet värdesätts om du är en stolt yrkesmänniska som är uthållig och gillar ett högt tempo! Hos oss är inte ensam stark, och vi tror att det är lagarbetet som genomsyrar vårt arbetssätt som leder till att gästernas upplevelser blir något utöver det vanliga.\n\nVillkor\nTjänsterna är säsongsanställningar med varierande arbetstidsomfattning. Arbetstiden är förlagd enligt verksamhetens behov, vilket betyder både dagar, kvällar och helger.\n\nHar du frågor är du välkommen att kontakta oss på jobb.liseberg@liseberg.se \n\nVi rekryterar löpande så vänta inte med att skicka in din ansökan! \nSista ansökningsdag är 31/7\n\n ",
        "conditions" : "Heltid/Deltid. Varierande. Tillträde: Enligt överenskommelse\r\nSäsongsanställning",
        "text" : "Just nu söker vi söker kockar till våra restauranger, bland annat till Lisebergs Wärdshus, Tyrolen, Järnvägsrestaurangen, 1923, The Green Room, Hamnkrogen och Personalrestaurangen Köket.\r\n\r\nLiseberg kan erbjuda dig en annorlunda och positiv arbetsmiljö med närhet till glädje och skratt, möten med förväntansfulla gäster, och lön enligt avtal.\n\nHär på Liseberg får du vara dig själv då vi respekterar och uppskattar varandras olikheter och många Lisebergare tycker att gemenskapen med arbetskamraterna är något av det allra bästa med att arbeta på Liseberg! \n\nArbetsuppgifter och kvalifikationer\nVåra köksmästare är duktiga ledare och förebilder. Vi arbetar aktivt med hållbarhetsfrågan och har flera KRAV-märkta restauranger och en matsmart personalrestaurang. Du behöver relevant yrkeserfarenhet. Har du restaurangutbildning är det en merit. \n\nHar du inte utbildning men har ett brinnande intresse för matlagning? Inga problem! Skicka in en ansökan så lära vi dig det du behöver kunna. \n\nDet värdesätts om du är en stolt yrkesmänniska som är uthållig och gillar ett högt tempo! Hos oss är inte ensam stark, och vi tror att det är lagarbetet som genomsyrar vårt arbetssätt som leder till att gästernas upplevelser blir något utöver det vanliga.\n\nVillkor\nTjänsterna är säsongsanställningar med varierande arbetstidsomfattning. Arbetstiden är förlagd enligt verksamhetens behov, vilket betyder både dagar, kvällar och helger.\n\nHar du frågor är du välkommen att kontakta oss på jobb.liseberg@liseberg.se \n\nVi rekryterar löpande så vänta inte med att skicka in din ansökan! \nSista ansökningsdag är 31/7"
      },
      "headline" : "Kockar till Lisebergs restauranger 2022 (säsongsanställning)",
      "driving_license" : null,
      "employer" : {
        "email" : null,
        "phone_number" : null,
        "organization_number" : "5560236811",
        "name" : "Liseberg AB",
        "url" : null,
        "workplace" : "Liseberg AB"
      },
      "removed_date" : null,
      "logo_url" : null,
      "last_publication_date" : "2022-07-31T23:59:59",
      "number_of_vacancies" : 1,
      "occupation" : {
        "concept_id" : "JbJw_as4_S93",
        "label" : "Kock, à la carte",
        "legacy_ams_taxonomy_id" : "7663"
      },
      "occupation_group" : {
        "concept_id" : "BStc_SJh_DKG",
        "label" : "Kockar och kallskänkor",
        "legacy_ams_taxonomy_id" : "5120"
      },
      "employment_type" : {
        "concept_id" : "Jh8f_q9J_pbJ",
        "label" : "Sommarjobb / feriejobb",
        "legacy_ams_taxonomy_id" : "2"
      },
      "webpage_url" : "https://arbetsformedlingen.se/platsbanken/annonser/26350070",
      "driving_license_required" : false,
      "application_contacts" : [ {
        "description" : "Liseberg Rekrytering",
        "email" : null,
        "telephone" : "031-7668614",
        "name" : null,
        "contact_type" : null
      } ],
      "duration" : {
        "concept_id" : "Sy9J_aRd_ALx",
        "label" : "11 dagar - upp till 3 månader",
        "legacy_ams_taxonomy_id" : "7"
      },
      "nice_to_have" : {
        "education_level" : [ ],
        "work_experiences" : [ ],
        "skills" : [ ],
        "education" : [ ],
        "languages" : [ ]
      },
      "application_details" : {
        "via_af" : false,
        "email" : null,
        "other" : null,
        "reference" : "2022/162",
        "url" : "https://liseberg.varbi.com/what:job/jobID:527044/type:job/where:1/apply:1",
        "information" : null
      },
      "source_type" : "VIA_PLATSBANKEN_DXA",
      "application_deadline" : "2022-07-31T23:59:59",
      "external_id" : "46-556023-6811-527044-4",
      "workplace_address" : {
        "coordinates" : [ 11.97456, 57.70887 ],
        "city" : null,
        "postcode" : null,
        "municipality" : "Göteborg",
        "region_concept_id" : "zdoY_6u5_Krt",
        "region" : "Västra Götalands län",
        "country_code" : "199",
        "region_code" : "14",
        "municipality_concept_id" : "PVZL_BQT_XtL",
        "country_concept_id" : "i46j_HmG_v64",
        "municipality_code" : "1480",
        "street_address" : null,
        "country" : "Sverige"
      },
      "id" : "26350070",
      "experience_required" : true,
      "working_hours_type" : {
        "concept_id" : "947z_JGS_Uk2",
        "label" : "Deltid",
        "legacy_ams_taxonomy_id" : "2"
      },
      "access" : null,
      "timestamp" : 1658734513559,
      "must_have" : {
        "education_level" : [ ],
        "work_experiences" : [ {
          "concept_id" : "JbJw_as4_S93",
          "weight" : 10,
          "label" : "Kock, à la carte",
          "legacy_ams_taxonomy_id" : "7663"
        } ],
        "skills" : [ ],
        "education" : [ ],
        "languages" : [ ]
      },
      "occupation_field" : {
        "concept_id" : "ScKy_FHB_7wT",
        "label" : "Hotell, restaurang, storhushåll",
        "legacy_ams_taxonomy_id" : "7"
      },
      "scope_of_work" : {
        "min" : 0,
        "max" : 100
      },
      "salary_type" : {
        "concept_id" : "oG8G_9cW_nRf",
        "label" : "Fast månads- vecko- eller timlön",
        "legacy_ams_taxonomy_id" : "1"
      },
      "removed" : false,
      "salary_description" : "Lön enligt avtal",
      "access_to_own_car" : false,
      "publication_date" : "2022-07-25T09:35:13"
    },
    "name" : "Kockar till Lisebergs restauranger 2022 (säsongsanställning)",
    "user" : "hannes"
  },
  "sha1" : "35295d1ddc62d8bfc81f0f5b7f32e58ef11211c0",
  "annotations" : [ {
    "preferred-label" : "Kock",
    "type" : "keyword",
    "start-position" : 0,
    "end-position" : 6,
    "concept-id" : "RTQf_1Qm_YhD",
    "matched-string" : "Kockar",
    "annotation-id" : 3
  }, {
    "preferred-label" : "Restaurang",
    "type" : "keyword",
    "start-position" : 22,
    "end-position" : 34,
    "concept-id" : "o2Cg_3Ap_qvK",
    "matched-string" : "restauranger",
    "annotation-id" : 4
  }, {
    "preferred-label" : "Restaurang",
    "type" : "keyword",
    "start-position" : 101,
    "end-position" : 113,
    "concept-id" : "o2Cg_3Ap_qvK",
    "matched-string" : "restauranger",
    "annotation-id" : 5
  }, {
    "preferred-label" : "arbetsmiljö",
    "sentiment" : "MUST_HAVE",
    "type" : "esco-skill",
    "start-position" : 302,
    "end-position" : 313,
    "concept-id" : "zdQY_QJh_nUH",
    "matched-string" : "arbetsmiljö",
    "annotation-id" : 0
  }, {
    "preferred-label" : "köksmästare",
    "sentiment" : "MUST_HAVE",
    "type" : "esco-occupation",
    "start-position" : 662,
    "end-position" : 673,
    "concept-id" : "tNA4_ywP_j5q",
    "matched-string" : "köksmästare",
    "annotation-id" : 1
  }, {
    "preferred-label" : "Restaurangutbildning",
    "sentiment" : "MUST_HAVE",
    "type" : "keyword",
    "start-position" : 867,
    "end-position" : 887,
    "concept-id" : "QZWP_ef1_KWF",
    "matched-string" : "restaurangutbildning",
    "annotation-id" : 2
  }, {
    "preferred-label" : "Säsongsanställning",
    "type" : "employment-type",
    "start-position" : 1330,
    "end-position" : 1350,
    "concept-id" : "EBhX_Qm2_8eX",
    "matched-string" : "säsongsanställningar",
    "annotation-id" : 6
  } ],
  "text" : "Kockar till Lisebergs restauranger 2022 (säsongsanställning)\nJust nu söker vi söker kockar till våra restauranger, bland annat till Lisebergs Wärdshus, Tyrolen, Järnvägsrestaurangen, 1923, The Green Room, Hamnkrogen och Personalrestaurangen Köket.\r\n\r\nLiseberg kan erbjuda dig en annorlunda och positiv arbetsmiljö med närhet till glädje och skratt, möten med förväntansfulla gäster, och lön enligt avtal.\n\nHär på Liseberg får du vara dig själv då vi respekterar och uppskattar varandras olikheter och många Lisebergare tycker att gemenskapen med arbetskamraterna är något av det allra bästa med att arbeta på Liseberg! \n\nArbetsuppgifter och kvalifikationer\nVåra köksmästare är duktiga ledare och förebilder. Vi arbetar aktivt med hållbarhetsfrågan och har flera KRAV-märkta restauranger och en matsmart personalrestaurang. Du behöver relevant yrkeserfarenhet. Har du restaurangutbildning är det en merit. \n\nHar du inte utbildning men har ett brinnande intresse för matlagning? Inga problem! Skicka in en ansökan så lära vi dig det du behöver kunna. \n\nDet värdesätts om du är en stolt yrkesmänniska som är uthållig och gillar ett högt tempo! Hos oss är inte ensam stark, och vi tror att det är lagarbetet som genomsyrar vårt arbetssätt som leder till att gästernas upplevelser blir något utöver det vanliga.\n\nVillkor\nTjänsterna är säsongsanställningar med varierande arbetstidsomfattning. Arbetstiden är förlagd enligt verksamhetens behov, vilket betyder både dagar, kvällar och helger.\n\nHar du frågor är du välkommen att kontakta oss på jobb.liseberg@liseberg.se \n\nVi rekryterar löpande så vänta inte med att skicka in din ansökan! \nSista ansökningsdag är 31/7"
}