{
  "meta" : {
    "jobad" : {
      "description" : {
        "requirements" : null,
        "needs" : null,
        "company_information" : null,
        "text_formatted" : "<p><strong>Beskrivning av tjänsten:</strong></p><ul><li>Swed Com söker dig som vill arbeta som frisör i Sundbyberg.</li><li>Som frisör är det viktigt att du leverar bra service och kundsbemötande.</li><li>Du ska ha tidigare erfarenhet av att arbeta som frisör samt utföra effektiv och kvalitetsäker hårklippningar.</li><li>Som person är det viktigt att du brinner för yrket samt är motiverad för nya utmaningar och lärande.</li></ul><p><strong>Anställning, arbetstider och lön:</strong></p><ul><li>Anställningen börjar med en provanställning med möjlighet till en tillsvidareanställning.</li><li>Arbetstiden är förlagd, mån-fre mellan kl. 10:00-19:00</li></ul><p><strong>Ansökningsalternativ:</strong></p><ul><li>Du är mer än välkommen att skicka ditt CV och personliga brev till oss via mejl: <u>info@swedcom.se</u></li><li>Markera gärna din ansökan med \"Frisör Stockholm\".</li><li>Hjärtligt välkomna med era ansökningar.</li></ul><p><strong>Observera:</strong></p><ul><li>Läs gärna noga annonsen innan ni skickar mejl eller ringer.</li></ul><p> </p><p id=\"oppenforalla\">Öppen för alla\nVi fokuserar på din kompetens, inte dina övriga förutsättningar. Vi är öppna för att anpassa rollen eller arbetsplatsen efter dina behov.</p>",
        "conditions" : null,
        "text" : "Beskrivning av tjänsten:\nSwed Com söker dig som vill arbeta som frisör i Sundbyberg.\nSom frisör är det viktigt att du leverar bra service och kundsbemötande.\nDu ska ha tidigare erfarenhet av att arbeta som frisör samt utföra effektiv och kvalitetsäker hårklippningar.\nSom person är det viktigt att du brinner för yrket samt är motiverad för nya utmaningar och lärande.\n\nAnställning, arbetstider och lön:\nAnställningen börjar med en provanställning med möjlighet till en tillsvidareanställning.\nArbetstiden är förlagd, mån-fre mellan kl. 10:00-19:00\n\nAnsökningsalternativ:\nDu är mer än välkommen att skicka ditt CV och personliga brev till oss via mejl: info@swedcom.se\nMarkera gärna din ansökan med \"Frisör Stockholm\".\nHjärtligt välkomna med era ansökningar.\n\nObservera:\nLäs gärna noga annonsen innan ni skickar mejl eller ringer.\n\n \nÖppen för alla\nVi fokuserar på din kompetens, inte dina övriga förutsättningar. Vi är öppna för att anpassa rollen eller arbetsplatsen efter dina behov."
      },
      "headline" : "Frisör sökes!",
      "driving_license" : null,
      "employer" : {
        "email" : null,
        "phone_number" : null,
        "organization_number" : "5592849482",
        "name" : "Swed Com AB",
        "url" : "swedcom.se",
        "workplace" : "Swed Com AB"
      },
      "removed_date" : null,
      "logo_url" : "https://www.arbetsformedlingen.se/rest/arbetsgivare/rest/af/v3/arbetsplatser/88157976/logotyper/logo.png",
      "last_publication_date" : "2022-08-13T00:00:00",
      "number_of_vacancies" : 1,
      "occupation" : {
        "concept_id" : "tuoE_9Nj_fAS",
        "label" : "Frisör",
        "legacy_ams_taxonomy_id" : "5491"
      },
      "occupation_group" : {
        "concept_id" : "LyBp_bY6_bZK",
        "label" : "Frisörer",
        "legacy_ams_taxonomy_id" : "5141"
      },
      "employment_type" : {
        "concept_id" : "PFZr_Syz_cUq",
        "label" : "Vanlig anställning",
        "legacy_ams_taxonomy_id" : "1"
      },
      "webpage_url" : "https://arbetsformedlingen.se/platsbanken/annonser/26328485",
      "driving_license_required" : false,
      "application_contacts" : [ {
        "description" : null,
        "email" : "hisham@swedcom.se",
        "telephone" : "073 555 62 64",
        "name" : "Hisham Mousa",
        "contact_type" : null
      } ],
      "duration" : {
        "concept_id" : "a7uU_j21_mkL",
        "label" : "Tills vidare",
        "legacy_ams_taxonomy_id" : "1"
      },
      "nice_to_have" : {
        "education_level" : [ ],
        "work_experiences" : [ {
          "concept_id" : "tuoE_9Nj_fAS",
          "weight" : 5,
          "label" : "Frisör",
          "legacy_ams_taxonomy_id" : "5491"
        } ],
        "skills" : [ ],
        "education" : [ ],
        "languages" : [ ]
      },
      "application_details" : {
        "via_af" : false,
        "email" : "info@swedcom.se",
        "other" : null,
        "reference" : "\"Frisör Stockholm\"",
        "url" : null,
        "information" : null
      },
      "source_type" : "VIA_ANNONSERA",
      "application_deadline" : "2022-08-13T00:00:00",
      "external_id" : null,
      "workplace_address" : {
        "coordinates" : [ null, null ],
        "city" : null,
        "postcode" : null,
        "municipality" : "Stockholm",
        "region_concept_id" : "CifL_Rzy_Mku",
        "region" : "Stockholms län",
        "country_code" : "199",
        "region_code" : "01",
        "municipality_concept_id" : "AvNB_uwa_6n6",
        "country_concept_id" : "i46j_HmG_v64",
        "municipality_code" : "0180",
        "street_address" : null,
        "country" : "Sverige"
      },
      "id" : "26328485",
      "experience_required" : true,
      "working_hours_type" : {
        "concept_id" : "6YE1_gAC_R2G",
        "label" : "Heltid",
        "legacy_ams_taxonomy_id" : "1"
      },
      "access" : null,
      "timestamp" : 1657813005267,
      "must_have" : {
        "education_level" : [ ],
        "work_experiences" : [ ],
        "skills" : [ {
          "concept_id" : "dyoy_LDv_Sx5",
          "weight" : 10,
          "label" : "Frisörsalong",
          "legacy_ams_taxonomy_id" : "608928"
        } ],
        "education" : [ ],
        "languages" : [ ]
      },
      "occupation_field" : {
        "concept_id" : "Uuf1_GMh_Uvw",
        "label" : "Kropps- och skönhetsvård",
        "legacy_ams_taxonomy_id" : "4"
      },
      "scope_of_work" : {
        "min" : 0,
        "max" : 100
      },
      "salary_type" : {
        "concept_id" : "asrX_9Df_ukn",
        "label" : "Fast och rörlig lön",
        "legacy_ams_taxonomy_id" : "7"
      },
      "removed" : false,
      "salary_description" : null,
      "access_to_own_car" : false,
      "publication_date" : "2022-07-14T17:36:45"
    },
    "name" : "Frisör sökes!",
    "user" : "kristof.fischer"
  },
  "sha1" : "28ebb96b7474526cfd61fbf2ef3aecec3e7d18c2",
  "annotations" : [ {
    "preferred-label" : "Frisör",
    "sentiment" : "MUST_HAVE",
    "type" : "occupation-name",
    "start-position" : 0,
    "end-position" : 6,
    "concept-id" : "tuoE_9Nj_fAS",
    "matched-string" : "frisör",
    "annotation-id" : 0
  }, {
    "preferred-label" : "Frisör",
    "sentiment" : "MUST_HAVE",
    "type" : "occupation-name",
    "start-position" : 78,
    "end-position" : 84,
    "concept-id" : "tuoE_9Nj_fAS",
    "matched-string" : "frisör",
    "annotation-id" : 2
  }, {
    "preferred-label" : "Sundbyberg",
    "type" : "municipality",
    "start-position" : 87,
    "end-position" : 97,
    "concept-id" : "UTJZ_zHH_mJm",
    "matched-string" : "Sundbyberg",
    "annotation-id" : 6
  }, {
    "preferred-label" : "Frisör",
    "sentiment" : "MUST_HAVE",
    "type" : "occupation-name",
    "start-position" : 103,
    "end-position" : 109,
    "concept-id" : "tuoE_9Nj_fAS",
    "matched-string" : "frisör",
    "annotation-id" : 3
  }, {
    "preferred-label" : "Frisör",
    "sentiment" : "MUST_HAVE",
    "type" : "occupation-name",
    "start-position" : 220,
    "end-position" : 226,
    "concept-id" : "tuoE_9Nj_fAS",
    "matched-string" : "frisör",
    "annotation-id" : 4
  }, {
    "preferred-label" : "hårklippningstekniker",
    "sentiment" : "MUST_HAVE",
    "type" : "esco-skill",
    "start-position" : 266,
    "end-position" : 280,
    "concept-id" : "ctoB_kAr_kEo",
    "matched-string" : "hårklippningar",
    "annotation-id" : 7
  }, {
    "preferred-label" : "Tillsvidareanställning (inkl. eventuell provanställning)",
    "type" : "employment-type",
    "start-position" : 484,
    "end-position" : 506,
    "concept-id" : "kpPX_CNN_gDU",
    "matched-string" : "tillsvidareanställning",
    "annotation-id" : 8
  } ],
  "text" : "Frisör sökes!\nBeskrivning av tjänsten:\nSwed Com söker dig som vill arbeta som frisör i Sundbyberg.\nSom frisör är det viktigt att du leverar bra service och kundsbemötande.\nDu ska ha tidigare erfarenhet av att arbeta som frisör samt utföra effektiv och kvalitetsäker hårklippningar.\nSom person är det viktigt att du brinner för yrket samt är motiverad för nya utmaningar och lärande.\n\nAnställning, arbetstider och lön:\nAnställningen börjar med en provanställning med möjlighet till en tillsvidareanställning.\nArbetstiden är förlagd, mån-fre mellan kl. 10:00-19:00\n\nAnsökningsalternativ:\nDu är mer än välkommen att skicka ditt CV och personliga brev till oss via mejl: info@swedcom.se\nMarkera gärna din ansökan med \"Frisör Stockholm\".\nHjärtligt välkomna med era ansökningar.\n\nObservera:\nLäs gärna noga annonsen innan ni skickar mejl eller ringer.\n\n \nÖppen för alla\nVi fokuserar på din kompetens, inte dina övriga förutsättningar. Vi är öppna för att anpassa rollen eller arbetsplatsen efter dina behov."
}