{
  "meta" : {
    "jobad" : {
      "description" : {
        "requirements" : null,
        "needs" : null,
        "company_information" : null,
        "text_formatted" : "<p>Kreativ kock sökes till fiskrestaurang i Helsingborg.</p><p>Letar du efter en ny utmaning?</p><p>Är du kreativ och driftig?</p><p>Har du en stolthet i ditt arbete? </p><p>Då passar du perfekt in i vårt team.</p><p><strong>Arbetsuppgifterna består av </strong></p><p>• Matlagning av varma och kalla rätter samt mise en place.</p><p>• Komponera menyer och andra i kök förekommande arbetsuppgifter.</p><p>• beställning av varor samt minimera svinn och sköta varulagret.</p><p>• Kontrollera att våra fakturor överensstämmer med våra följesedlar.</p><p>• Ansvarar för att maten vi serverar håller hög klass.</p><p>• Aktivt jobba för att skapa bättre rutiner för köksarbetet.</p><p>• Sköta inventering och ordermottagning.</p><p>• Sköta egenkontroll, hygien, städschema, samt dokumentera detta varje vecka. </p><p>Kvalifikationer</p><p>- det är ett krav att du är en erfaren kock med ett par års erfarenhet.</p><p>- att du är en team player</p><p>- pratar svenska</p><p>- lär dig snabbt</p><p>- är renlig och vet hur man hanterar livsmedel på ett hygieniskt sätt </p><p>- kan ha många bollar i luften och hantera stress </p><p>- service inriktad och professionell </p><p>- har en stolthet i ditt arbete och tar initiativ. </p><p>Vi erbjuder </p><p>100% tjänst dagtid måndag-tisdag 8-16:30, onsdagar ledig, torsdag-fredag 8-16:30 samt varannan lördag - söndag 8-16:30 med sexmånaders provanställning </p><p>Lön enligt överenskommelse</p><p>Omgående anställning </p><p>1 plats. </p>",
        "conditions" : null,
        "text" : "Kreativ kock sökes till fiskrestaurang i Helsingborg.\nLetar du efter en ny utmaning?\nÄr du kreativ och driftig?\nHar du en stolthet i ditt arbete? \nDå passar du perfekt in i vårt team.\nArbetsuppgifterna består av \n• Matlagning av varma och kalla rätter samt mise en place.\n• Komponera menyer och andra i kök förekommande arbetsuppgifter.\n• beställning av varor samt minimera svinn och sköta varulagret.\n• Kontrollera att våra fakturor överensstämmer med våra följesedlar.\n• Ansvarar för att maten vi serverar håller hög klass.\n• Aktivt jobba för att skapa bättre rutiner för köksarbetet.\n• Sköta inventering och ordermottagning.\n• Sköta egenkontroll, hygien, städschema, samt dokumentera detta varje vecka. \nKvalifikationer\n- det är ett krav att du är en erfaren kock med ett par års erfarenhet.\n- att du är en team player\n- pratar svenska\n- lär dig snabbt\n- är renlig och vet hur man hanterar livsmedel på ett hygieniskt sätt \n- kan ha många bollar i luften och hantera stress \n- service inriktad och professionell \n- har en stolthet i ditt arbete och tar initiativ. \nVi erbjuder \n100% tjänst dagtid måndag-tisdag 8-16:30, onsdagar ledig, torsdag-fredag 8-16:30 samt varannan lördag - söndag 8-16:30 med sexmånaders provanställning \nLön enligt överenskommelse\nOmgående anställning \n1 plats."
      },
      "headline" : "Kreativ kock dagtid ",
      "driving_license" : null,
      "employer" : {
        "email" : null,
        "phone_number" : null,
        "organization_number" : "5590031570",
        "name" : "Urianda AB",
        "url" : null,
        "workplace" : "Urianda AB"
      },
      "removed_date" : null,
      "logo_url" : null,
      "last_publication_date" : "2022-08-23T23:59:59",
      "number_of_vacancies" : 1,
      "occupation" : {
        "concept_id" : "JbJw_as4_S93",
        "label" : "Kock, à la carte",
        "legacy_ams_taxonomy_id" : "7663"
      },
      "occupation_group" : {
        "concept_id" : "BStc_SJh_DKG",
        "label" : "Kockar och kallskänkor",
        "legacy_ams_taxonomy_id" : "5120"
      },
      "employment_type" : {
        "concept_id" : "PFZr_Syz_cUq",
        "label" : "Vanlig anställning",
        "legacy_ams_taxonomy_id" : "1"
      },
      "webpage_url" : "https://arbetsformedlingen.se/platsbanken/annonser/26349342",
      "driving_license_required" : false,
      "application_contacts" : [ {
        "description" : null,
        "email" : "christopherfortes@icloud.com",
        "telephone" : "0736216340",
        "name" : "Christopher  Fortes",
        "contact_type" : null
      } ],
      "duration" : {
        "concept_id" : "a7uU_j21_mkL",
        "label" : "Tills vidare",
        "legacy_ams_taxonomy_id" : "1"
      },
      "nice_to_have" : {
        "education_level" : [ ],
        "work_experiences" : [ ],
        "skills" : [ ],
        "education" : [ ],
        "languages" : [ ]
      },
      "application_details" : {
        "via_af" : false,
        "email" : "christopherfortes@icloud.com",
        "other" : null,
        "reference" : null,
        "url" : null,
        "information" : null
      },
      "source_type" : "VIA_ANNONSERA",
      "application_deadline" : "2022-08-23T23:59:59",
      "external_id" : null,
      "workplace_address" : {
        "coordinates" : [ null, null ],
        "city" : null,
        "postcode" : null,
        "municipality" : "Helsingborg",
        "region_concept_id" : "CaRE_1nn_cSU",
        "region" : "Skåne län",
        "country_code" : "199",
        "region_code" : "12",
        "municipality_concept_id" : "qj3q_oXH_MGR",
        "country_concept_id" : "i46j_HmG_v64",
        "municipality_code" : "1283",
        "street_address" : null,
        "country" : "Sverige"
      },
      "id" : "26349342",
      "experience_required" : true,
      "working_hours_type" : {
        "concept_id" : "6YE1_gAC_R2G",
        "label" : "Heltid",
        "legacy_ams_taxonomy_id" : "1"
      },
      "access" : null,
      "timestamp" : 1658679400271,
      "must_have" : {
        "education_level" : [ ],
        "work_experiences" : [ {
          "concept_id" : "JbJw_as4_S93",
          "weight" : 10,
          "label" : "Kock, à la carte",
          "legacy_ams_taxonomy_id" : "7663"
        } ],
        "skills" : [ ],
        "education" : [ ],
        "languages" : [ {
          "concept_id" : "zSLA_vw2_FXN",
          "weight" : 10,
          "label" : "Svenska",
          "legacy_ams_taxonomy_id" : "502"
        } ]
      },
      "occupation_field" : {
        "concept_id" : "ScKy_FHB_7wT",
        "label" : "Hotell, restaurang, storhushåll",
        "legacy_ams_taxonomy_id" : "7"
      },
      "scope_of_work" : {
        "min" : 0,
        "max" : 100
      },
      "salary_type" : {
        "concept_id" : "oG8G_9cW_nRf",
        "label" : "Fast månads- vecko- eller timlön",
        "legacy_ams_taxonomy_id" : "1"
      },
      "removed" : false,
      "salary_description" : null,
      "access_to_own_car" : false,
      "publication_date" : "2022-07-24T18:16:40"
    },
    "name" : "Kreativ kock dagtid ",
    "user" : "hannes"
  },
  "sha1" : "a96e2d44afa0f479b65aa8bd35a3779519334144",
  "annotations" : [ {
    "preferred-label" : "kock",
    "sentiment" : "MUST_HAVE",
    "type" : "esco-occupation",
    "start-position" : 8,
    "end-position" : 12,
    "concept-id" : "Ti2H_QoQ_EMX",
    "matched-string" : "kock",
    "annotation-id" : 0
  }, {
    "preferred-label" : "kock",
    "sentiment" : "MUST_HAVE",
    "type" : "esco-occupation",
    "start-position" : 29,
    "end-position" : 33,
    "concept-id" : "Ti2H_QoQ_EMX",
    "matched-string" : "kock",
    "annotation-id" : 1
  }, {
    "preferred-label" : "Restaurang",
    "type" : "keyword",
    "start-position" : 45,
    "end-position" : 59,
    "concept-id" : "o2Cg_3Ap_qvK",
    "matched-string" : "fiskrestaurang",
    "annotation-id" : 7
  }, {
    "preferred-label" : "Helsingborg",
    "type" : "municipality",
    "start-position" : 62,
    "end-position" : 73,
    "concept-id" : "qj3q_oXH_MGR",
    "matched-string" : "Helsingborg",
    "annotation-id" : 6
  }, {
    "preferred-label" : "komponera menyer",
    "type" : "esco-skill",
    "start-position" : 295,
    "end-position" : 311,
    "concept-id" : "XyXa_Cd6_6AU",
    "matched-string" : "Komponera menyer",
    "annotation-id" : 8
  }, {
    "preferred-label" : "Ordermottagning",
    "sentiment" : "MUST_HAVE",
    "type" : "skill",
    "start-position" : 632,
    "end-position" : 647,
    "concept-id" : "ZF9w_knj_7cW",
    "matched-string" : "ordermottagning",
    "annotation-id" : 2
  }, {
    "preferred-label" : "kock",
    "sentiment" : "MUST_HAVE",
    "type" : "esco-occupation",
    "start-position" : 783,
    "end-position" : 787,
    "concept-id" : "Ti2H_QoQ_EMX",
    "matched-string" : "kock",
    "annotation-id" : 3
  }, {
    "preferred-label" : "2-4 års erfarenhet",
    "type" : "occupation-experience-year",
    "start-position" : 792,
    "end-position" : 814,
    "concept-id" : "RWA2_uu6_udD",
    "matched-string" : "ett par års erfarenhet",
    "annotation-id" : 9
  }, {
    "preferred-label" : "Svenska",
    "sentiment" : "MUST_HAVE",
    "type" : "language",
    "start-position" : 852,
    "end-position" : 859,
    "concept-id" : "zSLA_vw2_FXN",
    "matched-string" : "svenska",
    "annotation-id" : 4
  }, {
    "preferred-label" : "Livsmedel",
    "sentiment" : "MUST_HAVE",
    "type" : "skill",
    "start-position" : 914,
    "end-position" : 923,
    "concept-id" : "tdbu_fUL_MnC",
    "matched-string" : "livsmedel",
    "annotation-id" : 5
  }, {
    "preferred-label" : "hantera stress",
    "type" : "esco-skill",
    "start-position" : 983,
    "end-position" : 997,
    "concept-id" : "z5Zo_DVb_VEK",
    "matched-string" : "hantera stress",
    "annotation-id" : 10
  }, {
    "preferred-label" : "Heltid",
    "type" : "worktime-extent",
    "start-position" : 1102,
    "end-position" : 1106,
    "concept-id" : "6YE1_gAC_R2G",
    "matched-string" : "100%",
    "annotation-id" : 11
  } ],
  "text" : "Kreativ kock dagtid \nKreativ kock sökes till fiskrestaurang i Helsingborg.\nLetar du efter en ny utmaning?\nÄr du kreativ och driftig?\nHar du en stolthet i ditt arbete? \nDå passar du perfekt in i vårt team.\nArbetsuppgifterna består av \n• Matlagning av varma och kalla rätter samt mise en place.\n• Komponera menyer och andra i kök förekommande arbetsuppgifter.\n• beställning av varor samt minimera svinn och sköta varulagret.\n• Kontrollera att våra fakturor överensstämmer med våra följesedlar.\n• Ansvarar för att maten vi serverar håller hög klass.\n• Aktivt jobba för att skapa bättre rutiner för köksarbetet.\n• Sköta inventering och ordermottagning.\n• Sköta egenkontroll, hygien, städschema, samt dokumentera detta varje vecka. \nKvalifikationer\n- det är ett krav att du är en erfaren kock med ett par års erfarenhet.\n- att du är en team player\n- pratar svenska\n- lär dig snabbt\n- är renlig och vet hur man hanterar livsmedel på ett hygieniskt sätt \n- kan ha många bollar i luften och hantera stress \n- service inriktad och professionell \n- har en stolthet i ditt arbete och tar initiativ. \nVi erbjuder \n100% tjänst dagtid måndag-tisdag 8-16:30, onsdagar ledig, torsdag-fredag 8-16:30 samt varannan lördag - söndag 8-16:30 med sexmånaders provanställning \nLön enligt överenskommelse\nOmgående anställning \n1 plats."
}