{
  "meta" : {
    "jobad" : {
      "description" : {
        "requirements" : null,
        "needs" : null,
        "company_information" : null,
        "text_formatted" : "<p><br></p><p><strong>Company Description</strong></p><p>At Bosch, we shape the future by inventing high-quality technologies and services that spark enthusiasm and enrich people’s lives. Our promise to our associates is rock-solid: we grow together, we enjoy our work, and we inspire each other. Join in and feel the difference.</p><p>Bosch R&amp;D Center Lund stands for modern development in cutting edge technology in the areas of connectivity, security, mobility solutions and AI. We are growing rapidly and looking for people to join us on our mission to become the Bosch Group’s 1st address for secure connected mobility solutions. We are working on a range of interesting projects, with a particular focus on software development for the automotive industry, electrical bicycles and Internet of Things.</p><p><br></p><p><strong>Job Description</strong></p><p>As a Senior Software Test Engineer, you will be part of an experienced test team, supporting three different development teams, developing products and modules for the Bosch eBike System. As a member of the test team, you will take part in testing product increments, regression testing, requirement reviews as well as test automation. In the team we perform both functional/component testing as well as system tests. In order to be successful in this role you must be passionate about testing, be communicative and think it is fun to work close to the hardware. If you have the experience of test lead activities and the ability to organize and structure, you will be vital part of the team.</p><p>You will be part of creative and innovative activities for bike computers, connectivity modules and display units. The Lund teams cover a wide range of technology areas such as embedded real-time systems, communication via CAN, BLE and cellular, displays and user interfaces, algorithm development including machine learning and interaction with cloud backend and mobile Apps.</p><p><strong>Skills &amp; Background</strong></p><p>A successful candidate must be a team player with strong social skills, initiative as well as a cross-functional mindset. Furthermore, you have a strong drive, a “can-do” positive attitude and you take ownership of your assignments. The work we perform is very hands-on why experience of working with embedded devices or similar is a must and that you appreciate working close to the hardware.</p><p><br></p><p><strong>Qualifications</strong></p><p><strong>Personal background</strong></p><ul><li>Master/Bachelor in Electrical Engineering, Computer Science, or similar</li><li>Strong sense of quality, customer- and goals focus – seeing the big picture</li><li>Passionate about testing</li><li>Relevant experience of test lead activities</li><li>Relevant experience of testing embedded systems</li><li>Experience of driving your own work while also participating in the team</li><li>Experience of test automation, preferably in Python and Robot Framework</li><li>Experience of working with requirements</li><li>Experience of scrum</li><li>Experience of TestRail, JIRA and JAMA is a merit</li><li>Experience of SAFe, Scaled Agile Framework is a merit</li><li>Strong communication skills, both verbally and in written form, especially in English.</li></ul><p><strong>Expectations</strong></p><ul><li>You will be a key figure in assuring and improving our product quality, making sure that we are giving a world-class experience to our users</li><li>Contribute and guide the other members of the team</li><li>Take ownership of your work and facilitate in the maintenance and evolvement of our testing processes</li><li>Review requirements and groom test ideas both within the test team and with the developers</li><li>Investigate and/or discuss findings with developers, product owners, requirement engineers and the test team</li><li>Create and run black box tests</li></ul><p><br></p><p><strong>Additional Information</strong></p><p>Your future job location offers you:</p><p>Flexible work time options, benefits and services, medical services, employee discounts, various sports and health opportunities, catering facilities, collective agreement, wellness contribution, access to local public transport, and room for creativity.</p><p>Diversity is our strength! At Bosch we look at diversity in gender, generation, nationalities and culture as our advantage. We believe mixed teams to be more successful because they utilize the potential offered by different perspectives and solution strategies. We therefore promote mixed teams at all levels and draw on the entire talent pool.</p><p><br></p>",
        "conditions" : null,
        "text" : "Company Description\nAt Bosch, we shape the future by inventing high-quality technologies and services that spark enthusiasm and enrich people’s lives. Our promise to our associates is rock-solid: we grow together, we enjoy our work, and we inspire each other. Join in and feel the difference.\nBosch R&D Center Lund stands for modern development in cutting edge technology in the areas of connectivity, security, mobility solutions and AI. We are growing rapidly and looking for people to join us on our mission to become the Bosch Group’s 1st address for secure connected mobility solutions. We are working on a range of interesting projects, with a particular focus on software development for the automotive industry, electrical bicycles and Internet of Things.\n\n\nJob Description\nAs a Senior Software Test Engineer, you will be part of an experienced test team, supporting three different development teams, developing products and modules for the Bosch eBike System. As a member of the test team, you will take part in testing product increments, regression testing, requirement reviews as well as test automation. In the team we perform both functional/component testing as well as system tests. In order to be successful in this role you must be passionate about testing, be communicative and think it is fun to work close to the hardware. If you have the experience of test lead activities and the ability to organize and structure, you will be vital part of the team.\nYou will be part of creative and innovative activities for bike computers, connectivity modules and display units. The Lund teams cover a wide range of technology areas such as embedded real-time systems, communication via CAN, BLE and cellular, displays and user interfaces, algorithm development including machine learning and interaction with cloud backend and mobile Apps.\nSkills & Background\nA successful candidate must be a team player with strong social skills, initiative as well as a cross-functional mindset. Furthermore, you have a strong drive, a “can-do” positive attitude and you take ownership of your assignments. The work we perform is very hands-on why experience of working with embedded devices or similar is a must and that you appreciate working close to the hardware.\n\n\nQualifications\nPersonal background\nMaster/Bachelor in Electrical Engineering, Computer Science, or similar\nStrong sense of quality, customer- and goals focus – seeing the big picture\nPassionate about testing\nRelevant experience of test lead activities\nRelevant experience of testing embedded systems\nExperience of driving your own work while also participating in the team\nExperience of test automation, preferably in Python and Robot Framework\nExperience of working with requirements\nExperience of scrum\nExperience of TestRail, JIRA and JAMA is a merit\nExperience of SAFe, Scaled Agile Framework is a merit\nStrong communication skills, both verbally and in written form, especially in English.\n\nExpectations\nYou will be a key figure in assuring and improving our product quality, making sure that we are giving a world-class experience to our users\nContribute and guide the other members of the team\nTake ownership of your work and facilitate in the maintenance and evolvement of our testing processes\nReview requirements and groom test ideas both within the test team and with the developers\nInvestigate and/or discuss findings with developers, product owners, requirement engineers and the test team\nCreate and run black box tests\n\n\n\nAdditional Information\nYour future job location offers you:\nFlexible work time options, benefits and services, medical services, employee discounts, various sports and health opportunities, catering facilities, collective agreement, wellness contribution, access to local public transport, and room for creativity.\nDiversity is our strength! At Bosch we look at diversity in gender, generation, nationalities and culture as our advantage. We believe mixed teams to be more successful because they utilize the potential offered by different perspectives and solution strategies. We therefore promote mixed teams at all levels and draw on the entire talent pool."
      },
      "headline" : "Senior Software Test Engineer for eBike Test Team",
      "driving_license" : null,
      "employer" : {
        "email" : null,
        "phone_number" : null,
        "organization_number" : "5560471194",
        "name" : "Robert Bosch AB",
        "url" : null,
        "workplace" : "Robert Bosch AB"
      },
      "removed_date" : null,
      "logo_url" : null,
      "last_publication_date" : "2022-07-29T00:00:00",
      "number_of_vacancies" : 1,
      "occupation" : {
        "concept_id" : "ZtTD_4VC_f4i",
        "label" : "Systemtestare",
        "legacy_ams_taxonomy_id" : "5422"
      },
      "occupation_group" : {
        "concept_id" : "D9SL_mtn_vGM",
        "label" : "Systemtestare och testledare",
        "legacy_ams_taxonomy_id" : "2514"
      },
      "employment_type" : {
        "concept_id" : "PFZr_Syz_cUq",
        "label" : "Vanlig anställning",
        "legacy_ams_taxonomy_id" : "1"
      },
      "webpage_url" : "https://arbetsformedlingen.se/platsbanken/annonser/26270089",
      "driving_license_required" : false,
      "application_contacts" : [ ],
      "duration" : {
        "concept_id" : "a7uU_j21_mkL",
        "label" : "Tills vidare",
        "legacy_ams_taxonomy_id" : "1"
      },
      "nice_to_have" : {
        "education_level" : [ ],
        "work_experiences" : [ ],
        "skills" : [ ],
        "education" : [ ],
        "languages" : [ ]
      },
      "application_details" : {
        "via_af" : false,
        "email" : null,
        "other" : null,
        "reference" : null,
        "url" : "https://jobs.smartrecruiters.com/BoschGroup/743999835292045-senior-software-test-engineer-for-ebike-test-team",
        "information" : null
      },
      "source_type" : "VIA_ANNONSERA",
      "application_deadline" : "2022-07-29T00:00:00",
      "external_id" : null,
      "workplace_address" : {
        "coordinates" : [ 13.215058812652032, 55.69737203216245 ],
        "city" : "LUND",
        "postcode" : "22370",
        "municipality" : "Lund",
        "region_concept_id" : "CaRE_1nn_cSU",
        "region" : "Skåne län",
        "country_code" : "199",
        "region_code" : "12",
        "municipality_concept_id" : "muSY_tsR_vDZ",
        "country_concept_id" : "i46j_HmG_v64",
        "municipality_code" : "1281",
        "street_address" : "Scheelevägen 15",
        "country" : "Sverige"
      },
      "id" : "26270089",
      "experience_required" : true,
      "working_hours_type" : {
        "concept_id" : "6YE1_gAC_R2G",
        "label" : "Heltid",
        "legacy_ams_taxonomy_id" : "1"
      },
      "access" : null,
      "timestamp" : 1656485270795,
      "must_have" : {
        "education_level" : [ ],
        "work_experiences" : [ ],
        "skills" : [ ],
        "education" : [ ],
        "languages" : [ ]
      },
      "occupation_field" : {
        "concept_id" : "apaJ_2ja_LuF",
        "label" : "Data/IT",
        "legacy_ams_taxonomy_id" : "3"
      },
      "scope_of_work" : {
        "min" : 0,
        "max" : 100
      },
      "salary_type" : {
        "concept_id" : "oG8G_9cW_nRf",
        "label" : "Fast månads- vecko- eller timlön",
        "legacy_ams_taxonomy_id" : "1"
      },
      "removed" : false,
      "salary_description" : null,
      "access_to_own_car" : false,
      "publication_date" : "2022-06-29T08:47:50"
    },
    "name" : "Senior Software Test Engineer for eBike Test Team",
    "user" : "hannes"
  },
  "sha1" : "d5fae617c6d6a263a58025b92d499f5b188c18f8",
  "annotations" : [ {
    "preferred-label" : "Testning, mjukvara/Verifiering, mjukvara",
    "type" : "skill",
    "start-position" : 7,
    "end-position" : 20,
    "concept-id" : "2kEw_jWL_6Zz",
    "matched-string" : "Software Test",
    "annotation-id" : 21
  }, {
    "preferred-label" : "Teknologi",
    "type" : "keyword",
    "start-position" : 126,
    "end-position" : 138,
    "concept-id" : "KQjv_TUZ_Hy9",
    "matched-string" : "technologies",
    "annotation-id" : 22
  }, {
    "preferred-label" : "Teknologi",
    "type" : "keyword",
    "start-position" : 411,
    "end-position" : 421,
    "concept-id" : "KQjv_TUZ_Hy9",
    "matched-string" : "technology",
    "annotation-id" : 23
  }, {
    "preferred-label" : "Artificial Intelligence/Artificiell intelligens/AI",
    "sentiment" : "MUST_HAVE",
    "type" : "skill",
    "start-position" : 485,
    "end-position" : 487,
    "concept-id" : "SaTd_K5z_ex1",
    "matched-string" : "ai",
    "annotation-id" : 3
  }, {
    "preferred-label" : "Mjukvaruutveckling",
    "type" : "skill",
    "start-position" : 720,
    "end-position" : 740,
    "concept-id" : "A5HJ_aMw_BQt",
    "matched-string" : "software development",
    "annotation-id" : 24
  }, {
    "preferred-label" : "Automotive/Fordonsindustri",
    "type" : "skill",
    "start-position" : 749,
    "end-position" : 768,
    "concept-id" : "jnLy_6Ns_KpH",
    "matched-string" : "automotive industry",
    "annotation-id" : 25
  }, {
    "preferred-label" : "elcyklar",
    "type" : "esco-skill",
    "start-position" : 770,
    "end-position" : 789,
    "concept-id" : "dcke_BL4_RvK",
    "matched-string" : "electrical bicycles",
    "annotation-id" : 26
  }, {
    "preferred-label" : "Internet of things/IoT",
    "sentiment" : "MUST_HAVE",
    "type" : "skill",
    "start-position" : 794,
    "end-position" : 812,
    "concept-id" : "v1kW_h4M_Kej",
    "matched-string" : "internet of things",
    "annotation-id" : 6
  }, {
    "preferred-label" : "Testning, mjukvara/Verifiering, mjukvara",
    "type" : "skill",
    "start-position" : 844,
    "end-position" : 857,
    "concept-id" : "2kEw_jWL_6Zz",
    "matched-string" : "Software Test",
    "annotation-id" : 27
  }, {
    "preferred-label" : "Testautomatisering/Test automation",
    "sentiment" : "MUST_HAVE",
    "type" : "skill",
    "start-position" : 1151,
    "end-position" : 1166,
    "concept-id" : "muKv_rHW_7ES",
    "matched-string" : "test automation",
    "annotation-id" : 7
  }, {
    "preferred-label" : "Hårdvara",
    "type" : "skill-headline",
    "start-position" : 1385,
    "end-position" : 1393,
    "concept-id" : "22jK_Hje_3Ec",
    "matched-string" : "hardware",
    "annotation-id" : 28
  }, {
    "preferred-label" : "Cykel",
    "type" : "keyword",
    "start-position" : 1584,
    "end-position" : 1588,
    "concept-id" : "YoQ5_F8M_9hs",
    "matched-string" : "bike",
    "annotation-id" : 29
  }, {
    "preferred-label" : "Lund",
    "type" : "municipality",
    "start-position" : 1644,
    "end-position" : 1648,
    "concept-id" : "muSY_tsR_vDZ",
    "matched-string" : "Lund",
    "annotation-id" : 30
  }, {
    "preferred-label" : "Teknologi",
    "type" : "keyword",
    "start-position" : 1677,
    "end-position" : 1687,
    "concept-id" : "KQjv_TUZ_Hy9",
    "matched-string" : "technology",
    "annotation-id" : 31
  }, {
    "preferred-label" : "CAN, kommunikationsprotokoll",
    "sentiment" : "MUST_HAVE",
    "type" : "skill",
    "start-position" : 1748,
    "end-position" : 1751,
    "concept-id" : "nTdr_FJz_ioy",
    "matched-string" : "can",
    "annotation-id" : 10
  }, {
    "preferred-label" : "Algoritmutvecklare",
    "type" : "keyword",
    "start-position" : 1801,
    "end-position" : 1822,
    "concept-id" : "q4Kq_Sag_CfH",
    "matched-string" : "algorithm development",
    "annotation-id" : 32
  }, {
    "preferred-label" : "Machine learning/Maskininlärning",
    "sentiment" : "MUST_HAVE",
    "type" : "skill",
    "start-position" : 1833,
    "end-position" : 1849,
    "concept-id" : "XEhm_7YA_qKM",
    "matched-string" : "machine learning",
    "annotation-id" : 11
  }, {
    "preferred-label" : "Backend-utvecklare",
    "type" : "occupation-name",
    "start-position" : 1877,
    "end-position" : 1884,
    "concept-id" : "7wdX_4rv_33z",
    "matched-string" : "backend",
    "annotation-id" : 33
  }, {
    "preferred-label" : "Applikationsutvecklare",
    "type" : "occupation-name",
    "start-position" : 1896,
    "end-position" : 1900,
    "concept-id" : "CZkP_hCz_KM8",
    "matched-string" : "Apps",
    "annotation-id" : 34
  }, {
    "preferred-label" : "Högskoleutbildning, generell, 5 år eller längre",
    "type" : "sun-education-level-3",
    "start-position" : 2353,
    "end-position" : 2359,
    "concept-id" : "mJj4_3Dz_V2z",
    "matched-string" : "Master",
    "annotation-id" : 35
  }, {
    "preferred-label" : "Högskoleutbildning, generell, 3 år",
    "type" : "sun-education-level-3",
    "start-position" : 2360,
    "end-position" : 2368,
    "concept-id" : "u9Qr_2wJ_nVu",
    "matched-string" : "Bachelor",
    "annotation-id" : 36
  }, {
    "preferred-label" : "Civilingenjörsutbildning, energi- och elektroteknik",
    "type" : "sun-education-field-4",
    "start-position" : 2372,
    "end-position" : 2394,
    "concept-id" : "uY1H_ZvY_FHg",
    "matched-string" : "Electrical Engineering",
    "annotation-id" : 37
  }, {
    "preferred-label" : "Programmering",
    "type" : "skill",
    "start-position" : 2396,
    "end-position" : 2412,
    "concept-id" : "iUew_moc_BRk",
    "matched-string" : "Computer Science",
    "annotation-id" : 38
  }, {
    "preferred-label" : "Testautomatisering/Test automation",
    "sentiment" : "MUST_HAVE",
    "type" : "skill",
    "start-position" : 2705,
    "end-position" : 2720,
    "concept-id" : "muKv_rHW_7ES",
    "matched-string" : "test automation",
    "annotation-id" : 14
  }, {
    "preferred-label" : "Python, programmeringsspråk",
    "sentiment" : "MUST_HAVE",
    "type" : "skill",
    "start-position" : 2736,
    "end-position" : 2742,
    "concept-id" : "qfkh_ZRK_w4W",
    "matched-string" : "python",
    "annotation-id" : 15
  }, {
    "preferred-label" : "Robotteknik",
    "type" : "skill",
    "start-position" : 2747,
    "end-position" : 2762,
    "concept-id" : "XUVf_RZ8_97a",
    "matched-string" : "Robot Framework",
    "annotation-id" : 39
  }, {
    "preferred-label" : "Scrum, systemutvecklingsmetod",
    "sentiment" : "MUST_HAVE",
    "type" : "skill",
    "start-position" : 2817,
    "end-position" : 2822,
    "concept-id" : "Cnqu_REg_6jo",
    "matched-string" : "scrum",
    "annotation-id" : 16
  }, {
    "preferred-label" : "Testrail, systemutvecklingsverktyg",
    "sentiment" : "MUST_HAVE",
    "type" : "skill",
    "start-position" : 2837,
    "end-position" : 2845,
    "concept-id" : "AKY2_EnS_eG4",
    "matched-string" : "testrail",
    "annotation-id" : 17
  }, {
    "preferred-label" : "JIRA, systemutvecklingsverktyg",
    "sentiment" : "MUST_HAVE",
    "type" : "skill",
    "start-position" : 2847,
    "end-position" : 2851,
    "concept-id" : "dQoJ_GY7_n5Z",
    "matched-string" : "jira",
    "annotation-id" : 18
  }, {
    "preferred-label" : "Scaled Agile Framework, SAFe",
    "type" : "skill",
    "start-position" : 2886,
    "end-position" : 2914,
    "concept-id" : "eTW8_AY5_tpe",
    "matched-string" : "SAFe, Scaled Agile Framework",
    "annotation-id" : 40
  }, {
    "preferred-label" : "Engelska",
    "type" : "language",
    "start-position" : 3004,
    "end-position" : 3011,
    "concept-id" : "NVxJ_hLg_TYS",
    "matched-string" : "English",
    "annotation-id" : 41
  }, {
    "preferred-label" : "Guide",
    "sentiment" : "MUST_HAVE",
    "type" : "occupation-name",
    "start-position" : 3183,
    "end-position" : 3188,
    "concept-id" : "teRQ_AeD_uwx",
    "matched-string" : "guide",
    "annotation-id" : 19
  } ],
  "text" : "Senior Software Test Engineer for eBike Test Team\nCompany Description\nAt Bosch, we shape the future by inventing high-quality technologies and services that spark enthusiasm and enrich people’s lives. Our promise to our associates is rock-solid: we grow together, we enjoy our work, and we inspire each other. Join in and feel the difference.\nBosch R&D Center Lund stands for modern development in cutting edge technology in the areas of connectivity, security, mobility solutions and AI. We are growing rapidly and looking for people to join us on our mission to become the Bosch Group’s 1st address for secure connected mobility solutions. We are working on a range of interesting projects, with a particular focus on software development for the automotive industry, electrical bicycles and Internet of Things.\n\n\nJob Description\nAs a Senior Software Test Engineer, you will be part of an experienced test team, supporting three different development teams, developing products and modules for the Bosch eBike System. As a member of the test team, you will take part in testing product increments, regression testing, requirement reviews as well as test automation. In the team we perform both functional/component testing as well as system tests. In order to be successful in this role you must be passionate about testing, be communicative and think it is fun to work close to the hardware. If you have the experience of test lead activities and the ability to organize and structure, you will be vital part of the team.\nYou will be part of creative and innovative activities for bike computers, connectivity modules and display units. The Lund teams cover a wide range of technology areas such as embedded real-time systems, communication via CAN, BLE and cellular, displays and user interfaces, algorithm development including machine learning and interaction with cloud backend and mobile Apps.\nSkills & Background\nA successful candidate must be a team player with strong social skills, initiative as well as a cross-functional mindset. Furthermore, you have a strong drive, a “can-do” positive attitude and you take ownership of your assignments. The work we perform is very hands-on why experience of working with embedded devices or similar is a must and that you appreciate working close to the hardware.\n\n\nQualifications\nPersonal background\nMaster/Bachelor in Electrical Engineering, Computer Science, or similar\nStrong sense of quality, customer- and goals focus – seeing the big picture\nPassionate about testing\nRelevant experience of test lead activities\nRelevant experience of testing embedded systems\nExperience of driving your own work while also participating in the team\nExperience of test automation, preferably in Python and Robot Framework\nExperience of working with requirements\nExperience of scrum\nExperience of TestRail, JIRA and JAMA is a merit\nExperience of SAFe, Scaled Agile Framework is a merit\nStrong communication skills, both verbally and in written form, especially in English.\n\nExpectations\nYou will be a key figure in assuring and improving our product quality, making sure that we are giving a world-class experience to our users\nContribute and guide the other members of the team\nTake ownership of your work and facilitate in the maintenance and evolvement of our testing processes\nReview requirements and groom test ideas both within the test team and with the developers\nInvestigate and/or discuss findings with developers, product owners, requirement engineers and the test team\nCreate and run black box tests\n\n\n\nAdditional Information\nYour future job location offers you:\nFlexible work time options, benefits and services, medical services, employee discounts, various sports and health opportunities, catering facilities, collective agreement, wellness contribution, access to local public transport, and room for creativity.\nDiversity is our strength! At Bosch we look at diversity in gender, generation, nationalities and culture as our advantage. We believe mixed teams to be more successful because they utilize the potential offered by different perspectives and solution strategies. We therefore promote mixed teams at all levels and draw on the entire talent pool."
}