{
  "meta" : {
    "dataset-id" : "myh-spreadsheet-2021",
    "type" : "education-description",
    "dataset-document-id" : "YH01070",
    "user" : "kristof.fischer"
  },
  "sha1" : "aa27decaca5543c99332108914bb2dc2153bca60",
  "annotations" : [ {
    "preferred-label" : "Yrkesbevis/examen",
    "sentiment" : "OFFERED",
    "type" : "skill-headline",
    "start-position" : 471,
    "end-position" : 477,
    "concept-id" : "HjPN_99i_cFD",
    "matched-string" : "examen",
    "annotation-id" : 1
  }, {
    "preferred-label" : "Högskoleutbildning, yrkesinriktad, 2 år",
    "sentiment" : "OFFERED",
    "type" : "sun-education-level-3",
    "start-position" : 478,
    "end-position" : 497,
    "concept-id" : "zdKB_pTL_HMS",
    "matched-string" : "Yrkeshögskoleexamen",
    "annotation-id" : 18
  }, {
    "preferred-label" : "Mölndal",
    "type" : "municipality",
    "start-position" : 613,
    "end-position" : 620,
    "concept-id" : "mc45_ki9_Bv3",
    "matched-string" : "Mölndal",
    "annotation-id" : 19
  }, {
    "preferred-label" : null,
    "sentiment" : "OFFERED",
    "type" : "skill",
    "start-position" : 1132,
    "end-position" : 1142,
    "concept-id" : null,
    "matched-string" : "aktivering",
    "annotation-id" : 20
  }, {
    "preferred-label" : "kommunikation",
    "sentiment" : "OFFERED",
    "type" : "esco-skill",
    "start-position" : 1144,
    "end-position" : 1157,
    "concept-id" : "ahPU_HgE_Jeb",
    "matched-string" : "kommunikation",
    "annotation-id" : 21
  }, {
    "preferred-label" : "organisera träning",
    "sentiment" : "OFFERED",
    "type" : "esco-skill",
    "start-position" : 1159,
    "end-position" : 1166,
    "concept-id" : "xn1f_njL_MMU",
    "matched-string" : "träning",
    "annotation-id" : 22
  }, {
    "preferred-label" : null,
    "sentiment" : "OFFERED",
    "type" : "skill",
    "start-position" : 1171,
    "end-position" : 1180,
    "concept-id" : null,
    "matched-string" : "stimulans",
    "annotation-id" : 23
  }, {
    "preferred-label" : "Rehabilitering",
    "sentiment" : "OFFERED",
    "type" : "skill",
    "start-position" : 1296,
    "end-position" : 1317,
    "concept-id" : "aoVs_Qfu_U3j",
    "matched-string" : "rehabiliteringsarbete",
    "annotation-id" : 24
  }, {
    "preferred-label" : "dokumentation inom hälso- och sjukvård",
    "sentiment" : "OFFERED",
    "type" : "esco-skill",
    "start-position" : 1366,
    "end-position" : 1396,
    "concept-id" : "2hA5_AC8_bsP",
    "matched-string" : "dokumentation och presentation",
    "annotation-id" : 25
  }, {
    "preferred-label" : "Kvalitetsutveckling, omsorg",
    "sentiment" : "OFFERED",
    "type" : "skill",
    "start-position" : 1475,
    "end-position" : 1492,
    "concept-id" : "gtVT_cXB_d7f",
    "matched-string" : "kvalitetsutveckla",
    "annotation-id" : 26
  }, {
    "preferred-label" : "Pedagogiskt förhållningssätt",
    "sentiment" : "OFFERED",
    "type" : "skill",
    "start-position" : 1497,
    "end-position" : 1530,
    "concept-id" : "qMfa_U8e_Lto",
    "matched-string" : "pedagogiskt vägleda vardagsarbete",
    "annotation-id" : 27
  }, {
    "preferred-label" : "Pedagogik",
    "sentiment" : "OFFERED",
    "type" : "occupation-field",
    "start-position" : 1807,
    "end-position" : 1825,
    "concept-id" : "MVqp_eS8_kDZ",
    "matched-string" : "aktiveringspedagog",
    "annotation-id" : 28
  }, {
    "preferred-label" : "Arbetsterapibiträde",
    "sentiment" : "OFFERED",
    "type" : "occupation-name",
    "start-position" : 1827,
    "end-position" : 1846,
    "concept-id" : "yiFS_2Zq_NzF",
    "matched-string" : "arbetsterapibiträde",
    "annotation-id" : 7
  }, {
    "preferred-label" : "Rehabiliteringsassistent",
    "sentiment" : "OFFERED",
    "type" : "occupation-name",
    "start-position" : 1848,
    "end-position" : 1872,
    "concept-id" : "Qgk2_se1_PZR",
    "matched-string" : "rehabiliteringsassistent",
    "annotation-id" : 8
  }, {
    "preferred-label" : "Omsorgsyrken",
    "sentiment" : "OFFERED",
    "type" : "ssyk-level-2",
    "start-position" : 1874,
    "end-position" : 1904,
    "concept-id" : "2U3x_Aub_tg1",
    "matched-string" : "äldresamordnare/äldrekonsulent",
    "annotation-id" : 29
  }, {
    "preferred-label" : "Stödpedagog",
    "sentiment" : "OFFERED",
    "type" : "occupation-name",
    "start-position" : 1911,
    "end-position" : 1922,
    "concept-id" : "NSEG_DmQ_waj",
    "matched-string" : "stödpedagog",
    "annotation-id" : 9
  }, {
    "preferred-label" : "Annan utbildning inom omvårdnad",
    "sentiment" : "OFFERED",
    "type" : "sun-education-field-4",
    "start-position" : 2065,
    "end-position" : 2096,
    "concept-id" : "2K8B_GSo_Rbw",
    "matched-string" : "Förutsättningar för yrkesrollen",
    "annotation-id" : 30
  }, {
    "preferred-label" : "Annan utbildning inom omvårdnad",
    "sentiment" : "OFFERED",
    "type" : "sun-education-field-4",
    "start-position" : 2113,
    "end-position" : 2164,
    "concept-id" : "2K8B_GSo_Rbw",
    "matched-string" : "Människans åldrande, hälsa och funktion i aktivitet",
    "annotation-id" : 31
  }, {
    "preferred-label" : "Annan utbildning inom omvårdnad",
    "sentiment" : "OFFERED",
    "type" : "sun-education-field-4",
    "start-position" : 2181,
    "end-position" : 2239,
    "concept-id" : "2K8B_GSo_Rbw",
    "matched-string" : "Professionellt, etiskt och hälsofrämjande förhållningssätt",
    "annotation-id" : 32
  }, {
    "preferred-label" : null,
    "sentiment" : "OFFERED",
    "type" : "sun-education-field-4",
    "start-position" : 2256,
    "comment" : "praktik",
    "end-position" : 2259,
    "concept-id" : null,
    "matched-string" : "LIA",
    "annotation-id" : 33
  }, {
    "preferred-label" : "Annan utbildning inom omvårdnad",
    "sentiment" : "OFFERED",
    "type" : "sun-education-field-4",
    "start-position" : 2343,
    "end-position" : 2381,
    "concept-id" : "2K8B_GSo_Rbw",
    "matched-string" : "Aktivitet, kommunikation, anpassningar",
    "annotation-id" : 34
  }, {
    "preferred-label" : "Annan utbildning inom omvårdnad",
    "sentiment" : "OFFERED",
    "type" : "sun-education-field-4",
    "start-position" : 2399,
    "end-position" : 2459,
    "concept-id" : "2K8B_GSo_Rbw",
    "matched-string" : "Vardagsaktivitet, aktivitetshinder och hälsofrämjande arbete",
    "annotation-id" : 35
  }, {
    "preferred-label" : "Annan utbildning inom omvårdnad",
    "sentiment" : "OFFERED",
    "type" : "sun-education-field-4",
    "start-position" : 2476,
    "end-position" : 2540,
    "concept-id" : "2K8B_GSo_Rbw",
    "matched-string" : "Tillgänglighet, delaktighet och välfärdsteknik och dokumentation",
    "annotation-id" : 36
  }, {
    "preferred-label" : "Annan utbildning inom omvårdnad",
    "sentiment" : "OFFERED",
    "type" : "sun-education-field-4",
    "start-position" : 2557,
    "end-position" : 2589,
    "concept-id" : "2K8B_GSo_Rbw",
    "matched-string" : "Kommunikation kultur och samspel",
    "annotation-id" : 37
  }, {
    "preferred-label" : "Annan utbildning inom omvårdnad",
    "sentiment" : "OFFERED",
    "type" : "sun-education-field-4",
    "start-position" : 2606,
    "end-position" : 2640,
    "concept-id" : "2K8B_GSo_Rbw",
    "matched-string" : "Kreativitet, skapande och hantverk",
    "annotation-id" : 38
  }, {
    "preferred-label" : null,
    "sentiment" : "OFFERED",
    "type" : "sun-education-field-4",
    "start-position" : 2657,
    "comment" : "praktik",
    "end-position" : 2660,
    "concept-id" : null,
    "matched-string" : "LIA",
    "annotation-id" : 39
  }, {
    "preferred-label" : "Annan utbildning inom omvårdnad",
    "sentiment" : "OFFERED",
    "type" : "sun-education-field-4",
    "start-position" : 2757,
    "end-position" : 2791,
    "concept-id" : "2K8B_GSo_Rbw",
    "matched-string" : "Vardagsarbete, vägledning, lärande",
    "annotation-id" : 40
  }, {
    "preferred-label" : "Vägledande arbetssätt",
    "sentiment" : "OFFERED",
    "type" : "skill",
    "start-position" : 2812,
    "end-position" : 2839,
    "concept-id" : "a8dY_8nt_E87",
    "matched-string" : "vägledande förhållningssätt",
    "annotation-id" : 41
  }, {
    "preferred-label" : "Evidensbaserad praktik",
    "sentiment" : "OFFERED",
    "type" : "skill",
    "start-position" : 2844,
    "end-position" : 2866,
    "concept-id" : "vzoU_stw_Utd",
    "matched-string" : "evidensbaserad praktik",
    "annotation-id" : 16
  }, {
    "preferred-label" : null,
    "sentiment" : "OFFERED",
    "type" : "sun-education-field-4",
    "start-position" : 2883,
    "comment" : "praktik",
    "end-position" : 2886,
    "concept-id" : null,
    "matched-string" : "LIA",
    "annotation-id" : 42
  }, {
    "preferred-label" : "Evidensbaserad praktik",
    "sentiment" : "OFFERED",
    "type" : "skill",
    "start-position" : 2904,
    "end-position" : 2926,
    "concept-id" : "vzoU_stw_Utd",
    "matched-string" : "evidensbaserad praktik",
    "annotation-id" : 17
  } ],
  "text" : "Vill du arbeta med att göra vardagen mer aktiv och meningsfull för såväl äldre personer som personer i behov av rehabilitering    I vår unika yrkeshögskoleutbildning lär du dig metoder och synsätt som bidrar till utveckling för både individ och verksamhet. Under YH-utbildningen finns det många tillfällen för reflektion och dialog. De här tillfällena har betydelse för utvecklingen av dina personliga egenskaper som är viktiga för din kommande yrkesroll.    SNABBFAKTA  Examen Yrkeshögskoleexamen  Start 13 september 2021  Längd 300 YH-poäng (2 år)  Studietakt 75%, bunden, skolförlagd 3 dagar/vecka   Studieort Mölndal  Antal platser 20 st  LIA 23 veckor (praktik)    UNDER STUDIETIDEN  I vår unika yrkeshögskoleutbildning lär du om metoder och synsätt som bidrar till utveckling för individ och verksamhet. Utbildningen innehåller många tillfällen till reflektion och dialog. Dessa tillfällen har betydelse för utveckling av dina personliga egenskaper som är viktiga för din kommande yrkesroll.    Under utbildningen fördjupar du din kunskap om rehabilitering och om den äldre människans livsvillkor. Du utvecklar kompetens inom aktivering, kommunikation, träning och stimulans ur ett hälsofrämjande perspektiv. Du lär dig att använda skapande, hantverk, rörelse, natur och kultur som medel i rehabiliteringsarbete. Under utbildningen fördjupar du din kunskap om dokumentation och presentation.    Du utvecklar också ditt professionella förhållningssätt som grund för att kvalitetsutveckla och pedagogiskt vägleda vardagsarbete inom exempelvis dagverksamhet, träffpunkter, olika typer av bostäder och rehabiliterande verksamheter inom kommun och region. Yrkeshögskoleutbildningen genomförs i nära samarbete med arbetslivet.    EFTER UTBILDNINGEN  Efter avslutad utbildning kan du arbeta till exempel som aktiveringspedagog, arbetsterapibiträde, rehabiliteringsassistent, äldresamordnare/äldrekonsulent eller stödpedagog.    KURSER SOM DU LÄSER (YH-poäng*):  *5 YH-poäng motsvarar 1 veckas helstudier    Utbildningen är uppbyggd av tre delar/block    Block 1   - Förutsättningar för yrkesrollen, 70 YH-poäng  - Människans åldrande, hälsa och funktion i aktivitet, 20 YH-poäng  - Professionellt, etiskt och hälsofrämjande förhållningssätt, 30 YH-poäng  - LIA 1 Den aktiva och skapande människan i samspel med andra, 20 YH-poäng    Block 2  - Aktivitet, kommunikation, anpassningar, 140 YH-poäng  - Vardagsaktivitet, aktivitetshinder och hälsofrämjande arbete, 25 YH-poäng  - Tillgänglighet, delaktighet och välfärdsteknik och dokumentation, 25 YH-poäng  - Kommunikation kultur och samspel, 25 YH-poäng  - Kreativitet, skapande och hantverk, 25 YH-poäng  - LIA 2 Vardagsaktivitet, kommunikation, tillgänglighet och dokumentation, 40 YH-poäng    Block 3   - Vardagsarbete, vägledning, lärande, 90 YH-poäng  - Ett vägledande förhållningssätt och evidensbaserad praktik, 40 YH-poäng  - LIA 3 Utveckling för evidensbaserad praktik, 25 YH-poäng  - Examensarbete, 25 YH-poäng"
}