{
  "meta" : {
    "jobad" : {
      "description" : {
        "requirements" : null,
        "needs" : null,
        "company_information" : null,
        "text_formatted" : "Brinner du för avancerad problemlösning, mjukvaruutveckling, systemarkitektur eller är du bara en extremt duktig nörd? Då är du rätt person för oss!\n\nTietoevry, i samarbete med Poolia, söker nu dig som redan har och dig som vill få ett passionerat intresse för system- och mjukvaruutveckling. Vi söker juniora och seniora utvecklare som vill vara med och leda och utveckla 5G inom Enhanced Mobile Broadband, Ultra Reliable Low Latency Communications och Massive Machine Type Communications och även för utvecklings- och forskningssamarbeten inom framtidens 6G telekomsystem. \n\nUrval sker löpande så ansök redan idag!\n\nTjänsten är på heltid med start enligt överenskommelse.\n\nOm tjänsten\nHos oss kommer du att arbeta i något av våra kundprojekt, hos de stora mobilsystemsföretagen, hos de främsta mobiltillverkarna och ibland även hos offensiva start-ups som är i behov av avancerade/innovativa muskler. \n\nStämningen i de olika teamen präglas av en stark lagkänsla där man möter framgångar och löser utmaningar tillsammans.\n\nDu kommer att arbeta i ett agilt krossfunktionellt utvecklingsteam där arbetet bland annat består av: \n-  Avancerad systemerin\n- Modellering/simulering\n- Hands-on mjukvaruutveckling i skarpa målsystem\n\nDu kommer att arbeta mot inbyggda multi-core system där realtidsprestanda och aspekter som cykel- och minnesoptimering är centrala. \n\nMjukvaruutvecklingen bedrivs i ett flertal språk och scriptdialekter som: \n- Realtime -C och C++ är centrala \n- Java,  Golang, Perl och Python är också viktiga \n\nVerktyg som används är: \n- GIT, Eclipse, Jira, Gerrit och Jenkins är en naturlig del av utvecklingsmiljön. \n- För simulering och modellering används även Matlab och Octave.\n\nVem är du?\nVi söker både juniora och seniora utvecklare. \n\nDu som vi söker tjänsten: \n- Håller på eller har avsluta en civilingenjörsutbildning inom teknisk datavetenskap, elektro, teknisk fysik eller motsvarande. \n- Du har kunskap inom Java och C/C++. \n- Om du har erfarenhet från mjukvaruutveckling och är van vid att jobba i projektform/agilt är det meriterande men inget krav. \n\nFör att trivas i rollen bör du vara en ansvarstagande och noggrann lagspelare som inte är rädd för att komma med nya idéer. Du är även analytisk och kan se förbättringsmöjligheter. Du är självklart uppdaterad i den senaste tekniken och har förmåga att ta egna initiativ.\n\nOm verksamheten\nTietoevrys mål är att vara kundernas förstahandsval för affärsförnyelse och det ledande mjukvaru- och tjänsteföretaget i Norden. \n\nI en snabbt föränderlig värld kan varje bit av information användas för att skapa nytt värde. Tieto vill omsätta möjligheterna i den datadrivna världen till värde för människor, företag och samhället i stort. Vi har idag en framträdande roll i det digitala ekosystemet och använder vår mjukvara och våra tjänster för att skapa verktyg och lösningar som förenklar vardagen för miljontals människor, hjälper kunder att förnya sin affär genom att fånga möjligheterna med modernisering, digitalisering och innovation och som skapar nya möjligheter baserat på öppenhet, innovationssamarbeten och ekosystem.\n\nTieto utgår från ett starkt nordiskt arv och kombinerar global förmåga med lokal närvaro.\nHuvudkontoret ligger i Esbo, Finland, och bolaget sysselsätter omkring 14 000 experter i cirka\n20 länder. Tietos omsättning är cirka 1,5 miljarder euro.\n\n  \nVarmt välkommen med din ansökan. Urval sker löpande, ansök därför redan idag genom att klicka på ansök på poolia.se.",
        "conditions" : "Heltid\r\nVisstid, mer än 6 månader",
        "text" : "Brinner du för avancerad problemlösning, mjukvaruutveckling, systemarkitektur eller är du bara en extremt duktig nörd? Då är du rätt person för oss!\n\nTietoevry, i samarbete med Poolia, söker nu dig som redan har och dig som vill få ett passionerat intresse för system- och mjukvaruutveckling. Vi söker juniora och seniora utvecklare som vill vara med och leda och utveckla 5G inom Enhanced Mobile Broadband, Ultra Reliable Low Latency Communications och Massive Machine Type Communications och även för utvecklings- och forskningssamarbeten inom framtidens 6G telekomsystem. \n\nUrval sker löpande så ansök redan idag!\n\nTjänsten är på heltid med start enligt överenskommelse.\n\nOm tjänsten\nHos oss kommer du att arbeta i något av våra kundprojekt, hos de stora mobilsystemsföretagen, hos de främsta mobiltillverkarna och ibland även hos offensiva start-ups som är i behov av avancerade/innovativa muskler. \n\nStämningen i de olika teamen präglas av en stark lagkänsla där man möter framgångar och löser utmaningar tillsammans.\n\nDu kommer att arbeta i ett agilt krossfunktionellt utvecklingsteam där arbetet bland annat består av: \n-  Avancerad systemerin\n- Modellering/simulering\n- Hands-on mjukvaruutveckling i skarpa målsystem\n\nDu kommer att arbeta mot inbyggda multi-core system där realtidsprestanda och aspekter som cykel- och minnesoptimering är centrala. \n\nMjukvaruutvecklingen bedrivs i ett flertal språk och scriptdialekter som: \n- Realtime -C och C++ är centrala \n- Java,  Golang, Perl och Python är också viktiga \n\nVerktyg som används är: \n- GIT, Eclipse, Jira, Gerrit och Jenkins är en naturlig del av utvecklingsmiljön. \n- För simulering och modellering används även Matlab och Octave.\n\nVem är du?\nVi söker både juniora och seniora utvecklare. \n\nDu som vi söker tjänsten: \n- Håller på eller har avsluta en civilingenjörsutbildning inom teknisk datavetenskap, elektro, teknisk fysik eller motsvarande. \n- Du har kunskap inom Java och C/C++. \n- Om du har erfarenhet från mjukvaruutveckling och är van vid att jobba i projektform/agilt är det meriterande men inget krav. \n\nFör att trivas i rollen bör du vara en ansvarstagande och noggrann lagspelare som inte är rädd för att komma med nya idéer. Du är även analytisk och kan se förbättringsmöjligheter. Du är självklart uppdaterad i den senaste tekniken och har förmåga att ta egna initiativ.\n\nOm verksamheten\nTietoevrys mål är att vara kundernas förstahandsval för affärsförnyelse och det ledande mjukvaru- och tjänsteföretaget i Norden. \n\nI en snabbt föränderlig värld kan varje bit av information användas för att skapa nytt värde. Tieto vill omsätta möjligheterna i den datadrivna världen till värde för människor, företag och samhället i stort. Vi har idag en framträdande roll i det digitala ekosystemet och använder vår mjukvara och våra tjänster för att skapa verktyg och lösningar som förenklar vardagen för miljontals människor, hjälper kunder att förnya sin affär genom att fånga möjligheterna med modernisering, digitalisering och innovation och som skapar nya möjligheter baserat på öppenhet, innovationssamarbeten och ekosystem.\n\nTieto utgår från ett starkt nordiskt arv och kombinerar global förmåga med lokal närvaro.\nHuvudkontoret ligger i Esbo, Finland, och bolaget sysselsätter omkring 14 000 experter i cirka\n20 länder. Tietos omsättning är cirka 1,5 miljarder euro.\n\n  \nVarmt välkommen med din ansökan. Urval sker löpande, ansök därför redan idag genom att klicka på ansök på poolia.se."
      },
      "headline" : "Systemutvecklare till Tietoevry i Umeå",
      "driving_license" : null,
      "employer" : {
        "email" : null,
        "phone_number" : null,
        "organization_number" : "5564267655",
        "name" : "Poolia Sverige AB",
        "url" : "http://www.poolia.se",
        "workplace" : "Poolia Umeå AB"
      },
      "removed_date" : null,
      "logo_url" : "https://www.arbetsformedlingen.se/rest/arbetsgivare/rest/af/v3/organisation/5564267655/logotyper/logo.png",
      "last_publication_date" : "2022-09-02T23:59:59",
      "number_of_vacancies" : 1,
      "occupation" : {
        "concept_id" : "fg7B_yov_smw",
        "label" : "Systemutvecklare/Programmerare",
        "legacy_ams_taxonomy_id" : "2419"
      },
      "occupation_group" : {
        "concept_id" : "DJh5_yyF_hEM",
        "label" : "Mjukvaru- och systemutvecklare m.fl.",
        "legacy_ams_taxonomy_id" : "2512"
      },
      "employment_type" : {
        "concept_id" : "PFZr_Syz_cUq",
        "label" : "Vanlig anställning",
        "legacy_ams_taxonomy_id" : "1"
      },
      "webpage_url" : "https://arbetsformedlingen.se/platsbanken/annonser/26376690",
      "driving_license_required" : false,
      "application_contacts" : [ {
        "description" : "Helena Forsberg",
        "email" : "helena.forsberg@poolia.se",
        "telephone" : "072-079 08 69",
        "name" : null,
        "contact_type" : null
      } ],
      "duration" : {
        "concept_id" : "qQUd_4qe_NDT",
        "label" : "6 månader eller längre",
        "legacy_ams_taxonomy_id" : "2"
      },
      "nice_to_have" : {
        "education_level" : [ ],
        "work_experiences" : [ ],
        "skills" : [ ],
        "education" : [ ],
        "languages" : [ ]
      },
      "application_details" : {
        "via_af" : false,
        "email" : null,
        "other" : null,
        "reference" : "65317",
        "url" : "https://www.poolia.se/lediga-jobb/?jobadid=65317",
        "information" : null
      },
      "source_type" : "VIA_PLATSBANKEN_DXA",
      "application_deadline" : "2022-09-02T23:59:59",
      "external_id" : "46-556426-7655-65317",
      "workplace_address" : {
        "coordinates" : [ 20.263035, 63.825848 ],
        "city" : null,
        "postcode" : null,
        "municipality" : "Umeå",
        "region_concept_id" : "g5Tt_CAV_zBd",
        "region" : "Västerbottens län",
        "country_code" : "199",
        "region_code" : "24",
        "municipality_concept_id" : "QiGt_BLu_amP",
        "country_concept_id" : "i46j_HmG_v64",
        "municipality_code" : "2480",
        "street_address" : null,
        "country" : "Sverige"
      },
      "id" : "26376690",
      "experience_required" : true,
      "working_hours_type" : {
        "concept_id" : "6YE1_gAC_R2G",
        "label" : "Heltid",
        "legacy_ams_taxonomy_id" : "1"
      },
      "access" : null,
      "timestamp" : 1659596774122,
      "must_have" : {
        "education_level" : [ ],
        "work_experiences" : [ {
          "concept_id" : "fg7B_yov_smw",
          "weight" : 10,
          "label" : "Systemutvecklare/Programmerare",
          "legacy_ams_taxonomy_id" : "2419"
        } ],
        "skills" : [ ],
        "education" : [ ],
        "languages" : [ ]
      },
      "occupation_field" : {
        "concept_id" : "apaJ_2ja_LuF",
        "label" : "Data/IT",
        "legacy_ams_taxonomy_id" : "3"
      },
      "scope_of_work" : {
        "min" : 100,
        "max" : 100
      },
      "salary_type" : {
        "concept_id" : "oG8G_9cW_nRf",
        "label" : "Fast månads- vecko- eller timlön",
        "legacy_ams_taxonomy_id" : "1"
      },
      "removed" : false,
      "salary_description" : "Fast lön",
      "access_to_own_car" : false,
      "publication_date" : "2022-08-04T09:06:14"
    },
    "name" : "Systemutvecklare till Tietoevry i Umeå",
    "user" : "hannes"
  },
  "sha1" : "5dafc91db69f2097ed767b5511705c81eeca6925",
  "annotations" : [ {
    "preferred-label" : "Systemutvecklare/Programmerare",
    "sentiment" : "MUST_HAVE",
    "type" : "occupation-name",
    "start-position" : 0,
    "end-position" : 16,
    "concept-id" : "fg7B_yov_smw",
    "matched-string" : "systemutvecklare",
    "annotation-id" : 0
  }, {
    "preferred-label" : "Umeå",
    "type" : "municipality",
    "start-position" : 34,
    "end-position" : 38,
    "concept-id" : "QiGt_BLu_amP",
    "matched-string" : "Umeå",
    "annotation-id" : 23
  }, {
    "preferred-label" : "Mjukvaruutveckling",
    "sentiment" : "MUST_HAVE",
    "type" : "skill",
    "start-position" : 80,
    "end-position" : 98,
    "concept-id" : "A5HJ_aMw_BQt",
    "matched-string" : "mjukvaruutveckling",
    "annotation-id" : 1
  }, {
    "preferred-label" : "Mjukvaru- och systemutvecklare m.fl.",
    "type" : "ssyk-level-4",
    "start-position" : 300,
    "end-position" : 330,
    "concept-id" : "DJh5_yyF_hEM",
    "matched-string" : "system- och mjukvaruutveckling",
    "annotation-id" : 24
  }, {
    "preferred-label" : "Heltid",
    "type" : "worktime-extent",
    "start-position" : 672,
    "end-position" : 678,
    "concept-id" : "6YE1_gAC_R2G",
    "matched-string" : "heltid",
    "annotation-id" : 25
  }, {
    "preferred-label" : "agil utveckling",
    "type" : "esco-skill",
    "start-position" : 1090,
    "end-position" : 1095,
    "concept-id" : "azwQ_pDo_Dur",
    "matched-string" : "agilt",
    "annotation-id" : 26
  }, {
    "preferred-label" : "agil utveckling",
    "type" : "esco-skill",
    "start-position" : 1114,
    "end-position" : 1129,
    "concept-id" : "azwQ_pDo_Dur",
    "matched-string" : "utvecklingsteam",
    "annotation-id" : 27
  }, {
    "preferred-label" : "Mjukvaruutveckling",
    "sentiment" : "MUST_HAVE",
    "type" : "skill",
    "start-position" : 1226,
    "end-position" : 1244,
    "concept-id" : "A5HJ_aMw_BQt",
    "matched-string" : "mjukvaruutveckling",
    "annotation-id" : 3
  }, {
    "preferred-label" : "C++ Builder, programmeringsverktyg",
    "type" : "skill",
    "start-position" : 1492,
    "end-position" : 1495,
    "concept-id" : "wbj8_LR2_aZ8",
    "matched-string" : "C++",
    "annotation-id" : 28
  }, {
    "preferred-label" : "Java, programmeringsspråk",
    "sentiment" : "MUST_HAVE",
    "type" : "skill",
    "start-position" : 1511,
    "end-position" : 1515,
    "concept-id" : "jCsR_WQX_CKD",
    "matched-string" : "java",
    "annotation-id" : 7
  }, {
    "preferred-label" : "Perl, programmeringsspråk",
    "sentiment" : "MUST_HAVE",
    "type" : "skill",
    "start-position" : 1526,
    "end-position" : 1530,
    "concept-id" : "uLhB_Tto_EJ2",
    "matched-string" : "perl",
    "annotation-id" : 8
  }, {
    "preferred-label" : "Python, programmeringsspråk",
    "sentiment" : "MUST_HAVE",
    "type" : "skill",
    "start-position" : 1535,
    "end-position" : 1541,
    "concept-id" : "qfkh_ZRK_w4W",
    "matched-string" : "python",
    "annotation-id" : 9
  }, {
    "preferred-label" : "Verktyg",
    "sentiment" : "MUST_HAVE",
    "type" : "skill",
    "start-position" : 1561,
    "end-position" : 1568,
    "concept-id" : "KG9j_WxP_ym2",
    "matched-string" : "verktyg",
    "annotation-id" : 10
  }, {
    "preferred-label" : "Git, versionshanteringssystem",
    "sentiment" : "MUST_HAVE",
    "type" : "skill",
    "start-position" : 1588,
    "end-position" : 1591,
    "concept-id" : "2REh_Drn_nsh",
    "matched-string" : "git",
    "annotation-id" : 11
  }, {
    "preferred-label" : "Eclipse, programmeringsverktyg",
    "sentiment" : "MUST_HAVE",
    "type" : "skill",
    "start-position" : 1593,
    "end-position" : 1600,
    "concept-id" : "BpH9_T22_HCv",
    "matched-string" : "eclipse",
    "annotation-id" : 12
  }, {
    "preferred-label" : "JIRA, systemutvecklingsverktyg",
    "sentiment" : "MUST_HAVE",
    "type" : "skill",
    "start-position" : 1602,
    "end-position" : 1606,
    "concept-id" : "dQoJ_GY7_n5Z",
    "matched-string" : "jira",
    "annotation-id" : 13
  }, {
    "preferred-label" : "Jenkins, systemutvecklingsverktyg",
    "sentiment" : "MUST_HAVE",
    "type" : "skill",
    "start-position" : 1619,
    "end-position" : 1626,
    "concept-id" : "tmyt_n6R_1Gc",
    "matched-string" : "jenkins",
    "annotation-id" : 14
  }, {
    "preferred-label" : "Tekniska beräkningar/MATLAB",
    "sentiment" : "MUST_HAVE",
    "type" : "skill",
    "start-position" : 1715,
    "end-position" : 1721,
    "concept-id" : "uvcb_DuX_NW8",
    "matched-string" : "matlab",
    "annotation-id" : 15
  }, {
    "preferred-label" : "Civilingenjörsutbildning, övrig och ospecificerad utbildning",
    "type" : "sun-education-field-4",
    "start-position" : 1854,
    "end-position" : 1878,
    "concept-id" : "idCW_nKR_Xnm",
    "matched-string" : "civilingenjörsutbildning",
    "annotation-id" : 29
  }, {
    "preferred-label" : "Civilingenjörsutbildning, datateknik",
    "type" : "sun-education-field-4",
    "start-position" : 1884,
    "end-position" : 1905,
    "concept-id" : "XG6m_ecV_2di",
    "matched-string" : "teknisk datavetenskap",
    "annotation-id" : 30
  }, {
    "preferred-label" : "Civilingenjörsutbildning, elektroteknik",
    "type" : "keyword",
    "start-position" : 1907,
    "end-position" : 1914,
    "concept-id" : "Vzg5_p73_x7u",
    "matched-string" : "elektro",
    "annotation-id" : 31
  }, {
    "preferred-label" : "Civilingenjörsutbildning, teknisk fysik",
    "sentiment" : "MUST_HAVE",
    "type" : "keyword",
    "start-position" : 1916,
    "end-position" : 1929,
    "concept-id" : "JxwV_TPy_fXB",
    "matched-string" : "teknisk fysik",
    "annotation-id" : 17
  }, {
    "preferred-label" : "Java, programmeringsspråk",
    "sentiment" : "MUST_HAVE",
    "type" : "skill",
    "start-position" : 1972,
    "end-position" : 1976,
    "concept-id" : "jCsR_WQX_CKD",
    "matched-string" : "java",
    "annotation-id" : 18
  }, {
    "preferred-label" : "C, programmeringsspråk",
    "sentiment" : "MUST_HAVE",
    "type" : "skill",
    "start-position" : 1981,
    "end-position" : 1982,
    "concept-id" : "o8wR_57f_jv9",
    "matched-string" : "c",
    "annotation-id" : 19
  }, {
    "preferred-label" : "C++, programmeringsspråk",
    "type" : "skill",
    "start-position" : 1983,
    "end-position" : 1986,
    "concept-id" : "yNm8_krX_usR",
    "matched-string" : "C++",
    "annotation-id" : 32
  }, {
    "preferred-label" : "Mjukvaruutveckling",
    "sentiment" : "MUST_HAVE",
    "type" : "skill",
    "start-position" : 2017,
    "end-position" : 2035,
    "concept-id" : "A5HJ_aMw_BQt",
    "matched-string" : "mjukvaruutveckling",
    "annotation-id" : 21
  }, {
    "preferred-label" : "Agila arbetsmetoder",
    "type" : "skill",
    "start-position" : 2055,
    "end-position" : 2060,
    "concept-id" : "TMVb_DnH_etF",
    "matched-string" : "jobba",
    "annotation-id" : 34
  }, {
    "preferred-label" : "Agila arbetsmetoder",
    "type" : "skill",
    "start-position" : 2075,
    "end-position" : 2080,
    "concept-id" : "TMVb_DnH_etF",
    "matched-string" : "agilt",
    "annotation-id" : 33
  }, {
    "preferred-label" : "visa ansvarstagande",
    "type" : "esco-skill",
    "start-position" : 2157,
    "end-position" : 2171,
    "concept-id" : "bcRp_hxV_f5G",
    "matched-string" : "ansvarstagande",
    "annotation-id" : 35
  }, {
    "preferred-label" : "noggrannhet",
    "type" : "esco-skill",
    "start-position" : 2176,
    "end-position" : 2184,
    "concept-id" : "mrsW_EkL_KRD",
    "matched-string" : "noggrann",
    "annotation-id" : 36
  }, {
    "preferred-label" : "tänka analytiskt",
    "type" : "esco-skill",
    "start-position" : 2253,
    "end-position" : 2262,
    "concept-id" : "osu5_TsT_qGo",
    "matched-string" : "analytisk",
    "annotation-id" : 37
  }, {
    "preferred-label" : "Verktyg",
    "sentiment" : "MUST_HAVE",
    "type" : "skill",
    "start-position" : 2864,
    "end-position" : 2871,
    "concept-id" : "KG9j_WxP_ym2",
    "matched-string" : "verktyg",
    "annotation-id" : 22
  }, {
    "preferred-label" : "Finland",
    "type" : "country",
    "start-position" : 3259,
    "end-position" : 3266,
    "concept-id" : "WgbG_whJ_E7J",
    "matched-string" : "Finland",
    "annotation-id" : 38
  } ],
  "text" : "Systemutvecklare till Tietoevry i Umeå\nBrinner du för avancerad problemlösning, mjukvaruutveckling, systemarkitektur eller är du bara en extremt duktig nörd? Då är du rätt person för oss!\n\nTietoevry, i samarbete med Poolia, söker nu dig som redan har och dig som vill få ett passionerat intresse för system- och mjukvaruutveckling. Vi söker juniora och seniora utvecklare som vill vara med och leda och utveckla 5G inom Enhanced Mobile Broadband, Ultra Reliable Low Latency Communications och Massive Machine Type Communications och även för utvecklings- och forskningssamarbeten inom framtidens 6G telekomsystem. \n\nUrval sker löpande så ansök redan idag!\n\nTjänsten är på heltid med start enligt överenskommelse.\n\nOm tjänsten\nHos oss kommer du att arbeta i något av våra kundprojekt, hos de stora mobilsystemsföretagen, hos de främsta mobiltillverkarna och ibland även hos offensiva start-ups som är i behov av avancerade/innovativa muskler. \n\nStämningen i de olika teamen präglas av en stark lagkänsla där man möter framgångar och löser utmaningar tillsammans.\n\nDu kommer att arbeta i ett agilt krossfunktionellt utvecklingsteam där arbetet bland annat består av: \n-  Avancerad systemerin\n- Modellering/simulering\n- Hands-on mjukvaruutveckling i skarpa målsystem\n\nDu kommer att arbeta mot inbyggda multi-core system där realtidsprestanda och aspekter som cykel- och minnesoptimering är centrala. \n\nMjukvaruutvecklingen bedrivs i ett flertal språk och scriptdialekter som: \n- Realtime -C och C++ är centrala \n- Java,  Golang, Perl och Python är också viktiga \n\nVerktyg som används är: \n- GIT, Eclipse, Jira, Gerrit och Jenkins är en naturlig del av utvecklingsmiljön. \n- För simulering och modellering används även Matlab och Octave.\n\nVem är du?\nVi söker både juniora och seniora utvecklare. \n\nDu som vi söker tjänsten: \n- Håller på eller har avsluta en civilingenjörsutbildning inom teknisk datavetenskap, elektro, teknisk fysik eller motsvarande. \n- Du har kunskap inom Java och C/C++. \n- Om du har erfarenhet från mjukvaruutveckling och är van vid att jobba i projektform/agilt är det meriterande men inget krav. \n\nFör att trivas i rollen bör du vara en ansvarstagande och noggrann lagspelare som inte är rädd för att komma med nya idéer. Du är även analytisk och kan se förbättringsmöjligheter. Du är självklart uppdaterad i den senaste tekniken och har förmåga att ta egna initiativ.\n\nOm verksamheten\nTietoevrys mål är att vara kundernas förstahandsval för affärsförnyelse och det ledande mjukvaru- och tjänsteföretaget i Norden. \n\nI en snabbt föränderlig värld kan varje bit av information användas för att skapa nytt värde. Tieto vill omsätta möjligheterna i den datadrivna världen till värde för människor, företag och samhället i stort. Vi har idag en framträdande roll i det digitala ekosystemet och använder vår mjukvara och våra tjänster för att skapa verktyg och lösningar som förenklar vardagen för miljontals människor, hjälper kunder att förnya sin affär genom att fånga möjligheterna med modernisering, digitalisering och innovation och som skapar nya möjligheter baserat på öppenhet, innovationssamarbeten och ekosystem.\n\nTieto utgår från ett starkt nordiskt arv och kombinerar global förmåga med lokal närvaro.\nHuvudkontoret ligger i Esbo, Finland, och bolaget sysselsätter omkring 14 000 experter i cirka\n20 länder. Tietos omsättning är cirka 1,5 miljarder euro.\n\n  \nVarmt välkommen med din ansökan. Urval sker löpande, ansök därför redan idag genom att klicka på ansök på poolia.se."
}