{
  "meta" : {
    "jobad" : {
      "description" : {
        "requirements" : null,
        "needs" : null,
        "company_information" : null,
        "text_formatted" : "Vill du kunna göra skillnad genom ditt dagliga arbete? Som medarbetare på Ragn-Sells gör du det, oavsett roll inom företaget. Vårt arbete bidrar nämligen till ett bättre samhälle och en bättre miljö. Dessutom verkar vi inom en spännande framtidsbransch där vår gedigna historia och stora kunnande är en enorm styrka. Som företag vill vi vara ett bevis på att omsorg om jorden och bra affärer går hand i hand. Nu söker vi en Transportplanerare till Ragn-Sells Recyclings Region Syd Öst som har erfarenhet av transportplanering och logistikfrågor. Om du är analytisk, strukturerad och trivs i samarbetet med andra samt har ett intresse för miljöfrågor kan det här vara nästa utmaning för dig! Intervjuer och urval sker löpande. Varmt välkommen med din ansökan redan idag!\n\n\nOm tjänsten\nArbetet innebär i huvudsak att:\n\n- Planera den operativa driften av transporterna för uppdrag inom regionen - både egna fordon och underentreprenörer\n- Hantera och planera ut arbetsorder på rätt resurs utifrån uppdragets krav\n- Skapa nya synergieffekter då du planerar fordon i en större geografi\n- Vid behov göra översyn och ruttoptimering. Du identifierar och rapporterar reklamationer och avvikelser samt tillser att företagets system för kvalitet, miljö- och arbetsmiljöfrågor följs i samband med transportplaneringen\n- Ha daglig kontakt med kunder, chaufförer, sektionschefer, kundtjänstmedarbetare samt övriga kollegor\n\nVi erbjuder dig ett arbete med logistik inom en av Sveriges viktigaste branscher, goda anställningsvillkor med kollektivavtal, pension och friskvårdsbidrag. Ragn-Sells erbjuder även för rätt person kompetensutvecklingsmöjligheter genom egen Akademi. Tjänsten är en visstidanställning på 1 år med start senast oktober. För rätt person finns stora möjligheter till fast anställning hos Ragn-Sells.\n\n\nVem är du?\nVi söker dig som har tidigare erfarenhet från arbete med logistikstöd eller kundservice inom logistik-eller transportbranschen. Du har relevant utbildning inom logistik, eller erfarenhet som bedöms likvärdig. Det är meriterande med erfarenhet från återvinningsbranschen.\n\nSom person är du strukturerad, kund- och lösningsorienterad. Du kommunicerar väl och obehindrat på svenska och har lätt för att samarbeta och skapa kontaktytor såväl externt som internt. Du är engagerad och vill bidra till utveckling och effektivisering. Vidare är du tydlig, flexibel och klarar snabba omställningar med bibehållen kvalitet och engagemang. Naturligtvis har du ett intresse för miljöfrågor. Vi lägger stor vikt vid personlig lämplighet.\n\n\nOm verksamheten\nRagn-Sells är ett av Sveriges främsta kompetensföretag inom återvinning och miljö. Vi samlar in, behandlar och återvinner avfall och restprodukter från näringsliv, organisationer och hushåll över hela Sverige. Våra erfarna och professionella medarbetare tror på enkla lösningar, ansvarstagande, helhetssyn och framåtanda. Vi är drygt 1500 medarbetare i Sverige. Ragn-Sells koncernen finns dessutom i Danmark, Norge och Estland. Totalt är vi ca 2400 personer i hela koncernen och 2021 omsatte koncernen ca 7,5 miljarder SEK.",
        "conditions" : "Heltid\r\nVisstid, mer än 6 månader",
        "text" : "Vill du kunna göra skillnad genom ditt dagliga arbete? Som medarbetare på Ragn-Sells gör du det, oavsett roll inom företaget. Vårt arbete bidrar nämligen till ett bättre samhälle och en bättre miljö. Dessutom verkar vi inom en spännande framtidsbransch där vår gedigna historia och stora kunnande är en enorm styrka. Som företag vill vi vara ett bevis på att omsorg om jorden och bra affärer går hand i hand. Nu söker vi en Transportplanerare till Ragn-Sells Recyclings Region Syd Öst som har erfarenhet av transportplanering och logistikfrågor. Om du är analytisk, strukturerad och trivs i samarbetet med andra samt har ett intresse för miljöfrågor kan det här vara nästa utmaning för dig! Intervjuer och urval sker löpande. Varmt välkommen med din ansökan redan idag!\n\n\nOm tjänsten\nArbetet innebär i huvudsak att:\n\n- Planera den operativa driften av transporterna för uppdrag inom regionen - både egna fordon och underentreprenörer\n- Hantera och planera ut arbetsorder på rätt resurs utifrån uppdragets krav\n- Skapa nya synergieffekter då du planerar fordon i en större geografi\n- Vid behov göra översyn och ruttoptimering. Du identifierar och rapporterar reklamationer och avvikelser samt tillser att företagets system för kvalitet, miljö- och arbetsmiljöfrågor följs i samband med transportplaneringen\n- Ha daglig kontakt med kunder, chaufförer, sektionschefer, kundtjänstmedarbetare samt övriga kollegor\n\nVi erbjuder dig ett arbete med logistik inom en av Sveriges viktigaste branscher, goda anställningsvillkor med kollektivavtal, pension och friskvårdsbidrag. Ragn-Sells erbjuder även för rätt person kompetensutvecklingsmöjligheter genom egen Akademi. Tjänsten är en visstidanställning på 1 år med start senast oktober. För rätt person finns stora möjligheter till fast anställning hos Ragn-Sells.\n\n\nVem är du?\nVi söker dig som har tidigare erfarenhet från arbete med logistikstöd eller kundservice inom logistik-eller transportbranschen. Du har relevant utbildning inom logistik, eller erfarenhet som bedöms likvärdig. Det är meriterande med erfarenhet från återvinningsbranschen.\n\nSom person är du strukturerad, kund- och lösningsorienterad. Du kommunicerar väl och obehindrat på svenska och har lätt för att samarbeta och skapa kontaktytor såväl externt som internt. Du är engagerad och vill bidra till utveckling och effektivisering. Vidare är du tydlig, flexibel och klarar snabba omställningar med bibehållen kvalitet och engagemang. Naturligtvis har du ett intresse för miljöfrågor. Vi lägger stor vikt vid personlig lämplighet.\n\n\nOm verksamheten\nRagn-Sells är ett av Sveriges främsta kompetensföretag inom återvinning och miljö. Vi samlar in, behandlar och återvinner avfall och restprodukter från näringsliv, organisationer och hushåll över hela Sverige. Våra erfarna och professionella medarbetare tror på enkla lösningar, ansvarstagande, helhetssyn och framåtanda. Vi är drygt 1500 medarbetare i Sverige. Ragn-Sells koncernen finns dessutom i Danmark, Norge och Estland. Totalt är vi ca 2400 personer i hela koncernen och 2021 omsatte koncernen ca 7,5 miljarder SEK."
      },
      "headline" : "Transportplanerare till Ragn-Sells i Jönköping",
      "driving_license" : [ {
        "concept_id" : "VTK8_WRx_GcM",
        "label" : "B",
        "legacy_ams_taxonomy_id" : "3"
      } ],
      "employer" : {
        "email" : null,
        "phone_number" : null,
        "organization_number" : "5564267655",
        "name" : "Poolia Sverige AB",
        "url" : "http://www.poolia.se",
        "workplace" : "Poolia Jönköping AB"
      },
      "removed_date" : null,
      "logo_url" : "https://www.arbetsformedlingen.se/rest/arbetsgivare/rest/af/v3/organisation/5564267655/logotyper/logo.png",
      "last_publication_date" : "2022-08-22T23:59:59",
      "number_of_vacancies" : 1,
      "occupation" : {
        "concept_id" : "T9bK_xR7_wvn",
        "label" : "Transportplanerare",
        "legacy_ams_taxonomy_id" : "5957"
      },
      "occupation_group" : {
        "concept_id" : "957L_kZK_rHZ",
        "label" : "Transportledare och transportsamordnare",
        "legacy_ams_taxonomy_id" : "4323"
      },
      "employment_type" : {
        "concept_id" : "PFZr_Syz_cUq",
        "label" : "Vanlig anställning",
        "legacy_ams_taxonomy_id" : "1"
      },
      "webpage_url" : "https://arbetsformedlingen.se/platsbanken/annonser/26376128",
      "driving_license_required" : true,
      "application_contacts" : [ {
        "description" : "Linnea Broman",
        "email" : "linnea.broman@poolia.se",
        "telephone" : "072-078 83 17",
        "name" : null,
        "contact_type" : null
      } ],
      "duration" : {
        "concept_id" : "qQUd_4qe_NDT",
        "label" : "6 månader eller längre",
        "legacy_ams_taxonomy_id" : "2"
      },
      "nice_to_have" : {
        "education_level" : [ ],
        "work_experiences" : [ ],
        "skills" : [ ],
        "education" : [ ],
        "languages" : [ ]
      },
      "application_details" : {
        "via_af" : false,
        "email" : null,
        "other" : null,
        "reference" : "65315",
        "url" : "https://www.poolia.se/lediga-jobb/?jobadid=65315",
        "information" : null
      },
      "source_type" : "VIA_PLATSBANKEN_DXA",
      "application_deadline" : "2022-08-22T23:59:59",
      "external_id" : "46-556426-7655-65315",
      "workplace_address" : {
        "coordinates" : [ 14.161788, 57.78261 ],
        "city" : null,
        "postcode" : null,
        "municipality" : "Jönköping",
        "region_concept_id" : "MtbE_xWT_eMi",
        "region" : "Jönköpings län",
        "country_code" : "199",
        "region_code" : "06",
        "municipality_concept_id" : "KURg_KJF_Lwc",
        "country_concept_id" : "i46j_HmG_v64",
        "municipality_code" : "0680",
        "street_address" : null,
        "country" : "Sverige"
      },
      "id" : "26376128",
      "experience_required" : false,
      "working_hours_type" : {
        "concept_id" : "6YE1_gAC_R2G",
        "label" : "Heltid",
        "legacy_ams_taxonomy_id" : "1"
      },
      "access" : null,
      "timestamp" : 1659554904048,
      "must_have" : {
        "education_level" : [ ],
        "work_experiences" : [ ],
        "skills" : [ ],
        "education" : [ ],
        "languages" : [ ]
      },
      "occupation_field" : {
        "concept_id" : "ASGV_zcE_bWf",
        "label" : "Transport, distribution, lager",
        "legacy_ams_taxonomy_id" : "19"
      },
      "scope_of_work" : {
        "min" : 100,
        "max" : 100
      },
      "salary_type" : {
        "concept_id" : "oG8G_9cW_nRf",
        "label" : "Fast månads- vecko- eller timlön",
        "legacy_ams_taxonomy_id" : "1"
      },
      "removed" : false,
      "salary_description" : "Fast lön",
      "access_to_own_car" : false,
      "publication_date" : "2022-08-03T21:28:24"
    },
    "name" : "Transportplanerare till Ragn-Sells i Jönköping",
    "user" : "kristof.fischer"
  },
  "sha1" : "75b19c1f4ae809fe3e128f80dc2e9903f34075e8",
  "annotations" : [ {
    "preferred-label" : "Transportplanerare",
    "sentiment" : "MUST_HAVE",
    "type" : "occupation-name",
    "start-position" : 0,
    "end-position" : 18,
    "concept-id" : "T9bK_xR7_wvn",
    "matched-string" : "transportplanerare",
    "annotation-id" : 0
  }, {
    "preferred-label" : "Jönköping",
    "type" : "municipality",
    "start-position" : 37,
    "end-position" : 46,
    "concept-id" : "KURg_KJF_Lwc",
    "matched-string" : "Jönköping",
    "annotation-id" : 16
  }, {
    "preferred-label" : "Transportplanerare",
    "sentiment" : "MUST_HAVE",
    "type" : "occupation-name",
    "start-position" : 471,
    "end-position" : 489,
    "concept-id" : "T9bK_xR7_wvn",
    "matched-string" : "transportplanerare",
    "annotation-id" : 2
  }, {
    "preferred-label" : "Transportplanering",
    "sentiment" : "MUST_HAVE",
    "type" : "skill",
    "start-position" : 554,
    "end-position" : 572,
    "concept-id" : "sKLW_XyF_UGt",
    "matched-string" : "transportplanering",
    "annotation-id" : 3
  }, {
    "preferred-label" : "tänka analytiskt",
    "sentiment" : "MUST_HAVE",
    "type" : "esco-skill",
    "start-position" : 602,
    "end-position" : 611,
    "concept-id" : "osu5_TsT_qGo",
    "matched-string" : "analytisk",
    "annotation-id" : 17
  }, {
    "preferred-label" : "Miljöfrågor",
    "sentiment" : "MUST_HAVE",
    "type" : "skill",
    "start-position" : 685,
    "end-position" : 696,
    "concept-id" : "wLYv_Pyd_uSZ",
    "matched-string" : "miljöfrågor",
    "annotation-id" : 4
  }, {
    "preferred-label" : "Sverige",
    "type" : "country",
    "start-position" : 1508,
    "end-position" : 1516,
    "concept-id" : "i46j_HmG_v64",
    "matched-string" : "Sveriges",
    "annotation-id" : 18
  }, {
    "preferred-label" : "Tidsbegränsad anställning",
    "type" : "employment-type",
    "start-position" : 1722,
    "end-position" : 1740,
    "concept-id" : "sTu5_NBQ_udq",
    "matched-string" : "visstidanställning",
    "annotation-id" : 19
  }, {
    "preferred-label" : "Logistik",
    "sentiment" : "MUST_HAVE",
    "type" : "skill",
    "start-position" : 1887,
    "end-position" : 1935,
    "concept-id" : "yXmf_iKi_7ci",
    "matched-string" : "tidigare erfarenhet från arbete med logistikstöd",
    "annotation-id" : 20
  }, {
    "preferred-label" : "kundservice",
    "sentiment" : "MUST_HAVE",
    "type" : "esco-skill",
    "start-position" : 1942,
    "end-position" : 1953,
    "concept-id" : "WykS_79d_Fz7",
    "matched-string" : "kundservice",
    "annotation-id" : 10
  }, {
    "preferred-label" : "Logistik",
    "sentiment" : "MUST_HAVE",
    "type" : "skill",
    "start-position" : 1959,
    "end-position" : 1967,
    "concept-id" : "yXmf_iKi_7ci",
    "matched-string" : "logistik",
    "annotation-id" : 11
  }, {
    "preferred-label" : "Transportteknik",
    "sentiment" : "MUST_HAVE",
    "type" : "skill",
    "start-position" : 1974,
    "end-position" : 1992,
    "concept-id" : "aJz8_o6C_Kgy",
    "matched-string" : "transportbranschen",
    "annotation-id" : 21
  }, {
    "preferred-label" : "Annan utbildning inom transporttjänster",
    "sentiment" : "MUST_HAVE",
    "type" : "sun-education-field-4",
    "start-position" : 2010,
    "end-position" : 2034,
    "concept-id" : "qMSb_Gxw_yJ3",
    "matched-string" : "utbildning inom logistik",
    "annotation-id" : 22
  }, {
    "preferred-label" : "Återvinningsteknik",
    "sentiment" : "NICE_TO_HAVE",
    "type" : "skill",
    "start-position" : 2114,
    "end-position" : 2135,
    "concept-id" : "P755_zTS_nta",
    "matched-string" : "återvinningsbranschen",
    "annotation-id" : 23
  }, {
    "preferred-label" : "Svenska",
    "sentiment" : "MUST_HAVE",
    "type" : "language",
    "start-position" : 2237,
    "end-position" : 2244,
    "concept-id" : "zSLA_vw2_FXN",
    "matched-string" : "svenska",
    "annotation-id" : 13
  }, {
    "preferred-label" : "samarbeta med kolleger",
    "sentiment" : "MUST_HAVE",
    "type" : "esco-skill",
    "start-position" : 2266,
    "end-position" : 2275,
    "concept-id" : "X15R_797_q62",
    "matched-string" : "samarbeta",
    "annotation-id" : 24
  } ],
  "text" : "Transportplanerare till Ragn-Sells i Jönköping\nVill du kunna göra skillnad genom ditt dagliga arbete? Som medarbetare på Ragn-Sells gör du det, oavsett roll inom företaget. Vårt arbete bidrar nämligen till ett bättre samhälle och en bättre miljö. Dessutom verkar vi inom en spännande framtidsbransch där vår gedigna historia och stora kunnande är en enorm styrka. Som företag vill vi vara ett bevis på att omsorg om jorden och bra affärer går hand i hand. Nu söker vi en Transportplanerare till Ragn-Sells Recyclings Region Syd Öst som har erfarenhet av transportplanering och logistikfrågor. Om du är analytisk, strukturerad och trivs i samarbetet med andra samt har ett intresse för miljöfrågor kan det här vara nästa utmaning för dig! Intervjuer och urval sker löpande. Varmt välkommen med din ansökan redan idag!\n\n\nOm tjänsten\nArbetet innebär i huvudsak att:\n\n- Planera den operativa driften av transporterna för uppdrag inom regionen - både egna fordon och underentreprenörer\n- Hantera och planera ut arbetsorder på rätt resurs utifrån uppdragets krav\n- Skapa nya synergieffekter då du planerar fordon i en större geografi\n- Vid behov göra översyn och ruttoptimering. Du identifierar och rapporterar reklamationer och avvikelser samt tillser att företagets system för kvalitet, miljö- och arbetsmiljöfrågor följs i samband med transportplaneringen\n- Ha daglig kontakt med kunder, chaufförer, sektionschefer, kundtjänstmedarbetare samt övriga kollegor\n\nVi erbjuder dig ett arbete med logistik inom en av Sveriges viktigaste branscher, goda anställningsvillkor med kollektivavtal, pension och friskvårdsbidrag. Ragn-Sells erbjuder även för rätt person kompetensutvecklingsmöjligheter genom egen Akademi. Tjänsten är en visstidanställning på 1 år med start senast oktober. För rätt person finns stora möjligheter till fast anställning hos Ragn-Sells.\n\n\nVem är du?\nVi söker dig som har tidigare erfarenhet från arbete med logistikstöd eller kundservice inom logistik-eller transportbranschen. Du har relevant utbildning inom logistik, eller erfarenhet som bedöms likvärdig. Det är meriterande med erfarenhet från återvinningsbranschen.\n\nSom person är du strukturerad, kund- och lösningsorienterad. Du kommunicerar väl och obehindrat på svenska och har lätt för att samarbeta och skapa kontaktytor såväl externt som internt. Du är engagerad och vill bidra till utveckling och effektivisering. Vidare är du tydlig, flexibel och klarar snabba omställningar med bibehållen kvalitet och engagemang. Naturligtvis har du ett intresse för miljöfrågor. Vi lägger stor vikt vid personlig lämplighet.\n\n\nOm verksamheten\nRagn-Sells är ett av Sveriges främsta kompetensföretag inom återvinning och miljö. Vi samlar in, behandlar och återvinner avfall och restprodukter från näringsliv, organisationer och hushåll över hela Sverige. Våra erfarna och professionella medarbetare tror på enkla lösningar, ansvarstagande, helhetssyn och framåtanda. Vi är drygt 1500 medarbetare i Sverige. Ragn-Sells koncernen finns dessutom i Danmark, Norge och Estland. Totalt är vi ca 2400 personer i hela koncernen och 2021 omsatte koncernen ca 7,5 miljarder SEK."
}