{
  "meta" : {
    "jobad" : {
      "description" : {
        "requirements" : null,
        "needs" : null,
        "company_information" : null,
        "text_formatted" : "Vi söker drivna restaurangbiträden som har glimten i ögat och brinner för bra service.\n\n\n\nVEM SÖKER VI?\nVi söker dig som har utbildning från restaurangskola och/eller har ett par års erfarenhet av restaurangbranschen Du är en utåtriktad och nyfiken person med driv som älskar nya utmaningar och är van att arbeta i högt tempo.\n\nKOMPETENS\n\nDu uppskattar kontakten med människor och arbetar på en hög servicenivå. Det är en förutsättning att du tycker om ett varierande arbete och snabbt kan sätta dig in i nya rutiner.\nDina arbetsuppgifter varierar men handlar om allt från beredning/påfyllning av salladsbuffé, vara behjälplig i disken, kunna stå i kassa samt se till att restaurangen ser ren och prydlig ut.\n\nDu behöver kunna tala flytande Svenska så att du kan kommunicera med dina gäster och förstå deras önskemål.\n\nVAD VI ERBJUDER?\n\nFlexibilitet och kontroll över ditt eget schema\n\nMöjlighet att kombinera ditt arbete hos oss med till exempel studier eller annan sysselsättning\n\nTrygga och bra villkor via HRF, Visita\n\nTillgänglighet för vår personal klockan 06-22 alla dagar\n\nEn språngbräda in i restaurangbranschen\n\nUtbildningar och utveckling\n\nVarierande arbetsuppgifter och arbetsplatser\n\nOM RESTAURANGASSISTANS\n\nRestaurang Assistans är Nordens största bemanningsföretag inom Hotell och Restaurang med kontor i Stockholm, Göteborg, Malmö och Oslo. Våra kunder är allt från Guide Michelin-krogar och guldkantade galor till rikstäckande hotell- och företagsrestauranger, konferensanläggningar, kursgårdar och cateringföretag. Vi arbetar efter ledorden Effektivitet, Kvalitet, Flexibilitet och Omtanke.\n\nVälkommen till oss!",
        "conditions" : "Heltid\r\nAnställningsgrad och anställningstid enligt överenskommelse ",
        "text" : "Vi söker drivna restaurangbiträden som har glimten i ögat och brinner för bra service.\n\n\n\nVEM SÖKER VI?\nVi söker dig som har utbildning från restaurangskola och/eller har ett par års erfarenhet av restaurangbranschen Du är en utåtriktad och nyfiken person med driv som älskar nya utmaningar och är van att arbeta i högt tempo.\n\nKOMPETENS\n\nDu uppskattar kontakten med människor och arbetar på en hög servicenivå. Det är en förutsättning att du tycker om ett varierande arbete och snabbt kan sätta dig in i nya rutiner.\nDina arbetsuppgifter varierar men handlar om allt från beredning/påfyllning av salladsbuffé, vara behjälplig i disken, kunna stå i kassa samt se till att restaurangen ser ren och prydlig ut.\n\nDu behöver kunna tala flytande Svenska så att du kan kommunicera med dina gäster och förstå deras önskemål.\n\nVAD VI ERBJUDER?\n\nFlexibilitet och kontroll över ditt eget schema\n\nMöjlighet att kombinera ditt arbete hos oss med till exempel studier eller annan sysselsättning\n\nTrygga och bra villkor via HRF, Visita\n\nTillgänglighet för vår personal klockan 06-22 alla dagar\n\nEn språngbräda in i restaurangbranschen\n\nUtbildningar och utveckling\n\nVarierande arbetsuppgifter och arbetsplatser\n\nOM RESTAURANGASSISTANS\n\nRestaurang Assistans är Nordens största bemanningsföretag inom Hotell och Restaurang med kontor i Stockholm, Göteborg, Malmö och Oslo. Våra kunder är allt från Guide Michelin-krogar och guldkantade galor till rikstäckande hotell- och företagsrestauranger, konferensanläggningar, kursgårdar och cateringföretag. Vi arbetar efter ledorden Effektivitet, Kvalitet, Flexibilitet och Omtanke.\n\nVälkommen till oss!"
      },
      "headline" : "Restaurangbiträde med passion för service sökes",
      "driving_license" : null,
      "employer" : {
        "email" : null,
        "phone_number" : null,
        "organization_number" : "5565545828",
        "name" : "Restaurang Assistans i Skandinavien AB",
        "url" : "https://www.restaurangassistans.se/",
        "workplace" : "RestaurangAssistans"
      },
      "removed_date" : null,
      "logo_url" : "https://www.arbetsformedlingen.se/rest/arbetsgivare/rest/af/v3/organisation/5565545828/logotyper/logo.png",
      "last_publication_date" : "2023-01-22T23:59:59",
      "number_of_vacancies" : 1,
      "occupation" : {
        "concept_id" : "yXRQ_Ad9_E8V",
        "label" : "Restaurangbiträde",
        "legacy_ams_taxonomy_id" : "5555"
      },
      "occupation_group" : {
        "concept_id" : "tPox_ie4_X9X",
        "label" : "Restaurang- och köksbiträden m.fl.",
        "legacy_ams_taxonomy_id" : "9412"
      },
      "employment_type" : {
        "concept_id" : "PFZr_Syz_cUq",
        "label" : "Vanlig anställning",
        "legacy_ams_taxonomy_id" : "1"
      },
      "webpage_url" : "https://arbetsformedlingen.se/platsbanken/annonser/26379390",
      "driving_license_required" : false,
      "application_contacts" : [ {
        "description" : "Therese Höglund",
        "email" : "therese.hoglund@restaurangassistans.se",
        "telephone" : null,
        "name" : null,
        "contact_type" : null
      } ],
      "duration" : {
        "concept_id" : "a7uU_j21_mkL",
        "label" : "Tills vidare",
        "legacy_ams_taxonomy_id" : "1"
      },
      "nice_to_have" : {
        "education_level" : [ ],
        "work_experiences" : [ ],
        "skills" : [ ],
        "education" : [ ],
        "languages" : [ ]
      },
      "application_details" : {
        "via_af" : false,
        "email" : null,
        "other" : null,
        "reference" : null,
        "url" : "https://jobb.restaurangassistans.se/jobs/1894713-restaurangbitrade-med-passion-for-service-sokes?promotion=441035-arbetsformedlingen",
        "information" : null
      },
      "source_type" : "VIA_PLATSBANKEN_DXA",
      "application_deadline" : "2023-01-22T23:59:59",
      "external_id" : "46-556554-5828-1894713-5",
      "workplace_address" : {
        "coordinates" : [ 11.97456, 57.70887 ],
        "city" : null,
        "postcode" : null,
        "municipality" : "Göteborg",
        "region_concept_id" : "zdoY_6u5_Krt",
        "region" : "Västra Götalands län",
        "country_code" : "199",
        "region_code" : "14",
        "municipality_concept_id" : "PVZL_BQT_XtL",
        "country_concept_id" : "i46j_HmG_v64",
        "municipality_code" : "1480",
        "street_address" : null,
        "country" : "Sverige"
      },
      "id" : "26379390",
      "experience_required" : true,
      "working_hours_type" : {
        "concept_id" : "6YE1_gAC_R2G",
        "label" : "Heltid",
        "legacy_ams_taxonomy_id" : "1"
      },
      "access" : null,
      "timestamp" : 1659679854947,
      "must_have" : {
        "education_level" : [ ],
        "work_experiences" : [ {
          "concept_id" : "yXRQ_Ad9_E8V",
          "weight" : 10,
          "label" : "Restaurangbiträde",
          "legacy_ams_taxonomy_id" : "5555"
        } ],
        "skills" : [ ],
        "education" : [ ],
        "languages" : [ ]
      },
      "occupation_field" : {
        "concept_id" : "ScKy_FHB_7wT",
        "label" : "Hotell, restaurang, storhushåll",
        "legacy_ams_taxonomy_id" : "7"
      },
      "scope_of_work" : {
        "min" : 100,
        "max" : 100
      },
      "salary_type" : {
        "concept_id" : "oG8G_9cW_nRf",
        "label" : "Fast månads- vecko- eller timlön",
        "legacy_ams_taxonomy_id" : "1"
      },
      "removed" : false,
      "salary_description" : "Lön enligt överenskommelse",
      "access_to_own_car" : false,
      "publication_date" : "2022-08-05T08:10:54"
    },
    "name" : "Restaurangbiträde med passion för service sökes",
    "user" : "hannes"
  },
  "sha1" : "5fc965fc46968259b963ec16a9dcaadc607f6ab8",
  "annotations" : [ {
    "preferred-label" : "Restaurangbiträde",
    "sentiment" : "MUST_HAVE",
    "type" : "occupation-name",
    "start-position" : 0,
    "end-position" : 17,
    "concept-id" : "yXRQ_Ad9_E8V",
    "matched-string" : "restaurangbiträde",
    "annotation-id" : 0
  }, {
    "preferred-label" : "Restaurangbiträde",
    "type" : "occupation-name",
    "start-position" : 64,
    "end-position" : 82,
    "concept-id" : "yXRQ_Ad9_E8V",
    "matched-string" : "restaurangbiträden",
    "annotation-id" : 8
  }, {
    "preferred-label" : "Restaurang",
    "type" : "keyword",
    "start-position" : 189,
    "end-position" : 204,
    "concept-id" : "o2Cg_3Ap_qvK",
    "matched-string" : "restaurangskola",
    "annotation-id" : 9
  }, {
    "preferred-label" : "Restaurang",
    "type" : "keyword",
    "start-position" : 245,
    "end-position" : 264,
    "concept-id" : "o2Cg_3Ap_qvK",
    "matched-string" : "restaurangbranschen",
    "annotation-id" : 10
  }, {
    "preferred-label" : "Svenska",
    "sentiment" : "MUST_HAVE",
    "type" : "language",
    "start-position" : 789,
    "end-position" : 796,
    "concept-id" : "zSLA_vw2_FXN",
    "matched-string" : "svenska",
    "annotation-id" : 1
  }, {
    "preferred-label" : "Personal",
    "sentiment" : "MUST_HAVE",
    "type" : "keyword",
    "start-position" : 1094,
    "end-position" : 1102,
    "concept-id" : "HVxM_6MS_y1c",
    "matched-string" : "personal",
    "annotation-id" : 2
  }, {
    "preferred-label" : "Restaurang",
    "type" : "keyword",
    "start-position" : 1149,
    "end-position" : 1168,
    "concept-id" : "o2Cg_3Ap_qvK",
    "matched-string" : "restaurangbranschen",
    "annotation-id" : 11
  }, {
    "preferred-label" : "Restaurang",
    "sentiment" : "MUST_HAVE",
    "type" : "keyword",
    "start-position" : 1269,
    "end-position" : 1279,
    "concept-id" : "o2Cg_3Ap_qvK",
    "matched-string" : "restaurang",
    "annotation-id" : 3
  }, {
    "preferred-label" : "Hotell och restaurang",
    "sentiment" : "MUST_HAVE",
    "type" : "keyword",
    "start-position" : 1332,
    "end-position" : 1353,
    "concept-id" : "F5kB_F4h_yc5",
    "matched-string" : "hotell och restaurang",
    "annotation-id" : 4
  }, {
    "preferred-label" : "Kontor",
    "sentiment" : "MUST_HAVE",
    "type" : "keyword",
    "start-position" : 1358,
    "end-position" : 1364,
    "concept-id" : "Hyz1_7HF_AkP",
    "matched-string" : "kontor",
    "annotation-id" : 5
  }, {
    "preferred-label" : "Guide",
    "sentiment" : "MUST_HAVE",
    "type" : "occupation-name",
    "start-position" : 1429,
    "end-position" : 1434,
    "concept-id" : "teRQ_AeD_uwx",
    "matched-string" : "guide",
    "annotation-id" : 6
  }, {
    "preferred-label" : "Hotell",
    "sentiment" : "MUST_HAVE",
    "type" : "keyword",
    "start-position" : 1491,
    "end-position" : 1497,
    "concept-id" : "Jrrg_iiS_2yp",
    "matched-string" : "hotell",
    "annotation-id" : 7
  } ],
  "text" : "Restaurangbiträde med passion för service sökes\nVi söker drivna restaurangbiträden som har glimten i ögat och brinner för bra service.\n\n\n\nVEM SÖKER VI?\nVi söker dig som har utbildning från restaurangskola och/eller har ett par års erfarenhet av restaurangbranschen Du är en utåtriktad och nyfiken person med driv som älskar nya utmaningar och är van att arbeta i högt tempo.\n\nKOMPETENS\n\nDu uppskattar kontakten med människor och arbetar på en hög servicenivå. Det är en förutsättning att du tycker om ett varierande arbete och snabbt kan sätta dig in i nya rutiner.\nDina arbetsuppgifter varierar men handlar om allt från beredning/påfyllning av salladsbuffé, vara behjälplig i disken, kunna stå i kassa samt se till att restaurangen ser ren och prydlig ut.\n\nDu behöver kunna tala flytande Svenska så att du kan kommunicera med dina gäster och förstå deras önskemål.\n\nVAD VI ERBJUDER?\n\nFlexibilitet och kontroll över ditt eget schema\n\nMöjlighet att kombinera ditt arbete hos oss med till exempel studier eller annan sysselsättning\n\nTrygga och bra villkor via HRF, Visita\n\nTillgänglighet för vår personal klockan 06-22 alla dagar\n\nEn språngbräda in i restaurangbranschen\n\nUtbildningar och utveckling\n\nVarierande arbetsuppgifter och arbetsplatser\n\nOM RESTAURANGASSISTANS\n\nRestaurang Assistans är Nordens största bemanningsföretag inom Hotell och Restaurang med kontor i Stockholm, Göteborg, Malmö och Oslo. Våra kunder är allt från Guide Michelin-krogar och guldkantade galor till rikstäckande hotell- och företagsrestauranger, konferensanläggningar, kursgårdar och cateringföretag. Vi arbetar efter ledorden Effektivitet, Kvalitet, Flexibilitet och Omtanke.\n\nVälkommen till oss!"
}