{
  "meta" : {
    "jobad" : {
      "description" : {
        "requirements" : null,
        "needs" : null,
        "company_information" : null,
        "text_formatted" : "<p>Vi söker en erfaren pizzabagare till vår restaurang. Vi ser att du är positiv, har känsla för service och är stresstålig. Du bör ha god planeringsförmåga och framförhållning. Som pizzabagare på därmedpasta ansvarar du för din station. Du planerar och förbereder samt tillverkar pizzor och diverse rätter.</p>",
        "conditions" : null,
        "text" : "Vi söker en erfaren pizzabagare till vår restaurang. Vi ser att du är positiv, har känsla för service och är stresstålig. Du bör ha god planeringsförmåga och framförhållning. Som pizzabagare på därmedpasta ansvarar du för din station. Du planerar och förbereder samt tillverkar pizzor och diverse rätter."
      },
      "headline" : "Pizzabagare sökes omgående",
      "driving_license" : null,
      "employer" : {
        "email" : null,
        "phone_number" : null,
        "organization_number" : "9696963736",
        "name" : "Därmed Pasta HB",
        "url" : "http://www.darmedpasta.se",
        "workplace" : "Därmedpasta"
      },
      "removed_date" : null,
      "logo_url" : null,
      "last_publication_date" : "2022-09-04T23:59:59",
      "number_of_vacancies" : 1,
      "occupation" : {
        "concept_id" : "9YaE_Syg_5ZB",
        "label" : "Pizzabagare",
        "legacy_ams_taxonomy_id" : "5505"
      },
      "occupation_group" : {
        "concept_id" : "a8gg_ktU_w8V",
        "label" : "Pizzabagare m.fl.",
        "legacy_ams_taxonomy_id" : "9411"
      },
      "employment_type" : {
        "concept_id" : "PFZr_Syz_cUq",
        "label" : "Vanlig anställning",
        "legacy_ams_taxonomy_id" : "1"
      },
      "webpage_url" : "https://arbetsformedlingen.se/platsbanken/annonser/26379725",
      "driving_license_required" : false,
      "application_contacts" : [ {
        "description" : null,
        "email" : null,
        "telephone" : "086683402",
        "name" : "Milenija Senicanin",
        "contact_type" : "Driftansvarig"
      } ],
      "duration" : {
        "concept_id" : "a7uU_j21_mkL",
        "label" : "Tills vidare",
        "legacy_ams_taxonomy_id" : "1"
      },
      "nice_to_have" : {
        "education_level" : [ ],
        "work_experiences" : [ ],
        "skills" : [ ],
        "education" : [ ],
        "languages" : [ ]
      },
      "application_details" : {
        "via_af" : false,
        "email" : null,
        "other" : "OBS Ansökan görs via telefon på 070-4159078 Vardagar mellan 10.00-18:00",
        "reference" : null,
        "url" : null,
        "information" : null
      },
      "source_type" : "VIA_ANNONSERA",
      "application_deadline" : "2022-09-04T23:59:59",
      "external_id" : null,
      "workplace_address" : {
        "coordinates" : [ 18.027336793347423, 59.3216384395969 ],
        "city" : "STOCKHOLM",
        "postcode" : "11733",
        "municipality" : "Stockholm",
        "region_concept_id" : "CifL_Rzy_Mku",
        "region" : "Stockholms län",
        "country_code" : "199",
        "region_code" : "01",
        "municipality_concept_id" : "AvNB_uwa_6n6",
        "country_concept_id" : "i46j_HmG_v64",
        "municipality_code" : "0180",
        "street_address" : "LÅNGHOLMSG 5",
        "country" : "Sverige"
      },
      "id" : "26379725",
      "experience_required" : true,
      "working_hours_type" : {
        "concept_id" : "6YE1_gAC_R2G",
        "label" : "Heltid",
        "legacy_ams_taxonomy_id" : "1"
      },
      "access" : null,
      "timestamp" : 1659684035318,
      "must_have" : {
        "education_level" : [ ],
        "work_experiences" : [ ],
        "skills" : [ ],
        "education" : [ ],
        "languages" : [ {
          "concept_id" : "zSLA_vw2_FXN",
          "weight" : 10,
          "label" : "Svenska",
          "legacy_ams_taxonomy_id" : "502"
        } ]
      },
      "occupation_field" : {
        "concept_id" : "ScKy_FHB_7wT",
        "label" : "Hotell, restaurang, storhushåll",
        "legacy_ams_taxonomy_id" : "7"
      },
      "scope_of_work" : {
        "min" : 0,
        "max" : 100
      },
      "salary_type" : {
        "concept_id" : "oG8G_9cW_nRf",
        "label" : "Fast månads- vecko- eller timlön",
        "legacy_ams_taxonomy_id" : "1"
      },
      "removed" : false,
      "salary_description" : null,
      "access_to_own_car" : false,
      "publication_date" : "2022-08-05T09:20:35"
    },
    "name" : "Pizzabagare sökes omgående",
    "user" : "hannes"
  },
  "sha1" : "0bda925649650d0f201f3c91c81be161e9d59b91",
  "annotations" : [ {
    "preferred-label" : "Pizzabagare",
    "sentiment" : "MUST_HAVE",
    "type" : "forecast-occupation",
    "start-position" : 0,
    "end-position" : 11,
    "concept-id" : "SyvN_uBW_USt",
    "matched-string" : "pizzabagare",
    "annotation-id" : 0
  }, {
    "preferred-label" : "Pizzabagare",
    "sentiment" : "MUST_HAVE",
    "type" : "forecast-occupation",
    "start-position" : 47,
    "end-position" : 58,
    "concept-id" : "SyvN_uBW_USt",
    "matched-string" : "pizzabagare",
    "annotation-id" : 1
  }, {
    "preferred-label" : "Restaurang",
    "sentiment" : "MUST_HAVE",
    "type" : "keyword",
    "start-position" : 68,
    "end-position" : 78,
    "concept-id" : "o2Cg_3Ap_qvK",
    "matched-string" : "restaurang",
    "annotation-id" : 2
  }, {
    "preferred-label" : "hantera stress",
    "type" : "esco-skill",
    "start-position" : 136,
    "end-position" : 147,
    "concept-id" : "z5Zo_DVb_VEK",
    "matched-string" : "stresstålig",
    "annotation-id" : 4
  }, {
    "preferred-label" : "Pizzabagare",
    "sentiment" : "MUST_HAVE",
    "type" : "forecast-occupation",
    "start-position" : 206,
    "end-position" : 217,
    "concept-id" : "SyvN_uBW_USt",
    "matched-string" : "pizzabagare",
    "annotation-id" : 3
  } ],
  "text" : "Pizzabagare sökes omgående\nVi söker en erfaren pizzabagare till vår restaurang. Vi ser att du är positiv, har känsla för service och är stresstålig. Du bör ha god planeringsförmåga och framförhållning. Som pizzabagare på därmedpasta ansvarar du för din station. Du planerar och förbereder samt tillverkar pizzor och diverse rätter."
}