{
  "meta" : {
    "jobad" : {
      "description" : {
        "requirements" : null,
        "needs" : null,
        "company_information" : null,
        "text_formatted" : "<p><strong>Extrajobb i Ljusdals krogliv </strong></p><p>Vi söker dig som vill vara en del av utelivet i stan och arbeta i en rolig och positiv miljö. Du är utåtriktad och tycker om att arbeta direkt mot gästerna för att skapa en trevlig stämning.  </p><p>Vill du ha ett socialt utvecklande extrajobb där ingen kväll är den andra lik? Då har vi jobbet för dig. </p><p>Cherry Spelglädje söker blivande dealers i Ljusdal. Vi erbjuder casino på barer, nattklubbar och restauranger. </p><p>Att arbeta som dealer är ett väldigt spännande jobb som lämpar sig bra för dig som studerar, behöver ett arbete till eller helt enkelt vill ha väldigt roligt på jobbet.  </p><p>Ett arbete hos oss är flexibelt då Cherry Spelglädje bedriver casino runt om i hela Sverige från Kiruna till Ystad. Så du kan med fördel ta med dig jobbet om du flyttar till annan ort.  </p><p>Inga förkunskaper krävs eftersom vi kostnadsfritt utbildar våra egna medarbetare. Åldersgräns är 18 år. Vi erbjuder minst fyra helgkvällar i månaden vilket motsvarar ca 20 timmar. Möjlighet att arbeta mer vardagar och helger utöver detta finns.  </p><p>Lönen varierar men hamnar på ca 150 - 250 kr i timmen beroende på resultatet och vilka timmar man jobbar. </p><p><strong>Känner du att detta är ett arbete som passar dig lämna du enkelt din ansökan på www.cherry.se/jobba/ Har du några frågor kan du kontakta Elsa Sörqvist som är Platschef i Södra Norrland, Du når Elsa på elsa.sorqvist@cherry.se. </strong></p>",
        "conditions" : null,
        "text" : "Extrajobb i Ljusdals krogliv \nVi söker dig som vill vara en del av utelivet i stan och arbeta i en rolig och positiv miljö. Du är utåtriktad och tycker om att arbeta direkt mot gästerna för att skapa en trevlig stämning.  \nVill du ha ett socialt utvecklande extrajobb där ingen kväll är den andra lik? Då har vi jobbet för dig. \nCherry Spelglädje söker blivande dealers i Ljusdal. Vi erbjuder casino på barer, nattklubbar och restauranger. \nAtt arbeta som dealer är ett väldigt spännande jobb som lämpar sig bra för dig som studerar, behöver ett arbete till eller helt enkelt vill ha väldigt roligt på jobbet.  \nEtt arbete hos oss är flexibelt då Cherry Spelglädje bedriver casino runt om i hela Sverige från Kiruna till Ystad. Så du kan med fördel ta med dig jobbet om du flyttar till annan ort.  \nInga förkunskaper krävs eftersom vi kostnadsfritt utbildar våra egna medarbetare. Åldersgräns är 18 år. Vi erbjuder minst fyra helgkvällar i månaden vilket motsvarar ca 20 timmar. Möjlighet att arbeta mer vardagar och helger utöver detta finns.  \nLönen varierar men hamnar på ca 150 - 250 kr i timmen beroende på resultatet och vilka timmar man jobbar. \nKänner du att detta är ett arbete som passar dig lämna du enkelt din ansökan på www.cherry.se/jobba/ Har du några frågor kan du kontakta Elsa Sörqvist som är Platschef i Södra Norrland, Du når Elsa på elsa.sorqvist@cherry.se."
      },
      "headline" : "Extrajobb i Ljusdal",
      "driving_license" : null,
      "employer" : {
        "email" : null,
        "phone_number" : null,
        "organization_number" : "5562253806",
        "name" : "Cherry Spelglädje AB",
        "url" : "http://www.cherryspelgladje.se",
        "workplace" : "Cherry Spelglädje AB"
      },
      "removed_date" : null,
      "logo_url" : "https://www.arbetsformedlingen.se/rest/arbetsgivare/rest/af/v3/arbetsplatser/10004838/logotyper/logo.png",
      "last_publication_date" : "2022-09-16T23:59:59",
      "number_of_vacancies" : 2,
      "occupation" : {
        "concept_id" : "r8ph_Hv3_eWg",
        "label" : "Dealer",
        "legacy_ams_taxonomy_id" : "2249"
      },
      "occupation_group" : {
        "concept_id" : "YHwG_fk2_MDL",
        "label" : "Croupierer och oddssättare m.fl.",
        "legacy_ams_taxonomy_id" : "4211"
      },
      "employment_type" : {
        "concept_id" : "PFZr_Syz_cUq",
        "label" : "Vanlig anställning",
        "legacy_ams_taxonomy_id" : "1"
      },
      "webpage_url" : "https://arbetsformedlingen.se/platsbanken/annonser/26433228",
      "driving_license_required" : false,
      "application_contacts" : [ {
        "description" : null,
        "email" : "elsa.sorqvist@cherry.se",
        "telephone" : "070 - 145 05 75",
        "name" : "Elsa Sörqvist",
        "contact_type" : null
      } ],
      "duration" : {
        "concept_id" : "a7uU_j21_mkL",
        "label" : "Tills vidare",
        "legacy_ams_taxonomy_id" : "1"
      },
      "nice_to_have" : {
        "education_level" : [ ],
        "work_experiences" : [ ],
        "skills" : [ ],
        "education" : [ ],
        "languages" : [ ]
      },
      "application_details" : {
        "via_af" : false,
        "email" : null,
        "other" : null,
        "reference" : null,
        "url" : "http://www.cherryspelgladje.se",
        "information" : null
      },
      "source_type" : "VIA_ANNONSERA",
      "application_deadline" : "2022-09-16T23:59:59",
      "external_id" : null,
      "workplace_address" : {
        "coordinates" : [ 16.064172824154767, 61.83230827894741 ],
        "city" : "LJUSDAL",
        "postcode" : "82730",
        "municipality" : "Ljusdal",
        "region_concept_id" : "zupA_8Nt_xcD",
        "region" : "Gävleborgs län",
        "country_code" : "199",
        "region_code" : "21",
        "municipality_concept_id" : "63iQ_V6F_REB",
        "country_concept_id" : "i46j_HmG_v64",
        "municipality_code" : "2161",
        "street_address" : null,
        "country" : "Sverige"
      },
      "id" : "26433228",
      "experience_required" : false,
      "working_hours_type" : {
        "concept_id" : "947z_JGS_Uk2",
        "label" : "Deltid",
        "legacy_ams_taxonomy_id" : "2"
      },
      "access" : null,
      "timestamp" : 1660919145285,
      "must_have" : {
        "education_level" : [ ],
        "work_experiences" : [ ],
        "skills" : [ ],
        "education" : [ ],
        "languages" : [ ]
      },
      "occupation_field" : {
        "concept_id" : "ScKy_FHB_7wT",
        "label" : "Hotell, restaurang, storhushåll",
        "legacy_ams_taxonomy_id" : "7"
      },
      "scope_of_work" : {
        "min" : 1,
        "max" : 20
      },
      "salary_type" : {
        "concept_id" : "asrX_9Df_ukn",
        "label" : "Fast och rörlig lön",
        "legacy_ams_taxonomy_id" : "7"
      },
      "removed" : false,
      "salary_description" : null,
      "access_to_own_car" : false,
      "publication_date" : "2022-08-19T16:25:45"
    },
    "name" : "Extrajobb i Ljusdal",
    "user" : "hannes"
  },
  "sha1" : "3f2413f01583582fe6e4048b7da9d43bb20ea9cf",
  "annotations" : [ {
    "preferred-label" : "Ljusdal",
    "sentiment" : "NOT_RELEVANT",
    "type" : "municipality",
    "start-position" : 12,
    "end-position" : 19,
    "concept-id" : "63iQ_V6F_REB",
    "matched-string" : "Ljusdal",
    "annotation-id" : 1
  }, {
    "preferred-label" : "Ljusdal",
    "sentiment" : "NOT_RELEVANT",
    "type" : "municipality",
    "start-position" : 32,
    "end-position" : 40,
    "concept-id" : "63iQ_V6F_REB",
    "matched-string" : "Ljusdals",
    "annotation-id" : 2
  }, {
    "preferred-label" : "Dealer",
    "sentiment" : "MUST_HAVE",
    "type" : "occupation-name",
    "start-position" : 382,
    "end-position" : 389,
    "concept-id" : "r8ph_Hv3_eWg",
    "matched-string" : "dealers",
    "annotation-id" : 4
  }, {
    "preferred-label" : "Ljusdal",
    "sentiment" : "NOT_RELEVANT",
    "type" : "municipality",
    "start-position" : 392,
    "end-position" : 399,
    "concept-id" : "63iQ_V6F_REB",
    "matched-string" : "Ljusdal",
    "annotation-id" : 3
  }, {
    "preferred-label" : "Dealer",
    "sentiment" : "MUST_HAVE",
    "type" : "occupation-name",
    "start-position" : 476,
    "end-position" : 482,
    "concept-id" : "r8ph_Hv3_eWg",
    "matched-string" : "dealer",
    "annotation-id" : 0
  } ],
  "text" : "Extrajobb i Ljusdal\nExtrajobb i Ljusdals krogliv \nVi söker dig som vill vara en del av utelivet i stan och arbeta i en rolig och positiv miljö. Du är utåtriktad och tycker om att arbeta direkt mot gästerna för att skapa en trevlig stämning.  \nVill du ha ett socialt utvecklande extrajobb där ingen kväll är den andra lik? Då har vi jobbet för dig. \nCherry Spelglädje söker blivande dealers i Ljusdal. Vi erbjuder casino på barer, nattklubbar och restauranger. \nAtt arbeta som dealer är ett väldigt spännande jobb som lämpar sig bra för dig som studerar, behöver ett arbete till eller helt enkelt vill ha väldigt roligt på jobbet.  \nEtt arbete hos oss är flexibelt då Cherry Spelglädje bedriver casino runt om i hela Sverige från Kiruna till Ystad. Så du kan med fördel ta med dig jobbet om du flyttar till annan ort.  \nInga förkunskaper krävs eftersom vi kostnadsfritt utbildar våra egna medarbetare. Åldersgräns är 18 år. Vi erbjuder minst fyra helgkvällar i månaden vilket motsvarar ca 20 timmar. Möjlighet att arbeta mer vardagar och helger utöver detta finns.  \nLönen varierar men hamnar på ca 150 - 250 kr i timmen beroende på resultatet och vilka timmar man jobbar. \nKänner du att detta är ett arbete som passar dig lämna du enkelt din ansökan på www.cherry.se/jobba/ Har du några frågor kan du kontakta Elsa Sörqvist som är Platschef i Södra Norrland, Du når Elsa på elsa.sorqvist@cherry.se."
}