{
  "meta" : {
    "jobad" : {
      "description" : {
        "requirements" : null,
        "needs" : null,
        "company_information" : null,
        "text_formatted" : "<p>Frisör salong Kungsholmen Fadi jabra</p><p>Vi letar efter duktig frisör kan klippa Dem/ Herr/ Barbering /  </p><p id=\"oppenforalla\">Öppen för alla\nVi fokuserar på din kompetens, inte dina övriga förutsättningar. Vi är öppna för att anpassa rollen eller arbetsplatsen efter dina behov.</p>",
        "conditions" : null,
        "text" : "Frisör salong Kungsholmen Fadi jabra\nVi letar efter duktig frisör kan klippa Dem/ Herr/ Barbering /  \nÖppen för alla\nVi fokuserar på din kompetens, inte dina övriga förutsättningar. Vi är öppna för att anpassa rollen eller arbetsplatsen efter dina behov."
      },
      "headline" : " Frisör sökes Kungsholmen salong Fadi jabra",
      "driving_license" : null,
      "employer" : {
        "email" : null,
        "phone_number" : null,
        "organization_number" : null,
        "name" : "Jabra, Fadi",
        "url" : null,
        "workplace" : "Jabra Fadi"
      },
      "removed_date" : null,
      "logo_url" : null,
      "last_publication_date" : "2022-08-31T23:59:59",
      "number_of_vacancies" : 2,
      "occupation" : {
        "concept_id" : "tuoE_9Nj_fAS",
        "label" : "Frisör",
        "legacy_ams_taxonomy_id" : "5491"
      },
      "occupation_group" : {
        "concept_id" : "LyBp_bY6_bZK",
        "label" : "Frisörer",
        "legacy_ams_taxonomy_id" : "5141"
      },
      "employment_type" : {
        "concept_id" : "PFZr_Syz_cUq",
        "label" : "Vanlig anställning",
        "legacy_ams_taxonomy_id" : "1"
      },
      "webpage_url" : "https://arbetsformedlingen.se/platsbanken/annonser/26332997",
      "driving_license_required" : false,
      "application_contacts" : [ ],
      "duration" : {
        "concept_id" : "a7uU_j21_mkL",
        "label" : "Tills vidare",
        "legacy_ams_taxonomy_id" : "1"
      },
      "nice_to_have" : {
        "education_level" : [ ],
        "work_experiences" : [ ],
        "skills" : [ ],
        "education" : [ ],
        "languages" : [ {
          "concept_id" : "zSLA_vw2_FXN",
          "weight" : 5,
          "label" : "Svenska",
          "legacy_ams_taxonomy_id" : "502"
        }, {
          "concept_id" : "NVxJ_hLg_TYS",
          "weight" : 5,
          "label" : "Engelska",
          "legacy_ams_taxonomy_id" : "283"
        } ]
      },
      "application_details" : {
        "via_af" : false,
        "email" : "Fadijabra@hotmail.com",
        "other" : null,
        "reference" : null,
        "url" : null,
        "information" : null
      },
      "source_type" : "VIA_ANNONSERA",
      "application_deadline" : "2022-08-31T23:59:59",
      "external_id" : null,
      "workplace_address" : {
        "coordinates" : [ null, null ],
        "city" : null,
        "postcode" : null,
        "municipality" : "Stockholm",
        "region_concept_id" : "CifL_Rzy_Mku",
        "region" : "Stockholms län",
        "country_code" : "199",
        "region_code" : "01",
        "municipality_concept_id" : "AvNB_uwa_6n6",
        "country_concept_id" : "i46j_HmG_v64",
        "municipality_code" : "0180",
        "street_address" : null,
        "country" : "Sverige"
      },
      "id" : "26332997",
      "experience_required" : true,
      "working_hours_type" : {
        "concept_id" : "6YE1_gAC_R2G",
        "label" : "Heltid",
        "legacy_ams_taxonomy_id" : "1"
      },
      "access" : null,
      "timestamp" : 1658006390296,
      "must_have" : {
        "education_level" : [ ],
        "work_experiences" : [ {
          "concept_id" : "tuoE_9Nj_fAS",
          "weight" : 10,
          "label" : "Frisör",
          "legacy_ams_taxonomy_id" : "5491"
        } ],
        "skills" : [ ],
        "education" : [ ],
        "languages" : [ ]
      },
      "occupation_field" : {
        "concept_id" : "Uuf1_GMh_Uvw",
        "label" : "Kropps- och skönhetsvård",
        "legacy_ams_taxonomy_id" : "4"
      },
      "scope_of_work" : {
        "min" : 0,
        "max" : 100
      },
      "salary_type" : {
        "concept_id" : "oG8G_9cW_nRf",
        "label" : "Fast månads- vecko- eller timlön",
        "legacy_ams_taxonomy_id" : "1"
      },
      "removed" : false,
      "salary_description" : null,
      "access_to_own_car" : false,
      "publication_date" : "2022-07-16T23:08:55"
    },
    "name" : " Frisör sökes Kungsholmen salong Fadi jabra",
    "user" : "kristof.fischer"
  },
  "sha1" : "b67802c62dde10371244e1308556017feea925f3",
  "annotations" : [ {
    "preferred-label" : "Frisör",
    "sentiment" : "MUST_HAVE",
    "type" : "occupation-name",
    "start-position" : 1,
    "end-position" : 7,
    "concept-id" : "tuoE_9Nj_fAS",
    "matched-string" : "frisör",
    "annotation-id" : 0
  }, {
    "preferred-label" : "Frisör",
    "sentiment" : "MUST_HAVE",
    "type" : "occupation-name",
    "start-position" : 44,
    "end-position" : 50,
    "concept-id" : "tuoE_9Nj_fAS",
    "matched-string" : "frisör",
    "annotation-id" : 1
  }, {
    "preferred-label" : "Frisör",
    "sentiment" : "MUST_HAVE",
    "type" : "occupation-name",
    "start-position" : 103,
    "end-position" : 109,
    "concept-id" : "tuoE_9Nj_fAS",
    "matched-string" : "frisör",
    "annotation-id" : 2
  }, {
    "preferred-label" : "behandla skägg och mustascher",
    "sentiment" : "MUST_HAVE",
    "type" : "esco-skill",
    "start-position" : 132,
    "end-position" : 141,
    "concept-id" : "TD6B_28Q_wDn",
    "matched-string" : "Barbering",
    "annotation-id" : 3
  } ],
  "text" : " Frisör sökes Kungsholmen salong Fadi jabra\nFrisör salong Kungsholmen Fadi jabra\nVi letar efter duktig frisör kan klippa Dem/ Herr/ Barbering /  \nÖppen för alla\nVi fokuserar på din kompetens, inte dina övriga förutsättningar. Vi är öppna för att anpassa rollen eller arbetsplatsen efter dina behov."
}