{
  "meta" : {
    "jobad" : {
      "description" : {
        "requirements" : null,
        "needs" : null,
        "company_information" : null,
        "text_formatted" : "Vi söker nu en Operatör till Byggelit<br><br><strong>Arbetet </strong><br>Som maskinoperatör hos Byggelit kommer du arbeta i något av företagets produktionsflöden. Du i dina arbetsuppgifter kan det ingå att övervaka produktionslinjen, följa och hålla uppsatta produktionsmål, utföra kvalitetskontroller, dokumentera, märka och föra data över producerat material. Oftast är uppgifterna varierande och arbetet bedrivs i lag med stort eget ansvar. Utbildning på maskinerna sker internt och det jobbas intensivt med ständiga förbättringar där allas delaktighet är en självklarhet. <br><br><strong>Kvalifikationer</strong><br>Vi söker dig som har erfarenhet och vill arbeta i  produktionsindustrin. Meriterande är om du har en industriteknisk gymnasieutbildning med erfarenhet från produktionsarbete. Har du utbildning på och erfarenhet av truckkörning är det meriterande men inte ett absolut krav. <br><br>För att lyckas i rollen som operatör hos oss på Byggelit tror vi att du som person är lösningsorienterad, prestigelös och noggrann. Vi tror att du trivs med att ha eget ansvar och kan ta egna initiativ. Samarbetsförmåga och en vilja att lära sig är egenskaper vi värderar högt.<br><br><strong>Omfattning och tillträde</strong><br>Heltid, tillsvidareanställning (6 månaders provanställning kan tillämpas).<br>Skiftgång <p><strong>Rekryteringsprocessen </strong><br>I den här rekryteringen samarbetar vi med OnePartnerGroup. <br>Du gör din ansökan genom vår hemsida www.onepartnergroup.se. Sista dag för ansökan är 2022-07-24, men skicka gärna in din ansökan så snart som möjligt då vi arbetar med löpande rekrytering. <br><br>•    Telefonintervju<br>•    Första intervju med OnePartnerGroup Jämtland <br>•    Andra intervju med Byggelit <br>•    Referenstagning <br>•    Slutintervju </p><p>Vid frågor kring tjänsten och rekryteringsprocessen, kontakta:<br>Elina Nyström – Kandidatansvarig<br>T:  070-815 03 64<br>E: <a href=\"mailto:elina.nystrom@onepartnergroup.se\" style=\"color:#0563c1; text-decoration:underline\">elina.nystrom@onepartnergroup.se</a><br> </p>",
        "conditions" : null,
        "text" : "Vi söker nu en Operatör till Byggelit\n\nArbetet \nSom maskinoperatör hos Byggelit kommer du arbeta i något av företagets produktionsflöden. Du i dina arbetsuppgifter kan det ingå att övervaka produktionslinjen, följa och hålla uppsatta produktionsmål, utföra kvalitetskontroller, dokumentera, märka och föra data över producerat material. Oftast är uppgifterna varierande och arbetet bedrivs i lag med stort eget ansvar. Utbildning på maskinerna sker internt och det jobbas intensivt med ständiga förbättringar där allas delaktighet är en självklarhet. \n\nKvalifikationer\nVi söker dig som har erfarenhet och vill arbeta i  produktionsindustrin. Meriterande är om du har en industriteknisk gymnasieutbildning med erfarenhet från produktionsarbete. Har du utbildning på och erfarenhet av truckkörning är det meriterande men inte ett absolut krav. \n\nFör att lyckas i rollen som operatör hos oss på Byggelit tror vi att du som person är lösningsorienterad, prestigelös och noggrann. Vi tror att du trivs med att ha eget ansvar och kan ta egna initiativ. Samarbetsförmåga och en vilja att lära sig är egenskaper vi värderar högt.\n\nOmfattning och tillträde\nHeltid, tillsvidareanställning (6 månaders provanställning kan tillämpas).\nSkiftgång \nRekryteringsprocessen \nI den här rekryteringen samarbetar vi med OnePartnerGroup. \nDu gör din ansökan genom vår hemsida www.onepartnergroup.se. Sista dag för ansökan är 2022-07-24, men skicka gärna in din ansökan så snart som möjligt då vi arbetar med löpande rekrytering. \n\n•    Telefonintervju\n•    Första intervju med OnePartnerGroup Jämtland \n•    Andra intervju med Byggelit \n•    Referenstagning \n•    Slutintervju \nVid frågor kring tjänsten och rekryteringsprocessen, kontakta:\nElina Nyström – Kandidatansvarig\nT:  070-815 03 64\nE: elina.nystrom@onepartnergroup.se"
      },
      "headline" : "Operatörer Byggelit",
      "driving_license" : null,
      "employer" : {
        "email" : null,
        "phone_number" : null,
        "organization_number" : "5590937537",
        "name" : "OnePartnerGroup Jämtland AB",
        "url" : null,
        "workplace" : "Byggelit Sverige AB"
      },
      "removed_date" : null,
      "logo_url" : null,
      "last_publication_date" : "2022-07-24T23:59:59",
      "number_of_vacancies" : 1,
      "occupation" : {
        "concept_id" : "2ouu_Ebh_M4B",
        "label" : "Maskinsnickare/Operatör, trävaruindustri",
        "legacy_ams_taxonomy_id" : "6606"
      },
      "occupation_group" : {
        "concept_id" : "VKKg_e4t_t46",
        "label" : "Maskinsnickare och maskinoperatörer, träindustri",
        "legacy_ams_taxonomy_id" : "7523"
      },
      "employment_type" : {
        "concept_id" : "PFZr_Syz_cUq",
        "label" : "Vanlig anställning",
        "legacy_ams_taxonomy_id" : "1"
      },
      "webpage_url" : "https://arbetsformedlingen.se/platsbanken/annonser/26234784",
      "driving_license_required" : false,
      "application_contacts" : [ {
        "description" : "Gustaf Wrangbäck",
        "email" : "gustaf.wrangback@onepartnergroup.se",
        "telephone" : null,
        "name" : null,
        "contact_type" : null
      } ],
      "duration" : {
        "concept_id" : "a7uU_j21_mkL",
        "label" : "Tills vidare",
        "legacy_ams_taxonomy_id" : "1"
      },
      "nice_to_have" : {
        "education_level" : [ ],
        "work_experiences" : [ ],
        "skills" : [ ],
        "education" : [ ],
        "languages" : [ ]
      },
      "application_details" : {
        "via_af" : false,
        "email" : null,
        "other" : null,
        "reference" : null,
        "url" : "https://apply.recman.no/job_post.php?id=278001&path=ams&sub_id=462",
        "information" : null
      },
      "source_type" : "VIA_PLATSBANKEN_DXA",
      "application_deadline" : "2022-07-24T23:59:59",
      "external_id" : "46-559093-7537-27800162a19571b405b",
      "workplace_address" : {
        "coordinates" : [ 14.636068, 63.17668 ],
        "city" : null,
        "postcode" : null,
        "municipality" : "Östersund",
        "region_concept_id" : "65Ms_7r1_RTG",
        "region" : "Jämtlands län",
        "country_code" : "199",
        "region_code" : "23",
        "municipality_concept_id" : "Vt7P_856_WZS",
        "country_concept_id" : "i46j_HmG_v64",
        "municipality_code" : "2380",
        "street_address" : null,
        "country" : "Sverige"
      },
      "id" : "26234784",
      "experience_required" : true,
      "working_hours_type" : {
        "concept_id" : "6YE1_gAC_R2G",
        "label" : "Heltid",
        "legacy_ams_taxonomy_id" : "1"
      },
      "access" : null,
      "timestamp" : 1655712828269,
      "must_have" : {
        "education_level" : [ ],
        "work_experiences" : [ {
          "concept_id" : "2ouu_Ebh_M4B",
          "weight" : 10,
          "label" : "Maskinsnickare, trävaruindustri/Operatör, trävaruindustri",
          "legacy_ams_taxonomy_id" : "6606"
        } ],
        "skills" : [ ],
        "education" : [ ],
        "languages" : [ ]
      },
      "occupation_field" : {
        "concept_id" : "wTEr_CBC_bqh",
        "label" : "Industriell tillverkning",
        "legacy_ams_taxonomy_id" : "9"
      },
      "scope_of_work" : {
        "min" : 100,
        "max" : 100
      },
      "salary_type" : {
        "concept_id" : "oG8G_9cW_nRf",
        "label" : "Fast månads- vecko- eller timlön",
        "legacy_ams_taxonomy_id" : "1"
      },
      "removed" : false,
      "salary_description" : null,
      "access_to_own_car" : false,
      "publication_date" : "2022-06-20T10:13:48"
    },
    "name" : "Operatörer Byggelit",
    "user" : "fisko"
  },
  "sha1" : "2e2a082563b836b92a5daf62c291c2676ac05e13",
  "annotations" : [ {
    "preferred-label" : "Maskinoperatör, mekanisk verkstad",
    "type" : "occupation-name",
    "start-position" : 72,
    "end-position" : 86,
    "concept-id" : "Z4Tt_Gwt_NGP",
    "matched-string" : "maskinoperatör",
    "annotation-id" : 2
  }, {
    "preferred-label" : "Produktionsteknik",
    "sentiment" : "MUST_HAVE",
    "type" : "skill",
    "start-position" : 640,
    "end-position" : 660,
    "concept-id" : "PuQP_aBK_nqJ",
    "matched-string" : "produktionsindustrin",
    "annotation-id" : 3
  }, {
    "preferred-label" : "Teknik, undervisning gymnasienivå",
    "sentiment" : "NICE_TO_HAVE",
    "type" : "skill",
    "start-position" : 690,
    "end-position" : 724,
    "concept-id" : "94Fw_DVh_WB3",
    "matched-string" : "industriteknisk gymnasieutbildning",
    "annotation-id" : 4
  }, {
    "preferred-label" : "Produktionsteknik",
    "sentiment" : "NICE_TO_HAVE",
    "type" : "skill",
    "start-position" : 745,
    "end-position" : 762,
    "concept-id" : "PuQP_aBK_nqJ",
    "matched-string" : "produktionsarbete",
    "annotation-id" : 5
  }, {
    "preferred-label" : "Truckvana",
    "sentiment" : "NICE_TO_HAVE",
    "type" : "skill",
    "start-position" : 803,
    "end-position" : 815,
    "concept-id" : "pGts_PKK_c8W",
    "matched-string" : "truckkörning",
    "annotation-id" : 6
  }, {
    "preferred-label" : "hitta lösningar på problem",
    "sentiment" : "MUST_HAVE",
    "type" : "esco-skill",
    "start-position" : 950,
    "end-position" : 968,
    "concept-id" : "WFSY_Bwt_QWE",
    "matched-string" : "lösningsorienterad",
    "annotation-id" : 7
  }, {
    "preferred-label" : "noggrannhet",
    "sentiment" : "MUST_HAVE",
    "type" : "esco-skill",
    "start-position" : 986,
    "end-position" : 994,
    "concept-id" : "mrsW_EkL_KRD",
    "matched-string" : "noggrann",
    "annotation-id" : 8
  } ],
  "text" : "Operatörer Byggelit\nVi söker nu en Operatör till Byggelit\n\nArbetet \nSom maskinoperatör hos Byggelit kommer du arbeta i något av företagets produktionsflöden. Du i dina arbetsuppgifter kan det ingå att övervaka produktionslinjen, följa och hålla uppsatta produktionsmål, utföra kvalitetskontroller, dokumentera, märka och föra data över producerat material. Oftast är uppgifterna varierande och arbetet bedrivs i lag med stort eget ansvar. Utbildning på maskinerna sker internt och det jobbas intensivt med ständiga förbättringar där allas delaktighet är en självklarhet. \n\nKvalifikationer\nVi söker dig som har erfarenhet och vill arbeta i  produktionsindustrin. Meriterande är om du har en industriteknisk gymnasieutbildning med erfarenhet från produktionsarbete. Har du utbildning på och erfarenhet av truckkörning är det meriterande men inte ett absolut krav. \n\nFör att lyckas i rollen som operatör hos oss på Byggelit tror vi att du som person är lösningsorienterad, prestigelös och noggrann. Vi tror att du trivs med att ha eget ansvar och kan ta egna initiativ. Samarbetsförmåga och en vilja att lära sig är egenskaper vi värderar högt.\n\nOmfattning och tillträde\nHeltid, tillsvidareanställning (6 månaders provanställning kan tillämpas).\nSkiftgång \nRekryteringsprocessen \nI den här rekryteringen samarbetar vi med OnePartnerGroup. \nDu gör din ansökan genom vår hemsida www.onepartnergroup.se. Sista dag för ansökan är 2022-07-24, men skicka gärna in din ansökan så snart som möjligt då vi arbetar med löpande rekrytering. \n\n•    Telefonintervju\n•    Första intervju med OnePartnerGroup Jämtland \n•    Andra intervju med Byggelit \n•    Referenstagning \n•    Slutintervju \nVid frågor kring tjänsten och rekryteringsprocessen, kontakta:\nElina Nyström – Kandidatansvarig\nT:  070-815 03 64\nE: elina.nystrom@onepartnergroup.se"
}