{
  "meta" : {
    "jobad" : {
      "description" : {
        "requirements" : null,
        "needs" : null,
        "company_information" : null,
        "text_formatted" : "Vi söker dig som är en driven och ödmjuk Scrum Master till ett uppdrag i ett tvärfunktionellt team hos vår kund i Stockholm. \n\nDu är en erfaren Scrum Master med flera års erfarenhet av uppdrag med en tydlig ledarroll. Du har tidigare erfarenhet av arbete från större organisation och tvärfunktionella team. Du kanske har varit ledare med personalansvar där du har arbetat agilt? Du har varit med om att införa nya arbetssätt. Du behöver även kunna svenska och engelska i tal och skrift. \n\nKortfattade arbetsuppgifter \n\n- Skapa rutiner och arbetssätt i en agil verksamhet \n- Coacha medarbetarna i Scrum och Kanban \n- Facilitera aktiviteter och kommunikation mellan teamen \n- Delta i regelbundna projekt- och förvaltningsmöten \n\n\n\nPersonliga egenskaper som behövs är prestigelös, uthållig och har en förmåga att skapa förtroende. \n\nUppdraget är en del av Quest Consulting personaluthyrning. Du kommer vara anställd av Quest Consulting och arbeta som konsult hos vår kund.\n\nDin ansökan\n\nLåter rollen intressant och passande? Ansök i så fall omgående för vi intervjuar löpande och rollen kan tillsättas innan sista ansökningsdatum. \n\nVi är flera rekryterare som hanterar rekryteringen av denna tjänst, vid frågor gällande den här rekryteringen eller tjänsten når du oss enklast på e-post info@quest.se \n\nVi kan enbart ta emot och bearbeta din ansökan genom att du registrerar ditt CV i vår portal. Med avseende på GDPR kan vi ej ta emot ansökningar via e-post. \n\nVarmt välkommen med din ansökan! \n\nUppdraget är en del av Quest Consulting personaluthyrning. Du kommer att vara anställd av Quest Consulting och arbeta som konsult hos vår kund.\n\nOm Quest Consulting\n\nQuest Consulting är ett auktoriserat konsultbolag med kollektivavtal, försäkringar, friskvård och tjänstepension. Vi är specialiserade inom IT, Teknik, HR, Administration och Ekonomi. Vår målsättning är att vara din personliga samarbetspartner och just därför är det så viktigt för oss att arbeta efter våra kärnvärden där våra ledord är att vara Personliga, Nyskapande och Professionella.",
        "conditions" : "Heltid\r\nTillsvidare",
        "text" : "Vi söker dig som är en driven och ödmjuk Scrum Master till ett uppdrag i ett tvärfunktionellt team hos vår kund i Stockholm. \n\nDu är en erfaren Scrum Master med flera års erfarenhet av uppdrag med en tydlig ledarroll. Du har tidigare erfarenhet av arbete från större organisation och tvärfunktionella team. Du kanske har varit ledare med personalansvar där du har arbetat agilt? Du har varit med om att införa nya arbetssätt. Du behöver även kunna svenska och engelska i tal och skrift. \n\nKortfattade arbetsuppgifter \n\n- Skapa rutiner och arbetssätt i en agil verksamhet \n- Coacha medarbetarna i Scrum och Kanban \n- Facilitera aktiviteter och kommunikation mellan teamen \n- Delta i regelbundna projekt- och förvaltningsmöten \n\n\n\nPersonliga egenskaper som behövs är prestigelös, uthållig och har en förmåga att skapa förtroende. \n\nUppdraget är en del av Quest Consulting personaluthyrning. Du kommer vara anställd av Quest Consulting och arbeta som konsult hos vår kund.\n\nDin ansökan\n\nLåter rollen intressant och passande? Ansök i så fall omgående för vi intervjuar löpande och rollen kan tillsättas innan sista ansökningsdatum. \n\nVi är flera rekryterare som hanterar rekryteringen av denna tjänst, vid frågor gällande den här rekryteringen eller tjänsten når du oss enklast på e-post info@quest.se \n\nVi kan enbart ta emot och bearbeta din ansökan genom att du registrerar ditt CV i vår portal. Med avseende på GDPR kan vi ej ta emot ansökningar via e-post. \n\nVarmt välkommen med din ansökan! \n\nUppdraget är en del av Quest Consulting personaluthyrning. Du kommer att vara anställd av Quest Consulting och arbeta som konsult hos vår kund.\n\nOm Quest Consulting\n\nQuest Consulting är ett auktoriserat konsultbolag med kollektivavtal, försäkringar, friskvård och tjänstepension. Vi är specialiserade inom IT, Teknik, HR, Administration och Ekonomi. Vår målsättning är att vara din personliga samarbetspartner och just därför är det så viktigt för oss att arbeta efter våra kärnvärden där våra ledord är att vara Personliga, Nyskapande och Professionella."
      },
      "headline" : "Scrum Master-  Offentlig sektor",
      "driving_license" : null,
      "employer" : {
        "email" : null,
        "phone_number" : null,
        "organization_number" : "5569456659",
        "name" : "Quest Consulting Sverige AB",
        "url" : null,
        "workplace" : "Quest Consulting"
      },
      "removed_date" : null,
      "logo_url" : "https://www.arbetsformedlingen.se/rest/arbetsgivare/rest/af/v3/organisation/5569456659/logotyper/logo.png",
      "last_publication_date" : "2022-08-25T23:59:59",
      "number_of_vacancies" : 1,
      "occupation" : {
        "concept_id" : "z5AM_ayf_WcL",
        "label" : "Projektledare, IT",
        "legacy_ams_taxonomy_id" : "5388"
      },
      "occupation_group" : {
        "concept_id" : "DJh5_yyF_hEM",
        "label" : "Mjukvaru- och systemutvecklare m.fl.",
        "legacy_ams_taxonomy_id" : "2512"
      },
      "employment_type" : {
        "concept_id" : "PFZr_Syz_cUq",
        "label" : "Vanlig anställning",
        "legacy_ams_taxonomy_id" : "1"
      },
      "webpage_url" : "https://arbetsformedlingen.se/platsbanken/annonser/26359344",
      "driving_license_required" : false,
      "application_contacts" : [ {
        "description" : "Quest Consulting",
        "email" : null,
        "telephone" : null,
        "name" : null,
        "contact_type" : null
      } ],
      "duration" : {
        "concept_id" : "a7uU_j21_mkL",
        "label" : "Tills vidare",
        "legacy_ams_taxonomy_id" : "1"
      },
      "nice_to_have" : {
        "education_level" : [ ],
        "work_experiences" : [ ],
        "skills" : [ ],
        "education" : [ ],
        "languages" : [ ]
      },
      "application_details" : {
        "via_af" : false,
        "email" : null,
        "other" : null,
        "reference" : null,
        "url" : "https://www.quest.se/lediga-jobb?mtrpage=assignment&mtrt=ams&mtrid=2102",
        "information" : null
      },
      "source_type" : "VIA_PLATSBANKEN_DXA",
      "application_deadline" : "2022-08-25T23:59:59",
      "external_id" : "46-556945-6659-2102",
      "workplace_address" : {
        "coordinates" : [ 18.06858, 59.329323 ],
        "city" : null,
        "postcode" : null,
        "municipality" : "Stockholm",
        "region_concept_id" : "CifL_Rzy_Mku",
        "region" : "Stockholms län",
        "country_code" : "199",
        "region_code" : "01",
        "municipality_concept_id" : "AvNB_uwa_6n6",
        "country_concept_id" : "i46j_HmG_v64",
        "municipality_code" : "0180",
        "street_address" : null,
        "country" : "Sverige"
      },
      "id" : "26359344",
      "experience_required" : true,
      "working_hours_type" : {
        "concept_id" : "6YE1_gAC_R2G",
        "label" : "Heltid",
        "legacy_ams_taxonomy_id" : "1"
      },
      "access" : null,
      "timestamp" : 1658993134943,
      "must_have" : {
        "education_level" : [ ],
        "work_experiences" : [ {
          "concept_id" : "z5AM_ayf_WcL",
          "weight" : 10,
          "label" : "Projektledare, IT",
          "legacy_ams_taxonomy_id" : "5388"
        } ],
        "skills" : [ ],
        "education" : [ ],
        "languages" : [ ]
      },
      "occupation_field" : {
        "concept_id" : "apaJ_2ja_LuF",
        "label" : "Data/IT",
        "legacy_ams_taxonomy_id" : "3"
      },
      "scope_of_work" : {
        "min" : 100,
        "max" : 100
      },
      "salary_type" : {
        "concept_id" : "oG8G_9cW_nRf",
        "label" : "Fast månads- vecko- eller timlön",
        "legacy_ams_taxonomy_id" : "1"
      },
      "removed" : false,
      "salary_description" : "Månadslön",
      "access_to_own_car" : false,
      "publication_date" : "2022-07-28T09:25:34"
    },
    "name" : "Scrum Master-  Offentlig sektor",
    "user" : "hannes"
  },
  "sha1" : "ba1d9afe1ea09c7e6791e833f1b193614a39b3e3",
  "annotations" : [ {
    "preferred-label" : "Scrum master",
    "sentiment" : "MUST_HAVE",
    "type" : "occupation-name",
    "start-position" : 0,
    "end-position" : 12,
    "concept-id" : "1UTZ_bS9_kUD",
    "matched-string" : "scrum master",
    "annotation-id" : 0
  }, {
    "preferred-label" : "Offentlig förvaltning",
    "type" : "sni-level-3",
    "start-position" : 15,
    "end-position" : 31,
    "concept-id" : "V5bJ_aFm_KMm",
    "matched-string" : "Offentlig sektor",
    "annotation-id" : 15
  }, {
    "preferred-label" : "Scrum master",
    "sentiment" : "MUST_HAVE",
    "type" : "occupation-name",
    "start-position" : 73,
    "end-position" : 85,
    "concept-id" : "1UTZ_bS9_kUD",
    "matched-string" : "scrum master",
    "annotation-id" : 1
  }, {
    "preferred-label" : "Stockholm",
    "type" : "municipality",
    "start-position" : 146,
    "end-position" : 155,
    "concept-id" : "AvNB_uwa_6n6",
    "matched-string" : "Stockholm",
    "annotation-id" : 16
  }, {
    "preferred-label" : "Scrum master",
    "sentiment" : "MUST_HAVE",
    "type" : "occupation-name",
    "start-position" : 176,
    "end-position" : 188,
    "concept-id" : "1UTZ_bS9_kUD",
    "matched-string" : "scrum master",
    "annotation-id" : 2
  }, {
    "preferred-label" : "Personalansvar",
    "sentiment" : "MUST_HAVE",
    "type" : "skill",
    "start-position" : 370,
    "end-position" : 384,
    "concept-id" : "ZzN5_m7B_5CY",
    "matched-string" : "personalansvar",
    "annotation-id" : 3
  }, {
    "preferred-label" : "Agila arbetsmetoder",
    "type" : "skill",
    "start-position" : 396,
    "end-position" : 409,
    "concept-id" : "TMVb_DnH_etF",
    "matched-string" : "arbetat agilt",
    "annotation-id" : 17
  }, {
    "preferred-label" : "Svenska",
    "sentiment" : "MUST_HAVE",
    "type" : "language",
    "start-position" : 480,
    "end-position" : 487,
    "concept-id" : "zSLA_vw2_FXN",
    "matched-string" : "svenska",
    "annotation-id" : 4
  }, {
    "preferred-label" : "Engelska",
    "sentiment" : "MUST_HAVE",
    "type" : "language",
    "start-position" : 492,
    "end-position" : 500,
    "concept-id" : "NVxJ_hLg_TYS",
    "matched-string" : "engelska",
    "annotation-id" : 5
  }, {
    "preferred-label" : "Agila arbetsmetoder",
    "type" : "skill",
    "start-position" : 559,
    "end-position" : 602,
    "concept-id" : "TMVb_DnH_etF",
    "matched-string" : "rutiner och arbetssätt i en agil verksamhet",
    "annotation-id" : 18
  }, {
    "preferred-label" : "Scrum, systemutvecklingsmetod",
    "sentiment" : "MUST_HAVE",
    "type" : "skill",
    "start-position" : 628,
    "end-position" : 633,
    "concept-id" : "Cnqu_REg_6jo",
    "matched-string" : "scrum",
    "annotation-id" : 6
  }, {
    "preferred-label" : "Kanban, systemutvecklingsverktyg",
    "sentiment" : "MUST_HAVE",
    "type" : "skill",
    "start-position" : 638,
    "end-position" : 644,
    "concept-id" : "mRpj_JZE_DxB",
    "matched-string" : "kanban",
    "annotation-id" : 7
  }, {
    "preferred-label" : "Personaluthyrning",
    "sentiment" : "MUST_HAVE",
    "type" : "sni-level-3",
    "start-position" : 902,
    "end-position" : 919,
    "concept-id" : "eUC5_9NM_qNC",
    "matched-string" : "personaluthyrning",
    "annotation-id" : 8
  }, {
    "preferred-label" : "Rekryterare/Rekryteringskonsult",
    "sentiment" : "MUST_HAVE",
    "type" : "occupation-name",
    "start-position" : 1174,
    "end-position" : 1185,
    "concept-id" : "QaQC_ozP_Bme",
    "matched-string" : "rekryterare",
    "annotation-id" : 9
  }, {
    "preferred-label" : "Personaluthyrning",
    "sentiment" : "MUST_HAVE",
    "type" : "sni-level-3",
    "start-position" : 1566,
    "end-position" : 1583,
    "concept-id" : "eUC5_9NM_qNC",
    "matched-string" : "personaluthyrning",
    "annotation-id" : 10
  }, {
    "preferred-label" : "Kollektivavtal",
    "sentiment" : "MUST_HAVE",
    "type" : "skill",
    "start-position" : 1746,
    "end-position" : 1760,
    "concept-id" : "z7wE_9xb_3jX",
    "matched-string" : "kollektivavtal",
    "annotation-id" : 11
  }, {
    "preferred-label" : "Friskvård",
    "sentiment" : "MUST_HAVE",
    "type" : "keyword",
    "start-position" : 1776,
    "end-position" : 1785,
    "concept-id" : "yoHe_xjK_qjH",
    "matched-string" : "friskvård",
    "annotation-id" : 12
  }, {
    "preferred-label" : "Data/IT",
    "sentiment" : "MUST_HAVE",
    "type" : "occupation-field",
    "start-position" : 1832,
    "end-position" : 1834,
    "concept-id" : "apaJ_2ja_LuF",
    "matched-string" : "it",
    "annotation-id" : 13
  }, {
    "preferred-label" : "Ekonomi",
    "sentiment" : "MUST_HAVE",
    "type" : "keyword",
    "start-position" : 1867,
    "end-position" : 1874,
    "concept-id" : "PW4f_bmT_new",
    "matched-string" : "ekonomi",
    "annotation-id" : 14
  } ],
  "text" : "Scrum Master-  Offentlig sektor\nVi söker dig som är en driven och ödmjuk Scrum Master till ett uppdrag i ett tvärfunktionellt team hos vår kund i Stockholm. \n\nDu är en erfaren Scrum Master med flera års erfarenhet av uppdrag med en tydlig ledarroll. Du har tidigare erfarenhet av arbete från större organisation och tvärfunktionella team. Du kanske har varit ledare med personalansvar där du har arbetat agilt? Du har varit med om att införa nya arbetssätt. Du behöver även kunna svenska och engelska i tal och skrift. \n\nKortfattade arbetsuppgifter \n\n- Skapa rutiner och arbetssätt i en agil verksamhet \n- Coacha medarbetarna i Scrum och Kanban \n- Facilitera aktiviteter och kommunikation mellan teamen \n- Delta i regelbundna projekt- och förvaltningsmöten \n\n\n\nPersonliga egenskaper som behövs är prestigelös, uthållig och har en förmåga att skapa förtroende. \n\nUppdraget är en del av Quest Consulting personaluthyrning. Du kommer vara anställd av Quest Consulting och arbeta som konsult hos vår kund.\n\nDin ansökan\n\nLåter rollen intressant och passande? Ansök i så fall omgående för vi intervjuar löpande och rollen kan tillsättas innan sista ansökningsdatum. \n\nVi är flera rekryterare som hanterar rekryteringen av denna tjänst, vid frågor gällande den här rekryteringen eller tjänsten når du oss enklast på e-post info@quest.se \n\nVi kan enbart ta emot och bearbeta din ansökan genom att du registrerar ditt CV i vår portal. Med avseende på GDPR kan vi ej ta emot ansökningar via e-post. \n\nVarmt välkommen med din ansökan! \n\nUppdraget är en del av Quest Consulting personaluthyrning. Du kommer att vara anställd av Quest Consulting och arbeta som konsult hos vår kund.\n\nOm Quest Consulting\n\nQuest Consulting är ett auktoriserat konsultbolag med kollektivavtal, försäkringar, friskvård och tjänstepension. Vi är specialiserade inom IT, Teknik, HR, Administration och Ekonomi. Vår målsättning är att vara din personliga samarbetspartner och just därför är det så viktigt för oss att arbeta efter våra kärnvärden där våra ledord är att vara Personliga, Nyskapande och Professionella."
}