{
  "meta" : {
    "jobad" : {
      "description" : {
        "requirements" : null,
        "needs" : null,
        "company_information" : null,
        "text_formatted" : "<p>Axevalla folkhögskola är känd för sin goda och varierande mat. Hos oss kan man äta frukost, lunch och ibland middag på vardagarna samt festmiddagar på beställning. Matgästerna består av skolans internatelever, personal och kortkursdeltagare och antalet kan variera mellan ett tjugotal och flera hundra per dag.</p><p>Som arbetsgivare värnar vi om alla våra medarbetare och erbjuder bl.a. kompetensutveckling och friskvårdsbidrag. Vi är en demokratisk arbetsplats och här har du goda möjligheter att utveckla vår verksamhet.</p><p>Nu söker vi en engagerad kock som på ett självständigt sätt och i god laganda med kollegorna kan möta gäster och ge bästa service. </p><p>ARBETSUPPGIFTER</p><p>Du kommer att arbeta som kock inom vårt skolkök tillsammans med tre andra personer. Dina arbetsuppgifter består av matberedning och servering.</p><p>OM ARBETET</p><p>Denna tillsvidareanställning omfattar 100%  med start i september.</p><p>Schema: Dagtid, måndag – fredag + helger</p><p>Vi tillämpar Kommunals kollektivavtal. </p><p>KVALIFIKATIONER</p><p>Du har relevant köksutbildning och/eller relevant arbetslivserfarenhet som arbetsgivaren bedömer likvärdig. Du behärskar svenska språket i såväl tal som skrift, du kan ta till dig skrivna instruktioner och har förmågan att kommunicera med ditt arbetsteam. Du kommer att använda dator i ditt arbete.</p><p>Du bidrar gärna till ett gott arbetsklimat och du har ett fint bemötande gentemot din omgivning. Initiativtagande och ansvarstagande är viktiga egenskaper samt förmågan att kunna vara flexibel och lösningsfokuserad då verksamheten kräver detta.</p><p>Stor vikt läggs vid personlig lämplighet. Utdrag från belastningsregister kommer att begäras.</p><p>ÖVRIGT</p><p>Skicka in din ansökan redan i dag till info@axevalla.fhsk.se </p><p>Ytterligare information om tjänsten: rektor Elina Majakari elina@axevalla.fhsk.se</p><p>Och Eva Sandell, Kommunal 010-442 86 44</p><p>Vill du veta mer om oss? Gå gärna in www.axevalla.fhsk.se !</p>",
        "conditions" : null,
        "text" : "Axevalla folkhögskola är känd för sin goda och varierande mat. Hos oss kan man äta frukost, lunch och ibland middag på vardagarna samt festmiddagar på beställning. Matgästerna består av skolans internatelever, personal och kortkursdeltagare och antalet kan variera mellan ett tjugotal och flera hundra per dag.\nSom arbetsgivare värnar vi om alla våra medarbetare och erbjuder bl.a. kompetensutveckling och friskvårdsbidrag. Vi är en demokratisk arbetsplats och här har du goda möjligheter att utveckla vår verksamhet.\nNu söker vi en engagerad kock som på ett självständigt sätt och i god laganda med kollegorna kan möta gäster och ge bästa service. \nARBETSUPPGIFTER\nDu kommer att arbeta som kock inom vårt skolkök tillsammans med tre andra personer. Dina arbetsuppgifter består av matberedning och servering.\nOM ARBETET\nDenna tillsvidareanställning omfattar 100%  med start i september.\nSchema: Dagtid, måndag – fredag + helger\nVi tillämpar Kommunals kollektivavtal. \nKVALIFIKATIONER\nDu har relevant köksutbildning och/eller relevant arbetslivserfarenhet som arbetsgivaren bedömer likvärdig. Du behärskar svenska språket i såväl tal som skrift, du kan ta till dig skrivna instruktioner och har förmågan att kommunicera med ditt arbetsteam. Du kommer att använda dator i ditt arbete.\nDu bidrar gärna till ett gott arbetsklimat och du har ett fint bemötande gentemot din omgivning. Initiativtagande och ansvarstagande är viktiga egenskaper samt förmågan att kunna vara flexibel och lösningsfokuserad då verksamheten kräver detta.\nStor vikt läggs vid personlig lämplighet. Utdrag från belastningsregister kommer att begäras.\nÖVRIGT\nSkicka in din ansökan redan i dag till info@axevalla.fhsk.se \nYtterligare information om tjänsten: rektor Elina Majakari elina@axevalla.fhsk.se\nOch Eva Sandell, Kommunal 010-442 86 44\nVill du veta mer om oss? Gå gärna in www.axevalla.fhsk.se !"
      },
      "headline" : "Kock till Axevalla folkhögskola",
      "driving_license" : null,
      "employer" : {
        "email" : null,
        "phone_number" : null,
        "organization_number" : "8684007472",
        "name" : "Stiftelsen Axevalla Folkhögskola",
        "url" : "www.axevalla.fhsk.se",
        "workplace" : "Stiftelsen Axevalla Folkhögskola"
      },
      "removed_date" : null,
      "logo_url" : "https://www.arbetsformedlingen.se/rest/arbetsgivare/rest/af/v3/arbetsplatser/10143449/logotyper/logo.png",
      "last_publication_date" : "2022-09-01T23:59:59",
      "number_of_vacancies" : 1,
      "occupation" : {
        "concept_id" : "Vg3d_Azf_p5Y",
        "label" : "Kock, storhushåll",
        "legacy_ams_taxonomy_id" : "7664"
      },
      "occupation_group" : {
        "concept_id" : "BStc_SJh_DKG",
        "label" : "Kockar och kallskänkor",
        "legacy_ams_taxonomy_id" : "5120"
      },
      "employment_type" : {
        "concept_id" : "1paU_aCR_nGn",
        "label" : "Behovsanställning",
        "legacy_ams_taxonomy_id" : "4"
      },
      "webpage_url" : "https://arbetsformedlingen.se/platsbanken/annonser/26371797",
      "driving_license_required" : false,
      "application_contacts" : [ ],
      "duration" : {
        "concept_id" : null,
        "label" : null,
        "legacy_ams_taxonomy_id" : null
      },
      "nice_to_have" : {
        "education_level" : [ ],
        "work_experiences" : [ ],
        "skills" : [ ],
        "education" : [ ],
        "languages" : [ ]
      },
      "application_details" : {
        "via_af" : false,
        "email" : "samuel.bjork@axevalla.fhsk.se",
        "other" : null,
        "reference" : "Kock",
        "url" : null,
        "information" : null
      },
      "source_type" : "VIA_ANNONSERA",
      "application_deadline" : "2022-09-01T23:59:59",
      "external_id" : null,
      "workplace_address" : {
        "coordinates" : [ 13.578057786658368, 58.38799232902224 ],
        "city" : "Axvall",
        "postcode" : "53272",
        "municipality" : "Skara",
        "region_concept_id" : "zdoY_6u5_Krt",
        "region" : "Västra Götalands län",
        "country_code" : "199",
        "region_code" : "14",
        "municipality_concept_id" : "k1SK_gxg_dW4",
        "country_concept_id" : "i46j_HmG_v64",
        "municipality_code" : "1495",
        "street_address" : "Axevalla Folkhögskola",
        "country" : "Sverige"
      },
      "id" : "26371797",
      "experience_required" : true,
      "working_hours_type" : {
        "concept_id" : null,
        "label" : null,
        "legacy_ams_taxonomy_id" : null
      },
      "access" : null,
      "timestamp" : 1659442380309,
      "must_have" : {
        "education_level" : [ ],
        "work_experiences" : [ {
          "concept_id" : "Vg3d_Azf_p5Y",
          "weight" : 10,
          "label" : "Kock, storhushåll",
          "legacy_ams_taxonomy_id" : "7664"
        } ],
        "skills" : [ ],
        "education" : [ ],
        "languages" : [ ]
      },
      "occupation_field" : {
        "concept_id" : "ScKy_FHB_7wT",
        "label" : "Hotell, restaurang, storhushåll",
        "legacy_ams_taxonomy_id" : "7"
      },
      "scope_of_work" : {
        "min" : 0,
        "max" : null
      },
      "salary_type" : {
        "concept_id" : "oG8G_9cW_nRf",
        "label" : "Fast månads- vecko- eller timlön",
        "legacy_ams_taxonomy_id" : "1"
      },
      "removed" : false,
      "salary_description" : null,
      "access_to_own_car" : false,
      "publication_date" : "2022-08-02T14:13:00"
    },
    "name" : "Kock till Axevalla folkhögskola",
    "user" : "Hannes"
  },
  "sha1" : "b01ca219d6b12e910fa64012a3ddf68cf310e600",
  "annotations" : [ {
    "preferred-label" : "kock",
    "sentiment" : "MUST_HAVE",
    "type" : "esco-occupation",
    "start-position" : 0,
    "end-position" : 4,
    "concept-id" : "Ti2H_QoQ_EMX",
    "matched-string" : "kock",
    "annotation-id" : 0
  }, {
    "preferred-label" : "Folkhögskola",
    "sentiment" : "MUST_HAVE",
    "type" : "keyword",
    "start-position" : 19,
    "end-position" : 31,
    "concept-id" : "WT9H_nAT_wW7",
    "matched-string" : "folkhögskola",
    "annotation-id" : 1
  }, {
    "preferred-label" : "Folkhögskola",
    "sentiment" : "MUST_HAVE",
    "type" : "keyword",
    "start-position" : 41,
    "end-position" : 53,
    "concept-id" : "WT9H_nAT_wW7",
    "matched-string" : "folkhögskola",
    "annotation-id" : 2
  }, {
    "preferred-label" : "Personal",
    "sentiment" : "MUST_HAVE",
    "type" : "keyword",
    "start-position" : 242,
    "end-position" : 250,
    "concept-id" : "HVxM_6MS_y1c",
    "matched-string" : "personal",
    "annotation-id" : 3
  }, {
    "preferred-label" : "kock",
    "sentiment" : "MUST_HAVE",
    "type" : "esco-occupation",
    "start-position" : 575,
    "end-position" : 579,
    "concept-id" : "Ti2H_QoQ_EMX",
    "matched-string" : "kock",
    "annotation-id" : 4
  }, {
    "preferred-label" : "arbeta självständigt",
    "type" : "esco-skill",
    "start-position" : 591,
    "end-position" : 604,
    "concept-id" : "NyFu_HHd_zhz",
    "matched-string" : "självständigt",
    "annotation-id" : 8
  }, {
    "preferred-label" : "kock",
    "sentiment" : "MUST_HAVE",
    "type" : "esco-occupation",
    "start-position" : 723,
    "end-position" : 727,
    "concept-id" : "Ti2H_QoQ_EMX",
    "matched-string" : "kock",
    "annotation-id" : 5
  }, {
    "preferred-label" : "Tillsvidareanställning (inkl. eventuell provanställning)",
    "type" : "employment-type",
    "start-position" : 858,
    "end-position" : 880,
    "concept-id" : "kpPX_CNN_gDU",
    "matched-string" : "tillsvidareanställning",
    "annotation-id" : 9
  }, {
    "preferred-label" : "Heltid",
    "type" : "worktime-extent",
    "start-position" : 890,
    "end-position" : 894,
    "concept-id" : "6YE1_gAC_R2G",
    "matched-string" : "100%",
    "annotation-id" : 10
  }, {
    "preferred-label" : "Kollektivavtal",
    "sentiment" : "MUST_HAVE",
    "type" : "skill",
    "start-position" : 983,
    "end-position" : 997,
    "concept-id" : "z7wE_9xb_3jX",
    "matched-string" : "kollektivavtal",
    "annotation-id" : 6
  }, {
    "preferred-label" : "Svenska språket",
    "sentiment" : "MUST_HAVE",
    "type" : "keyword",
    "start-position" : 1137,
    "end-position" : 1152,
    "concept-id" : "BiGm_58D_SSn",
    "matched-string" : "svenska språket",
    "annotation-id" : 7
  } ],
  "text" : "Kock till Axevalla folkhögskola\nAxevalla folkhögskola är känd för sin goda och varierande mat. Hos oss kan man äta frukost, lunch och ibland middag på vardagarna samt festmiddagar på beställning. Matgästerna består av skolans internatelever, personal och kortkursdeltagare och antalet kan variera mellan ett tjugotal och flera hundra per dag.\nSom arbetsgivare värnar vi om alla våra medarbetare och erbjuder bl.a. kompetensutveckling och friskvårdsbidrag. Vi är en demokratisk arbetsplats och här har du goda möjligheter att utveckla vår verksamhet.\nNu söker vi en engagerad kock som på ett självständigt sätt och i god laganda med kollegorna kan möta gäster och ge bästa service. \nARBETSUPPGIFTER\nDu kommer att arbeta som kock inom vårt skolkök tillsammans med tre andra personer. Dina arbetsuppgifter består av matberedning och servering.\nOM ARBETET\nDenna tillsvidareanställning omfattar 100%  med start i september.\nSchema: Dagtid, måndag – fredag + helger\nVi tillämpar Kommunals kollektivavtal. \nKVALIFIKATIONER\nDu har relevant köksutbildning och/eller relevant arbetslivserfarenhet som arbetsgivaren bedömer likvärdig. Du behärskar svenska språket i såväl tal som skrift, du kan ta till dig skrivna instruktioner och har förmågan att kommunicera med ditt arbetsteam. Du kommer att använda dator i ditt arbete.\nDu bidrar gärna till ett gott arbetsklimat och du har ett fint bemötande gentemot din omgivning. Initiativtagande och ansvarstagande är viktiga egenskaper samt förmågan att kunna vara flexibel och lösningsfokuserad då verksamheten kräver detta.\nStor vikt läggs vid personlig lämplighet. Utdrag från belastningsregister kommer att begäras.\nÖVRIGT\nSkicka in din ansökan redan i dag till info@axevalla.fhsk.se \nYtterligare information om tjänsten: rektor Elina Majakari elina@axevalla.fhsk.se\nOch Eva Sandell, Kommunal 010-442 86 44\nVill du veta mer om oss? Gå gärna in www.axevalla.fhsk.se !"
}