{
  "meta" : {
    "jobad" : {
      "description" : {
        "requirements" : null,
        "needs" : null,
        "company_information" : null,
        "text_formatted" : "Tolkcentralen är en enhet inom Öron, näs- och halskliniken Region Östergötland och vårt uppdrag omfattar hela länet.\r\n\r\nVi erbjuder tolkservice med hög tillgänglighet och bred kompetens till döva, dövblinda, vuxendöva, hörselskadade och till personer med funktionsnedsättning som rör röst-, tal- eller språksvårigheter samt psykosocialt stöd till barndomsdöva vuxna.\nTolkverksamheten erbjuder tolkservice dygnet runt, årets alla dagar och utifrån beställarens behov möjliggör våra professionella medarbetare kommunikation mellan människor. Här arbetar teckenspråks/dövblindtolkar, skriv- och TSS-tolkar, taltjänsttolkar, samordnare samt ett dövteam.\n\nHos oss får du möjlighet till ett omväxlande och utvecklande arbete i en flexibel miljö och tillsammans med erfarna och stödjande kollegor får du ta ansvar att påverka såväl din vardag som tolktjänsten framåt. Du kommer att utföra ett meningsfullt arbete som gör direkt skillnad. \n\nDin introduktion anpassas utifrån dina kunskaper, färdigheter och tidigare erfarenheter och vi är måna om att skapa förutsättningar för att du ska känna dig välkommen och trygg i din roll. Under introduktionen kommer du att få en mentor.\n\nVi erbjuder en flexibel schemamodell med möjlighet att till viss del påverka ditt schema samt att genom en distansarbetsplatsvariant ibland kunna börja eller avsluta arbetsdagen hemifrån.\n\nArbetsbeskrivning\nDina huvudsakliga arbetsuppgifter är att utföra tolkning inom ramen för regionens ansvarsområde. I tolkuppdraget ingår för- och efterarbete samt resor främst inom länet men även utanför länet. Nya digitala lösningar och behov möjliggör att tolkning genomförs både på distans och på plats. Din arbetstid är förlagd till såväl dag som kväll och helg. Du kommer att utföra tolkuppdrag både själv och tillsammans med kollega.\n\nFörutom tolkuppdragets utförande har du ansvarsområden och är aktiv i enhetens förbättrings- och kvalitetsarbeten samt utvärderar och reflekterar utifrån den etiska värdegrunden.\n\nUtbildning och erfarenhet\nDu är utbildad skrivtolk, meriterande är om du även är utbildad TSS-tolk eller teckenspråks-och dövblindtolk och om du har erfarenhet av att arbeta som skrivtolk. Meriterande är även goda kunskaper och färdigheter i att hantera utrustning, teknik och distanslösningar i samband med skrivtolkning på plats och digitalt. B-körkort är ett krav.\n\nPersonliga egenskaper\nVi önskar att du är trygg i din yrkesroll och vågar ta plats på ett respektfullt sätt. Vi lägger också stor vikt vid att du är serviceinriktad, kommunikativ och lyhörd för verksamhetens behov samt har god förmåga att skapa goda samarbetsrelationer.  Du kan behålla ett lugnt förhållningssätt även i stressiga situationer. Du kan genom hög flexibilitet snabbt ställa om samt tycker om att arbeta både självständigt och tillsammans med kollega. Vi lägger stor vikt vid personlig lämplighet.\n\nVarmt välkommen in med din ansökan! Om du behöver hjälp med att registrera i systemet, kontakta kundtjänst Stöd och service, 010-103 60 00, under kontorstid.\n\nTill bemannings-, förmedlings- och rekryteringsföretag och till dig som är försäljare:\nVi undanber oss vänligen men bestämt direktkontakt med bemannings-, förmedlings- och rekryteringsföretag samt andra externa aktörer och försäljare av ytterligare jobbannonser. Region Östergötland har upphandlade avtal.",
        "conditions" : "100%. Tillträde: Enligt överenskommelse\r\nTillsvidareanställning",
        "text" : "Tolkcentralen är en enhet inom Öron, näs- och halskliniken Region Östergötland och vårt uppdrag omfattar hela länet.\r\n\r\nVi erbjuder tolkservice med hög tillgänglighet och bred kompetens till döva, dövblinda, vuxendöva, hörselskadade och till personer med funktionsnedsättning som rör röst-, tal- eller språksvårigheter samt psykosocialt stöd till barndomsdöva vuxna.\nTolkverksamheten erbjuder tolkservice dygnet runt, årets alla dagar och utifrån beställarens behov möjliggör våra professionella medarbetare kommunikation mellan människor. Här arbetar teckenspråks/dövblindtolkar, skriv- och TSS-tolkar, taltjänsttolkar, samordnare samt ett dövteam.\n\nHos oss får du möjlighet till ett omväxlande och utvecklande arbete i en flexibel miljö och tillsammans med erfarna och stödjande kollegor får du ta ansvar att påverka såväl din vardag som tolktjänsten framåt. Du kommer att utföra ett meningsfullt arbete som gör direkt skillnad. \n\nDin introduktion anpassas utifrån dina kunskaper, färdigheter och tidigare erfarenheter och vi är måna om att skapa förutsättningar för att du ska känna dig välkommen och trygg i din roll. Under introduktionen kommer du att få en mentor.\n\nVi erbjuder en flexibel schemamodell med möjlighet att till viss del påverka ditt schema samt att genom en distansarbetsplatsvariant ibland kunna börja eller avsluta arbetsdagen hemifrån.\n\nArbetsbeskrivning\nDina huvudsakliga arbetsuppgifter är att utföra tolkning inom ramen för regionens ansvarsområde. I tolkuppdraget ingår för- och efterarbete samt resor främst inom länet men även utanför länet. Nya digitala lösningar och behov möjliggör att tolkning genomförs både på distans och på plats. Din arbetstid är förlagd till såväl dag som kväll och helg. Du kommer att utföra tolkuppdrag både själv och tillsammans med kollega.\n\nFörutom tolkuppdragets utförande har du ansvarsområden och är aktiv i enhetens förbättrings- och kvalitetsarbeten samt utvärderar och reflekterar utifrån den etiska värdegrunden.\n\nUtbildning och erfarenhet\nDu är utbildad skrivtolk, meriterande är om du även är utbildad TSS-tolk eller teckenspråks-och dövblindtolk och om du har erfarenhet av att arbeta som skrivtolk. Meriterande är även goda kunskaper och färdigheter i att hantera utrustning, teknik och distanslösningar i samband med skrivtolkning på plats och digitalt. B-körkort är ett krav.\n\nPersonliga egenskaper\nVi önskar att du är trygg i din yrkesroll och vågar ta plats på ett respektfullt sätt. Vi lägger också stor vikt vid att du är serviceinriktad, kommunikativ och lyhörd för verksamhetens behov samt har god förmåga att skapa goda samarbetsrelationer.  Du kan behålla ett lugnt förhållningssätt även i stressiga situationer. Du kan genom hög flexibilitet snabbt ställa om samt tycker om att arbeta både självständigt och tillsammans med kollega. Vi lägger stor vikt vid personlig lämplighet.\n\nVarmt välkommen in med din ansökan! Om du behöver hjälp med att registrera i systemet, kontakta kundtjänst Stöd och service, 010-103 60 00, under kontorstid.\n\nTill bemannings-, förmedlings- och rekryteringsföretag och till dig som är försäljare:\nVi undanber oss vänligen men bestämt direktkontakt med bemannings-, förmedlings- och rekryteringsföretag samt andra externa aktörer och försäljare av ytterligare jobbannonser. Region Östergötland har upphandlade avtal."
      },
      "headline" : "Skrivtolk till Tolkcentralen",
      "driving_license" : [ {
        "concept_id" : "VTK8_WRx_GcM",
        "label" : "B",
        "legacy_ams_taxonomy_id" : "3"
      } ],
      "employer" : {
        "email" : null,
        "phone_number" : null,
        "organization_number" : "2321000040",
        "name" : "REGION ÖSTERGÖTLAND",
        "url" : null,
        "workplace" : "Öron- näs- och halskliniken"
      },
      "removed_date" : null,
      "logo_url" : "https://www.arbetsformedlingen.se/rest/arbetsgivare/rest/af/v3/organisation/2321000040/logotyper/logo.png",
      "last_publication_date" : "2022-08-29T23:59:59",
      "number_of_vacancies" : 1,
      "occupation" : {
        "concept_id" : "fRnA_rcj_eJi",
        "label" : "Skrivtolk/Vuxendövtolk",
        "legacy_ams_taxonomy_id" : "3202"
      },
      "occupation_group" : {
        "concept_id" : "PQDm_Z63_zst",
        "label" : "Översättare, tolkar och lingvister m.fl.",
        "legacy_ams_taxonomy_id" : "2643"
      },
      "employment_type" : {
        "concept_id" : "PFZr_Syz_cUq",
        "label" : "Vanlig anställning",
        "legacy_ams_taxonomy_id" : "1"
      },
      "webpage_url" : "https://arbetsformedlingen.se/platsbanken/annonser/26369428",
      "driving_license_required" : true,
      "application_contacts" : [ {
        "description" : "Enhetschef Peter Strid",
        "email" : null,
        "telephone" : "072-4630158.",
        "name" : null,
        "contact_type" : null
      } ],
      "duration" : {
        "concept_id" : "a7uU_j21_mkL",
        "label" : "Tills vidare",
        "legacy_ams_taxonomy_id" : "1"
      },
      "nice_to_have" : {
        "education_level" : [ ],
        "work_experiences" : [ ],
        "skills" : [ ],
        "education" : [ ],
        "languages" : [ ]
      },
      "application_details" : {
        "via_af" : false,
        "email" : null,
        "other" : null,
        "reference" : "2022/1355",
        "url" : "https://regionostergotland.varbi.com/what:job/jobID:524390/type:job/where:1/apply:1",
        "information" : null
      },
      "source_type" : "VIA_PLATSBANKEN_DXA",
      "application_deadline" : "2022-08-29T23:59:59",
      "external_id" : "46-232100-0040-524390",
      "workplace_address" : {
        "coordinates" : [ 15.621373, 58.41081 ],
        "city" : null,
        "postcode" : null,
        "municipality" : "Linköping",
        "region_concept_id" : "oLT3_Q9p_3nn",
        "region" : "Östergötlands län",
        "country_code" : "199",
        "region_code" : "05",
        "municipality_concept_id" : "bm2x_1mr_Qhx",
        "country_concept_id" : "i46j_HmG_v64",
        "municipality_code" : "0580",
        "street_address" : null,
        "country" : "Sverige"
      },
      "id" : "26369428",
      "experience_required" : false,
      "working_hours_type" : {
        "concept_id" : "6YE1_gAC_R2G",
        "label" : "Heltid",
        "legacy_ams_taxonomy_id" : "1"
      },
      "access" : null,
      "timestamp" : 1659367584082,
      "must_have" : {
        "education_level" : [ ],
        "work_experiences" : [ ],
        "skills" : [ ],
        "education" : [ ],
        "languages" : [ ]
      },
      "occupation_field" : {
        "concept_id" : "9puE_nYg_crq",
        "label" : "Kultur, media, design",
        "legacy_ams_taxonomy_id" : "11"
      },
      "scope_of_work" : {
        "min" : 100,
        "max" : 100
      },
      "salary_type" : {
        "concept_id" : "oG8G_9cW_nRf",
        "label" : "Fast månads- vecko- eller timlön",
        "legacy_ams_taxonomy_id" : "1"
      },
      "removed" : false,
      "salary_description" : "Individuella löner tillämpas",
      "access_to_own_car" : false,
      "publication_date" : "2022-08-01T17:26:24"
    },
    "name" : "Skrivtolk till Tolkcentralen",
    "user" : "hannes"
  },
  "sha1" : "7bf11ed2e2c8a8cb495b7c5ec718ec497cb88e1d",
  "annotations" : [ {
    "preferred-label" : "Skrivtolk/Vuxendövtolk",
    "sentiment" : "MUST_HAVE",
    "type" : "occupation-name",
    "start-position" : 0,
    "end-position" : 9,
    "concept-id" : "fRnA_rcj_eJi",
    "matched-string" : "skrivtolk",
    "annotation-id" : 0
  }, {
    "preferred-label" : "Östergötlands län",
    "type" : "region",
    "start-position" : 88,
    "end-position" : 107,
    "concept-id" : "oLT3_Q9p_3nn",
    "matched-string" : "Region Östergötland",
    "annotation-id" : 8
  }, {
    "preferred-label" : "Teckenspråkstolk/Dövblindtolk",
    "type" : "occupation-name",
    "start-position" : 581,
    "end-position" : 608,
    "concept-id" : "aPeE_Gxs_cWJ",
    "matched-string" : "teckenspråks/dövblindtolkar",
    "annotation-id" : 9
  }, {
    "preferred-label" : "Skrivtolk",
    "type" : "keyword",
    "start-position" : 610,
    "end-position" : 615,
    "concept-id" : "Xmpp_htd_2Bo",
    "matched-string" : "skriv",
    "annotation-id" : 10
  }, {
    "preferred-label" : "TSS-tolkning (Tecken som Stöd)",
    "type" : "skill",
    "start-position" : 621,
    "end-position" : 631,
    "concept-id" : "JEkW_rqS_ojk",
    "matched-string" : "TSS-tolkar",
    "annotation-id" : 11
  }, {
    "preferred-label" : "Taltjänsttolk",
    "type" : "occupation-name",
    "start-position" : 633,
    "end-position" : 648,
    "concept-id" : "65wn_Bad_e5L",
    "matched-string" : "taltjänsttolkar",
    "annotation-id" : 12
  }, {
    "preferred-label" : "Distansarbete",
    "type" : "work-place-environment",
    "start-position" : 1308,
    "end-position" : 1333,
    "concept-id" : "uwzb_xcR_vxS",
    "matched-string" : "distansarbetsplatsvariant",
    "annotation-id" : 13
  }, {
    "preferred-label" : "Översättning och tolkning",
    "type" : "sni-level-5",
    "start-position" : 1456,
    "end-position" : 1464,
    "concept-id" : "zRGC_HRv_2tW",
    "matched-string" : "tolkning",
    "annotation-id" : 14
  }, {
    "preferred-label" : "Resor i arbetet förekommer",
    "type" : "work-place-environment",
    "start-position" : 1553,
    "end-position" : 1558,
    "concept-id" : "oaM2_JTK_muh",
    "matched-string" : "resor",
    "annotation-id" : 15
  }, {
    "preferred-label" : "Distansarbete",
    "type" : "work-place-environment",
    "start-position" : 1675,
    "end-position" : 1682,
    "concept-id" : "uwzb_xcR_vxS",
    "matched-string" : "distans",
    "annotation-id" : 16
  }, {
    "preferred-label" : "Skrivtolk/Vuxendövtolk",
    "sentiment" : "MUST_HAVE",
    "type" : "occupation-name",
    "start-position" : 2052,
    "end-position" : 2061,
    "concept-id" : "fRnA_rcj_eJi",
    "matched-string" : "skrivtolk",
    "annotation-id" : 2
  }, {
    "preferred-label" : "TSS-tolkning (Tecken som Stöd)",
    "type" : "skill",
    "start-position" : 2101,
    "end-position" : 2109,
    "concept-id" : "JEkW_rqS_ojk",
    "matched-string" : "TSS-tolk",
    "annotation-id" : 17
  }, {
    "preferred-label" : "Teckenspråkstolk/Dövblindtolk",
    "type" : "occupation-name",
    "start-position" : 2116,
    "end-position" : 2145,
    "concept-id" : "aPeE_Gxs_cWJ",
    "matched-string" : "teckenspråks-och dövblindtolk",
    "annotation-id" : 18
  }, {
    "preferred-label" : "Skrivtolk/Vuxendövtolk",
    "sentiment" : "MUST_HAVE",
    "type" : "occupation-name",
    "start-position" : 2189,
    "end-position" : 2198,
    "concept-id" : "fRnA_rcj_eJi",
    "matched-string" : "skrivtolk",
    "annotation-id" : 5
  }, {
    "preferred-label" : "Skrivtolkning",
    "sentiment" : "MUST_HAVE",
    "type" : "skill",
    "start-position" : 2319,
    "end-position" : 2332,
    "concept-id" : "KFyd_zgS_6aw",
    "matched-string" : "skrivtolkning",
    "annotation-id" : 6
  }, {
    "preferred-label" : "B",
    "type" : "driving-licence",
    "start-position" : 2356,
    "end-position" : 2365,
    "concept-id" : "VTK8_WRx_GcM",
    "matched-string" : "B-körkort",
    "annotation-id" : 19
  } ],
  "text" : "Skrivtolk till Tolkcentralen\nTolkcentralen är en enhet inom Öron, näs- och halskliniken Region Östergötland och vårt uppdrag omfattar hela länet.\r\n\r\nVi erbjuder tolkservice med hög tillgänglighet och bred kompetens till döva, dövblinda, vuxendöva, hörselskadade och till personer med funktionsnedsättning som rör röst-, tal- eller språksvårigheter samt psykosocialt stöd till barndomsdöva vuxna.\nTolkverksamheten erbjuder tolkservice dygnet runt, årets alla dagar och utifrån beställarens behov möjliggör våra professionella medarbetare kommunikation mellan människor. Här arbetar teckenspråks/dövblindtolkar, skriv- och TSS-tolkar, taltjänsttolkar, samordnare samt ett dövteam.\n\nHos oss får du möjlighet till ett omväxlande och utvecklande arbete i en flexibel miljö och tillsammans med erfarna och stödjande kollegor får du ta ansvar att påverka såväl din vardag som tolktjänsten framåt. Du kommer att utföra ett meningsfullt arbete som gör direkt skillnad. \n\nDin introduktion anpassas utifrån dina kunskaper, färdigheter och tidigare erfarenheter och vi är måna om att skapa förutsättningar för att du ska känna dig välkommen och trygg i din roll. Under introduktionen kommer du att få en mentor.\n\nVi erbjuder en flexibel schemamodell med möjlighet att till viss del påverka ditt schema samt att genom en distansarbetsplatsvariant ibland kunna börja eller avsluta arbetsdagen hemifrån.\n\nArbetsbeskrivning\nDina huvudsakliga arbetsuppgifter är att utföra tolkning inom ramen för regionens ansvarsområde. I tolkuppdraget ingår för- och efterarbete samt resor främst inom länet men även utanför länet. Nya digitala lösningar och behov möjliggör att tolkning genomförs både på distans och på plats. Din arbetstid är förlagd till såväl dag som kväll och helg. Du kommer att utföra tolkuppdrag både själv och tillsammans med kollega.\n\nFörutom tolkuppdragets utförande har du ansvarsområden och är aktiv i enhetens förbättrings- och kvalitetsarbeten samt utvärderar och reflekterar utifrån den etiska värdegrunden.\n\nUtbildning och erfarenhet\nDu är utbildad skrivtolk, meriterande är om du även är utbildad TSS-tolk eller teckenspråks-och dövblindtolk och om du har erfarenhet av att arbeta som skrivtolk. Meriterande är även goda kunskaper och färdigheter i att hantera utrustning, teknik och distanslösningar i samband med skrivtolkning på plats och digitalt. B-körkort är ett krav.\n\nPersonliga egenskaper\nVi önskar att du är trygg i din yrkesroll och vågar ta plats på ett respektfullt sätt. Vi lägger också stor vikt vid att du är serviceinriktad, kommunikativ och lyhörd för verksamhetens behov samt har god förmåga att skapa goda samarbetsrelationer.  Du kan behålla ett lugnt förhållningssätt även i stressiga situationer. Du kan genom hög flexibilitet snabbt ställa om samt tycker om att arbeta både självständigt och tillsammans med kollega. Vi lägger stor vikt vid personlig lämplighet.\n\nVarmt välkommen in med din ansökan! Om du behöver hjälp med att registrera i systemet, kontakta kundtjänst Stöd och service, 010-103 60 00, under kontorstid.\n\nTill bemannings-, förmedlings- och rekryteringsföretag och till dig som är försäljare:\nVi undanber oss vänligen men bestämt direktkontakt med bemannings-, förmedlings- och rekryteringsföretag samt andra externa aktörer och försäljare av ytterligare jobbannonser. Region Östergötland har upphandlade avtal."
}