{
  "meta" : {
    "jobad" : {
      "description" : {
        "requirements" : null,
        "needs" : null,
        "company_information" : null,
        "text_formatted" : "<p><strong>Nu söker Zynca i samarbete med Restaurang Barón ERFAREN KOCK!</strong></p><p><strong>Om Zynca: </strong>Vi är Sveriges digitala Jobbförmedling! Zyncas digitala plattform kopplar samman arbetsgivare med arbetssökande. Allt på en och samma plats!​</p><p><strong>Om Barón: </strong>Barón är en tapasrestaurang belägen i en av Karlstads vackraste lokaler mitt i centrum. Restaurangen är med i den prestige fyllda gastronomiska White Guide.</p><p>Barón präglas av kvalitet, både i maten och dryckens råvaror och framställning samt i serveringens bemötande. De ställer höga krav på service och produktkännedom och utbildar därför sin personal regelbundet. Restaurangen är en a´la carte restaurang som är öppen kvällstid på vardagar och helger. </p><p><strong>Vi söker dig som:</strong><em> </em></p><p>Är <strong>erfaren </strong>och <strong>rutinerad </strong>kock,  som har mål och vision att arbeta på en gastronomisk restaurang.</p><p>Din uppgift är att driva och utveckla köket efter dem ramar som är satta av ledningen. Ditt arbete går ut på att säkerställa att köket är välfungerande, lönsam och med välmående personal. Tjänsten är 100% tillsvidare på kvällstid och helger. </p><p>Du trivs bra i en miljö med mycket gästkontakt, högt tempo och en fullsatt restaurang.</p><p><u>Du söker jobbet genom att skicka mail med </u><strong><u>CV</u></strong><u>, </u><strong><u>BREV </u></strong><u>och </u><strong><u>BILD</u></strong><u>! till martina@zynca.se</u></p><p><em>Vi förbehåller oss rätten att endast svara de kandidater som går vidare i intervjuprocess. </em></p><p><br></p><p><strong><em>välkommen med din ansökan. </em></strong></p>",
        "conditions" : null,
        "text" : "Nu söker Zynca i samarbete med Restaurang Barón ERFAREN KOCK!\nOm Zynca: Vi är Sveriges digitala Jobbförmedling! Zyncas digitala plattform kopplar samman arbetsgivare med arbetssökande. Allt på en och samma plats!​\nOm Barón: Barón är en tapasrestaurang belägen i en av Karlstads vackraste lokaler mitt i centrum. Restaurangen är med i den prestige fyllda gastronomiska White Guide.\nBarón präglas av kvalitet, både i maten och dryckens råvaror och framställning samt i serveringens bemötande. De ställer höga krav på service och produktkännedom och utbildar därför sin personal regelbundet. Restaurangen är en a´la carte restaurang som är öppen kvällstid på vardagar och helger. \nVi söker dig som: \nÄr erfaren och rutinerad kock,  som har mål och vision att arbeta på en gastronomisk restaurang.\nDin uppgift är att driva och utveckla köket efter dem ramar som är satta av ledningen. Ditt arbete går ut på att säkerställa att köket är välfungerande, lönsam och med välmående personal. Tjänsten är 100% tillsvidare på kvällstid och helger. \nDu trivs bra i en miljö med mycket gästkontakt, högt tempo och en fullsatt restaurang.\nDu söker jobbet genom att skicka mail med CV, BREV och BILD! till martina@zynca.se\nVi förbehåller oss rätten att endast svara de kandidater som går vidare i intervjuprocess. \n\n\nvälkommen med din ansökan."
      },
      "headline" : "ERFAREN KOCK TILL A´LA CARTE",
      "driving_license" : null,
      "employer" : {
        "email" : null,
        "phone_number" : null,
        "organization_number" : "5592352321",
        "name" : "Zynca AB",
        "url" : "https://zynca.se/",
        "workplace" : "Zynca AB"
      },
      "removed_date" : null,
      "logo_url" : "https://www.arbetsformedlingen.se/rest/arbetsgivare/rest/af/v3/arbetsplatser/87980067/logotyper/logo.png",
      "last_publication_date" : "2022-09-17T23:59:59",
      "number_of_vacancies" : 1,
      "occupation" : {
        "concept_id" : "JbJw_as4_S93",
        "label" : "Kock, à la carte",
        "legacy_ams_taxonomy_id" : "7663"
      },
      "occupation_group" : {
        "concept_id" : "BStc_SJh_DKG",
        "label" : "Kockar och kallskänkor",
        "legacy_ams_taxonomy_id" : "5120"
      },
      "employment_type" : {
        "concept_id" : "PFZr_Syz_cUq",
        "label" : "Vanlig anställning",
        "legacy_ams_taxonomy_id" : "1"
      },
      "webpage_url" : "https://arbetsformedlingen.se/platsbanken/annonser/26427824",
      "driving_license_required" : false,
      "application_contacts" : [ ],
      "duration" : {
        "concept_id" : "a7uU_j21_mkL",
        "label" : "Tills vidare",
        "legacy_ams_taxonomy_id" : "1"
      },
      "nice_to_have" : {
        "education_level" : [ ],
        "work_experiences" : [ ],
        "skills" : [ {
          "concept_id" : "Bb4Q_Vou_pbq",
          "weight" : 5,
          "label" : "A la carte",
          "legacy_ams_taxonomy_id" : "603372"
        }, {
          "concept_id" : "STwz_WtJ_W4p",
          "weight" : 5,
          "label" : "Mästarbrev, kock",
          "legacy_ams_taxonomy_id" : "601075"
        }, {
          "concept_id" : "Dxqv_2WA_TYt",
          "weight" : 5,
          "label" : "Restaurangkök",
          "legacy_ams_taxonomy_id" : "604218"
        } ],
        "education" : [ ],
        "languages" : [ {
          "concept_id" : "zSLA_vw2_FXN",
          "weight" : 5,
          "label" : "Svenska",
          "legacy_ams_taxonomy_id" : "502"
        }, {
          "concept_id" : "NVxJ_hLg_TYS",
          "weight" : 5,
          "label" : "Engelska",
          "legacy_ams_taxonomy_id" : "283"
        } ]
      },
      "application_details" : {
        "via_af" : false,
        "email" : "martina@zynca.se",
        "other" : null,
        "reference" : "KOCK BARON",
        "url" : null,
        "information" : null
      },
      "source_type" : "VIA_ANNONSERA",
      "application_deadline" : "2022-09-17T23:59:59",
      "external_id" : null,
      "workplace_address" : {
        "coordinates" : [ 13.495872518707392, 59.37946270056415 ],
        "city" : "KARLSTAD",
        "postcode" : "65225",
        "municipality" : "Karlstad",
        "region_concept_id" : "EVVp_h6U_GSZ",
        "region" : "Värmlands län",
        "country_code" : "199",
        "region_code" : "17",
        "municipality_concept_id" : "hRDj_PoV_sFU",
        "country_concept_id" : "i46j_HmG_v64",
        "municipality_code" : "1780",
        "street_address" : null,
        "country" : "Sverige"
      },
      "id" : "26427824",
      "experience_required" : true,
      "working_hours_type" : {
        "concept_id" : "6YE1_gAC_R2G",
        "label" : "Heltid",
        "legacy_ams_taxonomy_id" : "1"
      },
      "access" : null,
      "timestamp" : 1660835345279,
      "must_have" : {
        "education_level" : [ ],
        "work_experiences" : [ {
          "concept_id" : "JbJw_as4_S93",
          "weight" : 10,
          "label" : "Kock, à la carte",
          "legacy_ams_taxonomy_id" : "7663"
        } ],
        "skills" : [ ],
        "education" : [ ],
        "languages" : [ ]
      },
      "occupation_field" : {
        "concept_id" : "ScKy_FHB_7wT",
        "label" : "Hotell, restaurang, storhushåll",
        "legacy_ams_taxonomy_id" : "7"
      },
      "scope_of_work" : {
        "min" : 0,
        "max" : 100
      },
      "salary_type" : {
        "concept_id" : "oG8G_9cW_nRf",
        "label" : "Fast månads- vecko- eller timlön",
        "legacy_ams_taxonomy_id" : "1"
      },
      "removed" : false,
      "salary_description" : null,
      "access_to_own_car" : false,
      "publication_date" : "2022-08-18T17:09:05"
    },
    "name" : "ERFAREN KOCK TILL A´LA CARTE",
    "user" : "hannes"
  },
  "sha1" : "2d97930bc161951f0c5358393b36985f2e2c836e",
  "annotations" : [ {
    "preferred-label" : "Kock, à la carte",
    "sentiment" : "MUST_HAVE",
    "type" : "occupation-name",
    "start-position" : 8,
    "end-position" : 28,
    "concept-id" : "JbJw_as4_S93",
    "matched-string" : "KOCK TILL A´LA CARTE",
    "annotation-id" : 10
  }, {
    "preferred-label" : "Restaurang",
    "sentiment" : "NOT_RELEVANT",
    "type" : "keyword",
    "start-position" : 60,
    "end-position" : 70,
    "concept-id" : "o2Cg_3Ap_qvK",
    "matched-string" : "restaurang",
    "annotation-id" : 1
  }, {
    "preferred-label" : "Kock, à la carte",
    "sentiment" : "MUST_HAVE",
    "type" : "occupation-name",
    "start-position" : 85,
    "end-position" : 89,
    "concept-id" : "JbJw_as4_S93",
    "matched-string" : "kock",
    "annotation-id" : 2
  }, {
    "preferred-label" : "Personal",
    "sentiment" : "NOT_RELEVANT",
    "type" : "keyword",
    "start-position" : 596,
    "end-position" : 604,
    "concept-id" : "HVxM_6MS_y1c",
    "matched-string" : "personal",
    "annotation-id" : 4
  }, {
    "preferred-label" : "Restaurang",
    "sentiment" : "NOT_RELEVANT",
    "type" : "keyword",
    "start-position" : 648,
    "end-position" : 658,
    "concept-id" : "o2Cg_3Ap_qvK",
    "matched-string" : "restaurang",
    "annotation-id" : 5
  }, {
    "preferred-label" : "Kock, à la carte",
    "sentiment" : "MUST_HAVE",
    "type" : "occupation-name",
    "start-position" : 751,
    "end-position" : 755,
    "concept-id" : "JbJw_as4_S93",
    "matched-string" : "kock",
    "annotation-id" : 6
  }, {
    "preferred-label" : "Restaurang",
    "sentiment" : "NOT_RELEVANT",
    "type" : "keyword",
    "start-position" : 811,
    "end-position" : 821,
    "concept-id" : "o2Cg_3Ap_qvK",
    "matched-string" : "restaurang",
    "annotation-id" : 7
  }, {
    "preferred-label" : "Personal",
    "sentiment" : "NOT_RELEVANT",
    "type" : "keyword",
    "start-position" : 1001,
    "end-position" : 1009,
    "concept-id" : "HVxM_6MS_y1c",
    "matched-string" : "personal",
    "annotation-id" : 8
  }, {
    "preferred-label" : "Heltid",
    "sentiment" : "OFFERED",
    "type" : "worktime-extent",
    "start-position" : 1023,
    "end-position" : 1027,
    "concept-id" : "6YE1_gAC_R2G",
    "matched-string" : "100%",
    "annotation-id" : 11
  }, {
    "preferred-label" : "Tillsvidareanställning (inkl. eventuell provanställning)",
    "sentiment" : "OFFERED",
    "type" : "employment-type",
    "start-position" : 1028,
    "end-position" : 1039,
    "concept-id" : "kpPX_CNN_gDU",
    "matched-string" : "tillsvidare",
    "annotation-id" : 12
  }, {
    "preferred-label" : "Restaurang",
    "sentiment" : "NOT_RELEVANT",
    "type" : "keyword",
    "start-position" : 1141,
    "end-position" : 1151,
    "concept-id" : "o2Cg_3Ap_qvK",
    "matched-string" : "restaurang",
    "annotation-id" : 9
  } ],
  "text" : "ERFAREN KOCK TILL A´LA CARTE\nNu söker Zynca i samarbete med Restaurang Barón ERFAREN KOCK!\nOm Zynca: Vi är Sveriges digitala Jobbförmedling! Zyncas digitala plattform kopplar samman arbetsgivare med arbetssökande. Allt på en och samma plats!​\nOm Barón: Barón är en tapasrestaurang belägen i en av Karlstads vackraste lokaler mitt i centrum. Restaurangen är med i den prestige fyllda gastronomiska White Guide.\nBarón präglas av kvalitet, både i maten och dryckens råvaror och framställning samt i serveringens bemötande. De ställer höga krav på service och produktkännedom och utbildar därför sin personal regelbundet. Restaurangen är en a´la carte restaurang som är öppen kvällstid på vardagar och helger. \nVi söker dig som: \nÄr erfaren och rutinerad kock,  som har mål och vision att arbeta på en gastronomisk restaurang.\nDin uppgift är att driva och utveckla köket efter dem ramar som är satta av ledningen. Ditt arbete går ut på att säkerställa att köket är välfungerande, lönsam och med välmående personal. Tjänsten är 100% tillsvidare på kvällstid och helger. \nDu trivs bra i en miljö med mycket gästkontakt, högt tempo och en fullsatt restaurang.\nDu söker jobbet genom att skicka mail med CV, BREV och BILD! till martina@zynca.se\nVi förbehåller oss rätten att endast svara de kandidater som går vidare i intervjuprocess. \n\n\nvälkommen med din ansökan."
}