{
  "meta" : {
    "jobad" : {
      "description" : {
        "requirements" : null,
        "needs" : null,
        "company_information" : null,
        "text_formatted" : "Vi söker fler skickliga sjuksköterskor för anställning på timme!\n\n\n• Vill du inte riktigt släppa det jobb du har, men är intresserad av att prova att jobba hos oss?\n• Är du nyfiken på hur det är att jobba i den barnpalliativa vården, men är inte säker på att det är rätt för dig?\n\nDå kan du prova att komma till oss som timanställd, där vi har möjlighet att lära känna varandra utan krav! \n\nHos oss på Lilla Erstagården vårdar vi hela familjen. Vården hos oss rymmer både samtal, läkemedel, medicintekniska moment, omvårdnad, existentiella aspekter samt lek och bullbak. Vi samarbetar nära i teamet och värnar att alla kompetenser kommer patienten till del. Vi har fem ordinarie vårdplatser och vår målgrupp är barn med livsbegränsande eller livshotande tillstånd. Vi bedriver vård både under tidig och sen palliativ fas samt i livets slut.\n\nDå vårt arbete ibland är ganska svårt erbjuder vi återkommande reflektion och handledning för att du ska må bra. Vi värdesätter din höga kompetens och betalar bra för den. \n\nVi vet genom patientenkäter och medarbetarundersökningar att Lilla Erstagården ger vård i toppklass och att vi har en mycket god arbetsmiljö. Vi vet att trivsel på arbetsplatsen skapar engagemang och ansvarstagande och vi premierar initiativ för att utveckla den barnpalliativa vården. \n\nDina kollegor blir barnläkare, barnsjuksköterskor, sjuksköterskor, barnsköterskor, undersköterskor, kurator, fysioterapeut, syskonstödjare, lekterapeut och diakon. Vi samarbetar även tätt med barnens ordinarie läkare inne på barnsjukhusen. \n\nLilla Erstagården är vackert beläget nära Sickla, vid Hästhagen, i anslutning till Nackareservatet och Järla sjö.\n\nVardagar finns hela teamet tillhands. Kvällar och helger finns läkare i beredskap men kort inställelsetid. Du behöver vara trygg att i samråd med läkare i beredskap och dina kollegor på plats kunna fatta självständiga beslut. \r\n\r\nARBETSUPPGIFTER\nSom sjuksköterska på Lilla Erstagården möter du barn och deras närstående i utsatta situationer, där du med din kompetens gör stor skillnad. Du behöver vara trygg i din yrkesroll och tycka om att jobba i team.\r\n\r\nKVALIFIKATIONER\nDu är legitimerad sjuksköterska. Starkt meriterande är barnsjuksköterska, eller flera års erfarenhet av barnsjukvård. Erfarenhet av palliativ vård är också meriterande. Vi lägger stor vikt vid din personliga lämplighet. \r\n\nÖVRIGT\nVi strävar efter en jämn könsfördelning och ser mångfald som en styrka och välkomnar därför sökande med olika bakgrund. Urvalet sker löpande och tjänsten kan tillsättas innan sista ansökningsdag.\n\nInför rekryteringsarbetet har vi tagit ställning till rekryteringskanaler och marknadsföring. Vi undanbeder oss därför bestämt kontakt med mediesäljare, rekryteringssajter och liknande.\n\nVi använder e-rekrytering för att effektivisera och kvalitetssäkra rekryteringsarbetet. Alla dina uppgifter sparas på ditt CV-konto och du kan enkelt logga in och uppdatera dina uppgifter när du vill. Fyll därför i dina uppgifter så omsorgsfullt som möjligt för att ge en rättvisande bild av dig själv. Uppgifterna behandlas och sparas enligt personuppgiftslagen.\n\nVarmt välkommen med din ansökan!",
        "conditions" : "Timavlönad. \r\nTidsbegränsad anställning, tillträde: Tillträde efter överenskommelse.\nUrval sker löpande.\nTjänsten omfattar: dag/kväll, natt.",
        "text" : "Vi söker fler skickliga sjuksköterskor för anställning på timme!\n\n\n• Vill du inte riktigt släppa det jobb du har, men är intresserad av att prova att jobba hos oss?\n• Är du nyfiken på hur det är att jobba i den barnpalliativa vården, men är inte säker på att det är rätt för dig?\n\nDå kan du prova att komma till oss som timanställd, där vi har möjlighet att lära känna varandra utan krav! \n\nHos oss på Lilla Erstagården vårdar vi hela familjen. Vården hos oss rymmer både samtal, läkemedel, medicintekniska moment, omvårdnad, existentiella aspekter samt lek och bullbak. Vi samarbetar nära i teamet och värnar att alla kompetenser kommer patienten till del. Vi har fem ordinarie vårdplatser och vår målgrupp är barn med livsbegränsande eller livshotande tillstånd. Vi bedriver vård både under tidig och sen palliativ fas samt i livets slut.\n\nDå vårt arbete ibland är ganska svårt erbjuder vi återkommande reflektion och handledning för att du ska må bra. Vi värdesätter din höga kompetens och betalar bra för den. \n\nVi vet genom patientenkäter och medarbetarundersökningar att Lilla Erstagården ger vård i toppklass och att vi har en mycket god arbetsmiljö. Vi vet att trivsel på arbetsplatsen skapar engagemang och ansvarstagande och vi premierar initiativ för att utveckla den barnpalliativa vården. \n\nDina kollegor blir barnläkare, barnsjuksköterskor, sjuksköterskor, barnsköterskor, undersköterskor, kurator, fysioterapeut, syskonstödjare, lekterapeut och diakon. Vi samarbetar även tätt med barnens ordinarie läkare inne på barnsjukhusen. \n\nLilla Erstagården är vackert beläget nära Sickla, vid Hästhagen, i anslutning till Nackareservatet och Järla sjö.\n\nVardagar finns hela teamet tillhands. Kvällar och helger finns läkare i beredskap men kort inställelsetid. Du behöver vara trygg att i samråd med läkare i beredskap och dina kollegor på plats kunna fatta självständiga beslut. \r\n\r\nARBETSUPPGIFTER\nSom sjuksköterska på Lilla Erstagården möter du barn och deras närstående i utsatta situationer, där du med din kompetens gör stor skillnad. Du behöver vara trygg i din yrkesroll och tycka om att jobba i team.\r\n\r\nKVALIFIKATIONER\nDu är legitimerad sjuksköterska. Starkt meriterande är barnsjuksköterska, eller flera års erfarenhet av barnsjukvård. Erfarenhet av palliativ vård är också meriterande. Vi lägger stor vikt vid din personliga lämplighet. \r\n\nÖVRIGT\nVi strävar efter en jämn könsfördelning och ser mångfald som en styrka och välkomnar därför sökande med olika bakgrund. Urvalet sker löpande och tjänsten kan tillsättas innan sista ansökningsdag.\n\nInför rekryteringsarbetet har vi tagit ställning till rekryteringskanaler och marknadsföring. Vi undanbeder oss därför bestämt kontakt med mediesäljare, rekryteringssajter och liknande.\n\nVi använder e-rekrytering för att effektivisera och kvalitetssäkra rekryteringsarbetet. Alla dina uppgifter sparas på ditt CV-konto och du kan enkelt logga in och uppdatera dina uppgifter när du vill. Fyll därför i dina uppgifter så omsorgsfullt som möjligt för att ge en rättvisande bild av dig själv. Uppgifterna behandlas och sparas enligt personuppgiftslagen.\n\nVarmt välkommen med din ansökan!"
      },
      "headline" : "Timavlönad sjuksköterska med barnkompetens till Lilla Erstagården",
      "driving_license" : null,
      "employer" : {
        "email" : null,
        "phone_number" : null,
        "organization_number" : "8020006717",
        "name" : "Ideella Fören Ersta Diakonisällskap Med Firmaers",
        "url" : "https://www.erstadiakoni.se/sv/sjukhus/Patient/Kliniker--avdelningar/Hospice/Lilla-Erstagarden/",
        "workplace" : "Ersta diakoni, Lilla Erstagården"
      },
      "removed_date" : null,
      "logo_url" : "https://www.arbetsformedlingen.se/rest/arbetsgivare/rest/af/v3/organisation/8020006717/logotyper/logo.png",
      "last_publication_date" : "2022-08-21T23:59:59",
      "number_of_vacancies" : 1,
      "occupation" : {
        "concept_id" : "CQBS_ZSZ_ViP",
        "label" : "Barnsjuksköterska",
        "legacy_ams_taxonomy_id" : "5759"
      },
      "occupation_group" : {
        "concept_id" : "NFUg_y9y_1TY",
        "label" : "Barnsjuksköterskor",
        "legacy_ams_taxonomy_id" : "2232"
      },
      "employment_type" : {
        "concept_id" : "PFZr_Syz_cUq",
        "label" : "Vanlig anställning",
        "legacy_ams_taxonomy_id" : "1"
      },
      "webpage_url" : "https://arbetsformedlingen.se/platsbanken/annonser/26295524",
      "driving_license_required" : false,
      "application_contacts" : [ {
        "description" : "Beat Axå",
        "email" : "beat.axa@erstadiakoni.se",
        "telephone" : "08 714 68 33",
        "name" : null,
        "contact_type" : "Vårdchef"
      }, {
        "description" : "Elin Bondesson",
        "email" : "elin.bondesson@erstadiakoni.se",
        "telephone" : null,
        "name" : null,
        "contact_type" : "Samordnare/Specialistsjuksköterska Barn och Ungdom"
      } ],
      "duration" : {
        "concept_id" : "Xj7x_7yZ_jEn",
        "label" : "3 månader – upp till 6 månader",
        "legacy_ams_taxonomy_id" : "3"
      },
      "nice_to_have" : {
        "education_level" : [ ],
        "work_experiences" : [ ],
        "skills" : [ ],
        "education" : [ ],
        "languages" : [ ]
      },
      "application_details" : {
        "via_af" : false,
        "email" : null,
        "other" : null,
        "reference" : "A9604",
        "url" : "https://recruit.visma.com/Public/Apply.aspx?guidAssignment=31706e20-96bc-4b5b-bba9-143c622f500f&publishCode=AMS&TK=d674ded9-4534-47db-b832-9828cf88d636",
        "information" : null
      },
      "source_type" : "VIA_PLATSBANKEN_DXA",
      "application_deadline" : "2022-08-21T23:59:59",
      "external_id" : "46-802000-6717-31706E2096BC4B5BBBA9143C622F500F",
      "workplace_address" : {
        "coordinates" : [ 18.06858, 59.329323 ],
        "city" : null,
        "postcode" : null,
        "municipality" : "Stockholm",
        "region_concept_id" : "CifL_Rzy_Mku",
        "region" : "Stockholms län",
        "country_code" : "199",
        "region_code" : "01",
        "municipality_concept_id" : "AvNB_uwa_6n6",
        "country_concept_id" : "i46j_HmG_v64",
        "municipality_code" : "0180",
        "street_address" : null,
        "country" : "Sverige"
      },
      "id" : "26295524",
      "experience_required" : true,
      "working_hours_type" : {
        "concept_id" : "947z_JGS_Uk2",
        "label" : "Deltid",
        "legacy_ams_taxonomy_id" : "2"
      },
      "access" : null,
      "timestamp" : 1657022721766,
      "must_have" : {
        "education_level" : [ ],
        "work_experiences" : [ {
          "concept_id" : "CQBS_ZSZ_ViP",
          "weight" : 10,
          "label" : "Barnsjuksköterska",
          "legacy_ams_taxonomy_id" : "5759"
        } ],
        "skills" : [ ],
        "education" : [ ],
        "languages" : [ ]
      },
      "occupation_field" : {
        "concept_id" : "NYW6_mP6_vwf",
        "label" : "Hälso- och sjukvård",
        "legacy_ams_taxonomy_id" : "8"
      },
      "scope_of_work" : {
        "min" : 0,
        "max" : 100
      },
      "salary_type" : {
        "concept_id" : "oG8G_9cW_nRf",
        "label" : "Fast månads- vecko- eller timlön",
        "legacy_ams_taxonomy_id" : "1"
      },
      "removed" : false,
      "salary_description" : "Enligt avtal.",
      "access_to_own_car" : false,
      "publication_date" : "2022-07-05T14:05:21"
    },
    "name" : "Timavlönad sjuksköterska med barnkompetens till Lilla Erstagården",
    "user" : "kristof.fischer"
  },
  "sha1" : "9dd82f8ac0ffdaefb5d950a0156386176afbb7ea",
  "annotations" : [ {
    "preferred-label" : "Barnsjuksköterska",
    "sentiment" : "MUST_HAVE",
    "type" : "occupation-name",
    "start-position" : 11,
    "end-position" : 24,
    "concept-id" : "CQBS_ZSZ_ViP",
    "matched-string" : "sjuksköterska",
    "annotation-id" : 0
  }, {
    "preferred-label" : "Barnsjuksköterska",
    "sentiment" : "MUST_HAVE",
    "type" : "occupation-name",
    "start-position" : 90,
    "end-position" : 104,
    "concept-id" : "CQBS_ZSZ_ViP",
    "matched-string" : "sjuksköterskor",
    "annotation-id" : 1
  }, {
    "preferred-label" : "Läkare",
    "sentiment" : "MUST_HAVE",
    "type" : "occupation-name",
    "start-position" : 1389,
    "end-position" : 1399,
    "concept-id" : "9K3i_XD4_Kyy",
    "matched-string" : "barnläkare",
    "annotation-id" : 5
  }, {
    "preferred-label" : "Barnsjuksköterska",
    "sentiment" : "MUST_HAVE",
    "type" : "occupation-name",
    "start-position" : 1401,
    "end-position" : 1419,
    "concept-id" : "CQBS_ZSZ_ViP",
    "matched-string" : "barnsjuksköterskor",
    "annotation-id" : 6
  }, {
    "preferred-label" : "Sjuksköterska, grundutbildad",
    "sentiment" : "MUST_HAVE",
    "type" : "occupation-name",
    "start-position" : 1421,
    "end-position" : 1435,
    "concept-id" : "bXNH_MNX_dUR",
    "matched-string" : "sjuksköterskor",
    "annotation-id" : 7
  }, {
    "preferred-label" : "Barnsköterska",
    "sentiment" : "MUST_HAVE",
    "type" : "occupation-name",
    "start-position" : 1437,
    "end-position" : 1451,
    "concept-id" : "rwrv_VQw_vPr",
    "matched-string" : "barnsköterskor",
    "annotation-id" : 8
  }, {
    "preferred-label" : "Undersköterska, vård- och specialavdelning och mottagning",
    "sentiment" : "MUST_HAVE",
    "type" : "occupation-name",
    "start-position" : 1453,
    "end-position" : 1468,
    "concept-id" : "PQkQ_Dmk_ZF8",
    "matched-string" : "undersköterskor",
    "annotation-id" : 9
  }, {
    "preferred-label" : "Kurator",
    "sentiment" : "MUST_HAVE",
    "type" : "occupation-name",
    "start-position" : 1470,
    "end-position" : 1477,
    "concept-id" : "YpRs_ybt_47a",
    "matched-string" : "kurator",
    "annotation-id" : 10
  }, {
    "preferred-label" : "Fysioterapeut/Sjukgymnast",
    "sentiment" : "MUST_HAVE",
    "type" : "occupation-name",
    "start-position" : 1479,
    "end-position" : 1492,
    "concept-id" : "raVz_oTw_N3e",
    "matched-string" : "fysioterapeut",
    "annotation-id" : 11
  }, {
    "preferred-label" : null,
    "type" : "occupation-name",
    "start-position" : 1494,
    "end-position" : 1508,
    "concept-id" : null,
    "matched-string" : "syskonstödjare",
    "annotation-id" : 22
  }, {
    "preferred-label" : "Lekterapeut",
    "sentiment" : "MUST_HAVE",
    "type" : "occupation-name",
    "start-position" : 1510,
    "end-position" : 1521,
    "concept-id" : "4mUk_ow8_wji",
    "matched-string" : "lekterapeut",
    "annotation-id" : 12
  }, {
    "preferred-label" : "Diakon",
    "sentiment" : "MUST_HAVE",
    "type" : "occupation-name",
    "start-position" : 1526,
    "end-position" : 1532,
    "concept-id" : "9HFY_TcS_6qs",
    "matched-string" : "diakon",
    "annotation-id" : 13
  }, {
    "preferred-label" : "Läkare",
    "type" : "occupation-name",
    "start-position" : 1580,
    "end-position" : 1586,
    "concept-id" : "9K3i_XD4_Kyy",
    "matched-string" : "läkare",
    "annotation-id" : 23
  }, {
    "preferred-label" : "Läkare",
    "type" : "occupation-name",
    "start-position" : 1790,
    "end-position" : 1796,
    "concept-id" : "9K3i_XD4_Kyy",
    "matched-string" : "läkare",
    "annotation-id" : 24
  }, {
    "preferred-label" : "Läkare",
    "type" : "occupation-name",
    "start-position" : 1873,
    "end-position" : 1879,
    "concept-id" : "9K3i_XD4_Kyy",
    "matched-string" : "läkare",
    "annotation-id" : 25
  }, {
    "preferred-label" : "fatta beslut",
    "sentiment" : "MUST_HAVE",
    "type" : "esco-skill",
    "start-position" : 1925,
    "end-position" : 1951,
    "concept-id" : "7akt_v7j_ggK",
    "matched-string" : "fatta självständiga beslut",
    "annotation-id" : 26
  }, {
    "preferred-label" : "Barnsjuksköterska",
    "sentiment" : "MUST_HAVE",
    "type" : "occupation-name",
    "start-position" : 1977,
    "end-position" : 1990,
    "concept-id" : "CQBS_ZSZ_ViP",
    "matched-string" : "sjuksköterska",
    "annotation-id" : 17
  }, {
    "preferred-label" : "Sjuksköterska, grundutbildad",
    "sentiment" : "MUST_HAVE",
    "type" : "occupation-name",
    "start-position" : 2220,
    "end-position" : 2233,
    "concept-id" : "bXNH_MNX_dUR",
    "matched-string" : "sjuksköterska",
    "annotation-id" : 18
  }, {
    "preferred-label" : "Barnsjuksköterska",
    "sentiment" : "NICE_TO_HAVE",
    "type" : "occupation-name",
    "start-position" : 2257,
    "end-position" : 2274,
    "concept-id" : "CQBS_ZSZ_ViP",
    "matched-string" : "barnsjuksköterska",
    "annotation-id" : 19
  }, {
    "preferred-label" : "Barn på sjukhus, barnskötarerfarenhet",
    "sentiment" : "NICE_TO_HAVE",
    "type" : "skill",
    "start-position" : 2306,
    "end-position" : 2318,
    "concept-id" : "sKux_n1g_FWp",
    "matched-string" : "barnsjukvård",
    "annotation-id" : 27
  }, {
    "preferred-label" : "Palliativ vård",
    "sentiment" : "NICE_TO_HAVE",
    "type" : "skill",
    "start-position" : 2334,
    "end-position" : 2348,
    "concept-id" : "ryxY_Uwr_pkw",
    "matched-string" : "palliativ vård",
    "annotation-id" : 20
  } ],
  "text" : "Timavlönad sjuksköterska med barnkompetens till Lilla Erstagården\nVi söker fler skickliga sjuksköterskor för anställning på timme!\n\n\n• Vill du inte riktigt släppa det jobb du har, men är intresserad av att prova att jobba hos oss?\n• Är du nyfiken på hur det är att jobba i den barnpalliativa vården, men är inte säker på att det är rätt för dig?\n\nDå kan du prova att komma till oss som timanställd, där vi har möjlighet att lära känna varandra utan krav! \n\nHos oss på Lilla Erstagården vårdar vi hela familjen. Vården hos oss rymmer både samtal, läkemedel, medicintekniska moment, omvårdnad, existentiella aspekter samt lek och bullbak. Vi samarbetar nära i teamet och värnar att alla kompetenser kommer patienten till del. Vi har fem ordinarie vårdplatser och vår målgrupp är barn med livsbegränsande eller livshotande tillstånd. Vi bedriver vård både under tidig och sen palliativ fas samt i livets slut.\n\nDå vårt arbete ibland är ganska svårt erbjuder vi återkommande reflektion och handledning för att du ska må bra. Vi värdesätter din höga kompetens och betalar bra för den. \n\nVi vet genom patientenkäter och medarbetarundersökningar att Lilla Erstagården ger vård i toppklass och att vi har en mycket god arbetsmiljö. Vi vet att trivsel på arbetsplatsen skapar engagemang och ansvarstagande och vi premierar initiativ för att utveckla den barnpalliativa vården. \n\nDina kollegor blir barnläkare, barnsjuksköterskor, sjuksköterskor, barnsköterskor, undersköterskor, kurator, fysioterapeut, syskonstödjare, lekterapeut och diakon. Vi samarbetar även tätt med barnens ordinarie läkare inne på barnsjukhusen. \n\nLilla Erstagården är vackert beläget nära Sickla, vid Hästhagen, i anslutning till Nackareservatet och Järla sjö.\n\nVardagar finns hela teamet tillhands. Kvällar och helger finns läkare i beredskap men kort inställelsetid. Du behöver vara trygg att i samråd med läkare i beredskap och dina kollegor på plats kunna fatta självständiga beslut. \r\n\r\nARBETSUPPGIFTER\nSom sjuksköterska på Lilla Erstagården möter du barn och deras närstående i utsatta situationer, där du med din kompetens gör stor skillnad. Du behöver vara trygg i din yrkesroll och tycka om att jobba i team.\r\n\r\nKVALIFIKATIONER\nDu är legitimerad sjuksköterska. Starkt meriterande är barnsjuksköterska, eller flera års erfarenhet av barnsjukvård. Erfarenhet av palliativ vård är också meriterande. Vi lägger stor vikt vid din personliga lämplighet. \r\n\nÖVRIGT\nVi strävar efter en jämn könsfördelning och ser mångfald som en styrka och välkomnar därför sökande med olika bakgrund. Urvalet sker löpande och tjänsten kan tillsättas innan sista ansökningsdag.\n\nInför rekryteringsarbetet har vi tagit ställning till rekryteringskanaler och marknadsföring. Vi undanbeder oss därför bestämt kontakt med mediesäljare, rekryteringssajter och liknande.\n\nVi använder e-rekrytering för att effektivisera och kvalitetssäkra rekryteringsarbetet. Alla dina uppgifter sparas på ditt CV-konto och du kan enkelt logga in och uppdatera dina uppgifter när du vill. Fyll därför i dina uppgifter så omsorgsfullt som möjligt för att ge en rättvisande bild av dig själv. Uppgifterna behandlas och sparas enligt personuppgiftslagen.\n\nVarmt välkommen med din ansökan!"
}