{
  "meta" : {
    "jobad" : {
      "description" : {
        "requirements" : null,
        "needs" : null,
        "company_information" : null,
        "text_formatted" : "<p>Mitan47 AB bedriver restaurang- och pizzeriaverksamhet i centrala Kristinehamn. Vi behöver förstärka vårt team med ytterligare två restaurangbiträden på deltid (minst 75%).</p><p>Vi söker dig som har erfarenhet, är glad &amp; serviceinriktad och van att arbeta i team med högt tempo.</p><p>Arbetsuppgifter: Sedvanliga arbetsuppgifter som förekommer i en restaurang, såsom servering/diskplock, lagerhantering och städning.</p><p id=\"oppenforalla\">Öppen för alla\nVi fokuserar på din kompetens, inte dina övriga förutsättningar. Vi är öppna för att anpassa rollen eller arbetsplatsen efter dina behov.</p>",
        "conditions" : null,
        "text" : "Mitan47 AB bedriver restaurang- och pizzeriaverksamhet i centrala Kristinehamn. Vi behöver förstärka vårt team med ytterligare två restaurangbiträden på deltid (minst 75%).\nVi söker dig som har erfarenhet, är glad & serviceinriktad och van att arbeta i team med högt tempo.\nArbetsuppgifter: Sedvanliga arbetsuppgifter som förekommer i en restaurang, såsom servering/diskplock, lagerhantering och städning.\nÖppen för alla\nVi fokuserar på din kompetens, inte dina övriga förutsättningar. Vi är öppna för att anpassa rollen eller arbetsplatsen efter dina behov."
      },
      "headline" : "Restaurangbiträde på deltid sökes",
      "driving_license" : null,
      "employer" : {
        "email" : null,
        "phone_number" : null,
        "organization_number" : "5593808032",
        "name" : "Mitan47 AB",
        "url" : null,
        "workplace" : "Mitan47 AB"
      },
      "removed_date" : null,
      "logo_url" : null,
      "last_publication_date" : "2022-09-13T23:59:59",
      "number_of_vacancies" : 2,
      "occupation" : {
        "concept_id" : "yXRQ_Ad9_E8V",
        "label" : "Restaurangbiträde",
        "legacy_ams_taxonomy_id" : "5555"
      },
      "occupation_group" : {
        "concept_id" : "tPox_ie4_X9X",
        "label" : "Restaurang- och köksbiträden m.fl.",
        "legacy_ams_taxonomy_id" : "9412"
      },
      "employment_type" : {
        "concept_id" : "PFZr_Syz_cUq",
        "label" : "Vanlig anställning",
        "legacy_ams_taxonomy_id" : "1"
      },
      "webpage_url" : "https://arbetsformedlingen.se/platsbanken/annonser/26406384",
      "driving_license_required" : false,
      "application_contacts" : [ ],
      "duration" : {
        "concept_id" : "a7uU_j21_mkL",
        "label" : "Tills vidare",
        "legacy_ams_taxonomy_id" : "1"
      },
      "nice_to_have" : {
        "education_level" : [ ],
        "work_experiences" : [ {
          "concept_id" : "yXRQ_Ad9_E8V",
          "weight" : 5,
          "label" : "Restaurangbiträde",
          "legacy_ams_taxonomy_id" : "5555"
        } ],
        "skills" : [ ],
        "education" : [ ],
        "languages" : [ ]
      },
      "application_details" : {
        "via_af" : false,
        "email" : "lavinmitan_47@hotmail.com",
        "other" : null,
        "reference" : "Restaurangbiträde",
        "url" : null,
        "information" : null
      },
      "source_type" : "VIA_ANNONSERA",
      "application_deadline" : "2022-09-13T23:59:59",
      "external_id" : null,
      "workplace_address" : {
        "coordinates" : [ 14.109891275167856, 59.30851957849974 ],
        "city" : "Kristinehamn",
        "postcode" : "68131",
        "municipality" : "Kristinehamn",
        "region_concept_id" : "EVVp_h6U_GSZ",
        "region" : "Värmlands län",
        "country_code" : "199",
        "region_code" : "17",
        "municipality_concept_id" : "SVQS_uwJ_m2B",
        "country_concept_id" : "i46j_HmG_v64",
        "municipality_code" : "1781",
        "street_address" : "Spelmansgatan 22",
        "country" : "Sverige"
      },
      "id" : "26406384",
      "experience_required" : true,
      "working_hours_type" : {
        "concept_id" : "947z_JGS_Uk2",
        "label" : "Deltid",
        "legacy_ams_taxonomy_id" : "2"
      },
      "access" : null,
      "timestamp" : 1660388705273,
      "must_have" : {
        "education_level" : [ ],
        "work_experiences" : [ ],
        "skills" : [ ],
        "education" : [ ],
        "languages" : [ ]
      },
      "occupation_field" : {
        "concept_id" : "ScKy_FHB_7wT",
        "label" : "Hotell, restaurang, storhushåll",
        "legacy_ams_taxonomy_id" : "7"
      },
      "scope_of_work" : {
        "min" : 0,
        "max" : 100
      },
      "salary_type" : {
        "concept_id" : "oG8G_9cW_nRf",
        "label" : "Fast månads- vecko- eller timlön",
        "legacy_ams_taxonomy_id" : "1"
      },
      "removed" : false,
      "salary_description" : null,
      "access_to_own_car" : false,
      "publication_date" : "2022-08-13T13:05:05"
    },
    "name" : "Restaurangbiträde på deltid sökes",
    "user" : "hannes"
  },
  "sha1" : "bdde60a16d4099aa7d811a421232fb44cdb14fbf",
  "annotations" : [ {
    "preferred-label" : "Restaurangbiträde",
    "sentiment" : "MUST_HAVE",
    "type" : "occupation-name",
    "start-position" : 0,
    "end-position" : 17,
    "concept-id" : "yXRQ_Ad9_E8V",
    "matched-string" : "restaurangbiträde",
    "annotation-id" : 0
  }, {
    "preferred-label" : "Deltid",
    "sentiment" : "MUST_HAVE",
    "type" : "worktime-extent",
    "start-position" : 21,
    "end-position" : 27,
    "concept-id" : "947z_JGS_Uk2",
    "matched-string" : "deltid",
    "annotation-id" : 3
  }, {
    "preferred-label" : "Restaurang",
    "sentiment" : "NOT_RELEVANT",
    "type" : "keyword",
    "start-position" : 54,
    "end-position" : 64,
    "concept-id" : "o2Cg_3Ap_qvK",
    "matched-string" : "restaurang",
    "annotation-id" : 1
  }, {
    "preferred-label" : "Pizzeria",
    "sentiment" : "NOT_RELEVANT",
    "type" : "skill",
    "start-position" : 70,
    "end-position" : 78,
    "concept-id" : "DmFL_vHQ_j7e",
    "matched-string" : "pizzeria",
    "annotation-id" : 4
  }, {
    "preferred-label" : "Kristinehamn",
    "sentiment" : "NOT_RELEVANT",
    "type" : "municipality",
    "start-position" : 100,
    "end-position" : 112,
    "concept-id" : "SVQS_uwJ_m2B",
    "matched-string" : "Kristinehamn",
    "annotation-id" : 5
  }, {
    "preferred-label" : "Deltid",
    "sentiment" : "NOT_RELEVANT",
    "type" : "worktime-extent",
    "start-position" : 187,
    "end-position" : 205,
    "concept-id" : "947z_JGS_Uk2",
    "matched-string" : "deltid (minst 75%)",
    "annotation-id" : 6
  }, {
    "preferred-label" : "Restaurang",
    "sentiment" : "NOT_RELEVANT",
    "type" : "keyword",
    "start-position" : 372,
    "end-position" : 382,
    "concept-id" : "o2Cg_3Ap_qvK",
    "matched-string" : "restaurang",
    "annotation-id" : 2
  }, {
    "preferred-label" : "Restaurang, servering",
    "sentiment" : "MUST_HAVE",
    "type" : "keyword",
    "start-position" : 390,
    "end-position" : 399,
    "concept-id" : "GqXD_ArB_Mmg",
    "matched-string" : "servering",
    "annotation-id" : 7
  }, {
    "preferred-label" : "Diskplockare",
    "sentiment" : "MUST_HAVE",
    "type" : "keyword",
    "start-position" : 400,
    "end-position" : 409,
    "concept-id" : "pEsS_jVe_EMQ",
    "matched-string" : "diskplock",
    "annotation-id" : 8
  }, {
    "preferred-label" : "Lager",
    "sentiment" : "MUST_HAVE",
    "type" : "keyword",
    "start-position" : 411,
    "end-position" : 425,
    "concept-id" : "J5gJ_6vV_egQ",
    "matched-string" : "lagerhantering",
    "annotation-id" : 9
  }, {
    "preferred-label" : "Städa",
    "sentiment" : "MUST_HAVE",
    "type" : "keyword",
    "start-position" : 430,
    "end-position" : 438,
    "concept-id" : "r35T_iyj_ueU",
    "matched-string" : "städning",
    "annotation-id" : 10
  } ],
  "text" : "Restaurangbiträde på deltid sökes\nMitan47 AB bedriver restaurang- och pizzeriaverksamhet i centrala Kristinehamn. Vi behöver förstärka vårt team med ytterligare två restaurangbiträden på deltid (minst 75%).\nVi söker dig som har erfarenhet, är glad & serviceinriktad och van att arbeta i team med högt tempo.\nArbetsuppgifter: Sedvanliga arbetsuppgifter som förekommer i en restaurang, såsom servering/diskplock, lagerhantering och städning.\nÖppen för alla\nVi fokuserar på din kompetens, inte dina övriga förutsättningar. Vi är öppna för att anpassa rollen eller arbetsplatsen efter dina behov."
}