{
  "meta" : {
    "jobad" : {
      "description" : {
        "requirements" : null,
        "needs" : null,
        "company_information" : null,
        "text_formatted" : "<p><br></p><p>2 st servitörer/servitriser sökes</p><p>Sushi Thai King AB befinner sig för närvaranden i ett intressant utvecklingsskede och kommer att expandera sin verksamhet den närmaste tiden. Med anledning av detta så söker vi nu 1 nya medarbetare till vår verksamhet i Mölndahls centrum.</p><p><br></p><p>De medarbetare som vi söker är servitörer/servitriser som också skall fungera som några slags allt-i-allo. Vår vision är att ge restaurangen bättre service och ett kvalitetslyft för framtiden där våra kunders belåtenhet kommer att vara vårt primära fokus. Därför är det viktigt att rätt medarbetare anställes och för rätt personer så kommer goda utvecklingsmöjligheter att finnas för dem i företaget. Det innebär bland annat möjligheter till vidareutbildning inom företaget som också betyder mer ansvar för verksamheten.</p><p>Vi värdesätter goda språkkunskaper i svenska, engelska men det är också värdefullt om ni har kunskaper i thailändska och kinesiska .</p>",
        "conditions" : null,
        "text" : "2 st servitörer/servitriser sökes\nSushi Thai King AB befinner sig för närvaranden i ett intressant utvecklingsskede och kommer att expandera sin verksamhet den närmaste tiden. Med anledning av detta så söker vi nu 1 nya medarbetare till vår verksamhet i Mölndahls centrum.\n\n\nDe medarbetare som vi söker är servitörer/servitriser som också skall fungera som några slags allt-i-allo. Vår vision är att ge restaurangen bättre service och ett kvalitetslyft för framtiden där våra kunders belåtenhet kommer att vara vårt primära fokus. Därför är det viktigt att rätt medarbetare anställes och för rätt personer så kommer goda utvecklingsmöjligheter att finnas för dem i företaget. Det innebär bland annat möjligheter till vidareutbildning inom företaget som också betyder mer ansvar för verksamheten.\nVi värdesätter goda språkkunskaper i svenska, engelska men det är också värdefullt om ni har kunskaper i thailändska och kinesiska ."
      },
      "headline" : "servitör/svervitris",
      "driving_license" : null,
      "employer" : {
        "email" : null,
        "phone_number" : null,
        "organization_number" : "5567493340",
        "name" : "Sushi Thai King AB",
        "url" : null,
        "workplace" : "Sushi Thai King AB"
      },
      "removed_date" : null,
      "logo_url" : null,
      "last_publication_date" : "2022-09-17T23:59:59",
      "number_of_vacancies" : 2,
      "occupation" : {
        "concept_id" : "rGGf_KLs_To7",
        "label" : "Servitör/Servitris",
        "legacy_ams_taxonomy_id" : "5487"
      },
      "occupation_group" : {
        "concept_id" : "UjoW_meY_Zwt",
        "label" : "Hovmästare och servitörer",
        "legacy_ams_taxonomy_id" : "5131"
      },
      "employment_type" : {
        "concept_id" : "PFZr_Syz_cUq",
        "label" : "Vanlig anställning",
        "legacy_ams_taxonomy_id" : "1"
      },
      "webpage_url" : "https://arbetsformedlingen.se/platsbanken/annonser/26428275",
      "driving_license_required" : false,
      "application_contacts" : [ ],
      "duration" : {
        "concept_id" : "a7uU_j21_mkL",
        "label" : "Tills vidare",
        "legacy_ams_taxonomy_id" : "1"
      },
      "nice_to_have" : {
        "education_level" : [ ],
        "work_experiences" : [ ],
        "skills" : [ ],
        "education" : [ ],
        "languages" : [ ]
      },
      "application_details" : {
        "via_af" : false,
        "email" : "sushithaiking@gmail.com",
        "other" : null,
        "reference" : null,
        "url" : null,
        "information" : null
      },
      "source_type" : "VIA_ANNONSERA",
      "application_deadline" : "2022-09-17T23:59:59",
      "external_id" : null,
      "workplace_address" : {
        "coordinates" : [ 12.016609939498082, 57.65628551516567 ],
        "city" : "MÖLNDAL",
        "postcode" : "43130",
        "municipality" : "Mölndal",
        "region_concept_id" : "zdoY_6u5_Krt",
        "region" : "Västra Götalands län",
        "country_code" : "199",
        "region_code" : "14",
        "municipality_concept_id" : "mc45_ki9_Bv3",
        "country_concept_id" : "i46j_HmG_v64",
        "municipality_code" : "1481",
        "street_address" : "GÖTEBORGSVÄGEN 5",
        "country" : "Sverige"
      },
      "id" : "26428275",
      "experience_required" : false,
      "working_hours_type" : {
        "concept_id" : "6YE1_gAC_R2G",
        "label" : "Heltid",
        "legacy_ams_taxonomy_id" : "1"
      },
      "access" : null,
      "timestamp" : 1660846530267,
      "must_have" : {
        "education_level" : [ ],
        "work_experiences" : [ ],
        "skills" : [ ],
        "education" : [ ],
        "languages" : [ ]
      },
      "occupation_field" : {
        "concept_id" : "ScKy_FHB_7wT",
        "label" : "Hotell, restaurang, storhushåll",
        "legacy_ams_taxonomy_id" : "7"
      },
      "scope_of_work" : {
        "min" : 0,
        "max" : 100
      },
      "salary_type" : {
        "concept_id" : "oG8G_9cW_nRf",
        "label" : "Fast månads- vecko- eller timlön",
        "legacy_ams_taxonomy_id" : "1"
      },
      "removed" : false,
      "salary_description" : null,
      "access_to_own_car" : false,
      "publication_date" : "2022-08-18T20:15:30"
    },
    "name" : "servitör/svervitris",
    "user" : "hannes"
  },
  "sha1" : "a7b4f5d791b905fdc351ef740d1fed70f165d822",
  "annotations" : [ {
    "preferred-label" : "Servitör/Servitris",
    "sentiment" : "MUST_HAVE",
    "type" : "occupation-name",
    "start-position" : 0,
    "end-position" : 19,
    "concept-id" : "rGGf_KLs_To7",
    "matched-string" : "servitör/svervitris",
    "annotation-id" : 8
  }, {
    "preferred-label" : "Servitör/Servitris",
    "sentiment" : "MUST_HAVE",
    "type" : "occupation-name",
    "start-position" : 25,
    "end-position" : 47,
    "concept-id" : "rGGf_KLs_To7",
    "matched-string" : "servitörer/servitriser",
    "annotation-id" : 9
  }, {
    "preferred-label" : "Sushi",
    "sentiment" : "NOT_RELEVANT",
    "type" : "skill",
    "start-position" : 54,
    "end-position" : 59,
    "concept-id" : "mttr_4tL_4hD",
    "matched-string" : "sushi",
    "annotation-id" : 1
  }, {
    "preferred-label" : "Thailändskt kök",
    "sentiment" : "NOT_RELEVANT",
    "type" : "skill",
    "start-position" : 60,
    "end-position" : 64,
    "concept-id" : "zJFj_sZ8_z4E",
    "matched-string" : "thai",
    "annotation-id" : 2
  }, {
    "preferred-label" : "Servitör/Servitris",
    "sentiment" : "MUST_HAVE",
    "type" : "occupation-name",
    "start-position" : 326,
    "end-position" : 348,
    "concept-id" : "rGGf_KLs_To7",
    "matched-string" : "servitörer/servitriser",
    "annotation-id" : 10
  }, {
    "preferred-label" : "Allt-i-allo",
    "sentiment" : "MUST_HAVE",
    "type" : "keyword",
    "start-position" : 389,
    "end-position" : 400,
    "concept-id" : "R7Qy_eMj_B4y",
    "matched-string" : "allt-i-allo",
    "annotation-id" : 3
  }, {
    "preferred-label" : "Svenska",
    "sentiment" : "MUST_HAVE",
    "type" : "language",
    "start-position" : 853,
    "end-position" : 860,
    "concept-id" : "zSLA_vw2_FXN",
    "matched-string" : "svenska",
    "annotation-id" : 4
  }, {
    "preferred-label" : "Engelska",
    "sentiment" : "MUST_HAVE",
    "type" : "language",
    "start-position" : 862,
    "end-position" : 870,
    "concept-id" : "NVxJ_hLg_TYS",
    "matched-string" : "engelska",
    "annotation-id" : 5
  }, {
    "preferred-label" : "Thailändska",
    "sentiment" : "MUST_HAVE",
    "type" : "language",
    "start-position" : 921,
    "end-position" : 932,
    "concept-id" : "ECih_Cev_hwd",
    "matched-string" : "thailändska",
    "annotation-id" : 6
  }, {
    "preferred-label" : "Kinesiska",
    "sentiment" : "MUST_HAVE",
    "type" : "language",
    "start-position" : 937,
    "end-position" : 946,
    "concept-id" : "pgjM_8KQ_RZT",
    "matched-string" : "kinesiska",
    "annotation-id" : 7
  } ],
  "text" : "servitör/svervitris\n2 st servitörer/servitriser sökes\nSushi Thai King AB befinner sig för närvaranden i ett intressant utvecklingsskede och kommer att expandera sin verksamhet den närmaste tiden. Med anledning av detta så söker vi nu 1 nya medarbetare till vår verksamhet i Mölndahls centrum.\n\n\nDe medarbetare som vi söker är servitörer/servitriser som också skall fungera som några slags allt-i-allo. Vår vision är att ge restaurangen bättre service och ett kvalitetslyft för framtiden där våra kunders belåtenhet kommer att vara vårt primära fokus. Därför är det viktigt att rätt medarbetare anställes och för rätt personer så kommer goda utvecklingsmöjligheter att finnas för dem i företaget. Det innebär bland annat möjligheter till vidareutbildning inom företaget som också betyder mer ansvar för verksamheten.\nVi värdesätter goda språkkunskaper i svenska, engelska men det är också värdefullt om ni har kunskaper i thailändska och kinesiska ."
}