{
  "meta" : {
    "jobad" : {
      "description" : {
        "requirements" : null,
        "needs" : null,
        "company_information" : null,
        "text_formatted" : "<p>Om tjänsten</p><p>Hos oss får du möjlighet att arbeta i ett glatt arbetslag där vi jobbar med att erbjuda våra besökare en god personlig service. Vi erbjuder våra gäster ett säkert och tryggt besök i simhallen. Tjänsten innebär att du arbetar i arbetslag med cirkulationstjänstgöring. Tjänstgöringen är schemalagd med arbete morgon, dag, kvällar samt helger.</p><p> </p><p>Arbetsbeskrivning</p><p>I arbetsuppgifterna ingår bemanning av anläggning för att se till att trivsel - och säkerhetsregler efterföljs.</p><p>Anställningen innebär att tjänstgöringen är på badhus/utebad.</p><p>Deltidsanställning 80 %.</p><p> </p><p>Kvalifikationer/Krav</p><p>Klara kunskapskrav i simning och livräddning motsvarande guldbojen SLS. Simtest görs innan anställning.</p><p>Vara 18 år fyllda</p><p>Erfarenhet av serviceyrke</p><p>Vana av samarbete i grupp/arbetslag</p><p>God kunskap i svenska språket</p><p> </p><p>Meriterande </p><p>Erfarenhet från arbete vid badanläggning – poollivräddare, badvakt</p><p> </p><p>Övrigt </p><p>Utdrag ut belastningsregistret ska lämnas in. Vi lägger stor vikt vid personliga egenskaper.</p><p> </p><p>Karlskrona simsällskaps är en ideell förening som bedriver idrottsverksamhet, med simkonsten som grund inom simsport och triathlon. Härutöver håller Simsällskapet simskola och badvaktsverksamhet. Verksamheten genomförs på årlig basis och kan i stort delas in i en vår-, en sommar- och en hösttermin. </p><p>Verksamhetsplatserna är Karlskrona Simhall, inom- och utomhus bassängerna i Rödeby, kommunens badplatser samt i kommunens idrottshallar. Det sistnämnd avsett för träningsgruppernas landträning.</p><p> </p><p>Merparten av Simsällskapets ledare är ideella eller arvoderade. Ett mindre antal är del- eller heltidsanställda. All verksamhet leds av en klubbchef.</p><p> </p><p>Simsällskapet bildades 25 augusti 1900 och har en välrenommerad och lyckosam historia innefattande betydande simidrottsliga framgångar vid olympiska spel, världs-, europiska-, nordiska och svenska mästerskap. Insatserna som sim utbildande föreningen är också framgångsrika. Simsällskapet är sedan decennier kommunens största simskoleleverantör.</p><p>Sedan invigningen av Karlskrona Simhall 1995 har sällskapet ansvaret att hålla badvaktsverksamheten i Karlskrona simhall och Rödeby inom- och utomhus bassänger. Badvaktsverksamhet sker såväl på dagtid som kvällstid samt vardag som helgdag.</p><p> </p><p>För att kunna ge sällskapets medlemmar och simidrottsutövare service och stöd finns en kanslifunktion, vid Nya Skeppsbrogatan 7-9</p><p> </p><p id=\"oppenforalla\">Öppen för alla\nVi fokuserar på din kompetens, inte dina övriga förutsättningar. Vi är öppna för att anpassa rollen eller arbetsplatsen efter dina behov.</p>",
        "conditions" : null,
        "text" : "Om tjänsten\nHos oss får du möjlighet att arbeta i ett glatt arbetslag där vi jobbar med att erbjuda våra besökare en god personlig service. Vi erbjuder våra gäster ett säkert och tryggt besök i simhallen. Tjänsten innebär att du arbetar i arbetslag med cirkulationstjänstgöring. Tjänstgöringen är schemalagd med arbete morgon, dag, kvällar samt helger.\n \nArbetsbeskrivning\nI arbetsuppgifterna ingår bemanning av anläggning för att se till att trivsel - och säkerhetsregler efterföljs.\nAnställningen innebär att tjänstgöringen är på badhus/utebad.\nDeltidsanställning 80 %.\n \nKvalifikationer/Krav\nKlara kunskapskrav i simning och livräddning motsvarande guldbojen SLS. Simtest görs innan anställning.\nVara 18 år fyllda\nErfarenhet av serviceyrke\nVana av samarbete i grupp/arbetslag\nGod kunskap i svenska språket\n \nMeriterande \nErfarenhet från arbete vid badanläggning – poollivräddare, badvakt\n \nÖvrigt \nUtdrag ut belastningsregistret ska lämnas in. Vi lägger stor vikt vid personliga egenskaper.\n \nKarlskrona simsällskaps är en ideell förening som bedriver idrottsverksamhet, med simkonsten som grund inom simsport och triathlon. Härutöver håller Simsällskapet simskola och badvaktsverksamhet. Verksamheten genomförs på årlig basis och kan i stort delas in i en vår-, en sommar- och en hösttermin. \nVerksamhetsplatserna är Karlskrona Simhall, inom- och utomhus bassängerna i Rödeby, kommunens badplatser samt i kommunens idrottshallar. Det sistnämnd avsett för träningsgruppernas landträning.\n \nMerparten av Simsällskapets ledare är ideella eller arvoderade. Ett mindre antal är del- eller heltidsanställda. All verksamhet leds av en klubbchef.\n \nSimsällskapet bildades 25 augusti 1900 och har en välrenommerad och lyckosam historia innefattande betydande simidrottsliga framgångar vid olympiska spel, världs-, europiska-, nordiska och svenska mästerskap. Insatserna som sim utbildande föreningen är också framgångsrika. Simsällskapet är sedan decennier kommunens största simskoleleverantör.\nSedan invigningen av Karlskrona Simhall 1995 har sällskapet ansvaret att hålla badvaktsverksamheten i Karlskrona simhall och Rödeby inom- och utomhus bassänger. Badvaktsverksamhet sker såväl på dagtid som kvällstid samt vardag som helgdag.\n \nFör att kunna ge sällskapets medlemmar och simidrottsutövare service och stöd finns en kanslifunktion, vid Nya Skeppsbrogatan 7-9\n \nÖppen för alla\nVi fokuserar på din kompetens, inte dina övriga förutsättningar. Vi är öppna för att anpassa rollen eller arbetsplatsen efter dina behov."
      },
      "headline" : "Badvakt till Karlskrona Simsällskap",
      "driving_license" : [ {
        "concept_id" : "VTK8_WRx_GcM",
        "label" : "B",
        "legacy_ams_taxonomy_id" : "3"
      } ],
      "employer" : {
        "email" : null,
        "phone_number" : null,
        "organization_number" : "8350005552",
        "name" : "Karlskrona Simsällskap",
        "url" : null,
        "workplace" : "KARLSKRONA SIMSÄLLSKAP"
      },
      "removed_date" : null,
      "logo_url" : null,
      "last_publication_date" : "2022-08-03T23:59:59",
      "number_of_vacancies" : 1,
      "occupation" : {
        "concept_id" : "qtPc_BJB_SYL",
        "label" : "Badvakt",
        "legacy_ams_taxonomy_id" : "5990"
      },
      "occupation_group" : {
        "concept_id" : "ayQ4_G3W_A2w",
        "label" : "Övrig bevaknings- och säkerhetspersonal",
        "legacy_ams_taxonomy_id" : "5419"
      },
      "employment_type" : {
        "concept_id" : "PFZr_Syz_cUq",
        "label" : "Vanlig anställning",
        "legacy_ams_taxonomy_id" : "1"
      },
      "webpage_url" : "https://arbetsformedlingen.se/platsbanken/annonser/26290687",
      "driving_license_required" : true,
      "application_contacts" : [ ],
      "duration" : {
        "concept_id" : "a7uU_j21_mkL",
        "label" : "Tills vidare",
        "legacy_ams_taxonomy_id" : "1"
      },
      "nice_to_have" : {
        "education_level" : [ ],
        "work_experiences" : [ {
          "concept_id" : "qtPc_BJB_SYL",
          "weight" : 5,
          "label" : "Badvakt",
          "legacy_ams_taxonomy_id" : "5990"
        } ],
        "skills" : [ ],
        "education" : [ ],
        "languages" : [ ]
      },
      "application_details" : {
        "via_af" : false,
        "email" : "gordana.njezic@karlskronasimsallskap.se",
        "other" : null,
        "reference" : null,
        "url" : null,
        "information" : null
      },
      "source_type" : "VIA_ANNONSERA",
      "application_deadline" : "2022-08-03T23:59:59",
      "external_id" : null,
      "workplace_address" : {
        "coordinates" : [ 15.598887991552681, 56.16560423089571 ],
        "city" : "KARLSKRONA",
        "postcode" : "37133",
        "municipality" : "Karlskrona",
        "region_concept_id" : "DQZd_uYs_oKb",
        "region" : "Blekinge län",
        "country_code" : "199",
        "region_code" : "10",
        "municipality_concept_id" : "YSt4_bAa_ccs",
        "country_concept_id" : "i46j_HmG_v64",
        "municipality_code" : "1080",
        "street_address" : "NYA SKEPPSBROGATAN 7 0TR",
        "country" : "Sverige"
      },
      "id" : "26290687",
      "experience_required" : true,
      "working_hours_type" : {
        "concept_id" : "947z_JGS_Uk2",
        "label" : "Deltid",
        "legacy_ams_taxonomy_id" : "2"
      },
      "access" : null,
      "timestamp" : 1656939505782,
      "must_have" : {
        "education_level" : [ ],
        "work_experiences" : [ ],
        "skills" : [ ],
        "education" : [ ],
        "languages" : [ ]
      },
      "occupation_field" : {
        "concept_id" : "E7hm_BLq_fqZ",
        "label" : "Säkerhet och bevakning",
        "legacy_ams_taxonomy_id" : "17"
      },
      "scope_of_work" : {
        "min" : 0,
        "max" : 100
      },
      "salary_type" : {
        "concept_id" : "oG8G_9cW_nRf",
        "label" : "Fast månads- vecko- eller timlön",
        "legacy_ams_taxonomy_id" : "1"
      },
      "removed" : false,
      "salary_description" : null,
      "access_to_own_car" : false,
      "publication_date" : "2022-07-04T14:58:25"
    },
    "name" : "Badvakt till Karlskrona Simsällskap",
    "user" : "hannes"
  },
  "sha1" : "3efe0af127fd5219a1910d7bfdea4fb2fd6e9dff",
  "annotations" : [ {
    "preferred-label" : "badvakt",
    "sentiment" : "MUST_HAVE",
    "type" : "esco-occupation",
    "start-position" : 0,
    "end-position" : 7,
    "concept-id" : "tps1_qiD_eL3",
    "matched-string" : "badvakt",
    "annotation-id" : 0
  }, {
    "preferred-label" : "Karlskrona",
    "type" : "municipality",
    "start-position" : 13,
    "end-position" : 23,
    "concept-id" : "YSt4_bAa_ccs",
    "matched-string" : "Karlskrona",
    "annotation-id" : 5
  }, {
    "preferred-label" : "Deltid",
    "type" : "worktime-extent",
    "start-position" : 583,
    "end-position" : 606,
    "concept-id" : "947z_JGS_Uk2",
    "matched-string" : "Deltidsanställning 80 %",
    "annotation-id" : 6
  }, {
    "preferred-label" : "Godkänd livräddare, SLS",
    "type" : "skill",
    "start-position" : 698,
    "end-position" : 701,
    "concept-id" : "GJho_f1V_YbF",
    "matched-string" : "SLS",
    "annotation-id" : 7
  }, {
    "preferred-label" : "Svenska språket",
    "sentiment" : "MUST_HAVE",
    "type" : "keyword",
    "start-position" : 829,
    "end-position" : 844,
    "concept-id" : "BiGm_58D_SSn",
    "matched-string" : "svenska språket",
    "annotation-id" : 1
  }, {
    "preferred-label" : "badvakt",
    "sentiment" : "MUST_HAVE",
    "type" : "esco-occupation",
    "start-position" : 919,
    "end-position" : 926,
    "concept-id" : "tps1_qiD_eL3",
    "matched-string" : "badvakt",
    "annotation-id" : 2
  }, {
    "preferred-label" : "Karlskrona",
    "type" : "municipality",
    "start-position" : 1032,
    "end-position" : 1042,
    "concept-id" : "YSt4_bAa_ccs",
    "matched-string" : "Karlskrona",
    "annotation-id" : 8
  }, {
    "preferred-label" : "Karlskrona",
    "type" : "municipality",
    "start-position" : 1357,
    "end-position" : 1367,
    "concept-id" : "YSt4_bAa_ccs",
    "matched-string" : "Karlskrona",
    "annotation-id" : 9
  }, {
    "preferred-label" : "Deltid",
    "type" : "worktime-extent",
    "start-position" : 1613,
    "end-position" : 1616,
    "concept-id" : "947z_JGS_Uk2",
    "matched-string" : "del",
    "annotation-id" : 10
  }, {
    "preferred-label" : "Heltid",
    "type" : "worktime-extent",
    "start-position" : 1624,
    "end-position" : 1640,
    "concept-id" : "6YE1_gAC_R2G",
    "matched-string" : "heltidsanställda",
    "annotation-id" : 11
  }, {
    "preferred-label" : "Svenska",
    "sentiment" : "MUST_HAVE",
    "type" : "keyword",
    "start-position" : 1870,
    "end-position" : 1877,
    "concept-id" : "gfhX_bqH_U4K",
    "matched-string" : "svenska",
    "annotation-id" : 4
  }, {
    "preferred-label" : "Karlskrona",
    "type" : "municipality",
    "start-position" : 2047,
    "end-position" : 2057,
    "concept-id" : "YSt4_bAa_ccs",
    "matched-string" : "Karlskrona",
    "annotation-id" : 12
  }, {
    "preferred-label" : "Karlskrona",
    "type" : "municipality",
    "start-position" : 2128,
    "end-position" : 2138,
    "concept-id" : "YSt4_bAa_ccs",
    "matched-string" : "Karlskrona",
    "annotation-id" : 13
  } ],
  "text" : "Badvakt till Karlskrona Simsällskap\nOm tjänsten\nHos oss får du möjlighet att arbeta i ett glatt arbetslag där vi jobbar med att erbjuda våra besökare en god personlig service. Vi erbjuder våra gäster ett säkert och tryggt besök i simhallen. Tjänsten innebär att du arbetar i arbetslag med cirkulationstjänstgöring. Tjänstgöringen är schemalagd med arbete morgon, dag, kvällar samt helger.\n \nArbetsbeskrivning\nI arbetsuppgifterna ingår bemanning av anläggning för att se till att trivsel - och säkerhetsregler efterföljs.\nAnställningen innebär att tjänstgöringen är på badhus/utebad.\nDeltidsanställning 80 %.\n \nKvalifikationer/Krav\nKlara kunskapskrav i simning och livräddning motsvarande guldbojen SLS. Simtest görs innan anställning.\nVara 18 år fyllda\nErfarenhet av serviceyrke\nVana av samarbete i grupp/arbetslag\nGod kunskap i svenska språket\n \nMeriterande \nErfarenhet från arbete vid badanläggning – poollivräddare, badvakt\n \nÖvrigt \nUtdrag ut belastningsregistret ska lämnas in. Vi lägger stor vikt vid personliga egenskaper.\n \nKarlskrona simsällskaps är en ideell förening som bedriver idrottsverksamhet, med simkonsten som grund inom simsport och triathlon. Härutöver håller Simsällskapet simskola och badvaktsverksamhet. Verksamheten genomförs på årlig basis och kan i stort delas in i en vår-, en sommar- och en hösttermin. \nVerksamhetsplatserna är Karlskrona Simhall, inom- och utomhus bassängerna i Rödeby, kommunens badplatser samt i kommunens idrottshallar. Det sistnämnd avsett för träningsgruppernas landträning.\n \nMerparten av Simsällskapets ledare är ideella eller arvoderade. Ett mindre antal är del- eller heltidsanställda. All verksamhet leds av en klubbchef.\n \nSimsällskapet bildades 25 augusti 1900 och har en välrenommerad och lyckosam historia innefattande betydande simidrottsliga framgångar vid olympiska spel, världs-, europiska-, nordiska och svenska mästerskap. Insatserna som sim utbildande föreningen är också framgångsrika. Simsällskapet är sedan decennier kommunens största simskoleleverantör.\nSedan invigningen av Karlskrona Simhall 1995 har sällskapet ansvaret att hålla badvaktsverksamheten i Karlskrona simhall och Rödeby inom- och utomhus bassänger. Badvaktsverksamhet sker såväl på dagtid som kvällstid samt vardag som helgdag.\n \nFör att kunna ge sällskapets medlemmar och simidrottsutövare service och stöd finns en kanslifunktion, vid Nya Skeppsbrogatan 7-9\n \nÖppen för alla\nVi fokuserar på din kompetens, inte dina övriga förutsättningar. Vi är öppna för att anpassa rollen eller arbetsplatsen efter dina behov."
}