{
  "meta" : {
    "description" : "",
    "name" : "101 Adobe Photoshop",
    "modulens id" : "22702",
    "type" : "AUB",
    "utbildningsid" : "122408"
  },
  "sha1" : "9e8ec11ead1c2a61a9f134b630cce3423e1da123",
  "annotations" : [ {
    "preferred-label" : "2D-grafik-Adobe Photoshop",
    "type" : "skill",
    "start-position" : 541,
    "end-position" : 556,
    "concept-id" : "xNyv_PTi_fSa",
    "matched-string" : "Adobe Photoshop",
    "annotation-id" : 1
  }, {
    "preferred-label" : "Layout-Adobe InDesign",
    "type" : "skill",
    "start-position" : 558,
    "end-position" : 572,
    "concept-id" : "Y2t4_aS8_tGo",
    "matched-string" : "Adobe InDesign",
    "annotation-id" : 2
  }, {
    "preferred-label" : "2D-grafik-Adobe Illustrator",
    "type" : "skill",
    "start-position" : 578,
    "end-position" : 595,
    "concept-id" : "FKub_QFH_Btk",
    "matched-string" : "Adobe Illustrator",
    "annotation-id" : 3
  } ],
  "text" : "\"Kunskaper i bild- och videoredigering är ofta en förutsättning för flera arbetssökande inom Kultur och mediaområdet för att kunna vara attraktiv på arbetsmarknaden idag. Adobes program är användbara arbetsverktyg för alla som arbetar med bildproduktion. Målet för utbildningen är att deltagarna ska få marknadsmässiga och tillämpliga kunskaper inom bildproduktion. Genom att behärska programmen\nges du även förutsättningar att skapa en digital portfolios för marknadsföring av din kompetens.\n\nUtbildningen är tre veckor lång och innehåller Adobe Photoshop, Adobe InDesign samt Adobe Illustrator. Tiden är en vecka per program och består av en kombination av teori samt praktiska övningar.\n\"\n"
}