{
  "meta" : {
    "jobad" : {
      "description" : {
        "requirements" : null,
        "needs" : null,
        "company_information" : null,
        "text_formatted" : "Avdelningen frukt och grönt är en avdelning som ständigt förändras i säsong. Klipp och inspiration är något vi ständigt jobbar med.\n\nTjänsten\n\nVi söker sig som är intresserad av ett arbete i en attraktiv butik, där man arbetar i ett tajt team som har hög arbetsmoral. Avdelningen frukt och grönt är en avdelning som ständigt förändras i säsong. Klipp och inspiration är något vi ständigt jobbar med.\n\nDina arbetsuppgifter kommer att bestå av varupåfyllning, planering och uppföljningar. Tillsammans med dina kollegor kommer du medverka till en trivsam, effektiv och säljande avdelning.\n\nPersonliga egenskaper\n\nDu som söker ska ha ett genuint intresse för butiksarbetet. Du behöver vara en driven person som är intresserad av nya utmaningar där du utvecklar din befintliga kunskap. Vi ser gärna att du är nytänkande och bidrar med positiv energi såväl till kunderna som till dina kollegor. Att ha en flexibel inställning till dina arbetsuppgifter är för dig en självklarhet. För att kunna bidra till en inbjudande avdelning ser vi att du har ett öga för form och färg. Du har god fysik och kan hantera tunga lyft.\n\nKvalifikationer\n\n- Arbetat med frukt och grönt\n- Meriterande med kunskap om AoB samt ICA:s plattform\n- Hög service känsla\n\n\nAnställningsform\n\nTjänsten är på ca 30 timmar/ veckan.\n\nStart vecka 33.\n\nProvanställning tillämpas.\n\nKvällar och helger kan förekomma.\n\nLön enligt handelsavtalet.\n\nIntervjuer sker löpande\n\nRekrytering\n\nMRC Bemanning ansvarar för rekryteringen av denna tjänst.\n\nHar du frågor kring dessa tjänster, mejla Konsultchef på MRC Syd: bokningsansvarig@mrcbemanning.se\n\nObservera att vi inte tar emot några ansökningar via e-post, du ansöker via länken nedan. Då urvalet sker löpande ser vi gärna att du skickar din ansökan snarast.\n\nVi ser fram emot din ansökan!",
        "conditions" : "Deltid\r\nAnställningstid enligt överenskommelse",
        "text" : "Avdelningen frukt och grönt är en avdelning som ständigt förändras i säsong. Klipp och inspiration är något vi ständigt jobbar med.\n\nTjänsten\n\nVi söker sig som är intresserad av ett arbete i en attraktiv butik, där man arbetar i ett tajt team som har hög arbetsmoral. Avdelningen frukt och grönt är en avdelning som ständigt förändras i säsong. Klipp och inspiration är något vi ständigt jobbar med.\n\nDina arbetsuppgifter kommer att bestå av varupåfyllning, planering och uppföljningar. Tillsammans med dina kollegor kommer du medverka till en trivsam, effektiv och säljande avdelning.\n\nPersonliga egenskaper\n\nDu som söker ska ha ett genuint intresse för butiksarbetet. Du behöver vara en driven person som är intresserad av nya utmaningar där du utvecklar din befintliga kunskap. Vi ser gärna att du är nytänkande och bidrar med positiv energi såväl till kunderna som till dina kollegor. Att ha en flexibel inställning till dina arbetsuppgifter är för dig en självklarhet. För att kunna bidra till en inbjudande avdelning ser vi att du har ett öga för form och färg. Du har god fysik och kan hantera tunga lyft.\n\nKvalifikationer\n\n- Arbetat med frukt och grönt\n- Meriterande med kunskap om AoB samt ICA:s plattform\n- Hög service känsla\n\n\nAnställningsform\n\nTjänsten är på ca 30 timmar/ veckan.\n\nStart vecka 33.\n\nProvanställning tillämpas.\n\nKvällar och helger kan förekomma.\n\nLön enligt handelsavtalet.\n\nIntervjuer sker löpande\n\nRekrytering\n\nMRC Bemanning ansvarar för rekryteringen av denna tjänst.\n\nHar du frågor kring dessa tjänster, mejla Konsultchef på MRC Syd: bokningsansvarig@mrcbemanning.se\n\nObservera att vi inte tar emot några ansökningar via e-post, du ansöker via länken nedan. Då urvalet sker löpande ser vi gärna att du skickar din ansökan snarast.\n\nVi ser fram emot din ansökan!"
      },
      "headline" : "Frukt och grön medarbetare söker till Ica Clemenstorget i Lund",
      "driving_license" : null,
      "employer" : {
        "email" : null,
        "phone_number" : null,
        "organization_number" : "5566471412",
        "name" : "Mrc Stockholm AB",
        "url" : "https://mrcbemanning.se/",
        "workplace" : "MRC Bemanning AB"
      },
      "removed_date" : null,
      "logo_url" : "https://www.arbetsformedlingen.se/rest/arbetsgivare/rest/af/v3/organisation/5566471412/logotyper/logo.png",
      "last_publication_date" : "2023-01-01T23:59:59",
      "number_of_vacancies" : 1,
      "occupation" : {
        "concept_id" : "pBhS_6fg_727",
        "label" : "Butikssäljare/Medarbetare, dagligvaror",
        "legacy_ams_taxonomy_id" : "2284"
      },
      "occupation_group" : {
        "concept_id" : "s1Qk_o98_2o1",
        "label" : "Butikssäljare, dagligvaror",
        "legacy_ams_taxonomy_id" : "5222"
      },
      "employment_type" : {
        "concept_id" : "PFZr_Syz_cUq",
        "label" : "Vanlig anställning",
        "legacy_ams_taxonomy_id" : "1"
      },
      "webpage_url" : "https://arbetsformedlingen.se/platsbanken/annonser/26331854",
      "driving_license_required" : false,
      "application_contacts" : [ {
        "description" : "Rekryteringsansvarig",
        "email" : "bokningsansvarig@mrcbemanning.se",
        "telephone" : "0720190720",
        "name" : null,
        "contact_type" : null
      } ],
      "duration" : {
        "concept_id" : "qQUd_4qe_NDT",
        "label" : "6 månader eller längre",
        "legacy_ams_taxonomy_id" : "2"
      },
      "nice_to_have" : {
        "education_level" : [ ],
        "work_experiences" : [ ],
        "skills" : [ ],
        "education" : [ ],
        "languages" : [ ]
      },
      "application_details" : {
        "via_af" : false,
        "email" : null,
        "other" : null,
        "reference" : null,
        "url" : "https://jobb.mrcbemanning.se/jobs/1701089-frukt-och-gron-medarbetare-soker-till-ica-clemenstorget-i-lund?promotion=389830-arbetsformedlingen",
        "information" : null
      },
      "source_type" : "VIA_PLATSBANKEN_DXA",
      "application_deadline" : "2023-01-01T23:59:59",
      "external_id" : "46-556647-1412-1701089-43",
      "workplace_address" : {
        "coordinates" : [ 13.191008, 55.70466 ],
        "city" : null,
        "postcode" : null,
        "municipality" : "Lund",
        "region_concept_id" : "CaRE_1nn_cSU",
        "region" : "Skåne län",
        "country_code" : "199",
        "region_code" : "12",
        "municipality_concept_id" : "muSY_tsR_vDZ",
        "country_concept_id" : "i46j_HmG_v64",
        "municipality_code" : "1281",
        "street_address" : null,
        "country" : "Sverige"
      },
      "id" : "26331854",
      "experience_required" : true,
      "working_hours_type" : {
        "concept_id" : "947z_JGS_Uk2",
        "label" : "Deltid",
        "legacy_ams_taxonomy_id" : "2"
      },
      "access" : null,
      "timestamp" : 1657889689294,
      "must_have" : {
        "education_level" : [ ],
        "work_experiences" : [ {
          "concept_id" : "pBhS_6fg_727",
          "weight" : 10,
          "label" : "Butikssäljare, dagligvaror/Medarbetare, dagligvaror",
          "legacy_ams_taxonomy_id" : "2284"
        } ],
        "skills" : [ ],
        "education" : [ ],
        "languages" : [ ]
      },
      "occupation_field" : {
        "concept_id" : "RPTn_bxG_ExZ",
        "label" : "Försäljning, inköp, marknadsföring",
        "legacy_ams_taxonomy_id" : "5"
      },
      "scope_of_work" : {
        "min" : 0,
        "max" : 100
      },
      "salary_type" : {
        "concept_id" : "oG8G_9cW_nRf",
        "label" : "Fast månads- vecko- eller timlön",
        "legacy_ams_taxonomy_id" : "1"
      },
      "removed" : false,
      "salary_description" : "Lön enligt överenskommelse",
      "access_to_own_car" : false,
      "publication_date" : "2022-07-15T14:54:49"
    },
    "name" : "Frukt och grön medarbetare söker till Ica Clemenstorget i Lund",
    "user" : "hannes"
  },
  "sha1" : "eca679fd762edead1f232768f5874dc8c4958391",
  "annotations" : [ {
    "preferred-label" : "frukt och grönsaker",
    "type" : "esco-skill",
    "start-position" : 0,
    "end-position" : 14,
    "concept-id" : "YjVy_ppp_T1c",
    "matched-string" : "Frukt och grön",
    "annotation-id" : 5
  }, {
    "preferred-label" : "Lund",
    "type" : "municipality",
    "start-position" : 58,
    "end-position" : 62,
    "concept-id" : "muSY_tsR_vDZ",
    "matched-string" : "Lund",
    "annotation-id" : 4
  }, {
    "preferred-label" : "frukt och grönsaker",
    "type" : "esco-skill",
    "start-position" : 75,
    "end-position" : 90,
    "concept-id" : "YjVy_ppp_T1c",
    "matched-string" : "frukt och grönt",
    "annotation-id" : 6
  }, {
    "preferred-label" : "Butik",
    "sentiment" : "MUST_HAVE",
    "type" : "keyword",
    "start-position" : 267,
    "end-position" : 272,
    "concept-id" : "xLsd_zjY_5wr",
    "matched-string" : "butik",
    "annotation-id" : 0
  }, {
    "preferred-label" : "frukt och grönsaker",
    "type" : "esco-skill",
    "start-position" : 343,
    "end-position" : 358,
    "concept-id" : "YjVy_ppp_T1c",
    "matched-string" : "frukt och grönt",
    "annotation-id" : 7
  }, {
    "preferred-label" : "Färg/Kemikalieprodukter/Tapeter",
    "sentiment" : "MUST_HAVE",
    "type" : "skill",
    "start-position" : 1125,
    "end-position" : 1129,
    "concept-id" : "fyJi_1k3_CdV",
    "matched-string" : "färg",
    "annotation-id" : 1
  }, {
    "preferred-label" : "God fysik (tunga lyft)",
    "type" : "skill",
    "start-position" : 1138,
    "end-position" : 1147,
    "concept-id" : "rwir_xvu_443",
    "matched-string" : "god fysik",
    "annotation-id" : 8
  }, {
    "preferred-label" : "frukt och grönsaker",
    "type" : "esco-skill",
    "start-position" : 1208,
    "end-position" : 1223,
    "concept-id" : "YjVy_ppp_T1c",
    "matched-string" : "frukt och grönt",
    "annotation-id" : 9
  }, {
    "preferred-label" : "Heltid",
    "type" : "worktime-extent",
    "start-position" : 1337,
    "end-position" : 1354,
    "concept-id" : "6YE1_gAC_R2G",
    "matched-string" : "30 timmar/ veckan",
    "annotation-id" : 10
  } ],
  "text" : "Frukt och grön medarbetare söker till Ica Clemenstorget i Lund\nAvdelningen frukt och grönt är en avdelning som ständigt förändras i säsong. Klipp och inspiration är något vi ständigt jobbar med.\n\nTjänsten\n\nVi söker sig som är intresserad av ett arbete i en attraktiv butik, där man arbetar i ett tajt team som har hög arbetsmoral. Avdelningen frukt och grönt är en avdelning som ständigt förändras i säsong. Klipp och inspiration är något vi ständigt jobbar med.\n\nDina arbetsuppgifter kommer att bestå av varupåfyllning, planering och uppföljningar. Tillsammans med dina kollegor kommer du medverka till en trivsam, effektiv och säljande avdelning.\n\nPersonliga egenskaper\n\nDu som söker ska ha ett genuint intresse för butiksarbetet. Du behöver vara en driven person som är intresserad av nya utmaningar där du utvecklar din befintliga kunskap. Vi ser gärna att du är nytänkande och bidrar med positiv energi såväl till kunderna som till dina kollegor. Att ha en flexibel inställning till dina arbetsuppgifter är för dig en självklarhet. För att kunna bidra till en inbjudande avdelning ser vi att du har ett öga för form och färg. Du har god fysik och kan hantera tunga lyft.\n\nKvalifikationer\n\n- Arbetat med frukt och grönt\n- Meriterande med kunskap om AoB samt ICA:s plattform\n- Hög service känsla\n\n\nAnställningsform\n\nTjänsten är på ca 30 timmar/ veckan.\n\nStart vecka 33.\n\nProvanställning tillämpas.\n\nKvällar och helger kan förekomma.\n\nLön enligt handelsavtalet.\n\nIntervjuer sker löpande\n\nRekrytering\n\nMRC Bemanning ansvarar för rekryteringen av denna tjänst.\n\nHar du frågor kring dessa tjänster, mejla Konsultchef på MRC Syd: bokningsansvarig@mrcbemanning.se\n\nObservera att vi inte tar emot några ansökningar via e-post, du ansöker via länken nedan. Då urvalet sker löpande ser vi gärna att du skickar din ansökan snarast.\n\nVi ser fram emot din ansökan!"
}