{
  "meta" : {
    "jobad" : {
      "description" : {
        "requirements" : null,
        "needs" : null,
        "company_information" : null,
        "text_formatted" : "Söker du ett spännande och praktiskt arbete? Gillar du varierande dagar med teamarbete och mycket kundkontakt? Då ska du söka jobbet som bilglastekniker hos Ryds Bilglas i Nässjö!\n\nRyds Bilglas har funnits i fordonsbranschen sedan 1947 och finns idag i Sverige, Storbritannien, Norge, Danmark och Spanien. Med sin specialkompetens och goda service utför de miljontals reparationer. \n\nVårt kundföretag söker nu ett nytt tillskott till deras team i Nässjö. Som bilglastekniker har du en viktig roll hos Ryds Bilglas. Förutom att ta emot kunder och ge service i världsklass kommer arbetsdagarna att innebära:\n\n• Byte av bilglas\n• Reparation av stenskott\n• Kalibrering av vindrutor\n• Beställa glas och tillbehör\n• Ta emot glas-leveranser\n• Utföra underhåll av utrustning\n\nAtt jobba med kundmottagning betyder också att det blir visst administrativt arbete, som till exempel att registrera skadeärenden hos försäkringsbolag.\n\nDetta är en direktrekrytering men vi på StudentConsulting ansvarar för rekryteringsprocessen. Tjänsten är på heltid och arbetstiderna är förlagda dagtid, måndag-fredag.\r\n\r\nDin profil\nVi söker sig som har 2–3 års arbetslivserfarenhet av fordonsbranschen exempelvis som bilmekaniker, billackerare eller bilplåtsslagare. För att vara aktuell för tjänsten krävs det att du har ett B-körkort för manuell bil och att du kan prata och skriva obehindrat på svenska. Du behöver även vara fysisk uthållig samt att du har erfarenhet av att skruva med bilar eller andra fordon sedan tidigare.\n\nDet är viktigt att du är serviceinriktad, noggrann, positiv samt att du har datorvana. Du är Ryds Bilglas ambassadör utåt och målsättningen är att alltid se till kundens bästa och att hålla en god servicenivå. Du är en problemlösare som ser till att kunderna är glada och nöjda när de lämnar verkstaden samtidigt som du bidrar med en god stämning bland kollegorna.\n\nLåter detta intressant? Sök tjänsten redan idag då urval och intervjuer sker löpande.\n\nOm företaget\nMångfaldigt prisbelönta StudentConsulting är ett av Skandinaviens största och ledande rekryterings- och bemanningsföretag med fokus på studenter, akademiker och yrkesutbildade. Tack vare ett stort nätverk och lång erfarenhet har vi rekryterat över 11 000 personer det senaste året. Vi erbjuder intressanta och utmanande tjänster på både hel- och deltid inom områden som IT, teknik, ekonomi, administration, HR, marknadsföring, kundtjänst, försäljning, industri, produktion, logistik och transport. Hitta din framtid på www.studentconsulting.se",
        "conditions" : "Visstidsanställning\r\n6 mån eller längre",
        "text" : "Söker du ett spännande och praktiskt arbete? Gillar du varierande dagar med teamarbete och mycket kundkontakt? Då ska du söka jobbet som bilglastekniker hos Ryds Bilglas i Nässjö!\n\nRyds Bilglas har funnits i fordonsbranschen sedan 1947 och finns idag i Sverige, Storbritannien, Norge, Danmark och Spanien. Med sin specialkompetens och goda service utför de miljontals reparationer. \n\nVårt kundföretag söker nu ett nytt tillskott till deras team i Nässjö. Som bilglastekniker har du en viktig roll hos Ryds Bilglas. Förutom att ta emot kunder och ge service i världsklass kommer arbetsdagarna att innebära:\n\n• Byte av bilglas\n• Reparation av stenskott\n• Kalibrering av vindrutor\n• Beställa glas och tillbehör\n• Ta emot glas-leveranser\n• Utföra underhåll av utrustning\n\nAtt jobba med kundmottagning betyder också att det blir visst administrativt arbete, som till exempel att registrera skadeärenden hos försäkringsbolag.\n\nDetta är en direktrekrytering men vi på StudentConsulting ansvarar för rekryteringsprocessen. Tjänsten är på heltid och arbetstiderna är förlagda dagtid, måndag-fredag.\r\n\r\nDin profil\nVi söker sig som har 2–3 års arbetslivserfarenhet av fordonsbranschen exempelvis som bilmekaniker, billackerare eller bilplåtsslagare. För att vara aktuell för tjänsten krävs det att du har ett B-körkort för manuell bil och att du kan prata och skriva obehindrat på svenska. Du behöver även vara fysisk uthållig samt att du har erfarenhet av att skruva med bilar eller andra fordon sedan tidigare.\n\nDet är viktigt att du är serviceinriktad, noggrann, positiv samt att du har datorvana. Du är Ryds Bilglas ambassadör utåt och målsättningen är att alltid se till kundens bästa och att hålla en god servicenivå. Du är en problemlösare som ser till att kunderna är glada och nöjda när de lämnar verkstaden samtidigt som du bidrar med en god stämning bland kollegorna.\n\nLåter detta intressant? Sök tjänsten redan idag då urval och intervjuer sker löpande.\n\nOm företaget\nMångfaldigt prisbelönta StudentConsulting är ett av Skandinaviens största och ledande rekryterings- och bemanningsföretag med fokus på studenter, akademiker och yrkesutbildade. Tack vare ett stort nätverk och lång erfarenhet har vi rekryterat över 11 000 personer det senaste året. Vi erbjuder intressanta och utmanande tjänster på både hel- och deltid inom områden som IT, teknik, ekonomi, administration, HR, marknadsföring, kundtjänst, försäljning, industri, produktion, logistik och transport. Hitta din framtid på www.studentconsulting.se"
      },
      "headline" : "Bilglastekniker sökes till Ryds Bilglas i Nässjö!",
      "driving_license" : [ {
        "concept_id" : "VTK8_WRx_GcM",
        "label" : "B",
        "legacy_ams_taxonomy_id" : "3"
      } ],
      "employer" : {
        "email" : null,
        "phone_number" : null,
        "organization_number" : "5566747449",
        "name" : "Studentconsulting Sweden AB (Publ)",
        "url" : "www.studentconsulting.com",
        "workplace" : "StudentConsulting"
      },
      "removed_date" : null,
      "logo_url" : "https://www.arbetsformedlingen.se/rest/arbetsgivare/rest/af/v3/organisation/5566747449/logotyper/logo.png",
      "last_publication_date" : "2022-08-22T23:59:59",
      "number_of_vacancies" : 1,
      "occupation" : {
        "concept_id" : "MJvj_tVV_zpZ",
        "label" : "Glastekniker/Glasmästare",
        "legacy_ams_taxonomy_id" : "5878"
      },
      "occupation_group" : {
        "concept_id" : "J17g_Q2a_2u1",
        "label" : "Glastekniker",
        "legacy_ams_taxonomy_id" : "7124"
      },
      "employment_type" : {
        "concept_id" : "PFZr_Syz_cUq",
        "label" : "Vanlig anställning",
        "legacy_ams_taxonomy_id" : "1"
      },
      "webpage_url" : "https://arbetsformedlingen.se/platsbanken/annonser/26380658",
      "driving_license_required" : true,
      "application_contacts" : [ {
        "description" : "Team Jönköping",
        "email" : "jonkoping@studentconsulting.com",
        "telephone" : null,
        "name" : null,
        "contact_type" : null
      } ],
      "duration" : {
        "concept_id" : "qQUd_4qe_NDT",
        "label" : "6 månader eller längre",
        "legacy_ams_taxonomy_id" : "2"
      },
      "nice_to_have" : {
        "education_level" : [ ],
        "work_experiences" : [ ],
        "skills" : [ ],
        "education" : [ ],
        "languages" : [ ]
      },
      "application_details" : {
        "via_af" : false,
        "email" : null,
        "other" : null,
        "reference" : null,
        "url" : "http://www.studentconsulting.com/sv/jobs/jonkoping/bilglastekniker-sokes-till-ryds-bilglas-i-nassjo/65647/?utm_source=af&utm_medium=sharedjob&utm_content=job65647",
        "information" : null
      },
      "source_type" : "VIA_PLATSBANKEN_DXA",
      "application_deadline" : "2022-08-22T23:59:59",
      "external_id" : "46-556674-7449-65647",
      "workplace_address" : {
        "coordinates" : [ 14.161788, 57.78261 ],
        "city" : null,
        "postcode" : null,
        "municipality" : "Jönköping",
        "region_concept_id" : "MtbE_xWT_eMi",
        "region" : "Jönköpings län",
        "country_code" : "199",
        "region_code" : "06",
        "municipality_concept_id" : "KURg_KJF_Lwc",
        "country_concept_id" : "i46j_HmG_v64",
        "municipality_code" : "0680",
        "street_address" : null,
        "country" : "Sverige"
      },
      "id" : "26380658",
      "experience_required" : true,
      "working_hours_type" : {
        "concept_id" : "6YE1_gAC_R2G",
        "label" : "Heltid",
        "legacy_ams_taxonomy_id" : "1"
      },
      "access" : null,
      "timestamp" : 1659693607341,
      "must_have" : {
        "education_level" : [ ],
        "work_experiences" : [ {
          "concept_id" : "MJvj_tVV_zpZ",
          "weight" : 10,
          "label" : "Glastekniker/Glasmästare",
          "legacy_ams_taxonomy_id" : "5878"
        } ],
        "skills" : [ ],
        "education" : [ ],
        "languages" : [ ]
      },
      "occupation_field" : {
        "concept_id" : "PaxQ_o1G_wWH",
        "label" : "Hantverk",
        "legacy_ams_taxonomy_id" : "6"
      },
      "scope_of_work" : {
        "min" : 100,
        "max" : 100
      },
      "salary_type" : {
        "concept_id" : "oG8G_9cW_nRf",
        "label" : "Fast månads- vecko- eller timlön",
        "legacy_ams_taxonomy_id" : "1"
      },
      "removed" : false,
      "salary_description" : "Fast lön",
      "access_to_own_car" : false,
      "publication_date" : "2022-08-05T12:00:07"
    },
    "name" : "Bilglastekniker sökes till Ryds Bilglas i Nässjö!",
    "user" : "hannes"
  },
  "sha1" : "54f53cbce13e9b0547cb53c393a7e32f8ebaa118",
  "annotations" : [ {
    "preferred-label" : "Bilglastekniker",
    "sentiment" : "MUST_HAVE",
    "type" : "keyword",
    "start-position" : 0,
    "end-position" : 15,
    "concept-id" : "nTHT_bze_3Wg",
    "matched-string" : "bilglastekniker",
    "annotation-id" : 0
  }, {
    "preferred-label" : "Nässjö",
    "type" : "municipality",
    "start-position" : 42,
    "end-position" : 48,
    "concept-id" : "KfXT_ySA_do2",
    "matched-string" : "Nässjö",
    "annotation-id" : 13
  }, {
    "preferred-label" : "Bilglastekniker",
    "sentiment" : "MUST_HAVE",
    "type" : "keyword",
    "start-position" : 187,
    "end-position" : 202,
    "concept-id" : "nTHT_bze_3Wg",
    "matched-string" : "bilglastekniker",
    "annotation-id" : 1
  }, {
    "preferred-label" : "Nässjö",
    "type" : "municipality",
    "start-position" : 222,
    "end-position" : 228,
    "concept-id" : "KfXT_ySA_do2",
    "matched-string" : "Nässjö",
    "annotation-id" : 14
  }, {
    "preferred-label" : "Nässjö",
    "type" : "municipality",
    "start-position" : 497,
    "end-position" : 503,
    "concept-id" : "KfXT_ySA_do2",
    "matched-string" : "Nässjö",
    "annotation-id" : 15
  }, {
    "preferred-label" : "Bilglastekniker",
    "sentiment" : "MUST_HAVE",
    "type" : "keyword",
    "start-position" : 509,
    "end-position" : 524,
    "concept-id" : "nTHT_bze_3Wg",
    "matched-string" : "bilglastekniker",
    "annotation-id" : 2
  }, {
    "preferred-label" : "Kalibrering",
    "sentiment" : "MUST_HAVE",
    "type" : "skill",
    "start-position" : 703,
    "end-position" : 714,
    "concept-id" : "1BKz_4at_cuy",
    "matched-string" : "kalibrering",
    "annotation-id" : 3
  }, {
    "preferred-label" : "Heltid",
    "type" : "worktime-extent",
    "start-position" : 1080,
    "end-position" : 1086,
    "concept-id" : "6YE1_gAC_R2G",
    "matched-string" : "heltid",
    "annotation-id" : 16
  }, {
    "preferred-label" : "2-4 års erfarenhet",
    "type" : "occupation-experience-year",
    "start-position" : 1175,
    "end-position" : 1203,
    "concept-id" : "RWA2_uu6_udD",
    "matched-string" : "2–3 års arbetslivserfarenhet",
    "annotation-id" : 17
  }, {
    "preferred-label" : "Fordonstekniker/Bilmekaniker/Personbilsmekaniker",
    "sentiment" : "MUST_HAVE",
    "type" : "occupation-name",
    "start-position" : 1239,
    "end-position" : 1251,
    "concept-id" : "bLKd_4Wg_3rn",
    "matched-string" : "bilmekaniker",
    "annotation-id" : 4
  }, {
    "preferred-label" : "Billackerare",
    "sentiment" : "MUST_HAVE",
    "type" : "keyword",
    "start-position" : 1253,
    "end-position" : 1265,
    "concept-id" : "kbSy_Xbm_XE3",
    "matched-string" : "billackerare",
    "annotation-id" : 5
  }, {
    "preferred-label" : "Bilplåtslagare/Bilskade- och karosserireparatör",
    "type" : "occupation-name",
    "start-position" : 1272,
    "end-position" : 1287,
    "concept-id" : "gqQC_PXg_gkU",
    "matched-string" : "bilplåtsslagare",
    "annotation-id" : 18
  }, {
    "preferred-label" : "B",
    "type" : "driving-licence",
    "start-position" : 1348,
    "end-position" : 1357,
    "concept-id" : "VTK8_WRx_GcM",
    "matched-string" : "B-körkort",
    "annotation-id" : 19
  }, {
    "preferred-label" : "Svenska",
    "sentiment" : "MUST_HAVE",
    "type" : "language",
    "start-position" : 1420,
    "end-position" : 1427,
    "concept-id" : "zSLA_vw2_FXN",
    "matched-string" : "svenska",
    "annotation-id" : 6
  }, {
    "preferred-label" : "noggrannhet",
    "type" : "esco-skill",
    "start-position" : 1595,
    "end-position" : 1603,
    "concept-id" : "mrsW_EkL_KRD",
    "matched-string" : "noggrann",
    "annotation-id" : 20
  }, {
    "preferred-label" : "Heltid/Deltid",
    "type" : "worktime-extent",
    "start-position" : 2356,
    "end-position" : 2371,
    "concept-id" : "hGCt_6Ni_XPz",
    "matched-string" : "hel- och deltid",
    "annotation-id" : 21
  }, {
    "preferred-label" : "Data/IT",
    "sentiment" : "MUST_HAVE",
    "type" : "occupation-field",
    "start-position" : 2389,
    "end-position" : 2391,
    "concept-id" : "apaJ_2ja_LuF",
    "matched-string" : "it",
    "annotation-id" : 8
  }, {
    "preferred-label" : "Ekonomi",
    "sentiment" : "MUST_HAVE",
    "type" : "keyword",
    "start-position" : 2401,
    "end-position" : 2408,
    "concept-id" : "PW4f_bmT_new",
    "matched-string" : "ekonomi",
    "annotation-id" : 9
  }, {
    "preferred-label" : "sköta administration",
    "type" : "esco-skill",
    "start-position" : 2410,
    "end-position" : 2424,
    "concept-id" : "NEWh_NMX_RCZ",
    "matched-string" : "administration",
    "annotation-id" : 23
  }, {
    "preferred-label" : "HR",
    "type" : "keyword",
    "start-position" : 2426,
    "end-position" : 2428,
    "concept-id" : "YxV3_BQC_eMP",
    "matched-string" : "HR",
    "annotation-id" : 22
  }, {
    "preferred-label" : "marknadsföring",
    "type" : "esco-skill",
    "start-position" : 2430,
    "end-position" : 2444,
    "concept-id" : "UXRx_guv_ZGc",
    "matched-string" : "marknadsföring",
    "annotation-id" : 24
  }, {
    "preferred-label" : "Kundtjänst",
    "sentiment" : "MUST_HAVE",
    "type" : "skill",
    "start-position" : 2446,
    "end-position" : 2456,
    "concept-id" : "aMyW_hB7_TpU",
    "matched-string" : "kundtjänst",
    "annotation-id" : 11
  }, {
    "preferred-label" : "Försäljning, inköp, marknadsföring",
    "type" : "occupation-field",
    "start-position" : 2458,
    "end-position" : 2469,
    "concept-id" : "RPTn_bxG_ExZ",
    "matched-string" : "försäljning",
    "annotation-id" : 25
  }, {
    "preferred-label" : "Logistik",
    "sentiment" : "MUST_HAVE",
    "type" : "skill",
    "start-position" : 2493,
    "end-position" : 2501,
    "concept-id" : "yXmf_iKi_7ci",
    "matched-string" : "logistik",
    "annotation-id" : 12
  } ],
  "text" : "Bilglastekniker sökes till Ryds Bilglas i Nässjö!\nSöker du ett spännande och praktiskt arbete? Gillar du varierande dagar med teamarbete och mycket kundkontakt? Då ska du söka jobbet som bilglastekniker hos Ryds Bilglas i Nässjö!\n\nRyds Bilglas har funnits i fordonsbranschen sedan 1947 och finns idag i Sverige, Storbritannien, Norge, Danmark och Spanien. Med sin specialkompetens och goda service utför de miljontals reparationer. \n\nVårt kundföretag söker nu ett nytt tillskott till deras team i Nässjö. Som bilglastekniker har du en viktig roll hos Ryds Bilglas. Förutom att ta emot kunder och ge service i världsklass kommer arbetsdagarna att innebära:\n\n• Byte av bilglas\n• Reparation av stenskott\n• Kalibrering av vindrutor\n• Beställa glas och tillbehör\n• Ta emot glas-leveranser\n• Utföra underhåll av utrustning\n\nAtt jobba med kundmottagning betyder också att det blir visst administrativt arbete, som till exempel att registrera skadeärenden hos försäkringsbolag.\n\nDetta är en direktrekrytering men vi på StudentConsulting ansvarar för rekryteringsprocessen. Tjänsten är på heltid och arbetstiderna är förlagda dagtid, måndag-fredag.\r\n\r\nDin profil\nVi söker sig som har 2–3 års arbetslivserfarenhet av fordonsbranschen exempelvis som bilmekaniker, billackerare eller bilplåtsslagare. För att vara aktuell för tjänsten krävs det att du har ett B-körkort för manuell bil och att du kan prata och skriva obehindrat på svenska. Du behöver även vara fysisk uthållig samt att du har erfarenhet av att skruva med bilar eller andra fordon sedan tidigare.\n\nDet är viktigt att du är serviceinriktad, noggrann, positiv samt att du har datorvana. Du är Ryds Bilglas ambassadör utåt och målsättningen är att alltid se till kundens bästa och att hålla en god servicenivå. Du är en problemlösare som ser till att kunderna är glada och nöjda när de lämnar verkstaden samtidigt som du bidrar med en god stämning bland kollegorna.\n\nLåter detta intressant? Sök tjänsten redan idag då urval och intervjuer sker löpande.\n\nOm företaget\nMångfaldigt prisbelönta StudentConsulting är ett av Skandinaviens största och ledande rekryterings- och bemanningsföretag med fokus på studenter, akademiker och yrkesutbildade. Tack vare ett stort nätverk och lång erfarenhet har vi rekryterat över 11 000 personer det senaste året. Vi erbjuder intressanta och utmanande tjänster på både hel- och deltid inom områden som IT, teknik, ekonomi, administration, HR, marknadsföring, kundtjänst, försäljning, industri, produktion, logistik och transport. Hitta din framtid på www.studentconsulting.se"
}