{
  "meta" : {
    "jobad" : {
      "description" : {
        "requirements" : null,
        "needs" : null,
        "company_information" : null,
        "text_formatted" : "Scandic Talk är beläget vägg i vägg med Stockholmsmässan, ett stenkast från pendeltågsstationen. Hos oss är ingen dag den andra lik – mässor, events och internationella kongresser skapar en dynamisk och spännande atmosfär. Trots att hotellet reser sig hela 19 våningar över marken är känslan på hotellet familjär. Vi är en liten organisation som präglas av trivsel, personlig utveckling och en stor gemenskap med alla som arbetar på hotellet. Vi lyssnar på våra gäster och älskar att leverera god service – allt för att kunna erbjuda den allra bästa hotellupplevelsen. Delar du vår passion för gemenskap och service? Då är du den vi söker!\n\nNu söker vi en Service Host (Receptionist) till hotellet Scandic Talk.\n\nOavsett varför gästen kommer till oss är det få saker som är så uppskattade som ett vänligt ansikte som hälsar välkommen. Som Service Host agerar du värd tillsammans med övriga teamet på hotellet och skapar en gästupplevelse i världsklass.\n\nI rollen som Service Host arbetar du inom ett eller flera ansvarsområden som alla bidrar till gästens helhetsupplevelse. Under din tid hos oss kan dessa områden variera i takt med att du och affären utvecklas. Hos oss får du ta ett stort eget ansvar för att ta de beslut som krävs för att göra gästen nöjd och teamen utvecklar och förbättrar arbetssätt och service i takt med att omvärlden förändras. Vi är nämligen övertygade om att det är när du får utvecklas och bidra med all din kompetens och erfarenhet som vi överträffar gästens förväntningar. På köpet får vi kul på jobbet!\n\nSå ta med dig dina erfarenheter, ditt engagemang och ditt sätt att tänka till oss – och bidra till en kultur där vi bryr oss på riktigt: om varandra, våra gäster och vår planet. Välkommen till Scandic! \n\nVad är innebär rollen som Service Host?\n\nDu som arbetar inom ansvarsområdet Front of House är ansvarig för att våra gäster får service i världsklass. Du är spindeln i nätet som ser till att gästen alltid är i fokus. Du är den som går igenom ankomstlistan och lägger tid på detaljerna. Ser till att gästens önskemål uppfylls. Du har alltid ett leende på läpparna och en kreativ lösning i backfikan. Du löser det mesta och är en stjärna på att vända en missnöjd gäst till en nöjd gäst. Din arbetsplats är vår lobby. För det är där du möter flest gäster. I ansvarsområdet ingår även administrativt arbete, säkerhetsarbete och arbete med försäljning. \n\nArbetet i Front of House innebär att checka in och ut hotellets gäster, hälsa välkommen och ge gästen den information den behöver om sin vistelse. Du hanterar bokningar i systemet Scorpio och hanterar administrativa uppgifter runt gäster och säkerhet. Allt arbete sker med gästnöjdhet och försäljning i fokus. \n\nHotellet har öppet dygnet runt och det är därför viktigt att du trivs med att arbeta i skift (förmiddagar, eftermiddagar och helger). \n\nVem är du?\n\nFör att passa i rollen tror vi att du har en väl utvecklad social förmåga och är kapabel att hantera att det händer många olika saker samtidigt. Det är mycket viktigt att du kan förmedla ett gott värdskap till hotellets gäster.\n\nDu har också vana och kunskap i att arbeta med dator som arbetsredskap. \n\nEftersom arbetet till stor del består av att kommunicera med gäster är goda kunskaper i svenska och engelska en förutsättning. Talar du ytterligare ett språk är det meriterande. \n\nAllra viktigast är dock dina personliga egenskaper och din inställning. För att passa i rollen behöver du vara en lyhörd och prestigelös lagspelare som tar ett stort ansvar för dina arbetsuppgifter och helhetsresultatet. \n\nInformation om tjänsten\n\nTjänsten är en tillsvidareanställning på heltid. \n\nVi tar enbart emot ansökningar via vår hemsida. Alla ansökningar kommer att behandlas löpande och tjänsten kan tillsättas innan sista ansökningsdag, varför vi ber dig att ansöka så snart som möjligt. I denna rekrytering använder vi oss av ett enklare test om service vid urvalet.\n\nVi ser fram emot att välkomna dig till oss på Scandic!\r\n\n\nVi når längre när olikheter bejakas. Hos oss får du utrymme att vara dig själv och utvecklas i den riktning du vill, med trygga villkor och schyssta avtal som grund. Ta med dig dina erfarenheter, ditt engagemang och ditt sätt att tänka till oss - bidra till en kultur där vi bryr oss på riktigt: om varandra, våra gäster och vår planet. Välkommen till Scandic.\n\nDelar du våra värderingar?\n\nBE A PRO BE YOU BE CARING BE BOLD",
        "conditions" : "Heltid\r\nTillsvidare",
        "text" : "Scandic Talk är beläget vägg i vägg med Stockholmsmässan, ett stenkast från pendeltågsstationen. Hos oss är ingen dag den andra lik – mässor, events och internationella kongresser skapar en dynamisk och spännande atmosfär. Trots att hotellet reser sig hela 19 våningar över marken är känslan på hotellet familjär. Vi är en liten organisation som präglas av trivsel, personlig utveckling och en stor gemenskap med alla som arbetar på hotellet. Vi lyssnar på våra gäster och älskar att leverera god service – allt för att kunna erbjuda den allra bästa hotellupplevelsen. Delar du vår passion för gemenskap och service? Då är du den vi söker!\n\nNu söker vi en Service Host (Receptionist) till hotellet Scandic Talk.\n\nOavsett varför gästen kommer till oss är det få saker som är så uppskattade som ett vänligt ansikte som hälsar välkommen. Som Service Host agerar du värd tillsammans med övriga teamet på hotellet och skapar en gästupplevelse i världsklass.\n\nI rollen som Service Host arbetar du inom ett eller flera ansvarsområden som alla bidrar till gästens helhetsupplevelse. Under din tid hos oss kan dessa områden variera i takt med att du och affären utvecklas. Hos oss får du ta ett stort eget ansvar för att ta de beslut som krävs för att göra gästen nöjd och teamen utvecklar och förbättrar arbetssätt och service i takt med att omvärlden förändras. Vi är nämligen övertygade om att det är när du får utvecklas och bidra med all din kompetens och erfarenhet som vi överträffar gästens förväntningar. På köpet får vi kul på jobbet!\n\nSå ta med dig dina erfarenheter, ditt engagemang och ditt sätt att tänka till oss – och bidra till en kultur där vi bryr oss på riktigt: om varandra, våra gäster och vår planet. Välkommen till Scandic! \n\nVad är innebär rollen som Service Host?\n\nDu som arbetar inom ansvarsområdet Front of House är ansvarig för att våra gäster får service i världsklass. Du är spindeln i nätet som ser till att gästen alltid är i fokus. Du är den som går igenom ankomstlistan och lägger tid på detaljerna. Ser till att gästens önskemål uppfylls. Du har alltid ett leende på läpparna och en kreativ lösning i backfikan. Du löser det mesta och är en stjärna på att vända en missnöjd gäst till en nöjd gäst. Din arbetsplats är vår lobby. För det är där du möter flest gäster. I ansvarsområdet ingår även administrativt arbete, säkerhetsarbete och arbete med försäljning. \n\nArbetet i Front of House innebär att checka in och ut hotellets gäster, hälsa välkommen och ge gästen den information den behöver om sin vistelse. Du hanterar bokningar i systemet Scorpio och hanterar administrativa uppgifter runt gäster och säkerhet. Allt arbete sker med gästnöjdhet och försäljning i fokus. \n\nHotellet har öppet dygnet runt och det är därför viktigt att du trivs med att arbeta i skift (förmiddagar, eftermiddagar och helger). \n\nVem är du?\n\nFör att passa i rollen tror vi att du har en väl utvecklad social förmåga och är kapabel att hantera att det händer många olika saker samtidigt. Det är mycket viktigt att du kan förmedla ett gott värdskap till hotellets gäster.\n\nDu har också vana och kunskap i att arbeta med dator som arbetsredskap. \n\nEftersom arbetet till stor del består av att kommunicera med gäster är goda kunskaper i svenska och engelska en förutsättning. Talar du ytterligare ett språk är det meriterande. \n\nAllra viktigast är dock dina personliga egenskaper och din inställning. För att passa i rollen behöver du vara en lyhörd och prestigelös lagspelare som tar ett stort ansvar för dina arbetsuppgifter och helhetsresultatet. \n\nInformation om tjänsten\n\nTjänsten är en tillsvidareanställning på heltid. \n\nVi tar enbart emot ansökningar via vår hemsida. Alla ansökningar kommer att behandlas löpande och tjänsten kan tillsättas innan sista ansökningsdag, varför vi ber dig att ansöka så snart som möjligt. I denna rekrytering använder vi oss av ett enklare test om service vid urvalet.\n\nVi ser fram emot att välkomna dig till oss på Scandic!\r\n\n\nVi når längre när olikheter bejakas. Hos oss får du utrymme att vara dig själv och utvecklas i den riktning du vill, med trygga villkor och schyssta avtal som grund. Ta med dig dina erfarenheter, ditt engagemang och ditt sätt att tänka till oss - bidra till en kultur där vi bryr oss på riktigt: om varandra, våra gäster och vår planet. Välkommen till Scandic.\n\nDelar du våra värderingar?\n\nBE A PRO BE YOU BE CARING BE BOLD"
      },
      "headline" : "Service Host, Front of House (Reception/Receptionist), Scandic Talk, heltid",
      "driving_license" : null,
      "employer" : {
        "email" : null,
        "phone_number" : null,
        "organization_number" : "5562991009",
        "name" : "Scandic Hotels AB",
        "url" : "https://www.scandichotels.se/",
        "workplace" : "Scandic Hotels Sverige"
      },
      "removed_date" : null,
      "logo_url" : "https://www.arbetsformedlingen.se/rest/arbetsgivare/rest/af/v3/organisation/5562991009/logotyper/logo.png",
      "last_publication_date" : "2022-08-08T23:59:59",
      "number_of_vacancies" : 1,
      "occupation" : {
        "concept_id" : "3kFW_XLk_v9H",
        "label" : "Hotellreceptionist",
        "legacy_ams_taxonomy_id" : "5596"
      },
      "occupation_group" : {
        "concept_id" : "bYde_Frc_xcB",
        "label" : "Hotellreceptionister m.fl.",
        "legacy_ams_taxonomy_id" : "4224"
      },
      "employment_type" : {
        "concept_id" : "PFZr_Syz_cUq",
        "label" : "Vanlig anställning",
        "legacy_ams_taxonomy_id" : "1"
      },
      "webpage_url" : "https://arbetsformedlingen.se/platsbanken/annonser/26356039",
      "driving_license_required" : false,
      "application_contacts" : [ ],
      "duration" : {
        "concept_id" : "a7uU_j21_mkL",
        "label" : "Tills vidare",
        "legacy_ams_taxonomy_id" : "1"
      },
      "nice_to_have" : {
        "education_level" : [ ],
        "work_experiences" : [ ],
        "skills" : [ ],
        "education" : [ ],
        "languages" : [ ]
      },
      "application_details" : {
        "via_af" : false,
        "email" : null,
        "other" : null,
        "reference" : null,
        "url" : "https://emp.jobylon.com/applications/jobs/142290/create/?utm_source=ams&utm_medium=promotionserializer",
        "information" : null
      },
      "source_type" : "VIA_PLATSBANKEN_DXA",
      "application_deadline" : "2022-08-08T23:59:59",
      "external_id" : "46-556299-1009-142290-72840",
      "workplace_address" : {
        "coordinates" : [ null, null ],
        "city" : null,
        "postcode" : null,
        "municipality" : null,
        "region_concept_id" : null,
        "region" : null,
        "country_code" : "199",
        "region_code" : null,
        "municipality_concept_id" : null,
        "country_concept_id" : "i46j_HmG_v64",
        "municipality_code" : null,
        "street_address" : null,
        "country" : "Sverige"
      },
      "id" : "26356039",
      "experience_required" : true,
      "working_hours_type" : {
        "concept_id" : "6YE1_gAC_R2G",
        "label" : "Heltid",
        "legacy_ams_taxonomy_id" : "1"
      },
      "access" : null,
      "timestamp" : 1658870353624,
      "must_have" : {
        "education_level" : [ ],
        "work_experiences" : [ {
          "concept_id" : "3kFW_XLk_v9H",
          "weight" : 10,
          "label" : "Hotellreceptionist",
          "legacy_ams_taxonomy_id" : "5596"
        } ],
        "skills" : [ ],
        "education" : [ ],
        "languages" : [ ]
      },
      "occupation_field" : {
        "concept_id" : "ScKy_FHB_7wT",
        "label" : "Hotell, restaurang, storhushåll",
        "legacy_ams_taxonomy_id" : "7"
      },
      "scope_of_work" : {
        "min" : 100,
        "max" : 100
      },
      "salary_type" : {
        "concept_id" : "oG8G_9cW_nRf",
        "label" : "Fast månads- vecko- eller timlön",
        "legacy_ams_taxonomy_id" : "1"
      },
      "removed" : false,
      "salary_description" : "Fast månads- vecko- eller timlön",
      "access_to_own_car" : false,
      "publication_date" : "2022-07-26T23:19:13"
    },
    "name" : "Service Host, Front of House (Reception/Receptionist), Scandic Talk, heltid",
    "user" : "hannes"
  },
  "sha1" : "205931072771db2626f10e2207464563f83cba11",
  "annotations" : [ {
    "preferred-label" : "Reception",
    "sentiment" : "MUST_HAVE",
    "type" : "keyword",
    "start-position" : 30,
    "end-position" : 39,
    "concept-id" : "zRKv_kwY_uw4",
    "matched-string" : "reception",
    "annotation-id" : 1
  }, {
    "preferred-label" : "Receptionist",
    "sentiment" : "MUST_HAVE",
    "type" : "keyword",
    "start-position" : 40,
    "end-position" : 52,
    "concept-id" : "gAAz_Lo5_WRR",
    "matched-string" : "receptionist",
    "annotation-id" : 2
  }, {
    "preferred-label" : "Heltid",
    "type" : "worktime-extent",
    "start-position" : 69,
    "end-position" : 75,
    "concept-id" : "6YE1_gAC_R2G",
    "matched-string" : "heltid",
    "annotation-id" : 10
  }, {
    "preferred-label" : "Hotell",
    "type" : "keyword",
    "start-position" : 309,
    "end-position" : 317,
    "concept-id" : "Jrrg_iiS_2yp",
    "matched-string" : "hotellet",
    "annotation-id" : 11
  }, {
    "preferred-label" : "Hotell",
    "type" : "keyword",
    "start-position" : 371,
    "end-position" : 379,
    "concept-id" : "Jrrg_iiS_2yp",
    "matched-string" : "hotellet",
    "annotation-id" : 12
  }, {
    "preferred-label" : "personlig utveckling",
    "sentiment" : "MUST_HAVE",
    "type" : "esco-skill",
    "start-position" : 442,
    "end-position" : 462,
    "concept-id" : "wkQj_Dah_2GD",
    "matched-string" : "personlig utveckling",
    "annotation-id" : 3
  }, {
    "preferred-label" : "Hotell",
    "type" : "keyword",
    "start-position" : 509,
    "end-position" : 517,
    "concept-id" : "Jrrg_iiS_2yp",
    "matched-string" : "hotellet",
    "annotation-id" : 13
  }, {
    "preferred-label" : "Receptionist",
    "sentiment" : "MUST_HAVE",
    "type" : "keyword",
    "start-position" : 746,
    "end-position" : 758,
    "concept-id" : "gAAz_Lo5_WRR",
    "matched-string" : "receptionist",
    "annotation-id" : 4
  }, {
    "preferred-label" : "Hotell",
    "type" : "keyword",
    "start-position" : 976,
    "end-position" : 984,
    "concept-id" : "Jrrg_iiS_2yp",
    "matched-string" : "hotellet",
    "annotation-id" : 14
  }, {
    "preferred-label" : "Hotell",
    "type" : "keyword",
    "start-position" : 2520,
    "end-position" : 2529,
    "concept-id" : "Jrrg_iiS_2yp",
    "matched-string" : "hotellets",
    "annotation-id" : 15
  }, {
    "preferred-label" : "utföra administrativt arbete",
    "type" : "esco-skill",
    "start-position" : 2658,
    "end-position" : 2691,
    "concept-id" : "2x13_sLi_EzG",
    "matched-string" : "hanterar administrativa uppgifter",
    "annotation-id" : 16
  }, {
    "preferred-label" : "Hotell",
    "type" : "keyword",
    "start-position" : 2778,
    "end-position" : 2786,
    "concept-id" : "Jrrg_iiS_2yp",
    "matched-string" : "Hotellet",
    "annotation-id" : 17
  }, {
    "preferred-label" : "Hotell",
    "type" : "keyword",
    "start-position" : 3136,
    "end-position" : 3145,
    "concept-id" : "Jrrg_iiS_2yp",
    "matched-string" : "hotellets",
    "annotation-id" : 18
  }, {
    "preferred-label" : "Svenska",
    "sentiment" : "MUST_HAVE",
    "type" : "language",
    "start-position" : 3317,
    "end-position" : 3324,
    "concept-id" : "zSLA_vw2_FXN",
    "matched-string" : "svenska",
    "annotation-id" : 8
  }, {
    "preferred-label" : "Engelska",
    "sentiment" : "MUST_HAVE",
    "type" : "language",
    "start-position" : 3329,
    "end-position" : 3337,
    "concept-id" : "NVxJ_hLg_TYS",
    "matched-string" : "engelska",
    "annotation-id" : 9
  }, {
    "preferred-label" : "Tillsvidareanställning (inkl. eventuell provanställning)",
    "type" : "employment-type",
    "start-position" : 3672,
    "end-position" : 3694,
    "concept-id" : "kpPX_CNN_gDU",
    "matched-string" : "tillsvidareanställning",
    "annotation-id" : 19
  }, {
    "preferred-label" : "Heltid",
    "type" : "worktime-extent",
    "start-position" : 3698,
    "end-position" : 3704,
    "concept-id" : "6YE1_gAC_R2G",
    "matched-string" : "heltid",
    "annotation-id" : 20
  } ],
  "text" : "Service Host, Front of House (Reception/Receptionist), Scandic Talk, heltid\nScandic Talk är beläget vägg i vägg med Stockholmsmässan, ett stenkast från pendeltågsstationen. Hos oss är ingen dag den andra lik – mässor, events och internationella kongresser skapar en dynamisk och spännande atmosfär. Trots att hotellet reser sig hela 19 våningar över marken är känslan på hotellet familjär. Vi är en liten organisation som präglas av trivsel, personlig utveckling och en stor gemenskap med alla som arbetar på hotellet. Vi lyssnar på våra gäster och älskar att leverera god service – allt för att kunna erbjuda den allra bästa hotellupplevelsen. Delar du vår passion för gemenskap och service? Då är du den vi söker!\n\nNu söker vi en Service Host (Receptionist) till hotellet Scandic Talk.\n\nOavsett varför gästen kommer till oss är det få saker som är så uppskattade som ett vänligt ansikte som hälsar välkommen. Som Service Host agerar du värd tillsammans med övriga teamet på hotellet och skapar en gästupplevelse i världsklass.\n\nI rollen som Service Host arbetar du inom ett eller flera ansvarsområden som alla bidrar till gästens helhetsupplevelse. Under din tid hos oss kan dessa områden variera i takt med att du och affären utvecklas. Hos oss får du ta ett stort eget ansvar för att ta de beslut som krävs för att göra gästen nöjd och teamen utvecklar och förbättrar arbetssätt och service i takt med att omvärlden förändras. Vi är nämligen övertygade om att det är när du får utvecklas och bidra med all din kompetens och erfarenhet som vi överträffar gästens förväntningar. På köpet får vi kul på jobbet!\n\nSå ta med dig dina erfarenheter, ditt engagemang och ditt sätt att tänka till oss – och bidra till en kultur där vi bryr oss på riktigt: om varandra, våra gäster och vår planet. Välkommen till Scandic! \n\nVad är innebär rollen som Service Host?\n\nDu som arbetar inom ansvarsområdet Front of House är ansvarig för att våra gäster får service i världsklass. Du är spindeln i nätet som ser till att gästen alltid är i fokus. Du är den som går igenom ankomstlistan och lägger tid på detaljerna. Ser till att gästens önskemål uppfylls. Du har alltid ett leende på läpparna och en kreativ lösning i backfikan. Du löser det mesta och är en stjärna på att vända en missnöjd gäst till en nöjd gäst. Din arbetsplats är vår lobby. För det är där du möter flest gäster. I ansvarsområdet ingår även administrativt arbete, säkerhetsarbete och arbete med försäljning. \n\nArbetet i Front of House innebär att checka in och ut hotellets gäster, hälsa välkommen och ge gästen den information den behöver om sin vistelse. Du hanterar bokningar i systemet Scorpio och hanterar administrativa uppgifter runt gäster och säkerhet. Allt arbete sker med gästnöjdhet och försäljning i fokus. \n\nHotellet har öppet dygnet runt och det är därför viktigt att du trivs med att arbeta i skift (förmiddagar, eftermiddagar och helger). \n\nVem är du?\n\nFör att passa i rollen tror vi att du har en väl utvecklad social förmåga och är kapabel att hantera att det händer många olika saker samtidigt. Det är mycket viktigt att du kan förmedla ett gott värdskap till hotellets gäster.\n\nDu har också vana och kunskap i att arbeta med dator som arbetsredskap. \n\nEftersom arbetet till stor del består av att kommunicera med gäster är goda kunskaper i svenska och engelska en förutsättning. Talar du ytterligare ett språk är det meriterande. \n\nAllra viktigast är dock dina personliga egenskaper och din inställning. För att passa i rollen behöver du vara en lyhörd och prestigelös lagspelare som tar ett stort ansvar för dina arbetsuppgifter och helhetsresultatet. \n\nInformation om tjänsten\n\nTjänsten är en tillsvidareanställning på heltid. \n\nVi tar enbart emot ansökningar via vår hemsida. Alla ansökningar kommer att behandlas löpande och tjänsten kan tillsättas innan sista ansökningsdag, varför vi ber dig att ansöka så snart som möjligt. I denna rekrytering använder vi oss av ett enklare test om service vid urvalet.\n\nVi ser fram emot att välkomna dig till oss på Scandic!\r\n\n\nVi når längre när olikheter bejakas. Hos oss får du utrymme att vara dig själv och utvecklas i den riktning du vill, med trygga villkor och schyssta avtal som grund. Ta med dig dina erfarenheter, ditt engagemang och ditt sätt att tänka till oss - bidra till en kultur där vi bryr oss på riktigt: om varandra, våra gäster och vår planet. Välkommen till Scandic.\n\nDelar du våra värderingar?\n\nBE A PRO BE YOU BE CARING BE BOLD"
}