{
  "meta" : {
    "jobad" : {
      "description" : {
        "requirements" : null,
        "needs" : null,
        "company_information" : null,
        "text_formatted" : "<p>Förskolan Vårsol startade 1990 och är belägen i Vasastan. Det finns två avdelningar med sammanlagt 34-36 barn i åldrarna 1-5 år.</p><p>Förskolan är ett föräldrakooperativ och drivs som en ekonomisk förening. Föräldrarna är engagerade i verksamheten genom schemalagda uppgifter i samband med stängning vid dagens slut samt genom styrelseåtaganden.</p><p>Lokalerna ligger i bottenvåningen i ett flerfamiljshus i vackra Rödabergen. Vi har ett eget kök med kock. Vi har en fin och välplanerad gård samt närhet till ett flertal parker så som Hälsingehöjden, Hedemoratäppan, Solvändan och Vasaparken.</p><p>Vårsol har en god organisation och ledningsstruktur samt sund ekonomi.</p><p>Vi ingår i ett nätverk om 10 förskolor (föräldrakooperativ) på Norrmalm, där vi bedriver ett pedagogiskt samarbete genom bl.a chefsmöten, pedagogträffar samt köksmöten för kockar.</p><p>Vi söker nu en kock/ekonomibiträde till Föräldrakooperativet Vårsol i Vasastan. Tillträde augusti/september 2022. Deltid, 75%.</p><p>I arbetsuppgifterna ingår att planera matsedel, beräkna portioner samt beställning av varor. Du har ansvar för din budget. Du ansvarar för att laga och servera lunch och mellanmål till 36 barn och 10 vuxna. Disk ingår efter lunch.</p><p>Du ska ha goda kunskaper i olika födoämnesallergier för att kunna tillaga specialkost samt kunskap kring vegetarisk kost. Dokumentation av egenkontroll ingår.</p><p>Som kock/ekonomibiträde ska du kunna laga god och varierad mat från grunden samt se till att maten serveras på ett tilltalande sätt. Vi vill att du har ett kreativt och lustfyllt förhållningssätt till matlagning för att locka barn till nya matupplevelser.</p><p>Du ska ha goda kunskaper i svenska språket i tal och skrift.</p>",
        "conditions" : null,
        "text" : "Förskolan Vårsol startade 1990 och är belägen i Vasastan. Det finns två avdelningar med sammanlagt 34-36 barn i åldrarna 1-5 år.\nFörskolan är ett föräldrakooperativ och drivs som en ekonomisk förening. Föräldrarna är engagerade i verksamheten genom schemalagda uppgifter i samband med stängning vid dagens slut samt genom styrelseåtaganden.\nLokalerna ligger i bottenvåningen i ett flerfamiljshus i vackra Rödabergen. Vi har ett eget kök med kock. Vi har en fin och välplanerad gård samt närhet till ett flertal parker så som Hälsingehöjden, Hedemoratäppan, Solvändan och Vasaparken.\nVårsol har en god organisation och ledningsstruktur samt sund ekonomi.\nVi ingår i ett nätverk om 10 förskolor (föräldrakooperativ) på Norrmalm, där vi bedriver ett pedagogiskt samarbete genom bl.a chefsmöten, pedagogträffar samt köksmöten för kockar.\nVi söker nu en kock/ekonomibiträde till Föräldrakooperativet Vårsol i Vasastan. Tillträde augusti/september 2022. Deltid, 75%.\nI arbetsuppgifterna ingår att planera matsedel, beräkna portioner samt beställning av varor. Du har ansvar för din budget. Du ansvarar för att laga och servera lunch och mellanmål till 36 barn och 10 vuxna. Disk ingår efter lunch.\nDu ska ha goda kunskaper i olika födoämnesallergier för att kunna tillaga specialkost samt kunskap kring vegetarisk kost. Dokumentation av egenkontroll ingår.\nSom kock/ekonomibiträde ska du kunna laga god och varierad mat från grunden samt se till att maten serveras på ett tilltalande sätt. Vi vill att du har ett kreativt och lustfyllt förhållningssätt till matlagning för att locka barn till nya matupplevelser.\nDu ska ha goda kunskaper i svenska språket i tal och skrift."
      },
      "headline" : "Kock/ekonomibiträde",
      "driving_license" : null,
      "employer" : {
        "email" : null,
        "phone_number" : null,
        "organization_number" : "7164213378",
        "name" : "Föräldraför Vårsol Ek F Vanadisplan Vasastan,Sth",
        "url" : "https://varsol.se",
        "workplace" : "Föräldrakooperativet Vårsol"
      },
      "removed_date" : null,
      "logo_url" : "https://www.arbetsformedlingen.se/rest/arbetsgivare/rest/af/v3/arbetsplatser/10026903/logotyper/logo.png",
      "last_publication_date" : "2022-08-28T23:59:59",
      "number_of_vacancies" : 1,
      "occupation" : {
        "concept_id" : "Vg3d_Azf_p5Y",
        "label" : "Kock, storhushåll",
        "legacy_ams_taxonomy_id" : "7664"
      },
      "occupation_group" : {
        "concept_id" : "BStc_SJh_DKG",
        "label" : "Kockar och kallskänkor",
        "legacy_ams_taxonomy_id" : "5120"
      },
      "employment_type" : {
        "concept_id" : "PFZr_Syz_cUq",
        "label" : "Vanlig anställning",
        "legacy_ams_taxonomy_id" : "1"
      },
      "webpage_url" : "https://arbetsformedlingen.se/platsbanken/annonser/26326368",
      "driving_license_required" : false,
      "application_contacts" : [ {
        "description" : null,
        "email" : null,
        "telephone" : "08311385",
        "name" : "Ingrid Karlsson",
        "contact_type" : "Rektor"
      } ],
      "duration" : {
        "concept_id" : "a7uU_j21_mkL",
        "label" : "Tills vidare",
        "legacy_ams_taxonomy_id" : "1"
      },
      "nice_to_have" : {
        "education_level" : [ ],
        "work_experiences" : [ ],
        "skills" : [ ],
        "education" : [ ],
        "languages" : [ ]
      },
      "application_details" : {
        "via_af" : false,
        "email" : "rekrytering.varsol@gmail.com",
        "other" : null,
        "reference" : null,
        "url" : null,
        "information" : null
      },
      "source_type" : "VIA_ANNONSERA",
      "application_deadline" : "2022-08-28T23:59:59",
      "external_id" : null,
      "workplace_address" : {
        "coordinates" : [ 18.038585807437048, 59.344522875955526 ],
        "city" : "STOCKHOLM",
        "postcode" : "11330",
        "municipality" : "Stockholm",
        "region_concept_id" : "CifL_Rzy_Mku",
        "region" : "Stockholms län",
        "country_code" : "199",
        "region_code" : "01",
        "municipality_concept_id" : "AvNB_uwa_6n6",
        "country_concept_id" : "i46j_HmG_v64",
        "municipality_code" : "0180",
        "street_address" : "Rödabergsbrinken 1",
        "country" : "Sverige"
      },
      "id" : "26326368",
      "experience_required" : true,
      "working_hours_type" : {
        "concept_id" : "947z_JGS_Uk2",
        "label" : "Deltid",
        "legacy_ams_taxonomy_id" : "2"
      },
      "access" : null,
      "timestamp" : 1657787680283,
      "must_have" : {
        "education_level" : [ ],
        "work_experiences" : [ {
          "concept_id" : "Vg3d_Azf_p5Y",
          "weight" : 10,
          "label" : "Kock, storhushåll",
          "legacy_ams_taxonomy_id" : "7664"
        } ],
        "skills" : [ ],
        "education" : [ ],
        "languages" : [ ]
      },
      "occupation_field" : {
        "concept_id" : "ScKy_FHB_7wT",
        "label" : "Hotell, restaurang, storhushåll",
        "legacy_ams_taxonomy_id" : "7"
      },
      "scope_of_work" : {
        "min" : 0,
        "max" : 100
      },
      "salary_type" : {
        "concept_id" : "oG8G_9cW_nRf",
        "label" : "Fast månads- vecko- eller timlön",
        "legacy_ams_taxonomy_id" : "1"
      },
      "removed" : false,
      "salary_description" : null,
      "access_to_own_car" : false,
      "publication_date" : "2022-07-27T00:00:00"
    },
    "name" : "Kock/ekonomibiträde",
    "user" : "hannes"
  },
  "sha1" : "67ed9e87b7f47c6ded197647d01e73a475910e05",
  "annotations" : [ {
    "preferred-label" : "kock",
    "sentiment" : "MUST_HAVE",
    "type" : "esco-occupation",
    "start-position" : 0,
    "end-position" : 4,
    "concept-id" : "Ti2H_QoQ_EMX",
    "matched-string" : "kock",
    "annotation-id" : 0
  }, {
    "preferred-label" : "Ekonomibiträde, storhushåll",
    "type" : "occupation-name",
    "start-position" : 5,
    "end-position" : 19,
    "concept-id" : "Kf29_nju_Xd4",
    "matched-string" : "ekonomibiträde",
    "annotation-id" : 9
  }, {
    "preferred-label" : "kock",
    "sentiment" : "MUST_HAVE",
    "type" : "esco-occupation",
    "start-position" : 461,
    "end-position" : 465,
    "concept-id" : "Ti2H_QoQ_EMX",
    "matched-string" : "kock",
    "annotation-id" : 1
  }, {
    "preferred-label" : "Ekonomi",
    "sentiment" : "MUST_HAVE",
    "type" : "keyword",
    "start-position" : 665,
    "end-position" : 672,
    "concept-id" : "PW4f_bmT_new",
    "matched-string" : "ekonomi",
    "annotation-id" : 2
  }, {
    "preferred-label" : "Kock",
    "type" : "keyword",
    "start-position" : 846,
    "end-position" : 852,
    "concept-id" : "RTQf_1Qm_YhD",
    "matched-string" : "kockar",
    "annotation-id" : 10
  }, {
    "preferred-label" : "kock",
    "sentiment" : "MUST_HAVE",
    "type" : "esco-occupation",
    "start-position" : 869,
    "end-position" : 873,
    "concept-id" : "Ti2H_QoQ_EMX",
    "matched-string" : "kock",
    "annotation-id" : 3
  }, {
    "preferred-label" : "Ekonomibiträde, storhushåll",
    "type" : "occupation-name",
    "start-position" : 874,
    "end-position" : 888,
    "concept-id" : "Kf29_nju_Xd4",
    "matched-string" : "ekonomibiträde",
    "annotation-id" : 11
  }, {
    "preferred-label" : "Deltid",
    "type" : "worktime-extent",
    "start-position" : 968,
    "end-position" : 979,
    "concept-id" : "947z_JGS_Uk2",
    "matched-string" : "Deltid, 75%",
    "annotation-id" : 12
  }, {
    "preferred-label" : "Budgetansvar",
    "type" : "skill",
    "start-position" : 1081,
    "end-position" : 1087,
    "concept-id" : "Gt5f_wdi_FSJ",
    "matched-string" : "ansvar",
    "annotation-id" : 13
  }, {
    "preferred-label" : "Budgetansvar",
    "type" : "skill",
    "start-position" : 1096,
    "end-position" : 1102,
    "concept-id" : "Gt5f_wdi_FSJ",
    "matched-string" : "budget",
    "annotation-id" : 14
  }, {
    "preferred-label" : "Specialkost",
    "sentiment" : "MUST_HAVE",
    "type" : "skill",
    "start-position" : 1286,
    "end-position" : 1297,
    "concept-id" : "JYKn_PRX_tif",
    "matched-string" : "specialkost",
    "annotation-id" : 4
  }, {
    "preferred-label" : "Vegetarisk kost",
    "sentiment" : "MUST_HAVE",
    "type" : "skill",
    "start-position" : 1317,
    "end-position" : 1332,
    "concept-id" : "d6J5_FPH_ARs",
    "matched-string" : "vegetarisk kost",
    "annotation-id" : 5
  }, {
    "preferred-label" : "Dokumentation",
    "sentiment" : "MUST_HAVE",
    "type" : "keyword",
    "start-position" : 1334,
    "end-position" : 1347,
    "concept-id" : "jodz_kWf_iKx",
    "matched-string" : "dokumentation",
    "annotation-id" : 6
  }, {
    "preferred-label" : "kock",
    "sentiment" : "MUST_HAVE",
    "type" : "esco-occupation",
    "start-position" : 1375,
    "end-position" : 1379,
    "concept-id" : "Ti2H_QoQ_EMX",
    "matched-string" : "kock",
    "annotation-id" : 7
  }, {
    "preferred-label" : "Ekonomibiträde, storhushåll",
    "type" : "occupation-name",
    "start-position" : 1380,
    "end-position" : 1394,
    "concept-id" : "Kf29_nju_Xd4",
    "matched-string" : "ekonomibiträde",
    "annotation-id" : 15
  }, {
    "preferred-label" : "Svenska språket",
    "sentiment" : "MUST_HAVE",
    "type" : "keyword",
    "start-position" : 1654,
    "end-position" : 1669,
    "concept-id" : "BiGm_58D_SSn",
    "matched-string" : "svenska språket",
    "annotation-id" : 8
  } ],
  "text" : "Kock/ekonomibiträde\nFörskolan Vårsol startade 1990 och är belägen i Vasastan. Det finns två avdelningar med sammanlagt 34-36 barn i åldrarna 1-5 år.\nFörskolan är ett föräldrakooperativ och drivs som en ekonomisk förening. Föräldrarna är engagerade i verksamheten genom schemalagda uppgifter i samband med stängning vid dagens slut samt genom styrelseåtaganden.\nLokalerna ligger i bottenvåningen i ett flerfamiljshus i vackra Rödabergen. Vi har ett eget kök med kock. Vi har en fin och välplanerad gård samt närhet till ett flertal parker så som Hälsingehöjden, Hedemoratäppan, Solvändan och Vasaparken.\nVårsol har en god organisation och ledningsstruktur samt sund ekonomi.\nVi ingår i ett nätverk om 10 förskolor (föräldrakooperativ) på Norrmalm, där vi bedriver ett pedagogiskt samarbete genom bl.a chefsmöten, pedagogträffar samt köksmöten för kockar.\nVi söker nu en kock/ekonomibiträde till Föräldrakooperativet Vårsol i Vasastan. Tillträde augusti/september 2022. Deltid, 75%.\nI arbetsuppgifterna ingår att planera matsedel, beräkna portioner samt beställning av varor. Du har ansvar för din budget. Du ansvarar för att laga och servera lunch och mellanmål till 36 barn och 10 vuxna. Disk ingår efter lunch.\nDu ska ha goda kunskaper i olika födoämnesallergier för att kunna tillaga specialkost samt kunskap kring vegetarisk kost. Dokumentation av egenkontroll ingår.\nSom kock/ekonomibiträde ska du kunna laga god och varierad mat från grunden samt se till att maten serveras på ett tilltalande sätt. Vi vill att du har ett kreativt och lustfyllt förhållningssätt till matlagning för att locka barn till nya matupplevelser.\nDu ska ha goda kunskaper i svenska språket i tal och skrift."
}