{
  "meta" : {
    "jobad" : {
      "description" : {
        "requirements" : null,
        "needs" : null,
        "company_information" : null,
        "text_formatted" : "Verksamhetsområde öron-, näsa och halssjukdomar \r\n\r\nVi är Akademiska sjukhuset – ett av Sveriges ledande universitetssjukhus. Förutom rollen som länssjukhus är vi leverantör av högspecialiserad vård och betjänar två miljoner människor i Mellansverige. Hos oss pågår det något hela tiden – ett nytt liv ser dagens ljus, en mormor opereras, en kollega hyllas som livets hjälte. Vi tror att ärlighet varar längst och det är ingen hemlighet att vi behöver bli fler. Som kollega till oss får du vara med om mycket. Hårda prövningar men också fantastiska händelser, stark gemenskap och stöttning från kollegor och medmänniskor. För att se delar ur vår verklighet, besök vår fotoutställning på akademiskafotoutstallning.se.\n\nVälkommen med din ansökan och bli en del av oss.\r\n\r\nVår verksamhet\nInom vår verksamhet bedrivs akut, planerad specialistvård och högspecialiserad vård. De akuta besöken utgörs främst av patienter med svåra infektioner inom öron-, näs- och halsområdet, övre luftvägs- och sväljningsproblem, blödningar och yrsel. Den högspecialiserade vården, som till stor del är riks - och regionvård, innefattar patienter med tumörsjukdomar, luftvägssjukdomar och bihålesjukdomar, otokirurgiska sjukdomar och hörselsjukdomar.\n\nDitt uppdrag\nSom operationskoordinator ansvarar du för planering och samordning av patienter som ska genomgå operation och behandling. Du kommer vara personen som ansvarar för helheten kring planeringen. Det innebär kontakt med patienter, andra regioner, kontaktsjuksköterskor, operationsavdelning, vårdavdelning, röntgen o.s.v. Du har möjlighet att själv lägga upp och planera ditt arbete. Du förväntas ha ett mycket gott och nära samarbete med övriga två koordinatorer på avdelningen.\n\nDina kvalifikationer\n\nSjukvårdsutbildad, helst sjuksköterska men inget krav\nNågra års erfarenhet inom vården är ett krav\nGod datorvana, gärna erfarenhet av Cosmic och/eller Orbit\nGärna erfarenhet från en administrativ och koordinerande roll\nDu ska vara kommunikativ och serviceinriktad\nNoggrann, strukturerad och lösningsorienterad\nDu behöver ha en professionell inställning med hög servicenivå och gilla att vara spindeln i nätet\nDu är en engagerad och glad kollega som bidrar till en bra arbetsmiljö.\n\nVi kommer lägga stor vikt vid personliga egenskaper\n\nVi erbjuder\nEn tillsvidareanställning. Helst heltid men det kan eventuellt diskuteras. Tillträde enligt överenskommelse. Arbetstiden är dagtid måndag till fredag.\n\nHos oss får du förmåner som gör skillnad, läs om förmånerna här (https://regionuppsala.se/jobba-hos-oss/bli-var-nya-kollega/formaner/).\n\nVill du veta mer?\nAvdelningschef Helen Orest 018-611 52 70\n\nFackliga kontaktperson: Mariana Nordensvärd (Vårdförbundet) 018-6110000\n\nVill du jobba med oss?\nVälkommen med din ansökan via länken nedan.\n\nRegion Uppsala värdesätter de kvaliteter som jämn könsfördelning och mångfald tillför verksamheten. Vi ser därför gärna sökande av alla kön och med olika födelsebakgrund, funktionalitet och livserfarenhet.\n\nDenna rekrytering sker helt genom Region Uppsalas försorg. Vi undanber oss därför telefonsamtal från rekryteringsföretag och annonsförsäljare.",
        "conditions" : "Tillsvidare, 100%, Tillträde Enligt överenskommelse\r\n\n-",
        "text" : "Verksamhetsområde öron-, näsa och halssjukdomar \r\n\r\nVi är Akademiska sjukhuset – ett av Sveriges ledande universitetssjukhus. Förutom rollen som länssjukhus är vi leverantör av högspecialiserad vård och betjänar två miljoner människor i Mellansverige. Hos oss pågår det något hela tiden – ett nytt liv ser dagens ljus, en mormor opereras, en kollega hyllas som livets hjälte. Vi tror att ärlighet varar längst och det är ingen hemlighet att vi behöver bli fler. Som kollega till oss får du vara med om mycket. Hårda prövningar men också fantastiska händelser, stark gemenskap och stöttning från kollegor och medmänniskor. För att se delar ur vår verklighet, besök vår fotoutställning på akademiskafotoutstallning.se.\n\nVälkommen med din ansökan och bli en del av oss.\r\n\r\nVår verksamhet\nInom vår verksamhet bedrivs akut, planerad specialistvård och högspecialiserad vård. De akuta besöken utgörs främst av patienter med svåra infektioner inom öron-, näs- och halsområdet, övre luftvägs- och sväljningsproblem, blödningar och yrsel. Den högspecialiserade vården, som till stor del är riks - och regionvård, innefattar patienter med tumörsjukdomar, luftvägssjukdomar och bihålesjukdomar, otokirurgiska sjukdomar och hörselsjukdomar.\n\nDitt uppdrag\nSom operationskoordinator ansvarar du för planering och samordning av patienter som ska genomgå operation och behandling. Du kommer vara personen som ansvarar för helheten kring planeringen. Det innebär kontakt med patienter, andra regioner, kontaktsjuksköterskor, operationsavdelning, vårdavdelning, röntgen o.s.v. Du har möjlighet att själv lägga upp och planera ditt arbete. Du förväntas ha ett mycket gott och nära samarbete med övriga två koordinatorer på avdelningen.\n\nDina kvalifikationer\n\nSjukvårdsutbildad, helst sjuksköterska men inget krav\nNågra års erfarenhet inom vården är ett krav\nGod datorvana, gärna erfarenhet av Cosmic och/eller Orbit\nGärna erfarenhet från en administrativ och koordinerande roll\nDu ska vara kommunikativ och serviceinriktad\nNoggrann, strukturerad och lösningsorienterad\nDu behöver ha en professionell inställning med hög servicenivå och gilla att vara spindeln i nätet\nDu är en engagerad och glad kollega som bidrar till en bra arbetsmiljö.\n\nVi kommer lägga stor vikt vid personliga egenskaper\n\nVi erbjuder\nEn tillsvidareanställning. Helst heltid men det kan eventuellt diskuteras. Tillträde enligt överenskommelse. Arbetstiden är dagtid måndag till fredag.\n\nHos oss får du förmåner som gör skillnad, läs om förmånerna här (https://regionuppsala.se/jobba-hos-oss/bli-var-nya-kollega/formaner/).\n\nVill du veta mer?\nAvdelningschef Helen Orest 018-611 52 70\n\nFackliga kontaktperson: Mariana Nordensvärd (Vårdförbundet) 018-6110000\n\nVill du jobba med oss?\nVälkommen med din ansökan via länken nedan.\n\nRegion Uppsala värdesätter de kvaliteter som jämn könsfördelning och mångfald tillför verksamheten. Vi ser därför gärna sökande av alla kön och med olika födelsebakgrund, funktionalitet och livserfarenhet.\n\nDenna rekrytering sker helt genom Region Uppsalas försorg. Vi undanber oss därför telefonsamtal från rekryteringsföretag och annonsförsäljare."
      },
      "headline" : "Operationskoordinator till öron-, näsa och hals mottagningen",
      "driving_license" : null,
      "employer" : {
        "email" : null,
        "phone_number" : null,
        "organization_number" : "2321000024",
        "name" : "REGION UPPSALA",
        "url" : null,
        "workplace" : "Region Uppsala"
      },
      "removed_date" : null,
      "logo_url" : "https://www.arbetsformedlingen.se/rest/arbetsgivare/rest/af/v3/organisation/2321000024/logotyper/logo.png",
      "last_publication_date" : "2022-08-07T23:59:59",
      "number_of_vacancies" : 1,
      "occupation" : {
        "concept_id" : "PQkQ_Dmk_ZF8",
        "label" : "Undersköterska, vård- o specialavd. o mottagning",
        "legacy_ams_taxonomy_id" : "7587"
      },
      "occupation_group" : {
        "concept_id" : "LP4Z_ABV_gRm",
        "label" : "Undersköterskor, vård- och specialavdelning och mottagning",
        "legacy_ams_taxonomy_id" : "5323"
      },
      "employment_type" : {
        "concept_id" : "PFZr_Syz_cUq",
        "label" : "Vanlig anställning",
        "legacy_ams_taxonomy_id" : "1"
      },
      "webpage_url" : "https://arbetsformedlingen.se/platsbanken/annonser/26321023",
      "driving_license_required" : false,
      "application_contacts" : [ ],
      "duration" : {
        "concept_id" : "a7uU_j21_mkL",
        "label" : "Tills vidare",
        "legacy_ams_taxonomy_id" : "1"
      },
      "nice_to_have" : {
        "education_level" : [ ],
        "work_experiences" : [ ],
        "skills" : [ ],
        "education" : [ ],
        "languages" : [ ]
      },
      "application_details" : {
        "via_af" : false,
        "email" : null,
        "other" : null,
        "reference" : "AS927/2022",
        "url" : "https://lul.powerinit.com/Modules/Recruitments/Public/?JobPositionId=42698&RefNo=AS927%2f2022",
        "information" : null
      },
      "source_type" : "VIA_PLATSBANKEN_DXA",
      "application_deadline" : "2022-08-07T23:59:59",
      "external_id" : "46-232100-0024-42698",
      "workplace_address" : {
        "coordinates" : [ 17.638927, 59.858562 ],
        "city" : null,
        "postcode" : null,
        "municipality" : "Uppsala",
        "region_concept_id" : "zBon_eET_fFU",
        "region" : "Uppsala län",
        "country_code" : "199",
        "region_code" : "03",
        "municipality_concept_id" : "otaF_bQY_4ZD",
        "country_concept_id" : "i46j_HmG_v64",
        "municipality_code" : "0380",
        "street_address" : null,
        "country" : "Sverige"
      },
      "id" : "26321023",
      "experience_required" : true,
      "working_hours_type" : {
        "concept_id" : "6YE1_gAC_R2G",
        "label" : "Heltid",
        "legacy_ams_taxonomy_id" : "1"
      },
      "access" : null,
      "timestamp" : 1657633501046,
      "must_have" : {
        "education_level" : [ ],
        "work_experiences" : [ {
          "concept_id" : "PQkQ_Dmk_ZF8",
          "weight" : 10,
          "label" : "Undersköterska, vård- och specialavdelning och mottagning",
          "legacy_ams_taxonomy_id" : "7587"
        } ],
        "skills" : [ ],
        "education" : [ ],
        "languages" : [ ]
      },
      "occupation_field" : {
        "concept_id" : "NYW6_mP6_vwf",
        "label" : "Hälso- och sjukvård",
        "legacy_ams_taxonomy_id" : "8"
      },
      "scope_of_work" : {
        "min" : 100,
        "max" : 100
      },
      "salary_type" : {
        "concept_id" : "oG8G_9cW_nRf",
        "label" : "Fast månads- vecko- eller timlön",
        "legacy_ams_taxonomy_id" : "1"
      },
      "removed" : false,
      "salary_description" : "-",
      "access_to_own_car" : false,
      "publication_date" : "2022-07-12T15:45:01"
    },
    "name" : "Operationskoordinator till öron-, näsa och hals mottagningen",
    "user" : "hannes"
  },
  "sha1" : "bb54bc4136315e51ce489fea165664ce9f33e474",
  "annotations" : [ {
    "preferred-label" : "öron-, näs- och halssjukdomar",
    "type" : "esco-skill",
    "start-position" : 79,
    "end-position" : 110,
    "concept-id" : "xh91_71f_LT4",
    "matched-string" : "öron-, näsa och halssjukdomar \r",
    "annotation-id" : 3
  }, {
    "preferred-label" : "tumörsjukdomar",
    "type" : "esco-skill",
    "start-position" : 1190,
    "end-position" : 1204,
    "concept-id" : "KnNJ_Z5E_H94",
    "matched-string" : "tumörsjukdomar",
    "annotation-id" : 4
  }, {
    "preferred-label" : "Kontaktsjuksköterska",
    "type" : "occupation-name",
    "start-position" : 1546,
    "end-position" : 1567,
    "concept-id" : "P255_NB8_Aa7",
    "matched-string" : "kontaktsjuksköterskor",
    "annotation-id" : 5
  }, {
    "preferred-label" : "Vårdavdelning/Mottagning",
    "sentiment" : "MUST_HAVE",
    "type" : "skill",
    "start-position" : 1590,
    "end-position" : 1603,
    "concept-id" : "TuUX_3Jo_wyq",
    "matched-string" : "vårdavdelning",
    "annotation-id" : 0
  }, {
    "preferred-label" : "Sjuksköterska",
    "sentiment" : "MUST_HAVE",
    "type" : "keyword",
    "start-position" : 1826,
    "end-position" : 1839,
    "concept-id" : "jrjV_wcz_fxg",
    "matched-string" : "sjuksköterska",
    "annotation-id" : 1
  }, {
    "preferred-label" : "noggrannhet",
    "type" : "esco-skill",
    "start-position" : 2065,
    "end-position" : 2073,
    "concept-id" : "mrsW_EkL_KRD",
    "matched-string" : "Noggrann",
    "annotation-id" : 6
  }, {
    "preferred-label" : "arbetsmiljö",
    "sentiment" : "MUST_HAVE",
    "type" : "esco-skill",
    "start-position" : 2269,
    "end-position" : 2280,
    "concept-id" : "zdQY_QJh_nUH",
    "matched-string" : "arbetsmiljö",
    "annotation-id" : 2
  }, {
    "preferred-label" : "Tillsvidareanställning (inkl. eventuell provanställning)",
    "type" : "employment-type",
    "start-position" : 2351,
    "end-position" : 2373,
    "concept-id" : "kpPX_CNN_gDU",
    "matched-string" : "tillsvidareanställning",
    "annotation-id" : 8
  }, {
    "preferred-label" : "Heltid",
    "type" : "worktime-extent",
    "start-position" : 2381,
    "end-position" : 2387,
    "concept-id" : "6YE1_gAC_R2G",
    "matched-string" : "heltid",
    "annotation-id" : 7
  } ],
  "text" : "Operationskoordinator till öron-, näsa och hals mottagningen\nVerksamhetsområde öron-, näsa och halssjukdomar \r\n\r\nVi är Akademiska sjukhuset – ett av Sveriges ledande universitetssjukhus. Förutom rollen som länssjukhus är vi leverantör av högspecialiserad vård och betjänar två miljoner människor i Mellansverige. Hos oss pågår det något hela tiden – ett nytt liv ser dagens ljus, en mormor opereras, en kollega hyllas som livets hjälte. Vi tror att ärlighet varar längst och det är ingen hemlighet att vi behöver bli fler. Som kollega till oss får du vara med om mycket. Hårda prövningar men också fantastiska händelser, stark gemenskap och stöttning från kollegor och medmänniskor. För att se delar ur vår verklighet, besök vår fotoutställning på akademiskafotoutstallning.se.\n\nVälkommen med din ansökan och bli en del av oss.\r\n\r\nVår verksamhet\nInom vår verksamhet bedrivs akut, planerad specialistvård och högspecialiserad vård. De akuta besöken utgörs främst av patienter med svåra infektioner inom öron-, näs- och halsområdet, övre luftvägs- och sväljningsproblem, blödningar och yrsel. Den högspecialiserade vården, som till stor del är riks - och regionvård, innefattar patienter med tumörsjukdomar, luftvägssjukdomar och bihålesjukdomar, otokirurgiska sjukdomar och hörselsjukdomar.\n\nDitt uppdrag\nSom operationskoordinator ansvarar du för planering och samordning av patienter som ska genomgå operation och behandling. Du kommer vara personen som ansvarar för helheten kring planeringen. Det innebär kontakt med patienter, andra regioner, kontaktsjuksköterskor, operationsavdelning, vårdavdelning, röntgen o.s.v. Du har möjlighet att själv lägga upp och planera ditt arbete. Du förväntas ha ett mycket gott och nära samarbete med övriga två koordinatorer på avdelningen.\n\nDina kvalifikationer\n\nSjukvårdsutbildad, helst sjuksköterska men inget krav\nNågra års erfarenhet inom vården är ett krav\nGod datorvana, gärna erfarenhet av Cosmic och/eller Orbit\nGärna erfarenhet från en administrativ och koordinerande roll\nDu ska vara kommunikativ och serviceinriktad\nNoggrann, strukturerad och lösningsorienterad\nDu behöver ha en professionell inställning med hög servicenivå och gilla att vara spindeln i nätet\nDu är en engagerad och glad kollega som bidrar till en bra arbetsmiljö.\n\nVi kommer lägga stor vikt vid personliga egenskaper\n\nVi erbjuder\nEn tillsvidareanställning. Helst heltid men det kan eventuellt diskuteras. Tillträde enligt överenskommelse. Arbetstiden är dagtid måndag till fredag.\n\nHos oss får du förmåner som gör skillnad, läs om förmånerna här (https://regionuppsala.se/jobba-hos-oss/bli-var-nya-kollega/formaner/).\n\nVill du veta mer?\nAvdelningschef Helen Orest 018-611 52 70\n\nFackliga kontaktperson: Mariana Nordensvärd (Vårdförbundet) 018-6110000\n\nVill du jobba med oss?\nVälkommen med din ansökan via länken nedan.\n\nRegion Uppsala värdesätter de kvaliteter som jämn könsfördelning och mångfald tillför verksamheten. Vi ser därför gärna sökande av alla kön och med olika födelsebakgrund, funktionalitet och livserfarenhet.\n\nDenna rekrytering sker helt genom Region Uppsalas försorg. Vi undanber oss därför telefonsamtal från rekryteringsföretag och annonsförsäljare."
}