{
  "meta" : {
    "jobad" : {
      "description" : {
        "requirements" : null,
        "needs" : null,
        "company_information" : null,
        "text_formatted" : "<p><strong>Extrajobb i Norrköpings krogliv</strong></p><p><br></p><p>Vi söker dig som vill vara en del av utelivet i stan och arbeta i en rolig och positiv miljö. Du är utåtriktad och tycker om att arbeta direkt mot gästerna för att skapa en trevlig stämning.</p><p>Vill du ha ett socialt utvecklande extrajobb där ingen kväll är den andra lik? Då har vi jobbet för dig.</p><p>Cherry Spelglädje söker blivande dealers i Norrköping. Vi erbjuder casino på barer, nattklubbar och restauranger.</p><p>Att arbeta som dealer är ett väldigt spännande jobb som lämpar sig bra för dig som studerar, behöver ett arbete till eller helt enkelt vill ha väldigt roligt på jobbet.</p><p>Ett arbete hos oss är flexibelt då Cherry Spelglädje bedriver casino runt om i hela Sverige från Kiruna till Ystad. Så du kan med fördel ta med dig jobbet om du flyttar till annan ort.</p><p>Vi erbjuder minst fyra helgkvällar i månaden vilket motsvarar ca 20 timmar. Möjlighet att arbeta mer vardagar och helger utöver detta finns.</p><p>Ingen tidigare erfarenhet krävs, då vi lägger större vikt vid dina personliga egenskaper. Vi erbjuder lön enligt kollektivavtal samt möjlighet till provision.</p><p><br></p><p>Känner du att detta är ett arbete som passar dig lämna du enkelt din ansökan på www.cherry.se/jobba/</p><p> Om du har frågor kan du vända dig till Leona Brandt som är ansvarig i Norrköping. Du når Leona på 0739-80 16 36 eller leona.brandt@cherry.se. Kolla gärna in vår Instagram @cherryspelgladje</p>",
        "conditions" : null,
        "text" : "Extrajobb i Norrköpings krogliv\n\n\nVi söker dig som vill vara en del av utelivet i stan och arbeta i en rolig och positiv miljö. Du är utåtriktad och tycker om att arbeta direkt mot gästerna för att skapa en trevlig stämning.\nVill du ha ett socialt utvecklande extrajobb där ingen kväll är den andra lik? Då har vi jobbet för dig.\nCherry Spelglädje söker blivande dealers i Norrköping. Vi erbjuder casino på barer, nattklubbar och restauranger.\nAtt arbeta som dealer är ett väldigt spännande jobb som lämpar sig bra för dig som studerar, behöver ett arbete till eller helt enkelt vill ha väldigt roligt på jobbet.\nEtt arbete hos oss är flexibelt då Cherry Spelglädje bedriver casino runt om i hela Sverige från Kiruna till Ystad. Så du kan med fördel ta med dig jobbet om du flyttar till annan ort.\nVi erbjuder minst fyra helgkvällar i månaden vilket motsvarar ca 20 timmar. Möjlighet att arbeta mer vardagar och helger utöver detta finns.\nIngen tidigare erfarenhet krävs, då vi lägger större vikt vid dina personliga egenskaper. Vi erbjuder lön enligt kollektivavtal samt möjlighet till provision.\n\n\nKänner du att detta är ett arbete som passar dig lämna du enkelt din ansökan på www.cherry.se/jobba/\n Om du har frågor kan du vända dig till Leona Brandt som är ansvarig i Norrköping. Du når Leona på 0739-80 16 36 eller leona.brandt@cherry.se. Kolla gärna in vår Instagram @cherryspelgladje"
      },
      "headline" : "Extrajobb i Norrköpings krogliv",
      "driving_license" : null,
      "employer" : {
        "email" : null,
        "phone_number" : null,
        "organization_number" : "5562253806",
        "name" : "Cherry Spelglädje AB",
        "url" : "http://www.cherryspelgladje.se",
        "workplace" : "Cherry Spelglädje AB"
      },
      "removed_date" : null,
      "logo_url" : "https://www.arbetsformedlingen.se/rest/arbetsgivare/rest/af/v3/arbetsplatser/10004838/logotyper/logo.png",
      "last_publication_date" : "2022-08-08T23:59:59",
      "number_of_vacancies" : 5,
      "occupation" : {
        "concept_id" : "r8ph_Hv3_eWg",
        "label" : "Dealer",
        "legacy_ams_taxonomy_id" : "2249"
      },
      "occupation_group" : {
        "concept_id" : "YHwG_fk2_MDL",
        "label" : "Croupierer och oddssättare m.fl.",
        "legacy_ams_taxonomy_id" : "4211"
      },
      "employment_type" : {
        "concept_id" : "PFZr_Syz_cUq",
        "label" : "Vanlig anställning",
        "legacy_ams_taxonomy_id" : "1"
      },
      "webpage_url" : "https://arbetsformedlingen.se/platsbanken/annonser/26350693",
      "driving_license_required" : false,
      "application_contacts" : [ {
        "description" : null,
        "email" : "leona.brandt@cherry.se",
        "telephone" : "0739-80 16 36",
        "name" : "Leona Brandt",
        "contact_type" : null
      } ],
      "duration" : {
        "concept_id" : "a7uU_j21_mkL",
        "label" : "Tills vidare",
        "legacy_ams_taxonomy_id" : "1"
      },
      "nice_to_have" : {
        "education_level" : [ ],
        "work_experiences" : [ ],
        "skills" : [ ],
        "education" : [ ],
        "languages" : [ ]
      },
      "application_details" : {
        "via_af" : false,
        "email" : null,
        "other" : null,
        "reference" : null,
        "url" : "http://www.cherryspelgladje.se",
        "information" : null
      },
      "source_type" : "VIA_ANNONSERA",
      "application_deadline" : "2022-08-08T23:59:59",
      "external_id" : null,
      "workplace_address" : {
        "coordinates" : [ 16.19713805134218, 58.598107888655086 ],
        "city" : "NORRKÖPING",
        "postcode" : "60114",
        "municipality" : "Norrköping",
        "region_concept_id" : "oLT3_Q9p_3nn",
        "region" : "Östergötlands län",
        "country_code" : "199",
        "region_code" : "05",
        "municipality_concept_id" : "SYty_Yho_JAF",
        "country_concept_id" : "i46j_HmG_v64",
        "municipality_code" : "0581",
        "street_address" : null,
        "country" : "Sverige"
      },
      "id" : "26350693",
      "experience_required" : false,
      "working_hours_type" : {
        "concept_id" : "947z_JGS_Uk2",
        "label" : "Deltid",
        "legacy_ams_taxonomy_id" : "2"
      },
      "access" : null,
      "timestamp" : 1658740555282,
      "must_have" : {
        "education_level" : [ ],
        "work_experiences" : [ ],
        "skills" : [ ],
        "education" : [ ],
        "languages" : [ ]
      },
      "occupation_field" : {
        "concept_id" : "ScKy_FHB_7wT",
        "label" : "Hotell, restaurang, storhushåll",
        "legacy_ams_taxonomy_id" : "7"
      },
      "scope_of_work" : {
        "min" : 20,
        "max" : 40
      },
      "salary_type" : {
        "concept_id" : "asrX_9Df_ukn",
        "label" : "Fast och rörlig lön",
        "legacy_ams_taxonomy_id" : "7"
      },
      "removed" : false,
      "salary_description" : null,
      "access_to_own_car" : false,
      "publication_date" : "2022-07-25T11:15:55"
    },
    "name" : "Extrajobb i Norrköpings krogliv",
    "user" : "hannes"
  },
  "sha1" : "00bf1cac01cdbbb0273b2a89c9d9c76b0dd32968",
  "annotations" : [ {
    "preferred-label" : "Behovsanställning",
    "sentiment" : "OFFERED",
    "type" : "employment-type",
    "start-position" : 0,
    "end-position" : 9,
    "concept-id" : "1paU_aCR_nGn",
    "matched-string" : "Extrajobb",
    "annotation-id" : 10
  }, {
    "preferred-label" : "Norrköping",
    "type" : "municipality",
    "start-position" : 12,
    "end-position" : 23,
    "concept-id" : "SYty_Yho_JAF",
    "matched-string" : "Norrköpings",
    "annotation-id" : 2
  }, {
    "preferred-label" : "Behovsanställning",
    "sentiment" : "OFFERED",
    "type" : "employment-type",
    "start-position" : 32,
    "end-position" : 41,
    "concept-id" : "1paU_aCR_nGn",
    "matched-string" : "Extrajobb",
    "annotation-id" : 11
  }, {
    "preferred-label" : "Norrköping",
    "type" : "municipality",
    "start-position" : 44,
    "end-position" : 55,
    "concept-id" : "SYty_Yho_JAF",
    "matched-string" : "Norrköpings",
    "annotation-id" : 3
  }, {
    "preferred-label" : "Dealer",
    "sentiment" : "OFFERED",
    "type" : "occupation-name",
    "start-position" : 395,
    "end-position" : 402,
    "concept-id" : "r8ph_Hv3_eWg",
    "matched-string" : "dealers",
    "annotation-id" : 12
  }, {
    "preferred-label" : "Norrköping",
    "type" : "municipality",
    "start-position" : 405,
    "end-position" : 415,
    "concept-id" : "SYty_Yho_JAF",
    "matched-string" : "Norrköping",
    "annotation-id" : 4
  }, {
    "preferred-label" : "Dealer",
    "sentiment" : "MUST_HAVE",
    "type" : "occupation-name",
    "start-position" : 491,
    "end-position" : 497,
    "concept-id" : "r8ph_Hv3_eWg",
    "matched-string" : "dealer",
    "annotation-id" : 0
  }, {
    "preferred-label" : "Sverige",
    "type" : "country",
    "start-position" : 729,
    "end-position" : 736,
    "concept-id" : "i46j_HmG_v64",
    "matched-string" : "Sverige",
    "annotation-id" : 5
  }, {
    "preferred-label" : "Kiruna",
    "type" : "municipality",
    "start-position" : 742,
    "end-position" : 748,
    "concept-id" : "biN6_UiL_Qob",
    "matched-string" : "Kiruna",
    "annotation-id" : 6
  }, {
    "preferred-label" : "Ystad",
    "type" : "municipality",
    "start-position" : 754,
    "end-position" : 759,
    "concept-id" : "hdYk_hnP_uju",
    "matched-string" : "Ystad",
    "annotation-id" : 7
  }, {
    "preferred-label" : "Deltid",
    "type" : "worktime-extent",
    "start-position" : 895,
    "end-position" : 904,
    "concept-id" : "947z_JGS_Uk2",
    "matched-string" : "20 timmar",
    "annotation-id" : 8
  }, {
    "preferred-label" : "Norrköping",
    "type" : "municipality",
    "start-position" : 1304,
    "end-position" : 1314,
    "concept-id" : "SYty_Yho_JAF",
    "matched-string" : "Norrköping",
    "annotation-id" : 9
  } ],
  "text" : "Extrajobb i Norrköpings krogliv\nExtrajobb i Norrköpings krogliv\n\n\nVi söker dig som vill vara en del av utelivet i stan och arbeta i en rolig och positiv miljö. Du är utåtriktad och tycker om att arbeta direkt mot gästerna för att skapa en trevlig stämning.\nVill du ha ett socialt utvecklande extrajobb där ingen kväll är den andra lik? Då har vi jobbet för dig.\nCherry Spelglädje söker blivande dealers i Norrköping. Vi erbjuder casino på barer, nattklubbar och restauranger.\nAtt arbeta som dealer är ett väldigt spännande jobb som lämpar sig bra för dig som studerar, behöver ett arbete till eller helt enkelt vill ha väldigt roligt på jobbet.\nEtt arbete hos oss är flexibelt då Cherry Spelglädje bedriver casino runt om i hela Sverige från Kiruna till Ystad. Så du kan med fördel ta med dig jobbet om du flyttar till annan ort.\nVi erbjuder minst fyra helgkvällar i månaden vilket motsvarar ca 20 timmar. Möjlighet att arbeta mer vardagar och helger utöver detta finns.\nIngen tidigare erfarenhet krävs, då vi lägger större vikt vid dina personliga egenskaper. Vi erbjuder lön enligt kollektivavtal samt möjlighet till provision.\n\n\nKänner du att detta är ett arbete som passar dig lämna du enkelt din ansökan på www.cherry.se/jobba/\n Om du har frågor kan du vända dig till Leona Brandt som är ansvarig i Norrköping. Du når Leona på 0739-80 16 36 eller leona.brandt@cherry.se. Kolla gärna in vår Instagram @cherryspelgladje"
}