{
  "meta" : {
    "jobad" : {
      "description" : {
        "requirements" : null,
        "needs" : null,
        "company_information" : null,
        "text_formatted" : "<p>BL Industri &amp; Privatstäd söker DIG</p><p>Är du energisk, ambitiös, lojal och som gillar ordning och reda? Då är du vår nästa lagspelare som vi söker till vårt lag!  </p><p>BL Industri &amp; Privatstäd är ett familjeföretag i Söderåkra som utför städning åt såväl privatpersoner som företag. Vi är etablerade i trakterna kring Torsås, Kalmar &amp; Karlskrona. </p><p>Tillsammans med våra kunder kommer vi överens om vilket arbete som ska utföras, för oss är det viktigt att du har en bra dialog med våra kunder. </p><p>Arbetsuppgifterna innehåller främst städning samt fönstertvätt. Arbetet sker primärt dagtid måndag- fredag, men helg &amp; kvällstid kan förekomma vid behov efter överenskommelse. </p><p>Körkort är ett krav samt behöver du behärska det svenska språket bra. </p><p>Du har stor frihet att styra dina arbetstider själv, det är därför viktigt för oss att du är ansvarstagande och ordningsam. </p><p>Ser du dig som vår nästa lagspelare? </p><p>Tveka då inte att söka! </p>",
        "conditions" : null,
        "text" : "BL Industri & Privatstäd söker DIG\nÄr du energisk, ambitiös, lojal och som gillar ordning och reda? Då är du vår nästa lagspelare som vi söker till vårt lag!  \nBL Industri & Privatstäd är ett familjeföretag i Söderåkra som utför städning åt såväl privatpersoner som företag. Vi är etablerade i trakterna kring Torsås, Kalmar & Karlskrona. \nTillsammans med våra kunder kommer vi överens om vilket arbete som ska utföras, för oss är det viktigt att du har en bra dialog med våra kunder. \nArbetsuppgifterna innehåller främst städning samt fönstertvätt. Arbetet sker primärt dagtid måndag- fredag, men helg & kvällstid kan förekomma vid behov efter överenskommelse. \nKörkort är ett krav samt behöver du behärska det svenska språket bra. \nDu har stor frihet att styra dina arbetstider själv, det är därför viktigt för oss att du är ansvarstagande och ordningsam. \nSer du dig som vår nästa lagspelare? \nTveka då inte att söka!"
      },
      "headline" : "Lokalvårdare sökes till familjeföretag i Torsås Kommun",
      "driving_license" : [ {
        "concept_id" : "VTK8_WRx_GcM",
        "label" : "B",
        "legacy_ams_taxonomy_id" : "3"
      } ],
      "employer" : {
        "email" : null,
        "phone_number" : null,
        "organization_number" : null,
        "name" : "Bl Industri&Privatstäd",
        "url" : null,
        "workplace" : "Bl Industri&Privatstäd"
      },
      "removed_date" : null,
      "logo_url" : null,
      "last_publication_date" : "2022-08-28T23:59:59",
      "number_of_vacancies" : 2,
      "occupation" : {
        "concept_id" : "dYo1_D8c_87U",
        "label" : "Städare/Lokalvårdare",
        "legacy_ams_taxonomy_id" : "464"
      },
      "occupation_group" : {
        "concept_id" : "Z6TY_xDf_Yup",
        "label" : "Städare",
        "legacy_ams_taxonomy_id" : "9111"
      },
      "employment_type" : {
        "concept_id" : "1paU_aCR_nGn",
        "label" : "Behovsanställning",
        "legacy_ams_taxonomy_id" : "4"
      },
      "webpage_url" : "https://arbetsformedlingen.se/platsbanken/annonser/26362576",
      "driving_license_required" : true,
      "application_contacts" : [ {
        "description" : null,
        "email" : "Bl.stadpartner@telia.com",
        "telephone" : "0709421879",
        "name" : "Lena  Birgersson",
        "contact_type" : null
      } ],
      "duration" : {
        "concept_id" : null,
        "label" : null,
        "legacy_ams_taxonomy_id" : null
      },
      "nice_to_have" : {
        "education_level" : [ ],
        "work_experiences" : [ ],
        "skills" : [ ],
        "education" : [ ],
        "languages" : [ ]
      },
      "application_details" : {
        "via_af" : false,
        "email" : "Bl.stadpartner@telia.com",
        "other" : null,
        "reference" : null,
        "url" : null,
        "information" : null
      },
      "source_type" : "VIA_ANNONSERA",
      "application_deadline" : "2022-08-28T23:59:59",
      "external_id" : null,
      "workplace_address" : {
        "coordinates" : [ 16.06311142709686, 56.45911847133181 ],
        "city" : "Söderåkra",
        "postcode" : "38550",
        "municipality" : "Torsås",
        "region_concept_id" : "9QUH_2bb_6Np",
        "region" : "Kalmar län",
        "country_code" : "199",
        "region_code" : "08",
        "municipality_concept_id" : "wYFb_q7w_Nnh",
        "country_concept_id" : "i46j_HmG_v64",
        "municipality_code" : "0834",
        "street_address" : "Törnlycke 120",
        "country" : "Sverige"
      },
      "id" : "26362576",
      "experience_required" : false,
      "working_hours_type" : {
        "concept_id" : null,
        "label" : null,
        "legacy_ams_taxonomy_id" : null
      },
      "access" : null,
      "timestamp" : 1659084050296,
      "must_have" : {
        "education_level" : [ ],
        "work_experiences" : [ ],
        "skills" : [ ],
        "education" : [ ],
        "languages" : [ {
          "concept_id" : "zSLA_vw2_FXN",
          "weight" : 10,
          "label" : "Svenska",
          "legacy_ams_taxonomy_id" : "502"
        } ]
      },
      "occupation_field" : {
        "concept_id" : "whao_Q6A_ScE",
        "label" : "Sanering och renhållning",
        "legacy_ams_taxonomy_id" : "12"
      },
      "scope_of_work" : {
        "min" : 0,
        "max" : null
      },
      "salary_type" : {
        "concept_id" : "oG8G_9cW_nRf",
        "label" : "Fast månads- vecko- eller timlön",
        "legacy_ams_taxonomy_id" : "1"
      },
      "removed" : false,
      "salary_description" : null,
      "access_to_own_car" : false,
      "publication_date" : "2022-07-29T10:40:50"
    },
    "name" : "Lokalvårdare sökes till familjeföretag i Torsås Kommun",
    "user" : "kristof.fischer"
  },
  "sha1" : "17115e602f565cd0cdd78f840789cb7603e408ea",
  "annotations" : [ {
    "preferred-label" : "Städare/Lokalvårdare",
    "sentiment" : "MUST_HAVE",
    "type" : "occupation-name",
    "start-position" : 0,
    "end-position" : 12,
    "concept-id" : "dYo1_D8c_87U",
    "matched-string" : "lokalvårdare",
    "annotation-id" : 0
  }, {
    "preferred-label" : "Torsås",
    "type" : "municipality",
    "start-position" : 41,
    "end-position" : 47,
    "concept-id" : "wYFb_q7w_Nnh",
    "matched-string" : "Torsås",
    "annotation-id" : 2
  }, {
    "preferred-label" : "ansvara för städning",
    "sentiment" : "MUST_HAVE",
    "type" : "esco-skill",
    "start-position" : 577,
    "end-position" : 585,
    "concept-id" : "2pc1_7xW_uYA",
    "matched-string" : "städning",
    "annotation-id" : 3
  }, {
    "preferred-label" : "Fönsterputsning",
    "sentiment" : "MUST_HAVE",
    "type" : "skill",
    "start-position" : 591,
    "end-position" : 603,
    "concept-id" : "BQPp_SQs_dtc",
    "matched-string" : "fönstertvätt",
    "annotation-id" : 4
  }, {
    "preferred-label" : "B",
    "sentiment" : "MUST_HAVE",
    "type" : "driving-licence",
    "start-position" : 718,
    "end-position" : 725,
    "concept-id" : "VTK8_WRx_GcM",
    "matched-string" : "Körkort",
    "annotation-id" : 5
  }, {
    "preferred-label" : "Svenska",
    "sentiment" : "MUST_HAVE",
    "type" : "language",
    "start-position" : 767,
    "end-position" : 782,
    "concept-id" : "zSLA_vw2_FXN",
    "matched-string" : "svenska språket",
    "annotation-id" : 1
  }, {
    "preferred-label" : "visa ansvarstagande",
    "sentiment" : "MUST_HAVE",
    "type" : "esco-skill",
    "start-position" : 882,
    "end-position" : 896,
    "concept-id" : "bcRp_hxV_f5G",
    "matched-string" : "ansvarstagande",
    "annotation-id" : 6
  } ],
  "text" : "Lokalvårdare sökes till familjeföretag i Torsås Kommun\nBL Industri & Privatstäd söker DIG\nÄr du energisk, ambitiös, lojal och som gillar ordning och reda? Då är du vår nästa lagspelare som vi söker till vårt lag!  \nBL Industri & Privatstäd är ett familjeföretag i Söderåkra som utför städning åt såväl privatpersoner som företag. Vi är etablerade i trakterna kring Torsås, Kalmar & Karlskrona. \nTillsammans med våra kunder kommer vi överens om vilket arbete som ska utföras, för oss är det viktigt att du har en bra dialog med våra kunder. \nArbetsuppgifterna innehåller främst städning samt fönstertvätt. Arbetet sker primärt dagtid måndag- fredag, men helg & kvällstid kan förekomma vid behov efter överenskommelse. \nKörkort är ett krav samt behöver du behärska det svenska språket bra. \nDu har stor frihet att styra dina arbetstider själv, det är därför viktigt för oss att du är ansvarstagande och ordningsam. \nSer du dig som vår nästa lagspelare? \nTveka då inte att söka!"
}