{
  "meta" : {
    "jobad" : {
      "description" : {
        "requirements" : null,
        "needs" : null,
        "company_information" : null,
        "text_formatted" : "Vi söker besiktningstekniker!\n\nSom besiktningstekniker jobbar du med att besikta fordon och kontrollerar att de uppfyller uppställda miljö- och säkerhetskrav utifrån ett digitalt protokoll. Du får ett arbete som lägger stort fokus på att skapa nya kontakter inom branschen samt service och säkerhet. Det är ett ansvarsfullt och noggrant arbete med tidvis högt tempo då det är vänte kunder, det är därför viktigt att kunna vara flexibel och se till att alla kunder är nöjda. Du kommer att arbeta dels självständigt men och i team tillsammans med övriga kollegor. Tjänsten kommer att vara på heltid måndag – fredag med goda möjligheter till arbeta övertid.\r\n\r\nVi söker dig\nSom är motiverad, engagerad och van vid att arbeta under ett högt tempo. Du bör även ha tidigare fordonskunskap via arbetserfarenheter eventuellt utbildning.\nVi ser gärna att du har ett stort tekniskt intresse och trivs att arbeta med människor. Du har en positiv inställning och tycker om att samarbeta med dina kollegor.\n\nVi söker dig som:\n• Service intresse\n• B-körkort utan begränsningar\n• Teknisk fordonskunskap\n• Grundläggande datakunskaper\nMeriterande: Tillgång till egen bil. Språkkunskaper utöver svenska och engelska.\n\nOm oss:\nAura personal tror på människor och att alla som vill kan. Våra år i branschen har gjort oss övertygade om att många fler kan skapa sin egen framgång bara någon ser dem och ger dem chansen. Vårt fokus ligger på att hitta just de som vill utvecklas och se möjligheter. Aura personal vill hjälpa dig i din utveckling genom att erbjuda Aura Academy. Det är en kostnadsfri utbildning inom lager, verkstad samt heta arbeten. För mer information besök gärna vår hemsida eller kontakt oss!",
        "conditions" : "Heltid\r\nHeltid",
        "text" : "Vi söker besiktningstekniker!\n\nSom besiktningstekniker jobbar du med att besikta fordon och kontrollerar att de uppfyller uppställda miljö- och säkerhetskrav utifrån ett digitalt protokoll. Du får ett arbete som lägger stort fokus på att skapa nya kontakter inom branschen samt service och säkerhet. Det är ett ansvarsfullt och noggrant arbete med tidvis högt tempo då det är vänte kunder, det är därför viktigt att kunna vara flexibel och se till att alla kunder är nöjda. Du kommer att arbeta dels självständigt men och i team tillsammans med övriga kollegor. Tjänsten kommer att vara på heltid måndag – fredag med goda möjligheter till arbeta övertid.\r\n\r\nVi söker dig\nSom är motiverad, engagerad och van vid att arbeta under ett högt tempo. Du bör även ha tidigare fordonskunskap via arbetserfarenheter eventuellt utbildning.\nVi ser gärna att du har ett stort tekniskt intresse och trivs att arbeta med människor. Du har en positiv inställning och tycker om att samarbeta med dina kollegor.\n\nVi söker dig som:\n• Service intresse\n• B-körkort utan begränsningar\n• Teknisk fordonskunskap\n• Grundläggande datakunskaper\nMeriterande: Tillgång till egen bil. Språkkunskaper utöver svenska och engelska.\n\nOm oss:\nAura personal tror på människor och att alla som vill kan. Våra år i branschen har gjort oss övertygade om att många fler kan skapa sin egen framgång bara någon ser dem och ger dem chansen. Vårt fokus ligger på att hitta just de som vill utvecklas och se möjligheter. Aura personal vill hjälpa dig i din utveckling genom att erbjuda Aura Academy. Det är en kostnadsfri utbildning inom lager, verkstad samt heta arbeten. För mer information besök gärna vår hemsida eller kontakt oss!"
      },
      "headline" : "Besiktningstekniker till vår kund i Strängnäs!",
      "driving_license" : null,
      "employer" : {
        "email" : null,
        "phone_number" : null,
        "organization_number" : "5593283020",
        "name" : "Aura Personal AB",
        "url" : "https://www.aurapersonal.se/",
        "workplace" : "Aura Personal AB"
      },
      "removed_date" : null,
      "logo_url" : "https://www.arbetsformedlingen.se/rest/arbetsgivare/rest/af/v3/organisation/5593283020/logotyper/logo.png",
      "last_publication_date" : "2022-08-03T23:59:59",
      "number_of_vacancies" : 1,
      "occupation" : {
        "concept_id" : "2Wq4_Wed_tBz",
        "label" : "Besiktningstekniker, bilprovning",
        "legacy_ams_taxonomy_id" : "624"
      },
      "occupation_group" : {
        "concept_id" : "nuXg_Wjc_JPd",
        "label" : "Säkerhetsinspektörer m.fl.",
        "legacy_ams_taxonomy_id" : "3354"
      },
      "employment_type" : {
        "concept_id" : "PFZr_Syz_cUq",
        "label" : "Vanlig anställning",
        "legacy_ams_taxonomy_id" : "1"
      },
      "webpage_url" : "https://arbetsformedlingen.se/platsbanken/annonser/26291465",
      "driving_license_required" : false,
      "application_contacts" : [ {
        "description" : "Karl Larsson",
        "email" : null,
        "telephone" : "072-041 40 06",
        "name" : null,
        "contact_type" : null
      } ],
      "duration" : {
        "concept_id" : "a7uU_j21_mkL",
        "label" : "Tills vidare",
        "legacy_ams_taxonomy_id" : "1"
      },
      "nice_to_have" : {
        "education_level" : [ ],
        "work_experiences" : [ ],
        "skills" : [ ],
        "education" : [ ],
        "languages" : [ ]
      },
      "application_details" : {
        "via_af" : false,
        "email" : null,
        "other" : null,
        "reference" : null,
        "url" : "https://aurapersonal.zerolime.se/show.aspx?src=AMS&id=9F1E2C95-CB69-4D6C-B39A-EF404A76C977",
        "information" : null
      },
      "source_type" : "VIA_PLATSBANKEN_DXA",
      "application_deadline" : "2022-08-03T23:59:59",
      "external_id" : "46-559328-3020-000000143555B51BF4",
      "workplace_address" : {
        "coordinates" : [ 17.03212, 59.377453 ],
        "city" : null,
        "postcode" : null,
        "municipality" : "Strängnäs",
        "region_concept_id" : "s93u_BEb_sx2",
        "region" : "Södermanlands län",
        "country_code" : "199",
        "region_code" : "04",
        "municipality_concept_id" : "shnD_RiE_RKL",
        "country_concept_id" : "i46j_HmG_v64",
        "municipality_code" : "0486",
        "street_address" : null,
        "country" : "Sverige"
      },
      "id" : "26291465",
      "experience_required" : true,
      "working_hours_type" : {
        "concept_id" : "6YE1_gAC_R2G",
        "label" : "Heltid",
        "legacy_ams_taxonomy_id" : "1"
      },
      "access" : null,
      "timestamp" : 1656942310766,
      "must_have" : {
        "education_level" : [ ],
        "work_experiences" : [ {
          "concept_id" : "2Wq4_Wed_tBz",
          "weight" : 10,
          "label" : "Besiktningstekniker, bilprovning",
          "legacy_ams_taxonomy_id" : "624"
        } ],
        "skills" : [ ],
        "education" : [ ],
        "languages" : [ ]
      },
      "occupation_field" : {
        "concept_id" : "E7hm_BLq_fqZ",
        "label" : "Säkerhet och bevakning",
        "legacy_ams_taxonomy_id" : "17"
      },
      "scope_of_work" : {
        "min" : 100,
        "max" : 100
      },
      "salary_type" : {
        "concept_id" : "oG8G_9cW_nRf",
        "label" : "Fast månads- vecko- eller timlön",
        "legacy_ams_taxonomy_id" : "1"
      },
      "removed" : false,
      "salary_description" : "Fast lön",
      "access_to_own_car" : false,
      "publication_date" : "2022-07-04T15:45:10"
    },
    "name" : "Besiktningstekniker till vår kund i Strängnäs!",
    "user" : "hannes"
  },
  "sha1" : "0a10e6c60ac6ce6679e6e68fa3d281bddcec2c1f",
  "annotations" : [ {
    "preferred-label" : "Besiktningstekniker",
    "sentiment" : "MUST_HAVE",
    "type" : "keyword",
    "start-position" : 0,
    "end-position" : 19,
    "concept-id" : "ifu8_Sui_fUM",
    "matched-string" : "besiktningstekniker",
    "annotation-id" : 0
  }, {
    "preferred-label" : "Strängnäs",
    "type" : "municipality",
    "start-position" : 36,
    "end-position" : 45,
    "concept-id" : "shnD_RiE_RKL",
    "matched-string" : "Strängnäs",
    "annotation-id" : 8
  }, {
    "preferred-label" : "Besiktningstekniker",
    "sentiment" : "MUST_HAVE",
    "type" : "keyword",
    "start-position" : 56,
    "end-position" : 75,
    "concept-id" : "ifu8_Sui_fUM",
    "matched-string" : "besiktningstekniker",
    "annotation-id" : 1
  }, {
    "preferred-label" : "Besiktningstekniker",
    "sentiment" : "MUST_HAVE",
    "type" : "keyword",
    "start-position" : 82,
    "end-position" : 101,
    "concept-id" : "ifu8_Sui_fUM",
    "matched-string" : "besiktningstekniker",
    "annotation-id" : 2
  }, {
    "preferred-label" : "visa ansvarstagande",
    "type" : "esco-skill",
    "start-position" : 358,
    "end-position" : 370,
    "concept-id" : "bcRp_hxV_f5G",
    "matched-string" : "ansvarsfullt",
    "annotation-id" : 9
  }, {
    "preferred-label" : "noggrannhet",
    "type" : "esco-skill",
    "start-position" : 375,
    "end-position" : 383,
    "concept-id" : "mrsW_EkL_KRD",
    "matched-string" : "noggrant",
    "annotation-id" : 10
  }, {
    "preferred-label" : "arbeta självständigt",
    "type" : "esco-skill",
    "start-position" : 535,
    "end-position" : 541,
    "concept-id" : "NyFu_HHd_zhz",
    "matched-string" : "arbeta",
    "annotation-id" : 12
  }, {
    "preferred-label" : "arbeta självständigt",
    "type" : "esco-skill",
    "start-position" : 547,
    "end-position" : 560,
    "concept-id" : "NyFu_HHd_zhz",
    "matched-string" : "självständigt",
    "annotation-id" : 11
  }, {
    "preferred-label" : "Heltid",
    "type" : "worktime-extent",
    "start-position" : 637,
    "end-position" : 643,
    "concept-id" : "6YE1_gAC_R2G",
    "matched-string" : "heltid",
    "annotation-id" : 13
  }, {
    "preferred-label" : "samarbeta med kolleger",
    "type" : "esco-skill",
    "start-position" : 1012,
    "end-position" : 1025,
    "concept-id" : "X15R_797_q62",
    "matched-string" : "samarbeta med",
    "annotation-id" : 14
  }, {
    "preferred-label" : "samarbeta med kolleger",
    "type" : "esco-skill",
    "start-position" : 1031,
    "end-position" : 1039,
    "concept-id" : "X15R_797_q62",
    "matched-string" : "kollegor",
    "annotation-id" : 15
  }, {
    "preferred-label" : "B",
    "type" : "driving-licence",
    "start-position" : 1081,
    "end-position" : 1090,
    "concept-id" : "VTK8_WRx_GcM",
    "matched-string" : "B-körkort",
    "annotation-id" : 16
  }, {
    "preferred-label" : "Svenska",
    "sentiment" : "MUST_HAVE",
    "type" : "language",
    "start-position" : 1224,
    "end-position" : 1231,
    "concept-id" : "zSLA_vw2_FXN",
    "matched-string" : "svenska",
    "annotation-id" : 3
  }, {
    "preferred-label" : "Engelska",
    "sentiment" : "MUST_HAVE",
    "type" : "language",
    "start-position" : 1236,
    "end-position" : 1244,
    "concept-id" : "NVxJ_hLg_TYS",
    "matched-string" : "engelska",
    "annotation-id" : 4
  } ],
  "text" : "Besiktningstekniker till vår kund i Strängnäs!\nVi söker besiktningstekniker!\n\nSom besiktningstekniker jobbar du med att besikta fordon och kontrollerar att de uppfyller uppställda miljö- och säkerhetskrav utifrån ett digitalt protokoll. Du får ett arbete som lägger stort fokus på att skapa nya kontakter inom branschen samt service och säkerhet. Det är ett ansvarsfullt och noggrant arbete med tidvis högt tempo då det är vänte kunder, det är därför viktigt att kunna vara flexibel och se till att alla kunder är nöjda. Du kommer att arbeta dels självständigt men och i team tillsammans med övriga kollegor. Tjänsten kommer att vara på heltid måndag – fredag med goda möjligheter till arbeta övertid.\r\n\r\nVi söker dig\nSom är motiverad, engagerad och van vid att arbeta under ett högt tempo. Du bör även ha tidigare fordonskunskap via arbetserfarenheter eventuellt utbildning.\nVi ser gärna att du har ett stort tekniskt intresse och trivs att arbeta med människor. Du har en positiv inställning och tycker om att samarbeta med dina kollegor.\n\nVi söker dig som:\n• Service intresse\n• B-körkort utan begränsningar\n• Teknisk fordonskunskap\n• Grundläggande datakunskaper\nMeriterande: Tillgång till egen bil. Språkkunskaper utöver svenska och engelska.\n\nOm oss:\nAura personal tror på människor och att alla som vill kan. Våra år i branschen har gjort oss övertygade om att många fler kan skapa sin egen framgång bara någon ser dem och ger dem chansen. Vårt fokus ligger på att hitta just de som vill utvecklas och se möjligheter. Aura personal vill hjälpa dig i din utveckling genom att erbjuda Aura Academy. Det är en kostnadsfri utbildning inom lager, verkstad samt heta arbeten. För mer information besök gärna vår hemsida eller kontakt oss!"
}