{
  "meta" : {
    "jobad" : {
      "description" : {
        "requirements" : null,
        "needs" : null,
        "company_information" : null,
        "text_formatted" : "Sektionen för mötesstöd och resor, RK Service, Förvaltningsavdelningen\nVill du arbeta med att utveckla framtidens arbetsplats tillsammans med kunniga kollegor där din främsta kompetens är inom teknik och digitala möten? Om du är lyhörd och trivs med att arbeta både operativt och administrativt på en händelserik arbetsplats, då kan du vara vår nya kollega.\n\nDin arbetsdag. Sveriges morgondag.\nRegeringskansliet är en mötesintensiv verksamhet med fokus på digitala möten. I rollen som tekniker är du med om att driva den utvecklingen framåt och skapa möjligheter för klimatsmarta lösningar. Vi söker dig som med ett professionellt bemötande kan vara ett stöd till användare inför, under och efter möten. Stödet gäller främst rådgivning av lämplig digital utrustning för varje specifikt tillfälle och lämplig lokal för detta. Inför större möten kommer du också att ha internationella kontakter med tekniker i andra länder för att säkerställa den tekniska lösningen för mötet.\n\nI arbetsuppgifterna ingår det också att felsöka, uppdatera och uppgradera konferensteknik liksom att ge användarna utbildning i hur den används. Arbetet är både operativt och administrativt. Det här innebär att du i rollen behöver kunna planera för och sköta montering av teknisk utrustning, arbeta med inköp och felanmälan av teknisk utrustning men även att du kan vara kontaktperson gentemot våra avtalsleverantörer. Du kommer också att bistå som sakkunnig vid upphandlingar och hantera fakturaunderlag. I din roll deltar du också i uppdrag och projekt för sektionen Mötesstöd och resor och du medverkar i och utvecklar samarbeten inom sektionen, inom enheten och inom Förvaltningsavdelningen i övrigt.\n\nLäs mer om vår verksamhet på www.regeringen.se.\n\nDin bakgrund\nVi söker dig som har en gymnasieexamen, om du har vidareutbildning inom ljud och bild är det meriterande. Du som söker det här arbetet har minst två års erfarenhet av liknande arbetsuppgifter och du har teknisk kompetens inom konferensrumsteknik, digital teknik samt ljud och bild. Vidare ser vi gärna att du har kunskaper om och erfarenhet av att utbilda inom teknikområdet. Om du har kunskaper i digitala plattformar ex. Skype, Zoom, Webex eller teams är det meriterande. Har du grundläggande kunskap om upphandling, avtal och avrop är det också meriterande. \n\nDina egenskaper\nFör att bli framgångsrik i rollen krävs att du är strukturerad och kan organisera arbetet på ett effektivt sätt. Du är flexibel och kan lätt anpassa dig till ändrade omständigheter, du ser möjligheter i förändringar och bidrar till utveckling av verksamheten. Du är lojal och har en positiv inställning. Rollen kräver att du är serviceinriktad och tillmötesgående och har intresse, vilja och förmåga att hjälpa andra samt skapa goda relationer. Du tycker om att ta ansvar för dina arbetsuppgifter.\nStor vikt kommer att läggas vid personliga egenskaper.\n\n\nÖvrigt\nTjänsten är en tillsvidareanställning. Regeringskansliet tillämpar sex månaders provanställning.\nBefattningen är placerad i säkerhetsklass och en säkerhetsprövning med registerkontroll kommer att genomföras innan beslut om anställning fattas. Du måste vara svensk medborgare, men får gärna ha utländsk bakgrund.\n\n\nÄr du intresserad?\nVill du veta mer om befattningen, kontakta sektionschef Jonas Lindqvist från 8 augusti på 08-405 42 17. Fackliga kontaktpersoner är Johan Strokirk för Saco, Peter Backéus för ST och Lars Vestberg för Seko. Du når dem via Regeringskansliets växel, 08-405 10 00. Vi tar gärna emot samtal från dig som är intresserad av jobbet men vi tackar nej till dig som säljer annonser och rekryteringstjänster.\n\nVälkommen att registrera din ansökan i vårt rekryteringsverktyg senast den 14 augusti.\n\n\n\nRegeringskansliets uppdrag är att stödja regeringen i dess arbete med att styra Sverige och förverkliga sin politik. Här arbetar 4 700 personer, varav 600 utomlands. Regeringskansliet välkomnar sökande med olika bakgrund och erfarenheter. Vi ser jämställdhet och mångfald som en styrka och tillgång och vi arbetar aktivt för att vara en arbetsplats fri från diskriminering. Förvaltningsavdelningen ansvarar för myndighetsövergripande frågor som förändrings- och förnyelsearbete, ekonomi, arbetsgivarfrågor, kompetensförsörjning, kommunikation, säkerhet, it, bibliotek, arkiv och registratur samt för den gemensamma servicen i Regeringskansliet.",
        "conditions" : "Heltid/\r\nEj specificerat",
        "text" : "Sektionen för mötesstöd och resor, RK Service, Förvaltningsavdelningen\nVill du arbeta med att utveckla framtidens arbetsplats tillsammans med kunniga kollegor där din främsta kompetens är inom teknik och digitala möten? Om du är lyhörd och trivs med att arbeta både operativt och administrativt på en händelserik arbetsplats, då kan du vara vår nya kollega.\n\nDin arbetsdag. Sveriges morgondag.\nRegeringskansliet är en mötesintensiv verksamhet med fokus på digitala möten. I rollen som tekniker är du med om att driva den utvecklingen framåt och skapa möjligheter för klimatsmarta lösningar. Vi söker dig som med ett professionellt bemötande kan vara ett stöd till användare inför, under och efter möten. Stödet gäller främst rådgivning av lämplig digital utrustning för varje specifikt tillfälle och lämplig lokal för detta. Inför större möten kommer du också att ha internationella kontakter med tekniker i andra länder för att säkerställa den tekniska lösningen för mötet.\n\nI arbetsuppgifterna ingår det också att felsöka, uppdatera och uppgradera konferensteknik liksom att ge användarna utbildning i hur den används. Arbetet är både operativt och administrativt. Det här innebär att du i rollen behöver kunna planera för och sköta montering av teknisk utrustning, arbeta med inköp och felanmälan av teknisk utrustning men även att du kan vara kontaktperson gentemot våra avtalsleverantörer. Du kommer också att bistå som sakkunnig vid upphandlingar och hantera fakturaunderlag. I din roll deltar du också i uppdrag och projekt för sektionen Mötesstöd och resor och du medverkar i och utvecklar samarbeten inom sektionen, inom enheten och inom Förvaltningsavdelningen i övrigt.\n\nLäs mer om vår verksamhet på www.regeringen.se.\n\nDin bakgrund\nVi söker dig som har en gymnasieexamen, om du har vidareutbildning inom ljud och bild är det meriterande. Du som söker det här arbetet har minst två års erfarenhet av liknande arbetsuppgifter och du har teknisk kompetens inom konferensrumsteknik, digital teknik samt ljud och bild. Vidare ser vi gärna att du har kunskaper om och erfarenhet av att utbilda inom teknikområdet. Om du har kunskaper i digitala plattformar ex. Skype, Zoom, Webex eller teams är det meriterande. Har du grundläggande kunskap om upphandling, avtal och avrop är det också meriterande. \n\nDina egenskaper\nFör att bli framgångsrik i rollen krävs att du är strukturerad och kan organisera arbetet på ett effektivt sätt. Du är flexibel och kan lätt anpassa dig till ändrade omständigheter, du ser möjligheter i förändringar och bidrar till utveckling av verksamheten. Du är lojal och har en positiv inställning. Rollen kräver att du är serviceinriktad och tillmötesgående och har intresse, vilja och förmåga att hjälpa andra samt skapa goda relationer. Du tycker om att ta ansvar för dina arbetsuppgifter.\nStor vikt kommer att läggas vid personliga egenskaper.\n\n\nÖvrigt\nTjänsten är en tillsvidareanställning. Regeringskansliet tillämpar sex månaders provanställning.\nBefattningen är placerad i säkerhetsklass och en säkerhetsprövning med registerkontroll kommer att genomföras innan beslut om anställning fattas. Du måste vara svensk medborgare, men får gärna ha utländsk bakgrund.\n\n\nÄr du intresserad?\nVill du veta mer om befattningen, kontakta sektionschef Jonas Lindqvist från 8 augusti på 08-405 42 17. Fackliga kontaktpersoner är Johan Strokirk för Saco, Peter Backéus för ST och Lars Vestberg för Seko. Du når dem via Regeringskansliets växel, 08-405 10 00. Vi tar gärna emot samtal från dig som är intresserad av jobbet men vi tackar nej till dig som säljer annonser och rekryteringstjänster.\n\nVälkommen att registrera din ansökan i vårt rekryteringsverktyg senast den 14 augusti.\n\n\n\nRegeringskansliets uppdrag är att stödja regeringen i dess arbete med att styra Sverige och förverkliga sin politik. Här arbetar 4 700 personer, varav 600 utomlands. Regeringskansliet välkomnar sökande med olika bakgrund och erfarenheter. Vi ser jämställdhet och mångfald som en styrka och tillgång och vi arbetar aktivt för att vara en arbetsplats fri från diskriminering. Förvaltningsavdelningen ansvarar för myndighetsövergripande frågor som förändrings- och förnyelsearbete, ekonomi, arbetsgivarfrågor, kompetensförsörjning, kommunikation, säkerhet, it, bibliotek, arkiv och registratur samt för den gemensamma servicen i Regeringskansliet."
      },
      "headline" : "Tekniker - bidra till ett effektivt mötesstöd",
      "driving_license" : null,
      "employer" : {
        "email" : null,
        "phone_number" : null,
        "organization_number" : "2021003831",
        "name" : "Regeringskansliet",
        "url" : "http://www.regeringen.se",
        "workplace" : "Regeringskansliet"
      },
      "removed_date" : null,
      "logo_url" : "https://www.arbetsformedlingen.se/rest/arbetsgivare/rest/af/v3/organisation/2021003831/logotyper/logo.png",
      "last_publication_date" : "2022-08-14T23:59:59",
      "number_of_vacancies" : 1,
      "occupation" : {
        "concept_id" : "fzwa_vK3_4c3",
        "label" : "Konferenstekniker",
        "legacy_ams_taxonomy_id" : "4134"
      },
      "occupation_group" : {
        "concept_id" : "4BsK_q2C_sCL",
        "label" : "Ljus-, ljud- och scentekniker",
        "legacy_ams_taxonomy_id" : "3522"
      },
      "employment_type" : {
        "concept_id" : "PFZr_Syz_cUq",
        "label" : "Vanlig anställning",
        "legacy_ams_taxonomy_id" : "1"
      },
      "webpage_url" : "https://arbetsformedlingen.se/platsbanken/annonser/26301437",
      "driving_license_required" : false,
      "application_contacts" : [ ],
      "duration" : {
        "concept_id" : "a7uU_j21_mkL",
        "label" : "Tills vidare",
        "legacy_ams_taxonomy_id" : "1"
      },
      "nice_to_have" : {
        "education_level" : [ ],
        "work_experiences" : [ ],
        "skills" : [ ],
        "education" : [ ],
        "languages" : [ ]
      },
      "application_details" : {
        "via_af" : false,
        "email" : null,
        "other" : null,
        "reference" : null,
        "url" : "https://web103.reachmee.com/ext/I003/584/main?site=19&validator=60988ba3b4a8fb26b1d3dbdf5e1a013e&lang=SE&rmpage=job&rmjob=10031",
        "information" : null
      },
      "source_type" : "VIA_PLATSBANKEN_DXA",
      "application_deadline" : "2022-08-14T23:59:59",
      "external_id" : "46-202100-3831-10031",
      "workplace_address" : {
        "coordinates" : [ 18.06858, 59.329323 ],
        "city" : null,
        "postcode" : null,
        "municipality" : "Stockholm",
        "region_concept_id" : "CifL_Rzy_Mku",
        "region" : "Stockholms län",
        "country_code" : "199",
        "region_code" : "01",
        "municipality_concept_id" : "AvNB_uwa_6n6",
        "country_concept_id" : "i46j_HmG_v64",
        "municipality_code" : "0180",
        "street_address" : null,
        "country" : "Sverige"
      },
      "id" : "26301437",
      "experience_required" : true,
      "working_hours_type" : {
        "concept_id" : "6YE1_gAC_R2G",
        "label" : "Heltid",
        "legacy_ams_taxonomy_id" : "1"
      },
      "access" : null,
      "timestamp" : 1657117770509,
      "must_have" : {
        "education_level" : [ ],
        "work_experiences" : [ {
          "concept_id" : "fzwa_vK3_4c3",
          "weight" : 10,
          "label" : "Konferenstekniker",
          "legacy_ams_taxonomy_id" : "4134"
        } ],
        "skills" : [ ],
        "education" : [ ],
        "languages" : [ ]
      },
      "occupation_field" : {
        "concept_id" : "9puE_nYg_crq",
        "label" : "Kultur, media, design",
        "legacy_ams_taxonomy_id" : "11"
      },
      "scope_of_work" : {
        "min" : 100,
        "max" : 100
      },
      "salary_type" : {
        "concept_id" : "oG8G_9cW_nRf",
        "label" : "Fast månads- vecko- eller timlön",
        "legacy_ams_taxonomy_id" : "1"
      },
      "removed" : false,
      "salary_description" : "Individuell lönesättning",
      "access_to_own_car" : false,
      "publication_date" : "2022-07-18T00:00:00"
    },
    "name" : "Tekniker - bidra till ett effektivt mötesstöd",
    "user" : "hannes"
  },
  "sha1" : "0a8eed1b005c5f104034f25a5ad94a289bf68a61",
  "annotations" : [ {
    "preferred-label" : "Konferenstekniker",
    "type" : "occupation-name",
    "start-position" : 0,
    "end-position" : 8,
    "concept-id" : "fzwa_vK3_4c3",
    "matched-string" : "Tekniker",
    "annotation-id" : 11
  }, {
    "preferred-label" : "Resor",
    "sentiment" : "MUST_HAVE",
    "type" : "keyword",
    "start-position" : 74,
    "end-position" : 79,
    "concept-id" : "mj44_gFW_1X5",
    "matched-string" : "resor",
    "annotation-id" : 0
  }, {
    "preferred-label" : "utföra administrativt arbete",
    "type" : "esco-skill",
    "start-position" : 300,
    "end-position" : 306,
    "concept-id" : "2x13_sLi_EzG",
    "matched-string" : "arbeta",
    "annotation-id" : 7
  }, {
    "preferred-label" : "utföra administrativt arbete",
    "type" : "esco-skill",
    "start-position" : 326,
    "end-position" : 340,
    "concept-id" : "2x13_sLi_EzG",
    "matched-string" : "administrativt",
    "annotation-id" : 6
  }, {
    "preferred-label" : "Sverige",
    "type" : "country",
    "start-position" : 420,
    "end-position" : 428,
    "concept-id" : "i46j_HmG_v64",
    "matched-string" : "Sveriges",
    "annotation-id" : 8
  }, {
    "preferred-label" : "göra felsökning",
    "type" : "esco-skill",
    "start-position" : 1062,
    "end-position" : 1069,
    "concept-id" : "HqC8_fVY_ACM",
    "matched-string" : "felsöka",
    "annotation-id" : 9
  }, {
    "preferred-label" : "Konferenstekniker",
    "type" : "occupation-name",
    "start-position" : 1096,
    "end-position" : 1111,
    "concept-id" : "fzwa_vK3_4c3",
    "matched-string" : "konferensteknik",
    "annotation-id" : 10
  }, {
    "preferred-label" : "utföra administrativt arbete",
    "type" : "esco-skill",
    "start-position" : 1167,
    "end-position" : 1174,
    "concept-id" : "2x13_sLi_EzG",
    "matched-string" : "Arbetet",
    "annotation-id" : 13
  }, {
    "preferred-label" : "utföra administrativt arbete",
    "type" : "esco-skill",
    "start-position" : 1197,
    "end-position" : 1211,
    "concept-id" : "2x13_sLi_EzG",
    "matched-string" : "administrativt",
    "annotation-id" : 12
  }, {
    "preferred-label" : "inköpare",
    "type" : "esco-occupation",
    "start-position" : 1314,
    "end-position" : 1330,
    "concept-id" : "3R2K_KLr_UJ5",
    "matched-string" : "arbeta med inköp",
    "annotation-id" : 14
  }, {
    "preferred-label" : "Resor",
    "sentiment" : "MUST_HAVE",
    "type" : "keyword",
    "start-position" : 1605,
    "end-position" : 1610,
    "concept-id" : "mj44_gFW_1X5",
    "matched-string" : "resor",
    "annotation-id" : 1
  }, {
    "preferred-label" : "Gymnasial utbildning, 3 år",
    "type" : "sun-education-level-2",
    "start-position" : 1814,
    "end-position" : 1828,
    "concept-id" : "7wEe_uui_q7S",
    "matched-string" : "gymnasieexamen",
    "annotation-id" : 15
  }, {
    "preferred-label" : "2-4 års erfarenhet",
    "type" : "occupation-experience-year",
    "start-position" : 1929,
    "end-position" : 1953,
    "concept-id" : "RWA2_uu6_udD",
    "matched-string" : "minst två års erfarenhet",
    "annotation-id" : 16
  }, {
    "preferred-label" : "Upphandling",
    "sentiment" : "MUST_HAVE",
    "type" : "keyword",
    "start-position" : 2296,
    "end-position" : 2307,
    "concept-id" : "zPkP_5oY_WvW",
    "matched-string" : "upphandling",
    "annotation-id" : 2
  }, {
    "preferred-label" : "Tillsvidareanställning (inkl. eventuell provanställning)",
    "type" : "employment-type",
    "start-position" : 2946,
    "end-position" : 2968,
    "concept-id" : "kpPX_CNN_gDU",
    "matched-string" : "tillsvidareanställning",
    "annotation-id" : 17
  }, {
    "preferred-label" : "Data/IT",
    "sentiment" : "MUST_HAVE",
    "type" : "occupation-field",
    "start-position" : 4306,
    "end-position" : 4308,
    "concept-id" : "apaJ_2ja_LuF",
    "matched-string" : "it",
    "annotation-id" : 5
  } ],
  "text" : "Tekniker - bidra till ett effektivt mötesstöd\nSektionen för mötesstöd och resor, RK Service, Förvaltningsavdelningen\nVill du arbeta med att utveckla framtidens arbetsplats tillsammans med kunniga kollegor där din främsta kompetens är inom teknik och digitala möten? Om du är lyhörd och trivs med att arbeta både operativt och administrativt på en händelserik arbetsplats, då kan du vara vår nya kollega.\n\nDin arbetsdag. Sveriges morgondag.\nRegeringskansliet är en mötesintensiv verksamhet med fokus på digitala möten. I rollen som tekniker är du med om att driva den utvecklingen framåt och skapa möjligheter för klimatsmarta lösningar. Vi söker dig som med ett professionellt bemötande kan vara ett stöd till användare inför, under och efter möten. Stödet gäller främst rådgivning av lämplig digital utrustning för varje specifikt tillfälle och lämplig lokal för detta. Inför större möten kommer du också att ha internationella kontakter med tekniker i andra länder för att säkerställa den tekniska lösningen för mötet.\n\nI arbetsuppgifterna ingår det också att felsöka, uppdatera och uppgradera konferensteknik liksom att ge användarna utbildning i hur den används. Arbetet är både operativt och administrativt. Det här innebär att du i rollen behöver kunna planera för och sköta montering av teknisk utrustning, arbeta med inköp och felanmälan av teknisk utrustning men även att du kan vara kontaktperson gentemot våra avtalsleverantörer. Du kommer också att bistå som sakkunnig vid upphandlingar och hantera fakturaunderlag. I din roll deltar du också i uppdrag och projekt för sektionen Mötesstöd och resor och du medverkar i och utvecklar samarbeten inom sektionen, inom enheten och inom Förvaltningsavdelningen i övrigt.\n\nLäs mer om vår verksamhet på www.regeringen.se.\n\nDin bakgrund\nVi söker dig som har en gymnasieexamen, om du har vidareutbildning inom ljud och bild är det meriterande. Du som söker det här arbetet har minst två års erfarenhet av liknande arbetsuppgifter och du har teknisk kompetens inom konferensrumsteknik, digital teknik samt ljud och bild. Vidare ser vi gärna att du har kunskaper om och erfarenhet av att utbilda inom teknikområdet. Om du har kunskaper i digitala plattformar ex. Skype, Zoom, Webex eller teams är det meriterande. Har du grundläggande kunskap om upphandling, avtal och avrop är det också meriterande. \n\nDina egenskaper\nFör att bli framgångsrik i rollen krävs att du är strukturerad och kan organisera arbetet på ett effektivt sätt. Du är flexibel och kan lätt anpassa dig till ändrade omständigheter, du ser möjligheter i förändringar och bidrar till utveckling av verksamheten. Du är lojal och har en positiv inställning. Rollen kräver att du är serviceinriktad och tillmötesgående och har intresse, vilja och förmåga att hjälpa andra samt skapa goda relationer. Du tycker om att ta ansvar för dina arbetsuppgifter.\nStor vikt kommer att läggas vid personliga egenskaper.\n\n\nÖvrigt\nTjänsten är en tillsvidareanställning. Regeringskansliet tillämpar sex månaders provanställning.\nBefattningen är placerad i säkerhetsklass och en säkerhetsprövning med registerkontroll kommer att genomföras innan beslut om anställning fattas. Du måste vara svensk medborgare, men får gärna ha utländsk bakgrund.\n\n\nÄr du intresserad?\nVill du veta mer om befattningen, kontakta sektionschef Jonas Lindqvist från 8 augusti på 08-405 42 17. Fackliga kontaktpersoner är Johan Strokirk för Saco, Peter Backéus för ST och Lars Vestberg för Seko. Du når dem via Regeringskansliets växel, 08-405 10 00. Vi tar gärna emot samtal från dig som är intresserad av jobbet men vi tackar nej till dig som säljer annonser och rekryteringstjänster.\n\nVälkommen att registrera din ansökan i vårt rekryteringsverktyg senast den 14 augusti.\n\n\n\nRegeringskansliets uppdrag är att stödja regeringen i dess arbete med att styra Sverige och förverkliga sin politik. Här arbetar 4 700 personer, varav 600 utomlands. Regeringskansliet välkomnar sökande med olika bakgrund och erfarenheter. Vi ser jämställdhet och mångfald som en styrka och tillgång och vi arbetar aktivt för att vara en arbetsplats fri från diskriminering. Förvaltningsavdelningen ansvarar för myndighetsövergripande frågor som förändrings- och förnyelsearbete, ekonomi, arbetsgivarfrågor, kompetensförsörjning, kommunikation, säkerhet, it, bibliotek, arkiv och registratur samt för den gemensamma servicen i Regeringskansliet."
}