{
  "meta" : {
    "dataset-id" : "myh-spreadsheet-2021",
    "type" : "education-description",
    "dataset-document-id" : "YH01511",
    "user" : "kristof.fischer"
  },
  "sha1" : "0f14b7bd5039d63a71b26e7d587b0ff53758e5c2",
  "annotations" : [ {
    "preferred-label" : "Trädgårdsmästare, anläggning",
    "type" : "occupation-name",
    "start-position" : 71,
    "end-position" : 87,
    "concept-id" : "JZur_dmf_EPY",
    "matched-string" : "trädgårdsmästare",
    "annotation-id" : 4
  }, {
    "preferred-label" : "Hållbar utveckling",
    "sentiment" : "OFFERED",
    "type" : "keyword",
    "start-position" : 179,
    "end-position" : 197,
    "concept-id" : "RKw3_zWW_1pf",
    "matched-string" : "hållbar utveckling",
    "annotation-id" : 0
  }, {
    "preferred-label" : "Trädgårdsmästare, anläggning",
    "type" : "occupation-name",
    "start-position" : 328,
    "end-position" : 344,
    "concept-id" : "JZur_dmf_EPY",
    "matched-string" : "trädgårdsmästare",
    "annotation-id" : 5
  }, {
    "preferred-label" : "Trädgårdsmästare, anläggning",
    "type" : "occupation-name",
    "start-position" : 592,
    "end-position" : 608,
    "concept-id" : "JZur_dmf_EPY",
    "matched-string" : "trädgårdsmästare",
    "annotation-id" : 6
  }, {
    "preferred-label" : "Sverige",
    "type" : "country",
    "start-position" : 687,
    "end-position" : 694,
    "concept-id" : "i46j_HmG_v64",
    "matched-string" : "Sverige",
    "annotation-id" : 7
  }, {
    "preferred-label" : "Trädgårdsanläggare/Trädgårdsanläggningsarbetare",
    "sentiment" : "OFFERED",
    "type" : "occupation-name",
    "start-position" : 742,
    "end-position" : 760,
    "concept-id" : "FvY5_W17_kDE",
    "matched-string" : "trädgårdsanläggare",
    "annotation-id" : 2
  }, {
    "preferred-label" : "Trädgårdsarbetare/Plantskolearbetare, trädgård",
    "sentiment" : "OFFERED",
    "type" : "occupation-name",
    "start-position" : 762,
    "end-position" : 779,
    "concept-id" : "geNh_Yah_F3J",
    "matched-string" : "trädgårdsarbetare",
    "annotation-id" : 3
  }, {
    "preferred-label" : "Trädgårdsmästare, anläggning",
    "type" : "occupation-name",
    "start-position" : 781,
    "end-position" : 797,
    "concept-id" : "JZur_dmf_EPY",
    "matched-string" : "Trädgårdsmästare",
    "annotation-id" : 8
  }, {
    "preferred-label" : "Heltid",
    "type" : "worktime-extent",
    "start-position" : 894,
    "end-position" : 911,
    "concept-id" : "6YE1_gAC_R2G",
    "matched-string" : "Heltidsutbildning",
    "annotation-id" : 9
  }, {
    "preferred-label" : "Distansarbete",
    "type" : "work-place-environment",
    "start-position" : 915,
    "end-position" : 922,
    "concept-id" : "uwzb_xcR_vxS",
    "matched-string" : "distans",
    "annotation-id" : 10
  }, {
    "preferred-label" : "Nynäshamn",
    "type" : "municipality",
    "start-position" : 964,
    "end-position" : 973,
    "concept-id" : "37UU_T7x_oxG",
    "matched-string" : "Nynäshamn",
    "annotation-id" : 11
  }, {
    "preferred-label" : "Högskoleutbildning, yrkesinriktad, 2 år",
    "sentiment" : "OFFERED",
    "type" : "sun-education-level-3",
    "start-position" : 1064,
    "end-position" : 1076,
    "concept-id" : "zdKB_pTL_HMS",
    "matched-string" : "Utbildningen",
    "annotation-id" : 12
  } ],
  "text" : "De gröna frågorna lyfts allt mer i samhället och branschen efterfrågar trädgårdsmästare med kompetens att underhålla, utveckla och möta nya utmaningar. Detta för att vi ska få en hållbar utveckling både ekologiskt och socialt. Vårt samhälle behöver kunna lösa alla de prövningar som kommer med ökande klimatförändringar.    Som trädgårdsmästare leder, planerar och utvecklar trädgårdar och parkmiljöer med fokus på funktion, hållbarhet och estetik. Detta med ett hållbart klimat i åtanke. Du kan arbeta i parker, trädgårdar, på kyrkogårdar, bostadsgårdar samt gröna gatu- och vägområden. Som trädgårdsmästare kan du också vara placerad på plantskolor, växthus och plantbutiker runt om i Sverige. Utbildningen leder till anställningar som:    Trädgårdsanläggare  Trädgårdsarbetare  Trädgårdsmästare (privat eller offentligt)    Om utbildningen  Startdatum: augusti 2021  Slutdatum: juni 2023    Heltidsutbildning på distans med ett antal seminarieträffar på Campus Nynäshamn varje termin.   1 veckas studier motsvarar 5 YH-poäng, totalt 80 veckor ger 400 poäng.    Utbildningen varar i ca 2 år och leder till en yrkeshögskoleexamen, motsvarande SeQF-  nivå 5.    Utbildningsplatser: 20    Utbildningen är avgiftsfri och studiestödsberättigande."
}