{
  "meta" : {
    "jobad" : {
      "description" : {
        "requirements" : null,
        "needs" : null,
        "company_information" : null,
        "text_formatted" : "<p><strong>Om jobbet</strong></p><p>SunRoof är ett av de snabbast växande techbolagen i hela Europa. Vi erbjuder en intressant och spännande arbetsplats inom en framtidsbransch. På SunRoof sätter vi anställda först och har stora ambitioner gällande förnybar energi. Nu söker vi dig som vill bidra till samhällets positiva utveckling genom att leda installation av våra marknadsledande tak och fasader. Vi söker en självgående, ambitiös och kommunikativ Area manager som vill åka med på SunRoofs enorma tillväxtresa.</p><p><strong>OM ROLLEN</strong></p><p>Vi söker nu efter en Area manager som ska leda våra projekt för solcellstak i specifika regioner. Det innebär att ansvara för våra  byggprojektledare, ha en projektöversikt och driva utvecklingsarbetet framåt. Du är med och rekryterar för din region och delegerar de projekt vi har inne till våra projektledare. Du bevakar lönsamheten i projekten, nyttjar UE kontakter och optimerar våran operativa byggavdelning.</p><p> </p><p><strong>Primära arbetsuppgifter</strong></p><ul><li>Att bygga upp en välfungerande organisation/avdelningar inom sin region inom bygg.</li><li>Att ansvara och genomföra byggprojektsplanering, produktionsstyrning och ekonomikontroll.</li><li>Upprätta samt följa upp produktionstidsplaner</li><li>Leda, motivera och följa upp sina kollegor och deras moment inom projekten</li><li>Vara hands on när det kommer till stora byggprojekt</li><li>Att införskaffa och samordna entreprenörer samt egen personal för att driva projekten framåt</li><li>Att säkerställa kvalitén och lönsamhet på våra projekt i regionen</li><li>Samordning med logistik och inköp</li></ul><p><br></p><p><br></p><p><strong>Kravbild</strong></p><ul><li>Besitter en relevant arbetslivserfarenhet inom liknande roll tex. projektchef, platschef etc. med minst 5 års erfarenhet.</li><li>Har mycket goda kunskaper inom byggkonstruktion</li><li>Förmåga att leda projekt och projektledarna </li><li>Ha ett bygg-ekonomiskt sinne och känsla för helheten </li><li>Strukturerad och inte rädd för att sätta processer (gärna ha implementerat nya system) </li><li>Får gärna jobbat i ett företag med liknande storlek med snabb rörelse och många projekt.</li><li>Högskola / eller universitetsutbildning inom bygg eller ingenjör är meriterande men inte ett krav.</li><li>Har god kunskap gällande AMA, BAS U, BAS P och entreprenadjuridik</li><li>Har en entreprenöriell förståelse</li></ul><p><br></p><p><br></p><p>Känner du att beskrivningen passar bra in på dig? Då får du gärna söka snarast då vi kommer tillsätta tjänsten så fort vi har hittat rätt kandidat.</p><p><br></p><p><br></p><ul><li><br></li></ul><p><br></p>",
        "conditions" : null,
        "text" : "Om jobbet\nSunRoof är ett av de snabbast växande techbolagen i hela Europa. Vi erbjuder en intressant och spännande arbetsplats inom en framtidsbransch. På SunRoof sätter vi anställda först och har stora ambitioner gällande förnybar energi. Nu söker vi dig som vill bidra till samhällets positiva utveckling genom att leda installation av våra marknadsledande tak och fasader. Vi söker en självgående, ambitiös och kommunikativ Area manager som vill åka med på SunRoofs enorma tillväxtresa.\nOM ROLLEN\nVi söker nu efter en Area manager som ska leda våra projekt för solcellstak i specifika regioner. Det innebär att ansvara för våra  byggprojektledare, ha en projektöversikt och driva utvecklingsarbetet framåt. Du är med och rekryterar för din region och delegerar de projekt vi har inne till våra projektledare. Du bevakar lönsamheten i projekten, nyttjar UE kontakter och optimerar våran operativa byggavdelning.\n \nPrimära arbetsuppgifter\nAtt bygga upp en välfungerande organisation/avdelningar inom sin region inom bygg.\nAtt ansvara och genomföra byggprojektsplanering, produktionsstyrning och ekonomikontroll.\nUpprätta samt följa upp produktionstidsplaner\nLeda, motivera och följa upp sina kollegor och deras moment inom projekten\nVara hands on när det kommer till stora byggprojekt\nAtt införskaffa och samordna entreprenörer samt egen personal för att driva projekten framåt\nAtt säkerställa kvalitén och lönsamhet på våra projekt i regionen\nSamordning med logistik och inköp\n\n\n\n\n\nKravbild\nBesitter en relevant arbetslivserfarenhet inom liknande roll tex. projektchef, platschef etc. med minst 5 års erfarenhet.\nHar mycket goda kunskaper inom byggkonstruktion\nFörmåga att leda projekt och projektledarna \nHa ett bygg-ekonomiskt sinne och känsla för helheten \nStrukturerad och inte rädd för att sätta processer (gärna ha implementerat nya system) \nFår gärna jobbat i ett företag med liknande storlek med snabb rörelse och många projekt.\nHögskola / eller universitetsutbildning inom bygg eller ingenjör är meriterande men inte ett krav.\nHar god kunskap gällande AMA, BAS U, BAS P och entreprenadjuridik\nHar en entreprenöriell förståelse\n\n\n\n\n\nKänner du att beskrivningen passar bra in på dig? Då får du gärna söka snarast då vi kommer tillsätta tjänsten så fort vi har hittat rätt kandidat."
      },
      "headline" : "Arbetschef/projektchef bygg",
      "driving_license" : [ {
        "concept_id" : "VTK8_WRx_GcM",
        "label" : "B",
        "legacy_ams_taxonomy_id" : "3"
      } ],
      "employer" : {
        "email" : null,
        "phone_number" : null,
        "organization_number" : "5568768716",
        "name" : "Sunroof Sverige AB",
        "url" : "https://sunroof.se/",
        "workplace" : "Sunroof Sverige AB"
      },
      "removed_date" : null,
      "logo_url" : "https://www.arbetsformedlingen.se/rest/arbetsgivare/rest/af/v3/arbetsplatser/87387976/logotyper/logo.png",
      "last_publication_date" : "2022-08-20T23:59:59",
      "number_of_vacancies" : 1,
      "occupation" : {
        "concept_id" : "pTTz_5DC_itW",
        "label" : "Projektledare, bygg och anläggning",
        "legacy_ams_taxonomy_id" : "7649"
      },
      "occupation_group" : {
        "concept_id" : "XeBP_nMe_pXx",
        "label" : "Civilingenjörsyrken inom bygg och anläggning",
        "legacy_ams_taxonomy_id" : "2142"
      },
      "employment_type" : {
        "concept_id" : "PFZr_Syz_cUq",
        "label" : "Vanlig anställning",
        "legacy_ams_taxonomy_id" : "1"
      },
      "webpage_url" : "https://arbetsformedlingen.se/platsbanken/annonser/26345300",
      "driving_license_required" : true,
      "application_contacts" : [ ],
      "duration" : {
        "concept_id" : "a7uU_j21_mkL",
        "label" : "Tills vidare",
        "legacy_ams_taxonomy_id" : "1"
      },
      "nice_to_have" : {
        "education_level" : [ ],
        "work_experiences" : [ {
          "concept_id" : "pTTz_5DC_itW",
          "weight" : 5,
          "label" : "Projektledare, bygg och anläggning",
          "legacy_ams_taxonomy_id" : "7649"
        } ],
        "skills" : [ ],
        "education" : [ ],
        "languages" : [ ]
      },
      "application_details" : {
        "via_af" : false,
        "email" : null,
        "other" : null,
        "reference" : null,
        "url" : "https://system.erecruiter.pl/FormTemplates/RecruitmentForm.aspx?WebID=0435035f3cd8482996c67bc3b71b1dec",
        "information" : null
      },
      "source_type" : "VIA_ANNONSERA",
      "application_deadline" : "2022-08-20T23:59:59",
      "external_id" : null,
      "workplace_address" : {
        "coordinates" : [ 11.984475219441178, 57.712734641470064 ],
        "city" : "GÖTEBORG",
        "postcode" : "40530",
        "municipality" : "Göteborg",
        "region_concept_id" : "zdoY_6u5_Krt",
        "region" : "Västra Götalands län",
        "country_code" : "199",
        "region_code" : "14",
        "municipality_concept_id" : "PVZL_BQT_XtL",
        "country_concept_id" : "i46j_HmG_v64",
        "municipality_code" : "1480",
        "street_address" : "Göteborg",
        "country" : "Sverige"
      },
      "id" : "26345300",
      "experience_required" : true,
      "working_hours_type" : {
        "concept_id" : "6YE1_gAC_R2G",
        "label" : "Heltid",
        "legacy_ams_taxonomy_id" : "1"
      },
      "access" : null,
      "timestamp" : 1658410185320,
      "must_have" : {
        "education_level" : [ ],
        "work_experiences" : [ ],
        "skills" : [ ],
        "education" : [ ],
        "languages" : [ ]
      },
      "occupation_field" : {
        "concept_id" : "j7Cq_ZJe_GkT",
        "label" : "Bygg och anläggning",
        "legacy_ams_taxonomy_id" : "2"
      },
      "scope_of_work" : {
        "min" : 0,
        "max" : 100
      },
      "salary_type" : {
        "concept_id" : "oG8G_9cW_nRf",
        "label" : "Fast månads- vecko- eller timlön",
        "legacy_ams_taxonomy_id" : "1"
      },
      "removed" : false,
      "salary_description" : null,
      "access_to_own_car" : true,
      "publication_date" : "2022-07-21T15:29:45"
    },
    "name" : "Arbetschef/projektchef bygg",
    "user" : "hannes"
  },
  "sha1" : "64ac9022152fbd4ef4167615eeb82f63e156876a",
  "annotations" : [ {
    "preferred-label" : "Bygg",
    "type" : "occupation-collection",
    "start-position" : 23,
    "end-position" : 27,
    "concept-id" : "ja7J_P8X_YC9",
    "matched-string" : "bygg",
    "annotation-id" : 6
  }, {
    "preferred-label" : "Manager",
    "sentiment" : "MUST_HAVE",
    "type" : "occupation-name",
    "start-position" : 460,
    "end-position" : 467,
    "concept-id" : "X9jv_K2b_m48",
    "matched-string" : "manager",
    "annotation-id" : 0
  }, {
    "preferred-label" : "Manager",
    "sentiment" : "MUST_HAVE",
    "type" : "occupation-name",
    "start-position" : 554,
    "end-position" : 561,
    "concept-id" : "X9jv_K2b_m48",
    "matched-string" : "manager",
    "annotation-id" : 1
  }, {
    "preferred-label" : "Byggprojektledare",
    "sentiment" : "MUST_HAVE",
    "type" : "keyword",
    "start-position" : 660,
    "end-position" : 677,
    "concept-id" : "adED_XCr_Rrm",
    "matched-string" : "byggprojektledare",
    "annotation-id" : 2
  }, {
    "preferred-label" : "Bygg",
    "type" : "occupation-collection",
    "start-position" : 1045,
    "end-position" : 1049,
    "concept-id" : "ja7J_P8X_YC9",
    "matched-string" : "bygg",
    "annotation-id" : 7
  }, {
    "preferred-label" : "Personal",
    "sentiment" : "MUST_HAVE",
    "type" : "keyword",
    "start-position" : 1367,
    "end-position" : 1375,
    "concept-id" : "HVxM_6MS_y1c",
    "matched-string" : "personal",
    "annotation-id" : 3
  }, {
    "preferred-label" : "Logistik",
    "sentiment" : "MUST_HAVE",
    "type" : "skill",
    "start-position" : 1488,
    "end-position" : 1496,
    "concept-id" : "yXmf_iKi_7ci",
    "matched-string" : "logistik",
    "annotation-id" : 4
  }, {
    "preferred-label" : "platschef",
    "type" : "esco-occupation",
    "start-position" : 1600,
    "end-position" : 1609,
    "concept-id" : "7ffE_ZTJ_Mix",
    "matched-string" : "platschef",
    "annotation-id" : 8
  }, {
    "preferred-label" : "5 års erfarenhet eller mer",
    "type" : "occupation-experience-year",
    "start-position" : 1619,
    "end-position" : 1641,
    "concept-id" : "8CVf_zRX_aZj",
    "matched-string" : "minst 5 års erfarenhet",
    "annotation-id" : 9
  }, {
    "preferred-label" : "Universitets- eller högskoleutbildning",
    "type" : "sni-level-5",
    "start-position" : 1967,
    "end-position" : 2006,
    "concept-id" : "4Hs1_pdH_C7k",
    "matched-string" : "Högskola / eller universitetsutbildning",
    "annotation-id" : 10
  }, {
    "preferred-label" : "Bygg",
    "type" : "occupation-collection",
    "start-position" : 2012,
    "end-position" : 2016,
    "concept-id" : "ja7J_P8X_YC9",
    "matched-string" : "bygg",
    "annotation-id" : 11
  }, {
    "preferred-label" : "Ingenjörer och tekniker",
    "type" : "ssyk-level-3",
    "start-position" : 2023,
    "end-position" : 2031,
    "concept-id" : "DhEP_m8M_qoi",
    "matched-string" : "ingenjör",
    "annotation-id" : 12
  }, {
    "preferred-label" : "Entreprenadjuridik",
    "sentiment" : "MUST_HAVE",
    "type" : "skill",
    "start-position" : 2113,
    "end-position" : 2131,
    "concept-id" : "nF6J_MNc_ZxS",
    "matched-string" : "entreprenadjuridik",
    "annotation-id" : 5
  } ],
  "text" : "Arbetschef/projektchef bygg\nOm jobbet\nSunRoof är ett av de snabbast växande techbolagen i hela Europa. Vi erbjuder en intressant och spännande arbetsplats inom en framtidsbransch. På SunRoof sätter vi anställda först och har stora ambitioner gällande förnybar energi. Nu söker vi dig som vill bidra till samhällets positiva utveckling genom att leda installation av våra marknadsledande tak och fasader. Vi söker en självgående, ambitiös och kommunikativ Area manager som vill åka med på SunRoofs enorma tillväxtresa.\nOM ROLLEN\nVi söker nu efter en Area manager som ska leda våra projekt för solcellstak i specifika regioner. Det innebär att ansvara för våra  byggprojektledare, ha en projektöversikt och driva utvecklingsarbetet framåt. Du är med och rekryterar för din region och delegerar de projekt vi har inne till våra projektledare. Du bevakar lönsamheten i projekten, nyttjar UE kontakter och optimerar våran operativa byggavdelning.\n \nPrimära arbetsuppgifter\nAtt bygga upp en välfungerande organisation/avdelningar inom sin region inom bygg.\nAtt ansvara och genomföra byggprojektsplanering, produktionsstyrning och ekonomikontroll.\nUpprätta samt följa upp produktionstidsplaner\nLeda, motivera och följa upp sina kollegor och deras moment inom projekten\nVara hands on när det kommer till stora byggprojekt\nAtt införskaffa och samordna entreprenörer samt egen personal för att driva projekten framåt\nAtt säkerställa kvalitén och lönsamhet på våra projekt i regionen\nSamordning med logistik och inköp\n\n\n\n\n\nKravbild\nBesitter en relevant arbetslivserfarenhet inom liknande roll tex. projektchef, platschef etc. med minst 5 års erfarenhet.\nHar mycket goda kunskaper inom byggkonstruktion\nFörmåga att leda projekt och projektledarna \nHa ett bygg-ekonomiskt sinne och känsla för helheten \nStrukturerad och inte rädd för att sätta processer (gärna ha implementerat nya system) \nFår gärna jobbat i ett företag med liknande storlek med snabb rörelse och många projekt.\nHögskola / eller universitetsutbildning inom bygg eller ingenjör är meriterande men inte ett krav.\nHar god kunskap gällande AMA, BAS U, BAS P och entreprenadjuridik\nHar en entreprenöriell förståelse\n\n\n\n\n\nKänner du att beskrivningen passar bra in på dig? Då får du gärna söka snarast då vi kommer tillsätta tjänsten så fort vi har hittat rätt kandidat."
}