{
  "meta" : {
    "jobad" : {
      "description" : {
        "requirements" : null,
        "needs" : null,
        "company_information" : null,
        "text_formatted" : "Är du driven och nyfiken på framtidens IT lösningar? Då kan du vara den vi söker!\n\nFuture Ordering är en arbetsgivare för dig som är nyfiken och tycker om att arbeta med ny-teknik, vill lära dig mer inom modern systemutveckling och tycker om problemlösning. Tycker du precis som oss om att arbeta flexibelt, disponera din arbetstid själv, dela med dig av dina kunskaper och lära dig av andra för att tillsammans nå mål som ett team? Bli en del i det Team som vill förändra hela gästupplevelsen när du beställer mat i alla former i hela världen. Jobba med att utveckla vår moln-plattform som är aktiv i över tio länder, två kontinenter och som hjälper varumärken som Circle-K och Max Hamburgers.\n\nVarför jobba på Future Ordering?\n- En rättvis och konkurrenskraftig lön\n- Trygg anställning med pensionssparande och pensionsplaner, privat sjukförsäkring och självförsörjningsförmåner\n- Flexibel arbetsplats med möjlighet att arbeta hemifrån och på plats i valfri kombination, beroende på din situation och preferenser\n- Träning på arbetstid och konkurrenskraftigt friskvårdsbidrag.\n- 30 dagars betald ledighet.\n- En samarbetskultur som uppmuntrar till nyfikenhet och ansvarstagande\n\nTjänsten hos oss innebär systemutvecklingsarbete tillsammans i ett team som följer modern systemutvecklings metodik.\r\n\r\nDin profil\nVi söker dig som har ett genuint intresse av modern teknik och drivs av att ligga i framkanten av modern utveckling. Vi ser att du som söker har god arbetsmoral och en vilja att ständigt utvecklas tillsammans med ditt team.\n\nKrav:\n* Du är problemlösande\n* Tycker om att lära dig nya saker\n* Avskräcks inte av förändring\n\nDet är meriterande om du:\n* Har mer än två års arbetserfarenhet inom området\n* Har erfarenhet av Microsoft Azure Clouds infrastruktur\n* Har erfarenhet av NET Core och/ellerNode.js\n* Erfarenhet av event- och köbaserad utveckling\n* Erfarenhet av Docker\n* Erfarenhet av React\n* Erfarenhet av att bygga distribuerade system\n\nStor vikt kommer att läggas vid personliga egenskaper.\n\nDenna rekryteringsprocess hanteras av ansvarig rekryterare/konsultchef Linda Vallerström. Du når Linda via mail på linda.vallerstrom@studentconsulting.com. Vi tillsätter tjänsterna så fort vi hittat rätt person för jobbet. Välkommen med din ansökan redan idag!\n\nOm företaget\nMångfaldigt prisbelönta StudentConsulting är ett av Skandinaviens största och ledande rekryterings- och bemanningsföretag med fokus på studenter, akademiker och yrkesutbildade. Tack vare ett stort nätverk och lång erfarenhet har vi rekryterat över 11 000 personer det senaste året. Vi erbjuder intressanta och utmanande tjänster på både hel- och deltid inom områden som IT, teknik, ekonomi, administration, HR, marknadsföring, kundtjänst, försäljning, industri, produktion, logistik och transport. Hitta din framtid på www.studentconsulting.se",
        "conditions" : "Tillsvidareanställning\r\nTillsvidare",
        "text" : "Är du driven och nyfiken på framtidens IT lösningar? Då kan du vara den vi söker!\n\nFuture Ordering är en arbetsgivare för dig som är nyfiken och tycker om att arbeta med ny-teknik, vill lära dig mer inom modern systemutveckling och tycker om problemlösning. Tycker du precis som oss om att arbeta flexibelt, disponera din arbetstid själv, dela med dig av dina kunskaper och lära dig av andra för att tillsammans nå mål som ett team? Bli en del i det Team som vill förändra hela gästupplevelsen när du beställer mat i alla former i hela världen. Jobba med att utveckla vår moln-plattform som är aktiv i över tio länder, två kontinenter och som hjälper varumärken som Circle-K och Max Hamburgers.\n\nVarför jobba på Future Ordering?\n- En rättvis och konkurrenskraftig lön\n- Trygg anställning med pensionssparande och pensionsplaner, privat sjukförsäkring och självförsörjningsförmåner\n- Flexibel arbetsplats med möjlighet att arbeta hemifrån och på plats i valfri kombination, beroende på din situation och preferenser\n- Träning på arbetstid och konkurrenskraftigt friskvårdsbidrag.\n- 30 dagars betald ledighet.\n- En samarbetskultur som uppmuntrar till nyfikenhet och ansvarstagande\n\nTjänsten hos oss innebär systemutvecklingsarbete tillsammans i ett team som följer modern systemutvecklings metodik.\r\n\r\nDin profil\nVi söker dig som har ett genuint intresse av modern teknik och drivs av att ligga i framkanten av modern utveckling. Vi ser att du som söker har god arbetsmoral och en vilja att ständigt utvecklas tillsammans med ditt team.\n\nKrav:\n* Du är problemlösande\n* Tycker om att lära dig nya saker\n* Avskräcks inte av förändring\n\nDet är meriterande om du:\n* Har mer än två års arbetserfarenhet inom området\n* Har erfarenhet av Microsoft Azure Clouds infrastruktur\n* Har erfarenhet av NET Core och/ellerNode.js\n* Erfarenhet av event- och köbaserad utveckling\n* Erfarenhet av Docker\n* Erfarenhet av React\n* Erfarenhet av att bygga distribuerade system\n\nStor vikt kommer att läggas vid personliga egenskaper.\n\nDenna rekryteringsprocess hanteras av ansvarig rekryterare/konsultchef Linda Vallerström. Du når Linda via mail på linda.vallerstrom@studentconsulting.com. Vi tillsätter tjänsterna så fort vi hittat rätt person för jobbet. Välkommen med din ansökan redan idag!\n\nOm företaget\nMångfaldigt prisbelönta StudentConsulting är ett av Skandinaviens största och ledande rekryterings- och bemanningsföretag med fokus på studenter, akademiker och yrkesutbildade. Tack vare ett stort nätverk och lång erfarenhet har vi rekryterat över 11 000 personer det senaste året. Vi erbjuder intressanta och utmanande tjänster på både hel- och deltid inom områden som IT, teknik, ekonomi, administration, HR, marknadsföring, kundtjänst, försäljning, industri, produktion, logistik och transport. Hitta din framtid på www.studentconsulting.se"
      },
      "headline" : "Systemutvecklare Future Ordering",
      "driving_license" : null,
      "employer" : {
        "email" : null,
        "phone_number" : null,
        "organization_number" : "5566747449",
        "name" : "Studentconsulting Sweden AB (Publ)",
        "url" : "www.studentconsulting.com",
        "workplace" : "StudentConsulting"
      },
      "removed_date" : null,
      "logo_url" : "https://www.arbetsformedlingen.se/rest/arbetsgivare/rest/af/v3/organisation/5566747449/logotyper/logo.png",
      "last_publication_date" : "2022-09-15T23:59:59",
      "number_of_vacancies" : 1,
      "occupation" : {
        "concept_id" : "CQse_CRd_snw",
        "label" : "Civilingenjör, systemutveckling",
        "legacy_ams_taxonomy_id" : "6509"
      },
      "occupation_group" : {
        "concept_id" : "DJh5_yyF_hEM",
        "label" : "Mjukvaru- och systemutvecklare m.fl.",
        "legacy_ams_taxonomy_id" : "2512"
      },
      "employment_type" : {
        "concept_id" : "PFZr_Syz_cUq",
        "label" : "Vanlig anställning",
        "legacy_ams_taxonomy_id" : "1"
      },
      "webpage_url" : "https://arbetsformedlingen.se/platsbanken/annonser/26385774",
      "driving_license_required" : false,
      "application_contacts" : [ {
        "description" : "Linda Vallerström",
        "email" : "linda.vallerstrom@studentconsulting.com",
        "telephone" : null,
        "name" : null,
        "contact_type" : null
      } ],
      "duration" : {
        "concept_id" : "a7uU_j21_mkL",
        "label" : "Tills vidare",
        "legacy_ams_taxonomy_id" : "1"
      },
      "nice_to_have" : {
        "education_level" : [ ],
        "work_experiences" : [ ],
        "skills" : [ ],
        "education" : [ ],
        "languages" : [ ]
      },
      "application_details" : {
        "via_af" : false,
        "email" : null,
        "other" : null,
        "reference" : null,
        "url" : "http://www.studentconsulting.com/sv/jobs/lulea/systemutvecklare-future-ordering/65686/?utm_source=af&utm_medium=sharedjob&utm_content=job65686",
        "information" : null
      },
      "source_type" : "VIA_PLATSBANKEN_DXA",
      "application_deadline" : "2022-09-15T23:59:59",
      "external_id" : "46-556674-7449-65686",
      "workplace_address" : {
        "coordinates" : [ 22.156702, 65.584816 ],
        "city" : null,
        "postcode" : null,
        "municipality" : "Luleå",
        "region_concept_id" : "9hXe_F4g_eTG",
        "region" : "Norrbottens län",
        "country_code" : "199",
        "region_code" : "25",
        "municipality_concept_id" : "CXbY_gui_14v",
        "country_concept_id" : "i46j_HmG_v64",
        "municipality_code" : "2580",
        "street_address" : null,
        "country" : "Sverige"
      },
      "id" : "26385774",
      "experience_required" : true,
      "working_hours_type" : {
        "concept_id" : "6YE1_gAC_R2G",
        "label" : "Heltid",
        "legacy_ams_taxonomy_id" : "1"
      },
      "access" : null,
      "timestamp" : 1659952814497,
      "must_have" : {
        "education_level" : [ ],
        "work_experiences" : [ {
          "concept_id" : "CQse_CRd_snw",
          "weight" : 10,
          "label" : "Civilingenjör, systemutveckling",
          "legacy_ams_taxonomy_id" : "6509"
        } ],
        "skills" : [ ],
        "education" : [ ],
        "languages" : [ ]
      },
      "occupation_field" : {
        "concept_id" : "apaJ_2ja_LuF",
        "label" : "Data/IT",
        "legacy_ams_taxonomy_id" : "3"
      },
      "scope_of_work" : {
        "min" : 100,
        "max" : 100
      },
      "salary_type" : {
        "concept_id" : "oG8G_9cW_nRf",
        "label" : "Fast månads- vecko- eller timlön",
        "legacy_ams_taxonomy_id" : "1"
      },
      "removed" : false,
      "salary_description" : "Fast lön",
      "access_to_own_car" : false,
      "publication_date" : "2022-08-08T12:00:14"
    },
    "name" : "Systemutvecklare Future Ordering",
    "user" : "hannes"
  },
  "sha1" : "b76503dd7531a1357cfd1f89510033201661306f",
  "annotations" : [ {
    "preferred-label" : "Systemutvecklare/Programmerare",
    "sentiment" : "MUST_HAVE",
    "type" : "occupation-name",
    "start-position" : 0,
    "end-position" : 16,
    "concept-id" : "fg7B_yov_smw",
    "matched-string" : "systemutvecklare",
    "annotation-id" : 0
  }, {
    "preferred-label" : "Data/IT",
    "sentiment" : "MUST_HAVE",
    "type" : "occupation-field",
    "start-position" : 72,
    "end-position" : 74,
    "concept-id" : "apaJ_2ja_LuF",
    "matched-string" : "it",
    "annotation-id" : 1
  }, {
    "preferred-label" : "systemutveckling",
    "sentiment" : "MUST_HAVE",
    "type" : "esco-skill",
    "start-position" : 244,
    "end-position" : 260,
    "concept-id" : "cm71_uwW_5zU",
    "matched-string" : "systemutveckling",
    "annotation-id" : 2
  }, {
    "preferred-label" : "Träning",
    "sentiment" : "MUST_HAVE",
    "type" : "keyword",
    "start-position" : 1050,
    "end-position" : 1057,
    "concept-id" : "n19Z_hzx_Apu",
    "matched-string" : "träning",
    "annotation-id" : 3
  }, {
    "preferred-label" : "visa nyfikenhet",
    "type" : "esco-skill",
    "start-position" : 1182,
    "end-position" : 1192,
    "concept-id" : "mbHa_NFf_vyf",
    "matched-string" : "nyfikenhet",
    "annotation-id" : 12
  }, {
    "preferred-label" : "visa ansvarstagande",
    "type" : "esco-skill",
    "start-position" : 1197,
    "end-position" : 1211,
    "concept-id" : "bcRp_hxV_f5G",
    "matched-string" : "ansvarstagande",
    "annotation-id" : 13
  }, {
    "preferred-label" : "2-4 års erfarenhet",
    "type" : "occupation-experience-year",
    "start-position" : 1704,
    "end-position" : 1728,
    "concept-id" : "RWA2_uu6_udD",
    "matched-string" : "två års arbetserfarenhet",
    "annotation-id" : 14
  }, {
    "preferred-label" : "Windows Azure, molnplattform",
    "type" : "skill",
    "start-position" : 1762,
    "end-position" : 1784,
    "concept-id" : "HKgZ_SWa_vn8",
    "matched-string" : "Microsoft Azure Clouds",
    "annotation-id" : 15
  }, {
    "preferred-label" : "Core-utvecklare",
    "type" : "keyword",
    "start-position" : 1819,
    "end-position" : 1827,
    "concept-id" : "uUz9_x1Z_w2e",
    "matched-string" : "NET Core",
    "annotation-id" : 16
  }, {
    "preferred-label" : "Node, exekveringsmiljö",
    "type" : "skill",
    "start-position" : 1837,
    "end-position" : 1844,
    "concept-id" : "McKJ_SG4_hCM",
    "matched-string" : "Node.js",
    "annotation-id" : 17
  }, {
    "preferred-label" : "Docker, container-plattform",
    "sentiment" : "MUST_HAVE",
    "type" : "skill",
    "start-position" : 1909,
    "end-position" : 1915,
    "concept-id" : "ZipR_ckJ_YQC",
    "matched-string" : "docker",
    "annotation-id" : 4
  }, {
    "preferred-label" : "Rekryterare/Rekryteringskonsult",
    "sentiment" : "MUST_HAVE",
    "type" : "occupation-name",
    "start-position" : 2089,
    "end-position" : 2100,
    "concept-id" : "QaQC_ozP_Bme",
    "matched-string" : "rekryterare",
    "annotation-id" : 5
  }, {
    "preferred-label" : "Data/IT",
    "sentiment" : "MUST_HAVE",
    "type" : "occupation-field",
    "start-position" : 2687,
    "end-position" : 2689,
    "concept-id" : "apaJ_2ja_LuF",
    "matched-string" : "it",
    "annotation-id" : 7
  }, {
    "preferred-label" : "Ekonomi",
    "sentiment" : "MUST_HAVE",
    "type" : "keyword",
    "start-position" : 2699,
    "end-position" : 2706,
    "concept-id" : "PW4f_bmT_new",
    "matched-string" : "ekonomi",
    "annotation-id" : 8
  }, {
    "preferred-label" : "Marknadsföring",
    "sentiment" : "MUST_HAVE",
    "type" : "sun-education-field-4",
    "start-position" : 2728,
    "end-position" : 2742,
    "concept-id" : "zTc5_e4U_Qsf",
    "matched-string" : "marknadsföring",
    "annotation-id" : 9
  }, {
    "preferred-label" : "Kundtjänst",
    "sentiment" : "MUST_HAVE",
    "type" : "skill",
    "start-position" : 2744,
    "end-position" : 2754,
    "concept-id" : "aMyW_hB7_TpU",
    "matched-string" : "kundtjänst",
    "annotation-id" : 10
  }, {
    "preferred-label" : "Logistik",
    "sentiment" : "MUST_HAVE",
    "type" : "skill",
    "start-position" : 2791,
    "end-position" : 2799,
    "concept-id" : "yXmf_iKi_7ci",
    "matched-string" : "logistik",
    "annotation-id" : 11
  } ],
  "text" : "Systemutvecklare Future Ordering\nÄr du driven och nyfiken på framtidens IT lösningar? Då kan du vara den vi söker!\n\nFuture Ordering är en arbetsgivare för dig som är nyfiken och tycker om att arbeta med ny-teknik, vill lära dig mer inom modern systemutveckling och tycker om problemlösning. Tycker du precis som oss om att arbeta flexibelt, disponera din arbetstid själv, dela med dig av dina kunskaper och lära dig av andra för att tillsammans nå mål som ett team? Bli en del i det Team som vill förändra hela gästupplevelsen när du beställer mat i alla former i hela världen. Jobba med att utveckla vår moln-plattform som är aktiv i över tio länder, två kontinenter och som hjälper varumärken som Circle-K och Max Hamburgers.\n\nVarför jobba på Future Ordering?\n- En rättvis och konkurrenskraftig lön\n- Trygg anställning med pensionssparande och pensionsplaner, privat sjukförsäkring och självförsörjningsförmåner\n- Flexibel arbetsplats med möjlighet att arbeta hemifrån och på plats i valfri kombination, beroende på din situation och preferenser\n- Träning på arbetstid och konkurrenskraftigt friskvårdsbidrag.\n- 30 dagars betald ledighet.\n- En samarbetskultur som uppmuntrar till nyfikenhet och ansvarstagande\n\nTjänsten hos oss innebär systemutvecklingsarbete tillsammans i ett team som följer modern systemutvecklings metodik.\r\n\r\nDin profil\nVi söker dig som har ett genuint intresse av modern teknik och drivs av att ligga i framkanten av modern utveckling. Vi ser att du som söker har god arbetsmoral och en vilja att ständigt utvecklas tillsammans med ditt team.\n\nKrav:\n* Du är problemlösande\n* Tycker om att lära dig nya saker\n* Avskräcks inte av förändring\n\nDet är meriterande om du:\n* Har mer än två års arbetserfarenhet inom området\n* Har erfarenhet av Microsoft Azure Clouds infrastruktur\n* Har erfarenhet av NET Core och/ellerNode.js\n* Erfarenhet av event- och köbaserad utveckling\n* Erfarenhet av Docker\n* Erfarenhet av React\n* Erfarenhet av att bygga distribuerade system\n\nStor vikt kommer att läggas vid personliga egenskaper.\n\nDenna rekryteringsprocess hanteras av ansvarig rekryterare/konsultchef Linda Vallerström. Du når Linda via mail på linda.vallerstrom@studentconsulting.com. Vi tillsätter tjänsterna så fort vi hittat rätt person för jobbet. Välkommen med din ansökan redan idag!\n\nOm företaget\nMångfaldigt prisbelönta StudentConsulting är ett av Skandinaviens största och ledande rekryterings- och bemanningsföretag med fokus på studenter, akademiker och yrkesutbildade. Tack vare ett stort nätverk och lång erfarenhet har vi rekryterat över 11 000 personer det senaste året. Vi erbjuder intressanta och utmanande tjänster på både hel- och deltid inom områden som IT, teknik, ekonomi, administration, HR, marknadsföring, kundtjänst, försäljning, industri, produktion, logistik och transport. Hitta din framtid på www.studentconsulting.se"
}