{
  "meta" : {
    "name" : "education-description",
    "dataset-id" : "myh-spreadsheet-2021",
    "dataset-document-id" : "YH00198",
    "user" : "kristof.fischer"
  },
  "sha1" : "446713ced84f2223b95d9ef872c1ca99180a42c6",
  "annotations" : [ {
    "preferred-label" : "socialpedagog",
    "sentiment" : "OFFERED",
    "type" : "esco-occupation",
    "start-position" : 3,
    "end-position" : 16,
    "concept-id" : "NUhh_NSS_itU",
    "matched-string" : "socialpedagog",
    "annotation-id" : 0
  }, {
    "preferred-label" : "Socialt arbete",
    "sentiment" : "OFFERED",
    "type" : "sun-education-field-3",
    "start-position" : 95,
    "end-position" : 109,
    "concept-id" : "t1wZ_E9z_Uz6",
    "matched-string" : "socialt arbete",
    "annotation-id" : 1
  }, {
    "preferred-label" : "socialpedagog",
    "sentiment" : "OFFERED",
    "type" : "esco-occupation",
    "start-position" : 114,
    "end-position" : 127,
    "concept-id" : "NUhh_NSS_itU",
    "matched-string" : "socialpedagog",
    "annotation-id" : 2
  }, {
    "preferred-label" : "socialpedagog",
    "sentiment" : "OFFERED",
    "type" : "esco-occupation",
    "start-position" : 286,
    "end-position" : 301,
    "concept-id" : "NUhh_NSS_itU",
    "matched-string" : "Socialpedagoger",
    "annotation-id" : 16
  }, {
    "preferred-label" : "socialpedagog",
    "sentiment" : "OFFERED",
    "type" : "esco-occupation",
    "start-position" : 428,
    "end-position" : 441,
    "concept-id" : "NUhh_NSS_itU",
    "matched-string" : "socialpedagog",
    "annotation-id" : 4
  }, {
    "preferred-label" : "socialpedagog",
    "sentiment" : "OFFERED",
    "type" : "esco-occupation",
    "start-position" : 663,
    "end-position" : 676,
    "concept-id" : "NUhh_NSS_itU",
    "matched-string" : "socialpedagog",
    "annotation-id" : 7
  }, {
    "preferred-label" : "Socionom",
    "type" : "occupation-name",
    "start-position" : 919,
    "end-position" : 929,
    "concept-id" : "aEF1_qeh_5Qe",
    "matched-string" : "socionomer",
    "annotation-id" : 19
  }, {
    "preferred-label" : "Pedagogik",
    "type" : "occupation-field",
    "start-position" : 931,
    "end-position" : 940,
    "concept-id" : "MVqp_eS8_kDZ",
    "matched-string" : "pedagoger",
    "annotation-id" : 18
  }, {
    "preferred-label" : "Poliser",
    "type" : "ssyk-level-3",
    "start-position" : 942,
    "end-position" : 947,
    "concept-id" : "4sGe_N4S_6vo",
    "matched-string" : "polis",
    "annotation-id" : 20
  }, {
    "preferred-label" : "Kriminalvården",
    "type" : "keyword",
    "start-position" : 949,
    "end-position" : 961,
    "concept-id" : "S84z_MKP_aV6",
    "matched-string" : "kriminalvård",
    "annotation-id" : 21
  }, {
    "preferred-label" : "Hälso- och sjukvård",
    "type" : "occupation-field",
    "start-position" : 966,
    "end-position" : 974,
    "concept-id" : "NYW6_mP6_vwf",
    "matched-string" : "sjukvård",
    "annotation-id" : 22
  }, {
    "preferred-label" : "Socialt arbete",
    "sentiment" : "OFFERED",
    "type" : "sun-education-field-3",
    "start-position" : 1036,
    "end-position" : 1050,
    "concept-id" : "t1wZ_E9z_Uz6",
    "matched-string" : "socialt arbete",
    "annotation-id" : 9
  }, {
    "preferred-label" : "Annan utbildning inom socialt arbete",
    "sentiment" : "OFFERED",
    "type" : "sun-education-field-4",
    "start-position" : 1145,
    "end-position" : 1186,
    "concept-id" : "kCNc_iUC_hh4",
    "matched-string" : "Utveckling, socialisation och livsvillkor",
    "annotation-id" : 23
  }, {
    "preferred-label" : "Annan utbildning i psykologi",
    "sentiment" : "OFFERED",
    "type" : "sun-education-field-4",
    "start-position" : 1220,
    "end-position" : 1282,
    "concept-id" : "BzfN_PaT_S9n",
    "matched-string" : "Psykisk ohälsa, psykiska funktionsnedsättningar, samsjuklighet",
    "annotation-id" : 24
  }, {
    "preferred-label" : "Social omsorgsutbildning, socialpedagogisk behandling",
    "sentiment" : "OFFERED",
    "type" : "sun-education-field-4",
    "start-position" : 1286,
    "end-position" : 1317,
    "concept-id" : "hjYB_MBd_tN2",
    "matched-string" : "Socialpedagogik och metodarbete",
    "annotation-id" : 25
  }, {
    "preferred-label" : "Social omsorgsutbildning, socialpedagogisk behandling",
    "sentiment" : "OFFERED",
    "type" : "sun-education-field-4",
    "start-position" : 1321,
    "end-position" : 1354,
    "concept-id" : "hjYB_MBd_tN2",
    "matched-string" : "Socialpedagogiskt arbete med unga",
    "annotation-id" : 26
  }, {
    "preferred-label" : "Öppna sociala insatser för vuxna med missbruksproblem",
    "sentiment" : "OFFERED",
    "type" : "sni-level-5",
    "start-position" : 1358,
    "end-position" : 1394,
    "concept-id" : "ZsgX_7Cc_ene",
    "matched-string" : "Missbruk, beroende och samsjuklighet",
    "annotation-id" : 27
  }, {
    "preferred-label" : "Annan utbildning i psykologi",
    "sentiment" : "OFFERED",
    "type" : "sun-education-field-4",
    "start-position" : 1398,
    "end-position" : 1439,
    "concept-id" : "BzfN_PaT_S9n",
    "matched-string" : "Psykisk ohälsa och antisocial problematik",
    "annotation-id" : 28
  }, {
    "preferred-label" : "Socialt arbete",
    "sentiment" : "OFFERED",
    "type" : "sun-education-field-3",
    "start-position" : 1443,
    "end-position" : 1481,
    "concept-id" : "t1wZ_E9z_Uz6",
    "matched-string" : "Integrationspedagogiskt socialt arbete",
    "annotation-id" : 29
  }, {
    "preferred-label" : "Socialt arbete",
    "sentiment" : "OFFERED",
    "type" : "sun-education-field-3",
    "start-position" : 1485,
    "end-position" : 1543,
    "concept-id" : "t1wZ_E9z_Uz6",
    "matched-string" : "Socialt arbete i nationellt och internationellt perspektiv",
    "annotation-id" : 30
  }, {
    "preferred-label" : null,
    "sentiment" : "OFFERED",
    "type" : "sun-education-level-3",
    "start-position" : 1547,
    "comment" : "LIA = praktik, finns inget sådant koncept",
    "end-position" : 1565,
    "concept-id" : null,
    "matched-string" : "Lärande i Arbete 1",
    "annotation-id" : 31
  }, {
    "preferred-label" : null,
    "sentiment" : "OFFERED",
    "type" : "sun-education-level-3",
    "start-position" : 1569,
    "comment" : "LIA = praktik, finns inget sådant koncept",
    "end-position" : 1587,
    "concept-id" : null,
    "matched-string" : "Lärande i Arbete 2",
    "annotation-id" : 32
  } ],
  "text" : "YH Socialpedagog är för dig som vill arbeta med barn, ungdomar och vuxna inom olika områden av socialt arbete. En socialpedagog arbetar med människor i olika utsatta grupper i samhället och du får genom utbildningen en bred kompetens som kan användas inom en mängd skilda verksamheter. Socialpedagoger har en växande arbetsmarknad och kompetent personal efterfrågas inom både privat och offentlig sektor.    Yrkesbenämningen är socialpedagog. Utbildningen kan även leda till anställning inom andra liknande områden. Du kommer exempelvis att kunna arbeta inom kommun, landsting, myndigheter, skola, behandlingshem och kriminalvården.    Arbetsuppgifter som Du som socialpedagog kommer att möta är skiftande beroende på vilket område du väljer att arbeta inom. Fokus kommer att vara att tillsammans med den du möter hitta vägar till förändring och utveckling. Du kommer att samarbeta med olika yrkeskategorier exempelvis socionomer, pedagoger, polis, kriminalvård och sjukvård.    I utbildningen ingår följande obligatoriska kurser:    - Socialt arbete - yrkesintroduktion, organisation, lagstiftning, värdegrund och hälsofrämjande perspektiv.  - Utveckling, socialisation och livsvillkor – individ, grupp och samhälle  - Psykisk ohälsa, psykiska funktionsnedsättningar, samsjuklighet  - Socialpedagogik och metodarbete  - Socialpedagogiskt arbete med unga  - Missbruk, beroende och samsjuklighet  - Psykisk ohälsa och antisocial problematik  - Integrationspedagogiskt socialt arbete  - Socialt arbete i nationellt och internationellt perspektiv  - Lärande i Arbete 1  - Lärande i Arbete 2    Utbildningen genomförs på plats i Östersund. Utbildningen är på heltid och Du får räkna med att spendera 2,5-3 dagar per vecka på skolan. Praktikkurserna LIA genomförs på arbetsplatser i länet, så resor kan förekomma. Du kan också ordna Din egen LIA-plats under förutsättning att praktikplatsen uppfyller utbildningens krav. Utbildningen ger rätt till CSN och ingår också i Östersundshems bostadsgaranti för studenter.    Utbildningens innehåll har utvecklats i aktivt samarbete med Umeå Universitet, kommunerna i Jämtland, kriminalvården samt SiS (statens institutionsstyrelse) och privat sektor i form av behandlingshem i regionen.    "
}