{
  "meta" : {
    "jobad" : {
      "description" : {
        "requirements" : null,
        "needs" : null,
        "company_information" : null,
        "text_formatted" : "Tillsammans skapar vi på Sahlgrenska Universitetssjukhuset vård av högsta kvalitet med patienten i fokus. Med stort engagemang och ständigt lärande är vi ett av landets ledande universitetssjukhus. Vi bedriver allt från länssjukvård till nationell högspecialiserad vård. Genom intressant forskning har vi en inriktning mot framtidens sjukvård. Hos oss är det viktigt med digital kompetens och att alla bidrar till den digitala utvecklingen. I vårt arbete tar vi tillvara den bredd av kunskap och erfarenhet vi gemensamt har – Tillsammans med dig vill vi skapa värde för våra patienter.\n\n\r\n\r\nOm oss\n\nOperation 2 bedriver operationsverksamhet med inriktning mot gynekologi och obstetrik och servar Nordens största förlossningsklinik dygnets alla timmar.\r\n\r\nBenign gynekologi bedrivs parallellt med planerade och akuta obstetriska ingrepp. Vi ger vård till kvinnor med gynekologiska tillstånd för att ge en förbättrad livskvalitet samt till gravida kvinnor som behöver kirurgiska åtgärder för att kunna fullfölja sin graviditet eller förlossning. Den obstetriska kirurgin består till stor del av elektiva kejsarsnitt men också ett stort akut uppdrag med urakuta snitt, placentalösningar, rupturer. På Operation 2 finns även en postoperativ enhet.\n\nPå enheten arbetar operationssjuksköterskor, anestesisjuksköterskor och undersköterskor tillsammans med instruktör, sektionsledare, bemanningsassistent och vårdenhetschefer. Totalt är vi cirka 70 medarbetare.\n\nVi arbetar med rotationstjänstgöring till Operation 1, Östra för att få variation, stimulans och en bred kompetens. Operation 1 är en av Nordens största colorektala enheter med varierande operationer med allt från enklare ingrepp till omfattande avancerade elektiva ingrepp inom colo- och övre gastrokirurgi för både vuxna och barn. Här ges även anestesiservice till tandvården, psykiatriska kliniken och GEA. Enheten bedriver också en stor akut verksamhet.\n\nVad kan vi erbjuda dig?\n\nVi erbjuder grundschema dag/kväll med tjänstgöring var fjärde helg.\n\nVerksamheten har ett tydligt fokus på personcentrerad vård och vi är måna om att arbeta med vår arbetsmiljö. Medarbetare arbetar tillsammans med utveckling på avdelningen, bland annat genom regelbundna utbildningstillfällen där vi lyfter matnyttig information om viktiga arbetsuppgifter och genom Gröna korset som är ett verktyg för patient- och kvalitetssäker vård.\n\nVi kan erbjuda dig som söker ett omväxlande och stimulerande arbete tillsammans med engagerade och kompetenta kollegor. Du kommer att få en gedigen introduktion som anpassas efter dina tidigare erfarenheter samt kontinuerlig utveckling med interna och externa utbildningar.\n\nArbetsuppgifter\n\nDina huvudsakliga arbetsuppgifter kommer vara som operationssjuksköterska.\n\nOm dig\n\nVi söker dig som är legitimerad sjuksköterska med specialistutbildning i operationssjukvård eller som snart är klar specialistsjuksköterska inom operationssjukvård. Det är meriterande om du har tidigare erfarenhet av arbete som operationssjuksköterska.\n\nVi söker dig som är legitimerad sjuksköterska med specialistutbildning inom operationssjukvård. Du har god samarbetsförmåga och visar respekt och omtanke för dina kollegor. Du har ett stort engagemang i arbetet, bidrar med nytänkande, stimuleras av utmaningar och är flexibel. Vidare är du självständig och kan hantera både elektiva och akuta situationer. Stor vikt läggs vid personliga egenskaper och personlig lämplighet.\n\nVälkommen med din ansökan!\n\nhttps://www.sahlgrenska.se/jobb-och-framtid/tillsammans-for-patienten/https://www.sahlgrenska.se/jobb-och-framtid/tillsammans-for-patienten/https://www.sahlgrenska.se/jobb-och-framtid/tillsammans-for-patienten/\n\nVid eventuell rekrytering av läkare/sjuksköterska med utländsk legitimation/specialistbevis föregås den aktuella tjänsten av process för att uppfylla kraven för svensk legitimation/specialistbevis.\n\nOm Västra Götalandsregionen\nVästra Götalandsregionen finns till för människorna i Västra Götaland. Vi ser till att det finns god hälso- och sjukvård för alla. Vi arbetar för en hållbar utveckling och tillväxt, bra miljö, förbättrad folkhälsa, ett rikt kulturliv och goda kommunikationer i hela Västra Götaland.\nVästra Götalandsregionen arbetar aktivt för att digitalisera fler arbetssätt. För att vara en del av den digitala omvandlingen har du med dig grundläggande färdigheter och kan använda digitala verktyg och tjänster. Du kan söka information, kommunicera, interagera digitalt, är riskmedveten och har motivation att delta i utvecklingen för att lära nytt.\n\n\nVill du veta mer om Västra Götalandsregionen kan du besöka vår introduktion till nya medarbetare på länken https://www.vgregion.se/introduktion\n\n\nAnsökan\nVästra Götalandsregionen ser helst att du registrerar din ansökan via rekryteringssystemet. Om du som sökande har frågor om den utannonserade tjänsten eller av särskilda och speciella skäl inte kan registrera dina uppgifter i ett offentligt system - kontakta kontaktperson för respektive annons.\n\n\nTill bemannings-, förmedlings- och rekryteringsföretag och till dig som är försäljare:\nVi undanber oss vänligen men bestämt direktkontakt med bemannings-, förmedlings- och rekryteringsföretag samt andra externa aktörer och försäljare av ytterligare jobbannonser. Västra Götalandsregionen har upphandlade avtal.",
        "conditions" : "100%. Tillträde: Snarast\r\nTillsvidareanställning",
        "text" : "Tillsammans skapar vi på Sahlgrenska Universitetssjukhuset vård av högsta kvalitet med patienten i fokus. Med stort engagemang och ständigt lärande är vi ett av landets ledande universitetssjukhus. Vi bedriver allt från länssjukvård till nationell högspecialiserad vård. Genom intressant forskning har vi en inriktning mot framtidens sjukvård. Hos oss är det viktigt med digital kompetens och att alla bidrar till den digitala utvecklingen. I vårt arbete tar vi tillvara den bredd av kunskap och erfarenhet vi gemensamt har – Tillsammans med dig vill vi skapa värde för våra patienter.\n\n\r\n\r\nOm oss\n\nOperation 2 bedriver operationsverksamhet med inriktning mot gynekologi och obstetrik och servar Nordens största förlossningsklinik dygnets alla timmar.\r\n\r\nBenign gynekologi bedrivs parallellt med planerade och akuta obstetriska ingrepp. Vi ger vård till kvinnor med gynekologiska tillstånd för att ge en förbättrad livskvalitet samt till gravida kvinnor som behöver kirurgiska åtgärder för att kunna fullfölja sin graviditet eller förlossning. Den obstetriska kirurgin består till stor del av elektiva kejsarsnitt men också ett stort akut uppdrag med urakuta snitt, placentalösningar, rupturer. På Operation 2 finns även en postoperativ enhet.\n\nPå enheten arbetar operationssjuksköterskor, anestesisjuksköterskor och undersköterskor tillsammans med instruktör, sektionsledare, bemanningsassistent och vårdenhetschefer. Totalt är vi cirka 70 medarbetare.\n\nVi arbetar med rotationstjänstgöring till Operation 1, Östra för att få variation, stimulans och en bred kompetens. Operation 1 är en av Nordens största colorektala enheter med varierande operationer med allt från enklare ingrepp till omfattande avancerade elektiva ingrepp inom colo- och övre gastrokirurgi för både vuxna och barn. Här ges även anestesiservice till tandvården, psykiatriska kliniken och GEA. Enheten bedriver också en stor akut verksamhet.\n\nVad kan vi erbjuda dig?\n\nVi erbjuder grundschema dag/kväll med tjänstgöring var fjärde helg.\n\nVerksamheten har ett tydligt fokus på personcentrerad vård och vi är måna om att arbeta med vår arbetsmiljö. Medarbetare arbetar tillsammans med utveckling på avdelningen, bland annat genom regelbundna utbildningstillfällen där vi lyfter matnyttig information om viktiga arbetsuppgifter och genom Gröna korset som är ett verktyg för patient- och kvalitetssäker vård.\n\nVi kan erbjuda dig som söker ett omväxlande och stimulerande arbete tillsammans med engagerade och kompetenta kollegor. Du kommer att få en gedigen introduktion som anpassas efter dina tidigare erfarenheter samt kontinuerlig utveckling med interna och externa utbildningar.\n\nArbetsuppgifter\n\nDina huvudsakliga arbetsuppgifter kommer vara som operationssjuksköterska.\n\nOm dig\n\nVi söker dig som är legitimerad sjuksköterska med specialistutbildning i operationssjukvård eller som snart är klar specialistsjuksköterska inom operationssjukvård. Det är meriterande om du har tidigare erfarenhet av arbete som operationssjuksköterska.\n\nVi söker dig som är legitimerad sjuksköterska med specialistutbildning inom operationssjukvård. Du har god samarbetsförmåga och visar respekt och omtanke för dina kollegor. Du har ett stort engagemang i arbetet, bidrar med nytänkande, stimuleras av utmaningar och är flexibel. Vidare är du självständig och kan hantera både elektiva och akuta situationer. Stor vikt läggs vid personliga egenskaper och personlig lämplighet.\n\nVälkommen med din ansökan!\n\nhttps://www.sahlgrenska.se/jobb-och-framtid/tillsammans-for-patienten/https://www.sahlgrenska.se/jobb-och-framtid/tillsammans-for-patienten/https://www.sahlgrenska.se/jobb-och-framtid/tillsammans-for-patienten/\n\nVid eventuell rekrytering av läkare/sjuksköterska med utländsk legitimation/specialistbevis föregås den aktuella tjänsten av process för att uppfylla kraven för svensk legitimation/specialistbevis.\n\nOm Västra Götalandsregionen\nVästra Götalandsregionen finns till för människorna i Västra Götaland. Vi ser till att det finns god hälso- och sjukvård för alla. Vi arbetar för en hållbar utveckling och tillväxt, bra miljö, förbättrad folkhälsa, ett rikt kulturliv och goda kommunikationer i hela Västra Götaland.\nVästra Götalandsregionen arbetar aktivt för att digitalisera fler arbetssätt. För att vara en del av den digitala omvandlingen har du med dig grundläggande färdigheter och kan använda digitala verktyg och tjänster. Du kan söka information, kommunicera, interagera digitalt, är riskmedveten och har motivation att delta i utvecklingen för att lära nytt.\n\n\nVill du veta mer om Västra Götalandsregionen kan du besöka vår introduktion till nya medarbetare på länken https://www.vgregion.se/introduktion\n\n\nAnsökan\nVästra Götalandsregionen ser helst att du registrerar din ansökan via rekryteringssystemet. Om du som sökande har frågor om den utannonserade tjänsten eller av särskilda och speciella skäl inte kan registrera dina uppgifter i ett offentligt system - kontakta kontaktperson för respektive annons.\n\n\nTill bemannings-, förmedlings- och rekryteringsföretag och till dig som är försäljare:\nVi undanber oss vänligen men bestämt direktkontakt med bemannings-, förmedlings- och rekryteringsföretag samt andra externa aktörer och försäljare av ytterligare jobbannonser. Västra Götalandsregionen har upphandlade avtal."
      },
      "headline" : "Operationssjuksköterska",
      "driving_license" : null,
      "employer" : {
        "email" : null,
        "phone_number" : null,
        "organization_number" : "2321000131",
        "name" : "VÄSTRA GÖTALANDSREGIONEN",
        "url" : null,
        "workplace" : "Sahlgrenska Universitetssjukhuset, An/Op/Iva Östra, Operation 1 och 2"
      },
      "removed_date" : null,
      "logo_url" : "https://www.arbetsformedlingen.se/rest/arbetsgivare/rest/af/v3/organisation/2321000131/logotyper/logo.png",
      "last_publication_date" : "2022-08-24T23:59:59",
      "number_of_vacancies" : 2,
      "occupation" : {
        "concept_id" : "YJKc_yXU_DUH",
        "label" : "Operationssjuksköterska",
        "legacy_ams_taxonomy_id" : "5781"
      },
      "occupation_group" : {
        "concept_id" : "cuaN_Rj5_YCc",
        "label" : "Operationssjuksköterskor",
        "legacy_ams_taxonomy_id" : "2231"
      },
      "employment_type" : {
        "concept_id" : "PFZr_Syz_cUq",
        "label" : "Vanlig anställning",
        "legacy_ams_taxonomy_id" : "1"
      },
      "webpage_url" : "https://arbetsformedlingen.se/platsbanken/annonser/26393717",
      "driving_license_required" : false,
      "application_contacts" : [ {
        "description" : "Madelaine eriksson Tf VEC",
        "email" : null,
        "telephone" : "072-2045569",
        "name" : null,
        "contact_type" : null
      } ],
      "duration" : {
        "concept_id" : "a7uU_j21_mkL",
        "label" : "Tills vidare",
        "legacy_ams_taxonomy_id" : "1"
      },
      "nice_to_have" : {
        "education_level" : [ ],
        "work_experiences" : [ ],
        "skills" : [ ],
        "education" : [ ],
        "languages" : [ ]
      },
      "application_details" : {
        "via_af" : false,
        "email" : null,
        "other" : null,
        "reference" : "2022/6125",
        "url" : "https://vgregion.varbi.com/what:job/jobID:534031/type:job/where:1/apply:1",
        "information" : null
      },
      "source_type" : "VIA_PLATSBANKEN_DXA",
      "application_deadline" : "2022-08-24T23:59:59",
      "external_id" : "46-232100-0131-534031",
      "workplace_address" : {
        "coordinates" : [ 11.97456, 57.70887 ],
        "city" : null,
        "postcode" : null,
        "municipality" : "Göteborg",
        "region_concept_id" : "zdoY_6u5_Krt",
        "region" : "Västra Götalands län",
        "country_code" : "199",
        "region_code" : "14",
        "municipality_concept_id" : "PVZL_BQT_XtL",
        "country_concept_id" : "i46j_HmG_v64",
        "municipality_code" : "1480",
        "street_address" : null,
        "country" : "Sverige"
      },
      "id" : "26393717",
      "experience_required" : false,
      "working_hours_type" : {
        "concept_id" : "6YE1_gAC_R2G",
        "label" : "Heltid",
        "legacy_ams_taxonomy_id" : "1"
      },
      "access" : null,
      "timestamp" : 1660110933901,
      "must_have" : {
        "education_level" : [ ],
        "work_experiences" : [ ],
        "skills" : [ ],
        "education" : [ ],
        "languages" : [ ]
      },
      "occupation_field" : {
        "concept_id" : "NYW6_mP6_vwf",
        "label" : "Hälso- och sjukvård",
        "legacy_ams_taxonomy_id" : "8"
      },
      "scope_of_work" : {
        "min" : 100,
        "max" : 100
      },
      "salary_type" : {
        "concept_id" : "oG8G_9cW_nRf",
        "label" : "Fast månads- vecko- eller timlön",
        "legacy_ams_taxonomy_id" : "1"
      },
      "removed" : false,
      "salary_description" : "Individuell lönesättning",
      "access_to_own_car" : false,
      "publication_date" : "2022-08-10T07:55:33"
    },
    "name" : "Operationssjuksköterska",
    "user" : "hannes"
  },
  "sha1" : "b1d42214e88526a28fde29ae4dd8495e568d2562",
  "annotations" : [ {
    "preferred-label" : "Operationssjuksköterska",
    "sentiment" : "MUST_HAVE",
    "type" : "occupation-name",
    "start-position" : 0,
    "end-position" : 23,
    "concept-id" : "YJKc_yXU_DUH",
    "matched-string" : "operationssjuksköterska",
    "annotation-id" : 0
  }, {
    "preferred-label" : "Gynekolog",
    "type" : "keyword",
    "start-position" : 684,
    "end-position" : 694,
    "concept-id" : "ASoB_Zaq_wFL",
    "matched-string" : "gynekologi",
    "annotation-id" : 21
  }, {
    "preferred-label" : "Obstetrik",
    "sentiment" : "MUST_HAVE",
    "type" : "skill",
    "start-position" : 699,
    "end-position" : 708,
    "concept-id" : "UtTP_C3o_hR3",
    "matched-string" : "obstetrik",
    "annotation-id" : 1
  }, {
    "preferred-label" : "Gynekolog",
    "type" : "keyword",
    "start-position" : 786,
    "end-position" : 796,
    "concept-id" : "ASoB_Zaq_wFL",
    "matched-string" : "gynekologi",
    "annotation-id" : 22
  }, {
    "preferred-label" : "Operationssjuksköterskor",
    "sentiment" : "MUST_HAVE",
    "type" : "ssyk-level-4",
    "start-position" : 1288,
    "end-position" : 1312,
    "concept-id" : "cuaN_Rj5_YCc",
    "matched-string" : "operationssjuksköterskor",
    "annotation-id" : 2
  }, {
    "preferred-label" : "Anestesisjuksköterskor",
    "sentiment" : "MUST_HAVE",
    "type" : "ssyk-level-4",
    "start-position" : 1314,
    "end-position" : 1336,
    "concept-id" : "nrVt_xUL_KdQ",
    "matched-string" : "anestesisjuksköterskor",
    "annotation-id" : 3
  }, {
    "preferred-label" : "Undersköterskor",
    "sentiment" : "MUST_HAVE",
    "type" : "ssyk-level-3",
    "start-position" : 1341,
    "end-position" : 1356,
    "concept-id" : "3EJj_WLs_kgD",
    "matched-string" : "undersköterskor",
    "annotation-id" : 4
  }, {
    "preferred-label" : "Bemanningsassistent",
    "sentiment" : "MUST_HAVE",
    "type" : "keyword",
    "start-position" : 1401,
    "end-position" : 1420,
    "concept-id" : "1eUR_54w_v1C",
    "matched-string" : "bemanningsassistent",
    "annotation-id" : 5
  }, {
    "preferred-label" : "arbetsmiljö",
    "sentiment" : "MUST_HAVE",
    "type" : "esco-skill",
    "start-position" : 2128,
    "end-position" : 2139,
    "concept-id" : "zdQY_QJh_nUH",
    "matched-string" : "arbetsmiljö",
    "annotation-id" : 6
  }, {
    "preferred-label" : "Verktyg",
    "sentiment" : "MUST_HAVE",
    "type" : "skill",
    "start-position" : 2353,
    "end-position" : 2360,
    "concept-id" : "KG9j_WxP_ym2",
    "matched-string" : "verktyg",
    "annotation-id" : 7
  }, {
    "preferred-label" : "Operationssjuksköterska",
    "sentiment" : "MUST_HAVE",
    "type" : "occupation-name",
    "start-position" : 2742,
    "end-position" : 2765,
    "concept-id" : "YJKc_yXU_DUH",
    "matched-string" : "operationssjuksköterska",
    "annotation-id" : 8
  }, {
    "preferred-label" : "Sjuksköterska",
    "sentiment" : "MUST_HAVE",
    "type" : "keyword",
    "start-position" : 2808,
    "end-position" : 2821,
    "concept-id" : "jrjV_wcz_fxg",
    "matched-string" : "sjuksköterska",
    "annotation-id" : 9
  }, {
    "preferred-label" : "Operationssjukvård",
    "sentiment" : "MUST_HAVE",
    "type" : "skill",
    "start-position" : 2849,
    "end-position" : 2867,
    "concept-id" : "2KV1_FD8_vGp",
    "matched-string" : "operationssjukvård",
    "annotation-id" : 10
  }, {
    "preferred-label" : "Operationssjukvård",
    "sentiment" : "MUST_HAVE",
    "type" : "skill",
    "start-position" : 2921,
    "end-position" : 2939,
    "concept-id" : "2KV1_FD8_vGp",
    "matched-string" : "operationssjukvård",
    "annotation-id" : 11
  }, {
    "preferred-label" : "Operationssjuksköterska",
    "sentiment" : "MUST_HAVE",
    "type" : "occupation-name",
    "start-position" : 3004,
    "end-position" : 3027,
    "concept-id" : "YJKc_yXU_DUH",
    "matched-string" : "operationssjuksköterska",
    "annotation-id" : 12
  }, {
    "preferred-label" : "Sjuksköterska",
    "sentiment" : "MUST_HAVE",
    "type" : "keyword",
    "start-position" : 3062,
    "end-position" : 3075,
    "concept-id" : "jrjV_wcz_fxg",
    "matched-string" : "sjuksköterska",
    "annotation-id" : 13
  }, {
    "preferred-label" : "Operationssjukvård",
    "sentiment" : "MUST_HAVE",
    "type" : "skill",
    "start-position" : 3106,
    "end-position" : 3124,
    "concept-id" : "2KV1_FD8_vGp",
    "matched-string" : "operationssjukvård",
    "annotation-id" : 14
  }, {
    "preferred-label" : "läkare",
    "sentiment" : "MUST_HAVE",
    "type" : "esco-occupation",
    "start-position" : 3724,
    "end-position" : 3730,
    "concept-id" : "snUT_QSf_LG9",
    "matched-string" : "läkare",
    "annotation-id" : 15
  }, {
    "preferred-label" : "Sjuksköterska",
    "sentiment" : "MUST_HAVE",
    "type" : "keyword",
    "start-position" : 3731,
    "end-position" : 3744,
    "concept-id" : "jrjV_wcz_fxg",
    "matched-string" : "sjuksköterska",
    "annotation-id" : 16
  }, {
    "preferred-label" : "Västra Götalands län",
    "type" : "region",
    "start-position" : 3897,
    "end-position" : 3921,
    "concept-id" : "zdoY_6u5_Krt",
    "matched-string" : "Västra Götalandsregionen",
    "annotation-id" : 23
  }, {
    "preferred-label" : "Västra Götalands län",
    "type" : "region",
    "start-position" : 3922,
    "end-position" : 3946,
    "concept-id" : "zdoY_6u5_Krt",
    "matched-string" : "Västra Götalandsregionen",
    "annotation-id" : 24
  }, {
    "preferred-label" : "Västra Götalands län",
    "type" : "region",
    "start-position" : 3976,
    "end-position" : 3991,
    "concept-id" : "zdoY_6u5_Krt",
    "matched-string" : "Västra Götaland",
    "annotation-id" : 26
  }, {
    "preferred-label" : "Hälso",
    "sentiment" : "MUST_HAVE",
    "type" : "keyword",
    "start-position" : 4023,
    "end-position" : 4028,
    "concept-id" : "5TsD_dN8_Uco",
    "matched-string" : "hälso",
    "annotation-id" : 17
  }, {
    "preferred-label" : "Hållbar utveckling",
    "sentiment" : "MUST_HAVE",
    "type" : "keyword",
    "start-position" : 4071,
    "end-position" : 4089,
    "concept-id" : "RKw3_zWW_1pf",
    "matched-string" : "hållbar utveckling",
    "annotation-id" : 18
  }, {
    "preferred-label" : "folkhälsa",
    "sentiment" : "MUST_HAVE",
    "type" : "esco-skill",
    "start-position" : 4126,
    "end-position" : 4135,
    "concept-id" : "jEdA_1Fe_Jji",
    "matched-string" : "folkhälsa",
    "annotation-id" : 19
  }, {
    "preferred-label" : "kommunikation",
    "type" : "esco-skill",
    "start-position" : 4165,
    "end-position" : 4180,
    "concept-id" : "ahPU_HgE_Jeb",
    "matched-string" : "kommunikationer",
    "annotation-id" : 30
  }, {
    "preferred-label" : "Västra Götalands län",
    "type" : "region",
    "start-position" : 4188,
    "end-position" : 4203,
    "concept-id" : "zdoY_6u5_Krt",
    "matched-string" : "Västra Götaland",
    "annotation-id" : 29
  }, {
    "preferred-label" : "Västra Götalands län",
    "type" : "region",
    "start-position" : 4205,
    "end-position" : 4229,
    "concept-id" : "zdoY_6u5_Krt",
    "matched-string" : "Västra Götalandsregionen",
    "annotation-id" : 25
  }, {
    "preferred-label" : "Verktyg",
    "sentiment" : "MUST_HAVE",
    "type" : "skill",
    "start-position" : 4398,
    "end-position" : 4405,
    "concept-id" : "KG9j_WxP_ym2",
    "matched-string" : "verktyg",
    "annotation-id" : 20
  }, {
    "preferred-label" : "Västra Götalands län",
    "type" : "region",
    "start-position" : 4580,
    "end-position" : 4604,
    "concept-id" : "zdoY_6u5_Krt",
    "matched-string" : "Västra Götalandsregionen",
    "annotation-id" : 27
  }, {
    "preferred-label" : "Västra Götalands län",
    "type" : "region",
    "start-position" : 4714,
    "end-position" : 4738,
    "concept-id" : "zdoY_6u5_Krt",
    "matched-string" : "Västra Götalandsregionen",
    "annotation-id" : 28
  } ],
  "text" : "Operationssjuksköterska\nTillsammans skapar vi på Sahlgrenska Universitetssjukhuset vård av högsta kvalitet med patienten i fokus. Med stort engagemang och ständigt lärande är vi ett av landets ledande universitetssjukhus. Vi bedriver allt från länssjukvård till nationell högspecialiserad vård. Genom intressant forskning har vi en inriktning mot framtidens sjukvård. Hos oss är det viktigt med digital kompetens och att alla bidrar till den digitala utvecklingen. I vårt arbete tar vi tillvara den bredd av kunskap och erfarenhet vi gemensamt har – Tillsammans med dig vill vi skapa värde för våra patienter.\n\n\r\n\r\nOm oss\n\nOperation 2 bedriver operationsverksamhet med inriktning mot gynekologi och obstetrik och servar Nordens största förlossningsklinik dygnets alla timmar.\r\n\r\nBenign gynekologi bedrivs parallellt med planerade och akuta obstetriska ingrepp. Vi ger vård till kvinnor med gynekologiska tillstånd för att ge en förbättrad livskvalitet samt till gravida kvinnor som behöver kirurgiska åtgärder för att kunna fullfölja sin graviditet eller förlossning. Den obstetriska kirurgin består till stor del av elektiva kejsarsnitt men också ett stort akut uppdrag med urakuta snitt, placentalösningar, rupturer. På Operation 2 finns även en postoperativ enhet.\n\nPå enheten arbetar operationssjuksköterskor, anestesisjuksköterskor och undersköterskor tillsammans med instruktör, sektionsledare, bemanningsassistent och vårdenhetschefer. Totalt är vi cirka 70 medarbetare.\n\nVi arbetar med rotationstjänstgöring till Operation 1, Östra för att få variation, stimulans och en bred kompetens. Operation 1 är en av Nordens största colorektala enheter med varierande operationer med allt från enklare ingrepp till omfattande avancerade elektiva ingrepp inom colo- och övre gastrokirurgi för både vuxna och barn. Här ges även anestesiservice till tandvården, psykiatriska kliniken och GEA. Enheten bedriver också en stor akut verksamhet.\n\nVad kan vi erbjuda dig?\n\nVi erbjuder grundschema dag/kväll med tjänstgöring var fjärde helg.\n\nVerksamheten har ett tydligt fokus på personcentrerad vård och vi är måna om att arbeta med vår arbetsmiljö. Medarbetare arbetar tillsammans med utveckling på avdelningen, bland annat genom regelbundna utbildningstillfällen där vi lyfter matnyttig information om viktiga arbetsuppgifter och genom Gröna korset som är ett verktyg för patient- och kvalitetssäker vård.\n\nVi kan erbjuda dig som söker ett omväxlande och stimulerande arbete tillsammans med engagerade och kompetenta kollegor. Du kommer att få en gedigen introduktion som anpassas efter dina tidigare erfarenheter samt kontinuerlig utveckling med interna och externa utbildningar.\n\nArbetsuppgifter\n\nDina huvudsakliga arbetsuppgifter kommer vara som operationssjuksköterska.\n\nOm dig\n\nVi söker dig som är legitimerad sjuksköterska med specialistutbildning i operationssjukvård eller som snart är klar specialistsjuksköterska inom operationssjukvård. Det är meriterande om du har tidigare erfarenhet av arbete som operationssjuksköterska.\n\nVi söker dig som är legitimerad sjuksköterska med specialistutbildning inom operationssjukvård. Du har god samarbetsförmåga och visar respekt och omtanke för dina kollegor. Du har ett stort engagemang i arbetet, bidrar med nytänkande, stimuleras av utmaningar och är flexibel. Vidare är du självständig och kan hantera både elektiva och akuta situationer. Stor vikt läggs vid personliga egenskaper och personlig lämplighet.\n\nVälkommen med din ansökan!\n\nhttps://www.sahlgrenska.se/jobb-och-framtid/tillsammans-for-patienten/https://www.sahlgrenska.se/jobb-och-framtid/tillsammans-for-patienten/https://www.sahlgrenska.se/jobb-och-framtid/tillsammans-for-patienten/\n\nVid eventuell rekrytering av läkare/sjuksköterska med utländsk legitimation/specialistbevis föregås den aktuella tjänsten av process för att uppfylla kraven för svensk legitimation/specialistbevis.\n\nOm Västra Götalandsregionen\nVästra Götalandsregionen finns till för människorna i Västra Götaland. Vi ser till att det finns god hälso- och sjukvård för alla. Vi arbetar för en hållbar utveckling och tillväxt, bra miljö, förbättrad folkhälsa, ett rikt kulturliv och goda kommunikationer i hela Västra Götaland.\nVästra Götalandsregionen arbetar aktivt för att digitalisera fler arbetssätt. För att vara en del av den digitala omvandlingen har du med dig grundläggande färdigheter och kan använda digitala verktyg och tjänster. Du kan söka information, kommunicera, interagera digitalt, är riskmedveten och har motivation att delta i utvecklingen för att lära nytt.\n\n\nVill du veta mer om Västra Götalandsregionen kan du besöka vår introduktion till nya medarbetare på länken https://www.vgregion.se/introduktion\n\n\nAnsökan\nVästra Götalandsregionen ser helst att du registrerar din ansökan via rekryteringssystemet. Om du som sökande har frågor om den utannonserade tjänsten eller av särskilda och speciella skäl inte kan registrera dina uppgifter i ett offentligt system - kontakta kontaktperson för respektive annons.\n\n\nTill bemannings-, förmedlings- och rekryteringsföretag och till dig som är försäljare:\nVi undanber oss vänligen men bestämt direktkontakt med bemannings-, förmedlings- och rekryteringsföretag samt andra externa aktörer och försäljare av ytterligare jobbannonser. Västra Götalandsregionen har upphandlade avtal."
}