{
  "meta" : {
    "jobad" : {
      "description" : {
        "requirements" : null,
        "needs" : null,
        "company_information" : null,
        "text_formatted" : "SVERIGES ROLIGASTE RESTAURANGFÖRETAG\n\nVi ska bli Sveriges roligaste restaurangföretag - tillsammans med dig. Låter det ambitiöst? Det är det också!\n\nVi tycker nämligen att du som jobbar i branschen förtjänar en bättre och roligare arbetsplats och en arbetsgivare som verkligen bryr sig om dig. Där du får möjligheten att utvecklas, både personligt och yrkesmässigt och där gemenskap, yrkesstolthet, high-fives, personalfester och glädje är drivkraften. Låter det bra? Vi tänkte väl det. Välkommen till FRAM! 🤗\n\nJOBBA MED DET DU ÄLSKAR - PÅ DINA VILLKOR 🤩\n\nPå FRAM kan du jobba med det du älskar utan att känna dig pressad till att jobba mer än du känner för när det blir för mycket att göra på jobbet. Vill du jobba mycket? Inga problem. Vill du jobba lite mindre och ha tid över till familj eller vänner? Inga problem. Vi lägger stort fokus på att du ska känna att ditt arbete passar ditt liv.\n\nPROFIL\n\nVi söker dig som vill jobba som värd, värdinna, garderob, servitör eller servitris. Du jobbar ute hos våra kunder på varierande arbetsplatser och arbetstider och får möjligheten att upptäcka en uppsjö av olika energigivande arbetsplatser och restauranger tillsammans med dina goa kollegor. Du är flexibel och kan jobba både kvällar och helger.\n\n\n Jobba när du vill, som du vill (ish)\n\n Utbildning inom mat, dryck och service\n\nFRAM AKADEMIN\n\nVi värderar personlig och yrkesmässig utveckling högt, därför har vi skapat FRAM Akademin där vi utbildar nya kollegor och ger dig möjligheten till att utvecklas, lära dig nya spännande saker och att skaffa nya kunskaper inom allt från serveringsteknik och försäljning till vin och cocktails.\n\nFRAM BEMANNING\n\nPå FRAM är vi helt övertygande om att restaurang är ett av världens roligaste jobb. Energin, kollegorna, de glada gästerna och att få jobba med mat och dryck tycker vi slår slöa kontorsarbeten och gråa administrativa jobb i alla avseenden. Att räkna ner tiden tills vi slutar är det få Frammare som känner igen sig i.\n\nVi är ett personligt bemanningsföretag som arbetar med hotell- och restaurangbranschen och ser på företag och personal lite annorlunda. Vi älskar våra medarbetare och brinner för restaurangbranschen.\n\nSjälvklart medlemmar i Visita och anslutna till kollektivavtal.\n\nANSÖKAN\n\nStart: Omgående\nLön: Timlön enl överenskommelse vi ser gärna att du har en annan huvudsysselsättning\nAnsökan: Bifoga CV och bild på dig själv i ansökan (bild är frivilligt)",
        "conditions" : "Deltid\r\nAnställningstid enligt överenskommelse",
        "text" : "SVERIGES ROLIGASTE RESTAURANGFÖRETAG\n\nVi ska bli Sveriges roligaste restaurangföretag - tillsammans med dig. Låter det ambitiöst? Det är det också!\n\nVi tycker nämligen att du som jobbar i branschen förtjänar en bättre och roligare arbetsplats och en arbetsgivare som verkligen bryr sig om dig. Där du får möjligheten att utvecklas, både personligt och yrkesmässigt och där gemenskap, yrkesstolthet, high-fives, personalfester och glädje är drivkraften. Låter det bra? Vi tänkte väl det. Välkommen till FRAM! 🤗\n\nJOBBA MED DET DU ÄLSKAR - PÅ DINA VILLKOR 🤩\n\nPå FRAM kan du jobba med det du älskar utan att känna dig pressad till att jobba mer än du känner för när det blir för mycket att göra på jobbet. Vill du jobba mycket? Inga problem. Vill du jobba lite mindre och ha tid över till familj eller vänner? Inga problem. Vi lägger stort fokus på att du ska känna att ditt arbete passar ditt liv.\n\nPROFIL\n\nVi söker dig som vill jobba som värd, värdinna, garderob, servitör eller servitris. Du jobbar ute hos våra kunder på varierande arbetsplatser och arbetstider och får möjligheten att upptäcka en uppsjö av olika energigivande arbetsplatser och restauranger tillsammans med dina goa kollegor. Du är flexibel och kan jobba både kvällar och helger.\n\n\n Jobba när du vill, som du vill (ish)\n\n Utbildning inom mat, dryck och service\n\nFRAM AKADEMIN\n\nVi värderar personlig och yrkesmässig utveckling högt, därför har vi skapat FRAM Akademin där vi utbildar nya kollegor och ger dig möjligheten till att utvecklas, lära dig nya spännande saker och att skaffa nya kunskaper inom allt från serveringsteknik och försäljning till vin och cocktails.\n\nFRAM BEMANNING\n\nPå FRAM är vi helt övertygande om att restaurang är ett av världens roligaste jobb. Energin, kollegorna, de glada gästerna och att få jobba med mat och dryck tycker vi slår slöa kontorsarbeten och gråa administrativa jobb i alla avseenden. Att räkna ner tiden tills vi slutar är det få Frammare som känner igen sig i.\n\nVi är ett personligt bemanningsföretag som arbetar med hotell- och restaurangbranschen och ser på företag och personal lite annorlunda. Vi älskar våra medarbetare och brinner för restaurangbranschen.\n\nSjälvklart medlemmar i Visita och anslutna till kollektivavtal.\n\nANSÖKAN\n\nStart: Omgående\nLön: Timlön enl överenskommelse vi ser gärna att du har en annan huvudsysselsättning\nAnsökan: Bifoga CV och bild på dig själv i ansökan (bild är frivilligt)"
      },
      "headline" : "Värdar, garderob och nya stjärnor till event!",
      "driving_license" : null,
      "employer" : {
        "email" : null,
        "phone_number" : null,
        "organization_number" : "5590338579",
        "name" : "FRAM Bemanning AB",
        "url" : "http://frambemanning.se",
        "workplace" : "FRAM Bemanning"
      },
      "removed_date" : null,
      "logo_url" : null,
      "last_publication_date" : "2022-08-15T23:59:59",
      "number_of_vacancies" : 1,
      "occupation" : {
        "concept_id" : "rGGf_KLs_To7",
        "label" : "Servitör/Servitris",
        "legacy_ams_taxonomy_id" : "5487"
      },
      "occupation_group" : {
        "concept_id" : "UjoW_meY_Zwt",
        "label" : "Hovmästare och servitörer",
        "legacy_ams_taxonomy_id" : "5131"
      },
      "employment_type" : {
        "concept_id" : "PFZr_Syz_cUq",
        "label" : "Vanlig anställning",
        "legacy_ams_taxonomy_id" : "1"
      },
      "webpage_url" : "https://arbetsformedlingen.se/platsbanken/annonser/26368317",
      "driving_license_required" : false,
      "application_contacts" : [ {
        "description" : "Johan Hardemo",
        "email" : "johan@frambemanning.se",
        "telephone" : "‭0735 31 45 19‬",
        "name" : null,
        "contact_type" : null
      } ],
      "duration" : {
        "concept_id" : "qQUd_4qe_NDT",
        "label" : "6 månader eller längre",
        "legacy_ams_taxonomy_id" : "2"
      },
      "nice_to_have" : {
        "education_level" : [ ],
        "work_experiences" : [ ],
        "skills" : [ ],
        "education" : [ ],
        "languages" : [ ]
      },
      "application_details" : {
        "via_af" : false,
        "email" : null,
        "other" : null,
        "reference" : null,
        "url" : "https://work.frambemanning.se/jobs/1692112-vardar-garderob-och-nya-stjarnor-till-event?promotion=386491-arbetsformedlingen",
        "information" : null
      },
      "source_type" : "VIA_PLATSBANKEN_DXA",
      "application_deadline" : "2022-08-15T23:59:59",
      "external_id" : "46-559033-8579-1692112-12",
      "workplace_address" : {
        "coordinates" : [ 13.003822, 55.60498 ],
        "city" : null,
        "postcode" : null,
        "municipality" : "Malmö",
        "region_concept_id" : "CaRE_1nn_cSU",
        "region" : "Skåne län",
        "country_code" : "199",
        "region_code" : "12",
        "municipality_concept_id" : "oYPt_yRA_Smm",
        "country_concept_id" : "i46j_HmG_v64",
        "municipality_code" : "1280",
        "street_address" : null,
        "country" : "Sverige"
      },
      "id" : "26368317",
      "experience_required" : true,
      "working_hours_type" : {
        "concept_id" : "947z_JGS_Uk2",
        "label" : "Deltid",
        "legacy_ams_taxonomy_id" : "2"
      },
      "access" : null,
      "timestamp" : 1659356515684,
      "must_have" : {
        "education_level" : [ ],
        "work_experiences" : [ {
          "concept_id" : "rGGf_KLs_To7",
          "weight" : 10,
          "label" : "Servitör/Servitris",
          "legacy_ams_taxonomy_id" : "5487"
        } ],
        "skills" : [ ],
        "education" : [ ],
        "languages" : [ ]
      },
      "occupation_field" : {
        "concept_id" : "ScKy_FHB_7wT",
        "label" : "Hotell, restaurang, storhushåll",
        "legacy_ams_taxonomy_id" : "7"
      },
      "scope_of_work" : {
        "min" : 0,
        "max" : 100
      },
      "salary_type" : {
        "concept_id" : "oG8G_9cW_nRf",
        "label" : "Fast månads- vecko- eller timlön",
        "legacy_ams_taxonomy_id" : "1"
      },
      "removed" : false,
      "salary_description" : "Lön enligt överenskommelse",
      "access_to_own_car" : false,
      "publication_date" : "2022-08-01T14:21:55"
    },
    "name" : "Värdar, garderob och nya stjärnor till event!",
    "user" : "hannes"
  },
  "sha1" : "315a612b946df32862f01268068dbe6bb6c80049",
  "annotations" : [ {
    "preferred-label" : "värd",
    "type" : "esco-occupation",
    "start-position" : 0,
    "end-position" : 6,
    "concept-id" : "GBvP_Wah_zpr",
    "matched-string" : "Värdar",
    "annotation-id" : 15
  }, {
    "preferred-label" : "Garderobsvärd",
    "type" : "keyword",
    "start-position" : 8,
    "end-position" : 16,
    "concept-id" : "Ky3v_Yf2_mNa",
    "matched-string" : "garderob",
    "annotation-id" : 14
  }, {
    "preferred-label" : "Sverige",
    "type" : "country",
    "start-position" : 46,
    "end-position" : 54,
    "concept-id" : "i46j_HmG_v64",
    "matched-string" : "SVERIGES",
    "annotation-id" : 8
  }, {
    "preferred-label" : "Sverige",
    "type" : "country",
    "start-position" : 95,
    "end-position" : 103,
    "concept-id" : "i46j_HmG_v64",
    "matched-string" : "Sveriges",
    "annotation-id" : 9
  }, {
    "preferred-label" : "Restaurang",
    "type" : "keyword",
    "start-position" : 114,
    "end-position" : 131,
    "concept-id" : "o2Cg_3Ap_qvK",
    "matched-string" : "restaurangföretag",
    "annotation-id" : 10
  }, {
    "preferred-label" : "värd",
    "type" : "esco-occupation",
    "start-position" : 984,
    "end-position" : 988,
    "concept-id" : "GBvP_Wah_zpr",
    "matched-string" : "värd",
    "annotation-id" : 11
  }, {
    "preferred-label" : "värd",
    "type" : "esco-occupation",
    "start-position" : 990,
    "end-position" : 998,
    "concept-id" : "GBvP_Wah_zpr",
    "matched-string" : "värdinna",
    "annotation-id" : 12
  }, {
    "preferred-label" : "Garderobsvärd",
    "type" : "keyword",
    "start-position" : 1000,
    "end-position" : 1008,
    "concept-id" : "Ky3v_Yf2_mNa",
    "matched-string" : "garderob",
    "annotation-id" : 13
  }, {
    "preferred-label" : "Servitör/Servitris",
    "sentiment" : "MUST_HAVE",
    "type" : "occupation-name",
    "start-position" : 1010,
    "end-position" : 1018,
    "concept-id" : "rGGf_KLs_To7",
    "matched-string" : "servitör",
    "annotation-id" : 0
  }, {
    "preferred-label" : "Servitör/Servitris",
    "sentiment" : "MUST_HAVE",
    "type" : "occupation-name",
    "start-position" : 1025,
    "end-position" : 1034,
    "concept-id" : "rGGf_KLs_To7",
    "matched-string" : "servitris",
    "annotation-id" : 1
  }, {
    "preferred-label" : "Sprit/Vin",
    "sentiment" : "MUST_HAVE",
    "type" : "skill",
    "start-position" : 1667,
    "end-position" : 1670,
    "concept-id" : "S4vL_AVu_s6q",
    "matched-string" : "vin",
    "annotation-id" : 2
  }, {
    "preferred-label" : "Cocktails/Drinkar",
    "sentiment" : "MUST_HAVE",
    "type" : "skill",
    "start-position" : 1675,
    "end-position" : 1684,
    "concept-id" : "ZvbR_g69_jGv",
    "matched-string" : "cocktails",
    "annotation-id" : 3
  }, {
    "preferred-label" : "Restaurang",
    "sentiment" : "MUST_HAVE",
    "type" : "keyword",
    "start-position" : 1741,
    "end-position" : 1751,
    "concept-id" : "o2Cg_3Ap_qvK",
    "matched-string" : "restaurang",
    "annotation-id" : 4
  }, {
    "preferred-label" : "Hotell",
    "sentiment" : "MUST_HAVE",
    "type" : "keyword",
    "start-position" : 2077,
    "end-position" : 2083,
    "concept-id" : "Jrrg_iiS_2yp",
    "matched-string" : "hotell",
    "annotation-id" : 5
  }, {
    "preferred-label" : "Restaurangverksamhet",
    "type" : "sni-level-5",
    "start-position" : 2089,
    "end-position" : 2108,
    "concept-id" : "CK7M_gYV_9ea",
    "matched-string" : "restaurangbranschen",
    "annotation-id" : 16
  }, {
    "preferred-label" : "Personal",
    "sentiment" : "MUST_HAVE",
    "type" : "keyword",
    "start-position" : 2132,
    "end-position" : 2140,
    "concept-id" : "HVxM_6MS_y1c",
    "matched-string" : "personal",
    "annotation-id" : 6
  }, {
    "preferred-label" : "Restaurangverksamhet",
    "type" : "sni-level-5",
    "start-position" : 2201,
    "end-position" : 2220,
    "concept-id" : "CK7M_gYV_9ea",
    "matched-string" : "restaurangbranschen",
    "annotation-id" : 17
  }, {
    "preferred-label" : "Kollektivavtal",
    "sentiment" : "MUST_HAVE",
    "type" : "skill",
    "start-position" : 2271,
    "end-position" : 2285,
    "concept-id" : "z7wE_9xb_3jX",
    "matched-string" : "kollektivavtal",
    "annotation-id" : 7
  } ],
  "text" : "Värdar, garderob och nya stjärnor till event!\nSVERIGES ROLIGASTE RESTAURANGFÖRETAG\n\nVi ska bli Sveriges roligaste restaurangföretag - tillsammans med dig. Låter det ambitiöst? Det är det också!\n\nVi tycker nämligen att du som jobbar i branschen förtjänar en bättre och roligare arbetsplats och en arbetsgivare som verkligen bryr sig om dig. Där du får möjligheten att utvecklas, både personligt och yrkesmässigt och där gemenskap, yrkesstolthet, high-fives, personalfester och glädje är drivkraften. Låter det bra? Vi tänkte väl det. Välkommen till FRAM! 🤗\n\nJOBBA MED DET DU ÄLSKAR - PÅ DINA VILLKOR 🤩\n\nPå FRAM kan du jobba med det du älskar utan att känna dig pressad till att jobba mer än du känner för när det blir för mycket att göra på jobbet. Vill du jobba mycket? Inga problem. Vill du jobba lite mindre och ha tid över till familj eller vänner? Inga problem. Vi lägger stort fokus på att du ska känna att ditt arbete passar ditt liv.\n\nPROFIL\n\nVi söker dig som vill jobba som värd, värdinna, garderob, servitör eller servitris. Du jobbar ute hos våra kunder på varierande arbetsplatser och arbetstider och får möjligheten att upptäcka en uppsjö av olika energigivande arbetsplatser och restauranger tillsammans med dina goa kollegor. Du är flexibel och kan jobba både kvällar och helger.\n\n\n Jobba när du vill, som du vill (ish)\n\n Utbildning inom mat, dryck och service\n\nFRAM AKADEMIN\n\nVi värderar personlig och yrkesmässig utveckling högt, därför har vi skapat FRAM Akademin där vi utbildar nya kollegor och ger dig möjligheten till att utvecklas, lära dig nya spännande saker och att skaffa nya kunskaper inom allt från serveringsteknik och försäljning till vin och cocktails.\n\nFRAM BEMANNING\n\nPå FRAM är vi helt övertygande om att restaurang är ett av världens roligaste jobb. Energin, kollegorna, de glada gästerna och att få jobba med mat och dryck tycker vi slår slöa kontorsarbeten och gråa administrativa jobb i alla avseenden. Att räkna ner tiden tills vi slutar är det få Frammare som känner igen sig i.\n\nVi är ett personligt bemanningsföretag som arbetar med hotell- och restaurangbranschen och ser på företag och personal lite annorlunda. Vi älskar våra medarbetare och brinner för restaurangbranschen.\n\nSjälvklart medlemmar i Visita och anslutna till kollektivavtal.\n\nANSÖKAN\n\nStart: Omgående\nLön: Timlön enl överenskommelse vi ser gärna att du har en annan huvudsysselsättning\nAnsökan: Bifoga CV och bild på dig själv i ansökan (bild är frivilligt)"
}