{
  "meta" : {
    "jobad" : {
      "description" : {
        "requirements" : null,
        "needs" : null,
        "company_information" : null,
        "text_formatted" : "Svenska kyrkan i Södertälje har drygt 100 anställda i kyrklig verksamhet och på Kyrkogårdsförvaltningen.\r\n\r\nSom kantor ingår du i Södertälje församlings arbetslag. Södertälje är en spännande stad med stor mångfald och där Svenska kyrkan ingår i det ekumeniska samarbetet.\n\n \n\nVi söker nu dig som vill vara med att utveckla vår musikverksamhet för barn och unga i Södertälje församling.\n\n \n\nTJÄNSTEN\n\nVi har en ledig tjänst som kantor med placering i Hovsjö och Tveta kyrkor i Södertälje.\n\n \n\nDITT UPPDRAG\n\nDu har kantorsutbildning och är förtrogenhet med Svenska kyrkans tro och liv.\n\nDu har ett diakonalt förhållningssätt, fingertoppskänsla och vill vara med och utveckla församlingslivet.\n\nDu är flexibel och kan växla mellan att vara drivande och att ingå i teamets samarbeten.\nDu vill arbeta med och för barn och ungdomar och tycker om att åka på läger.\n\n \n\nI tjänsten ingår att regelbundet spela vid gudstjänster, andakter och kyrkliga handlingar.\n\n \n\nKVALIFIKATIONER\n\n\n - Kantorsutbildning eller högre.\n - Medlem i Svenska kyrkan\n - B-körkort\n\n \n\nIntervjuer med provspelning sker löpande.\n\n \n\nVälkommen att läsa mer om oss och vår verksamhet på https://www.svenskakyrkan.se/sodertalje.",
        "conditions" : "100%. Tillträde: Enligt överenskommelse\r\nTillsvidareanställning",
        "text" : "Svenska kyrkan i Södertälje har drygt 100 anställda i kyrklig verksamhet och på Kyrkogårdsförvaltningen.\r\n\r\nSom kantor ingår du i Södertälje församlings arbetslag. Södertälje är en spännande stad med stor mångfald och där Svenska kyrkan ingår i det ekumeniska samarbetet.\n\n \n\nVi söker nu dig som vill vara med att utveckla vår musikverksamhet för barn och unga i Södertälje församling.\n\n \n\nTJÄNSTEN\n\nVi har en ledig tjänst som kantor med placering i Hovsjö och Tveta kyrkor i Södertälje.\n\n \n\nDITT UPPDRAG\n\nDu har kantorsutbildning och är förtrogenhet med Svenska kyrkans tro och liv.\n\nDu har ett diakonalt förhållningssätt, fingertoppskänsla och vill vara med och utveckla församlingslivet.\n\nDu är flexibel och kan växla mellan att vara drivande och att ingå i teamets samarbeten.\nDu vill arbeta med och för barn och ungdomar och tycker om att åka på läger.\n\n \n\nI tjänsten ingår att regelbundet spela vid gudstjänster, andakter och kyrkliga handlingar.\n\n \n\nKVALIFIKATIONER\n\n\n - Kantorsutbildning eller högre.\n - Medlem i Svenska kyrkan\n - B-körkort\n\n \n\nIntervjuer med provspelning sker löpande.\n\n \n\nVälkommen att läsa mer om oss och vår verksamhet på https://www.svenskakyrkan.se/sodertalje."
      },
      "headline" : "Kantor 100%",
      "driving_license" : [ {
        "concept_id" : "VTK8_WRx_GcM",
        "label" : "B",
        "legacy_ams_taxonomy_id" : "3"
      } ],
      "employer" : {
        "email" : null,
        "phone_number" : null,
        "organization_number" : "2520030707",
        "name" : "Södertälje Pastorat",
        "url" : null,
        "workplace" : "Södertälje pastorat, Södertälje församling"
      },
      "removed_date" : null,
      "logo_url" : "https://www.arbetsformedlingen.se/rest/arbetsgivare/rest/af/v3/organisation/2520030707/logotyper/logo.png",
      "last_publication_date" : "2022-09-12T23:59:59",
      "number_of_vacancies" : 1,
      "occupation" : {
        "concept_id" : "WoT4_oqQ_5Fa",
        "label" : "Kantor",
        "legacy_ams_taxonomy_id" : "3362"
      },
      "occupation_group" : {
        "concept_id" : "AWJF_wqZ_va9",
        "label" : "Musiker, sångare och kompositörer",
        "legacy_ams_taxonomy_id" : "2652"
      },
      "employment_type" : {
        "concept_id" : "PFZr_Syz_cUq",
        "label" : "Vanlig anställning",
        "legacy_ams_taxonomy_id" : "1"
      },
      "webpage_url" : "https://arbetsformedlingen.se/platsbanken/annonser/26425782",
      "driving_license_required" : true,
      "application_contacts" : [ {
        "description" : "Hanna Lönneborg",
        "email" : null,
        "telephone" : "08-55091360",
        "name" : null,
        "contact_type" : null
      } ],
      "duration" : {
        "concept_id" : "a7uU_j21_mkL",
        "label" : "Tills vidare",
        "legacy_ams_taxonomy_id" : "1"
      },
      "nice_to_have" : {
        "education_level" : [ ],
        "work_experiences" : [ ],
        "skills" : [ ],
        "education" : [ ],
        "languages" : [ ]
      },
      "application_details" : {
        "via_af" : false,
        "email" : null,
        "other" : null,
        "reference" : "2022/216",
        "url" : "https://svenskakyrkan.varbi.com/what:job/jobID:536310/type:job/where:1/apply:1",
        "information" : null
      },
      "source_type" : "VIA_PLATSBANKEN_DXA",
      "application_deadline" : "2022-09-12T23:59:59",
      "external_id" : "46-252003-0707-536310",
      "workplace_address" : {
        "coordinates" : [ 17.625689, 59.195362 ],
        "city" : null,
        "postcode" : null,
        "municipality" : "Södertälje",
        "region_concept_id" : "CifL_Rzy_Mku",
        "region" : "Stockholms län",
        "country_code" : "199",
        "region_code" : "01",
        "municipality_concept_id" : "g6hK_M1o_hiU",
        "country_concept_id" : "i46j_HmG_v64",
        "municipality_code" : "0181",
        "street_address" : null,
        "country" : "Sverige"
      },
      "id" : "26425782",
      "experience_required" : true,
      "working_hours_type" : {
        "concept_id" : "6YE1_gAC_R2G",
        "label" : "Heltid",
        "legacy_ams_taxonomy_id" : "1"
      },
      "access" : null,
      "timestamp" : 1660820972883,
      "must_have" : {
        "education_level" : [ ],
        "work_experiences" : [ {
          "concept_id" : "WoT4_oqQ_5Fa",
          "weight" : 10,
          "label" : "Kantor",
          "legacy_ams_taxonomy_id" : "3362"
        } ],
        "skills" : [ ],
        "education" : [ ],
        "languages" : [ ]
      },
      "occupation_field" : {
        "concept_id" : "9puE_nYg_crq",
        "label" : "Kultur, media, design",
        "legacy_ams_taxonomy_id" : "11"
      },
      "scope_of_work" : {
        "min" : 100,
        "max" : 100
      },
      "salary_type" : {
        "concept_id" : "oG8G_9cW_nRf",
        "label" : "Fast månads- vecko- eller timlön",
        "legacy_ams_taxonomy_id" : "1"
      },
      "removed" : false,
      "salary_description" : "Månadslön",
      "access_to_own_car" : false,
      "publication_date" : "2022-08-18T13:09:32"
    },
    "name" : "Kantor 100%",
    "user" : "hannes"
  },
  "sha1" : "2915efabc005badf0f810cd04c5e249f7d136c2d",
  "annotations" : [ {
    "preferred-label" : "Kantor",
    "sentiment" : "MUST_HAVE",
    "type" : "occupation-name",
    "start-position" : 0,
    "end-position" : 6,
    "concept-id" : "WoT4_oqQ_5Fa",
    "matched-string" : "kantor",
    "annotation-id" : 0
  }, {
    "preferred-label" : "Heltid",
    "sentiment" : "OFFERED",
    "type" : "worktime-extent",
    "start-position" : 7,
    "end-position" : 11,
    "concept-id" : "6YE1_gAC_R2G",
    "matched-string" : "100%",
    "annotation-id" : 13
  }, {
    "preferred-label" : "Kyrkan",
    "sentiment" : "NOT_RELEVANT",
    "type" : "keyword",
    "start-position" : 20,
    "end-position" : 26,
    "concept-id" : "h4LF_GE3_FGu",
    "matched-string" : "kyrkan",
    "annotation-id" : 2
  }, {
    "preferred-label" : "Södertälje",
    "sentiment" : "NOT_RELEVANT",
    "type" : "municipality",
    "start-position" : 29,
    "end-position" : 39,
    "concept-id" : "g6hK_M1o_hiU",
    "matched-string" : "Södertälje",
    "annotation-id" : 14
  }, {
    "preferred-label" : "Kantor",
    "sentiment" : "MUST_HAVE",
    "type" : "occupation-name",
    "start-position" : 124,
    "end-position" : 130,
    "concept-id" : "WoT4_oqQ_5Fa",
    "matched-string" : "kantor",
    "annotation-id" : 3
  }, {
    "preferred-label" : "Södertälje",
    "sentiment" : "NOT_RELEVANT",
    "type" : "municipality",
    "start-position" : 142,
    "end-position" : 152,
    "concept-id" : "g6hK_M1o_hiU",
    "matched-string" : "Södertälje",
    "annotation-id" : 15
  }, {
    "preferred-label" : "Södertälje",
    "sentiment" : "NOT_RELEVANT",
    "type" : "municipality",
    "start-position" : 176,
    "end-position" : 186,
    "concept-id" : "g6hK_M1o_hiU",
    "matched-string" : "Södertälje",
    "annotation-id" : 16
  }, {
    "preferred-label" : "Kyrkan",
    "sentiment" : "NOT_RELEVANT",
    "type" : "keyword",
    "start-position" : 242,
    "end-position" : 248,
    "concept-id" : "h4LF_GE3_FGu",
    "matched-string" : "kyrkan",
    "annotation-id" : 5
  }, {
    "preferred-label" : "Södertälje",
    "sentiment" : "NOT_RELEVANT",
    "type" : "municipality",
    "start-position" : 375,
    "end-position" : 385,
    "concept-id" : "g6hK_M1o_hiU",
    "matched-string" : "Södertälje",
    "annotation-id" : 17
  }, {
    "preferred-label" : "Församling",
    "sentiment" : "NOT_RELEVANT",
    "type" : "keyword",
    "start-position" : 386,
    "end-position" : 396,
    "concept-id" : "rfGv_wrD_n9x",
    "matched-string" : "församling",
    "annotation-id" : 6
  }, {
    "preferred-label" : "Kantor",
    "sentiment" : "MUST_HAVE",
    "type" : "occupation-name",
    "start-position" : 439,
    "end-position" : 445,
    "concept-id" : "WoT4_oqQ_5Fa",
    "matched-string" : "kantor",
    "annotation-id" : 7
  }, {
    "preferred-label" : "Södertälje",
    "sentiment" : "NOT_RELEVANT",
    "type" : "municipality",
    "start-position" : 488,
    "end-position" : 498,
    "concept-id" : "g6hK_M1o_hiU",
    "matched-string" : "Södertälje",
    "annotation-id" : 18
  }, {
    "preferred-label" : "Kantorsutbildning",
    "sentiment" : "MUST_HAVE",
    "type" : "keyword",
    "start-position" : 525,
    "end-position" : 542,
    "concept-id" : "YjCp_owJ_erz",
    "matched-string" : "kantorsutbildning",
    "annotation-id" : 8
  }, {
    "preferred-label" : "Kyrkan",
    "sentiment" : "NOT_RELEVANT",
    "type" : "keyword",
    "start-position" : 575,
    "end-position" : 582,
    "concept-id" : "h4LF_GE3_FGu",
    "matched-string" : "kyrkans",
    "annotation-id" : 19
  }, {
    "preferred-label" : "Kantorsutbildning",
    "sentiment" : "MUST_HAVE",
    "type" : "keyword",
    "start-position" : 990,
    "end-position" : 1007,
    "concept-id" : "YjCp_owJ_erz",
    "matched-string" : "kantorsutbildning",
    "annotation-id" : 10
  }, {
    "preferred-label" : "Kyrkan",
    "sentiment" : "MUST_HAVE",
    "type" : "keyword",
    "start-position" : 1041,
    "end-position" : 1047,
    "concept-id" : "h4LF_GE3_FGu",
    "matched-string" : "kyrkan",
    "annotation-id" : 12
  }, {
    "preferred-label" : "B",
    "sentiment" : "MUST_HAVE",
    "type" : "driving-licence",
    "start-position" : 1051,
    "end-position" : 1060,
    "concept-id" : "VTK8_WRx_GcM",
    "matched-string" : "B-körkort",
    "annotation-id" : 20
  } ],
  "text" : "Kantor 100%\nSvenska kyrkan i Södertälje har drygt 100 anställda i kyrklig verksamhet och på Kyrkogårdsförvaltningen.\r\n\r\nSom kantor ingår du i Södertälje församlings arbetslag. Södertälje är en spännande stad med stor mångfald och där Svenska kyrkan ingår i det ekumeniska samarbetet.\n\n \n\nVi söker nu dig som vill vara med att utveckla vår musikverksamhet för barn och unga i Södertälje församling.\n\n \n\nTJÄNSTEN\n\nVi har en ledig tjänst som kantor med placering i Hovsjö och Tveta kyrkor i Södertälje.\n\n \n\nDITT UPPDRAG\n\nDu har kantorsutbildning och är förtrogenhet med Svenska kyrkans tro och liv.\n\nDu har ett diakonalt förhållningssätt, fingertoppskänsla och vill vara med och utveckla församlingslivet.\n\nDu är flexibel och kan växla mellan att vara drivande och att ingå i teamets samarbeten.\nDu vill arbeta med och för barn och ungdomar och tycker om att åka på läger.\n\n \n\nI tjänsten ingår att regelbundet spela vid gudstjänster, andakter och kyrkliga handlingar.\n\n \n\nKVALIFIKATIONER\n\n\n - Kantorsutbildning eller högre.\n - Medlem i Svenska kyrkan\n - B-körkort\n\n \n\nIntervjuer med provspelning sker löpande.\n\n \n\nVälkommen att läsa mer om oss och vår verksamhet på https://www.svenskakyrkan.se/sodertalje."
}