{
  "meta" : {
    "jobad" : {
      "description" : {
        "requirements" : null,
        "needs" : null,
        "company_information" : null,
        "text_formatted" : "Om enheten\n Försvarsmusiken är en enhet med funktionsansvar inom Försvarsmakten för den svenska militärmusiken. Huvuduppgiften är statsceremonier med musik vid nationella högtidsdagar, riksmötets öppnande, statsbesök, kungliga audienser, högvaktsavlösning med vaktparad samt högre chefsbesök. Försvarsmusiken erbjuder ett brett utbud av konserter för en bred publik främst under höst, vinter och vår. Försvarsmusiken består tre musikkårer: Arméns musikkår, Marinens musikkår och den beridna Livgardets dragonmusikkår.\n\nArméns musikkår är en musikkår för parad- och ceremoniverksamhet samt en symfonisk blåsorkester för konsertverksamhet i olika genrer och med skiftande inriktning. Kåren, som består av 53 musiker, är placerad Häggvik i Sollentuna. Samarbete sker med de övriga musikkårerna.\n\nHuvudsakliga arbetsuppgifter\n\n\n• Marscherande spel i ceremoniel, parad och figurativ uppvisning\n• Medverka vid konserter i orkester och ensembler\n• Medverka i Tv-, radio-, streaming-, skivinspelning och sociala medier\n• Delta i olika arbetsgrupper inom Försvarsmusiken\n\n \n\nArbetsförhållanden\n  • Arbetet sker på flera platser med oregelbundna arbetstider samt i skiftande förhållanden och miljöer såväl inom- som utomhus, i Sverige och utomlands\n\n\n• Framträdanden sker i uniform\n\n\n Kvalifikationer\n  • Musikutbildning vid högskola eller motsvarande kompetens\n\n\n• Mycket god fysisk status för marscherande spel\n \n Meriterande\n• Genomförd värnplikt/grundläggande militär utbildning\n• Körkort\n\n \n\nPersonliga egenskaper \n Stor vikt kommer att läggas vid personlig lämplighet. Vi söker en självgående och ansvarsfull person. Du är ordningsam, lyhörd och pålitlig med ett flexibelt och lösningsorienterat tänk. Du är en lagspelare som har lätt för att samarbeta med andra. En viktig del i rollen är att vara en värdig representant för Sverige och Försvarsmakten.\n \n Övrigt\n Befattningen är en tillsvidaretjänst med sex månaders provanställning. Den tillsätts efter provspelning som genomförs efter personlig kallelse i musikkårens lokaler i Häggvik den 30 september 2022. Efterföljande intervju och exercisprov sker snarast möjligt.\n\nObligatoriskt verk i första rundan är Richard Strauss hornkonsert opus 11, sats 1. Övriga noter skickas ut i samband med kallelsen cirka tre veckor före provspelningen.\n\nTillträde 1 januari 2023 eller efter överenskommelse. Det är den sammanvägda bedömningen av ensembleprovet, exercisprovet och intervjun som kommer att ligga till grund för ett erbjudande om anställning. Individuell lönesättning tillämpas. Sökande skall vara svensk medborgare. Godkänd registerkontroll är ett krav för anställning.\n\nAnställda inom Försvarsmakten erbjuds tre timmar fysisk träning i veckan på arbetstid. Goda träningsmöjligheter finns i och kring musikkårens lokaler i Sollentuna.\n\nDin ansökan görs via rekryteringsverktyget Reachme innehållande CV och ett personligt brev där du motiverar varför du är lämpad för denna befattning senast 4 september 2022.\n\n \n\nFör upplysningar om befattningen kontakta:\n Per Iko, chef för Arméns musikkår, 073-338 70 57, per.iko@mil.se\n\nMattias Arveheim, ställföreträdande chef, 070-520 33 28, mattias.arveheim@mil.se\n\nKristian Möller, konsertmästare, 070-818 88 00, kristian.moller@mil.se\n\n \n\nFackliga företrädare (nås via Försvarsmaktens växel 08- 584 540 00):\n SEKO: Thomas Klasson\n\nSACO: Johan Gillemyr\n\nOFRO: Stefan Morin\n\nOFRS: Kennet Hartikainen \n\n\n Ansökningar till denna befattning kommer endast tas emot via Försvarsmaktens webbplats. \n--------------------------------------------------------\nInformation om Försvarsmakten och det rekryterande förbandet:\n\nLivgardet är ett av Försvarsmaktens största förband med anor från 1521. Vi utbildar morgondagens soldater, liksom militärpoliser och personal som ska genomföra internationell insats. Vi bevakar de kungliga slotten, vi har säkerhets- och markstridsförband. Vi ansvarar också för att bevara och utveckla svensk militärmusiktradition. Vårt huvudsäte är i Kungsängen utanför Stockholm, men vi finns också i Sollentuna, i centrala Stockholm, Uppsala, Göteborg och Karlskrona.  \n\nInom Försvarsmakten finns en stark värdegrund som bygger på öppenhet, resultat och ansvar. Professionell utveckling och personlig hälsa värdesätts och uppmuntras. Det finns goda förutsättningar för intern karriärrörlighet, friskvård samt bra balans mellan arbete och privatliv.\n\nEn anställning hos oss innebär placering i säkerhetsklass. Vanligtvis krävs svenskt medborgarskap.\nSäkerhetsprövning med registerkontroll kommer att genomföras före anställning enligt 3 kap i säkerhetsskyddslagen. Med anställning följer en skyldighet att krigsplaceras. I anställningen ingår även en skyldighet att tjänstgöra utomlands. Innebörden av detta varierar beroende på typ av befattning.\n\nTill ansökan om anställning ska CV och personligt brev bifogas. Om du går vidare i anställningsprocessen ska alltid vidimerade kopior av betyg och intyg uppvisas.\n\nSamtal från externa rekryteringsföretag och säljare undanbedes.",
        "conditions" : "Heltid/\r\n100%",
        "text" : "Om enheten\n Försvarsmusiken är en enhet med funktionsansvar inom Försvarsmakten för den svenska militärmusiken. Huvuduppgiften är statsceremonier med musik vid nationella högtidsdagar, riksmötets öppnande, statsbesök, kungliga audienser, högvaktsavlösning med vaktparad samt högre chefsbesök. Försvarsmusiken erbjuder ett brett utbud av konserter för en bred publik främst under höst, vinter och vår. Försvarsmusiken består tre musikkårer: Arméns musikkår, Marinens musikkår och den beridna Livgardets dragonmusikkår.\n\nArméns musikkår är en musikkår för parad- och ceremoniverksamhet samt en symfonisk blåsorkester för konsertverksamhet i olika genrer och med skiftande inriktning. Kåren, som består av 53 musiker, är placerad Häggvik i Sollentuna. Samarbete sker med de övriga musikkårerna.\n\nHuvudsakliga arbetsuppgifter\n\n\n• Marscherande spel i ceremoniel, parad och figurativ uppvisning\n• Medverka vid konserter i orkester och ensembler\n• Medverka i Tv-, radio-, streaming-, skivinspelning och sociala medier\n• Delta i olika arbetsgrupper inom Försvarsmusiken\n\n \n\nArbetsförhållanden\n  • Arbetet sker på flera platser med oregelbundna arbetstider samt i skiftande förhållanden och miljöer såväl inom- som utomhus, i Sverige och utomlands\n\n\n• Framträdanden sker i uniform\n\n\n Kvalifikationer\n  • Musikutbildning vid högskola eller motsvarande kompetens\n\n\n• Mycket god fysisk status för marscherande spel\n \n Meriterande\n• Genomförd värnplikt/grundläggande militär utbildning\n• Körkort\n\n \n\nPersonliga egenskaper \n Stor vikt kommer att läggas vid personlig lämplighet. Vi söker en självgående och ansvarsfull person. Du är ordningsam, lyhörd och pålitlig med ett flexibelt och lösningsorienterat tänk. Du är en lagspelare som har lätt för att samarbeta med andra. En viktig del i rollen är att vara en värdig representant för Sverige och Försvarsmakten.\n \n Övrigt\n Befattningen är en tillsvidaretjänst med sex månaders provanställning. Den tillsätts efter provspelning som genomförs efter personlig kallelse i musikkårens lokaler i Häggvik den 30 september 2022. Efterföljande intervju och exercisprov sker snarast möjligt.\n\nObligatoriskt verk i första rundan är Richard Strauss hornkonsert opus 11, sats 1. Övriga noter skickas ut i samband med kallelsen cirka tre veckor före provspelningen.\n\nTillträde 1 januari 2023 eller efter överenskommelse. Det är den sammanvägda bedömningen av ensembleprovet, exercisprovet och intervjun som kommer att ligga till grund för ett erbjudande om anställning. Individuell lönesättning tillämpas. Sökande skall vara svensk medborgare. Godkänd registerkontroll är ett krav för anställning.\n\nAnställda inom Försvarsmakten erbjuds tre timmar fysisk träning i veckan på arbetstid. Goda träningsmöjligheter finns i och kring musikkårens lokaler i Sollentuna.\n\nDin ansökan görs via rekryteringsverktyget Reachme innehållande CV och ett personligt brev där du motiverar varför du är lämpad för denna befattning senast 4 september 2022.\n\n \n\nFör upplysningar om befattningen kontakta:\n Per Iko, chef för Arméns musikkår, 073-338 70 57, per.iko@mil.se\n\nMattias Arveheim, ställföreträdande chef, 070-520 33 28, mattias.arveheim@mil.se\n\nKristian Möller, konsertmästare, 070-818 88 00, kristian.moller@mil.se\n\n \n\nFackliga företrädare (nås via Försvarsmaktens växel 08- 584 540 00):\n SEKO: Thomas Klasson\n\nSACO: Johan Gillemyr\n\nOFRO: Stefan Morin\n\nOFRS: Kennet Hartikainen \n\n\n Ansökningar till denna befattning kommer endast tas emot via Försvarsmaktens webbplats. \n--------------------------------------------------------\nInformation om Försvarsmakten och det rekryterande förbandet:\n\nLivgardet är ett av Försvarsmaktens största förband med anor från 1521. Vi utbildar morgondagens soldater, liksom militärpoliser och personal som ska genomföra internationell insats. Vi bevakar de kungliga slotten, vi har säkerhets- och markstridsförband. Vi ansvarar också för att bevara och utveckla svensk militärmusiktradition. Vårt huvudsäte är i Kungsängen utanför Stockholm, men vi finns också i Sollentuna, i centrala Stockholm, Uppsala, Göteborg och Karlskrona.  \n\nInom Försvarsmakten finns en stark värdegrund som bygger på öppenhet, resultat och ansvar. Professionell utveckling och personlig hälsa värdesätts och uppmuntras. Det finns goda förutsättningar för intern karriärrörlighet, friskvård samt bra balans mellan arbete och privatliv.\n\nEn anställning hos oss innebär placering i säkerhetsklass. Vanligtvis krävs svenskt medborgarskap.\nSäkerhetsprövning med registerkontroll kommer att genomföras före anställning enligt 3 kap i säkerhetsskyddslagen. Med anställning följer en skyldighet att krigsplaceras. I anställningen ingår även en skyldighet att tjänstgöra utomlands. Innebörden av detta varierar beroende på typ av befattning.\n\nTill ansökan om anställning ska CV och personligt brev bifogas. Om du går vidare i anställningsprocessen ska alltid vidimerade kopior av betyg och intyg uppvisas.\n\nSamtal från externa rekryteringsföretag och säljare undanbedes."
      },
      "headline" : "Musiker – valthorn till Arméns musikkår",
      "driving_license" : null,
      "employer" : {
        "email" : null,
        "phone_number" : null,
        "organization_number" : "2021004615",
        "name" : "Försvarsmakten",
        "url" : "http://www.forsvarsmakten.se/sv/",
        "workplace" : "Försvarsmakten"
      },
      "removed_date" : null,
      "logo_url" : "https://www.arbetsformedlingen.se/rest/arbetsgivare/rest/af/v3/organisation/2021004615/logotyper/logo.png",
      "last_publication_date" : "2022-09-04T23:59:59",
      "number_of_vacancies" : 1,
      "occupation" : {
        "concept_id" : "aR3a_5Ly_TDw",
        "label" : "Musiker, klassisk musik",
        "legacy_ams_taxonomy_id" : "7202"
      },
      "occupation_group" : {
        "concept_id" : "AWJF_wqZ_va9",
        "label" : "Musiker, sångare och kompositörer",
        "legacy_ams_taxonomy_id" : "2652"
      },
      "employment_type" : {
        "concept_id" : "PFZr_Syz_cUq",
        "label" : "Vanlig anställning",
        "legacy_ams_taxonomy_id" : "1"
      },
      "webpage_url" : "https://arbetsformedlingen.se/platsbanken/annonser/26328968",
      "driving_license_required" : false,
      "application_contacts" : [ ],
      "duration" : {
        "concept_id" : "a7uU_j21_mkL",
        "label" : "Tills vidare",
        "legacy_ams_taxonomy_id" : "1"
      },
      "nice_to_have" : {
        "education_level" : [ ],
        "work_experiences" : [ ],
        "skills" : [ ],
        "education" : [ ],
        "languages" : [ ]
      },
      "application_details" : {
        "via_af" : false,
        "email" : null,
        "other" : null,
        "reference" : null,
        "url" : "https://web103.reachmee.com/ext/I005/333/main?site=2&validator=a75fbd88f1b2a3a49de2af9c8b7bc228&lang=SE&rmpage=job&rmjob=30230",
        "information" : null
      },
      "source_type" : "VIA_PLATSBANKEN_DXA",
      "application_deadline" : "2022-09-04T23:59:59",
      "external_id" : "46-202100-4615-30230",
      "workplace_address" : {
        "coordinates" : [ 17.94148, 59.43911 ],
        "city" : null,
        "postcode" : null,
        "municipality" : "Sollentuna",
        "region_concept_id" : "CifL_Rzy_Mku",
        "region" : "Stockholms län",
        "country_code" : "199",
        "region_code" : "01",
        "municipality_concept_id" : "Z5Cq_SgB_dsB",
        "country_concept_id" : "i46j_HmG_v64",
        "municipality_code" : "0163",
        "street_address" : null,
        "country" : "Sverige"
      },
      "id" : "26328968",
      "experience_required" : true,
      "working_hours_type" : {
        "concept_id" : "6YE1_gAC_R2G",
        "label" : "Heltid",
        "legacy_ams_taxonomy_id" : "1"
      },
      "access" : null,
      "timestamp" : 1657865211110,
      "must_have" : {
        "education_level" : [ ],
        "work_experiences" : [ {
          "concept_id" : "aR3a_5Ly_TDw",
          "weight" : 10,
          "label" : "Musiker, klassisk musik",
          "legacy_ams_taxonomy_id" : "7202"
        } ],
        "skills" : [ ],
        "education" : [ ],
        "languages" : [ ]
      },
      "occupation_field" : {
        "concept_id" : "9puE_nYg_crq",
        "label" : "Kultur, media, design",
        "legacy_ams_taxonomy_id" : "11"
      },
      "scope_of_work" : {
        "min" : 100,
        "max" : 100
      },
      "salary_type" : {
        "concept_id" : "oG8G_9cW_nRf",
        "label" : "Fast månads- vecko- eller timlön",
        "legacy_ams_taxonomy_id" : "1"
      },
      "removed" : false,
      "salary_description" : "Försvarsmakten tillämpar individuell lönesättning",
      "access_to_own_car" : false,
      "publication_date" : "2022-07-15T08:06:51"
    },
    "name" : "Musiker – valthorn till Arméns musikkår",
    "user" : "hannes"
  },
  "sha1" : "36aae828974c8c93957807952faf390e0601747e",
  "annotations" : [ {
    "preferred-label" : "musiker",
    "sentiment" : "MUST_HAVE",
    "type" : "esco-occupation",
    "start-position" : 0,
    "end-position" : 7,
    "concept-id" : "okbH_FXa_yFz",
    "matched-string" : "musiker",
    "annotation-id" : 0
  }, {
    "preferred-label" : "Valthorn",
    "sentiment" : "MUST_HAVE",
    "type" : "skill",
    "start-position" : 10,
    "end-position" : 18,
    "concept-id" : "pPRM_tVp_b9v",
    "matched-string" : "valthorn",
    "annotation-id" : 1
  }, {
    "preferred-label" : "Försvarsmakten",
    "sentiment" : "MUST_HAVE",
    "type" : "keyword",
    "start-position" : 105,
    "end-position" : 119,
    "concept-id" : "GSC3_yU4_K5V",
    "matched-string" : "försvarsmakten",
    "annotation-id" : 2
  }, {
    "preferred-label" : "musiker",
    "sentiment" : "MUST_HAVE",
    "type" : "esco-occupation",
    "start-position" : 746,
    "end-position" : 753,
    "concept-id" : "okbH_FXa_yFz",
    "matched-string" : "musiker",
    "annotation-id" : 5
  }, {
    "preferred-label" : "Sollentuna",
    "type" : "municipality",
    "start-position" : 777,
    "end-position" : 787,
    "concept-id" : "Z5Cq_SgB_dsB",
    "matched-string" : "Sollentuna",
    "annotation-id" : 21
  }, {
    "preferred-label" : "TV",
    "type" : "skill",
    "start-position" : 992,
    "end-position" : 994,
    "concept-id" : "YBuN_Wgv_19X",
    "matched-string" : "Tv",
    "annotation-id" : 22
  }, {
    "preferred-label" : "Radio",
    "sentiment" : "MUST_HAVE",
    "type" : "skill",
    "start-position" : 997,
    "end-position" : 1002,
    "concept-id" : "5T5g_ij5_JUC",
    "matched-string" : "radio",
    "annotation-id" : 6
  }, {
    "preferred-label" : "Sverige",
    "type" : "country",
    "start-position" : 1257,
    "end-position" : 1264,
    "concept-id" : "i46j_HmG_v64",
    "matched-string" : "Sverige",
    "annotation-id" : 23
  }, {
    "preferred-label" : "Fullgjord värnplikt",
    "type" : "skill",
    "start-position" : 1460,
    "end-position" : 1479,
    "concept-id" : "JjHn_wR7_Zdg",
    "matched-string" : "Genomförd värnplikt",
    "annotation-id" : 25
  }, {
    "preferred-label" : "Militär",
    "sentiment" : "MUST_HAVE",
    "type" : "keyword",
    "start-position" : 1494,
    "end-position" : 1501,
    "concept-id" : "DwGx_oR9_N4t",
    "matched-string" : "militär",
    "annotation-id" : 7
  }, {
    "preferred-label" : "körkort",
    "type" : "esco-skill",
    "start-position" : 1515,
    "end-position" : 1522,
    "concept-id" : "UvDr_eNo_HSQ",
    "matched-string" : "Körkort",
    "annotation-id" : 24
  }, {
    "preferred-label" : "visa ansvarstagande",
    "type" : "esco-skill",
    "start-position" : 1633,
    "end-position" : 1644,
    "concept-id" : "bcRp_hxV_f5G",
    "matched-string" : "ansvarsfull",
    "annotation-id" : 26
  }, {
    "preferred-label" : "Sverige",
    "type" : "country",
    "start-position" : 1862,
    "end-position" : 1869,
    "concept-id" : "i46j_HmG_v64",
    "matched-string" : "Sverige",
    "annotation-id" : 27
  }, {
    "preferred-label" : "Försvarsmakten",
    "sentiment" : "MUST_HAVE",
    "type" : "keyword",
    "start-position" : 1874,
    "end-position" : 1888,
    "concept-id" : "GSC3_yU4_K5V",
    "matched-string" : "försvarsmakten",
    "annotation-id" : 8
  }, {
    "preferred-label" : "Tillsvidareanställning (inkl. eventuell provanställning)",
    "type" : "employment-type",
    "start-position" : 1920,
    "end-position" : 1937,
    "concept-id" : "kpPX_CNN_gDU",
    "matched-string" : "tillsvidaretjänst",
    "annotation-id" : 28
  }, {
    "preferred-label" : "Försvarsmakten",
    "sentiment" : "MUST_HAVE",
    "type" : "keyword",
    "start-position" : 2678,
    "end-position" : 2692,
    "concept-id" : "GSC3_yU4_K5V",
    "matched-string" : "försvarsmakten",
    "annotation-id" : 10
  }, {
    "preferred-label" : "Träning",
    "sentiment" : "MUST_HAVE",
    "type" : "keyword",
    "start-position" : 2719,
    "end-position" : 2726,
    "concept-id" : "n19Z_hzx_Apu",
    "matched-string" : "träning",
    "annotation-id" : 11
  }, {
    "preferred-label" : "Sollentuna",
    "type" : "municipality",
    "start-position" : 2815,
    "end-position" : 2825,
    "concept-id" : "Z5Cq_SgB_dsB",
    "matched-string" : "Sollentuna",
    "annotation-id" : 29
  }, {
    "preferred-label" : "Konsertmästare",
    "sentiment" : "MUST_HAVE",
    "type" : "occupation-name",
    "start-position" : 3215,
    "end-position" : 3229,
    "concept-id" : "ZCkY_eHC_K8J",
    "matched-string" : "konsertmästare",
    "annotation-id" : 12
  }, {
    "preferred-label" : "Försvarsmakten",
    "sentiment" : "MUST_HAVE",
    "type" : "keyword",
    "start-position" : 3597,
    "end-position" : 3611,
    "concept-id" : "GSC3_yU4_K5V",
    "matched-string" : "försvarsmakten",
    "annotation-id" : 13
  }, {
    "preferred-label" : "Försvarsmakten",
    "sentiment" : "MUST_HAVE",
    "type" : "keyword",
    "start-position" : 4124,
    "end-position" : 4138,
    "concept-id" : "GSC3_yU4_K5V",
    "matched-string" : "försvarsmakten",
    "annotation-id" : 15
  }, {
    "preferred-label" : "Svenskt medborgarskap",
    "sentiment" : "MUST_HAVE",
    "type" : "skill",
    "start-position" : 4474,
    "end-position" : 4495,
    "concept-id" : "chKz_HpD_XL5",
    "matched-string" : "svenskt medborgarskap",
    "annotation-id" : 19
  } ],
  "text" : "Musiker – valthorn till Arméns musikkår\nOm enheten\n Försvarsmusiken är en enhet med funktionsansvar inom Försvarsmakten för den svenska militärmusiken. Huvuduppgiften är statsceremonier med musik vid nationella högtidsdagar, riksmötets öppnande, statsbesök, kungliga audienser, högvaktsavlösning med vaktparad samt högre chefsbesök. Försvarsmusiken erbjuder ett brett utbud av konserter för en bred publik främst under höst, vinter och vår. Försvarsmusiken består tre musikkårer: Arméns musikkår, Marinens musikkår och den beridna Livgardets dragonmusikkår.\n\nArméns musikkår är en musikkår för parad- och ceremoniverksamhet samt en symfonisk blåsorkester för konsertverksamhet i olika genrer och med skiftande inriktning. Kåren, som består av 53 musiker, är placerad Häggvik i Sollentuna. Samarbete sker med de övriga musikkårerna.\n\nHuvudsakliga arbetsuppgifter\n\n\n• Marscherande spel i ceremoniel, parad och figurativ uppvisning\n• Medverka vid konserter i orkester och ensembler\n• Medverka i Tv-, radio-, streaming-, skivinspelning och sociala medier\n• Delta i olika arbetsgrupper inom Försvarsmusiken\n\n \n\nArbetsförhållanden\n  • Arbetet sker på flera platser med oregelbundna arbetstider samt i skiftande förhållanden och miljöer såväl inom- som utomhus, i Sverige och utomlands\n\n\n• Framträdanden sker i uniform\n\n\n Kvalifikationer\n  • Musikutbildning vid högskola eller motsvarande kompetens\n\n\n• Mycket god fysisk status för marscherande spel\n \n Meriterande\n• Genomförd värnplikt/grundläggande militär utbildning\n• Körkort\n\n \n\nPersonliga egenskaper \n Stor vikt kommer att läggas vid personlig lämplighet. Vi söker en självgående och ansvarsfull person. Du är ordningsam, lyhörd och pålitlig med ett flexibelt och lösningsorienterat tänk. Du är en lagspelare som har lätt för att samarbeta med andra. En viktig del i rollen är att vara en värdig representant för Sverige och Försvarsmakten.\n \n Övrigt\n Befattningen är en tillsvidaretjänst med sex månaders provanställning. Den tillsätts efter provspelning som genomförs efter personlig kallelse i musikkårens lokaler i Häggvik den 30 september 2022. Efterföljande intervju och exercisprov sker snarast möjligt.\n\nObligatoriskt verk i första rundan är Richard Strauss hornkonsert opus 11, sats 1. Övriga noter skickas ut i samband med kallelsen cirka tre veckor före provspelningen.\n\nTillträde 1 januari 2023 eller efter överenskommelse. Det är den sammanvägda bedömningen av ensembleprovet, exercisprovet och intervjun som kommer att ligga till grund för ett erbjudande om anställning. Individuell lönesättning tillämpas. Sökande skall vara svensk medborgare. Godkänd registerkontroll är ett krav för anställning.\n\nAnställda inom Försvarsmakten erbjuds tre timmar fysisk träning i veckan på arbetstid. Goda träningsmöjligheter finns i och kring musikkårens lokaler i Sollentuna.\n\nDin ansökan görs via rekryteringsverktyget Reachme innehållande CV och ett personligt brev där du motiverar varför du är lämpad för denna befattning senast 4 september 2022.\n\n \n\nFör upplysningar om befattningen kontakta:\n Per Iko, chef för Arméns musikkår, 073-338 70 57, per.iko@mil.se\n\nMattias Arveheim, ställföreträdande chef, 070-520 33 28, mattias.arveheim@mil.se\n\nKristian Möller, konsertmästare, 070-818 88 00, kristian.moller@mil.se\n\n \n\nFackliga företrädare (nås via Försvarsmaktens växel 08- 584 540 00):\n SEKO: Thomas Klasson\n\nSACO: Johan Gillemyr\n\nOFRO: Stefan Morin\n\nOFRS: Kennet Hartikainen \n\n\n Ansökningar till denna befattning kommer endast tas emot via Försvarsmaktens webbplats. \n--------------------------------------------------------\nInformation om Försvarsmakten och det rekryterande förbandet:\n\nLivgardet är ett av Försvarsmaktens största förband med anor från 1521. Vi utbildar morgondagens soldater, liksom militärpoliser och personal som ska genomföra internationell insats. Vi bevakar de kungliga slotten, vi har säkerhets- och markstridsförband. Vi ansvarar också för att bevara och utveckla svensk militärmusiktradition. Vårt huvudsäte är i Kungsängen utanför Stockholm, men vi finns också i Sollentuna, i centrala Stockholm, Uppsala, Göteborg och Karlskrona.  \n\nInom Försvarsmakten finns en stark värdegrund som bygger på öppenhet, resultat och ansvar. Professionell utveckling och personlig hälsa värdesätts och uppmuntras. Det finns goda förutsättningar för intern karriärrörlighet, friskvård samt bra balans mellan arbete och privatliv.\n\nEn anställning hos oss innebär placering i säkerhetsklass. Vanligtvis krävs svenskt medborgarskap.\nSäkerhetsprövning med registerkontroll kommer att genomföras före anställning enligt 3 kap i säkerhetsskyddslagen. Med anställning följer en skyldighet att krigsplaceras. I anställningen ingår även en skyldighet att tjänstgöra utomlands. Innebörden av detta varierar beroende på typ av befattning.\n\nTill ansökan om anställning ska CV och personligt brev bifogas. Om du går vidare i anställningsprocessen ska alltid vidimerade kopior av betyg och intyg uppvisas.\n\nSamtal från externa rekryteringsföretag och säljare undanbedes."
}