{
  "meta" : {
    "description" : "",
    "ssyk-level-4-kod" : "[\"7212\",\"7223\"]",
    "name" : "Industriteknisk utbildning BAS inkl. Verkstadsteknik",
    "type" : "AUB",
    "utbildningsid" : "124855",
    "ssyk-level-4-namn" : "[\"Maskinställare o maskinoperatörer, metallarbete\",\"Svetsare och gasskärare\"]"
  },
  "sha1" : "df99dc1d2dc5429b46913dd598572e864a5aac60",
  "annotations" : [ {
    "preferred-label" : "Ritningsläsning",
    "sentiment" : "OFFERED",
    "type" : "skill",
    "start-position" : 457,
    "end-position" : 472,
    "concept-id" : "aHCV_VsV_LiD",
    "matched-string" : "ritningsläsning",
    "annotation-id" : 3
  }, {
    "preferred-label" : "matematik",
    "sentiment" : "OFFERED",
    "type" : "esco-skill",
    "start-position" : 443,
    "end-position" : 452,
    "concept-id" : "qn4M_gYf_2K1",
    "matched-string" : "matematik",
    "annotation-id" : 2
  }, {
    "preferred-label" : "CNC-operatör",
    "sentiment" : "OFFERED",
    "type" : "esco-occupation",
    "start-position" : 187,
    "end-position" : 199,
    "concept-id" : "ezxx_3Jf_Li6",
    "matched-string" : "cnc-operatör",
    "annotation-id" : 1
  }, {
    "preferred-label" : "Svets",
    "sentiment" : "OFFERED",
    "type" : "keyword",
    "start-position" : 170,
    "end-position" : 175,
    "concept-id" : "Emhe_ce6_MYC",
    "matched-string" : "svets",
    "annotation-id" : 0
  } ],
  "text" : "Utbildningen ger dig grundkunskaper för att kunna arbeta inom industrin eller för att gå påbyggnadsutbildningar inom industriområdet. Du kan t.ex. vidareutbilda dig inom svets eller till CNC-operatör.\r\n\r\nArbetsmarknaden inom industrin är god och det finns mycket bra möjligheter till arbete i hela landet.\r\n\r\nHur går utbildningen till?\r\nUtbildningen består av både praktiska och teoretiska moment. De teoretiska momenten innehåller exempelvis matematik och ritningsläsning och under de praktiska momenten får du även pröva på olika tekniker. Utbildningen sker i nära samarbete med branschen och en del av grundutbildningen gör du på ett företag för att få kännedom om hur det fungerar i branschen.\r\n\r\nHur lång är utbildningen?\r\nHela utbildningen är ca 21 veckor lång. Men utifrån dina och företagens behov kan den bli såväl längre som kortare."
}