{
  "meta" : {
    "jobad" : {
      "description" : {
        "requirements" : null,
        "needs" : null,
        "company_information" : null,
        "text_formatted" : "<p>A-LYFT AB söker 1 förare till Liebherr mobil tornkran / mobilkran. Vi är ett välmående mobilkranföretag med fräsch maskinpark. Vi har hög beläggning och kommande investeringar. Vårt rykte är gott och vi har en ljus framtid. Trivsel och teamanda är viktigt för oss, det finner du här. Du hittar oss i moderna lokaler i Mölndal.</p><p>Du är: -Självständig och ansvarsfull -Lätt att sammarbeta med -Ordningsam, var sak har sin plats -Flexibel med arbetstider då dagen snabbt kan förändras, tidiga morgnar och sena kvällar förekommer.</p><p>Kranförarbevis är meriterande. Hittar vi rätt person med C-kort står vi för utbildning.</p>",
        "conditions" : null,
        "text" : "A-LYFT AB söker 1 förare till Liebherr mobil tornkran / mobilkran. Vi är ett välmående mobilkranföretag med fräsch maskinpark. Vi har hög beläggning och kommande investeringar. Vårt rykte är gott och vi har en ljus framtid. Trivsel och teamanda är viktigt för oss, det finner du här. Du hittar oss i moderna lokaler i Mölndal.\nDu är: -Självständig och ansvarsfull -Lätt att sammarbeta med -Ordningsam, var sak har sin plats -Flexibel med arbetstider då dagen snabbt kan förändras, tidiga morgnar och sena kvällar förekommer.\nKranförarbevis är meriterande. Hittar vi rätt person med C-kort står vi för utbildning."
      },
      "headline" : "Mobilkranförare",
      "driving_license" : [ {
        "concept_id" : "BKCx_hST_Pcm",
        "label" : "C",
        "legacy_ams_taxonomy_id" : "4"
      }, {
        "concept_id" : "VTK8_WRx_GcM",
        "label" : "B",
        "legacy_ams_taxonomy_id" : "3"
      } ],
      "employer" : {
        "email" : null,
        "phone_number" : null,
        "organization_number" : "5567621247",
        "name" : "A-Lyft AB",
        "url" : "www.a-lyft.se",
        "workplace" : "A-Lyft AB"
      },
      "removed_date" : null,
      "logo_url" : "https://www.arbetsformedlingen.se/rest/arbetsgivare/rest/af/v3/arbetsplatser/86079844/logotyper/logo.png",
      "last_publication_date" : "2022-08-31T23:59:59",
      "number_of_vacancies" : 1,
      "occupation" : {
        "concept_id" : "8c4V_VDM_K7q",
        "label" : "Mobilkranförare",
        "legacy_ams_taxonomy_id" : "1325"
      },
      "occupation_group" : {
        "concept_id" : "XYzP_5Tn_7Ep",
        "label" : "Kranförare m.fl.",
        "legacy_ams_taxonomy_id" : "8343"
      },
      "employment_type" : {
        "concept_id" : "PFZr_Syz_cUq",
        "label" : "Vanlig anställning",
        "legacy_ams_taxonomy_id" : "1"
      },
      "webpage_url" : "https://arbetsformedlingen.se/platsbanken/annonser/26225465",
      "driving_license_required" : true,
      "application_contacts" : [ ],
      "duration" : {
        "concept_id" : "a7uU_j21_mkL",
        "label" : "Tills vidare",
        "legacy_ams_taxonomy_id" : "1"
      },
      "nice_to_have" : {
        "education_level" : [ ],
        "work_experiences" : [ ],
        "skills" : [ ],
        "education" : [ ],
        "languages" : [ ]
      },
      "application_details" : {
        "via_af" : false,
        "email" : "info@alyft.se",
        "other" : null,
        "reference" : null,
        "url" : null,
        "information" : null
      },
      "source_type" : "VIA_ANNONSERA",
      "application_deadline" : "2022-08-31T23:59:59",
      "external_id" : null,
      "workplace_address" : {
        "coordinates" : [ 12.012122366549617, 57.63837458211844 ],
        "city" : "Mölndal",
        "postcode" : "43153",
        "municipality" : "Mölndal",
        "region_concept_id" : "zdoY_6u5_Krt",
        "region" : "Västra Götalands län",
        "country_code" : "199",
        "region_code" : "14",
        "municipality_concept_id" : "mc45_ki9_Bv3",
        "country_concept_id" : "i46j_HmG_v64",
        "municipality_code" : "1481",
        "street_address" : "Kryptongatan 16",
        "country" : "Sverige"
      },
      "id" : "26225465",
      "experience_required" : false,
      "working_hours_type" : {
        "concept_id" : "6YE1_gAC_R2G",
        "label" : "Heltid",
        "legacy_ams_taxonomy_id" : "1"
      },
      "access" : null,
      "timestamp" : 1655387645785,
      "must_have" : {
        "education_level" : [ ],
        "work_experiences" : [ ],
        "skills" : [ ],
        "education" : [ ],
        "languages" : [ ]
      },
      "occupation_field" : {
        "concept_id" : "j7Cq_ZJe_GkT",
        "label" : "Bygg och anläggning",
        "legacy_ams_taxonomy_id" : "2"
      },
      "scope_of_work" : {
        "min" : 0,
        "max" : 100
      },
      "salary_type" : {
        "concept_id" : "oG8G_9cW_nRf",
        "label" : "Fast månads- vecko- eller timlön",
        "legacy_ams_taxonomy_id" : "1"
      },
      "removed" : false,
      "salary_description" : null,
      "access_to_own_car" : false,
      "publication_date" : "2022-06-16T15:54:05"
    },
    "name" : "Mobilkranförare",
    "user" : "hannes"
  },
  "sha1" : "20cce8f4b27a836be6fb42767f2f7459999e0da1",
  "annotations" : [ {
    "preferred-label" : "Mobilkranförare",
    "sentiment" : "MUST_HAVE",
    "type" : "occupation-name",
    "start-position" : 0,
    "end-position" : 15,
    "concept-id" : "8c4V_VDM_K7q",
    "matched-string" : "mobilkranförare",
    "annotation-id" : 0
  }, {
    "preferred-label" : "Tornkranförare",
    "type" : "occupation-name",
    "start-position" : 61,
    "end-position" : 69,
    "concept-id" : "z1K2_Ens_9zu",
    "matched-string" : "tornkran",
    "annotation-id" : 3
  }, {
    "preferred-label" : "Mobilkran",
    "sentiment" : "MUST_HAVE",
    "type" : "skill",
    "start-position" : 72,
    "end-position" : 81,
    "concept-id" : "w2ch_nk6_kqc",
    "matched-string" : "mobilkran",
    "annotation-id" : 1
  }, {
    "preferred-label" : "Mölndal",
    "type" : "municipality",
    "start-position" : 334,
    "end-position" : 341,
    "concept-id" : "mc45_ki9_Bv3",
    "matched-string" : "Mölndal",
    "annotation-id" : 4
  }, {
    "preferred-label" : "arbeta självständigt",
    "type" : "esco-skill",
    "start-position" : 351,
    "end-position" : 363,
    "concept-id" : "NyFu_HHd_zhz",
    "matched-string" : "Självständig",
    "annotation-id" : 5
  }, {
    "preferred-label" : "visa ansvarstagande",
    "type" : "esco-skill",
    "start-position" : 368,
    "end-position" : 379,
    "concept-id" : "bcRp_hxV_f5G",
    "matched-string" : "ansvarsfull",
    "annotation-id" : 6
  }, {
    "preferred-label" : "C",
    "type" : "driving-licence",
    "start-position" : 598,
    "end-position" : 604,
    "concept-id" : "BKCx_hST_Pcm",
    "matched-string" : "C-kort",
    "annotation-id" : 7
  } ],
  "text" : "Mobilkranförare\nA-LYFT AB söker 1 förare till Liebherr mobil tornkran / mobilkran. Vi är ett välmående mobilkranföretag med fräsch maskinpark. Vi har hög beläggning och kommande investeringar. Vårt rykte är gott och vi har en ljus framtid. Trivsel och teamanda är viktigt för oss, det finner du här. Du hittar oss i moderna lokaler i Mölndal.\nDu är: -Självständig och ansvarsfull -Lätt att sammarbeta med -Ordningsam, var sak har sin plats -Flexibel med arbetstider då dagen snabbt kan förändras, tidiga morgnar och sena kvällar förekommer.\nKranförarbevis är meriterande. Hittar vi rätt person med C-kort står vi för utbildning."
}