{
  "meta" : {
    "jobad" : {
      "description" : {
        "requirements" : null,
        "needs" : null,
        "company_information" : null,
        "text_formatted" : "<p>Vi söker en serviceinriktad och noggrann nagelteknolog. Det är även önskvärt att du kan göra ögonfransar. Du måste vara kunnig och utbildad inom området. Arbetsuppgifterna är manikyr, pedikyr, nagelförlängning, fransförlängning etc. Heltid. Lön enligt kollektivavtal.</p><p>My's Nails Skönhetssalong AB, Cityhuset, Kungsgatan 24, Eskilstuna.</p>",
        "conditions" : null,
        "text" : "Vi söker en serviceinriktad och noggrann nagelteknolog. Det är även önskvärt att du kan göra ögonfransar. Du måste vara kunnig och utbildad inom området. Arbetsuppgifterna är manikyr, pedikyr, nagelförlängning, fransförlängning etc. Heltid. Lön enligt kollektivavtal.\nMy's Nails Skönhetssalong AB, Cityhuset, Kungsgatan 24, Eskilstuna."
      },
      "headline" : "Utbildad nagelteknolog sökes",
      "driving_license" : null,
      "employer" : {
        "email" : null,
        "phone_number" : null,
        "organization_number" : "5591899223",
        "name" : "My's Nails Skönhetssalong AB",
        "url" : null,
        "workplace" : "My's Nails Skönhetssalong AB"
      },
      "removed_date" : null,
      "logo_url" : null,
      "last_publication_date" : "2022-09-03T23:59:59",
      "number_of_vacancies" : 1,
      "occupation" : {
        "concept_id" : "JjXV_QEg_EQ1",
        "label" : "Nagelterapeut/Nagelteknolog",
        "legacy_ams_taxonomy_id" : "5439"
      },
      "occupation_group" : {
        "concept_id" : "ezKk_kss_CiQ",
        "label" : "Övriga skönhets- och kroppsterapeuter",
        "legacy_ams_taxonomy_id" : "5149"
      },
      "employment_type" : {
        "concept_id" : "PFZr_Syz_cUq",
        "label" : "Vanlig anställning",
        "legacy_ams_taxonomy_id" : "1"
      },
      "webpage_url" : "https://arbetsformedlingen.se/platsbanken/annonser/26377128",
      "driving_license_required" : false,
      "application_contacts" : [ ],
      "duration" : {
        "concept_id" : "a7uU_j21_mkL",
        "label" : "Tills vidare",
        "legacy_ams_taxonomy_id" : "1"
      },
      "nice_to_have" : {
        "education_level" : [ ],
        "work_experiences" : [ ],
        "skills" : [ ],
        "education" : [ ],
        "languages" : [ ]
      },
      "application_details" : {
        "via_af" : false,
        "email" : "myhanhpham4444@gmail.com",
        "other" : null,
        "reference" : "Arbetsansökan",
        "url" : null,
        "information" : null
      },
      "source_type" : "VIA_ANNONSERA",
      "application_deadline" : "2022-09-03T23:59:59",
      "external_id" : null,
      "workplace_address" : {
        "coordinates" : [ 16.5088668626808, 59.36946308295182 ],
        "city" : "ESKILSTUNA",
        "postcode" : "63220",
        "municipality" : "Eskilstuna",
        "region_concept_id" : "s93u_BEb_sx2",
        "region" : "Södermanlands län",
        "country_code" : "199",
        "region_code" : "04",
        "municipality_concept_id" : "kMxr_NiX_YrU",
        "country_concept_id" : "i46j_HmG_v64",
        "municipality_code" : "0484",
        "street_address" : "Kungsgatan 24",
        "country" : "Sverige"
      },
      "id" : "26377128",
      "experience_required" : true,
      "working_hours_type" : {
        "concept_id" : "6YE1_gAC_R2G",
        "label" : "Heltid",
        "legacy_ams_taxonomy_id" : "1"
      },
      "access" : null,
      "timestamp" : 1659600925280,
      "must_have" : {
        "education_level" : [ ],
        "work_experiences" : [ {
          "concept_id" : "JjXV_QEg_EQ1",
          "weight" : 10,
          "label" : "Nagelterapeut/Nagelteknolog",
          "legacy_ams_taxonomy_id" : "5439"
        } ],
        "skills" : [ {
          "concept_id" : "ayge_aHH_pkG",
          "weight" : 10,
          "label" : "Nagelskulptur",
          "legacy_ams_taxonomy_id" : "4109"
        } ],
        "education" : [ ],
        "languages" : [ ]
      },
      "occupation_field" : {
        "concept_id" : "Uuf1_GMh_Uvw",
        "label" : "Kropps- och skönhetsvård",
        "legacy_ams_taxonomy_id" : "4"
      },
      "scope_of_work" : {
        "min" : 0,
        "max" : 100
      },
      "salary_type" : {
        "concept_id" : "oG8G_9cW_nRf",
        "label" : "Fast månads- vecko- eller timlön",
        "legacy_ams_taxonomy_id" : "1"
      },
      "removed" : false,
      "salary_description" : null,
      "access_to_own_car" : false,
      "publication_date" : "2022-08-04T10:15:25"
    },
    "name" : "Utbildad nagelteknolog sökes",
    "user" : "kristof.fischer"
  },
  "sha1" : "aab9fe44d567b0c31b6e022428b74b117fad643c",
  "annotations" : [ {
    "preferred-label" : "Nagelterapeut/Nagelteknolog",
    "sentiment" : "MUST_HAVE",
    "type" : "occupation-name",
    "start-position" : 9,
    "end-position" : 22,
    "concept-id" : "JjXV_QEg_EQ1",
    "matched-string" : "nagelteknolog",
    "annotation-id" : 0
  }, {
    "preferred-label" : "noggrannhet",
    "sentiment" : "MUST_HAVE",
    "type" : "esco-skill",
    "start-position" : 61,
    "end-position" : 69,
    "concept-id" : "mrsW_EkL_KRD",
    "matched-string" : "noggrann",
    "annotation-id" : 7
  }, {
    "preferred-label" : "Nagelterapeut/Nagelteknolog",
    "sentiment" : "MUST_HAVE",
    "type" : "occupation-name",
    "start-position" : 70,
    "end-position" : 83,
    "concept-id" : "JjXV_QEg_EQ1",
    "matched-string" : "nagelteknolog",
    "annotation-id" : 1
  }, {
    "preferred-label" : "Fransförlängning",
    "sentiment" : "MUST_HAVE",
    "type" : "skill",
    "start-position" : 122,
    "end-position" : 133,
    "concept-id" : "kWPd_NUy_9Za",
    "matched-string" : "ögonfransar",
    "annotation-id" : 8
  }, {
    "preferred-label" : "Handvård/Manikyr",
    "sentiment" : "MUST_HAVE",
    "type" : "skill",
    "start-position" : 204,
    "end-position" : 211,
    "concept-id" : "RVLi_2no_Eyg",
    "matched-string" : "manikyr",
    "annotation-id" : 2
  }, {
    "preferred-label" : "Fotvård/Pedikyr",
    "sentiment" : "MUST_HAVE",
    "type" : "skill",
    "start-position" : 213,
    "end-position" : 220,
    "concept-id" : "5APZ_gLs_AB4",
    "matched-string" : "pedikyr",
    "annotation-id" : 3
  }, {
    "preferred-label" : "Nagelförlängning",
    "sentiment" : "MUST_HAVE",
    "type" : "skill",
    "start-position" : 222,
    "end-position" : 238,
    "concept-id" : "VxS2_ZHa_Kag",
    "matched-string" : "nagelförlängning",
    "annotation-id" : 4
  }, {
    "preferred-label" : "Fransförlängning",
    "sentiment" : "MUST_HAVE",
    "type" : "skill",
    "start-position" : 240,
    "end-position" : 256,
    "concept-id" : "kWPd_NUy_9Za",
    "matched-string" : "fransförlängning",
    "annotation-id" : 5
  }, {
    "preferred-label" : "Heltid",
    "type" : "worktime-extent",
    "start-position" : 262,
    "end-position" : 268,
    "concept-id" : "6YE1_gAC_R2G",
    "matched-string" : "Heltid",
    "annotation-id" : 9
  }, {
    "preferred-label" : "Eskilstuna",
    "type" : "municipality",
    "start-position" : 353,
    "end-position" : 363,
    "concept-id" : "kMxr_NiX_YrU",
    "matched-string" : "Eskilstuna",
    "annotation-id" : 10
  } ],
  "text" : "Utbildad nagelteknolog sökes\nVi söker en serviceinriktad och noggrann nagelteknolog. Det är även önskvärt att du kan göra ögonfransar. Du måste vara kunnig och utbildad inom området. Arbetsuppgifterna är manikyr, pedikyr, nagelförlängning, fransförlängning etc. Heltid. Lön enligt kollektivavtal.\nMy's Nails Skönhetssalong AB, Cityhuset, Kungsgatan 24, Eskilstuna."
}