{
  "meta" : {
    "jobad" : {
      "description" : {
        "requirements" : null,
        "needs" : null,
        "company_information" : null,
        "text_formatted" : "<p><strong>Gillar du att leverera hög kvalité och att arbeta i ett högt tempo? Då vill vi på Simplex gärna att du söker dig till oss!</strong></p><p>Vi söker efter dig som vill ta nästa steg inom logistik och arbeta som lagermedarbetare hos en av våra kunder i Rosersberg. Tjänsten startar omgående.</p><p>Som lagermedarbetare arbetar du självständigt med att plocka och packa på lagret. Arbetet innebär att packa varor utifrån en plocklista samt att arbeta nära med ut- och inleverans. Varje lagermedarbetare arbetar utifrån sin egna plocklista, där plockningen sker utifrån en given tidsram. Det är ett varierande och spännande jobb där man har chansen att utvecklas utifrån sin vilja och kompetens.</p><p><strong>Arbetsuppgifter:</strong></p><ul><li>Ansvara för inleveranser av gods och material</li><li>Scanna in produkter i affärssystem</li><li>Samordna produkter utifrån en plocklista</li><li>Lastning av kurirbilar</li></ul><p><strong>Om dig:</strong></p><p>Arbetsuppgifterna i den här rollen passar dig som är stresstålig, punktlig och ansvarsfull. Du uppskattar ett högt tempo och har goda kunskaper inom logistik och lagerhantering, vilka du erhållit antingen från studier eller arbetslivet. Om du har erfarenhet av liknande arbete och har erfarenhet av orderhantering är det meriterande.</p><p><strong>Meriterande:</strong></p><ul><li>Körkort B</li><li>Truckkort A+B</li></ul><p><strong>Lagret är beläget i Kista Stockholm</strong></p><p><strong>Arbetet är förlagt mån-fre 07-16</strong></p><p><strong>Om oss:</strong></p><p>Det är vi som är Simplex. Framtidens bemanningsföretag med siktet inställt på utveckling. För det är precis vad vi vill skapa, utveckling för företag och människor. Med rätt person, på rätt plats skapas nytta för alla parter. Idag ser ni våra konsulter köra truck på terminaler, leverera pallar med tunga fordon, leda logistiken på byggarbetsplatser eller packa orders på lager. Men det är bara en liten del av vad vi erbjuder. Hos oss arbetar människor som vill framåt och som driver på logistiken i hela Sverige. Svårare eller enklare behöver det inte vara.</p><p> </p><p>Är du redo för nästa steg i karriären, öppnar vi dörrar till nya möjligheter. Vårt mål är att ta vara på varje individs unika kompetens och förädla med erfarenheter.</p><p><br></p><p><strong>Välkommen till Simplex!</strong></p><p><br></p>",
        "conditions" : null,
        "text" : "Gillar du att leverera hög kvalité och att arbeta i ett högt tempo? Då vill vi på Simplex gärna att du söker dig till oss!\nVi söker efter dig som vill ta nästa steg inom logistik och arbeta som lagermedarbetare hos en av våra kunder i Rosersberg. Tjänsten startar omgående.\nSom lagermedarbetare arbetar du självständigt med att plocka och packa på lagret. Arbetet innebär att packa varor utifrån en plocklista samt att arbeta nära med ut- och inleverans. Varje lagermedarbetare arbetar utifrån sin egna plocklista, där plockningen sker utifrån en given tidsram. Det är ett varierande och spännande jobb där man har chansen att utvecklas utifrån sin vilja och kompetens.\nArbetsuppgifter:\nAnsvara för inleveranser av gods och material\nScanna in produkter i affärssystem\nSamordna produkter utifrån en plocklista\nLastning av kurirbilar\n\nOm dig:\nArbetsuppgifterna i den här rollen passar dig som är stresstålig, punktlig och ansvarsfull. Du uppskattar ett högt tempo och har goda kunskaper inom logistik och lagerhantering, vilka du erhållit antingen från studier eller arbetslivet. Om du har erfarenhet av liknande arbete och har erfarenhet av orderhantering är det meriterande.\nMeriterande:\nKörkort B\nTruckkort A+B\n\nLagret är beläget i Kista Stockholm\nArbetet är förlagt mån-fre 07-16\nOm oss:\nDet är vi som är Simplex. Framtidens bemanningsföretag med siktet inställt på utveckling. För det är precis vad vi vill skapa, utveckling för företag och människor. Med rätt person, på rätt plats skapas nytta för alla parter. Idag ser ni våra konsulter köra truck på terminaler, leverera pallar med tunga fordon, leda logistiken på byggarbetsplatser eller packa orders på lager. Men det är bara en liten del av vad vi erbjuder. Hos oss arbetar människor som vill framåt och som driver på logistiken i hela Sverige. Svårare eller enklare behöver det inte vara.\n \nÄr du redo för nästa steg i karriären, öppnar vi dörrar till nya möjligheter. Vårt mål är att ta vara på varje individs unika kompetens och förädla med erfarenheter.\n\n\nVälkommen till Simplex!"
      },
      "headline" : "Lagermedarbetare - Kista - Heltid",
      "driving_license" : null,
      "employer" : {
        "email" : null,
        "phone_number" : null,
        "organization_number" : "5590010277",
        "name" : "Simplex Bemanning AB",
        "url" : "https://simplexbemanning.se/",
        "workplace" : "Simplex Bemanning "
      },
      "removed_date" : null,
      "logo_url" : "https://www.arbetsformedlingen.se/rest/arbetsgivare/rest/af/v3/arbetsplatser/88062781/logotyper/logo.png",
      "last_publication_date" : "2022-09-02T00:00:00",
      "number_of_vacancies" : 5,
      "occupation" : {
        "concept_id" : "sizv_uPq_nWf",
        "label" : "Lagerarbetare",
        "legacy_ams_taxonomy_id" : "5842"
      },
      "occupation_group" : {
        "concept_id" : "kLyY_rwr_aJr",
        "label" : "Lager- och terminalpersonal",
        "legacy_ams_taxonomy_id" : "4322"
      },
      "employment_type" : {
        "concept_id" : "PFZr_Syz_cUq",
        "label" : "Vanlig anställning",
        "legacy_ams_taxonomy_id" : "1"
      },
      "webpage_url" : "https://arbetsformedlingen.se/platsbanken/annonser/26375985",
      "driving_license_required" : false,
      "application_contacts" : [ ],
      "duration" : {
        "concept_id" : "a7uU_j21_mkL",
        "label" : "Tills vidare",
        "legacy_ams_taxonomy_id" : "1"
      },
      "nice_to_have" : {
        "education_level" : [ ],
        "work_experiences" : [ ],
        "skills" : [ ],
        "education" : [ ],
        "languages" : [ ]
      },
      "application_details" : {
        "via_af" : false,
        "email" : null,
        "other" : null,
        "reference" : null,
        "url" : "https://simplexbemanning.teamtailor.com/jobs/1954336-lagermedarbetare-kista-heltid",
        "information" : null
      },
      "source_type" : "VIA_ANNONSERA",
      "application_deadline" : "2022-09-02T00:00:00",
      "external_id" : null,
      "workplace_address" : {
        "coordinates" : [ 18.118850610961907, 59.31573623580193 ],
        "city" : "Nacka",
        "postcode" : "13173",
        "municipality" : "Nacka",
        "region_concept_id" : "CifL_Rzy_Mku",
        "region" : "Stockholms län",
        "country_code" : "199",
        "region_code" : "01",
        "municipality_concept_id" : "aYA7_PpG_BqP",
        "country_concept_id" : "i46j_HmG_v64",
        "municipality_code" : "0182",
        "street_address" : "Finnboda Varvsväg 9",
        "country" : "Sverige"
      },
      "id" : "26375985",
      "experience_required" : false,
      "working_hours_type" : {
        "concept_id" : "6YE1_gAC_R2G",
        "label" : "Heltid",
        "legacy_ams_taxonomy_id" : "1"
      },
      "access" : null,
      "timestamp" : 1659540250273,
      "must_have" : {
        "education_level" : [ ],
        "work_experiences" : [ ],
        "skills" : [ ],
        "education" : [ ],
        "languages" : [ {
          "concept_id" : "zSLA_vw2_FXN",
          "weight" : 10,
          "label" : "Svenska",
          "legacy_ams_taxonomy_id" : "502"
        } ]
      },
      "occupation_field" : {
        "concept_id" : "ASGV_zcE_bWf",
        "label" : "Transport, distribution, lager",
        "legacy_ams_taxonomy_id" : "19"
      },
      "scope_of_work" : {
        "min" : 0,
        "max" : 100
      },
      "salary_type" : {
        "concept_id" : "oG8G_9cW_nRf",
        "label" : "Fast månads- vecko- eller timlön",
        "legacy_ams_taxonomy_id" : "1"
      },
      "removed" : false,
      "salary_description" : null,
      "access_to_own_car" : false,
      "publication_date" : "2022-08-03T17:24:10"
    },
    "name" : "Lagermedarbetare - Kista - Heltid",
    "user" : "kristof.fischer"
  },
  "sha1" : "04d0c7910d769b91183fda70b6d0ea610ab9c05d",
  "annotations" : [ {
    "preferred-label" : "Lagerarbetare",
    "sentiment" : "MUST_HAVE",
    "type" : "occupation-name",
    "start-position" : 0,
    "end-position" : 16,
    "concept-id" : "sizv_uPq_nWf",
    "matched-string" : "lagermedarbetare",
    "annotation-id" : 0
  }, {
    "preferred-label" : "Heltid",
    "type" : "worktime-extent",
    "start-position" : 27,
    "end-position" : 33,
    "concept-id" : "6YE1_gAC_R2G",
    "matched-string" : "Heltid",
    "annotation-id" : 9
  }, {
    "preferred-label" : "Lagerarbetare",
    "sentiment" : "MUST_HAVE",
    "type" : "occupation-name",
    "start-position" : 228,
    "end-position" : 244,
    "concept-id" : "sizv_uPq_nWf",
    "matched-string" : "lagermedarbetare",
    "annotation-id" : 2
  }, {
    "preferred-label" : "Lagerarbetare",
    "sentiment" : "MUST_HAVE",
    "type" : "occupation-name",
    "start-position" : 312,
    "end-position" : 328,
    "concept-id" : "sizv_uPq_nWf",
    "matched-string" : "lagermedarbetare",
    "annotation-id" : 3
  }, {
    "preferred-label" : "arbeta självständigt",
    "sentiment" : "MUST_HAVE",
    "type" : "esco-skill",
    "start-position" : 329,
    "end-position" : 353,
    "concept-id" : "NyFu_HHd_zhz",
    "matched-string" : "arbetar du självständigt",
    "annotation-id" : 10
  }, {
    "preferred-label" : "Lagerarbetare",
    "sentiment" : "MUST_HAVE",
    "type" : "occupation-name",
    "start-position" : 495,
    "end-position" : 511,
    "concept-id" : "sizv_uPq_nWf",
    "matched-string" : "lagermedarbetare",
    "annotation-id" : 4
  }, {
    "preferred-label" : "hantera stressande situationer",
    "sentiment" : "MUST_HAVE",
    "type" : "esco-skill",
    "start-position" : 928,
    "end-position" : 939,
    "concept-id" : "qhLq_ZdJ_rqJ",
    "matched-string" : "stresstålig",
    "annotation-id" : 11
  }, {
    "preferred-label" : "Logistik",
    "sentiment" : "MUST_HAVE",
    "type" : "skill",
    "start-position" : 1024,
    "end-position" : 1032,
    "concept-id" : "yXmf_iKi_7ci",
    "matched-string" : "logistik",
    "annotation-id" : 12
  }, {
    "preferred-label" : "Terminal- och lagerarbete",
    "sentiment" : "MUST_HAVE",
    "type" : "skill",
    "start-position" : 1037,
    "end-position" : 1051,
    "concept-id" : "ijHY_aHk_ADE",
    "matched-string" : "lagerhantering",
    "annotation-id" : 13
  }, {
    "preferred-label" : "hantera orderstock",
    "sentiment" : "NICE_TO_HAVE",
    "type" : "esco-skill",
    "start-position" : 1174,
    "end-position" : 1188,
    "concept-id" : "aB8m_LiV_GS5",
    "matched-string" : "orderhantering",
    "annotation-id" : 14
  }, {
    "preferred-label" : "B",
    "sentiment" : "NICE_TO_HAVE",
    "type" : "driving-licence",
    "start-position" : 1222,
    "end-position" : 1231,
    "concept-id" : "VTK8_WRx_GcM",
    "matched-string" : "Körkort B",
    "annotation-id" : 15
  }, {
    "preferred-label" : "A-truckar",
    "sentiment" : "NICE_TO_HAVE",
    "type" : "skill",
    "start-position" : 1232,
    "end-position" : 1243,
    "concept-id" : "Zk4h_jP4_e85",
    "matched-string" : "Truckkort A",
    "annotation-id" : 16
  }, {
    "preferred-label" : "B-truckar",
    "sentiment" : "NICE_TO_HAVE",
    "type" : "skill",
    "start-position" : 1244,
    "end-position" : 1245,
    "concept-id" : "HeXq_amc_ABd",
    "matched-string" : "B",
    "annotation-id" : 17
  }, {
    "preferred-label" : "Stockholm",
    "type" : "municipality",
    "start-position" : 1273,
    "end-position" : 1282,
    "concept-id" : "AvNB_uwa_6n6",
    "matched-string" : "Stockholm",
    "annotation-id" : 18
  }, {
    "preferred-label" : "Sverige",
    "type" : "country",
    "start-position" : 1830,
    "end-position" : 1837,
    "concept-id" : "i46j_HmG_v64",
    "matched-string" : "Sverige",
    "annotation-id" : 19
  } ],
  "text" : "Lagermedarbetare - Kista - Heltid\nGillar du att leverera hög kvalité och att arbeta i ett högt tempo? Då vill vi på Simplex gärna att du söker dig till oss!\nVi söker efter dig som vill ta nästa steg inom logistik och arbeta som lagermedarbetare hos en av våra kunder i Rosersberg. Tjänsten startar omgående.\nSom lagermedarbetare arbetar du självständigt med att plocka och packa på lagret. Arbetet innebär att packa varor utifrån en plocklista samt att arbeta nära med ut- och inleverans. Varje lagermedarbetare arbetar utifrån sin egna plocklista, där plockningen sker utifrån en given tidsram. Det är ett varierande och spännande jobb där man har chansen att utvecklas utifrån sin vilja och kompetens.\nArbetsuppgifter:\nAnsvara för inleveranser av gods och material\nScanna in produkter i affärssystem\nSamordna produkter utifrån en plocklista\nLastning av kurirbilar\n\nOm dig:\nArbetsuppgifterna i den här rollen passar dig som är stresstålig, punktlig och ansvarsfull. Du uppskattar ett högt tempo och har goda kunskaper inom logistik och lagerhantering, vilka du erhållit antingen från studier eller arbetslivet. Om du har erfarenhet av liknande arbete och har erfarenhet av orderhantering är det meriterande.\nMeriterande:\nKörkort B\nTruckkort A+B\n\nLagret är beläget i Kista Stockholm\nArbetet är förlagt mån-fre 07-16\nOm oss:\nDet är vi som är Simplex. Framtidens bemanningsföretag med siktet inställt på utveckling. För det är precis vad vi vill skapa, utveckling för företag och människor. Med rätt person, på rätt plats skapas nytta för alla parter. Idag ser ni våra konsulter köra truck på terminaler, leverera pallar med tunga fordon, leda logistiken på byggarbetsplatser eller packa orders på lager. Men det är bara en liten del av vad vi erbjuder. Hos oss arbetar människor som vill framåt och som driver på logistiken i hela Sverige. Svårare eller enklare behöver det inte vara.\n \nÄr du redo för nästa steg i karriären, öppnar vi dörrar till nya möjligheter. Vårt mål är att ta vara på varje individs unika kompetens och förädla med erfarenheter.\n\n\nVälkommen till Simplex!"
}