{
  "meta" : {
    "jobad" : {
      "description" : {
        "requirements" : null,
        "needs" : null,
        "company_information" : null,
        "text_formatted" : "<p>Vi söker dig som har en hög språklig nivå och förmåga till nivåanpassning. Som frilansande teckenspråkstolk hos Linguacom anlitas du vid behov, från enstaka timmar upp till flera möten i följd av varandra. Bland våra kunder finns kommuner, privata företag, landsting, polis, domstolar och andra myndigheter.</p><p>Oavsett om man vill arbeta heltid eller kombinera det med något annat så är det spännande och viktigt att arbeta som teckenspråkstolk. Som frilansande teckenspråkstolk blir du kontaktad av oss vid aktuella bokningar runt om i hela landet men primärt för uppdrag i skåne län. </p><p><strong>Huvudsakliga arbetsuppgifter:</strong></p><p>-        Att självständigt utföra tolkuppdrag på plats eller via digitalt möte.</p><p>-        Att arbeta för så hög utförande grad som möjligt av inkomna tolkbeställningar.</p><p><br></p><p><strong>Kvalifikationer:</strong></p><p>-        Slutförd teckenspråkstolkutbildning.</p><p>-        Erfarenhet av arbete som tolk är meriterande.</p><p>-        Erfarenhet av arbete som tolk på tolkcentral är meriterande.</p><p><br></p><p><strong>Om oss</strong></p><p>Linguacom är en av Sveriges ledande språkbyråer med mer än 30 år samlad erfarenhet i branschen.</p><p>Vi förmedlar tolk- och översättningstjänster till främst stat, kommuner och landsting, men även till privata företag och kunder. Vi är idag ca 35 anställda och vi sitter i fina lokaler i Finntorp, Nacka (ca 8 minuter från Slussen med buss).</p>",
        "conditions" : null,
        "text" : "Vi söker dig som har en hög språklig nivå och förmåga till nivåanpassning. Som frilansande teckenspråkstolk hos Linguacom anlitas du vid behov, från enstaka timmar upp till flera möten i följd av varandra. Bland våra kunder finns kommuner, privata företag, landsting, polis, domstolar och andra myndigheter.\nOavsett om man vill arbeta heltid eller kombinera det med något annat så är det spännande och viktigt att arbeta som teckenspråkstolk. Som frilansande teckenspråkstolk blir du kontaktad av oss vid aktuella bokningar runt om i hela landet men primärt för uppdrag i skåne län. \nHuvudsakliga arbetsuppgifter:\n-        Att självständigt utföra tolkuppdrag på plats eller via digitalt möte.\n-        Att arbeta för så hög utförande grad som möjligt av inkomna tolkbeställningar.\n\n\nKvalifikationer:\n-        Slutförd teckenspråkstolkutbildning.\n-        Erfarenhet av arbete som tolk är meriterande.\n-        Erfarenhet av arbete som tolk på tolkcentral är meriterande.\n\n\nOm oss\nLinguacom är en av Sveriges ledande språkbyråer med mer än 30 år samlad erfarenhet i branschen.\nVi förmedlar tolk- och översättningstjänster till främst stat, kommuner och landsting, men även till privata företag och kunder. Vi är idag ca 35 anställda och vi sitter i fina lokaler i Finntorp, Nacka (ca 8 minuter från Slussen med buss)."
      },
      "headline" : "Teckenspråk-/TSS-/skriv/relä och dövblindtolk i skåne län sökes!",
      "driving_license" : null,
      "employer" : {
        "email" : null,
        "phone_number" : null,
        "organization_number" : "5568639628",
        "name" : "Lingua Communication Nordic AB",
        "url" : "www.linguacom.se",
        "workplace" : "Lingua Communication Nordic AB"
      },
      "removed_date" : null,
      "logo_url" : "https://www.arbetsformedlingen.se/rest/arbetsgivare/rest/af/v3/arbetsplatser/85667622/logotyper/logo.png",
      "last_publication_date" : "2022-07-29T23:59:59",
      "number_of_vacancies" : 5,
      "occupation" : {
        "concept_id" : "aPeE_Gxs_cWJ",
        "label" : "Teckenspråkstolk/Dövblindtolk",
        "legacy_ams_taxonomy_id" : "3199"
      },
      "occupation_group" : {
        "concept_id" : "PQDm_Z63_zst",
        "label" : "Översättare, tolkar och lingvister m.fl.",
        "legacy_ams_taxonomy_id" : "2643"
      },
      "employment_type" : {
        "concept_id" : "1paU_aCR_nGn",
        "label" : "Behovsanställning",
        "legacy_ams_taxonomy_id" : "4"
      },
      "webpage_url" : "https://arbetsformedlingen.se/platsbanken/annonser/26271074",
      "driving_license_required" : false,
      "application_contacts" : [ {
        "description" : null,
        "email" : "johan.muller@linguacom.se",
        "telephone" : "073 043 20 78",
        "name" : "Johan Müller",
        "contact_type" : null
      } ],
      "duration" : {
        "concept_id" : null,
        "label" : null,
        "legacy_ams_taxonomy_id" : null
      },
      "nice_to_have" : {
        "education_level" : [ ],
        "work_experiences" : [ ],
        "skills" : [ ],
        "education" : [ ],
        "languages" : [ ]
      },
      "application_details" : {
        "via_af" : false,
        "email" : "Hr@linguacom.se",
        "other" : null,
        "reference" : "Teckenspråkstolk skåne län",
        "url" : null,
        "information" : null
      },
      "source_type" : "VIA_ANNONSERA",
      "application_deadline" : "2022-07-29T23:59:59",
      "external_id" : null,
      "workplace_address" : {
        "coordinates" : [ null, null ],
        "city" : null,
        "postcode" : null,
        "municipality" : null,
        "region_concept_id" : null,
        "region" : null,
        "country_code" : "199",
        "region_code" : null,
        "municipality_concept_id" : null,
        "country_concept_id" : "i46j_HmG_v64",
        "municipality_code" : null,
        "street_address" : null,
        "country" : "Sverige"
      },
      "id" : "26271074",
      "experience_required" : true,
      "working_hours_type" : {
        "concept_id" : null,
        "label" : null,
        "legacy_ams_taxonomy_id" : null
      },
      "access" : null,
      "timestamp" : 1656492255864,
      "must_have" : {
        "education_level" : [ ],
        "work_experiences" : [ ],
        "skills" : [ ],
        "education" : [ ],
        "languages" : [ ]
      },
      "occupation_field" : {
        "concept_id" : "9puE_nYg_crq",
        "label" : "Kultur, media, design",
        "legacy_ams_taxonomy_id" : "11"
      },
      "scope_of_work" : {
        "min" : 0,
        "max" : null
      },
      "salary_type" : {
        "concept_id" : "vVtj_qm6_GQu",
        "label" : "Rörlig ackords- eller provisionslön",
        "legacy_ams_taxonomy_id" : "8"
      },
      "removed" : false,
      "salary_description" : null,
      "access_to_own_car" : false,
      "publication_date" : "2022-06-29T10:44:15"
    },
    "name" : "Teckenspråk-/TSS-/skriv/relä och dövblindtolk i skåne län sökes!",
    "user" : "hannes"
  },
  "sha1" : "c8a12411f99ca8ad79a87ebe08de1de784487ebf",
  "annotations" : [ {
    "preferred-label" : "Teckenspråk",
    "sentiment" : "MUST_HAVE",
    "type" : "keyword",
    "start-position" : 0,
    "end-position" : 11,
    "concept-id" : "tngT_R2E_Qmb",
    "matched-string" : "teckenspråk",
    "annotation-id" : 0
  }, {
    "preferred-label" : "TSS-tolkning (Tecken som Stöd)",
    "type" : "skill",
    "start-position" : 13,
    "end-position" : 16,
    "concept-id" : "JEkW_rqS_ojk",
    "matched-string" : "TSS",
    "annotation-id" : 8
  }, {
    "preferred-label" : "Skrivtolkning",
    "type" : "skill",
    "start-position" : 18,
    "end-position" : 23,
    "concept-id" : "KFyd_zgS_6aw",
    "matched-string" : "skriv",
    "annotation-id" : 9
  }, {
    "preferred-label" : "Teckenspråkstolk/Dövblindtolk",
    "sentiment" : "MUST_HAVE",
    "type" : "occupation-name",
    "start-position" : 33,
    "end-position" : 45,
    "concept-id" : "aPeE_Gxs_cWJ",
    "matched-string" : "dövblindtolk",
    "annotation-id" : 1
  }, {
    "preferred-label" : "Skåne län",
    "type" : "region",
    "start-position" : 48,
    "end-position" : 57,
    "concept-id" : "CaRE_1nn_cSU",
    "matched-string" : "skåne län",
    "annotation-id" : 10
  }, {
    "preferred-label" : "Frilansuppdrag",
    "type" : "skill",
    "start-position" : 144,
    "end-position" : 155,
    "concept-id" : "Pk1y_cpM_ZhC",
    "matched-string" : "frilansande",
    "annotation-id" : 11
  }, {
    "preferred-label" : "teckenspråkstolk",
    "sentiment" : "MUST_HAVE",
    "type" : "esco-occupation",
    "start-position" : 156,
    "end-position" : 172,
    "concept-id" : "jHsd_wAS_aAT",
    "matched-string" : "teckenspråkstolk",
    "annotation-id" : 2
  }, {
    "preferred-label" : "Heltid",
    "type" : "worktime-extent",
    "start-position" : 400,
    "end-position" : 406,
    "concept-id" : "6YE1_gAC_R2G",
    "matched-string" : "heltid",
    "annotation-id" : 12
  }, {
    "preferred-label" : "teckenspråkstolk",
    "sentiment" : "MUST_HAVE",
    "type" : "esco-occupation",
    "start-position" : 490,
    "end-position" : 506,
    "concept-id" : "jHsd_wAS_aAT",
    "matched-string" : "teckenspråkstolk",
    "annotation-id" : 3
  }, {
    "preferred-label" : "Frilansuppdrag",
    "type" : "skill",
    "start-position" : 512,
    "end-position" : 523,
    "concept-id" : "Pk1y_cpM_ZhC",
    "matched-string" : "frilansande",
    "annotation-id" : 13
  }, {
    "preferred-label" : "teckenspråkstolk",
    "sentiment" : "MUST_HAVE",
    "type" : "esco-occupation",
    "start-position" : 524,
    "end-position" : 540,
    "concept-id" : "jHsd_wAS_aAT",
    "matched-string" : "teckenspråkstolk",
    "annotation-id" : 4
  }, {
    "preferred-label" : "Skåne län",
    "type" : "region",
    "start-position" : 637,
    "end-position" : 646,
    "concept-id" : "CaRE_1nn_cSU",
    "matched-string" : "skåne län",
    "annotation-id" : 14
  }, {
    "preferred-label" : "arbeta självständigt",
    "type" : "esco-skill",
    "start-position" : 692,
    "end-position" : 705,
    "concept-id" : "NyFu_HHd_zhz",
    "matched-string" : "självständigt",
    "annotation-id" : 15
  }, {
    "preferred-label" : "Tolk",
    "type" : "occupation-name",
    "start-position" : 713,
    "end-position" : 717,
    "concept-id" : "vaEY_R9R_LjB",
    "matched-string" : "tolk",
    "annotation-id" : 16
  }, {
    "preferred-label" : "Tolk",
    "type" : "occupation-name",
    "start-position" : 828,
    "end-position" : 832,
    "concept-id" : "vaEY_R9R_LjB",
    "matched-string" : "tolk",
    "annotation-id" : 17
  }, {
    "preferred-label" : "teckenspråkstolk",
    "type" : "esco-occupation",
    "start-position" : 884,
    "end-position" : 900,
    "concept-id" : "jHsd_wAS_aAT",
    "matched-string" : "teckenspråkstolk",
    "annotation-id" : 18
  }, {
    "preferred-label" : "Tolk",
    "sentiment" : "MUST_HAVE",
    "type" : "occupation-name",
    "start-position" : 946,
    "end-position" : 950,
    "concept-id" : "vaEY_R9R_LjB",
    "matched-string" : "tolk",
    "annotation-id" : 5
  }, {
    "preferred-label" : "Tolk",
    "sentiment" : "MUST_HAVE",
    "type" : "occupation-name",
    "start-position" : 1001,
    "end-position" : 1005,
    "concept-id" : "vaEY_R9R_LjB",
    "matched-string" : "tolk",
    "annotation-id" : 6
  }, {
    "preferred-label" : "Tolk",
    "sentiment" : "MUST_HAVE",
    "type" : "occupation-name",
    "start-position" : 1155,
    "end-position" : 1159,
    "concept-id" : "vaEY_R9R_LjB",
    "matched-string" : "tolk",
    "annotation-id" : 7
  }, {
    "preferred-label" : "Översättning och tolkning",
    "type" : "sni-level-5",
    "start-position" : 1165,
    "end-position" : 1177,
    "concept-id" : "zRGC_HRv_2tW",
    "matched-string" : "översättning",
    "annotation-id" : 19
  }, {
    "preferred-label" : "Nacka",
    "type" : "municipality",
    "start-position" : 1339,
    "end-position" : 1344,
    "concept-id" : "aYA7_PpG_BqP",
    "matched-string" : "Nacka",
    "annotation-id" : 20
  } ],
  "text" : "Teckenspråk-/TSS-/skriv/relä och dövblindtolk i skåne län sökes!\nVi söker dig som har en hög språklig nivå och förmåga till nivåanpassning. Som frilansande teckenspråkstolk hos Linguacom anlitas du vid behov, från enstaka timmar upp till flera möten i följd av varandra. Bland våra kunder finns kommuner, privata företag, landsting, polis, domstolar och andra myndigheter.\nOavsett om man vill arbeta heltid eller kombinera det med något annat så är det spännande och viktigt att arbeta som teckenspråkstolk. Som frilansande teckenspråkstolk blir du kontaktad av oss vid aktuella bokningar runt om i hela landet men primärt för uppdrag i skåne län. \nHuvudsakliga arbetsuppgifter:\n-        Att självständigt utföra tolkuppdrag på plats eller via digitalt möte.\n-        Att arbeta för så hög utförande grad som möjligt av inkomna tolkbeställningar.\n\n\nKvalifikationer:\n-        Slutförd teckenspråkstolkutbildning.\n-        Erfarenhet av arbete som tolk är meriterande.\n-        Erfarenhet av arbete som tolk på tolkcentral är meriterande.\n\n\nOm oss\nLinguacom är en av Sveriges ledande språkbyråer med mer än 30 år samlad erfarenhet i branschen.\nVi förmedlar tolk- och översättningstjänster till främst stat, kommuner och landsting, men även till privata företag och kunder. Vi är idag ca 35 anställda och vi sitter i fina lokaler i Finntorp, Nacka (ca 8 minuter från Slussen med buss)."
}