{
  "meta" : {
    "jobad" : {
      "description" : {
        "requirements" : null,
        "needs" : null,
        "company_information" : null,
        "text_formatted" : "Vill du vara med och skapa dagens och morgondagens utemiljöer i Göteborg? Park- och naturförvaltningen är en viktig part i stadsutvecklingen. Vi förvaltar och utvecklar stadens parker, lekplatser, naturområden, sjöar och vattendrag. På uppdrag av andra förvaltningar utför vi även barmarksrenhållning, grönskötsel, vinterväghållning, underhåll och nybyggnation av markanläggningar samt arbetsmarknadsuppdrag. I vårt arbete strävar vi efter att vara effektiva, kompetenta, engagerade och nyfikna för att skapa en skön storstad med en grön själ, där alla kan hitta sin plats.\r\n\r\nARBETSUPPGIFTER\nJust nu pågår ett spännande arbete med att bygga upp Göteborgs nya organisationer för stadsutveckling. De nya förvaltningarna ska bidra till en mer sammanhållen stadsutvecklingsprocess i såväl planering, genomförande som förvaltning av staden. Förändringen ska bidra till ökad effektivitet och transparens i arbetet med stadsutveckling för boende, besökare och näringsliv. Tillsammans kommer vi med våra andra berörda förvaltningar att slås ihop och bilda fyra nya förvaltningar från och med årsskiftet 2022/2023. Nu söker vi dig som vill vara med på denna förändringsresa och tillsammans lägga grunden för vår nya stadsutvecklingsorganisation i Göteborg.\n\nSom parkförvaltare kommer du att arbeta på parkenheten, som förvaltar, sköter och utvecklar parker, lekplatser, träd, planteringar, vissa torg, gång och cykelstråk samt bostadsnära naturområden. Här får du möjlighet att, tillsammans med engagerade kollegor, delta i stadens utvecklingsarbete och bidra till sociala och ekologiska värden genom att ta hand om Stadens grönområden.\n\nUtifrån din roll som beställare kommer du att ansvara för och koordinera skötsel och utveckling av utomhusmiljöer inom ett eller flera avgränsade geografiska område. Det innebär bland annat att du ska planera för hur området ska skötas samt delta i utvecklingen av området. Du ska även följa upp och kvalitetssäkra skötseluppdraget. Förutom att ansvara för den kontinuerliga skötseln ska du genomföra olika reparation underhålls- och upprustningsarbeten. Du kommer att vara park- och naturförvaltningens representant i olika projekt och samrådsgrupper och arbetet innebär mycket kontakter med allmänhet, olika entreprenörer samt andra förvaltningar och bolag i Göteborgs Stad. Du har ett budgetansvar och tjänsten är huvudsakligen administrativ med administration av det som rör ditt ansvarsområde, samt besiktning och upphandling.\n\nPå Parkenheten arbetar 19 medarbetare med stor kompetens och starkt engagemang för att förvalta och utveckla vår Stad. Just nu är förvaltningen i en utvecklingsfas och du har god möjlighet och förväntas att bidra med nytänkande och förbättringsarbete. Innehållet i rollen kan komma att justeras utifrån att vi ser över rollen och ansvarsområden på enheten. Vårt mål är att uppnå en organisation som möter omvärldens krav och skapar en bättre vardag för de som bor i och besöker Göteborg.\n\n\n\r\n\r\nKVALIFIKATIONER\nVi söker dig som har en högskoleutbildning eller YH-utbildning inom det gröna området. Vi ser att du har några års erfarenhet av skötsel och underhåll samt några års erfarenhet av park- och anläggningsarbete. Du har även erfarenhet av arbetsledning gentemot entreprenörer eller utförare. \nVi tillhandahåller service och information och arbetsuppgifterna innebär många kontaktytor, därför är det meriterande om du har tidigare erfarenhet av att arbeta med service och kundkontakter. Du kommer arbeta både på egen hand och tillsammans med andra vilket ställer krav på att du både är självständig och har god samarbetsförmåga. Då arbetsuppgifterna varierar behöver du vara flexibel och för att trivas i rollen ser vi att du har ett stort intresse av att bidra till Göteborgs utveckling. \n\nPark- och naturförvaltningen arbetar enligt Göteborgs Stads förhållningssätt som är: \nVi vet vårt uppdrag och vem vi är till för, vi bryr oss, vi arbetar tillsammans och vi tänker nytt. Vi vill att park- och naturförvaltningen ska präglas av öppenhet och respekt för olikheter. Därför tror vi att mångfald bidrar till att utveckla vår verksamhet.\n\nVälkommen med din ansökan!\n\n\r\n\nÖVRIGT\nPark- och naturförvaltningen har ett brett uppdrag och kan erbjuda ett flertal spännande roller så att du som medarbetare kan växa och utvecklas. Vår rekryteringsprocess är normkritisk och kompetensbaserad och vi strävar efter mångfald bland våra medarbetare. Vi arbetar för en god och hållbar arbetsmiljö och tar avstånd från alla former av kränkningar och sexuella trakasserier. För att du ska trivas och må bra erbjuder vi förmåner som cykelbidrag, friskvårdsbidrag och träning på flera olika idrottsanläggningar till rabatterat pris. Vi har även en fritidsförening som ordnar olika aktiviteter för personalen.\nVill du veta mer om oss?\n\nFölj vår företagssida på Linkedin \nhttps://bit.ly/2Mi5QOJ",
        "conditions" : "Heltid.  Dagtid.\r\nTillsvidareanställning, tillträde: Enligt överenskommelse .",
        "text" : "Vill du vara med och skapa dagens och morgondagens utemiljöer i Göteborg? Park- och naturförvaltningen är en viktig part i stadsutvecklingen. Vi förvaltar och utvecklar stadens parker, lekplatser, naturområden, sjöar och vattendrag. På uppdrag av andra förvaltningar utför vi även barmarksrenhållning, grönskötsel, vinterväghållning, underhåll och nybyggnation av markanläggningar samt arbetsmarknadsuppdrag. I vårt arbete strävar vi efter att vara effektiva, kompetenta, engagerade och nyfikna för att skapa en skön storstad med en grön själ, där alla kan hitta sin plats.\r\n\r\nARBETSUPPGIFTER\nJust nu pågår ett spännande arbete med att bygga upp Göteborgs nya organisationer för stadsutveckling. De nya förvaltningarna ska bidra till en mer sammanhållen stadsutvecklingsprocess i såväl planering, genomförande som förvaltning av staden. Förändringen ska bidra till ökad effektivitet och transparens i arbetet med stadsutveckling för boende, besökare och näringsliv. Tillsammans kommer vi med våra andra berörda förvaltningar att slås ihop och bilda fyra nya förvaltningar från och med årsskiftet 2022/2023. Nu söker vi dig som vill vara med på denna förändringsresa och tillsammans lägga grunden för vår nya stadsutvecklingsorganisation i Göteborg.\n\nSom parkförvaltare kommer du att arbeta på parkenheten, som förvaltar, sköter och utvecklar parker, lekplatser, träd, planteringar, vissa torg, gång och cykelstråk samt bostadsnära naturområden. Här får du möjlighet att, tillsammans med engagerade kollegor, delta i stadens utvecklingsarbete och bidra till sociala och ekologiska värden genom att ta hand om Stadens grönområden.\n\nUtifrån din roll som beställare kommer du att ansvara för och koordinera skötsel och utveckling av utomhusmiljöer inom ett eller flera avgränsade geografiska område. Det innebär bland annat att du ska planera för hur området ska skötas samt delta i utvecklingen av området. Du ska även följa upp och kvalitetssäkra skötseluppdraget. Förutom att ansvara för den kontinuerliga skötseln ska du genomföra olika reparation underhålls- och upprustningsarbeten. Du kommer att vara park- och naturförvaltningens representant i olika projekt och samrådsgrupper och arbetet innebär mycket kontakter med allmänhet, olika entreprenörer samt andra förvaltningar och bolag i Göteborgs Stad. Du har ett budgetansvar och tjänsten är huvudsakligen administrativ med administration av det som rör ditt ansvarsområde, samt besiktning och upphandling.\n\nPå Parkenheten arbetar 19 medarbetare med stor kompetens och starkt engagemang för att förvalta och utveckla vår Stad. Just nu är förvaltningen i en utvecklingsfas och du har god möjlighet och förväntas att bidra med nytänkande och förbättringsarbete. Innehållet i rollen kan komma att justeras utifrån att vi ser över rollen och ansvarsområden på enheten. Vårt mål är att uppnå en organisation som möter omvärldens krav och skapar en bättre vardag för de som bor i och besöker Göteborg.\n\n\n\r\n\r\nKVALIFIKATIONER\nVi söker dig som har en högskoleutbildning eller YH-utbildning inom det gröna området. Vi ser att du har några års erfarenhet av skötsel och underhåll samt några års erfarenhet av park- och anläggningsarbete. Du har även erfarenhet av arbetsledning gentemot entreprenörer eller utförare. \nVi tillhandahåller service och information och arbetsuppgifterna innebär många kontaktytor, därför är det meriterande om du har tidigare erfarenhet av att arbeta med service och kundkontakter. Du kommer arbeta både på egen hand och tillsammans med andra vilket ställer krav på att du både är självständig och har god samarbetsförmåga. Då arbetsuppgifterna varierar behöver du vara flexibel och för att trivas i rollen ser vi att du har ett stort intresse av att bidra till Göteborgs utveckling. \n\nPark- och naturförvaltningen arbetar enligt Göteborgs Stads förhållningssätt som är: \nVi vet vårt uppdrag och vem vi är till för, vi bryr oss, vi arbetar tillsammans och vi tänker nytt. Vi vill att park- och naturförvaltningen ska präglas av öppenhet och respekt för olikheter. Därför tror vi att mångfald bidrar till att utveckla vår verksamhet.\n\nVälkommen med din ansökan!\n\n\r\n\nÖVRIGT\nPark- och naturförvaltningen har ett brett uppdrag och kan erbjuda ett flertal spännande roller så att du som medarbetare kan växa och utvecklas. Vår rekryteringsprocess är normkritisk och kompetensbaserad och vi strävar efter mångfald bland våra medarbetare. Vi arbetar för en god och hållbar arbetsmiljö och tar avstånd från alla former av kränkningar och sexuella trakasserier. För att du ska trivas och må bra erbjuder vi förmåner som cykelbidrag, friskvårdsbidrag och träning på flera olika idrottsanläggningar till rabatterat pris. Vi har även en fritidsförening som ordnar olika aktiviteter för personalen.\nVill du veta mer om oss?\n\nFölj vår företagssida på Linkedin \nhttps://bit.ly/2Mi5QOJ"
      },
      "headline" : "Parkförvaltare",
      "driving_license" : [ {
        "concept_id" : "VTK8_WRx_GcM",
        "label" : "B",
        "legacy_ams_taxonomy_id" : "3"
      } ],
      "employer" : {
        "email" : null,
        "phone_number" : null,
        "organization_number" : "2120001355",
        "name" : "GÖTEBORGS KOMMUN",
        "url" : null,
        "workplace" : "Göteborgs Stad , Park- och naturförvaltningen"
      },
      "removed_date" : null,
      "logo_url" : "https://www.arbetsformedlingen.se/rest/arbetsgivare/rest/af/v3/organisation/2120001355/logotyper/logo.png",
      "last_publication_date" : "2022-08-21T23:59:59",
      "number_of_vacancies" : 1,
      "occupation" : {
        "concept_id" : "8hp2_MAG_9Vn",
        "label" : "Parkförvaltare",
        "legacy_ams_taxonomy_id" : "5253"
      },
      "occupation_group" : {
        "concept_id" : "XurM_DVs_ggn",
        "label" : "Specialister och rådgivare inom lantbruk m.m.",
        "legacy_ams_taxonomy_id" : "2134"
      },
      "employment_type" : {
        "concept_id" : "PFZr_Syz_cUq",
        "label" : "Vanlig anställning",
        "legacy_ams_taxonomy_id" : "1"
      },
      "webpage_url" : "https://arbetsformedlingen.se/platsbanken/annonser/26358349",
      "driving_license_required" : true,
      "application_contacts" : [ {
        "description" : "Peter Elheim",
        "email" : "peter.elheim@ponf.goteborg.se",
        "telephone" : "031-365 57 12",
        "name" : null,
        "contact_type" : "Enhetschef Parkenheten"
      } ],
      "duration" : {
        "concept_id" : "a7uU_j21_mkL",
        "label" : "Tills vidare",
        "legacy_ams_taxonomy_id" : "1"
      },
      "nice_to_have" : {
        "education_level" : [ ],
        "work_experiences" : [ ],
        "skills" : [ ],
        "education" : [ ],
        "languages" : [ ]
      },
      "application_details" : {
        "via_af" : false,
        "email" : null,
        "other" : null,
        "reference" : "C97179",
        "url" : "https://recruit.visma.com/Public/Apply.aspx?guidAssignment=8992669a-c400-463a-b86f-f8f1b6d0ffc9&publishCode=AMS&TK=231ded75-56be-4b2e-8420-35ca3d0964d1",
        "information" : null
      },
      "source_type" : "VIA_PLATSBANKEN_DXA",
      "application_deadline" : "2022-08-21T23:59:59",
      "external_id" : "46-212000-1355-8992669AC400463AB86FF8F1B6D0FFC9",
      "workplace_address" : {
        "coordinates" : [ 11.97456, 57.70887 ],
        "city" : null,
        "postcode" : null,
        "municipality" : "Göteborg",
        "region_concept_id" : "zdoY_6u5_Krt",
        "region" : "Västra Götalands län",
        "country_code" : "199",
        "region_code" : "14",
        "municipality_concept_id" : "PVZL_BQT_XtL",
        "country_concept_id" : "i46j_HmG_v64",
        "municipality_code" : "1480",
        "street_address" : null,
        "country" : "Sverige"
      },
      "id" : "26358349",
      "experience_required" : true,
      "working_hours_type" : {
        "concept_id" : "6YE1_gAC_R2G",
        "label" : "Heltid",
        "legacy_ams_taxonomy_id" : "1"
      },
      "access" : null,
      "timestamp" : 1658929513712,
      "must_have" : {
        "education_level" : [ ],
        "work_experiences" : [ {
          "concept_id" : "8hp2_MAG_9Vn",
          "weight" : 10,
          "label" : "Parkförvaltare",
          "legacy_ams_taxonomy_id" : "5253"
        } ],
        "skills" : [ ],
        "education" : [ ],
        "languages" : [ ]
      },
      "occupation_field" : {
        "concept_id" : "VuuL_7CH_adj",
        "label" : "Naturbruk",
        "legacy_ams_taxonomy_id" : "13"
      },
      "scope_of_work" : {
        "min" : 100,
        "max" : 100
      },
      "salary_type" : {
        "concept_id" : "oG8G_9cW_nRf",
        "label" : "Fast månads- vecko- eller timlön",
        "legacy_ams_taxonomy_id" : "1"
      },
      "removed" : false,
      "salary_description" : "Enligt avtal.",
      "access_to_own_car" : false,
      "publication_date" : "2022-07-27T15:40:23"
    },
    "name" : "Parkförvaltare",
    "user" : "kristof.fischer"
  },
  "sha1" : "1b70de9a85534126907203ac5b77dfeba3a76753",
  "annotations" : [ {
    "preferred-label" : "Parkförvaltare",
    "sentiment" : "MUST_HAVE",
    "type" : "occupation-name",
    "start-position" : 0,
    "end-position" : 14,
    "concept-id" : "8hp2_MAG_9Vn",
    "matched-string" : "parkförvaltare",
    "annotation-id" : 0
  }, {
    "preferred-label" : "Göteborg",
    "type" : "municipality",
    "start-position" : 79,
    "end-position" : 87,
    "concept-id" : "PVZL_BQT_XtL",
    "matched-string" : "Göteborg",
    "annotation-id" : 8
  }, {
    "preferred-label" : "Göteborg",
    "type" : "municipality",
    "start-position" : 661,
    "end-position" : 670,
    "concept-id" : "PVZL_BQT_XtL",
    "matched-string" : "Göteborgs",
    "annotation-id" : 9
  }, {
    "preferred-label" : "Göteborg",
    "type" : "municipality",
    "start-position" : 1254,
    "end-position" : 1262,
    "concept-id" : "PVZL_BQT_XtL",
    "matched-string" : "Göteborg",
    "annotation-id" : 10
  }, {
    "preferred-label" : "Parkförvaltare",
    "sentiment" : "MUST_HAVE",
    "type" : "occupation-name",
    "start-position" : 1269,
    "end-position" : 1283,
    "concept-id" : "8hp2_MAG_9Vn",
    "matched-string" : "parkförvaltare",
    "annotation-id" : 1
  }, {
    "preferred-label" : "Göteborg",
    "type" : "municipality",
    "start-position" : 2956,
    "end-position" : 2964,
    "concept-id" : "PVZL_BQT_XtL",
    "matched-string" : "Göteborg",
    "annotation-id" : 11
  }, {
    "preferred-label" : "Universitets- eller högskoleutbildning",
    "sentiment" : "MUST_HAVE",
    "type" : "sni-level-4",
    "start-position" : 3012,
    "end-position" : 3030,
    "concept-id" : "m1vC_Ssq_5Y7",
    "matched-string" : "högskoleutbildning",
    "annotation-id" : 12
  }, {
    "preferred-label" : "Universitets- eller högskoleutbildning",
    "sentiment" : "MUST_HAVE",
    "type" : "sni-level-4",
    "start-position" : 3037,
    "end-position" : 3050,
    "concept-id" : "m1vC_Ssq_5Y7",
    "matched-string" : "YH-utbildning",
    "annotation-id" : 13
  }, {
    "preferred-label" : "1-2 års erfarenhet",
    "sentiment" : "MUST_HAVE",
    "type" : "occupation-experience-year",
    "start-position" : 3093,
    "end-position" : 3113,
    "concept-id" : "LLnd_5GJ_4ju",
    "matched-string" : "några års erfarenhet",
    "annotation-id" : 14
  }, {
    "preferred-label" : "Skötsel och underhåll av utemiljöer",
    "sentiment" : "MUST_HAVE",
    "type" : "skill",
    "start-position" : 3117,
    "end-position" : 3138,
    "concept-id" : "Y6VX_E1a_pNH",
    "matched-string" : "skötsel och underhåll",
    "annotation-id" : 15
  }, {
    "preferred-label" : "1-2 års erfarenhet",
    "sentiment" : "MUST_HAVE",
    "type" : "occupation-experience-year",
    "start-position" : 3144,
    "end-position" : 3164,
    "concept-id" : "LLnd_5GJ_4ju",
    "matched-string" : "några års erfarenhet",
    "annotation-id" : 16
  }, {
    "preferred-label" : "Anläggningsarbete",
    "sentiment" : "MUST_HAVE",
    "type" : "skill",
    "start-position" : 3168,
    "end-position" : 3195,
    "concept-id" : "myMG_ygC_kDW",
    "matched-string" : "park- och anläggningsarbete",
    "annotation-id" : 17
  }, {
    "preferred-label" : null,
    "sentiment" : "MUST_HAVE",
    "type" : "skill",
    "start-position" : 3223,
    "end-position" : 3236,
    "concept-id" : null,
    "matched-string" : "arbetsledning",
    "annotation-id" : 18
  }, {
    "preferred-label" : null,
    "sentiment" : "NICE_TO_HAVE",
    "type" : "skill",
    "start-position" : 3443,
    "end-position" : 3468,
    "concept-id" : null,
    "matched-string" : "service och kundkontakter",
    "annotation-id" : 19
  }, {
    "preferred-label" : "arbeta självständigt",
    "sentiment" : "MUST_HAVE",
    "type" : "esco-skill",
    "start-position" : 3569,
    "end-position" : 3581,
    "concept-id" : "NyFu_HHd_zhz",
    "matched-string" : "självständig",
    "annotation-id" : 20
  }, {
    "preferred-label" : "samarbeta med kolleger",
    "sentiment" : "MUST_HAVE",
    "type" : "esco-skill",
    "start-position" : 3590,
    "end-position" : 3610,
    "concept-id" : "X15R_797_q62",
    "matched-string" : "god samarbetsförmåga",
    "annotation-id" : 21
  }, {
    "preferred-label" : "Göteborg",
    "type" : "municipality",
    "start-position" : 3750,
    "end-position" : 3759,
    "concept-id" : "PVZL_BQT_XtL",
    "matched-string" : "Göteborgs",
    "annotation-id" : 22
  }, {
    "preferred-label" : "Göteborg",
    "type" : "municipality",
    "start-position" : 3818,
    "end-position" : 3827,
    "concept-id" : "PVZL_BQT_XtL",
    "matched-string" : "Göteborgs",
    "annotation-id" : 23
  } ],
  "text" : "Parkförvaltare\nVill du vara med och skapa dagens och morgondagens utemiljöer i Göteborg? Park- och naturförvaltningen är en viktig part i stadsutvecklingen. Vi förvaltar och utvecklar stadens parker, lekplatser, naturområden, sjöar och vattendrag. På uppdrag av andra förvaltningar utför vi även barmarksrenhållning, grönskötsel, vinterväghållning, underhåll och nybyggnation av markanläggningar samt arbetsmarknadsuppdrag. I vårt arbete strävar vi efter att vara effektiva, kompetenta, engagerade och nyfikna för att skapa en skön storstad med en grön själ, där alla kan hitta sin plats.\r\n\r\nARBETSUPPGIFTER\nJust nu pågår ett spännande arbete med att bygga upp Göteborgs nya organisationer för stadsutveckling. De nya förvaltningarna ska bidra till en mer sammanhållen stadsutvecklingsprocess i såväl planering, genomförande som förvaltning av staden. Förändringen ska bidra till ökad effektivitet och transparens i arbetet med stadsutveckling för boende, besökare och näringsliv. Tillsammans kommer vi med våra andra berörda förvaltningar att slås ihop och bilda fyra nya förvaltningar från och med årsskiftet 2022/2023. Nu söker vi dig som vill vara med på denna förändringsresa och tillsammans lägga grunden för vår nya stadsutvecklingsorganisation i Göteborg.\n\nSom parkförvaltare kommer du att arbeta på parkenheten, som förvaltar, sköter och utvecklar parker, lekplatser, träd, planteringar, vissa torg, gång och cykelstråk samt bostadsnära naturområden. Här får du möjlighet att, tillsammans med engagerade kollegor, delta i stadens utvecklingsarbete och bidra till sociala och ekologiska värden genom att ta hand om Stadens grönområden.\n\nUtifrån din roll som beställare kommer du att ansvara för och koordinera skötsel och utveckling av utomhusmiljöer inom ett eller flera avgränsade geografiska område. Det innebär bland annat att du ska planera för hur området ska skötas samt delta i utvecklingen av området. Du ska även följa upp och kvalitetssäkra skötseluppdraget. Förutom att ansvara för den kontinuerliga skötseln ska du genomföra olika reparation underhålls- och upprustningsarbeten. Du kommer att vara park- och naturförvaltningens representant i olika projekt och samrådsgrupper och arbetet innebär mycket kontakter med allmänhet, olika entreprenörer samt andra förvaltningar och bolag i Göteborgs Stad. Du har ett budgetansvar och tjänsten är huvudsakligen administrativ med administration av det som rör ditt ansvarsområde, samt besiktning och upphandling.\n\nPå Parkenheten arbetar 19 medarbetare med stor kompetens och starkt engagemang för att förvalta och utveckla vår Stad. Just nu är förvaltningen i en utvecklingsfas och du har god möjlighet och förväntas att bidra med nytänkande och förbättringsarbete. Innehållet i rollen kan komma att justeras utifrån att vi ser över rollen och ansvarsområden på enheten. Vårt mål är att uppnå en organisation som möter omvärldens krav och skapar en bättre vardag för de som bor i och besöker Göteborg.\n\n\n\r\n\r\nKVALIFIKATIONER\nVi söker dig som har en högskoleutbildning eller YH-utbildning inom det gröna området. Vi ser att du har några års erfarenhet av skötsel och underhåll samt några års erfarenhet av park- och anläggningsarbete. Du har även erfarenhet av arbetsledning gentemot entreprenörer eller utförare. \nVi tillhandahåller service och information och arbetsuppgifterna innebär många kontaktytor, därför är det meriterande om du har tidigare erfarenhet av att arbeta med service och kundkontakter. Du kommer arbeta både på egen hand och tillsammans med andra vilket ställer krav på att du både är självständig och har god samarbetsförmåga. Då arbetsuppgifterna varierar behöver du vara flexibel och för att trivas i rollen ser vi att du har ett stort intresse av att bidra till Göteborgs utveckling. \n\nPark- och naturförvaltningen arbetar enligt Göteborgs Stads förhållningssätt som är: \nVi vet vårt uppdrag och vem vi är till för, vi bryr oss, vi arbetar tillsammans och vi tänker nytt. Vi vill att park- och naturförvaltningen ska präglas av öppenhet och respekt för olikheter. Därför tror vi att mångfald bidrar till att utveckla vår verksamhet.\n\nVälkommen med din ansökan!\n\n\r\n\nÖVRIGT\nPark- och naturförvaltningen har ett brett uppdrag och kan erbjuda ett flertal spännande roller så att du som medarbetare kan växa och utvecklas. Vår rekryteringsprocess är normkritisk och kompetensbaserad och vi strävar efter mångfald bland våra medarbetare. Vi arbetar för en god och hållbar arbetsmiljö och tar avstånd från alla former av kränkningar och sexuella trakasserier. För att du ska trivas och må bra erbjuder vi förmåner som cykelbidrag, friskvårdsbidrag och träning på flera olika idrottsanläggningar till rabatterat pris. Vi har även en fritidsförening som ordnar olika aktiviteter för personalen.\nVill du veta mer om oss?\n\nFölj vår företagssida på Linkedin \nhttps://bit.ly/2Mi5QOJ"
}