{
  "meta" : {
    "jobad" : {
      "description" : {
        "requirements" : null,
        "needs" : null,
        "company_information" : null,
        "text_formatted" : "Avdelning 42 MAVA/MIA är inriktad på medicinsk akutvård (MAVA) har 17 vårdplatser. Tre av dessa är intermediärvårdplatser (MIA) med teknisk utrustning för avanceras övervakning. På arbetsplatsen finns kompetenta kollegor som jobbar bra i team med att ta hand om svårt sjuka patienter.  \n\nVi söker\nVi söker dig som är legitimerad sjuksköterska, det är meriterande om du har tidigare arbetserfarenhet inom akutsjukvård.\nVi lägger stor vikt vid dina personliga egenskaper. Du är initiativtagande, självständig och har en helhetssyn där du tar hänsyn till det större perspektivet. \n\nDet här får du arbeta med\nSom sjuksköterska på vår avdelning kommer du att möta patienter med skilda behov och åldrar. Vårt mål är att ge våra patienter den allra bästa omvårdnaden och att varje patient ska känna trygghet och mötas med respekt och lyhördhet när de vårdas hos oss. Som sjuksköterska är du ansvarig för omvårdnadsplanering, läkemedelshantering, arbetsledning och dokumentation. \n\nDet här erbjuder vi dig\n-Vi erbjuder internutbildning i områden relevanta för avdelningen.\n- Utvecklings- och karriärmöjligheter där du får vara med och skapa framtidens hälsa och vård\n- Hälsofrämjande arbetsplatser med tillgång till friskvårdsaktiviteter och friskvårdsbidrag\n- Länk till våra förmåner: https://www.norrbotten.se/sv/Jobb-och-utbildning/Jobba-hos-oss/\nInformation om tjänsten\nVi erbjuder en tillsvidaretjänst på heltid. Arbetstiderna varierar mellan dag och kväll  det finns även möjlighet att arbeta natt. Urval och intervjuer sker löpande och tjänsten kan tillsättas innan sista ansökningsdag.\nRegion Norrbotten tillämpar individuell lönesättning enligt kollektivavtal.\n\nVälkommen med din ansökan!",
        "conditions" : "Heltid",
        "text" : "Avdelning 42 MAVA/MIA är inriktad på medicinsk akutvård (MAVA) har 17 vårdplatser. Tre av dessa är intermediärvårdplatser (MIA) med teknisk utrustning för avanceras övervakning. På arbetsplatsen finns kompetenta kollegor som jobbar bra i team med att ta hand om svårt sjuka patienter.  \n\nVi söker\nVi söker dig som är legitimerad sjuksköterska, det är meriterande om du har tidigare arbetserfarenhet inom akutsjukvård.\nVi lägger stor vikt vid dina personliga egenskaper. Du är initiativtagande, självständig och har en helhetssyn där du tar hänsyn till det större perspektivet. \n\nDet här får du arbeta med\nSom sjuksköterska på vår avdelning kommer du att möta patienter med skilda behov och åldrar. Vårt mål är att ge våra patienter den allra bästa omvårdnaden och att varje patient ska känna trygghet och mötas med respekt och lyhördhet när de vårdas hos oss. Som sjuksköterska är du ansvarig för omvårdnadsplanering, läkemedelshantering, arbetsledning och dokumentation. \n\nDet här erbjuder vi dig\n-Vi erbjuder internutbildning i områden relevanta för avdelningen.\n- Utvecklings- och karriärmöjligheter där du får vara med och skapa framtidens hälsa och vård\n- Hälsofrämjande arbetsplatser med tillgång till friskvårdsaktiviteter och friskvårdsbidrag\n- Länk till våra förmåner: https://www.norrbotten.se/sv/Jobb-och-utbildning/Jobba-hos-oss/\nInformation om tjänsten\nVi erbjuder en tillsvidaretjänst på heltid. Arbetstiderna varierar mellan dag och kväll  det finns även möjlighet att arbeta natt. Urval och intervjuer sker löpande och tjänsten kan tillsättas innan sista ansökningsdag.\nRegion Norrbotten tillämpar individuell lönesättning enligt kollektivavtal.\n\nVälkommen med din ansökan!"
      },
      "headline" : "Sjuksköterska till MAVA/MIA på Sunderby sjukhus ",
      "driving_license" : null,
      "employer" : {
        "email" : null,
        "phone_number" : null,
        "organization_number" : "2321000230",
        "name" : "REGION NORRBOTTEN",
        "url" : "www.nll.se",
        "workplace" : "Region Norrbotten"
      },
      "removed_date" : null,
      "logo_url" : "https://www.arbetsformedlingen.se/rest/arbetsgivare/rest/af/v3/organisation/2321000230/logotyper/logo.png",
      "last_publication_date" : "2022-09-11T23:59:59",
      "number_of_vacancies" : 1,
      "occupation" : {
        "concept_id" : "bXNH_MNX_dUR",
        "label" : "Sjuksköterska, grundutbildad",
        "legacy_ams_taxonomy_id" : "7296"
      },
      "occupation_group" : {
        "concept_id" : "Z8ci_bBE_tmx",
        "label" : "Grundutbildade sjuksköterskor",
        "legacy_ams_taxonomy_id" : "2221"
      },
      "employment_type" : {
        "concept_id" : "PFZr_Syz_cUq",
        "label" : "Vanlig anställning",
        "legacy_ams_taxonomy_id" : "1"
      },
      "webpage_url" : "https://arbetsformedlingen.se/platsbanken/annonser/26412803",
      "driving_license_required" : false,
      "application_contacts" : [ {
        "description" : null,
        "email" : "andreas.westin@norrbotten.se",
        "telephone" : "072-502 96 44",
        "name" : "Andreas Westin",
        "contact_type" : null
      } ],
      "duration" : {
        "concept_id" : "a7uU_j21_mkL",
        "label" : "Tills vidare",
        "legacy_ams_taxonomy_id" : "1"
      },
      "nice_to_have" : {
        "education_level" : [ ],
        "work_experiences" : [ ],
        "skills" : [ ],
        "education" : [ ],
        "languages" : [ ]
      },
      "application_details" : {
        "via_af" : false,
        "email" : null,
        "other" : null,
        "reference" : "201567",
        "url" : "https://candidate.hr-manager.net/ApplicationInit.aspx?cid=290&ProjectId=201567&DepartmentId=21812&MediaId=4",
        "information" : null
      },
      "source_type" : "VIA_PLATSBANKEN_DXA",
      "application_deadline" : "2022-09-11T23:59:59",
      "external_id" : "46-232100-0230-00159117",
      "workplace_address" : {
        "coordinates" : [ 22.156702, 65.584816 ],
        "city" : null,
        "postcode" : null,
        "municipality" : "Luleå",
        "region_concept_id" : "9hXe_F4g_eTG",
        "region" : "Norrbottens län",
        "country_code" : "199",
        "region_code" : "25",
        "municipality_concept_id" : "CXbY_gui_14v",
        "country_concept_id" : "i46j_HmG_v64",
        "municipality_code" : "2580",
        "street_address" : null,
        "country" : "Sverige"
      },
      "id" : "26412803",
      "experience_required" : true,
      "working_hours_type" : {
        "concept_id" : "6YE1_gAC_R2G",
        "label" : "Heltid",
        "legacy_ams_taxonomy_id" : "1"
      },
      "access" : null,
      "timestamp" : 1660630412690,
      "must_have" : {
        "education_level" : [ ],
        "work_experiences" : [ {
          "concept_id" : "bXNH_MNX_dUR",
          "weight" : 10,
          "label" : "Sjuksköterska, grundutbildad",
          "legacy_ams_taxonomy_id" : "7296"
        } ],
        "skills" : [ ],
        "education" : [ ],
        "languages" : [ ]
      },
      "occupation_field" : {
        "concept_id" : "NYW6_mP6_vwf",
        "label" : "Hälso- och sjukvård",
        "legacy_ams_taxonomy_id" : "8"
      },
      "scope_of_work" : {
        "min" : 100,
        "max" : 100
      },
      "salary_type" : {
        "concept_id" : "oG8G_9cW_nRf",
        "label" : "Fast månads- vecko- eller timlön",
        "legacy_ams_taxonomy_id" : "1"
      },
      "removed" : false,
      "salary_description" : null,
      "access_to_own_car" : false,
      "publication_date" : "2022-08-16T08:13:32"
    },
    "name" : "Sjuksköterska till MAVA/MIA på Sunderby sjukhus ",
    "user" : "hannes"
  },
  "sha1" : "ac21c27639509ba7cbe906b537ea8d1da1df6b9f",
  "annotations" : [ {
    "preferred-label" : "Sjuksköterska, grundutbildad",
    "sentiment" : "MUST_HAVE",
    "type" : "occupation-name",
    "start-position" : 0,
    "end-position" : 13,
    "concept-id" : "bXNH_MNX_dUR",
    "matched-string" : "sjuksköterska",
    "annotation-id" : 0
  }, {
    "preferred-label" : "Sjuksköterska, grundutbildad",
    "sentiment" : "MUST_HAVE",
    "type" : "occupation-name",
    "start-position" : 378,
    "end-position" : 391,
    "concept-id" : "bXNH_MNX_dUR",
    "matched-string" : "sjuksköterska",
    "annotation-id" : 1
  }, {
    "preferred-label" : "Akutsjukvård",
    "sentiment" : "NOT_RELEVANT",
    "type" : "skill",
    "start-position" : 453,
    "end-position" : 465,
    "concept-id" : "azXF_rgu_EWv",
    "matched-string" : "akutsjukvård",
    "annotation-id" : 2
  }, {
    "preferred-label" : "arbeta självständigt",
    "sentiment" : "MUST_HAVE",
    "type" : "esco-skill",
    "start-position" : 543,
    "end-position" : 555,
    "concept-id" : "NyFu_HHd_zhz",
    "matched-string" : "självständig",
    "annotation-id" : 8
  }, {
    "preferred-label" : "Sjuksköterska, grundutbildad",
    "sentiment" : "MUST_HAVE",
    "type" : "occupation-name",
    "start-position" : 658,
    "end-position" : 671,
    "concept-id" : "bXNH_MNX_dUR",
    "matched-string" : "sjuksköterska",
    "annotation-id" : 3
  }, {
    "preferred-label" : "Sjuksköterska, grundutbildad",
    "sentiment" : "MUST_HAVE",
    "type" : "occupation-name",
    "start-position" : 913,
    "end-position" : 926,
    "concept-id" : "bXNH_MNX_dUR",
    "matched-string" : "sjuksköterska",
    "annotation-id" : 4
  }, {
    "preferred-label" : "Dokumentation",
    "sentiment" : "MUST_HAVE",
    "type" : "keyword",
    "start-position" : 1006,
    "end-position" : 1019,
    "concept-id" : "jodz_kWf_iKx",
    "matched-string" : "dokumentation",
    "annotation-id" : 5
  }, {
    "preferred-label" : "Hälsa",
    "sentiment" : "NOT_RELEVANT",
    "type" : "keyword",
    "start-position" : 1193,
    "end-position" : 1198,
    "concept-id" : "Abys_5p1_Cnq",
    "matched-string" : "hälsa",
    "annotation-id" : 6
  }, {
    "preferred-label" : "Tillsvidareanställning (inkl. eventuell provanställning)",
    "sentiment" : "OFFERED",
    "type" : "employment-type",
    "start-position" : 1430,
    "end-position" : 1447,
    "concept-id" : "kpPX_CNN_gDU",
    "matched-string" : "tillsvidaretjänst",
    "annotation-id" : 9
  }, {
    "preferred-label" : "Heltid",
    "sentiment" : "OFFERED",
    "type" : "worktime-extent",
    "start-position" : 1451,
    "end-position" : 1457,
    "concept-id" : "6YE1_gAC_R2G",
    "matched-string" : "heltid",
    "annotation-id" : 10
  }, {
    "preferred-label" : "Norrbottens län",
    "sentiment" : "NOT_RELEVANT",
    "type" : "region",
    "start-position" : 1635,
    "end-position" : 1652,
    "concept-id" : "9hXe_F4g_eTG",
    "matched-string" : "Region Norrbotten",
    "annotation-id" : 11
  }, {
    "preferred-label" : "Kollektivavtal",
    "sentiment" : "OFFERED",
    "type" : "skill",
    "start-position" : 1695,
    "end-position" : 1709,
    "concept-id" : "z7wE_9xb_3jX",
    "matched-string" : "kollektivavtal",
    "annotation-id" : 7
  } ],
  "text" : "Sjuksköterska till MAVA/MIA på Sunderby sjukhus \nAvdelning 42 MAVA/MIA är inriktad på medicinsk akutvård (MAVA) har 17 vårdplatser. Tre av dessa är intermediärvårdplatser (MIA) med teknisk utrustning för avanceras övervakning. På arbetsplatsen finns kompetenta kollegor som jobbar bra i team med att ta hand om svårt sjuka patienter.  \n\nVi söker\nVi söker dig som är legitimerad sjuksköterska, det är meriterande om du har tidigare arbetserfarenhet inom akutsjukvård.\nVi lägger stor vikt vid dina personliga egenskaper. Du är initiativtagande, självständig och har en helhetssyn där du tar hänsyn till det större perspektivet. \n\nDet här får du arbeta med\nSom sjuksköterska på vår avdelning kommer du att möta patienter med skilda behov och åldrar. Vårt mål är att ge våra patienter den allra bästa omvårdnaden och att varje patient ska känna trygghet och mötas med respekt och lyhördhet när de vårdas hos oss. Som sjuksköterska är du ansvarig för omvårdnadsplanering, läkemedelshantering, arbetsledning och dokumentation. \n\nDet här erbjuder vi dig\n-Vi erbjuder internutbildning i områden relevanta för avdelningen.\n- Utvecklings- och karriärmöjligheter där du får vara med och skapa framtidens hälsa och vård\n- Hälsofrämjande arbetsplatser med tillgång till friskvårdsaktiviteter och friskvårdsbidrag\n- Länk till våra förmåner: https://www.norrbotten.se/sv/Jobb-och-utbildning/Jobba-hos-oss/\nInformation om tjänsten\nVi erbjuder en tillsvidaretjänst på heltid. Arbetstiderna varierar mellan dag och kväll  det finns även möjlighet att arbeta natt. Urval och intervjuer sker löpande och tjänsten kan tillsättas innan sista ansökningsdag.\nRegion Norrbotten tillämpar individuell lönesättning enligt kollektivavtal.\n\nVälkommen med din ansökan!"
}