{
  "meta" : {
    "jobad" : {
      "description" : {
        "requirements" : null,
        "needs" : null,
        "company_information" : null,
        "text_formatted" : "<p>Thai House är en väl renoverad restaurang i Skövde för det asiatiska köket. Vi behöver stärka vårt arbetslag med en kock.</p><p>Du ska ha kunskap om det Asiatiska köket, är du dessutom utbildad kock är det meriterande men ej krav.</p><p>Du ska vara ansvarsfull, plikttrogen och flexibel. Ordning och reda är också ledord hos dig.</p><p>Du ser möjligheten i att lösa problemen när de uppstår.</p><p>Vi erbjuder ett flexibelt arbete med korta beslutsvägar, där alla ställer upp för varandra. </p><p id=\"oppenforalla\">Öppen för alla\nVi fokuserar på din kompetens, inte dina övriga förutsättningar. Vi är öppna för att anpassa rollen eller arbetsplatsen efter dina behov.</p>",
        "conditions" : null,
        "text" : "Thai House är en väl renoverad restaurang i Skövde för det asiatiska köket. Vi behöver stärka vårt arbetslag med en kock.\nDu ska ha kunskap om det Asiatiska köket, är du dessutom utbildad kock är det meriterande men ej krav.\nDu ska vara ansvarsfull, plikttrogen och flexibel. Ordning och reda är också ledord hos dig.\nDu ser möjligheten i att lösa problemen när de uppstår.\nVi erbjuder ett flexibelt arbete med korta beslutsvägar, där alla ställer upp för varandra. \nÖppen för alla\nVi fokuserar på din kompetens, inte dina övriga förutsättningar. Vi är öppna för att anpassa rollen eller arbetsplatsen efter dina behov."
      },
      "headline" : "asiatiska kock",
      "driving_license" : null,
      "employer" : {
        "email" : null,
        "phone_number" : null,
        "organization_number" : "5567295620",
        "name" : "Cy Island AB",
        "url" : null,
        "workplace" : "Cy Island AB"
      },
      "removed_date" : null,
      "logo_url" : null,
      "last_publication_date" : "2022-12-31T23:59:59",
      "number_of_vacancies" : 3,
      "occupation" : {
        "concept_id" : "JbJw_as4_S93",
        "label" : "Kock, à la carte",
        "legacy_ams_taxonomy_id" : "7663"
      },
      "occupation_group" : {
        "concept_id" : "BStc_SJh_DKG",
        "label" : "Kockar och kallskänkor",
        "legacy_ams_taxonomy_id" : "5120"
      },
      "employment_type" : {
        "concept_id" : "PFZr_Syz_cUq",
        "label" : "Vanlig anställning",
        "legacy_ams_taxonomy_id" : "1"
      },
      "webpage_url" : "https://arbetsformedlingen.se/platsbanken/annonser/26349496",
      "driving_license_required" : false,
      "application_contacts" : [ ],
      "duration" : {
        "concept_id" : "a7uU_j21_mkL",
        "label" : "Tills vidare",
        "legacy_ams_taxonomy_id" : "1"
      },
      "nice_to_have" : {
        "education_level" : [ ],
        "work_experiences" : [ {
          "concept_id" : "JbJw_as4_S93",
          "weight" : 5,
          "label" : "Kock, à la carte",
          "legacy_ams_taxonomy_id" : "7663"
        } ],
        "skills" : [ ],
        "education" : [ ],
        "languages" : [ ]
      },
      "application_details" : {
        "via_af" : false,
        "email" : "thaihouse.sk@gmail.com",
        "other" : null,
        "reference" : null,
        "url" : null,
        "information" : null
      },
      "source_type" : "VIA_ANNONSERA",
      "application_deadline" : "2022-12-31T23:59:59",
      "external_id" : null,
      "workplace_address" : {
        "coordinates" : [ 13.865116519105348, 58.39313236987147 ],
        "city" : "Skövde",
        "postcode" : "54134",
        "municipality" : "Skövde",
        "region_concept_id" : "zdoY_6u5_Krt",
        "region" : "Västra Götalands län",
        "country_code" : "199",
        "region_code" : "14",
        "municipality_concept_id" : "fqAy_4ji_Lz2",
        "country_concept_id" : "i46j_HmG_v64",
        "municipality_code" : "1496",
        "street_address" : "Lärkstigen 2",
        "country" : "Sverige"
      },
      "id" : "26349496",
      "experience_required" : true,
      "working_hours_type" : {
        "concept_id" : "6YE1_gAC_R2G",
        "label" : "Heltid",
        "legacy_ams_taxonomy_id" : "1"
      },
      "access" : null,
      "timestamp" : 1658702420291,
      "must_have" : {
        "education_level" : [ ],
        "work_experiences" : [ ],
        "skills" : [ ],
        "education" : [ ],
        "languages" : [ ]
      },
      "occupation_field" : {
        "concept_id" : "ScKy_FHB_7wT",
        "label" : "Hotell, restaurang, storhushåll",
        "legacy_ams_taxonomy_id" : "7"
      },
      "scope_of_work" : {
        "min" : 0,
        "max" : 100
      },
      "salary_type" : {
        "concept_id" : "oG8G_9cW_nRf",
        "label" : "Fast månads- vecko- eller timlön",
        "legacy_ams_taxonomy_id" : "1"
      },
      "removed" : false,
      "salary_description" : null,
      "access_to_own_car" : false,
      "publication_date" : "2022-07-25T00:40:20"
    },
    "name" : "asiatiska kock",
    "user" : "hannes"
  },
  "sha1" : "ec95ffe5b5054a22bf65a25b4171bc372f163a32",
  "annotations" : [ {
    "preferred-label" : "kock",
    "sentiment" : "MUST_HAVE",
    "type" : "esco-occupation",
    "start-position" : 10,
    "end-position" : 14,
    "concept-id" : "Ti2H_QoQ_EMX",
    "matched-string" : "kock",
    "annotation-id" : 0
  }, {
    "preferred-label" : "Restaurang",
    "sentiment" : "MUST_HAVE",
    "type" : "keyword",
    "start-position" : 48,
    "end-position" : 58,
    "concept-id" : "o2Cg_3Ap_qvK",
    "matched-string" : "restaurang",
    "annotation-id" : 3
  }, {
    "preferred-label" : "kock",
    "sentiment" : "MUST_HAVE",
    "type" : "esco-occupation",
    "start-position" : 139,
    "end-position" : 143,
    "concept-id" : "Ti2H_QoQ_EMX",
    "matched-string" : "kock",
    "annotation-id" : 4
  }, {
    "preferred-label" : "kock",
    "sentiment" : "MUST_HAVE",
    "type" : "esco-occupation",
    "start-position" : 213,
    "end-position" : 217,
    "concept-id" : "Ti2H_QoQ_EMX",
    "matched-string" : "kock",
    "annotation-id" : 5
  }, {
    "preferred-label" : "visa ansvarstagande",
    "type" : "esco-skill",
    "start-position" : 263,
    "end-position" : 274,
    "concept-id" : "bcRp_hxV_f5G",
    "matched-string" : "ansvarsfull",
    "annotation-id" : 6
  } ],
  "text" : "asiatiska kock\nThai House är en väl renoverad restaurang i Skövde för det asiatiska köket. Vi behöver stärka vårt arbetslag med en kock.\nDu ska ha kunskap om det Asiatiska köket, är du dessutom utbildad kock är det meriterande men ej krav.\nDu ska vara ansvarsfull, plikttrogen och flexibel. Ordning och reda är också ledord hos dig.\nDu ser möjligheten i att lösa problemen när de uppstår.\nVi erbjuder ett flexibelt arbete med korta beslutsvägar, där alla ställer upp för varandra. \nÖppen för alla\nVi fokuserar på din kompetens, inte dina övriga förutsättningar. Vi är öppna för att anpassa rollen eller arbetsplatsen efter dina behov."
}