{
  "meta" : {
    "jobad" : {
      "description" : {
        "requirements" : null,
        "needs" : null,
        "company_information" : null,
        "text_formatted" : "<h3><strong>Till vår kund trevliga kund i Växjö söker vi nu ansvarsfulla medarbetare för underhåll av rondeller och refuger.</strong><br> </h3><h3>I rollen ansvarar du främst för:</h3><ul>\t<li>Gräs- och häckklippning</li>\t<li>Beskärningsarbeten</li>\t<li>Ogräsrensning</li></ul><h3> </h3><p>Har du känsla för växter och planteringar och vill vara den person som säkerställer att offentliga miljöer så som rondeller och refuger ser trevliga och fina ut? Då vill vi gärna komma i kontakt med dig redan idag!<br>  <br><br><strong>Din profil</strong><br>Vi söker dig som har någon form av gymnasial utbildning samt gillar att arbeta utomhus. Har du trädgårdsutbildning eller erfarenhet/intresse av trädgårdsarbete är detta meriterande, likaså utbildningen Arbete på väg då man vistas mycket vid vägar. <br><br>Som person är du ansvarsfull, pålitlig och engagerad, du bidrar med hög arbetsmoral och har alltid ett leende på läpparna. Vidare trivs du med att arbeta praktiskt och god fysisk. Du gillar att arbeta självständigt men trivs även i gruppmoment där ni tillsammans verkar för det goda samarbetet. Glädje och trivsel bland kollegor är något som ligger dig extra varmt om hjärtat, något som även vi som uppdragsgivare värdesätter!<br><br>Vi ställer krav på B-körkort samt ser vi gärna att du har goda vana av att använda handverktyg, röjsåg, motorsåg eller andra utomhusmaskiner.<br><br>Uppdraget startar omgående och är ett korttidsuppdrag på två veckor men för rätt person finns möjlighet till en tillsvidareanställning på sikt.<br>                              <br><br>Vi rekryterar löpande och tjänsten kan komma att tillsättas innan ansökningstiden har gått ut.<br>Du är varmt välkommen med din ansökan redan idag!<br>Du ansöker direkt på <a href=\"http://www.empleo.se/\">www.empleo.se</a><br><br>Uppstart: Omgående.<br>Ort/Placering: Växjö<br>Omfattning: Heltid, dagtid. <br>Lön: Enligt gällande kollektivavtal.</p><h3><br><br><br><br> </h3><p> </p>",
        "conditions" : null,
        "text" : "Till vår kund trevliga kund i Växjö söker vi nu ansvarsfulla medarbetare för underhåll av rondeller och refuger.\n \nI rollen ansvarar du främst för:\n Gräs- och häckklippning\n Beskärningsarbeten\n Ogräsrensning\n\n \nHar du känsla för växter och planteringar och vill vara den person som säkerställer att offentliga miljöer så som rondeller och refuger ser trevliga och fina ut? Då vill vi gärna komma i kontakt med dig redan idag!\n  \n\nDin profil\nVi söker dig som har någon form av gymnasial utbildning samt gillar att arbeta utomhus. Har du trädgårdsutbildning eller erfarenhet/intresse av trädgårdsarbete är detta meriterande, likaså utbildningen Arbete på väg då man vistas mycket vid vägar. \n\nSom person är du ansvarsfull, pålitlig och engagerad, du bidrar med hög arbetsmoral och har alltid ett leende på läpparna. Vidare trivs du med att arbeta praktiskt och god fysisk. Du gillar att arbeta självständigt men trivs även i gruppmoment där ni tillsammans verkar för det goda samarbetet. Glädje och trivsel bland kollegor är något som ligger dig extra varmt om hjärtat, något som även vi som uppdragsgivare värdesätter!\n\nVi ställer krav på B-körkort samt ser vi gärna att du har goda vana av att använda handverktyg, röjsåg, motorsåg eller andra utomhusmaskiner.\n\nUppdraget startar omgående och är ett korttidsuppdrag på två veckor men för rätt person finns möjlighet till en tillsvidareanställning på sikt.\n                              \n\nVi rekryterar löpande och tjänsten kan komma att tillsättas innan ansökningstiden har gått ut.\nDu är varmt välkommen med din ansökan redan idag!\nDu ansöker direkt på www.empleo.se\n\nUppstart: Omgående.\nOrt/Placering: Växjö\nOmfattning: Heltid, dagtid. \nLön: Enligt gällande kollektivavtal."
      },
      "headline" : "Drivna studenter sökes för korttidsuppdrag i Växjö",
      "driving_license" : [ {
        "concept_id" : "VTK8_WRx_GcM",
        "label" : "B",
        "legacy_ams_taxonomy_id" : "3"
      } ],
      "employer" : {
        "email" : null,
        "phone_number" : null,
        "organization_number" : "5568731425",
        "name" : "Empleo Växjö AB",
        "url" : "www.peab.se",
        "workplace" : "Empleo AB"
      },
      "removed_date" : null,
      "logo_url" : "https://www.arbetsformedlingen.se/rest/arbetsgivare/rest/af/v3/organisation/5568731425/logotyper/logo.png",
      "last_publication_date" : "2022-06-26T23:59:59",
      "number_of_vacancies" : 3,
      "occupation" : {
        "concept_id" : "EwkH_3Xb_r8j",
        "label" : "Parkarbetare/Utemiljöarbetare/Miljövärd",
        "legacy_ams_taxonomy_id" : "6717"
      },
      "occupation_group" : {
        "concept_id" : "XBh3_Xrm_C4R",
        "label" : "Trädgårdsanläggare m.fl.",
        "legacy_ams_taxonomy_id" : "6113"
      },
      "employment_type" : {
        "concept_id" : "PFZr_Syz_cUq",
        "label" : "Vanlig anställning",
        "legacy_ams_taxonomy_id" : "1"
      },
      "webpage_url" : "https://arbetsformedlingen.se/platsbanken/annonser/26244431",
      "driving_license_required" : true,
      "application_contacts" : [ {
        "description" : "Åsa Svärd",
        "email" : "asa.svard@empleo.se",
        "telephone" : null,
        "name" : null,
        "contact_type" : null
      } ],
      "duration" : {
        "concept_id" : "a7uU_j21_mkL",
        "label" : "Tills vidare",
        "legacy_ams_taxonomy_id" : "1"
      },
      "nice_to_have" : {
        "education_level" : [ ],
        "work_experiences" : [ ],
        "skills" : [ ],
        "education" : [ ],
        "languages" : [ ]
      },
      "application_details" : {
        "via_af" : false,
        "email" : null,
        "other" : null,
        "reference" : null,
        "url" : "https://apply.recman.no/job_post.php?id=282760&path=ams&sub_id=452",
        "information" : null
      },
      "source_type" : "VIA_PLATSBANKEN_DXA",
      "application_deadline" : "2022-06-26T23:59:59",
      "external_id" : "46-556873-1425-28276062b1d8a8e2f11",
      "workplace_address" : {
        "coordinates" : [ 14.805852, 56.879005 ],
        "city" : null,
        "postcode" : null,
        "municipality" : "Växjö",
        "region_concept_id" : "tF3y_MF9_h5G",
        "region" : "Kronobergs län",
        "country_code" : "199",
        "region_code" : "07",
        "municipality_concept_id" : "mmot_H3A_auW",
        "country_concept_id" : "i46j_HmG_v64",
        "municipality_code" : "0780",
        "street_address" : null,
        "country" : "Sverige"
      },
      "id" : "26244431",
      "experience_required" : true,
      "working_hours_type" : {
        "concept_id" : "6YE1_gAC_R2G",
        "label" : "Heltid",
        "legacy_ams_taxonomy_id" : "1"
      },
      "access" : null,
      "timestamp" : 1655822509485,
      "must_have" : {
        "education_level" : [ ],
        "work_experiences" : [ {
          "concept_id" : "EwkH_3Xb_r8j",
          "weight" : 10,
          "label" : "Parkarbetare/Utemiljöarbetare/Miljövärd",
          "legacy_ams_taxonomy_id" : "6717"
        } ],
        "skills" : [ ],
        "education" : [ ],
        "languages" : [ ]
      },
      "occupation_field" : {
        "concept_id" : "VuuL_7CH_adj",
        "label" : "Naturbruk",
        "legacy_ams_taxonomy_id" : "13"
      },
      "scope_of_work" : {
        "min" : 100,
        "max" : 100
      },
      "salary_type" : {
        "concept_id" : "oG8G_9cW_nRf",
        "label" : "Fast månads- vecko- eller timlön",
        "legacy_ams_taxonomy_id" : "1"
      },
      "removed" : false,
      "salary_description" : null,
      "access_to_own_car" : true,
      "publication_date" : "2022-06-21T16:41:49"
    },
    "name" : "Drivna studenter sökes för korttidsuppdrag i Växjö",
    "user" : "hannes"
  },
  "sha1" : "03237a20fdfbc19ca1ab6e6f6bba9fdb672b511c",
  "annotations" : [ {
    "preferred-label" : "Tidsbegränsad anställning",
    "sentiment" : "OFFERED",
    "type" : "employment-type",
    "start-position" : 27,
    "end-position" : 42,
    "concept-id" : "sTu5_NBQ_udq",
    "matched-string" : "korttidsuppdrag",
    "annotation-id" : 19
  }, {
    "preferred-label" : "Växjö",
    "type" : "municipality",
    "start-position" : 45,
    "end-position" : 50,
    "concept-id" : "mmot_H3A_auW",
    "matched-string" : "Växjö",
    "annotation-id" : 2
  }, {
    "preferred-label" : "Växjö",
    "type" : "municipality",
    "start-position" : 81,
    "end-position" : 86,
    "concept-id" : "mmot_H3A_auW",
    "matched-string" : "Växjö",
    "annotation-id" : 3
  }, {
    "preferred-label" : "använda olika typer av utrustning för gräsklippning",
    "sentiment" : "OFFERED",
    "type" : "esco-skill",
    "start-position" : 200,
    "end-position" : 204,
    "concept-id" : "b2w6_YKJ_qZX",
    "matched-string" : "Gräs",
    "annotation-id" : 4
  }, {
    "preferred-label" : "beskära häckar och träd",
    "sentiment" : "OFFERED",
    "type" : "esco-skill",
    "start-position" : 210,
    "end-position" : 223,
    "concept-id" : "GShq_Sut_Wp9",
    "matched-string" : "häckklippning",
    "annotation-id" : 20
  }, {
    "preferred-label" : "beskära häckar och träd",
    "sentiment" : "OFFERED",
    "type" : "esco-skill",
    "start-position" : 225,
    "end-position" : 243,
    "concept-id" : "GShq_Sut_Wp9",
    "matched-string" : "Beskärningsarbeten",
    "annotation-id" : 21
  }, {
    "preferred-label" : "utföra insatser för att bekämpa ogräs",
    "sentiment" : "OFFERED",
    "type" : "esco-skill",
    "start-position" : 245,
    "end-position" : 258,
    "concept-id" : "mY9p_ai7_b9N",
    "matched-string" : "Ogräsrensning",
    "annotation-id" : 6
  }, {
    "preferred-label" : "Gymnasial utbildning",
    "sentiment" : "MUST_HAVE",
    "type" : "sun-education-level-1",
    "start-position" : 527,
    "end-position" : 547,
    "concept-id" : "wyLL_K3a_HRC",
    "matched-string" : "gymnasial utbildning",
    "annotation-id" : 0
  }, {
    "preferred-label" : "arbeta utomhus",
    "type" : "esco-skill",
    "start-position" : 564,
    "end-position" : 578,
    "concept-id" : "Jvu2_Ain_MsJ",
    "matched-string" : "arbeta utomhus",
    "annotation-id" : 7
  }, {
    "preferred-label" : "Trädgårdsingenjörs- och trädgårdsteknikerutbildning",
    "sentiment" : "NICE_TO_HAVE",
    "type" : "sun-education-field-4",
    "start-position" : 587,
    "end-position" : 606,
    "concept-id" : "3rUV_nwv_CbW",
    "matched-string" : "trädgårdsutbildning",
    "annotation-id" : 8
  }, {
    "preferred-label" : "Trädgårdsskötsel",
    "sentiment" : "NICE_TO_HAVE",
    "type" : "skill",
    "start-position" : 636,
    "end-position" : 651,
    "concept-id" : "AAaS_o41_sEg",
    "matched-string" : "trädgårdsarbete",
    "annotation-id" : 9
  }, {
    "preferred-label" : "Arbete på väg, nivå 1 och 2",
    "sentiment" : "NICE_TO_HAVE",
    "type" : "skill",
    "start-position" : 694,
    "end-position" : 707,
    "concept-id" : "drj3_CKp_Mpp",
    "matched-string" : "Arbete på väg",
    "annotation-id" : 22
  }, {
    "preferred-label" : "visa ansvarstagande",
    "sentiment" : "MUST_HAVE",
    "type" : "esco-skill",
    "start-position" : 759,
    "end-position" : 770,
    "concept-id" : "bcRp_hxV_f5G",
    "matched-string" : "ansvarsfull",
    "annotation-id" : 11
  }, {
    "preferred-label" : "God fysik (tunga lyft)",
    "sentiment" : "MUST_HAVE",
    "type" : "skill",
    "start-position" : 910,
    "end-position" : 921,
    "concept-id" : "rwir_xvu_443",
    "matched-string" : "god fysisk.",
    "annotation-id" : 23
  }, {
    "preferred-label" : "arbeta självständigt",
    "sentiment" : "MUST_HAVE",
    "type" : "esco-skill",
    "start-position" : 936,
    "end-position" : 956,
    "concept-id" : "NyFu_HHd_zhz",
    "matched-string" : "arbeta självständigt",
    "annotation-id" : 12
  }, {
    "preferred-label" : "samarbeta med kolleger",
    "sentiment" : "MUST_HAVE",
    "type" : "esco-skill",
    "start-position" : 1025,
    "end-position" : 1035,
    "concept-id" : "X15R_797_q62",
    "matched-string" : "samarbetet",
    "annotation-id" : 13
  }, {
    "preferred-label" : "B",
    "sentiment" : "MUST_HAVE",
    "type" : "driving-licence",
    "start-position" : 1189,
    "end-position" : 1198,
    "concept-id" : "VTK8_WRx_GcM",
    "matched-string" : "B-körkort",
    "annotation-id" : 14
  }, {
    "preferred-label" : "använda handverktyg",
    "sentiment" : "NICE_TO_HAVE",
    "type" : "esco-skill",
    "start-position" : 1253,
    "end-position" : 1264,
    "concept-id" : "kEAr_Hbu_SbC",
    "matched-string" : "handverktyg",
    "annotation-id" : 24
  }, {
    "preferred-label" : "hantera motorsåg",
    "sentiment" : "NICE_TO_HAVE",
    "type" : "esco-skill",
    "start-position" : 1274,
    "end-position" : 1282,
    "concept-id" : "B3Cd_AUp_eCF",
    "matched-string" : "motorsåg",
    "annotation-id" : 15
  }, {
    "preferred-label" : "Tidsbegränsad anställning",
    "sentiment" : "OFFERED",
    "type" : "employment-type",
    "start-position" : 1351,
    "end-position" : 1366,
    "concept-id" : "sTu5_NBQ_udq",
    "matched-string" : "korttidsuppdrag",
    "annotation-id" : 25
  }, {
    "preferred-label" : "Tillsvidareanställning (inkl. eventuell provanställning)",
    "sentiment" : "OFFERED",
    "type" : "employment-type",
    "start-position" : 1425,
    "end-position" : 1447,
    "concept-id" : "kpPX_CNN_gDU",
    "matched-string" : "tillsvidareanställning",
    "annotation-id" : 16
  }, {
    "preferred-label" : "Växjö",
    "type" : "municipality",
    "start-position" : 1705,
    "end-position" : 1710,
    "concept-id" : "mmot_H3A_auW",
    "matched-string" : "Växjö",
    "annotation-id" : 17
  }, {
    "preferred-label" : "Heltid",
    "type" : "worktime-extent",
    "start-position" : 1723,
    "end-position" : 1729,
    "concept-id" : "6YE1_gAC_R2G",
    "matched-string" : "Heltid",
    "annotation-id" : 18
  }, {
    "preferred-label" : "Kollektivavtal",
    "sentiment" : "MUST_HAVE",
    "type" : "skill",
    "start-position" : 1761,
    "end-position" : 1775,
    "concept-id" : "z7wE_9xb_3jX",
    "matched-string" : "kollektivavtal",
    "annotation-id" : 1
  } ],
  "text" : "Drivna studenter sökes för korttidsuppdrag i Växjö\nTill vår kund trevliga kund i Växjö söker vi nu ansvarsfulla medarbetare för underhåll av rondeller och refuger.\n \nI rollen ansvarar du främst för:\n Gräs- och häckklippning\n Beskärningsarbeten\n Ogräsrensning\n\n \nHar du känsla för växter och planteringar och vill vara den person som säkerställer att offentliga miljöer så som rondeller och refuger ser trevliga och fina ut? Då vill vi gärna komma i kontakt med dig redan idag!\n  \n\nDin profil\nVi söker dig som har någon form av gymnasial utbildning samt gillar att arbeta utomhus. Har du trädgårdsutbildning eller erfarenhet/intresse av trädgårdsarbete är detta meriterande, likaså utbildningen Arbete på väg då man vistas mycket vid vägar. \n\nSom person är du ansvarsfull, pålitlig och engagerad, du bidrar med hög arbetsmoral och har alltid ett leende på läpparna. Vidare trivs du med att arbeta praktiskt och god fysisk. Du gillar att arbeta självständigt men trivs även i gruppmoment där ni tillsammans verkar för det goda samarbetet. Glädje och trivsel bland kollegor är något som ligger dig extra varmt om hjärtat, något som även vi som uppdragsgivare värdesätter!\n\nVi ställer krav på B-körkort samt ser vi gärna att du har goda vana av att använda handverktyg, röjsåg, motorsåg eller andra utomhusmaskiner.\n\nUppdraget startar omgående och är ett korttidsuppdrag på två veckor men för rätt person finns möjlighet till en tillsvidareanställning på sikt.\n                              \n\nVi rekryterar löpande och tjänsten kan komma att tillsättas innan ansökningstiden har gått ut.\nDu är varmt välkommen med din ansökan redan idag!\nDu ansöker direkt på www.empleo.se\n\nUppstart: Omgående.\nOrt/Placering: Växjö\nOmfattning: Heltid, dagtid. \nLön: Enligt gällande kollektivavtal."
}