{
  "meta" : {
    "jobad" : {
      "description" : {
        "requirements" : null,
        "needs" : null,
        "company_information" : null,
        "text_formatted" : "*\nFör oss på Montico är det viktigt att vi som arbetsgivare ser till att du trivs och känner att du har möjligheter att utvecklas. Vi strävar efter att skapa en vi-känsla där du ska känna dig som en i gänget.\n\nMontico har funnits sedan 1996 och har hunnit växa och starta upp kontor på 24 orter runt om i södra Sverige. Vi finns bland annat i Markaryd där du förväntas att arbeta detta innebär också att du som anställd alltid har en närhet till din arbetsgivare och ansvarig konsultchef.\n\nOm tjänsten\nVi söker nu en möbeltapetserare till en av våra kunder i Markaryd. Företaget är ledande inom möbelbranschen och ser på framtiden med tillförsikt. \nArbetstiden är förlagd på dagtid, måndag-fredag.\n\nVi söker dig som\nVi söker dig som har en utbildning i grunden mot möbeltapetsering eller har en likvärdig yrkeserfarenhet.\nDu är en hantverkare som gillar att arbeta med olika typer av material och fokuserar alltid på kvalitet och noggrannhet i varje steg. Vidare är du bekant med olika typer av material och är van vid att hantera olika modeller.\nVi ser att du som person är initiativtagande, tillmötesgående och gillar att arbeta i team likväl som att arbeta självständigt.",
        "conditions" : "Heltid\r\nTillsvidare",
        "text" : "*\nFör oss på Montico är det viktigt att vi som arbetsgivare ser till att du trivs och känner att du har möjligheter att utvecklas. Vi strävar efter att skapa en vi-känsla där du ska känna dig som en i gänget.\n\nMontico har funnits sedan 1996 och har hunnit växa och starta upp kontor på 24 orter runt om i södra Sverige. Vi finns bland annat i Markaryd där du förväntas att arbeta detta innebär också att du som anställd alltid har en närhet till din arbetsgivare och ansvarig konsultchef.\n\nOm tjänsten\nVi söker nu en möbeltapetserare till en av våra kunder i Markaryd. Företaget är ledande inom möbelbranschen och ser på framtiden med tillförsikt. \nArbetstiden är förlagd på dagtid, måndag-fredag.\n\nVi söker dig som\nVi söker dig som har en utbildning i grunden mot möbeltapetsering eller har en likvärdig yrkeserfarenhet.\nDu är en hantverkare som gillar att arbeta med olika typer av material och fokuserar alltid på kvalitet och noggrannhet i varje steg. Vidare är du bekant med olika typer av material och är van vid att hantera olika modeller.\nVi ser att du som person är initiativtagande, tillmötesgående och gillar att arbeta i team likväl som att arbeta självständigt."
      },
      "headline" : "Möbeltapetserare",
      "driving_license" : [ {
        "concept_id" : "VTK8_WRx_GcM",
        "label" : "B",
        "legacy_ams_taxonomy_id" : "3"
      } ],
      "employer" : {
        "email" : null,
        "phone_number" : null,
        "organization_number" : "5565806741",
        "name" : "Montico Hr Partner AB",
        "url" : "http://www.montico.se/",
        "workplace" : "Montico HR Partner AB"
      },
      "removed_date" : null,
      "logo_url" : "https://www.arbetsformedlingen.se/rest/arbetsgivare/rest/af/v3/organisation/5565806741/logotyper/logo.png",
      "last_publication_date" : "2022-08-31T23:59:59",
      "number_of_vacancies" : 1,
      "occupation" : {
        "concept_id" : "RP3C_w4J_RLS",
        "label" : "Tapetserare, hantverk",
        "legacy_ams_taxonomy_id" : "7617"
      },
      "occupation_group" : {
        "concept_id" : "vhUJ_LyD_XWc",
        "label" : "Tapetserare",
        "legacy_ams_taxonomy_id" : "7533"
      },
      "employment_type" : {
        "concept_id" : "PFZr_Syz_cUq",
        "label" : "Vanlig anställning",
        "legacy_ams_taxonomy_id" : "1"
      },
      "webpage_url" : "https://arbetsformedlingen.se/platsbanken/annonser/26370010",
      "driving_license_required" : true,
      "application_contacts" : [ {
        "description" : "Nathalie   Jonsson",
        "email" : "nathalie.jonsson@montico.se",
        "telephone" : "0372-75 99 54",
        "name" : null,
        "contact_type" : null
      } ],
      "duration" : {
        "concept_id" : "a7uU_j21_mkL",
        "label" : "Tills vidare",
        "legacy_ams_taxonomy_id" : "1"
      },
      "nice_to_have" : {
        "education_level" : [ ],
        "work_experiences" : [ ],
        "skills" : [ ],
        "education" : [ ],
        "languages" : [ ]
      },
      "application_details" : {
        "via_af" : false,
        "email" : null,
        "other" : null,
        "reference" : "7989",
        "url" : "https://jobb.montico.se/lediga-jobb/7989/",
        "information" : null
      },
      "source_type" : "VIA_PLATSBANKEN_DXA",
      "application_deadline" : "2022-08-31T23:59:59",
      "external_id" : "46-556580-6741-7989",
      "workplace_address" : {
        "coordinates" : [ 13.992941, 56.381535 ],
        "city" : null,
        "postcode" : null,
        "municipality" : "Osby",
        "region_concept_id" : "CaRE_1nn_cSU",
        "region" : "Skåne län",
        "country_code" : "199",
        "region_code" : "12",
        "municipality_concept_id" : "najS_Lvy_mDD",
        "country_concept_id" : "i46j_HmG_v64",
        "municipality_code" : "1273",
        "street_address" : null,
        "country" : "Sverige"
      },
      "id" : "26370010",
      "experience_required" : true,
      "working_hours_type" : {
        "concept_id" : "6YE1_gAC_R2G",
        "label" : "Heltid",
        "legacy_ams_taxonomy_id" : "1"
      },
      "access" : null,
      "timestamp" : 1659422074758,
      "must_have" : {
        "education_level" : [ ],
        "work_experiences" : [ {
          "concept_id" : "RP3C_w4J_RLS",
          "weight" : 10,
          "label" : "Tapetserare, hantverk",
          "legacy_ams_taxonomy_id" : "7617"
        } ],
        "skills" : [ ],
        "education" : [ ],
        "languages" : [ ]
      },
      "occupation_field" : {
        "concept_id" : "PaxQ_o1G_wWH",
        "label" : "Hantverk",
        "legacy_ams_taxonomy_id" : "6"
      },
      "scope_of_work" : {
        "min" : 100,
        "max" : 100
      },
      "salary_type" : {
        "concept_id" : "oG8G_9cW_nRf",
        "label" : "Fast månads- vecko- eller timlön",
        "legacy_ams_taxonomy_id" : "1"
      },
      "removed" : false,
      "salary_description" : "Fast lön",
      "access_to_own_car" : false,
      "publication_date" : "2022-08-02T08:34:34"
    },
    "name" : "Möbeltapetserare",
    "user" : "hannes"
  },
  "sha1" : "0b0f44317a369f72eebb03fbda95861a7cfbd57b",
  "annotations" : [ {
    "preferred-label" : "Tapetsering, möbler",
    "type" : "skill",
    "start-position" : 0,
    "end-position" : 16,
    "concept-id" : "ASht_i6X_E6T",
    "matched-string" : "Möbeltapetserare",
    "annotation-id" : 1
  }, {
    "preferred-label" : "Kontor",
    "sentiment" : "MUST_HAVE",
    "type" : "keyword",
    "start-position" : 293,
    "end-position" : 299,
    "concept-id" : "Hyz1_7HF_AkP",
    "matched-string" : "kontor",
    "annotation-id" : 0
  }, {
    "preferred-label" : "Sverige",
    "type" : "country",
    "start-position" : 328,
    "end-position" : 335,
    "concept-id" : "i46j_HmG_v64",
    "matched-string" : "Sverige",
    "annotation-id" : 3
  }, {
    "preferred-label" : "Tapetsering, möbler",
    "type" : "skill",
    "start-position" : 534,
    "end-position" : 550,
    "concept-id" : "ASht_i6X_E6T",
    "matched-string" : "möbeltapetserare",
    "annotation-id" : 2
  }, {
    "preferred-label" : "Sverige",
    "type" : "country",
    "start-position" : 782,
    "end-position" : 798,
    "concept-id" : "i46j_HmG_v64",
    "matched-string" : "möbeltapetsering",
    "annotation-id" : 4
  }, {
    "preferred-label" : "noggrannhet",
    "type" : "esco-skill",
    "start-position" : 947,
    "end-position" : 958,
    "concept-id" : "mrsW_EkL_KRD",
    "matched-string" : "noggrannhet",
    "annotation-id" : 5
  }, {
    "preferred-label" : "arbeta självständigt",
    "type" : "esco-skill",
    "start-position" : 1170,
    "end-position" : 1190,
    "concept-id" : "NyFu_HHd_zhz",
    "matched-string" : "arbeta självständigt",
    "annotation-id" : 6
  } ],
  "text" : "Möbeltapetserare\n*\nFör oss på Montico är det viktigt att vi som arbetsgivare ser till att du trivs och känner att du har möjligheter att utvecklas. Vi strävar efter att skapa en vi-känsla där du ska känna dig som en i gänget.\n\nMontico har funnits sedan 1996 och har hunnit växa och starta upp kontor på 24 orter runt om i södra Sverige. Vi finns bland annat i Markaryd där du förväntas att arbeta detta innebär också att du som anställd alltid har en närhet till din arbetsgivare och ansvarig konsultchef.\n\nOm tjänsten\nVi söker nu en möbeltapetserare till en av våra kunder i Markaryd. Företaget är ledande inom möbelbranschen och ser på framtiden med tillförsikt. \nArbetstiden är förlagd på dagtid, måndag-fredag.\n\nVi söker dig som\nVi söker dig som har en utbildning i grunden mot möbeltapetsering eller har en likvärdig yrkeserfarenhet.\nDu är en hantverkare som gillar att arbeta med olika typer av material och fokuserar alltid på kvalitet och noggrannhet i varje steg. Vidare är du bekant med olika typer av material och är van vid att hantera olika modeller.\nVi ser att du som person är initiativtagande, tillmötesgående och gillar att arbeta i team likväl som att arbeta självständigt."
}