{
  "meta" : {
    "jobad" : {
      "description" : {
        "requirements" : null,
        "needs" : null,
        "company_information" : null,
        "text_formatted" : "<p>Vi söker tim och extra servispersonal till vår restaurang i midsommarkransen!</p><p>Vi söker dig som är service minded och alltid har ett leende på läpparna.</p><p><br></p><p>Eftersom att du kommer att ansvara för servicen, kunderna och vara vårt ansikte utåt är behöver vi någon som har erfarenhet av att arbeta i italiensk resturang. Uppgifter som att ta emot kunder, servera, kassa, disk och städ hör till vardagen.</p><p><br></p><p>Du klarar av att arbeta med andra men även självständigt.</p><p><br></p><p>Vi vill att du har hög arbetsmoral, är flexibel med tider, att du kan jobba kvällar och helger och självklart att du tar ditt jobb på fullaste allvar.</p>",
        "conditions" : null,
        "text" : "Vi söker tim och extra servispersonal till vår restaurang i midsommarkransen!\nVi söker dig som är service minded och alltid har ett leende på läpparna.\n\n\nEftersom att du kommer att ansvara för servicen, kunderna och vara vårt ansikte utåt är behöver vi någon som har erfarenhet av att arbeta i italiensk resturang. Uppgifter som att ta emot kunder, servera, kassa, disk och städ hör till vardagen.\n\n\nDu klarar av att arbeta med andra men även självständigt.\n\n\nVi vill att du har hög arbetsmoral, är flexibel med tider, att du kan jobba kvällar och helger och självklart att du tar ditt jobb på fullaste allvar."
      },
      "headline" : "Glad servispersonal söks till en trevlig italiensk restaurang",
      "driving_license" : null,
      "employer" : {
        "email" : null,
        "phone_number" : null,
        "organization_number" : "5592281249",
        "name" : "Piccola Cabina AB",
        "url" : null,
        "workplace" : "Piccola Cabina AB"
      },
      "removed_date" : null,
      "logo_url" : null,
      "last_publication_date" : "2022-09-17T23:59:59",
      "number_of_vacancies" : 1,
      "occupation" : {
        "concept_id" : "rGGf_KLs_To7",
        "label" : "Servitör/Servitris",
        "legacy_ams_taxonomy_id" : "5487"
      },
      "occupation_group" : {
        "concept_id" : "UjoW_meY_Zwt",
        "label" : "Hovmästare och servitörer",
        "legacy_ams_taxonomy_id" : "5131"
      },
      "employment_type" : {
        "concept_id" : "1paU_aCR_nGn",
        "label" : "Behovsanställning",
        "legacy_ams_taxonomy_id" : "4"
      },
      "webpage_url" : "https://arbetsformedlingen.se/platsbanken/annonser/26428409",
      "driving_license_required" : false,
      "application_contacts" : [ ],
      "duration" : {
        "concept_id" : null,
        "label" : null,
        "legacy_ams_taxonomy_id" : null
      },
      "nice_to_have" : {
        "education_level" : [ ],
        "work_experiences" : [ {
          "concept_id" : "rGGf_KLs_To7",
          "weight" : 5,
          "label" : "Servitör/Servitris",
          "legacy_ams_taxonomy_id" : "5487"
        } ],
        "skills" : [ ],
        "education" : [ ],
        "languages" : [ ]
      },
      "application_details" : {
        "via_af" : false,
        "email" : "sami6208@gmail.com",
        "other" : null,
        "reference" : null,
        "url" : null,
        "information" : null
      },
      "source_type" : "VIA_ANNONSERA",
      "application_deadline" : "2022-09-17T23:59:59",
      "external_id" : null,
      "workplace_address" : {
        "coordinates" : [ 18.014746932440044, 59.30225456147849 ],
        "city" : "Hägersten",
        "postcode" : "12632",
        "municipality" : "Stockholm",
        "region_concept_id" : "CifL_Rzy_Mku",
        "region" : "Stockholms län",
        "country_code" : "199",
        "region_code" : "01",
        "municipality_concept_id" : "AvNB_uwa_6n6",
        "country_concept_id" : "i46j_HmG_v64",
        "municipality_code" : "0180",
        "street_address" : "Tegelbruksvägen 4",
        "country" : "Sverige"
      },
      "id" : "26428409",
      "experience_required" : true,
      "working_hours_type" : {
        "concept_id" : null,
        "label" : null,
        "legacy_ams_taxonomy_id" : null
      },
      "access" : null,
      "timestamp" : 1660856330273,
      "must_have" : {
        "education_level" : [ ],
        "work_experiences" : [ ],
        "skills" : [ ],
        "education" : [ ],
        "languages" : [ ]
      },
      "occupation_field" : {
        "concept_id" : "ScKy_FHB_7wT",
        "label" : "Hotell, restaurang, storhushåll",
        "legacy_ams_taxonomy_id" : "7"
      },
      "scope_of_work" : {
        "min" : 0,
        "max" : null
      },
      "salary_type" : {
        "concept_id" : "oG8G_9cW_nRf",
        "label" : "Fast månads- vecko- eller timlön",
        "legacy_ams_taxonomy_id" : "1"
      },
      "removed" : false,
      "salary_description" : null,
      "access_to_own_car" : false,
      "publication_date" : "2022-08-18T22:58:50"
    },
    "name" : "Glad servispersonal söks till en trevlig italiensk restaurang",
    "user" : "hannes"
  },
  "sha1" : "1f8add72c5761bdfc6d80fedb655f0f05a77a051",
  "annotations" : [ {
    "preferred-label" : "Servitör/Servitris",
    "sentiment" : "MUST_HAVE",
    "type" : "occupation-name",
    "start-position" : 5,
    "end-position" : 19,
    "concept-id" : "rGGf_KLs_To7",
    "matched-string" : "servispersonal",
    "annotation-id" : 3
  }, {
    "preferred-label" : "Italienskt kök",
    "sentiment" : "NOT_RELEVANT",
    "type" : "skill",
    "start-position" : 41,
    "end-position" : 50,
    "concept-id" : "T38R_QfY_piB",
    "matched-string" : "italiensk",
    "annotation-id" : 2
  }, {
    "preferred-label" : "Restaurang",
    "sentiment" : "NOT_RELEVANT",
    "type" : "keyword",
    "start-position" : 51,
    "end-position" : 61,
    "concept-id" : "o2Cg_3Ap_qvK",
    "matched-string" : "restaurang",
    "annotation-id" : 0
  }, {
    "preferred-label" : "Timanställning",
    "sentiment" : "OFFERED",
    "type" : "keyword",
    "start-position" : 71,
    "end-position" : 74,
    "concept-id" : "kfXw_Vmt_Zzk",
    "matched-string" : "tim",
    "annotation-id" : 5
  }, {
    "preferred-label" : "Servitör/Servitris",
    "sentiment" : "NOT_RELEVANT",
    "type" : "occupation-name",
    "start-position" : 85,
    "end-position" : 99,
    "concept-id" : "rGGf_KLs_To7",
    "matched-string" : "servispersonal",
    "annotation-id" : 4
  }, {
    "preferred-label" : "Restaurang",
    "sentiment" : "NOT_RELEVANT",
    "type" : "keyword",
    "start-position" : 109,
    "end-position" : 119,
    "concept-id" : "o2Cg_3Ap_qvK",
    "matched-string" : "restaurang",
    "annotation-id" : 1
  }, {
    "preferred-label" : "Italienskt kök",
    "sentiment" : "NOT_RELEVANT",
    "type" : "skill",
    "start-position" : 356,
    "end-position" : 365,
    "concept-id" : "T38R_QfY_piB",
    "matched-string" : "italiensk",
    "annotation-id" : 6
  }, {
    "preferred-label" : "Restaurang",
    "sentiment" : "NOT_RELEVANT",
    "type" : "keyword",
    "start-position" : 366,
    "end-position" : 375,
    "concept-id" : "o2Cg_3Ap_qvK",
    "matched-string" : "resturang",
    "annotation-id" : 7
  }, {
    "preferred-label" : "sköta en kassa",
    "sentiment" : "MUST_HAVE",
    "type" : "esco-skill",
    "start-position" : 420,
    "end-position" : 425,
    "concept-id" : "USNU_LMY_prY",
    "matched-string" : "kassa",
    "annotation-id" : 8
  }, {
    "preferred-label" : "diska",
    "sentiment" : "MUST_HAVE",
    "type" : "esco-skill",
    "start-position" : 427,
    "end-position" : 431,
    "concept-id" : "Hkh7_SuX_4k1",
    "matched-string" : "disk",
    "annotation-id" : 9
  }, {
    "preferred-label" : "Städa",
    "sentiment" : "MUST_HAVE",
    "type" : "keyword",
    "start-position" : 436,
    "end-position" : 440,
    "concept-id" : "r35T_iyj_ueU",
    "matched-string" : "städ",
    "annotation-id" : 10
  }, {
    "preferred-label" : "arbeta självständigt",
    "sentiment" : "MUST_HAVE",
    "type" : "esco-skill",
    "start-position" : 479,
    "end-position" : 485,
    "concept-id" : "NyFu_HHd_zhz",
    "matched-string" : "arbeta",
    "annotation-id" : 12
  }, {
    "preferred-label" : "samarbeta med kolleger",
    "sentiment" : "MUST_HAVE",
    "type" : "esco-skill",
    "start-position" : 486,
    "end-position" : 495,
    "concept-id" : "X15R_797_q62",
    "matched-string" : "med andra",
    "annotation-id" : 13
  }, {
    "preferred-label" : "arbeta självständigt",
    "sentiment" : "MUST_HAVE",
    "type" : "esco-skill",
    "start-position" : 505,
    "end-position" : 518,
    "concept-id" : "NyFu_HHd_zhz",
    "matched-string" : "självständigt",
    "annotation-id" : 11
  } ],
  "text" : "Glad servispersonal söks till en trevlig italiensk restaurang\nVi söker tim och extra servispersonal till vår restaurang i midsommarkransen!\nVi söker dig som är service minded och alltid har ett leende på läpparna.\n\n\nEftersom att du kommer att ansvara för servicen, kunderna och vara vårt ansikte utåt är behöver vi någon som har erfarenhet av att arbeta i italiensk resturang. Uppgifter som att ta emot kunder, servera, kassa, disk och städ hör till vardagen.\n\n\nDu klarar av att arbeta med andra men även självständigt.\n\n\nVi vill att du har hög arbetsmoral, är flexibel med tider, att du kan jobba kvällar och helger och självklart att du tar ditt jobb på fullaste allvar."
}