{
  "meta" : {
    "jobad" : {
      "description" : {
        "requirements" : null,
        "needs" : null,
        "company_information" : null,
        "text_formatted" : "<p>Är du en toppsäljare med känsla för service och personliga möten?</p><p>Vi förväntar oss att du har ett stort modeintresse och erfarenhet av att bemöta alla tänkbara personlighetstyper. Vi vill att du älskar att sälja och ge förstklassig service utöver det vanliga, har humor och nära till skratt samtidigt som du är seriös och ansvarstagande. Att du trivs att jobba i team och även är resultatinriktad, självständig och ansvarstagande. Varje dag möter du massor av kunder som förväntar sig att du skall hälsa, vara glad, lyssna och vara nyfiken, svara på frågor, ge goda råd och service med det lilla extra. Vi ser gärna att du har fyllt 30 år Dina arbetsuppgifter är i huvudsak att ge den bästa servicen till våra kunder, även uppackning/märkning, varu-vård och exponering av kläder ingår i det dagliga arbetet. Vi förväntar oss att du har ett genuint intresse för mode och älskar att se till att våra kunder får en totalupplevelse utöver det vanliga, att du alltid ger det lilla extra. Vår butik har öppet sju dagar/vecka, det innebär en hel del helgarbete i denna tjänst.</p><p>Personlig service är vårt ledord.</p><p>Tillträde: Snarast</p><p>Deltid</p>",
        "conditions" : null,
        "text" : "Är du en toppsäljare med känsla för service och personliga möten?\nVi förväntar oss att du har ett stort modeintresse och erfarenhet av att bemöta alla tänkbara personlighetstyper. Vi vill att du älskar att sälja och ge förstklassig service utöver det vanliga, har humor och nära till skratt samtidigt som du är seriös och ansvarstagande. Att du trivs att jobba i team och även är resultatinriktad, självständig och ansvarstagande. Varje dag möter du massor av kunder som förväntar sig att du skall hälsa, vara glad, lyssna och vara nyfiken, svara på frågor, ge goda råd och service med det lilla extra. Vi ser gärna att du har fyllt 30 år Dina arbetsuppgifter är i huvudsak att ge den bästa servicen till våra kunder, även uppackning/märkning, varu-vård och exponering av kläder ingår i det dagliga arbetet. Vi förväntar oss att du har ett genuint intresse för mode och älskar att se till att våra kunder får en totalupplevelse utöver det vanliga, att du alltid ger det lilla extra. Vår butik har öppet sju dagar/vecka, det innebär en hel del helgarbete i denna tjänst.\nPersonlig service är vårt ledord.\nTillträde: Snarast\nDeltid"
      },
      "headline" : "Säljare till FANNY i Hudiksvall",
      "driving_license" : null,
      "employer" : {
        "email" : null,
        "phone_number" : null,
        "organization_number" : "5592404890",
        "name" : "Claes J'son Mode AB",
        "url" : null,
        "workplace" : "FANNY"
      },
      "removed_date" : null,
      "logo_url" : "https://www.arbetsformedlingen.se/rest/arbetsgivare/rest/af/v3/arbetsplatser/87646017/logotyper/logo.png",
      "last_publication_date" : "2022-08-21T23:59:59",
      "number_of_vacancies" : 1,
      "occupation" : {
        "concept_id" : "ek9W_CmD_y2M",
        "label" : "Butikssäljare, fackhandel",
        "legacy_ams_taxonomy_id" : "5357"
      },
      "occupation_group" : {
        "concept_id" : "YKL2_FCB_1yr",
        "label" : "Butikssäljare, fackhandel",
        "legacy_ams_taxonomy_id" : "5223"
      },
      "employment_type" : {
        "concept_id" : "PFZr_Syz_cUq",
        "label" : "Vanlig anställning",
        "legacy_ams_taxonomy_id" : "1"
      },
      "webpage_url" : "https://arbetsformedlingen.se/platsbanken/annonser/26274008",
      "driving_license_required" : false,
      "application_contacts" : [ {
        "description" : null,
        "email" : "info@fannybutikerna.se",
        "telephone" : null,
        "name" : "Theres Näslund",
        "contact_type" : "Administratör"
      }, {
        "description" : null,
        "email" : null,
        "telephone" : "0650-182 60",
        "name" : "Linda Wallström",
        "contact_type" : "Butikschef"
      } ],
      "duration" : {
        "concept_id" : "a7uU_j21_mkL",
        "label" : "Tills vidare",
        "legacy_ams_taxonomy_id" : "1"
      },
      "nice_to_have" : {
        "education_level" : [ {
          "concept_id" : "3Bof_mmm_XRk",
          "weight" : 5,
          "label" : "Eftergymnasial utbildning kortare än två år",
          "legacy_ams_taxonomy_id" : "5"
        } ],
        "work_experiences" : [ {
          "concept_id" : "ek9W_CmD_y2M",
          "weight" : 5,
          "label" : "Butikssäljare, fackhandel",
          "legacy_ams_taxonomy_id" : "5357"
        } ],
        "skills" : [ ],
        "education" : [ {
          "concept_id" : "CU11_PU7_Yj1",
          "weight" : 5,
          "label" : "Företagsekonomi, handel och administration",
          "legacy_ams_taxonomy_id" : "9"
        } ],
        "languages" : [ {
          "concept_id" : "NVxJ_hLg_TYS",
          "weight" : 5,
          "label" : "Engelska",
          "legacy_ams_taxonomy_id" : "283"
        } ]
      },
      "application_details" : {
        "via_af" : false,
        "email" : "info@fannybutikerna.se",
        "other" : null,
        "reference" : "Säljare till FANNY Hudiksvall",
        "url" : null,
        "information" : null
      },
      "source_type" : "VIA_ANNONSERA",
      "application_deadline" : "2022-08-21T23:59:59",
      "external_id" : null,
      "workplace_address" : {
        "coordinates" : [ 17.104553392731706, 61.730869122874815 ],
        "city" : "HUDIKSVALL",
        "postcode" : "82430",
        "municipality" : "Hudiksvall",
        "region_concept_id" : "zupA_8Nt_xcD",
        "region" : "Gävleborgs län",
        "country_code" : "199",
        "region_code" : "21",
        "municipality_concept_id" : "Utks_mwF_axY",
        "country_concept_id" : "i46j_HmG_v64",
        "municipality_code" : "2184",
        "street_address" : "V.Tullgatan 8",
        "country" : "Sverige"
      },
      "id" : "26274008",
      "experience_required" : true,
      "working_hours_type" : {
        "concept_id" : "947z_JGS_Uk2",
        "label" : "Deltid",
        "legacy_ams_taxonomy_id" : "2"
      },
      "access" : null,
      "timestamp" : 1656512990783,
      "must_have" : {
        "education_level" : [ ],
        "work_experiences" : [ ],
        "skills" : [ ],
        "education" : [ ],
        "languages" : [ {
          "concept_id" : "zSLA_vw2_FXN",
          "weight" : 10,
          "label" : "Svenska",
          "legacy_ams_taxonomy_id" : "502"
        } ]
      },
      "occupation_field" : {
        "concept_id" : "RPTn_bxG_ExZ",
        "label" : "Försäljning, inköp, marknadsföring",
        "legacy_ams_taxonomy_id" : "5"
      },
      "scope_of_work" : {
        "min" : 0,
        "max" : 100
      },
      "salary_type" : {
        "concept_id" : "oG8G_9cW_nRf",
        "label" : "Fast månads- vecko- eller timlön",
        "legacy_ams_taxonomy_id" : "1"
      },
      "removed" : false,
      "salary_description" : null,
      "access_to_own_car" : false,
      "publication_date" : "2022-08-01T00:00:00"
    },
    "name" : "Säljare till FANNY i Hudiksvall",
    "user" : "kristof.fischer"
  },
  "sha1" : "0781649f90d07f9c69b17f2f14b3524469ea448e",
  "annotations" : [ {
    "preferred-label" : "Butikssäljare, fackhandel",
    "sentiment" : "MUST_HAVE",
    "type" : "occupation-name",
    "start-position" : 0,
    "end-position" : 7,
    "concept-id" : "ek9W_CmD_y2M",
    "matched-string" : "säljare",
    "annotation-id" : 0
  }, {
    "preferred-label" : "Hudiksvall",
    "type" : "municipality",
    "start-position" : 21,
    "end-position" : 31,
    "concept-id" : "Utks_mwF_axY",
    "matched-string" : "Hudiksvall",
    "annotation-id" : 5
  }, {
    "preferred-label" : "visa ansvarstagande",
    "sentiment" : "MUST_HAVE",
    "type" : "esco-skill",
    "start-position" : 354,
    "end-position" : 368,
    "concept-id" : "bcRp_hxV_f5G",
    "matched-string" : "ansvarstagande",
    "annotation-id" : 6
  }, {
    "preferred-label" : "arbeta självständigt",
    "sentiment" : "MUST_HAVE",
    "type" : "esco-skill",
    "start-position" : 430,
    "end-position" : 442,
    "concept-id" : "NyFu_HHd_zhz",
    "matched-string" : "självständig",
    "annotation-id" : 7
  }, {
    "preferred-label" : "visa ansvarstagande",
    "sentiment" : "MUST_HAVE",
    "type" : "esco-skill",
    "start-position" : 447,
    "end-position" : 461,
    "concept-id" : "bcRp_hxV_f5G",
    "matched-string" : "ansvarstagande",
    "annotation-id" : 8
  }, {
    "preferred-label" : "Deltid",
    "type" : "worktime-extent",
    "start-position" : 1155,
    "end-position" : 1161,
    "concept-id" : "947z_JGS_Uk2",
    "matched-string" : "Deltid",
    "annotation-id" : 9
  } ],
  "text" : "Säljare till FANNY i Hudiksvall\nÄr du en toppsäljare med känsla för service och personliga möten?\nVi förväntar oss att du har ett stort modeintresse och erfarenhet av att bemöta alla tänkbara personlighetstyper. Vi vill att du älskar att sälja och ge förstklassig service utöver det vanliga, har humor och nära till skratt samtidigt som du är seriös och ansvarstagande. Att du trivs att jobba i team och även är resultatinriktad, självständig och ansvarstagande. Varje dag möter du massor av kunder som förväntar sig att du skall hälsa, vara glad, lyssna och vara nyfiken, svara på frågor, ge goda råd och service med det lilla extra. Vi ser gärna att du har fyllt 30 år Dina arbetsuppgifter är i huvudsak att ge den bästa servicen till våra kunder, även uppackning/märkning, varu-vård och exponering av kläder ingår i det dagliga arbetet. Vi förväntar oss att du har ett genuint intresse för mode och älskar att se till att våra kunder får en totalupplevelse utöver det vanliga, att du alltid ger det lilla extra. Vår butik har öppet sju dagar/vecka, det innebär en hel del helgarbete i denna tjänst.\nPersonlig service är vårt ledord.\nTillträde: Snarast\nDeltid"
}