{
  "meta" : {
    "description" : "",
    "ssyk-level-4" : "7119 - Övriga byggnads- och anläggningsarbetare",
    "name" : "107 Systemuppbyggnad",
    "type" : "aub-modul"
  },
  "sha1" : "ceccbd6c06af2b9da49d6ec4d58543666018bb07",
  "annotations" : [ {
    "preferred-label" : "Ritningsläsning",
    "sentiment" : "NICE_TO_HAVE",
    "type" : "skill",
    "start-position" : 430,
    "end-position" : 531,
    "concept-id" : "aHCV_VsV_LiD",
    "matched-string" : "Enkla systemritningar, ritningssymboler och beteckningar samt hur de används för att beskriva\nsystem.",
    "annotation-id" : 2
  }, {
    "preferred-label" : "Energihushållning",
    "sentiment" : "OFFERED",
    "type" : "skill",
    "start-position" : 739,
    "end-position" : 756,
    "concept-id" : "vAS3_M5r_RUx",
    "matched-string" : "energihushållning",
    "annotation-id" : 0
  }, {
    "preferred-label" : "Hälsa",
    "sentiment" : "OFFERED",
    "type" : "keyword",
    "start-position" : 758,
    "end-position" : 763,
    "concept-id" : "Abys_5p1_Cnq",
    "matched-string" : "hälsa",
    "annotation-id" : 1
  } ],
  "text" : "Modulens beskrivning\n\n\"-Helhetssyn på värme-, sanitets-, ventilations-, kyl- och värmepumpssystems funktioner och\nsamverkan i fastigheter, byggnadsverk och anläggningar.\n-Uppbyggnad och funktion av värme-, sanitets-, ventilations-, kyl- och värmepumpssystem samt\nhur de installeras och sköts.\n-Flödesriktningar, tryck och temperaturer i olika system.\n-Hur apparater och komponenter i system fungerar var för sig och i samverkan.\n-Enkla systemritningar, ritningssymboler och beteckningar samt hur de används för att beskriva\nsystem.\n-Flödesscheman, driftkort och användarmanualer för att utföra driftkontroll på verkliga eller fiktiva\nsystem.\n-Installationsregler, bygglagstiftning och arbetsmiljöregler för att uppfylla samhällets krav på\nenergihushållning, hälsa och säkerhet.\n\n\"\n\nModulens mål:\n\nGe deltagaren kunskap i systemuppbyggnad.\n"
}