{
  "meta" : {
    "dataset-id" : "myh-spreadsheet-2021",
    "type" : "education-desciption",
    "dataset-document-id" : "YH00578",
    "user" : "hannes"
  },
  "sha1" : "cddf2d15c5da31c130e4f097e392862ef291250a",
  "annotations" : [ {
    "preferred-label" : "Account manager",
    "sentiment" : "NOT_RELEVANT",
    "type" : "occupation-name",
    "start-position" : 3,
    "end-position" : 18,
    "concept-id" : "8jrL_5RZ_9Kt",
    "matched-string" : "account manager",
    "annotation-id" : 0
  }, {
    "preferred-label" : "arbeta självständigt inom försäljning",
    "sentiment" : "OFFERED",
    "type" : "esco-skill",
    "start-position" : 506,
    "end-position" : 540,
    "concept-id" : "EEZc_qm2_2j8",
    "matched-string" : "självständigt implementera modernt",
    "annotation-id" : 15
  }, {
    "preferred-label" : "Affärsmannaskap",
    "sentiment" : "OFFERED",
    "type" : "keyword",
    "start-position" : 541,
    "end-position" : 552,
    "concept-id" : "zgV5_X3h_GgS",
    "matched-string" : "affärsmanna",
    "annotation-id" : 13
  }, {
    "preferred-label" : "Ledarskap, organisation och styrning",
    "sentiment" : "OFFERED",
    "type" : "sun-education-field-4",
    "start-position" : 558,
    "end-position" : 567,
    "concept-id" : "AUNw_Uki_1ig",
    "matched-string" : "ledarskap",
    "annotation-id" : 14
  }, {
    "preferred-label" : "arbeta självständigt inom försäljning",
    "sentiment" : "OFFERED",
    "type" : "esco-skill",
    "start-position" : 568,
    "end-position" : 581,
    "concept-id" : "EEZc_qm2_2j8",
    "matched-string" : "i säljarbetet",
    "annotation-id" : 16
  }, {
    "preferred-label" : "arbeta självständigt inom försäljning",
    "sentiment" : "OFFERED",
    "type" : "esco-skill",
    "start-position" : 585,
    "end-position" : 664,
    "concept-id" : "EEZc_qm2_2j8",
    "matched-string" : "självständigt använda strategisk och taktiskt tänkande för att utveckla affärer",
    "annotation-id" : 17
  }, {
    "preferred-label" : "arbeta självständigt inom försäljning",
    "sentiment" : "OFFERED",
    "type" : "esco-skill",
    "start-position" : 668,
    "end-position" : 756,
    "concept-id" : "EEZc_qm2_2j8",
    "matched-string" : "självständigt leda ett kreativt och analytiskt tänkande genom hela försäljningsprocessen",
    "annotation-id" : 18
  }, {
    "preferred-label" : "Säljare",
    "sentiment" : "OFFERED",
    "type" : "keyword",
    "start-position" : 815,
    "end-position" : 822,
    "concept-id" : "rDcj_Tao_TJJ",
    "matched-string" : "säljare",
    "annotation-id" : 1
  }, {
    "preferred-label" : "Account manager",
    "sentiment" : "OFFERED",
    "type" : "occupation-name",
    "start-position" : 824,
    "end-position" : 839,
    "concept-id" : "8jrL_5RZ_9Kt",
    "matched-string" : "account manager",
    "annotation-id" : 2
  }, {
    "preferred-label" : "Företagssäljare",
    "sentiment" : "OFFERED",
    "type" : "ssyk-level-4",
    "start-position" : 841,
    "end-position" : 856,
    "concept-id" : "oXSW_fbY_XrY",
    "matched-string" : "företagssäljare",
    "annotation-id" : 3
  }, {
    "preferred-label" : "B2B-säljare",
    "sentiment" : "OFFERED",
    "type" : "keyword",
    "start-position" : 861,
    "end-position" : 872,
    "concept-id" : "gyej_EdX_JSE",
    "matched-string" : "B2B Säljare",
    "annotation-id" : 19
  }, {
    "preferred-label" : "Account manager",
    "sentiment" : "NOT_RELEVANT",
    "type" : "occupation-name",
    "start-position" : 898,
    "end-position" : 913,
    "concept-id" : "8jrL_5RZ_9Kt",
    "matched-string" : "account manager",
    "annotation-id" : 5
  }, {
    "preferred-label" : "Högskoleutbildning, yrkesinriktad, 2 år",
    "sentiment" : "OFFERED",
    "type" : "sun-education-level-3",
    "start-position" : 920,
    "end-position" : 943,
    "concept-id" : "zdKB_pTL_HMS",
    "matched-string" : "Yrkeshögskoleutbildning",
    "annotation-id" : 20
  }, {
    "preferred-label" : "Heltid",
    "sentiment" : "OFFERED",
    "type" : "worktime-extent",
    "start-position" : 1055,
    "end-position" : 1061,
    "concept-id" : "6YE1_gAC_R2G",
    "matched-string" : "heltid",
    "annotation-id" : 21
  }, {
    "preferred-label" : "Engelska",
    "sentiment" : "MUST_HAVE",
    "type" : "language",
    "start-position" : 1443,
    "end-position" : 1451,
    "concept-id" : "NVxJ_hLg_TYS",
    "matched-string" : "engelska",
    "annotation-id" : 6
  }, {
    "preferred-label" : "Finansiering",
    "sentiment" : "OFFERED",
    "type" : "skill",
    "start-position" : 1518,
    "end-position" : 1530,
    "concept-id" : "cRLv_eAB_8eH",
    "matched-string" : "finansiering",
    "annotation-id" : 7
  }, {
    "preferred-label" : "Affärsjuridik",
    "sentiment" : "OFFERED",
    "type" : "skill",
    "start-position" : 1708,
    "end-position" : 1721,
    "concept-id" : "xSbx_mnD_bdK",
    "matched-string" : "affärsjuridik",
    "annotation-id" : 8
  }, {
    "preferred-label" : "Företagsekonomi",
    "sentiment" : "OFFERED",
    "type" : "skill",
    "start-position" : 1756,
    "end-position" : 1771,
    "concept-id" : "VfP9_2xd_g2h",
    "matched-string" : "företagsekonomi",
    "annotation-id" : 9
  }, {
    "preferred-label" : "Verktyg",
    "sentiment" : "NOT_RELEVANT",
    "type" : "skill",
    "start-position" : 1827,
    "end-position" : 1834,
    "concept-id" : "KG9j_WxP_ym2",
    "matched-string" : "verktyg",
    "annotation-id" : 10
  }, {
    "preferred-label" : "retorik",
    "sentiment" : "OFFERED",
    "type" : "esco-skill",
    "start-position" : 1886,
    "end-position" : 1893,
    "concept-id" : "rNfF_a6W_8Nq",
    "matched-string" : "retorik",
    "annotation-id" : 11
  }, {
    "preferred-label" : "Offentlig upphandling",
    "sentiment" : "OFFERED",
    "type" : "keyword",
    "start-position" : 1957,
    "end-position" : 1978,
    "concept-id" : "cKYr_Y4o_WvV",
    "matched-string" : "offentlig upphandling",
    "annotation-id" : 12
  } ],
  "text" : "En Account Manager ansvarar för att bygga långsiktiga relationer med företagets kunder, nya som befintliga. Du blir ansiktet utåt för företaget. Syftet med utbildningen är att ge en mycket god teoretisk grund, utveckla ett strategiskt och analytiskt tänkande kombinerat med praktisk tillämpning i yrkesrollen. Syftet är även att utveckla en god förmåga att hantera och förstå kundernas verksamhet och befattningshavarnas handlande.    Efter avslutad utbildning ska den studerande ha kompetenser för att  • självständigt implementera modernt affärsmanna- och ledarskap i säljarbetet  • självständigt använda strategisk och taktiskt tänkande för att utveckla affärer  • självständigt leda ett kreativt och analytiskt tänkande genom hela försäljningsprocessen    Exempel på befattningar på kommande yrkesroll kan vara Säljare, Account manager, Företagssäljare och B2B Säljare    Kort om utbildningen  Account Manager är en Yrkeshögskoleutbildning (Yh) som anordnas i samverkan med arbetslivet och på uppdrag av Myndigheten för yrkeshögskolan. Du studerar på heltid under 2 år och får en Yrkeshögskoleexamen. I varje kurs har vi i genomsnitt schemalagda lektioner två dagar i veckan. Övrig tid arbetar du med projekt, gruppuppgifter samt egna studier. Under Lärande i arbete (LIA) följer man arbetsplatsens arbetstider. Föreläsare och lärare som medverkar i utbildningen är personer med anknytning till yrkesområdet. Vissa delkurser ges delvis på engelska.    Omfattning: 80 veckor varav 26 veckor Lärande i arbete (LIA)  Finansiering: Avgiftsfri utbildning som berättigar till studiemedel från CSN  Var? Kammakargatan 5 i Stockholm och via FEIFLEX  Kontakt? Skicka gärna frågor till oss på yh@fei.se    Kurser  Affärsjuridik  Business English  Examensarbete  Företagsekonomi  Försäljning 1 - Försäljningsprocessen  Försäljning 2- Verktyg och kommunikation  Försäljning 3 - Förhandling och retorik  Försäljning 4- Strategisk försäljning,  omvärldsbevakning och offentlig upphandling  Försäljning och marknad  LIA 1  LIA 2  Projektledning    FEIFLEX – läs på FEI var du än befinner dig  Utbildningen erbjuds med FEIFLEX – vårt innovativa system för flexibla studier. Det innebär att du kan gå utbildningen var du än bor eller befinner dig. Med vår FEIFLEX-teknik går det bra att medverka aktivt på lektioner i realtid när du befinner dig online. Vi rekommenderar att du använder ett bra headset och webbkamera.\n"
}