{
  "meta" : {
    "jobad" : {
      "description" : {
        "requirements" : null,
        "needs" : null,
        "company_information" : null,
        "text_formatted" : "<p>Är du en social och stresstålig person som gillar när det är mycket att göra. Du har lätt för att samarbeta och uppskattar ett skinande resultat. Har du tidigare erfarenhet är det meriterande, men framförallt ska du vara serviceminded och ha hög arbetsmoral.</p><p><br></p><p><br></p><p>Stämmer detta in på dig?</p><p><br></p><p>Välkommen med din ansökan snarast!</p><p><br></p><p>berk.bozlak@pitchers.se</p>",
        "conditions" : null,
        "text" : "Är du en social och stresstålig person som gillar när det är mycket att göra. Du har lätt för att samarbeta och uppskattar ett skinande resultat. Har du tidigare erfarenhet är det meriterande, men framförallt ska du vara serviceminded och ha hög arbetsmoral.\n\n\n\n\nStämmer detta in på dig?\n\n\nVälkommen med din ansökan snarast!\n\n\nberk.bozlak@pitchers.se"
      },
      "headline" : "Diskare /Städare Sökes",
      "driving_license" : null,
      "employer" : {
        "email" : null,
        "phone_number" : null,
        "organization_number" : "5591192512",
        "name" : "Davidos Gävle AB",
        "url" : "www.llamice.se",
        "workplace" : "Davidos Gävle AB"
      },
      "removed_date" : null,
      "logo_url" : "https://www.arbetsformedlingen.se/rest/arbetsgivare/rest/af/v3/arbetsplatser/86634597/logotyper/logo.png",
      "last_publication_date" : "2022-08-31T23:59:59",
      "number_of_vacancies" : 1,
      "occupation" : {
        "concept_id" : "pKTY_Kwu_sUw",
        "label" : "Diskare",
        "legacy_ams_taxonomy_id" : "5556"
      },
      "occupation_group" : {
        "concept_id" : "tPox_ie4_X9X",
        "label" : "Restaurang- och köksbiträden m.fl.",
        "legacy_ams_taxonomy_id" : "9412"
      },
      "employment_type" : {
        "concept_id" : "PFZr_Syz_cUq",
        "label" : "Vanlig anställning",
        "legacy_ams_taxonomy_id" : "1"
      },
      "webpage_url" : "https://arbetsformedlingen.se/platsbanken/annonser/26368004",
      "driving_license_required" : false,
      "application_contacts" : [ ],
      "duration" : {
        "concept_id" : "a7uU_j21_mkL",
        "label" : "Tills vidare",
        "legacy_ams_taxonomy_id" : "1"
      },
      "nice_to_have" : {
        "education_level" : [ ],
        "work_experiences" : [ ],
        "skills" : [ ],
        "education" : [ ],
        "languages" : [ ]
      },
      "application_details" : {
        "via_af" : false,
        "email" : "berk.bozlak@pitchers.se",
        "other" : null,
        "reference" : null,
        "url" : null,
        "information" : null
      },
      "source_type" : "VIA_ANNONSERA",
      "application_deadline" : "2022-08-31T23:59:59",
      "external_id" : null,
      "workplace_address" : {
        "coordinates" : [ 17.140699259393003, 60.67732798414674 ],
        "city" : "Gävle",
        "postcode" : "80323",
        "municipality" : "Gävle",
        "region_concept_id" : "zupA_8Nt_xcD",
        "region" : "Gävleborgs län",
        "country_code" : "199",
        "region_code" : "21",
        "municipality_concept_id" : "qk8Y_2b6_82D",
        "country_concept_id" : "i46j_HmG_v64",
        "municipality_code" : "2180",
        "street_address" : "Norra Kungsgatan 17",
        "country" : "Sverige"
      },
      "id" : "26368004",
      "experience_required" : true,
      "working_hours_type" : {
        "concept_id" : "6YE1_gAC_R2G",
        "label" : "Heltid",
        "legacy_ams_taxonomy_id" : "1"
      },
      "access" : null,
      "timestamp" : 1659353955300,
      "must_have" : {
        "education_level" : [ ],
        "work_experiences" : [ ],
        "skills" : [ ],
        "education" : [ ],
        "languages" : [ ]
      },
      "occupation_field" : {
        "concept_id" : "ScKy_FHB_7wT",
        "label" : "Hotell, restaurang, storhushåll",
        "legacy_ams_taxonomy_id" : "7"
      },
      "scope_of_work" : {
        "min" : 0,
        "max" : 100
      },
      "salary_type" : {
        "concept_id" : "oG8G_9cW_nRf",
        "label" : "Fast månads- vecko- eller timlön",
        "legacy_ams_taxonomy_id" : "1"
      },
      "removed" : false,
      "salary_description" : null,
      "access_to_own_car" : false,
      "publication_date" : "2022-08-01T13:39:15"
    },
    "name" : "Diskare /Städare Sökes",
    "user" : "hannes"
  },
  "sha1" : "871f5d07292ceb98cc822ed1c356bf1789caa081",
  "annotations" : [ {
    "preferred-label" : "Diskare",
    "sentiment" : "MUST_HAVE",
    "type" : "occupation-name",
    "start-position" : 0,
    "end-position" : 7,
    "concept-id" : "pKTY_Kwu_sUw",
    "matched-string" : "diskare",
    "annotation-id" : 0
  }, {
    "preferred-label" : "Städare",
    "sentiment" : "MUST_HAVE",
    "type" : "ssyk-level-4",
    "start-position" : 9,
    "end-position" : 16,
    "concept-id" : "Z6TY_xDf_Yup",
    "matched-string" : "städare",
    "annotation-id" : 1
  }, {
    "preferred-label" : "hantera stress",
    "type" : "esco-skill",
    "start-position" : 43,
    "end-position" : 54,
    "concept-id" : "z5Zo_DVb_VEK",
    "matched-string" : "stresstålig",
    "annotation-id" : 2
  } ],
  "text" : "Diskare /Städare Sökes\nÄr du en social och stresstålig person som gillar när det är mycket att göra. Du har lätt för att samarbeta och uppskattar ett skinande resultat. Har du tidigare erfarenhet är det meriterande, men framförallt ska du vara serviceminded och ha hög arbetsmoral.\n\n\n\n\nStämmer detta in på dig?\n\n\nVälkommen med din ansökan snarast!\n\n\nberk.bozlak@pitchers.se"
}