{
  "meta" : {
    "jobad" : {
      "description" : {
        "requirements" : null,
        "needs" : null,
        "company_information" : null,
        "text_formatted" : "Vill du jobba på ett företag där du varje dag bidrar till att ge andra människor ett bra liv och där du erbjuds ett viktigt och spännande jobb? Välkommen till Humana.\n\nOm tjänsten:\nHumana söker nu en personlig assistent till vår kund i Kungälv. Kunden är en kvinna i 70-årsåldern som har en led/muskelsjukdom och en whiplashskada. Hon behöver hjälp med olika sysslor för att vardagen ska fungera.\n\nDu kommer att hjälpa henne i det dagliga livet med arbetsuppgifter som hushållssysslor, hjälp vid förflyttningar samt att fungera som stöd vid övriga dagliga aktiviteter. Vår kund vill gärna komma ut och hitta på saker och andra intressen är sömnad, matlagning, shopping, trädgårdsarbete.\n\nVi söker dig som:\nVi tror att du om söker är en kvinna som delar dessa intressen och har båda fötterna på jorden och hjärtat på rätt ställe. Vidare är du rökfri och inte allergisk mot hundar då fyrbenta vänner ibland kommer på besök. Du är mogen, plikttrogen och ute efter ett långsiktigt samarbete.\n\nHar du erfarenhet av personlig assistans eller annat arbete inom vårdyrket är det ett plus, men avgörande är personkemi med kunden.\n\nKrav:\nKörkort\nEj rädd/allergisk mot hund\nRökfri\n\nVi erbjuder: Ett spännande och varierat arbete med goda anställningsvillkor, som präglas av ett stort engagemang för våra arbetsuppgifter. Varje framgång för våra kunder är en framgång för oss. Vi är aldrig färdiga utan alltid på väg att bli bättre.\n\nArbetstid/Varaktighet: Tjänstens omfattning är ca 60%. Passen är förlagda tre dagar i veckan 9:30-17.30 (måndag onsdag och torsdag). Du arbetar inga helger eller storhelger. Vår kund reser ca 7–8 veckor per år då arbetar man inte. Då sägs avtalet upp och tar vid då kunden är åter ifrån sin resa. Vi söker även dig som vill vara timvikarie och bli inringd då ordinarie assistent är sjuk eller vid planerad ledighet.\n\nLön:Fast timlön enligt överenskommelse. Övriga ersättningar enligt kollektivavtal\n\nTillträde: När vi har hittat rätt kandidat för vår kund. Så vänta inte med din ansökan då tjänsten kan bli tillsatt innan sista ansökningsdag.\n\nEn förutsättning för att påbörja en anställning hos oss på Humana är att du som söker kan uppvisa giltig ID-handling och eventuella dokument som styrker rätten till arbete inom Sverige.\n\nAtt jobba på Humana\nHumana är ett ledande nordiskt omsorgsföretag som erbjuder tjänster inom personlig assistans, individ- och familjeomsorg, äldreomsorg och bostäder med särskild service enligt LSS, Lagen om stöd och service för vissa funktionshindrade. Humana har 16 000 engagerade medarbetare i Sverige, Norge, Danmark och Finland som utför omsorgstjänster till över 9 000 människor.\n\nHos Humana erbjuds du ett meningsfullt jobb med trygga anställningar. Vi har en prestigelös arbetsmiljö där vi uppmuntrar varandra till delaktighet och att sprida glädje på jobbet. Här drivs vi av utveckling och arbetar ständigt för att förbättra kvaliteten i vår verksamhet, där du som medarbetare är en viktig del av detta arbete. Våra värdegrundsord - Engagemang, glädje och ansvar är ledande i vårt dagliga arbete. I rekryteringsprocessen innebär det att vi värdesätter egenskaper som dessa hos dig.\n\nLäs mer om hur det är att jobba som personlig assistent hos oss på Humana HÄR \n\nVad händer nu?\nVi ser gärna att du ansöker snarast då vi går igenom urvalet löpande och kan komma att tillsätta tjänsten innan sista ansökningsdag.\n\nDin ansökan läses av personal på Humana, av kunden och dennes anhöriga. För anställning hos Humana Assistans krävs att du har ett BankID och godkänner att använda ditt BankID i tjänsten. \n\nVill du veta mer om tjänsten eller rekryteringsprocessen är du varmt välkommen att kontakta oss!\n\nVälkommen med din ansökan!",
        "conditions" : "Deltid 40%-60%",
        "text" : "Vill du jobba på ett företag där du varje dag bidrar till att ge andra människor ett bra liv och där du erbjuds ett viktigt och spännande jobb? Välkommen till Humana.\n\nOm tjänsten:\nHumana söker nu en personlig assistent till vår kund i Kungälv. Kunden är en kvinna i 70-årsåldern som har en led/muskelsjukdom och en whiplashskada. Hon behöver hjälp med olika sysslor för att vardagen ska fungera.\n\nDu kommer att hjälpa henne i det dagliga livet med arbetsuppgifter som hushållssysslor, hjälp vid förflyttningar samt att fungera som stöd vid övriga dagliga aktiviteter. Vår kund vill gärna komma ut och hitta på saker och andra intressen är sömnad, matlagning, shopping, trädgårdsarbete.\n\nVi söker dig som:\nVi tror att du om söker är en kvinna som delar dessa intressen och har båda fötterna på jorden och hjärtat på rätt ställe. Vidare är du rökfri och inte allergisk mot hundar då fyrbenta vänner ibland kommer på besök. Du är mogen, plikttrogen och ute efter ett långsiktigt samarbete.\n\nHar du erfarenhet av personlig assistans eller annat arbete inom vårdyrket är det ett plus, men avgörande är personkemi med kunden.\n\nKrav:\nKörkort\nEj rädd/allergisk mot hund\nRökfri\n\nVi erbjuder: Ett spännande och varierat arbete med goda anställningsvillkor, som präglas av ett stort engagemang för våra arbetsuppgifter. Varje framgång för våra kunder är en framgång för oss. Vi är aldrig färdiga utan alltid på väg att bli bättre.\n\nArbetstid/Varaktighet: Tjänstens omfattning är ca 60%. Passen är förlagda tre dagar i veckan 9:30-17.30 (måndag onsdag och torsdag). Du arbetar inga helger eller storhelger. Vår kund reser ca 7–8 veckor per år då arbetar man inte. Då sägs avtalet upp och tar vid då kunden är åter ifrån sin resa. Vi söker även dig som vill vara timvikarie och bli inringd då ordinarie assistent är sjuk eller vid planerad ledighet.\n\nLön:Fast timlön enligt överenskommelse. Övriga ersättningar enligt kollektivavtal\n\nTillträde: När vi har hittat rätt kandidat för vår kund. Så vänta inte med din ansökan då tjänsten kan bli tillsatt innan sista ansökningsdag.\n\nEn förutsättning för att påbörja en anställning hos oss på Humana är att du som söker kan uppvisa giltig ID-handling och eventuella dokument som styrker rätten till arbete inom Sverige.\n\nAtt jobba på Humana\nHumana är ett ledande nordiskt omsorgsföretag som erbjuder tjänster inom personlig assistans, individ- och familjeomsorg, äldreomsorg och bostäder med särskild service enligt LSS, Lagen om stöd och service för vissa funktionshindrade. Humana har 16 000 engagerade medarbetare i Sverige, Norge, Danmark och Finland som utför omsorgstjänster till över 9 000 människor.\n\nHos Humana erbjuds du ett meningsfullt jobb med trygga anställningar. Vi har en prestigelös arbetsmiljö där vi uppmuntrar varandra till delaktighet och att sprida glädje på jobbet. Här drivs vi av utveckling och arbetar ständigt för att förbättra kvaliteten i vår verksamhet, där du som medarbetare är en viktig del av detta arbete. Våra värdegrundsord - Engagemang, glädje och ansvar är ledande i vårt dagliga arbete. I rekryteringsprocessen innebär det att vi värdesätter egenskaper som dessa hos dig.\n\nLäs mer om hur det är att jobba som personlig assistent hos oss på Humana HÄR \n\nVad händer nu?\nVi ser gärna att du ansöker snarast då vi går igenom urvalet löpande och kan komma att tillsätta tjänsten innan sista ansökningsdag.\n\nDin ansökan läses av personal på Humana, av kunden och dennes anhöriga. För anställning hos Humana Assistans krävs att du har ett BankID och godkänner att använda ditt BankID i tjänsten. \n\nVill du veta mer om tjänsten eller rekryteringsprocessen är du varmt välkommen att kontakta oss!\n\nVälkommen med din ansökan!"
      },
      "headline" : "Personlig assistent till trädgårdsintresserad kvinna i Kungälv!",
      "driving_license" : [ {
        "concept_id" : "VTK8_WRx_GcM",
        "label" : "B",
        "legacy_ams_taxonomy_id" : "3"
      } ],
      "employer" : {
        "email" : null,
        "phone_number" : null,
        "organization_number" : "5567608475",
        "name" : "Humana AB",
        "url" : null,
        "workplace" : "Humana AB"
      },
      "removed_date" : null,
      "logo_url" : "https://www.arbetsformedlingen.se/rest/arbetsgivare/rest/af/v3/organisation/5567608475/logotyper/logo.png",
      "last_publication_date" : "2022-08-10T23:59:59",
      "number_of_vacancies" : 1,
      "occupation" : {
        "concept_id" : "eU1q_zvL_9Rf",
        "label" : "Personlig assistent",
        "legacy_ams_taxonomy_id" : "5798"
      },
      "occupation_group" : {
        "concept_id" : "sq3e_WVv_Fjd",
        "label" : "Personliga assistenter",
        "legacy_ams_taxonomy_id" : "5343"
      },
      "employment_type" : {
        "concept_id" : "PFZr_Syz_cUq",
        "label" : "Vanlig anställning",
        "legacy_ams_taxonomy_id" : "1"
      },
      "webpage_url" : "https://arbetsformedlingen.se/platsbanken/annonser/26308031",
      "driving_license_required" : true,
      "application_contacts" : [ {
        "description" : null,
        "email" : "louise.klint@humana.se",
        "telephone" : null,
        "name" : "Louise Klint",
        "contact_type" : null
      } ],
      "duration" : {
        "concept_id" : "a7uU_j21_mkL",
        "label" : "Tills vidare",
        "legacy_ams_taxonomy_id" : "1"
      },
      "nice_to_have" : {
        "education_level" : [ ],
        "work_experiences" : [ ],
        "skills" : [ ],
        "education" : [ ],
        "languages" : [ ]
      },
      "application_details" : {
        "via_af" : false,
        "email" : null,
        "other" : null,
        "reference" : "145593",
        "url" : "https://candidate.hr-manager.net/ApplicationInit.aspx?cid=2132&ProjectId=148851&DepartmentId=19013&MediaId=4622&SkipAdvertisement=true",
        "information" : null
      },
      "source_type" : "VIA_PLATSBANKEN_DXA",
      "application_deadline" : "2022-08-10T23:59:59",
      "external_id" : "46-556760-8475-00104554",
      "workplace_address" : {
        "coordinates" : [ 11.974031, 57.869755 ],
        "city" : null,
        "postcode" : null,
        "municipality" : "Kungälv",
        "region_concept_id" : "zdoY_6u5_Krt",
        "region" : "Västra Götalands län",
        "country_code" : "199",
        "region_code" : "14",
        "municipality_concept_id" : "ZkZf_HbK_Mcr",
        "country_concept_id" : "i46j_HmG_v64",
        "municipality_code" : "1482",
        "street_address" : null,
        "country" : "Sverige"
      },
      "id" : "26308031",
      "experience_required" : false,
      "working_hours_type" : {
        "concept_id" : "947z_JGS_Uk2",
        "label" : "Deltid",
        "legacy_ams_taxonomy_id" : "2"
      },
      "access" : null,
      "timestamp" : 1657266969693,
      "must_have" : {
        "education_level" : [ ],
        "work_experiences" : [ ],
        "skills" : [ ],
        "education" : [ ],
        "languages" : [ ]
      },
      "occupation_field" : {
        "concept_id" : "GazW_2TU_kJw",
        "label" : "Yrken med social inriktning",
        "legacy_ams_taxonomy_id" : "16"
      },
      "scope_of_work" : {
        "min" : 40,
        "max" : 60
      },
      "salary_type" : {
        "concept_id" : "oG8G_9cW_nRf",
        "label" : "Fast månads- vecko- eller timlön",
        "legacy_ams_taxonomy_id" : "1"
      },
      "removed" : false,
      "salary_description" : null,
      "access_to_own_car" : false,
      "publication_date" : "2022-07-08T09:56:09"
    },
    "name" : "Personlig assistent till trädgårdsintresserad kvinna i Kungälv!",
    "user" : "hannes"
  },
  "sha1" : "35d0de2127d00f201a8907125760eaf1a4b60865",
  "annotations" : [ {
    "preferred-label" : "personlig assistent",
    "sentiment" : "MUST_HAVE",
    "type" : "esco-occupation",
    "start-position" : 0,
    "end-position" : 19,
    "concept-id" : "qnSi_h1g_ENs",
    "matched-string" : "personlig assistent",
    "annotation-id" : 0
  }, {
    "preferred-label" : "Kungälv",
    "type" : "municipality",
    "start-position" : 55,
    "end-position" : 62,
    "concept-id" : "ZkZf_HbK_Mcr",
    "matched-string" : "Kungälv",
    "annotation-id" : 8
  }, {
    "preferred-label" : "personlig assistent",
    "sentiment" : "MUST_HAVE",
    "type" : "esco-occupation",
    "start-position" : 264,
    "end-position" : 283,
    "concept-id" : "qnSi_h1g_ENs",
    "matched-string" : "personlig assistent",
    "annotation-id" : 1
  }, {
    "preferred-label" : "Kungälv",
    "type" : "municipality",
    "start-position" : 300,
    "end-position" : 307,
    "concept-id" : "ZkZf_HbK_Mcr",
    "matched-string" : "Kungälv",
    "annotation-id" : 9
  }, {
    "preferred-label" : "Sömnad",
    "sentiment" : "MUST_HAVE",
    "type" : "skill",
    "start-position" : 704,
    "end-position" : 710,
    "concept-id" : "2H6W_q67_ygJ",
    "matched-string" : "sömnad",
    "annotation-id" : 2
  }, {
    "preferred-label" : "leda matlagningen",
    "type" : "esco-skill",
    "start-position" : 712,
    "end-position" : 722,
    "concept-id" : "xUVF_gHj_me2",
    "matched-string" : "matlagning",
    "annotation-id" : 10
  }, {
    "preferred-label" : "Trädgårdsanläggare m.fl.",
    "type" : "ssyk-level-4",
    "start-position" : 734,
    "end-position" : 749,
    "concept-id" : "XBh3_Xrm_C4R",
    "matched-string" : "trädgårdsarbete",
    "annotation-id" : 11
  }, {
    "preferred-label" : "Personliga assistenter",
    "type" : "ssyk-level-4",
    "start-position" : 1074,
    "end-position" : 1093,
    "concept-id" : "sq3e_WVv_Fjd",
    "matched-string" : "personlig assistans",
    "annotation-id" : 12
  }, {
    "preferred-label" : "B",
    "type" : "driving-licence",
    "start-position" : 1192,
    "end-position" : 1199,
    "concept-id" : "VTK8_WRx_GcM",
    "matched-string" : "Körkort",
    "annotation-id" : 13
  }, {
    "preferred-label" : "Hund",
    "sentiment" : "MUST_HAVE",
    "type" : "keyword",
    "start-position" : 1222,
    "end-position" : 1226,
    "concept-id" : "YVnr_qQp_tH2",
    "matched-string" : "hund",
    "annotation-id" : 3
  }, {
    "preferred-label" : "Deltid",
    "type" : "worktime-extent",
    "start-position" : 1536,
    "end-position" : 1539,
    "concept-id" : "947z_JGS_Uk2",
    "matched-string" : "60%",
    "annotation-id" : 14
  }, {
    "preferred-label" : "Timanställning",
    "type" : "keyword",
    "start-position" : 1815,
    "end-position" : 1825,
    "concept-id" : "kfXw_Vmt_Zzk",
    "matched-string" : "timvikarie",
    "annotation-id" : 15
  }, {
    "preferred-label" : "Fast månads- vecko- eller timlön",
    "type" : "wage-type",
    "start-position" : 1907,
    "end-position" : 1918,
    "concept-id" : "oG8G_9cW_nRf",
    "matched-string" : "Fast timlön",
    "annotation-id" : 16
  }, {
    "preferred-label" : "Kollektivavtal",
    "sentiment" : "MUST_HAVE",
    "type" : "skill",
    "start-position" : 1970,
    "end-position" : 1984,
    "concept-id" : "z7wE_9xb_3jX",
    "matched-string" : "kollektivavtal",
    "annotation-id" : 4
  }, {
    "preferred-label" : "Sverige",
    "type" : "country",
    "start-position" : 2307,
    "end-position" : 2314,
    "concept-id" : "i46j_HmG_v64",
    "matched-string" : "Sverige",
    "annotation-id" : 17
  }, {
    "preferred-label" : "Personlig assistent",
    "type" : "occupation-name",
    "start-position" : 2410,
    "end-position" : 2429,
    "concept-id" : "eU1q_zvL_9Rf",
    "matched-string" : "personlig assistans",
    "annotation-id" : 18
  }, {
    "preferred-label" : "Äldreomsorg",
    "type" : "skill",
    "start-position" : 2459,
    "end-position" : 2470,
    "concept-id" : "Yt2Z_1pY_MNz",
    "matched-string" : "äldreomsorg",
    "annotation-id" : 19
  }, {
    "preferred-label" : "Sverige",
    "type" : "country",
    "start-position" : 2615,
    "end-position" : 2622,
    "concept-id" : "i46j_HmG_v64",
    "matched-string" : "Sverige",
    "annotation-id" : 20
  }, {
    "preferred-label" : "Norge",
    "type" : "country",
    "start-position" : 2624,
    "end-position" : 2629,
    "concept-id" : "QJgN_Zge_BzJ",
    "matched-string" : "Norge",
    "annotation-id" : 21
  }, {
    "preferred-label" : "Danmark",
    "type" : "country",
    "start-position" : 2631,
    "end-position" : 2638,
    "concept-id" : "Co3h_1xq_Cwb",
    "matched-string" : "Danmark",
    "annotation-id" : 22
  }, {
    "preferred-label" : "Finland",
    "type" : "country",
    "start-position" : 2643,
    "end-position" : 2650,
    "concept-id" : "WgbG_whJ_E7J",
    "matched-string" : "Finland",
    "annotation-id" : 23
  }, {
    "preferred-label" : "arbetsmiljö",
    "sentiment" : "MUST_HAVE",
    "type" : "esco-skill",
    "start-position" : 2797,
    "end-position" : 2808,
    "concept-id" : "zdQY_QJh_nUH",
    "matched-string" : "arbetsmiljö",
    "annotation-id" : 5
  }, {
    "preferred-label" : "personlig assistent",
    "sentiment" : "MUST_HAVE",
    "type" : "esco-occupation",
    "start-position" : 3246,
    "end-position" : 3265,
    "concept-id" : "qnSi_h1g_ENs",
    "matched-string" : "personlig assistent",
    "annotation-id" : 6
  }, {
    "preferred-label" : "Personal",
    "sentiment" : "MUST_HAVE",
    "type" : "keyword",
    "start-position" : 3460,
    "end-position" : 3468,
    "concept-id" : "HVxM_6MS_y1c",
    "matched-string" : "personal",
    "annotation-id" : 7
  } ],
  "text" : "Personlig assistent till trädgårdsintresserad kvinna i Kungälv!\nVill du jobba på ett företag där du varje dag bidrar till att ge andra människor ett bra liv och där du erbjuds ett viktigt och spännande jobb? Välkommen till Humana.\n\nOm tjänsten:\nHumana söker nu en personlig assistent till vår kund i Kungälv. Kunden är en kvinna i 70-årsåldern som har en led/muskelsjukdom och en whiplashskada. Hon behöver hjälp med olika sysslor för att vardagen ska fungera.\n\nDu kommer att hjälpa henne i det dagliga livet med arbetsuppgifter som hushållssysslor, hjälp vid förflyttningar samt att fungera som stöd vid övriga dagliga aktiviteter. Vår kund vill gärna komma ut och hitta på saker och andra intressen är sömnad, matlagning, shopping, trädgårdsarbete.\n\nVi söker dig som:\nVi tror att du om söker är en kvinna som delar dessa intressen och har båda fötterna på jorden och hjärtat på rätt ställe. Vidare är du rökfri och inte allergisk mot hundar då fyrbenta vänner ibland kommer på besök. Du är mogen, plikttrogen och ute efter ett långsiktigt samarbete.\n\nHar du erfarenhet av personlig assistans eller annat arbete inom vårdyrket är det ett plus, men avgörande är personkemi med kunden.\n\nKrav:\nKörkort\nEj rädd/allergisk mot hund\nRökfri\n\nVi erbjuder: Ett spännande och varierat arbete med goda anställningsvillkor, som präglas av ett stort engagemang för våra arbetsuppgifter. Varje framgång för våra kunder är en framgång för oss. Vi är aldrig färdiga utan alltid på väg att bli bättre.\n\nArbetstid/Varaktighet: Tjänstens omfattning är ca 60%. Passen är förlagda tre dagar i veckan 9:30-17.30 (måndag onsdag och torsdag). Du arbetar inga helger eller storhelger. Vår kund reser ca 7–8 veckor per år då arbetar man inte. Då sägs avtalet upp och tar vid då kunden är åter ifrån sin resa. Vi söker även dig som vill vara timvikarie och bli inringd då ordinarie assistent är sjuk eller vid planerad ledighet.\n\nLön:Fast timlön enligt överenskommelse. Övriga ersättningar enligt kollektivavtal\n\nTillträde: När vi har hittat rätt kandidat för vår kund. Så vänta inte med din ansökan då tjänsten kan bli tillsatt innan sista ansökningsdag.\n\nEn förutsättning för att påbörja en anställning hos oss på Humana är att du som söker kan uppvisa giltig ID-handling och eventuella dokument som styrker rätten till arbete inom Sverige.\n\nAtt jobba på Humana\nHumana är ett ledande nordiskt omsorgsföretag som erbjuder tjänster inom personlig assistans, individ- och familjeomsorg, äldreomsorg och bostäder med särskild service enligt LSS, Lagen om stöd och service för vissa funktionshindrade. Humana har 16 000 engagerade medarbetare i Sverige, Norge, Danmark och Finland som utför omsorgstjänster till över 9 000 människor.\n\nHos Humana erbjuds du ett meningsfullt jobb med trygga anställningar. Vi har en prestigelös arbetsmiljö där vi uppmuntrar varandra till delaktighet och att sprida glädje på jobbet. Här drivs vi av utveckling och arbetar ständigt för att förbättra kvaliteten i vår verksamhet, där du som medarbetare är en viktig del av detta arbete. Våra värdegrundsord - Engagemang, glädje och ansvar är ledande i vårt dagliga arbete. I rekryteringsprocessen innebär det att vi värdesätter egenskaper som dessa hos dig.\n\nLäs mer om hur det är att jobba som personlig assistent hos oss på Humana HÄR \n\nVad händer nu?\nVi ser gärna att du ansöker snarast då vi går igenom urvalet löpande och kan komma att tillsätta tjänsten innan sista ansökningsdag.\n\nDin ansökan läses av personal på Humana, av kunden och dennes anhöriga. För anställning hos Humana Assistans krävs att du har ett BankID och godkänner att använda ditt BankID i tjänsten. \n\nVill du veta mer om tjänsten eller rekryteringsprocessen är du varmt välkommen att kontakta oss!\n\nVälkommen med din ansökan!"
}