{
  "meta" : {
    "dataset-id" : "myh-spreadsheet-2021",
    "type" : "education-description",
    "dataset-document-id" : "YH01451",
    "user" : "kristof.fischer"
  },
  "sha1" : "26be9704347ee934d284fae62b75ee367ad0479b",
  "annotations" : [ {
    "preferred-label" : "3D-printingspecialist",
    "sentiment" : "OFFERED",
    "type" : "occupation-name",
    "start-position" : 155,
    "end-position" : 176,
    "concept-id" : "kHsW_KVe_dT4",
    "matched-string" : "3d-printingspecialist",
    "annotation-id" : 0
  }, {
    "preferred-label" : "Konstruktör, tillverkningsindustri",
    "sentiment" : "OFFERED",
    "type" : "occupation-name",
    "start-position" : 618,
    "end-position" : 629,
    "concept-id" : "44U4_7Fz_GCy",
    "matched-string" : "konstruktör",
    "annotation-id" : 18
  }, {
    "preferred-label" : "Designer",
    "sentiment" : "OFFERED",
    "type" : "occupation-name",
    "start-position" : 631,
    "end-position" : 639,
    "concept-id" : "42SW_cUg_uq2",
    "matched-string" : "designer",
    "annotation-id" : 6
  }, {
    "preferred-label" : null,
    "sentiment" : "OFFERED",
    "type" : "occupation-name",
    "start-position" : 641,
    "comment" : "inget passande koncept",
    "end-position" : 651,
    "concept-id" : null,
    "matched-string" : "utvecklare",
    "annotation-id" : 19
  }, {
    "preferred-label" : null,
    "sentiment" : "OFFERED",
    "type" : "occupation-name",
    "start-position" : 653,
    "end-position" : 661,
    "concept-id" : null,
    "matched-string" : "beredare",
    "annotation-id" : 20
  }, {
    "preferred-label" : "Övriga ingenjörer och tekniker",
    "sentiment" : "OFFERED",
    "type" : "ssyk-level-4",
    "start-position" : 663,
    "end-position" : 671,
    "concept-id" : "mis4_feV_uex",
    "matched-string" : "tekniker",
    "annotation-id" : 21
  }, {
    "preferred-label" : null,
    "sentiment" : "OFFERED",
    "type" : "occupation-name",
    "start-position" : 673,
    "end-position" : 681,
    "concept-id" : null,
    "matched-string" : "operatör",
    "annotation-id" : 22
  }, {
    "preferred-label" : null,
    "sentiment" : "OFFERED",
    "type" : "occupation-name",
    "start-position" : 688,
    "end-position" : 697,
    "concept-id" : null,
    "matched-string" : "mekaniker",
    "annotation-id" : 23
  }, {
    "preferred-label" : "3D-printning",
    "sentiment" : "OFFERED",
    "type" : "skill",
    "start-position" : 724,
    "end-position" : 746,
    "concept-id" : "XCdg_UJK_w2q",
    "matched-string" : "additiv   tillverkning",
    "annotation-id" : 24
  }, {
    "preferred-label" : null,
    "sentiment" : "OFFERED",
    "type" : "skill",
    "start-position" : 760,
    "end-position" : 780,
    "concept-id" : null,
    "matched-string" : "digital tillverkning",
    "annotation-id" : 25
  }, {
    "preferred-label" : "3D-printning",
    "sentiment" : "OFFERED",
    "type" : "skill",
    "start-position" : 791,
    "end-position" : 802,
    "concept-id" : "XCdg_UJK_w2q",
    "matched-string" : "3D-printing",
    "annotation-id" : 26
  }, {
    "preferred-label" : "3D-modellering",
    "sentiment" : "OFFERED",
    "type" : "skill",
    "start-position" : 807,
    "end-position" : 821,
    "concept-id" : "yQcc_fTn_JL5",
    "matched-string" : "3d-modellering",
    "annotation-id" : 9
  }, {
    "preferred-label" : "Eslöv",
    "sentiment" : "NOT_RELEVANT",
    "type" : "municipality",
    "start-position" : 1032,
    "end-position" : 1037,
    "concept-id" : "gfCw_egj_1M4",
    "matched-string" : "Eslöv",
    "annotation-id" : 27
  }, {
    "preferred-label" : "3D-printingspecialist",
    "sentiment" : "OFFERED",
    "type" : "occupation-name",
    "start-position" : 1049,
    "end-position" : 1072,
    "concept-id" : "kHsW_KVe_dT4",
    "matched-string" : "3D-printingspecialister",
    "annotation-id" : 28
  }, {
    "preferred-label" : "3D-printning",
    "sentiment" : "OFFERED",
    "type" : "skill",
    "start-position" : 1583,
    "end-position" : 1594,
    "concept-id" : "XCdg_UJK_w2q",
    "matched-string" : "3D-printing",
    "annotation-id" : 29
  }, {
    "preferred-label" : "Scanning",
    "sentiment" : "OFFERED",
    "type" : "skill",
    "start-position" : 1641,
    "end-position" : 1652,
    "concept-id" : "6s37_N7Y_UuC",
    "matched-string" : "3D-scanning",
    "annotation-id" : 30
  }, {
    "preferred-label" : "Beredning, verkstadsmaskiner",
    "sentiment" : "OFFERED",
    "type" : "skill",
    "start-position" : 1696,
    "end-position" : 1756,
    "concept-id" : "J8Sg_Pqv_Dtd",
    "matched-string" : "Beredning, materiallära & tillverkningsmetoder för  3D print",
    "annotation-id" : 31
  }, {
    "preferred-label" : "Digital konstruktion",
    "sentiment" : "OFFERED",
    "type" : "skill",
    "start-position" : 1771,
    "end-position" : 1785,
    "concept-id" : "WHyi_vfU_5Bg",
    "matched-string" : "Digital design",
    "annotation-id" : 32
  }, {
    "preferred-label" : "3D-modellering",
    "sentiment" : "OFFERED",
    "type" : "skill",
    "start-position" : 1787,
    "end-position" : 1801,
    "concept-id" : "yQcc_fTn_JL5",
    "matched-string" : "3d-modellering",
    "annotation-id" : 16
  }, {
    "preferred-label" : "3D-printning",
    "sentiment" : "OFFERED",
    "type" : "skill",
    "start-position" : 1808,
    "end-position" : 1830,
    "concept-id" : "XCdg_UJK_w2q",
    "matched-string" : "mjukvaror för 3D-print",
    "annotation-id" : 33
  }, {
    "preferred-label" : "Utvecklingsarbete",
    "sentiment" : "OFFERED",
    "type" : "skill",
    "start-position" : 1873,
    "end-position" : 1891,
    "concept-id" : "LsGo_Kh2_3kH",
    "matched-string" : "Förbättringsarbete",
    "annotation-id" : 34
  }, {
    "preferred-label" : "Ständiga förbättringar/Lean",
    "sentiment" : "OFFERED",
    "type" : "skill",
    "start-position" : 1893,
    "end-position" : 1897,
    "concept-id" : "74Mw_JUN_VKx",
    "matched-string" : "lean",
    "annotation-id" : 17
  }, {
    "preferred-label" : null,
    "sentiment" : "OFFERED",
    "type" : "skill",
    "start-position" : 1899,
    "end-position" : 1905,
    "concept-id" : null,
    "matched-string" : "Kaizen",
    "annotation-id" : 35
  }, {
    "preferred-label" : null,
    "sentiment" : "OFFERED",
    "type" : "skill",
    "start-position" : 1907,
    "end-position" : 1916,
    "concept-id" : null,
    "matched-string" : "Six Sigma",
    "annotation-id" : 36
  }, {
    "preferred-label" : null,
    "sentiment" : "OFFERED",
    "type" : "skill",
    "start-position" : 1921,
    "end-position" : 1932,
    "concept-id" : null,
    "matched-string" : "Toyota Kata",
    "annotation-id" : 37
  }, {
    "preferred-label" : "Digital konstruktion",
    "sentiment" : "OFFERED",
    "type" : "skill",
    "start-position" : 1947,
    "end-position" : 1959,
    "concept-id" : "WHyi_vfU_5Bg",
    "matched-string" : "Konstruktion",
    "annotation-id" : 38
  }, {
    "preferred-label" : "3D-printning",
    "sentiment" : "OFFERED",
    "type" : "skill",
    "start-position" : 1976,
    "end-position" : 1987,
    "concept-id" : "XCdg_UJK_w2q",
    "matched-string" : "3D-printing",
    "annotation-id" : 39
  }, {
    "preferred-label" : "projektledning",
    "sentiment" : "OFFERED",
    "type" : "esco-skill",
    "start-position" : 2054,
    "end-position" : 2090,
    "concept-id" : "PPNS_ZLX_YsQ",
    "matched-string" : "Projektledning, grupp, kommunikation",
    "annotation-id" : 40
  }, {
    "preferred-label" : "Distansarbete",
    "sentiment" : "OFFERED",
    "type" : "work-place-environment",
    "start-position" : 2212,
    "end-position" : 2219,
    "concept-id" : "uwzb_xcR_vxS",
    "matched-string" : "distans",
    "annotation-id" : 41
  }, {
    "preferred-label" : "Deltid",
    "sentiment" : "OFFERED",
    "type" : "worktime-extent",
    "start-position" : 2224,
    "end-position" : 2238,
    "concept-id" : "947z_JGS_Uk2",
    "matched-string" : "75% studietakt",
    "annotation-id" : 42
  }, {
    "preferred-label" : "Eslöv",
    "sentiment" : "NOT_RELEVANT",
    "type" : "municipality",
    "start-position" : 2316,
    "end-position" : 2321,
    "concept-id" : "gfCw_egj_1M4",
    "matched-string" : "Eslöv",
    "annotation-id" : 43
  } ],
  "text" : "Utbildningens mål  Utbildningen syftar till att ge den studerande de teoretiska och praktiska kunskaper och färdigheter som krävs för att kunna arbeta som 3D-printingspecialist med inriktning mot design, konstruktion och produktion.    Den studerande får en bred utbildning som ger möjligheter att verka i en rad olika branscher som idag använder tekniken, exempelvis inom fordon, flyg, verkstad, plast- och gummi, livsmedel, verktygstillverkning, gjuteridesign, försvaret, medicin, dental, arkitektur, hjälpmedel, kultur och utbildning.    Efter utbildning  Efter genomgången utbildning kan den studerande arbeta som konstruktör, designer, utvecklare, beredare, tekniker, operatör eller mekaniker, med expertkompetens inom additiv   tillverkning med fokus på digital tillverkning, särskilt 3D-printing och 3D-modellering.    Arbetsmarknad  Näringsdepartementet, liksom branschorganisationen Teknikföretagen, bedömer att det riktiga genombrottet för 3D-printing kommer inom de närmaste tre åren och därför utbildar Yrkeshögskolan i Eslöv sedan 2016 3D-printingspecialister på eftergymnasial nivå.    Branschrepresentanterna beskriver ett svenskt näringsliv som står och faller på möjligheten att skapa en mer effektiv produktion och utveckling, i takt med att konkurrensen från   omvärlden blir mer påtaglig.    Idag och på 3-5 års sikt är behovet som allra störst inom följande branscher: fordon, flyg, verkstad, plast och gummi, livsmedel, verktygstillverkning, gjuteridesign, försvaret, medicin, dental, arkitektur, smycken och hjälpmedel, kultur och utbildning.    Kursinnehåll  3D-printing (AT) – ur ett helhetsperspektiv, 10 YH-poäng  3D-scanning, med inriktning  3D-printing, 10 YH-poäng  Beredning, materiallära & tillverkningsmetoder för  3D print, 30 YH-poäng  Digital design, 3D-modellering, samt mjukvaror för 3D-print, 30 YH-poäng  Examensarbete, 15 YH-poäng  Förbättringsarbete: Lean, Kaizen, Six Sigma och Toyota Kata, 10 YH-poäng  Konstruktion, med inriktning 3D-printing, 45 YH-poäng  LIA - ett yrkesanpassat projektarbete, 40 YH-poäng  Projektledning, grupp, kommunikation, 20 YH-poäng    Ändringar i kursplanen kan förekomma    Utbildningens studieform och omfattning  Utbildningen bedrivs på distans med 75% studietakt.   Undervisningen baseras på distansstudier kombinerat med ca fyra träffar i Eslöv per termin."
}