{
  "meta" : {
    "jobad" : {
      "description" : {
        "requirements" : null,
        "needs" : null,
        "company_information" : null,
        "text_formatted" : "<p><strong>Nationskock på heltid till Stockholms nation!</strong></p><p>Har du erfarenhet som kock och är redo för en ny utmaning? Vill du arbeta med ambitiösa studenter i en fartfylld och kreativ miljö? Då är du varmt välkommen att söka till nationskock hos oss på Stockholms nation.</p><p><strong>Om tjänsten</strong></p><p>Stockholms nation grundades år 1649 och är en av de största studentnationerna i Uppsala med över 7000 medlemmar och runt 150 studenter (ämbetsmän) som engagerar sig i verksamheten varje vecka. Vi söker nu en nationskock på heltid med start till 1:a oktober.</p><p>Hos oss arbetar du i en fartfylld miljö och träffar nya människor varje dag. Du arbetar med ambitiösa studenter och har stor kreativ frihet.</p><p><strong>Arbetsuppgifter</strong></p><p>I rollen som nationskock ansvarar du över tillagningen av nationens lunch, torsdagsrestaurang Holmiana samt våra sittningar under helgerna. Detta med hjälp av nationens ämbetsmän och personal. Under vardagarna lagar du maten till nationens lunch och tar hand om inköp samt planerar inför torsdagens restaurang och helgens sittningar. Se nedan för en närmare beskrivning av våra verksamheter.</p><ul><li><strong>Lunch:</strong> Lunchverksamhet mellan måndag - fredag mellan 11.30-13.15. Serveras två rätter och salladsbuffé.</li><li><strong>Restaurang Holmiana</strong>: Nationens restaurangverksamhet under torsdagskvällar åt förbokade sällskap. À la carte meny bestäms i överenskommelse med nationens restaurangchef. Du arbetar tillsammans med nationens hovmästare, servis och övrig personal.</li><li><strong>Uthyrningar och interna evenemang:</strong> Uthyrningar och interna evenemang sker främst kvällstid under helger. Det rör sig om mellan 100-300 gäster per tillfälle minst en gång per helg. Meny sätts enligt överenskommelse med restaurangchef eller tredje kurator (verksamhetschef). Du arbetar tillsammans med nationens hovmästare, uthyrningsansvariga, servis och övrig personal. </li></ul><p><br></p><p><strong>Utöver detta ansvarar du över:</strong></p><ul><li>Förberedelser och planering inför verksamheterna.</li><li>Inköp och inventering för samtliga ovanstående verksamheter.</li><li>Rutiner för livsmedelssäkerhet enligt nationens egenkontrollsprogram.</li></ul><p><br></p><p><strong>Du erbjuds:</strong></p><ul><li>En tillsvidareanställning på heltid.</li><li>Kreativ frihet och varierande arbetsuppgifter.</li><li>En gedigen upplärning av vår tidigare kock.</li><li>Attraktiv lön. </li></ul><p><br></p><p><strong>Vem söker vi?</strong></p><p>Vi söker dig med minst tre års erfarenhet som kock och som är redo att ge dig in i en helt ny typ av restaurangmiljö. Tillsammans med Stockholms nations ämbetsmän arbetar du i en fartfylld miljö och träffar nya människor varje termin. </p><p><strong>Vi söker dig som är: </strong></p><ul><li>Social, prestigelös och har lätt att arbeta med nya människor.</li><li>Stresstålig, tålmodig och flexibel.</li><li>Bekväm med att jobba varierande arbetstider.</li><li>Flytande i svenska (både tal och skrift).</li></ul><p><br></p><p><strong>Det är meriterande om du:</strong> </p><ul><li>Har tidigare erfarenhet inom liknande verksamhet eller storkök.</li><li>Har en utbildning inom restaurang- och hotell.</li><li>Erfarenhet från nationsliv.</li></ul><p><br></p><p>Är du den vi söker?</p><p>Sök genom att skicka in ditt CV till 3q@stockholmsnation.se senast den 4 augusti.</p><p><br></p><p><br></p>",
        "conditions" : null,
        "text" : "Nationskock på heltid till Stockholms nation!\nHar du erfarenhet som kock och är redo för en ny utmaning? Vill du arbeta med ambitiösa studenter i en fartfylld och kreativ miljö? Då är du varmt välkommen att söka till nationskock hos oss på Stockholms nation.\nOm tjänsten\nStockholms nation grundades år 1649 och är en av de största studentnationerna i Uppsala med över 7000 medlemmar och runt 150 studenter (ämbetsmän) som engagerar sig i verksamheten varje vecka. Vi söker nu en nationskock på heltid med start till 1:a oktober.\nHos oss arbetar du i en fartfylld miljö och träffar nya människor varje dag. Du arbetar med ambitiösa studenter och har stor kreativ frihet.\nArbetsuppgifter\nI rollen som nationskock ansvarar du över tillagningen av nationens lunch, torsdagsrestaurang Holmiana samt våra sittningar under helgerna. Detta med hjälp av nationens ämbetsmän och personal. Under vardagarna lagar du maten till nationens lunch och tar hand om inköp samt planerar inför torsdagens restaurang och helgens sittningar. Se nedan för en närmare beskrivning av våra verksamheter.\nLunch: Lunchverksamhet mellan måndag - fredag mellan 11.30-13.15. Serveras två rätter och salladsbuffé.\nRestaurang Holmiana: Nationens restaurangverksamhet under torsdagskvällar åt förbokade sällskap. À la carte meny bestäms i överenskommelse med nationens restaurangchef. Du arbetar tillsammans med nationens hovmästare, servis och övrig personal.\nUthyrningar och interna evenemang: Uthyrningar och interna evenemang sker främst kvällstid under helger. Det rör sig om mellan 100-300 gäster per tillfälle minst en gång per helg. Meny sätts enligt överenskommelse med restaurangchef eller tredje kurator (verksamhetschef). Du arbetar tillsammans med nationens hovmästare, uthyrningsansvariga, servis och övrig personal. \n\n\n\nUtöver detta ansvarar du över:\nFörberedelser och planering inför verksamheterna.\nInköp och inventering för samtliga ovanstående verksamheter.\nRutiner för livsmedelssäkerhet enligt nationens egenkontrollsprogram.\n\n\n\nDu erbjuds:\nEn tillsvidareanställning på heltid.\nKreativ frihet och varierande arbetsuppgifter.\nEn gedigen upplärning av vår tidigare kock.\nAttraktiv lön. \n\n\n\nVem söker vi?\nVi söker dig med minst tre års erfarenhet som kock och som är redo att ge dig in i en helt ny typ av restaurangmiljö. Tillsammans med Stockholms nations ämbetsmän arbetar du i en fartfylld miljö och träffar nya människor varje termin. \nVi söker dig som är: \nSocial, prestigelös och har lätt att arbeta med nya människor.\nStresstålig, tålmodig och flexibel.\nBekväm med att jobba varierande arbetstider.\nFlytande i svenska (både tal och skrift).\n\n\n\nDet är meriterande om du: \nHar tidigare erfarenhet inom liknande verksamhet eller storkök.\nHar en utbildning inom restaurang- och hotell.\nErfarenhet från nationsliv.\n\n\n\nÄr du den vi söker?\nSök genom att skicka in ditt CV till 3q@stockholmsnation.se senast den 4 augusti."
      },
      "headline" : "Nationskock på Stockholms nation",
      "driving_license" : null,
      "employer" : {
        "email" : null,
        "phone_number" : null,
        "organization_number" : "2620000683",
        "name" : "Stockholms Nation",
        "url" : null,
        "workplace" : "Stockholms Nation"
      },
      "removed_date" : null,
      "logo_url" : "https://www.arbetsformedlingen.se/rest/arbetsgivare/rest/af/v3/arbetsplatser/86318116/logotyper/logo.png",
      "last_publication_date" : "2022-08-04T23:59:59",
      "number_of_vacancies" : 1,
      "occupation" : {
        "concept_id" : "Vg3d_Azf_p5Y",
        "label" : "Kock, storhushåll",
        "legacy_ams_taxonomy_id" : "7664"
      },
      "occupation_group" : {
        "concept_id" : "BStc_SJh_DKG",
        "label" : "Kockar och kallskänkor",
        "legacy_ams_taxonomy_id" : "5120"
      },
      "employment_type" : {
        "concept_id" : "PFZr_Syz_cUq",
        "label" : "Vanlig anställning",
        "legacy_ams_taxonomy_id" : "1"
      },
      "webpage_url" : "https://arbetsformedlingen.se/platsbanken/annonser/26291757",
      "driving_license_required" : false,
      "application_contacts" : [ ],
      "duration" : {
        "concept_id" : "a7uU_j21_mkL",
        "label" : "Tills vidare",
        "legacy_ams_taxonomy_id" : "1"
      },
      "nice_to_have" : {
        "education_level" : [ ],
        "work_experiences" : [ ],
        "skills" : [ ],
        "education" : [ ],
        "languages" : [ ]
      },
      "application_details" : {
        "via_af" : false,
        "email" : "3q@stockholmsnation.se",
        "other" : null,
        "reference" : "Kock Stockholms nation",
        "url" : null,
        "information" : null
      },
      "source_type" : "VIA_ANNONSERA",
      "application_deadline" : "2022-08-04T23:59:59",
      "external_id" : null,
      "workplace_address" : {
        "coordinates" : [ 17.63430091920932, 59.856510315226714 ],
        "city" : "Uppsala",
        "postcode" : "75310",
        "municipality" : "Uppsala",
        "region_concept_id" : "zBon_eET_fFU",
        "region" : "Uppsala län",
        "country_code" : "199",
        "region_code" : "03",
        "municipality_concept_id" : "otaF_bQY_4ZD",
        "country_concept_id" : "i46j_HmG_v64",
        "municipality_code" : "0380",
        "street_address" : "Drottninggatan 11",
        "country" : "Sverige"
      },
      "id" : "26291757",
      "experience_required" : true,
      "working_hours_type" : {
        "concept_id" : "6YE1_gAC_R2G",
        "label" : "Heltid",
        "legacy_ams_taxonomy_id" : "1"
      },
      "access" : null,
      "timestamp" : 1657199825283,
      "must_have" : {
        "education_level" : [ ],
        "work_experiences" : [ {
          "concept_id" : "Vg3d_Azf_p5Y",
          "weight" : 10,
          "label" : "Kock, storhushåll",
          "legacy_ams_taxonomy_id" : "7664"
        } ],
        "skills" : [ ],
        "education" : [ ],
        "languages" : [ ]
      },
      "occupation_field" : {
        "concept_id" : "ScKy_FHB_7wT",
        "label" : "Hotell, restaurang, storhushåll",
        "legacy_ams_taxonomy_id" : "7"
      },
      "scope_of_work" : {
        "min" : 0,
        "max" : 100
      },
      "salary_type" : {
        "concept_id" : "asrX_9Df_ukn",
        "label" : "Fast och rörlig lön",
        "legacy_ams_taxonomy_id" : "7"
      },
      "removed" : false,
      "salary_description" : null,
      "access_to_own_car" : false,
      "publication_date" : "2022-07-07T15:17:05"
    },
    "name" : "Nationskock på Stockholms nation",
    "user" : "hannes"
  },
  "sha1" : "aacf9f56b3948755ca8cecaaae7f77d6ae79673c",
  "annotations" : [ {
    "preferred-label" : "Kock",
    "type" : "keyword",
    "start-position" : 7,
    "end-position" : 11,
    "concept-id" : "RTQf_1Qm_YhD",
    "matched-string" : "kock",
    "annotation-id" : 20
  }, {
    "preferred-label" : "Stockholm",
    "type" : "municipality",
    "start-position" : 15,
    "end-position" : 25,
    "concept-id" : "AvNB_uwa_6n6",
    "matched-string" : "Stockholms",
    "annotation-id" : 21
  }, {
    "preferred-label" : "Kock",
    "type" : "keyword",
    "start-position" : 40,
    "end-position" : 44,
    "concept-id" : "RTQf_1Qm_YhD",
    "matched-string" : "kock",
    "annotation-id" : 22
  }, {
    "preferred-label" : "Heltid",
    "type" : "worktime-extent",
    "start-position" : 48,
    "end-position" : 54,
    "concept-id" : "6YE1_gAC_R2G",
    "matched-string" : "heltid",
    "annotation-id" : 23
  }, {
    "preferred-label" : "Stockholm",
    "type" : "municipality",
    "start-position" : 60,
    "end-position" : 70,
    "concept-id" : "AvNB_uwa_6n6",
    "matched-string" : "Stockholms",
    "annotation-id" : 24
  }, {
    "preferred-label" : "kock",
    "sentiment" : "MUST_HAVE",
    "type" : "esco-occupation",
    "start-position" : 101,
    "end-position" : 105,
    "concept-id" : "Ti2H_QoQ_EMX",
    "matched-string" : "kock",
    "annotation-id" : 0
  }, {
    "preferred-label" : "Kock",
    "type" : "keyword",
    "start-position" : 257,
    "end-position" : 261,
    "concept-id" : "RTQf_1Qm_YhD",
    "matched-string" : "kock",
    "annotation-id" : 25
  }, {
    "preferred-label" : "Stockholm",
    "type" : "municipality",
    "start-position" : 273,
    "end-position" : 283,
    "concept-id" : "AvNB_uwa_6n6",
    "matched-string" : "Stockholms",
    "annotation-id" : 26
  }, {
    "preferred-label" : "Stockholm",
    "type" : "municipality",
    "start-position" : 304,
    "end-position" : 314,
    "concept-id" : "AvNB_uwa_6n6",
    "matched-string" : "Stockholms",
    "annotation-id" : 27
  }, {
    "preferred-label" : "Uppsala",
    "type" : "municipality",
    "start-position" : 384,
    "end-position" : 391,
    "concept-id" : "otaF_bQY_4ZD",
    "matched-string" : "Uppsala",
    "annotation-id" : 28
  }, {
    "preferred-label" : "Kock",
    "type" : "keyword",
    "start-position" : 512,
    "end-position" : 523,
    "concept-id" : "RTQf_1Qm_YhD",
    "matched-string" : "nationskock",
    "annotation-id" : 29
  }, {
    "preferred-label" : "Heltid",
    "type" : "worktime-extent",
    "start-position" : 527,
    "end-position" : 533,
    "concept-id" : "6YE1_gAC_R2G",
    "matched-string" : "heltid",
    "annotation-id" : 30
  }, {
    "preferred-label" : "Kock",
    "type" : "keyword",
    "start-position" : 732,
    "end-position" : 743,
    "concept-id" : "RTQf_1Qm_YhD",
    "matched-string" : "nationskock",
    "annotation-id" : 31
  }, {
    "preferred-label" : "Lunchansvarig",
    "type" : "keyword",
    "start-position" : 744,
    "end-position" : 752,
    "concept-id" : "3jyy_qYX_MCM",
    "matched-string" : "ansvarar",
    "annotation-id" : 33
  }, {
    "preferred-label" : "Lunchansvarig",
    "type" : "keyword",
    "start-position" : 787,
    "end-position" : 792,
    "concept-id" : "3jyy_qYX_MCM",
    "matched-string" : "lunch",
    "annotation-id" : 32
  }, {
    "preferred-label" : "Personal",
    "sentiment" : "MUST_HAVE",
    "type" : "keyword",
    "start-position" : 902,
    "end-position" : 910,
    "concept-id" : "HVxM_6MS_y1c",
    "matched-string" : "personal",
    "annotation-id" : 1
  }, {
    "preferred-label" : "Restaurang",
    "sentiment" : "MUST_HAVE",
    "type" : "keyword",
    "start-position" : 1018,
    "end-position" : 1028,
    "concept-id" : "o2Cg_3Ap_qvK",
    "matched-string" : "restaurang",
    "annotation-id" : 2
  }, {
    "preferred-label" : "Restaurang",
    "sentiment" : "MUST_HAVE",
    "type" : "keyword",
    "start-position" : 1215,
    "end-position" : 1225,
    "concept-id" : "o2Cg_3Ap_qvK",
    "matched-string" : "restaurang",
    "annotation-id" : 3
  }, {
    "preferred-label" : "Restaurangverksamhet",
    "sentiment" : "MUST_HAVE",
    "type" : "sni-level-4",
    "start-position" : 1246,
    "end-position" : 1266,
    "concept-id" : "byvM_cVn_X7Q",
    "matched-string" : "restaurangverksamhet",
    "annotation-id" : 4
  }, {
    "preferred-label" : "Restaurangchef",
    "sentiment" : "MUST_HAVE",
    "type" : "occupation-name",
    "start-position" : 1368,
    "end-position" : 1382,
    "concept-id" : "XSBp_5wD_VaU",
    "matched-string" : "restaurangchef",
    "annotation-id" : 5
  }, {
    "preferred-label" : "Hovmästare",
    "sentiment" : "MUST_HAVE",
    "type" : "occupation-name",
    "start-position" : 1421,
    "end-position" : 1431,
    "concept-id" : "4ZeS_9Z9_wmL",
    "matched-string" : "hovmästare",
    "annotation-id" : 6
  }, {
    "preferred-label" : "Servis",
    "sentiment" : "MUST_HAVE",
    "type" : "keyword",
    "start-position" : 1433,
    "end-position" : 1439,
    "concept-id" : "7coY_HT4_rJc",
    "matched-string" : "servis",
    "annotation-id" : 7
  }, {
    "preferred-label" : "Personal",
    "sentiment" : "MUST_HAVE",
    "type" : "keyword",
    "start-position" : 1450,
    "end-position" : 1458,
    "concept-id" : "HVxM_6MS_y1c",
    "matched-string" : "personal",
    "annotation-id" : 8
  }, {
    "preferred-label" : "Restaurangchef",
    "sentiment" : "MUST_HAVE",
    "type" : "occupation-name",
    "start-position" : 1678,
    "end-position" : 1692,
    "concept-id" : "XSBp_5wD_VaU",
    "matched-string" : "restaurangchef",
    "annotation-id" : 9
  }, {
    "preferred-label" : "Kurator",
    "sentiment" : "MUST_HAVE",
    "type" : "occupation-name",
    "start-position" : 1706,
    "end-position" : 1713,
    "concept-id" : "YpRs_ybt_47a",
    "matched-string" : "kurator",
    "annotation-id" : 10
  }, {
    "preferred-label" : "Hovmästare",
    "sentiment" : "MUST_HAVE",
    "type" : "occupation-name",
    "start-position" : 1770,
    "end-position" : 1780,
    "concept-id" : "4ZeS_9Z9_wmL",
    "matched-string" : "hovmästare",
    "annotation-id" : 11
  }, {
    "preferred-label" : "Uthyrningsansvarig",
    "type" : "keyword",
    "start-position" : 1782,
    "end-position" : 1801,
    "concept-id" : "bosc_gu5_1PK",
    "matched-string" : "uthyrningsansvariga",
    "annotation-id" : 34
  }, {
    "preferred-label" : "Servis",
    "sentiment" : "MUST_HAVE",
    "type" : "keyword",
    "start-position" : 1803,
    "end-position" : 1809,
    "concept-id" : "7coY_HT4_rJc",
    "matched-string" : "servis",
    "annotation-id" : 12
  }, {
    "preferred-label" : "Personal",
    "sentiment" : "MUST_HAVE",
    "type" : "keyword",
    "start-position" : 1820,
    "end-position" : 1828,
    "concept-id" : "HVxM_6MS_y1c",
    "matched-string" : "personal",
    "annotation-id" : 13
  }, {
    "preferred-label" : "Tillsvidareanställning (inkl. eventuell provanställning)",
    "type" : "employment-type",
    "start-position" : 2064,
    "end-position" : 2086,
    "concept-id" : "kpPX_CNN_gDU",
    "matched-string" : "tillsvidareanställning",
    "annotation-id" : 35
  }, {
    "preferred-label" : "Heltid",
    "type" : "worktime-extent",
    "start-position" : 2090,
    "end-position" : 2096,
    "concept-id" : "6YE1_gAC_R2G",
    "matched-string" : "heltid",
    "annotation-id" : 36
  }, {
    "preferred-label" : "kock",
    "sentiment" : "MUST_HAVE",
    "type" : "esco-occupation",
    "start-position" : 2183,
    "end-position" : 2187,
    "concept-id" : "Ti2H_QoQ_EMX",
    "matched-string" : "kock",
    "annotation-id" : 14
  }, {
    "preferred-label" : "kock",
    "sentiment" : "MUST_HAVE",
    "type" : "esco-occupation",
    "start-position" : 2268,
    "end-position" : 2272,
    "concept-id" : "Ti2H_QoQ_EMX",
    "matched-string" : "kock",
    "annotation-id" : 15
  }, {
    "preferred-label" : "Restaurang",
    "type" : "keyword",
    "start-position" : 2323,
    "end-position" : 2338,
    "concept-id" : "o2Cg_3Ap_qvK",
    "matched-string" : "restaurangmiljö",
    "annotation-id" : 37
  }, {
    "preferred-label" : "Stockholm",
    "type" : "municipality",
    "start-position" : 2356,
    "end-position" : 2366,
    "concept-id" : "AvNB_uwa_6n6",
    "matched-string" : "Stockholms",
    "annotation-id" : 38
  }, {
    "preferred-label" : "hantera stress",
    "type" : "esco-skill",
    "start-position" : 2543,
    "end-position" : 2554,
    "concept-id" : "z5Zo_DVb_VEK",
    "matched-string" : "Stresstålig",
    "annotation-id" : 39
  }, {
    "preferred-label" : "Svenska",
    "sentiment" : "MUST_HAVE",
    "type" : "language",
    "start-position" : 2635,
    "end-position" : 2642,
    "concept-id" : "zSLA_vw2_FXN",
    "matched-string" : "svenska",
    "annotation-id" : 16
  }, {
    "preferred-label" : "Storkök",
    "sentiment" : "MUST_HAVE",
    "type" : "skill",
    "start-position" : 2751,
    "end-position" : 2758,
    "concept-id" : "GQ9R_2Za_Awt",
    "matched-string" : "storkök",
    "annotation-id" : 17
  }, {
    "preferred-label" : "Restaurang",
    "sentiment" : "MUST_HAVE",
    "type" : "keyword",
    "start-position" : 2783,
    "end-position" : 2793,
    "concept-id" : "o2Cg_3Ap_qvK",
    "matched-string" : "restaurang",
    "annotation-id" : 18
  }, {
    "preferred-label" : "Hotell",
    "sentiment" : "MUST_HAVE",
    "type" : "keyword",
    "start-position" : 2799,
    "end-position" : 2805,
    "concept-id" : "Jrrg_iiS_2yp",
    "matched-string" : "hotell",
    "annotation-id" : 19
  } ],
  "text" : "Nationskock på Stockholms nation\nNationskock på heltid till Stockholms nation!\nHar du erfarenhet som kock och är redo för en ny utmaning? Vill du arbeta med ambitiösa studenter i en fartfylld och kreativ miljö? Då är du varmt välkommen att söka till nationskock hos oss på Stockholms nation.\nOm tjänsten\nStockholms nation grundades år 1649 och är en av de största studentnationerna i Uppsala med över 7000 medlemmar och runt 150 studenter (ämbetsmän) som engagerar sig i verksamheten varje vecka. Vi söker nu en nationskock på heltid med start till 1:a oktober.\nHos oss arbetar du i en fartfylld miljö och träffar nya människor varje dag. Du arbetar med ambitiösa studenter och har stor kreativ frihet.\nArbetsuppgifter\nI rollen som nationskock ansvarar du över tillagningen av nationens lunch, torsdagsrestaurang Holmiana samt våra sittningar under helgerna. Detta med hjälp av nationens ämbetsmän och personal. Under vardagarna lagar du maten till nationens lunch och tar hand om inköp samt planerar inför torsdagens restaurang och helgens sittningar. Se nedan för en närmare beskrivning av våra verksamheter.\nLunch: Lunchverksamhet mellan måndag - fredag mellan 11.30-13.15. Serveras två rätter och salladsbuffé.\nRestaurang Holmiana: Nationens restaurangverksamhet under torsdagskvällar åt förbokade sällskap. À la carte meny bestäms i överenskommelse med nationens restaurangchef. Du arbetar tillsammans med nationens hovmästare, servis och övrig personal.\nUthyrningar och interna evenemang: Uthyrningar och interna evenemang sker främst kvällstid under helger. Det rör sig om mellan 100-300 gäster per tillfälle minst en gång per helg. Meny sätts enligt överenskommelse med restaurangchef eller tredje kurator (verksamhetschef). Du arbetar tillsammans med nationens hovmästare, uthyrningsansvariga, servis och övrig personal. \n\n\n\nUtöver detta ansvarar du över:\nFörberedelser och planering inför verksamheterna.\nInköp och inventering för samtliga ovanstående verksamheter.\nRutiner för livsmedelssäkerhet enligt nationens egenkontrollsprogram.\n\n\n\nDu erbjuds:\nEn tillsvidareanställning på heltid.\nKreativ frihet och varierande arbetsuppgifter.\nEn gedigen upplärning av vår tidigare kock.\nAttraktiv lön. \n\n\n\nVem söker vi?\nVi söker dig med minst tre års erfarenhet som kock och som är redo att ge dig in i en helt ny typ av restaurangmiljö. Tillsammans med Stockholms nations ämbetsmän arbetar du i en fartfylld miljö och träffar nya människor varje termin. \nVi söker dig som är: \nSocial, prestigelös och har lätt att arbeta med nya människor.\nStresstålig, tålmodig och flexibel.\nBekväm med att jobba varierande arbetstider.\nFlytande i svenska (både tal och skrift).\n\n\n\nDet är meriterande om du: \nHar tidigare erfarenhet inom liknande verksamhet eller storkök.\nHar en utbildning inom restaurang- och hotell.\nErfarenhet från nationsliv.\n\n\n\nÄr du den vi söker?\nSök genom att skicka in ditt CV till 3q@stockholmsnation.se senast den 4 augusti."
}