{
  "meta" : {
    "jobad" : {
      "description" : {
        "requirements" : null,
        "needs" : null,
        "company_information" : null,
        "text_formatted" : "Känner du dig redo för nya utmaningar? Har du en passion för framtida teknologier? I så fall, är detta den perfekta rollen för dig!\n\n \n\nDin roll\n\nDu kommer att ha rollen som teknisk ledare inom den nya plattformen som vi tar fram i området av Sensor Core. Det är ett mycket varierande jobb och spänner över hela området från idé till kundleverans. Design av ny funktionalitet ifrån kontrakterade krav, arkitekturdesign, kravspecifikationer för våra delsystem är några exempel på möjliga arbetsuppgifter. I den här rollen kommer du att jobba med nya teknikområden som innebär en möjlighet att utvecklas både personligt och professionellt.\n\nVi ser gärna att du har erfarenheter inom några av följande områden:\n\n * \n\nSystemdesign\n * \n\nKravhantering och teknisk dokumentation\n * \n\nProduktutveckling\n * \n\nDatorer, nätverk, mjukvara och operativsystem\n\n \n\nDet är önskvärt om du har erfarenhet inom informationssäkerhet och agil utveckling.\n\n \n\nDin profil\n\nSom person är du positiv, nyfiken, driven och en utpräglad lagspelare. Du är trygg i att presentera och förklara tekniska lösningar som är anpassat för olika intressenter. Du gillar att arbeta i team och samarbeta med andra. Att hantera nya frågeställningar och miljöer ser du som en naturlig del av jobbet och du har förmåga att förstå komplexa tekniska system, samtidigt som du kan se helheten ur ett systemperspektiv.\n\n \n\nBefattningen kräver att du genomgår och godkänns enligt vid var tid gällande bestämmelser för säkerhetsskydd. För befattningar där Saab har krav på säkerhetsklassinplacering kan, i förekommande fall, medföra krav på visst medborgarskap. \n\n \n\nVad du blir en del av\n\nSaab är ett ledande försvars- och säkerhetsföretag med uppdrag att hjälpa nationer att skydda sin befolkning och bidrar till trygghet för människor och samhällen. Med 18 000 talangfulla medarbetare utvecklar Saab teknik och lösningar för en säkrare, mer hållbar och mer rättvis värld.\n \n\nAffärsområdet Surveillance erbjuder världsledande sensorteknik inom övervakning och beslutsstöd för att skydda mot hot. Portföljen omfattar luftburna, markbaserade och marina radarer, elektronisk krigföring, stridsledning, flygsystem och cybersäkerhet.\n\n \n\nEnheten Sensor Core Platforms är en del av Product Unit Fighter & Sensor Core. Vår uppgift är att utveckla effektiva och aktuella plattformsprodukter för Surveillance framtida sensorer, baserat på kundbehov och produkt roadmaps.\n\n \n\nVi är idag ett mindre team, inom Sensor Core Platforms, som ska växa och vi har nu behov av erfarna tekniska ledare. Tillsammans med dina kollegor ges du möjlighet att utvecklas inom vårt teknikområde samtidigt som du lär dig mer om nya inriktningar och på så sätt fördjupar dina kunskaper.\n\n \n\nKontaktinformation:\n\nCatrin Merkert, rekryterande chef; email: catrin.merkert@saabgroup.com\n\n \n\nVänligen observera att vi arbetar med löpande urval och tjänsten kan komma att tillsättas innan sista ansökningsdatum har gått ut.\n\n \n\nVill du lära känna vår verksamhet och personal lite bättre? Här kan du hitta berättelser från några av våra anställda.\n\n \n\nSaab är ett företag där människan står i centrum. Vi har en god arbetsmiljö där vi stöttar och hjälper varandra att göra vårt bästa. Kontinuerligt lärande, välmående, karriär- och talangutveckling är exempel på områden där vi alltid arbetar hårt för att säkerställa att du som medarbetare får de möjligheter som du behöver.",
        "conditions" : "Heltid\r\nPermanent",
        "text" : "Känner du dig redo för nya utmaningar? Har du en passion för framtida teknologier? I så fall, är detta den perfekta rollen för dig!\n\n \n\nDin roll\n\nDu kommer att ha rollen som teknisk ledare inom den nya plattformen som vi tar fram i området av Sensor Core. Det är ett mycket varierande jobb och spänner över hela området från idé till kundleverans. Design av ny funktionalitet ifrån kontrakterade krav, arkitekturdesign, kravspecifikationer för våra delsystem är några exempel på möjliga arbetsuppgifter. I den här rollen kommer du att jobba med nya teknikområden som innebär en möjlighet att utvecklas både personligt och professionellt.\n\nVi ser gärna att du har erfarenheter inom några av följande områden:\n\n * \n\nSystemdesign\n * \n\nKravhantering och teknisk dokumentation\n * \n\nProduktutveckling\n * \n\nDatorer, nätverk, mjukvara och operativsystem\n\n \n\nDet är önskvärt om du har erfarenhet inom informationssäkerhet och agil utveckling.\n\n \n\nDin profil\n\nSom person är du positiv, nyfiken, driven och en utpräglad lagspelare. Du är trygg i att presentera och förklara tekniska lösningar som är anpassat för olika intressenter. Du gillar att arbeta i team och samarbeta med andra. Att hantera nya frågeställningar och miljöer ser du som en naturlig del av jobbet och du har förmåga att förstå komplexa tekniska system, samtidigt som du kan se helheten ur ett systemperspektiv.\n\n \n\nBefattningen kräver att du genomgår och godkänns enligt vid var tid gällande bestämmelser för säkerhetsskydd. För befattningar där Saab har krav på säkerhetsklassinplacering kan, i förekommande fall, medföra krav på visst medborgarskap. \n\n \n\nVad du blir en del av\n\nSaab är ett ledande försvars- och säkerhetsföretag med uppdrag att hjälpa nationer att skydda sin befolkning och bidrar till trygghet för människor och samhällen. Med 18 000 talangfulla medarbetare utvecklar Saab teknik och lösningar för en säkrare, mer hållbar och mer rättvis värld.\n \n\nAffärsområdet Surveillance erbjuder världsledande sensorteknik inom övervakning och beslutsstöd för att skydda mot hot. Portföljen omfattar luftburna, markbaserade och marina radarer, elektronisk krigföring, stridsledning, flygsystem och cybersäkerhet.\n\n \n\nEnheten Sensor Core Platforms är en del av Product Unit Fighter & Sensor Core. Vår uppgift är att utveckla effektiva och aktuella plattformsprodukter för Surveillance framtida sensorer, baserat på kundbehov och produkt roadmaps.\n\n \n\nVi är idag ett mindre team, inom Sensor Core Platforms, som ska växa och vi har nu behov av erfarna tekniska ledare. Tillsammans med dina kollegor ges du möjlighet att utvecklas inom vårt teknikområde samtidigt som du lär dig mer om nya inriktningar och på så sätt fördjupar dina kunskaper.\n\n \n\nKontaktinformation:\n\nCatrin Merkert, rekryterande chef; email: catrin.merkert@saabgroup.com\n\n \n\nVänligen observera att vi arbetar med löpande urval och tjänsten kan komma att tillsättas innan sista ansökningsdatum har gått ut.\n\n \n\nVill du lära känna vår verksamhet och personal lite bättre? Här kan du hitta berättelser från några av våra anställda.\n\n \n\nSaab är ett företag där människan står i centrum. Vi har en god arbetsmiljö där vi stöttar och hjälper varandra att göra vårt bästa. Kontinuerligt lärande, välmående, karriär- och talangutveckling är exempel på områden där vi alltid arbetar hårt för att säkerställa att du som medarbetare får de möjligheter som du behöver."
      },
      "headline" : "Intresserad av att vara teknisk ledare inom plattformsarkitektu",
      "driving_license" : null,
      "employer" : {
        "email" : null,
        "phone_number" : null,
        "organization_number" : "5560360793",
        "name" : "SAAB AB",
        "url" : null,
        "workplace" : "Saab AB"
      },
      "removed_date" : null,
      "logo_url" : "https://www.arbetsformedlingen.se/rest/arbetsgivare/rest/af/v3/organisation/5560360793/logotyper/logo.png",
      "last_publication_date" : "2022-09-15T23:59:59",
      "number_of_vacancies" : 3,
      "occupation" : {
        "concept_id" : "7YaM_bPu_c1T",
        "label" : "Systemanalytiker/Systemutredare",
        "legacy_ams_taxonomy_id" : "2411"
      },
      "occupation_group" : {
        "concept_id" : "UXKZ_3zZ_ipB",
        "label" : "Systemanalytiker och IT-arkitekter m.fl.",
        "legacy_ams_taxonomy_id" : "2511"
      },
      "employment_type" : {
        "concept_id" : "PFZr_Syz_cUq",
        "label" : "Vanlig anställning",
        "legacy_ams_taxonomy_id" : "1"
      },
      "webpage_url" : "https://arbetsformedlingen.se/platsbanken/annonser/26401458",
      "driving_license_required" : false,
      "application_contacts" : [ {
        "description" : "Saab AB",
        "email" : null,
        "telephone" : null,
        "name" : null,
        "contact_type" : null
      } ],
      "duration" : {
        "concept_id" : "a7uU_j21_mkL",
        "label" : "Tills vidare",
        "legacy_ams_taxonomy_id" : "1"
      },
      "nice_to_have" : {
        "education_level" : [ ],
        "work_experiences" : [ ],
        "skills" : [ ],
        "education" : [ ],
        "languages" : [ ]
      },
      "application_details" : {
        "via_af" : false,
        "email" : null,
        "other" : null,
        "reference" : "REQ_13288",
        "url" : "https://www.aplitrak.com/?adid=YW0uMDI2ODAuMzEwMUBzYWFiLmFwbGl0cmFrLmNvbQ",
        "information" : null
      },
      "source_type" : "VIA_PLATSBANKEN_DXA",
      "application_deadline" : "2022-09-15T23:59:59",
      "external_id" : "46-556036-0793-REQ_13288",
      "workplace_address" : {
        "coordinates" : [ 11.97456, 57.70887 ],
        "city" : null,
        "postcode" : null,
        "municipality" : "Göteborg",
        "region_concept_id" : "zdoY_6u5_Krt",
        "region" : "Västra Götalands län",
        "country_code" : "199",
        "region_code" : "14",
        "municipality_concept_id" : "PVZL_BQT_XtL",
        "country_concept_id" : "i46j_HmG_v64",
        "municipality_code" : "1480",
        "street_address" : null,
        "country" : "Sverige"
      },
      "id" : "26401458",
      "experience_required" : true,
      "working_hours_type" : {
        "concept_id" : "6YE1_gAC_R2G",
        "label" : "Heltid",
        "legacy_ams_taxonomy_id" : "1"
      },
      "access" : null,
      "timestamp" : 1660230343932,
      "must_have" : {
        "education_level" : [ ],
        "work_experiences" : [ {
          "concept_id" : "7YaM_bPu_c1T",
          "weight" : 10,
          "label" : "Systemanalytiker/Systemutredare",
          "legacy_ams_taxonomy_id" : "2411"
        } ],
        "skills" : [ ],
        "education" : [ ],
        "languages" : [ ]
      },
      "occupation_field" : {
        "concept_id" : "apaJ_2ja_LuF",
        "label" : "Data/IT",
        "legacy_ams_taxonomy_id" : "3"
      },
      "scope_of_work" : {
        "min" : 100,
        "max" : 100
      },
      "salary_type" : {
        "concept_id" : "oG8G_9cW_nRf",
        "label" : "Fast månads- vecko- eller timlön",
        "legacy_ams_taxonomy_id" : "1"
      },
      "removed" : false,
      "salary_description" : "Not Specified",
      "access_to_own_car" : false,
      "publication_date" : "2022-08-11T17:05:43"
    },
    "name" : "Intresserad av att vara teknisk ledare inom plattformsarkitektu",
    "user" : "hannes"
  },
  "sha1" : "57282cec555b6d6cfc7ff3807366b3c13023d00d",
  "annotations" : [ {
    "preferred-label" : "Systemdesigner",
    "sentiment" : "MUST_HAVE",
    "type" : "occupation-name",
    "start-position" : 778,
    "end-position" : 790,
    "concept-id" : "9jYT_DS5_6JE",
    "matched-string" : "Systemdesign",
    "annotation-id" : 9
  }, {
    "preferred-label" : "Kravhantering, systemutveckling",
    "sentiment" : "MUST_HAVE",
    "type" : "skill",
    "start-position" : 796,
    "end-position" : 809,
    "concept-id" : "Utw1_tLL_sS2",
    "matched-string" : "Kravhantering",
    "annotation-id" : 8
  }, {
    "preferred-label" : "Teknisk dokumentation",
    "sentiment" : "MUST_HAVE",
    "type" : "skill",
    "start-position" : 814,
    "end-position" : 835,
    "concept-id" : "AEgv_4gP_ndv",
    "matched-string" : "teknisk dokumentation",
    "annotation-id" : 0
  }, {
    "preferred-label" : "Produktutveckling",
    "sentiment" : "MUST_HAVE",
    "type" : "skill",
    "start-position" : 841,
    "end-position" : 858,
    "concept-id" : "uwev_L2n_fpz",
    "matched-string" : "produktutveckling",
    "annotation-id" : 1
  }, {
    "preferred-label" : "Nätverk",
    "sentiment" : "MUST_HAVE",
    "type" : "skill-headline",
    "start-position" : 873,
    "end-position" : 880,
    "concept-id" : "nHDU_dpj_R9H",
    "matched-string" : "nätverk",
    "annotation-id" : 11
  }, {
    "preferred-label" : "Testning, mjukvara/Verifiering, mjukvara",
    "sentiment" : "MUST_HAVE",
    "type" : "skill",
    "start-position" : 882,
    "end-position" : 890,
    "concept-id" : "2kEw_jWL_6Zz",
    "matched-string" : "mjukvara",
    "annotation-id" : 10
  }, {
    "preferred-label" : "Operativsystem",
    "sentiment" : "MUST_HAVE",
    "type" : "skill-headline",
    "start-position" : 895,
    "end-position" : 909,
    "concept-id" : "xAWr_WYq_JPP",
    "matched-string" : "operativsystem",
    "annotation-id" : 2
  }, {
    "preferred-label" : "Informationssäkerhet",
    "sentiment" : "MUST_HAVE",
    "type" : "skill",
    "start-position" : 956,
    "end-position" : 976,
    "concept-id" : "LqRT_TVB_RPo",
    "matched-string" : "informationssäkerhet",
    "annotation-id" : 3
  }, {
    "preferred-label" : "Agila arbetsmetoder",
    "sentiment" : "MUST_HAVE",
    "type" : "skill",
    "start-position" : 981,
    "end-position" : 996,
    "concept-id" : "TMVb_DnH_etF",
    "matched-string" : "agil utveckling",
    "annotation-id" : 12
  }, {
    "preferred-label" : "visa nyfikenhet",
    "sentiment" : "MUST_HAVE",
    "type" : "esco-skill",
    "start-position" : 1040,
    "end-position" : 1047,
    "concept-id" : "mbHa_NFf_vyf",
    "matched-string" : "nyfiken",
    "annotation-id" : 14
  }, {
    "preferred-label" : "samarbeta med kolleger",
    "sentiment" : "MUST_HAVE",
    "type" : "esco-skill",
    "start-position" : 1218,
    "end-position" : 1237,
    "concept-id" : "X15R_797_q62",
    "matched-string" : "samarbeta med andra",
    "annotation-id" : 13
  }, {
    "preferred-label" : "Sensorteknik",
    "sentiment" : "MUST_HAVE",
    "type" : "skill",
    "start-position" : 2042,
    "end-position" : 2054,
    "concept-id" : "bZ2o_tXM_Z9d",
    "matched-string" : "sensorteknik",
    "annotation-id" : 4
  }, {
    "preferred-label" : "Personal",
    "sentiment" : "NOT_RELEVANT",
    "type" : "keyword",
    "start-position" : 3046,
    "end-position" : 3054,
    "concept-id" : "HVxM_6MS_y1c",
    "matched-string" : "personal",
    "annotation-id" : 6
  }, {
    "preferred-label" : "arbetsmiljö",
    "sentiment" : "NOT_RELEVANT",
    "type" : "esco-skill",
    "start-position" : 3195,
    "end-position" : 3206,
    "concept-id" : "zdQY_QJh_nUH",
    "matched-string" : "arbetsmiljö",
    "annotation-id" : 7
  } ],
  "text" : "Intresserad av att vara teknisk ledare inom plattformsarkitektu\nKänner du dig redo för nya utmaningar? Har du en passion för framtida teknologier? I så fall, är detta den perfekta rollen för dig!\n\n \n\nDin roll\n\nDu kommer att ha rollen som teknisk ledare inom den nya plattformen som vi tar fram i området av Sensor Core. Det är ett mycket varierande jobb och spänner över hela området från idé till kundleverans. Design av ny funktionalitet ifrån kontrakterade krav, arkitekturdesign, kravspecifikationer för våra delsystem är några exempel på möjliga arbetsuppgifter. I den här rollen kommer du att jobba med nya teknikområden som innebär en möjlighet att utvecklas både personligt och professionellt.\n\nVi ser gärna att du har erfarenheter inom några av följande områden:\n\n * \n\nSystemdesign\n * \n\nKravhantering och teknisk dokumentation\n * \n\nProduktutveckling\n * \n\nDatorer, nätverk, mjukvara och operativsystem\n\n \n\nDet är önskvärt om du har erfarenhet inom informationssäkerhet och agil utveckling.\n\n \n\nDin profil\n\nSom person är du positiv, nyfiken, driven och en utpräglad lagspelare. Du är trygg i att presentera och förklara tekniska lösningar som är anpassat för olika intressenter. Du gillar att arbeta i team och samarbeta med andra. Att hantera nya frågeställningar och miljöer ser du som en naturlig del av jobbet och du har förmåga att förstå komplexa tekniska system, samtidigt som du kan se helheten ur ett systemperspektiv.\n\n \n\nBefattningen kräver att du genomgår och godkänns enligt vid var tid gällande bestämmelser för säkerhetsskydd. För befattningar där Saab har krav på säkerhetsklassinplacering kan, i förekommande fall, medföra krav på visst medborgarskap. \n\n \n\nVad du blir en del av\n\nSaab är ett ledande försvars- och säkerhetsföretag med uppdrag att hjälpa nationer att skydda sin befolkning och bidrar till trygghet för människor och samhällen. Med 18 000 talangfulla medarbetare utvecklar Saab teknik och lösningar för en säkrare, mer hållbar och mer rättvis värld.\n \n\nAffärsområdet Surveillance erbjuder världsledande sensorteknik inom övervakning och beslutsstöd för att skydda mot hot. Portföljen omfattar luftburna, markbaserade och marina radarer, elektronisk krigföring, stridsledning, flygsystem och cybersäkerhet.\n\n \n\nEnheten Sensor Core Platforms är en del av Product Unit Fighter & Sensor Core. Vår uppgift är att utveckla effektiva och aktuella plattformsprodukter för Surveillance framtida sensorer, baserat på kundbehov och produkt roadmaps.\n\n \n\nVi är idag ett mindre team, inom Sensor Core Platforms, som ska växa och vi har nu behov av erfarna tekniska ledare. Tillsammans med dina kollegor ges du möjlighet att utvecklas inom vårt teknikområde samtidigt som du lär dig mer om nya inriktningar och på så sätt fördjupar dina kunskaper.\n\n \n\nKontaktinformation:\n\nCatrin Merkert, rekryterande chef; email: catrin.merkert@saabgroup.com\n\n \n\nVänligen observera att vi arbetar med löpande urval och tjänsten kan komma att tillsättas innan sista ansökningsdatum har gått ut.\n\n \n\nVill du lära känna vår verksamhet och personal lite bättre? Här kan du hitta berättelser från några av våra anställda.\n\n \n\nSaab är ett företag där människan står i centrum. Vi har en god arbetsmiljö där vi stöttar och hjälper varandra att göra vårt bästa. Kontinuerligt lärande, välmående, karriär- och talangutveckling är exempel på områden där vi alltid arbetar hårt för att säkerställa att du som medarbetare får de möjligheter som du behöver."
}