{
  "meta" : {
    "jobad" : {
      "description" : {
        "requirements" : null,
        "needs" : null,
        "company_information" : null,
        "text_formatted" : "<p><u>Vilka är vi</u></p><p>Omsorg och behandling är ett företag med hög vårdkunskap där alla i ledande befattningar är vårdutbildade och vi är aktiva i hela Sverige men fokuserar på att verka lokalt.</p><p>Vi arbetar ständigt för att kunna ge våra kunder den bästa servicen, assistansen och tryggheten. Målsättningen är att skapa de bästa förutsättningar för en individanpassad personlig assistans.</p><p><u>Om jobbet</u></p><p>Vi söker nu personal till en glad vuxen kille. Han är utåtriktad och hans intressen är bland annat att fotografera och teknik men också träning. Du som sökande bör vara social och förstå vikten av att finnas till när han behöver dig.</p><p>I dina arbetsuppgifter ingår allt från hemmets alla vardagssysslor till att följa med på aktiviteter.</p><p>Som assistent hos oss arbetar du i en miljö där vi tillsammans ser till att kunden får stort inflytande och delaktighet i sin assistans, där du kommer att vara en viktig del i kundens vardag.</p><p><u>Vad förväntar vi oss av dig</u></p><ul><li>Vi söker dig som är positiv och flexibel och har ett professionellt förhållningssätt</li><li>Att du inte har några problem med HBTQ    personer</li><li>Körkort är en merit men inget krav</li><li>Att du kan uttrycka dig obehindrat på svenska i tal och skrift</li></ul><p>Du kommer ofta att arbeta självständigt så de är viktigt att du är trygg i din roll som assistent.</p><p>Vi har kollektivavtal och erbjuder ett spännande och varierat arbete med goda anställningsvillkor.</p><p>Vänligen kontakta oss för mer information och ett personligt möte.</p>",
        "conditions" : null,
        "text" : "Vilka är vi\nOmsorg och behandling är ett företag med hög vårdkunskap där alla i ledande befattningar är vårdutbildade och vi är aktiva i hela Sverige men fokuserar på att verka lokalt.\nVi arbetar ständigt för att kunna ge våra kunder den bästa servicen, assistansen och tryggheten. Målsättningen är att skapa de bästa förutsättningar för en individanpassad personlig assistans.\nOm jobbet\nVi söker nu personal till en glad vuxen kille. Han är utåtriktad och hans intressen är bland annat att fotografera och teknik men också träning. Du som sökande bör vara social och förstå vikten av att finnas till när han behöver dig.\nI dina arbetsuppgifter ingår allt från hemmets alla vardagssysslor till att följa med på aktiviteter.\nSom assistent hos oss arbetar du i en miljö där vi tillsammans ser till att kunden får stort inflytande och delaktighet i sin assistans, där du kommer att vara en viktig del i kundens vardag.\nVad förväntar vi oss av dig\nVi söker dig som är positiv och flexibel och har ett professionellt förhållningssätt\nAtt du inte har några problem med HBTQ    personer\nKörkort är en merit men inget krav\nAtt du kan uttrycka dig obehindrat på svenska i tal och skrift\n\nDu kommer ofta att arbeta självständigt så de är viktigt att du är trygg i din roll som assistent.\nVi har kollektivavtal och erbjuder ett spännande och varierat arbete med goda anställningsvillkor.\nVänligen kontakta oss för mer information och ett personligt möte."
      },
      "headline" : "Personlig assistent Karlskoga",
      "driving_license" : null,
      "employer" : {
        "email" : null,
        "phone_number" : null,
        "organization_number" : "5565569380",
        "name" : "Omsorg & Behandling 1 AB",
        "url" : "http://www.omsorgbehandling.se",
        "workplace" : "Omsorg & Behandling 1 AB"
      },
      "removed_date" : null,
      "logo_url" : "https://www.arbetsformedlingen.se/rest/arbetsgivare/rest/af/v3/arbetsplatser/82507331/logotyper/logo.png",
      "last_publication_date" : "2022-09-01T23:59:59",
      "number_of_vacancies" : 2,
      "occupation" : {
        "concept_id" : "eU1q_zvL_9Rf",
        "label" : "Personlig assistent",
        "legacy_ams_taxonomy_id" : "5798"
      },
      "occupation_group" : {
        "concept_id" : "sq3e_WVv_Fjd",
        "label" : "Personliga assistenter",
        "legacy_ams_taxonomy_id" : "5343"
      },
      "employment_type" : {
        "concept_id" : "PFZr_Syz_cUq",
        "label" : "Vanlig anställning",
        "legacy_ams_taxonomy_id" : "1"
      },
      "webpage_url" : "https://arbetsformedlingen.se/platsbanken/annonser/26372877",
      "driving_license_required" : false,
      "application_contacts" : [ {
        "description" : null,
        "email" : null,
        "telephone" : "073-373 00 52",
        "name" : "Stina Bergqvist",
        "contact_type" : "Verksamhetschef"
      } ],
      "duration" : {
        "concept_id" : "qQUd_4qe_NDT",
        "label" : "6 månader eller längre",
        "legacy_ams_taxonomy_id" : "2"
      },
      "nice_to_have" : {
        "education_level" : [ ],
        "work_experiences" : [ ],
        "skills" : [ ],
        "education" : [ ],
        "languages" : [ ]
      },
      "application_details" : {
        "via_af" : false,
        "email" : "assistans@omsorgbehandling.se",
        "other" : null,
        "reference" : null,
        "url" : null,
        "information" : null
      },
      "source_type" : "VIA_ANNONSERA",
      "application_deadline" : "2022-09-01T23:59:59",
      "external_id" : null,
      "workplace_address" : {
        "coordinates" : [ 16.50827407986109, 59.36904965524722 ],
        "city" : "Eskilstuna",
        "postcode" : "63220",
        "municipality" : "Eskilstuna",
        "region_concept_id" : "s93u_BEb_sx2",
        "region" : "Södermanlands län",
        "country_code" : "199",
        "region_code" : "04",
        "municipality_concept_id" : "kMxr_NiX_YrU",
        "country_concept_id" : "i46j_HmG_v64",
        "municipality_code" : "0484",
        "street_address" : "Kriebsensgatan 18",
        "country" : "Sverige"
      },
      "id" : "26372877",
      "experience_required" : false,
      "working_hours_type" : {
        "concept_id" : "947z_JGS_Uk2",
        "label" : "Deltid",
        "legacy_ams_taxonomy_id" : "2"
      },
      "access" : null,
      "timestamp" : 1659461160295,
      "must_have" : {
        "education_level" : [ ],
        "work_experiences" : [ ],
        "skills" : [ ],
        "education" : [ ],
        "languages" : [ ]
      },
      "occupation_field" : {
        "concept_id" : "GazW_2TU_kJw",
        "label" : "Yrken med social inriktning",
        "legacy_ams_taxonomy_id" : "16"
      },
      "scope_of_work" : {
        "min" : 60,
        "max" : 80
      },
      "salary_type" : {
        "concept_id" : "oG8G_9cW_nRf",
        "label" : "Fast månads- vecko- eller timlön",
        "legacy_ams_taxonomy_id" : "1"
      },
      "removed" : false,
      "salary_description" : null,
      "access_to_own_car" : false,
      "publication_date" : "2022-08-02T19:26:00"
    },
    "name" : "Personlig assistent Karlskoga",
    "user" : "kristof.fischer"
  },
  "sha1" : "0993673c05206b3f0585f7238743d4793afdb117",
  "annotations" : [ {
    "preferred-label" : "Personlig assistent",
    "sentiment" : "MUST_HAVE",
    "type" : "occupation-name",
    "start-position" : 0,
    "end-position" : 19,
    "concept-id" : "eU1q_zvL_9Rf",
    "matched-string" : "personlig assistent",
    "annotation-id" : 0
  }, {
    "preferred-label" : "Karlskoga",
    "type" : "municipality",
    "start-position" : 20,
    "end-position" : 29,
    "concept-id" : "wgJm_upX_z5W",
    "matched-string" : "Karlskoga",
    "annotation-id" : 5
  }, {
    "preferred-label" : "Sverige",
    "type" : "country",
    "start-position" : 172,
    "end-position" : 179,
    "concept-id" : "i46j_HmG_v64",
    "matched-string" : "Sverige",
    "annotation-id" : 6
  }, {
    "preferred-label" : "B",
    "sentiment" : "NICE_TO_HAVE",
    "type" : "driving-licence",
    "start-position" : 1110,
    "end-position" : 1117,
    "concept-id" : "VTK8_WRx_GcM",
    "matched-string" : "Körkort",
    "annotation-id" : 7
  }, {
    "preferred-label" : "Svenska",
    "sentiment" : "MUST_HAVE",
    "type" : "language",
    "start-position" : 1183,
    "end-position" : 1190,
    "concept-id" : "zSLA_vw2_FXN",
    "matched-string" : "svenska",
    "annotation-id" : 3
  }, {
    "preferred-label" : "arbeta självständigt",
    "sentiment" : "MUST_HAVE",
    "type" : "esco-skill",
    "start-position" : 1228,
    "end-position" : 1248,
    "concept-id" : "NyFu_HHd_zhz",
    "matched-string" : "arbeta självständigt",
    "annotation-id" : 8
  } ],
  "text" : "Personlig assistent Karlskoga\nVilka är vi\nOmsorg och behandling är ett företag med hög vårdkunskap där alla i ledande befattningar är vårdutbildade och vi är aktiva i hela Sverige men fokuserar på att verka lokalt.\nVi arbetar ständigt för att kunna ge våra kunder den bästa servicen, assistansen och tryggheten. Målsättningen är att skapa de bästa förutsättningar för en individanpassad personlig assistans.\nOm jobbet\nVi söker nu personal till en glad vuxen kille. Han är utåtriktad och hans intressen är bland annat att fotografera och teknik men också träning. Du som sökande bör vara social och förstå vikten av att finnas till när han behöver dig.\nI dina arbetsuppgifter ingår allt från hemmets alla vardagssysslor till att följa med på aktiviteter.\nSom assistent hos oss arbetar du i en miljö där vi tillsammans ser till att kunden får stort inflytande och delaktighet i sin assistans, där du kommer att vara en viktig del i kundens vardag.\nVad förväntar vi oss av dig\nVi söker dig som är positiv och flexibel och har ett professionellt förhållningssätt\nAtt du inte har några problem med HBTQ    personer\nKörkort är en merit men inget krav\nAtt du kan uttrycka dig obehindrat på svenska i tal och skrift\n\nDu kommer ofta att arbeta självständigt så de är viktigt att du är trygg i din roll som assistent.\nVi har kollektivavtal och erbjuder ett spännande och varierat arbete med goda anställningsvillkor.\nVänligen kontakta oss för mer information och ett personligt möte."
}