{
  "meta" : {
    "jobad" : {
      "description" : {
        "requirements" : null,
        "needs" : null,
        "company_information" : null,
        "text_formatted" : "Nu söker vi en IT Business Support Specialist till vår interna Process Support & IT avdelning. Är du en IT-intresserad person med något/några års erfarenhet i branschen, med ett öga för problemlösning? Då är det dig vi söker efter!\n\nDina arbetsuppgifter\n\nI rollen som Business IT support Specialist så kommer du främst arbeta med systemförvaltning och incidenthantering av våra interna affärssystem. Du kommer ha ett dagligt ansvar för att hantera inkommande ärenden och incidenter från vår affärsverksamhet. Du rapporterar till Process Support & IT manager och du kommer att ingå i en grupp av totalt tio personer som tillsammans utgör den interna Process Support & IT avdelningen.\n\nUtöver arbetet med förvaltning kommer det även ingå en del projektarbete där du tillsammans med kollegor på gruppen stöttar verksamheten att genomföra aktiviteter som bidrar till verksamhetens utveckling.\n\nDet huvudsakliga ansvaret i rollen innebär att du skall:\n\n\n• Hantera förvaltningsärenden och incidenter på daglig basis\n• Dokumentera och underhålla systemdokumentation\n• Bygga automation inom förvaltningsrådet\n• Delaktig i utvecklingsprojekt/aktiviteter\n\nTjänsten är förlagd till Scania Finans huvudkontor i Södertälje. Scania Finans erbjuder delvis hemarbete och har en intention om att vara en flexibel arbetsgivare. \n\nDin profil\n För att lyckas och trivas i tjänsten krävs det att du:\n\n\n• Har något/några års erfarenhet av arbete med applikationsförvaltning eller IT incidenthantering\n• Har kunskap i PowerShell scriptning\n• Har kunskap i MS SQL\n• Behärskar svenska och engelska i så väl tal som i skrift\n• Är serviceinriktad och lösningsorienterad\n• Kan hantera förändringar och vara flexibel\n• Duktig på att organisera och planera\n\nNedan punkter är meriterande, men inte ett krav:\n\n\n• Kunskap i BanqSoft system (PreView, CoreView)\n• Kunskap om och har jobbat med finansiella processer\n\nSom person ser vi att du är nyfiken att lära och naturligt sätter kunden i fokus.\n\nAnsökan\n Din ansökan skall innehålla både CV och personligt brev och vara oss tillhanda senast den 14 augusti.\n\nEn bakgrundskontroll kan även komma att genomföras för denna tjänst.\n\nVi ser fram emot din ansökan!\n\nOm oss\n\nScania Finans AB (SFA) är ett finansbolag som ingår i affärsområdet Scania Financial Services. SFA erbjuder finansiering och försäkring av Scanias produkter genom filialer i Norden och Baltikum. Företaget grundades 1947 och har idag en finansieringsportfölj på ca. 19 miljarder, vilket gör SFA till det äldsta och det största finansbolagen inom Scania Financial Services. Företaget har ca. 100 anställda varav ca. 40 stycken sitter på huvudkontoret i Södertälje.\n\n#LI-Hybrid",
        "conditions" : "Heltid/\r\nEj specificerat",
        "text" : "Nu söker vi en IT Business Support Specialist till vår interna Process Support & IT avdelning. Är du en IT-intresserad person med något/några års erfarenhet i branschen, med ett öga för problemlösning? Då är det dig vi söker efter!\n\nDina arbetsuppgifter\n\nI rollen som Business IT support Specialist så kommer du främst arbeta med systemförvaltning och incidenthantering av våra interna affärssystem. Du kommer ha ett dagligt ansvar för att hantera inkommande ärenden och incidenter från vår affärsverksamhet. Du rapporterar till Process Support & IT manager och du kommer att ingå i en grupp av totalt tio personer som tillsammans utgör den interna Process Support & IT avdelningen.\n\nUtöver arbetet med förvaltning kommer det även ingå en del projektarbete där du tillsammans med kollegor på gruppen stöttar verksamheten att genomföra aktiviteter som bidrar till verksamhetens utveckling.\n\nDet huvudsakliga ansvaret i rollen innebär att du skall:\n\n\n• Hantera förvaltningsärenden och incidenter på daglig basis\n• Dokumentera och underhålla systemdokumentation\n• Bygga automation inom förvaltningsrådet\n• Delaktig i utvecklingsprojekt/aktiviteter\n\nTjänsten är förlagd till Scania Finans huvudkontor i Södertälje. Scania Finans erbjuder delvis hemarbete och har en intention om att vara en flexibel arbetsgivare. \n\nDin profil\n För att lyckas och trivas i tjänsten krävs det att du:\n\n\n• Har något/några års erfarenhet av arbete med applikationsförvaltning eller IT incidenthantering\n• Har kunskap i PowerShell scriptning\n• Har kunskap i MS SQL\n• Behärskar svenska och engelska i så väl tal som i skrift\n• Är serviceinriktad och lösningsorienterad\n• Kan hantera förändringar och vara flexibel\n• Duktig på att organisera och planera\n\nNedan punkter är meriterande, men inte ett krav:\n\n\n• Kunskap i BanqSoft system (PreView, CoreView)\n• Kunskap om och har jobbat med finansiella processer\n\nSom person ser vi att du är nyfiken att lära och naturligt sätter kunden i fokus.\n\nAnsökan\n Din ansökan skall innehålla både CV och personligt brev och vara oss tillhanda senast den 14 augusti.\n\nEn bakgrundskontroll kan även komma att genomföras för denna tjänst.\n\nVi ser fram emot din ansökan!\n\nOm oss\n\nScania Finans AB (SFA) är ett finansbolag som ingår i affärsområdet Scania Financial Services. SFA erbjuder finansiering och försäkring av Scanias produkter genom filialer i Norden och Baltikum. Företaget grundades 1947 och har idag en finansieringsportfölj på ca. 19 miljarder, vilket gör SFA till det äldsta och det största finansbolagen inom Scania Financial Services. Företaget har ca. 100 anställda varav ca. 40 stycken sitter på huvudkontoret i Södertälje.\n\n#LI-Hybrid"
      },
      "headline" : "IT Business Support Specialist",
      "driving_license" : null,
      "employer" : {
        "email" : null,
        "phone_number" : null,
        "organization_number" : "5560840976",
        "name" : "Scania CV AB",
        "url" : "https://www.scania.com/world/#/",
        "workplace" : "Scania"
      },
      "removed_date" : null,
      "logo_url" : "https://www.arbetsformedlingen.se/rest/arbetsgivare/rest/af/v3/organisation/5560840976/logotyper/logo.png",
      "last_publication_date" : "2022-08-14T23:59:59",
      "number_of_vacancies" : 1,
      "occupation" : {
        "concept_id" : "KQty_E1u_cia",
        "label" : "Helpdesktekniker/Supporttekniker",
        "legacy_ams_taxonomy_id" : "7020"
      },
      "occupation_group" : {
        "concept_id" : "hmaC_cfi_UKg",
        "label" : "Supporttekniker, IT",
        "legacy_ams_taxonomy_id" : "3512"
      },
      "employment_type" : {
        "concept_id" : "PFZr_Syz_cUq",
        "label" : "Vanlig anställning",
        "legacy_ams_taxonomy_id" : "1"
      },
      "webpage_url" : "https://arbetsformedlingen.se/platsbanken/annonser/26327330",
      "driving_license_required" : false,
      "application_contacts" : [ ],
      "duration" : {
        "concept_id" : "a7uU_j21_mkL",
        "label" : "Tills vidare",
        "legacy_ams_taxonomy_id" : "1"
      },
      "nice_to_have" : {
        "education_level" : [ ],
        "work_experiences" : [ ],
        "skills" : [ ],
        "education" : [ ],
        "languages" : [ ]
      },
      "application_details" : {
        "via_af" : false,
        "email" : null,
        "other" : null,
        "reference" : null,
        "url" : "https://web103.reachmee.com/ext/I017/1100/main?site=6&validator=ff4da3d16545a3dd1ed116854e58a403&lang=SE&rmpage=job&rmjob=14151",
        "information" : null
      },
      "source_type" : "VIA_PLATSBANKEN_DXA",
      "application_deadline" : "2022-08-14T23:59:59",
      "external_id" : "46-556084-0976-14151",
      "workplace_address" : {
        "coordinates" : [ 17.625689, 59.195362 ],
        "city" : null,
        "postcode" : null,
        "municipality" : "Södertälje",
        "region_concept_id" : "CifL_Rzy_Mku",
        "region" : "Stockholms län",
        "country_code" : "199",
        "region_code" : "01",
        "municipality_concept_id" : "g6hK_M1o_hiU",
        "country_concept_id" : "i46j_HmG_v64",
        "municipality_code" : "0181",
        "street_address" : null,
        "country" : "Sverige"
      },
      "id" : "26327330",
      "experience_required" : true,
      "working_hours_type" : {
        "concept_id" : "6YE1_gAC_R2G",
        "label" : "Heltid",
        "legacy_ams_taxonomy_id" : "1"
      },
      "access" : null,
      "timestamp" : 1657798548446,
      "must_have" : {
        "education_level" : [ ],
        "work_experiences" : [ {
          "concept_id" : "KQty_E1u_cia",
          "weight" : 10,
          "label" : "Helpdesktekniker/Supporttekniker",
          "legacy_ams_taxonomy_id" : "7020"
        } ],
        "skills" : [ ],
        "education" : [ ],
        "languages" : [ ]
      },
      "occupation_field" : {
        "concept_id" : "apaJ_2ja_LuF",
        "label" : "Data/IT",
        "legacy_ams_taxonomy_id" : "3"
      },
      "scope_of_work" : {
        "min" : 100,
        "max" : 100
      },
      "salary_type" : {
        "concept_id" : "oG8G_9cW_nRf",
        "label" : "Fast månads- vecko- eller timlön",
        "legacy_ams_taxonomy_id" : "1"
      },
      "removed" : false,
      "salary_description" : "Enligt överenskommelse.",
      "access_to_own_car" : false,
      "publication_date" : "2022-07-22T00:00:00"
    },
    "name" : "IT Business Support Specialist",
    "user" : "hannes"
  },
  "sha1" : "be1690c5d4e2cce55112f649e50860df927f86f5",
  "annotations" : [ {
    "preferred-label" : "Data/IT",
    "sentiment" : "MUST_HAVE",
    "type" : "occupation-field",
    "start-position" : 0,
    "end-position" : 2,
    "concept-id" : "apaJ_2ja_LuF",
    "matched-string" : "it",
    "annotation-id" : 0
  }, {
    "preferred-label" : "Data/IT",
    "sentiment" : "MUST_HAVE",
    "type" : "occupation-field",
    "start-position" : 46,
    "end-position" : 48,
    "concept-id" : "apaJ_2ja_LuF",
    "matched-string" : "it",
    "annotation-id" : 1
  }, {
    "preferred-label" : "Data/IT",
    "sentiment" : "MUST_HAVE",
    "type" : "occupation-field",
    "start-position" : 112,
    "end-position" : 114,
    "concept-id" : "apaJ_2ja_LuF",
    "matched-string" : "it",
    "annotation-id" : 2
  }, {
    "preferred-label" : "Data/IT",
    "sentiment" : "MUST_HAVE",
    "type" : "occupation-field",
    "start-position" : 135,
    "end-position" : 137,
    "concept-id" : "apaJ_2ja_LuF",
    "matched-string" : "it",
    "annotation-id" : 3
  }, {
    "preferred-label" : "Data/IT",
    "sentiment" : "MUST_HAVE",
    "type" : "occupation-field",
    "start-position" : 308,
    "end-position" : 310,
    "concept-id" : "apaJ_2ja_LuF",
    "matched-string" : "it",
    "annotation-id" : 4
  }, {
    "preferred-label" : "Systemförvaltning",
    "sentiment" : "MUST_HAVE",
    "type" : "skill",
    "start-position" : 361,
    "end-position" : 378,
    "concept-id" : "4f1v_w91_qVM",
    "matched-string" : "systemförvaltning",
    "annotation-id" : 5
  }, {
    "preferred-label" : "Data/IT",
    "sentiment" : "MUST_HAVE",
    "type" : "occupation-field",
    "start-position" : 578,
    "end-position" : 580,
    "concept-id" : "apaJ_2ja_LuF",
    "matched-string" : "it",
    "annotation-id" : 6
  }, {
    "preferred-label" : "Manager",
    "sentiment" : "MUST_HAVE",
    "type" : "occupation-name",
    "start-position" : 581,
    "end-position" : 588,
    "concept-id" : "X9jv_K2b_m48",
    "matched-string" : "manager",
    "annotation-id" : 7
  }, {
    "preferred-label" : "Data/IT",
    "sentiment" : "MUST_HAVE",
    "type" : "occupation-field",
    "start-position" : 698,
    "end-position" : 700,
    "concept-id" : "apaJ_2ja_LuF",
    "matched-string" : "it",
    "annotation-id" : 8
  }, {
    "preferred-label" : "Södertälje",
    "type" : "municipality",
    "start-position" : 1230,
    "end-position" : 1240,
    "concept-id" : "g6hK_M1o_hiU",
    "matched-string" : "Södertälje",
    "annotation-id" : 16
  }, {
    "preferred-label" : "Data/IT",
    "sentiment" : "MUST_HAVE",
    "type" : "occupation-field",
    "start-position" : 1489,
    "end-position" : 1491,
    "concept-id" : "apaJ_2ja_LuF",
    "matched-string" : "it",
    "annotation-id" : 10
  }, {
    "preferred-label" : "Windows Powershell, systemutvecklingsverktyg",
    "type" : "skill",
    "start-position" : 1526,
    "end-position" : 1547,
    "concept-id" : "SnKF_v7d_qUH",
    "matched-string" : "PowerShell scriptning",
    "annotation-id" : 17
  }, {
    "preferred-label" : "SQL, programmeringsspråk",
    "sentiment" : "MUST_HAVE",
    "type" : "skill",
    "start-position" : 1567,
    "end-position" : 1570,
    "concept-id" : "Xnmr_kYS_YKY",
    "matched-string" : "sql",
    "annotation-id" : 11
  }, {
    "preferred-label" : "Svenska",
    "sentiment" : "MUST_HAVE",
    "type" : "language",
    "start-position" : 1583,
    "end-position" : 1590,
    "concept-id" : "zSLA_vw2_FXN",
    "matched-string" : "svenska",
    "annotation-id" : 12
  }, {
    "preferred-label" : "Engelska",
    "sentiment" : "MUST_HAVE",
    "type" : "language",
    "start-position" : 1595,
    "end-position" : 1603,
    "concept-id" : "NVxJ_hLg_TYS",
    "matched-string" : "engelska",
    "annotation-id" : 13
  } ],
  "text" : "IT Business Support Specialist\nNu söker vi en IT Business Support Specialist till vår interna Process Support & IT avdelning. Är du en IT-intresserad person med något/några års erfarenhet i branschen, med ett öga för problemlösning? Då är det dig vi söker efter!\n\nDina arbetsuppgifter\n\nI rollen som Business IT support Specialist så kommer du främst arbeta med systemförvaltning och incidenthantering av våra interna affärssystem. Du kommer ha ett dagligt ansvar för att hantera inkommande ärenden och incidenter från vår affärsverksamhet. Du rapporterar till Process Support & IT manager och du kommer att ingå i en grupp av totalt tio personer som tillsammans utgör den interna Process Support & IT avdelningen.\n\nUtöver arbetet med förvaltning kommer det även ingå en del projektarbete där du tillsammans med kollegor på gruppen stöttar verksamheten att genomföra aktiviteter som bidrar till verksamhetens utveckling.\n\nDet huvudsakliga ansvaret i rollen innebär att du skall:\n\n\n• Hantera förvaltningsärenden och incidenter på daglig basis\n• Dokumentera och underhålla systemdokumentation\n• Bygga automation inom förvaltningsrådet\n• Delaktig i utvecklingsprojekt/aktiviteter\n\nTjänsten är förlagd till Scania Finans huvudkontor i Södertälje. Scania Finans erbjuder delvis hemarbete och har en intention om att vara en flexibel arbetsgivare. \n\nDin profil\n För att lyckas och trivas i tjänsten krävs det att du:\n\n\n• Har något/några års erfarenhet av arbete med applikationsförvaltning eller IT incidenthantering\n• Har kunskap i PowerShell scriptning\n• Har kunskap i MS SQL\n• Behärskar svenska och engelska i så väl tal som i skrift\n• Är serviceinriktad och lösningsorienterad\n• Kan hantera förändringar och vara flexibel\n• Duktig på att organisera och planera\n\nNedan punkter är meriterande, men inte ett krav:\n\n\n• Kunskap i BanqSoft system (PreView, CoreView)\n• Kunskap om och har jobbat med finansiella processer\n\nSom person ser vi att du är nyfiken att lära och naturligt sätter kunden i fokus.\n\nAnsökan\n Din ansökan skall innehålla både CV och personligt brev och vara oss tillhanda senast den 14 augusti.\n\nEn bakgrundskontroll kan även komma att genomföras för denna tjänst.\n\nVi ser fram emot din ansökan!\n\nOm oss\n\nScania Finans AB (SFA) är ett finansbolag som ingår i affärsområdet Scania Financial Services. SFA erbjuder finansiering och försäkring av Scanias produkter genom filialer i Norden och Baltikum. Företaget grundades 1947 och har idag en finansieringsportfölj på ca. 19 miljarder, vilket gör SFA till det äldsta och det största finansbolagen inom Scania Financial Services. Företaget har ca. 100 anställda varav ca. 40 stycken sitter på huvudkontoret i Södertälje.\n\n#LI-Hybrid"
}