{
  "meta" : {
    "jobad" : {
      "description" : {
        "requirements" : null,
        "needs" : null,
        "company_information" : null,
        "text_formatted" : "<p>Vi söker dig som: </p><p>-Är glad, utåtriktad &amp; brinner för kundservice</p><p>-Vill vara en i gänget</p><p>-Har gediget intresse för nagelvård och vill utvecklas</p><p>-Diplomerad Nagelterapeut med erfarenhet av fotvård  </p><p><br></p><p>Vi erbjuder: </p><p>-Anställning (hel- eller deltid)</p><p id=\"oppenforalla\">Öppen för alla\nVi fokuserar på din kompetens, inte dina övriga förutsättningar. Vi är öppna för att anpassa rollen eller arbetsplatsen efter dina behov.</p>",
        "conditions" : null,
        "text" : "Vi söker dig som: \n-Är glad, utåtriktad & brinner för kundservice\n-Vill vara en i gänget\n-Har gediget intresse för nagelvård och vill utvecklas\n-Diplomerad Nagelterapeut med erfarenhet av fotvård  \n\n\nVi erbjuder: \n-Anställning (hel- eller deltid)\nÖppen för alla\nVi fokuserar på din kompetens, inte dina övriga förutsättningar. Vi är öppna för att anpassa rollen eller arbetsplatsen efter dina behov."
      },
      "headline" : "Nagelteknolog & pedikyr",
      "driving_license" : null,
      "employer" : {
        "email" : null,
        "phone_number" : null,
        "organization_number" : null,
        "name" : "Järfälla laserklinik",
        "url" : "www.jarfallaskonhet.se",
        "workplace" : "Järfälla skönhet "
      },
      "removed_date" : null,
      "logo_url" : "https://www.arbetsformedlingen.se/rest/arbetsgivare/rest/af/v3/arbetsplatser/88028273/logotyper/logo.png",
      "last_publication_date" : "2022-08-04T00:00:00",
      "number_of_vacancies" : 1,
      "occupation" : {
        "concept_id" : "JjXV_QEg_EQ1",
        "label" : "Nagelterapeut/Nagelteknolog",
        "legacy_ams_taxonomy_id" : "5439"
      },
      "occupation_group" : {
        "concept_id" : "ezKk_kss_CiQ",
        "label" : "Övriga skönhets- och kroppsterapeuter",
        "legacy_ams_taxonomy_id" : "5149"
      },
      "employment_type" : {
        "concept_id" : "PFZr_Syz_cUq",
        "label" : "Vanlig anställning",
        "legacy_ams_taxonomy_id" : "1"
      },
      "webpage_url" : "https://arbetsformedlingen.se/platsbanken/annonser/26292595",
      "driving_license_required" : false,
      "application_contacts" : [ {
        "description" : null,
        "email" : "Info@jarfallaskonhet.se",
        "telephone" : "0739160998, 0739160998",
        "name" : "Parisa Zaeimi",
        "contact_type" : "Vd"
      } ],
      "duration" : {
        "concept_id" : "a7uU_j21_mkL",
        "label" : "Tills vidare",
        "legacy_ams_taxonomy_id" : "1"
      },
      "nice_to_have" : {
        "education_level" : [ ],
        "work_experiences" : [ {
          "concept_id" : "JjXV_QEg_EQ1",
          "weight" : 5,
          "label" : "Nagelterapeut/Nagelteknolog",
          "legacy_ams_taxonomy_id" : "5439"
        } ],
        "skills" : [ ],
        "education" : [ ],
        "languages" : [ ]
      },
      "application_details" : {
        "via_af" : false,
        "email" : "Info@jarfallaskonhet.se",
        "other" : null,
        "reference" : null,
        "url" : null,
        "information" : null
      },
      "source_type" : "VIA_ANNONSERA",
      "application_deadline" : "2022-08-04T00:00:00",
      "external_id" : null,
      "workplace_address" : {
        "coordinates" : [ 17.800919921067283, 59.411910912395165 ],
        "city" : "Järfälla",
        "postcode" : "17545",
        "municipality" : "Järfälla",
        "region_concept_id" : "CifL_Rzy_Mku",
        "region" : "Stockholms län",
        "country_code" : "199",
        "region_code" : "01",
        "municipality_concept_id" : "qm5H_jsD_fUF",
        "country_concept_id" : "i46j_HmG_v64",
        "municipality_code" : "0123",
        "street_address" : "Viksjöplan 43",
        "country" : "Sverige"
      },
      "id" : "26292595",
      "experience_required" : true,
      "working_hours_type" : {
        "concept_id" : "6YE1_gAC_R2G",
        "label" : "Heltid",
        "legacy_ams_taxonomy_id" : "1"
      },
      "access" : null,
      "timestamp" : 1656977015778,
      "must_have" : {
        "education_level" : [ ],
        "work_experiences" : [ ],
        "skills" : [ ],
        "education" : [ ],
        "languages" : [ ]
      },
      "occupation_field" : {
        "concept_id" : "Uuf1_GMh_Uvw",
        "label" : "Kropps- och skönhetsvård",
        "legacy_ams_taxonomy_id" : "4"
      },
      "scope_of_work" : {
        "min" : 0,
        "max" : 100
      },
      "salary_type" : {
        "concept_id" : "oG8G_9cW_nRf",
        "label" : "Fast månads- vecko- eller timlön",
        "legacy_ams_taxonomy_id" : "1"
      },
      "removed" : false,
      "salary_description" : null,
      "access_to_own_car" : false,
      "publication_date" : "2022-07-05T01:23:35"
    },
    "name" : "Nagelteknolog & pedikyr",
    "user" : "hannes"
  },
  "sha1" : "fefab748b10abdd9677da88ea04295ce5db009e9",
  "annotations" : [ {
    "preferred-label" : "Nagelterapeut/Nagelteknolog",
    "sentiment" : "MUST_HAVE",
    "type" : "occupation-name",
    "start-position" : 0,
    "end-position" : 13,
    "concept-id" : "JjXV_QEg_EQ1",
    "matched-string" : "nagelteknolog",
    "annotation-id" : 0
  }, {
    "preferred-label" : "Fotvård/Pedikyr",
    "sentiment" : "MUST_HAVE",
    "type" : "skill",
    "start-position" : 16,
    "end-position" : 23,
    "concept-id" : "5APZ_gLs_AB4",
    "matched-string" : "pedikyr",
    "annotation-id" : 1
  }, {
    "preferred-label" : "kundservice",
    "sentiment" : "MUST_HAVE",
    "type" : "esco-skill",
    "start-position" : 78,
    "end-position" : 89,
    "concept-id" : "WykS_79d_Fz7",
    "matched-string" : "kundservice",
    "annotation-id" : 2
  }, {
    "preferred-label" : "Nagelterapeut/Nagelteknolog",
    "sentiment" : "MUST_HAVE",
    "type" : "occupation-name",
    "start-position" : 180,
    "end-position" : 193,
    "concept-id" : "JjXV_QEg_EQ1",
    "matched-string" : "nagelterapeut",
    "annotation-id" : 3
  }, {
    "preferred-label" : "fotvård",
    "sentiment" : "MUST_HAVE",
    "type" : "esco-skill",
    "start-position" : 212,
    "end-position" : 219,
    "concept-id" : "aRM1_2Jc_Eww",
    "matched-string" : "fotvård",
    "annotation-id" : 4
  }, {
    "preferred-label" : "Heltid/Deltid",
    "type" : "worktime-extent",
    "start-position" : 252,
    "end-position" : 269,
    "concept-id" : "hGCt_6Ni_XPz",
    "matched-string" : "hel- eller deltid",
    "annotation-id" : 5
  } ],
  "text" : "Nagelteknolog & pedikyr\nVi söker dig som: \n-Är glad, utåtriktad & brinner för kundservice\n-Vill vara en i gänget\n-Har gediget intresse för nagelvård och vill utvecklas\n-Diplomerad Nagelterapeut med erfarenhet av fotvård  \n\n\nVi erbjuder: \n-Anställning (hel- eller deltid)\nÖppen för alla\nVi fokuserar på din kompetens, inte dina övriga förutsättningar. Vi är öppna för att anpassa rollen eller arbetsplatsen efter dina behov."
}