{
  "meta" : {
    "jobad" : {
      "description" : {
        "requirements" : null,
        "needs" : null,
        "company_information" : null,
        "text_formatted" : "Gör skillnad. Varje dag.\n\nÄr du en biomedicinsk analytiker som söker efter en ny utmaning? Vill du ha ett ansvarsfullt, utvecklande och självständigt arbete i en härlig arbetsmiljö? Då kan detta vara rätt tjänst för dig!\n\nMedicinsk service ger stöd och service till den skånska hälso- och sjukvården. Våra tjänster omfattar alltifrån laboratoriemedicin och medicinsk teknik till uppdrag inom prehospital sjukvård och forskning. Vi är cirka 2 100 medarbetare inom förvaltningen. \n\nLaboratoriemedicin Bas är ett specialitetsoberoende och växande verksamhetsområde i förvaltningen. Vi förser vården med diagnostik till stöd för vård och behandling samt bedriver en bred och högteknologisk verksamhet inom specialiteterna; klinisk kemi, klinisk mikrobiologi, klinisk immunologi och transfusionsmedicin samt provtagning och funktionsundersökningar. Vår verksamhet kommer under de närmsta åren att expandera ytterligare för att anpassa diagnostikutbudet för den framtida vården.\n\nVerksamhetens uppdrag omfattar förutom diagnostik även konsultverksamhet för sjukvården, utbildning av bland annat läkare och biomedicinska analytiker samt samarbete med universitet kring aktuella forsknings- och utvecklingsprojekt. I vår verksamhet ingår även område bild- och laboratorieteknik som ansvarar för den medicintekniska säkerheten.\n\nFör att upprätthålla kvalitet och kompetens samverkar vi kontinuerligt med övriga verksamhetsområden inom förvaltningen och har nära samarbete med både chefer, processledare och läkare inom dessa specialiteter. Tillsammans arbetar vi aktivt med att utveckla och förbättra metoder, flöden och processer för att skapa konkurrenskraft anpassad till sjukvårdens framtida behov\n\nVerksamheten bedrivs på tio orter i Skåne och består av drygt 500 medarbetare där den största personalkategorin är biomedicinska analytiker. Vi har även andra yrkeskategorier hos oss så som biomedicinare, administratörer, undersköterskor och sjuksköterskor. \n\nTillsammans skickar vi årligen ut cirka 17 miljoner provsvar.\r\n\r\nARBETSUPPGIFTER\nNu har du chansen att bli en av oss på Laboratoriemedicin Bas i Kristianstad. Hos erbjuds du ett varierande arbete med goda möjligheter att påverka. Vi välkomnar dig som vill vara med i vår verksamhets fortsatta utveckling.\n\nSom biomedicinsk analytiker är din ansvarsområden inriktade på kliniskt kemiskt analysarbete, inklusive ven- och kapillärprovtagning på såväl vuxna som barn. Vidare har du även ansvar för funktionsundersökningar. De flesta av analysområden inom klinisk kemi utförs i Kristianstad, men kommer du även ägna dig åt analysarbete inom transfusionsmedicin och mikrobiologi. Utöver det kommer du också vara aktiv i verksamhetsområdets kvalitetsarbete på vårt laboratorium med ansvar för upplärning och utbildning av nya medarbetare och studenter. \n\nSom ny medarbetare hos oss får du genomgå ett internt upplärningsprogram som sker på dagtid. Därefter kan din arbetstid omfatta dag-, kvälls-, helg- och nattjänstgöring. Din placeringsort är Kristianstad, men även arbete i Hässleholm kan förekomma.\r\n\r\nKVALIFIKATIONER\nDu som söker är legitimerad biomedicinsk analytiker med behörighet att verka inom svensk sjukvård. Språkkunskap i svenska motsvarande lägst nivå C1 enligt Europarådets nivåskala är ett krav. Om du har kunskap i övriga språk ses det som meriterande för tjänsten. För tjänsten är det fördelaktigt om du ha erfarenhet av analysarbete inom transfusionsmedicin och/eller klinisk kemi samt kunskap och erfarenhet av ven- och kapillärprovtagning på vuxna och barn.\n\nSom person är du ansvarstagande och empatisk med god förmåga att arbeta såväl självständigt som i grupp. Du är kvalitetsmedveten och noggrann i ditt arbete och har ett strukturerat förhållningssätt. Vidare är du professionell i ditt bemötande och kan kommunicera med både interna och externa kontakter. Vid intensiva perioder kräver ditt arbete att du kan prioritera om och anpassa dig vid ändrade omständigheter samt att du har förmågan att anpassa dig till ändrad planering.\n\nVid tillsättning av tjänsterna kommer vi lägga stor vikt på de personliga egenskaperna som måste harmonisera med Region Skånes värderingar. Stor vikt kommer läggas vid personlig lämplighet.\n\nI denna process tillämpas löpande urval. Varmt välkommen med din ansökan, vi ser fram emot att lära känna dig!\r\n\nÖVRIGT\nRegion Skåne finns till för att alla som bor i Skåne ska må bra och känna framtidstro. Genom gränslösa samarbeten och omtanke skapas de bästa förutsättningar för ett hälsosamt liv  inom näringsliv, kollektivtrafik, kultur och hälso- och sjukvård  i Skåne. Tillsammans gör vi livet mera möjligt. \n\nMedicinsk service är en av Region Skånes sex hälso- och sjukvårdsförvaltningar, med cirka 2 000 medarbetare. Vi möter vårdens behov av ambulanssjukvård, bild- och laboratorieteknik, klinisk träning, laboratoriemedicin och sjukvårdsrådgivning. Den laboratoriemedicinska verksamheten omfattar områdena arbets- och miljömedicin, biobank, genetik, immunologi och transfusionsmedicin, kemi, farmakologi, mikrobiologi samt patologi. Förvaltningen bedriver även forskning och utveckling inom sina områden.\n\nPå http://www.skane.se/rekryteringsstatus kan du se i vilket skede Region Skånes rekryteringar befinner sig och hur många som har sökt tjänsterna. \n\nTill bemannings- och rekryteringsföretag och till dig som är försäljare: Vi undanber oss vänligen men bestämt direktkontakt med bemannings- och rekryteringsföretag samt försäljare av ytterligare jobbannonser.",
        "conditions" : "Heltid. \r\nTillsvidareanställning, tillträde: Tillträde: Enligt överenskommelse.",
        "text" : "Gör skillnad. Varje dag.\n\nÄr du en biomedicinsk analytiker som söker efter en ny utmaning? Vill du ha ett ansvarsfullt, utvecklande och självständigt arbete i en härlig arbetsmiljö? Då kan detta vara rätt tjänst för dig!\n\nMedicinsk service ger stöd och service till den skånska hälso- och sjukvården. Våra tjänster omfattar alltifrån laboratoriemedicin och medicinsk teknik till uppdrag inom prehospital sjukvård och forskning. Vi är cirka 2 100 medarbetare inom förvaltningen. \n\nLaboratoriemedicin Bas är ett specialitetsoberoende och växande verksamhetsområde i förvaltningen. Vi förser vården med diagnostik till stöd för vård och behandling samt bedriver en bred och högteknologisk verksamhet inom specialiteterna; klinisk kemi, klinisk mikrobiologi, klinisk immunologi och transfusionsmedicin samt provtagning och funktionsundersökningar. Vår verksamhet kommer under de närmsta åren att expandera ytterligare för att anpassa diagnostikutbudet för den framtida vården.\n\nVerksamhetens uppdrag omfattar förutom diagnostik även konsultverksamhet för sjukvården, utbildning av bland annat läkare och biomedicinska analytiker samt samarbete med universitet kring aktuella forsknings- och utvecklingsprojekt. I vår verksamhet ingår även område bild- och laboratorieteknik som ansvarar för den medicintekniska säkerheten.\n\nFör att upprätthålla kvalitet och kompetens samverkar vi kontinuerligt med övriga verksamhetsområden inom förvaltningen och har nära samarbete med både chefer, processledare och läkare inom dessa specialiteter. Tillsammans arbetar vi aktivt med att utveckla och förbättra metoder, flöden och processer för att skapa konkurrenskraft anpassad till sjukvårdens framtida behov\n\nVerksamheten bedrivs på tio orter i Skåne och består av drygt 500 medarbetare där den största personalkategorin är biomedicinska analytiker. Vi har även andra yrkeskategorier hos oss så som biomedicinare, administratörer, undersköterskor och sjuksköterskor. \n\nTillsammans skickar vi årligen ut cirka 17 miljoner provsvar.\r\n\r\nARBETSUPPGIFTER\nNu har du chansen att bli en av oss på Laboratoriemedicin Bas i Kristianstad. Hos erbjuds du ett varierande arbete med goda möjligheter att påverka. Vi välkomnar dig som vill vara med i vår verksamhets fortsatta utveckling.\n\nSom biomedicinsk analytiker är din ansvarsområden inriktade på kliniskt kemiskt analysarbete, inklusive ven- och kapillärprovtagning på såväl vuxna som barn. Vidare har du även ansvar för funktionsundersökningar. De flesta av analysområden inom klinisk kemi utförs i Kristianstad, men kommer du även ägna dig åt analysarbete inom transfusionsmedicin och mikrobiologi. Utöver det kommer du också vara aktiv i verksamhetsområdets kvalitetsarbete på vårt laboratorium med ansvar för upplärning och utbildning av nya medarbetare och studenter. \n\nSom ny medarbetare hos oss får du genomgå ett internt upplärningsprogram som sker på dagtid. Därefter kan din arbetstid omfatta dag-, kvälls-, helg- och nattjänstgöring. Din placeringsort är Kristianstad, men även arbete i Hässleholm kan förekomma.\r\n\r\nKVALIFIKATIONER\nDu som söker är legitimerad biomedicinsk analytiker med behörighet att verka inom svensk sjukvård. Språkkunskap i svenska motsvarande lägst nivå C1 enligt Europarådets nivåskala är ett krav. Om du har kunskap i övriga språk ses det som meriterande för tjänsten. För tjänsten är det fördelaktigt om du ha erfarenhet av analysarbete inom transfusionsmedicin och/eller klinisk kemi samt kunskap och erfarenhet av ven- och kapillärprovtagning på vuxna och barn.\n\nSom person är du ansvarstagande och empatisk med god förmåga att arbeta såväl självständigt som i grupp. Du är kvalitetsmedveten och noggrann i ditt arbete och har ett strukturerat förhållningssätt. Vidare är du professionell i ditt bemötande och kan kommunicera med både interna och externa kontakter. Vid intensiva perioder kräver ditt arbete att du kan prioritera om och anpassa dig vid ändrade omständigheter samt att du har förmågan att anpassa dig till ändrad planering.\n\nVid tillsättning av tjänsterna kommer vi lägga stor vikt på de personliga egenskaperna som måste harmonisera med Region Skånes värderingar. Stor vikt kommer läggas vid personlig lämplighet.\n\nI denna process tillämpas löpande urval. Varmt välkommen med din ansökan, vi ser fram emot att lära känna dig!\r\n\nÖVRIGT\nRegion Skåne finns till för att alla som bor i Skåne ska må bra och känna framtidstro. Genom gränslösa samarbeten och omtanke skapas de bästa förutsättningar för ett hälsosamt liv  inom näringsliv, kollektivtrafik, kultur och hälso- och sjukvård  i Skåne. Tillsammans gör vi livet mera möjligt. \n\nMedicinsk service är en av Region Skånes sex hälso- och sjukvårdsförvaltningar, med cirka 2 000 medarbetare. Vi möter vårdens behov av ambulanssjukvård, bild- och laboratorieteknik, klinisk träning, laboratoriemedicin och sjukvårdsrådgivning. Den laboratoriemedicinska verksamheten omfattar områdena arbets- och miljömedicin, biobank, genetik, immunologi och transfusionsmedicin, kemi, farmakologi, mikrobiologi samt patologi. Förvaltningen bedriver även forskning och utveckling inom sina områden.\n\nPå http://www.skane.se/rekryteringsstatus kan du se i vilket skede Region Skånes rekryteringar befinner sig och hur många som har sökt tjänsterna. \n\nTill bemannings- och rekryteringsföretag och till dig som är försäljare: Vi undanber oss vänligen men bestämt direktkontakt med bemannings- och rekryteringsföretag samt försäljare av ytterligare jobbannonser."
      },
      "headline" : "Biomedicinsk analytiker till Laboratoriemedicin Bas i Kristianstad",
      "driving_license" : null,
      "employer" : {
        "email" : null,
        "phone_number" : null,
        "organization_number" : "2321000255",
        "name" : "REGION SKÅNE",
        "url" : null,
        "workplace" : "Region Skåne, Medicinsk service"
      },
      "removed_date" : null,
      "logo_url" : "https://www.arbetsformedlingen.se/rest/arbetsgivare/rest/af/v3/organisation/2321000255/logotyper/logo.png",
      "last_publication_date" : "2022-08-31T23:59:59",
      "number_of_vacancies" : 5,
      "occupation" : {
        "concept_id" : "Pj8T_bST_f7D",
        "label" : "Biomedicinsk analytiker",
        "legacy_ams_taxonomy_id" : "5734"
      },
      "occupation_group" : {
        "concept_id" : "wNrt_Ysj_WuT",
        "label" : "Biomedicinska analytiker m.fl.",
        "legacy_ams_taxonomy_id" : "3212"
      },
      "employment_type" : {
        "concept_id" : "PFZr_Syz_cUq",
        "label" : "Vanlig anställning",
        "legacy_ams_taxonomy_id" : "1"
      },
      "webpage_url" : "https://arbetsformedlingen.se/platsbanken/annonser/26351950",
      "driving_license_required" : false,
      "application_contacts" : [ {
        "description" : "Tove Björnberg",
        "email" : null,
        "telephone" : "044-309 19 49",
        "name" : null,
        "contact_type" : "Biträdande verksamhetschef"
      }, {
        "description" : "Kristina Helgotsson",
        "email" : null,
        "telephone" : "0724-63 40 14",
        "name" : null,
        "contact_type" : "Enhetschef"
      } ],
      "duration" : {
        "concept_id" : "a7uU_j21_mkL",
        "label" : "Tills vidare",
        "legacy_ams_taxonomy_id" : "1"
      },
      "nice_to_have" : {
        "education_level" : [ ],
        "work_experiences" : [ ],
        "skills" : [ ],
        "education" : [ ],
        "languages" : [ ]
      },
      "application_details" : {
        "via_af" : false,
        "email" : null,
        "other" : null,
        "reference" : "C96946",
        "url" : "https://recruit.visma.com/Public/Apply.aspx?guidAssignment=9d85d0f1-5286-453e-99ea-f456dc8baf14&publishCode=AMS&TK=708e199a-646e-43b4-a4d0-b0a525bbc77e",
        "information" : null
      },
      "source_type" : "VIA_PLATSBANKEN_DXA",
      "application_deadline" : "2022-08-31T23:59:59",
      "external_id" : "46-232100-0255-9D85D0F15286453E99EAF456DC8BAF14",
      "workplace_address" : {
        "coordinates" : [ 14.156678, 56.029392 ],
        "city" : null,
        "postcode" : null,
        "municipality" : "Kristianstad",
        "region_concept_id" : "CaRE_1nn_cSU",
        "region" : "Skåne län",
        "country_code" : "199",
        "region_code" : "12",
        "municipality_concept_id" : "vrvW_sr8_1en",
        "country_concept_id" : "i46j_HmG_v64",
        "municipality_code" : "1290",
        "street_address" : null,
        "country" : "Sverige"
      },
      "id" : "26351950",
      "experience_required" : false,
      "working_hours_type" : {
        "concept_id" : "6YE1_gAC_R2G",
        "label" : "Heltid",
        "legacy_ams_taxonomy_id" : "1"
      },
      "access" : null,
      "timestamp" : 1658751624093,
      "must_have" : {
        "education_level" : [ ],
        "work_experiences" : [ ],
        "skills" : [ ],
        "education" : [ ],
        "languages" : [ ]
      },
      "occupation_field" : {
        "concept_id" : "kJeN_wmw_9wX",
        "label" : "Naturvetenskap",
        "legacy_ams_taxonomy_id" : "14"
      },
      "scope_of_work" : {
        "min" : 100,
        "max" : 100
      },
      "salary_type" : {
        "concept_id" : "oG8G_9cW_nRf",
        "label" : "Fast månads- vecko- eller timlön",
        "legacy_ams_taxonomy_id" : "1"
      },
      "removed" : false,
      "salary_description" : "Enligt avtal.",
      "access_to_own_car" : false,
      "publication_date" : "2022-07-25T14:20:24"
    },
    "name" : "Biomedicinsk analytiker till Laboratoriemedicin Bas i Kristianstad",
    "user" : "hannes"
  },
  "sha1" : "3a0727f27f89b0daca7a7d36190725d79440ff04",
  "annotations" : [ {
    "preferred-label" : "Biomedicinsk analytiker/BMA",
    "sentiment" : "MUST_HAVE",
    "type" : "occupation-name",
    "start-position" : 0,
    "end-position" : 23,
    "concept-id" : "Pj8T_bST_f7D",
    "matched-string" : "biomedicinsk analytiker",
    "annotation-id" : 0
  }, {
    "preferred-label" : "Kristianstad",
    "type" : "municipality",
    "start-position" : 54,
    "end-position" : 66,
    "concept-id" : "vrvW_sr8_1en",
    "matched-string" : "Kristianstad",
    "annotation-id" : 35
  }, {
    "preferred-label" : "Biomedicinsk analytiker/BMA",
    "sentiment" : "MUST_HAVE",
    "type" : "occupation-name",
    "start-position" : 102,
    "end-position" : 125,
    "concept-id" : "Pj8T_bST_f7D",
    "matched-string" : "biomedicinsk analytiker",
    "annotation-id" : 1
  }, {
    "preferred-label" : "arbeta självständigt",
    "type" : "esco-skill",
    "start-position" : 203,
    "end-position" : 223,
    "concept-id" : "NyFu_HHd_zhz",
    "matched-string" : "självständigt arbete",
    "annotation-id" : 36
  }, {
    "preferred-label" : "arbetsmiljö",
    "sentiment" : "MUST_HAVE",
    "type" : "esco-skill",
    "start-position" : 236,
    "end-position" : 247,
    "concept-id" : "zdQY_QJh_nUH",
    "matched-string" : "arbetsmiljö",
    "annotation-id" : 2
  }, {
    "preferred-label" : "Skånska",
    "sentiment" : "MUST_HAVE",
    "type" : "skill",
    "start-position" : 337,
    "end-position" : 344,
    "concept-id" : "a3P4_Tzp_csR",
    "matched-string" : "skånska",
    "annotation-id" : 3
  }, {
    "preferred-label" : "Hälso- och sjukvård",
    "type" : "sni-level-2",
    "start-position" : 345,
    "end-position" : 366,
    "concept-id" : "KhNL_Quq_Xjk",
    "matched-string" : "hälso- och sjukvården",
    "annotation-id" : 37
  }, {
    "preferred-label" : "klinisk kemi",
    "sentiment" : "MUST_HAVE",
    "type" : "esco-skill",
    "start-position" : 786,
    "end-position" : 798,
    "concept-id" : "t9By_k6F_Hav",
    "matched-string" : "klinisk kemi",
    "annotation-id" : 5
  }, {
    "preferred-label" : "klinisk mikrobiologi",
    "type" : "esco-skill",
    "start-position" : 800,
    "end-position" : 820,
    "concept-id" : "j794_7DV_GAf",
    "matched-string" : "klinisk mikrobiologi",
    "annotation-id" : 38
  }, {
    "preferred-label" : "Klinisk immunologi och transfusionsmedicin",
    "sentiment" : "MUST_HAVE",
    "type" : "skill",
    "start-position" : 822,
    "end-position" : 864,
    "concept-id" : "DwyB_rQR_wZZ",
    "matched-string" : "klinisk immunologi och transfusionsmedicin",
    "annotation-id" : 7
  }, {
    "preferred-label" : "läkare",
    "sentiment" : "MUST_HAVE",
    "type" : "esco-occupation",
    "start-position" : 1156,
    "end-position" : 1162,
    "concept-id" : "snUT_QSf_LG9",
    "matched-string" : "läkare",
    "annotation-id" : 8
  }, {
    "preferred-label" : "Biomedicinska analytiker m.fl.",
    "type" : "ssyk-level-4",
    "start-position" : 1167,
    "end-position" : 1191,
    "concept-id" : "wNrt_Ysj_WuT",
    "matched-string" : "biomedicinska analytiker",
    "annotation-id" : 39
  }, {
    "preferred-label" : "medicinsk bildteknik",
    "type" : "esco-skill",
    "start-position" : 1309,
    "end-position" : 1313,
    "concept-id" : "vJSD_WWT_EqH",
    "matched-string" : "bild",
    "annotation-id" : 40
  }, {
    "preferred-label" : "Laboratorieteknik (allmän)",
    "sentiment" : "MUST_HAVE",
    "type" : "keyword",
    "start-position" : 1319,
    "end-position" : 1336,
    "concept-id" : "hwCv_Zc3_HSC",
    "matched-string" : "laboratorieteknik",
    "annotation-id" : 9
  }, {
    "preferred-label" : "läkare",
    "sentiment" : "MUST_HAVE",
    "type" : "esco-occupation",
    "start-position" : 1565,
    "end-position" : 1571,
    "concept-id" : "snUT_QSf_LG9",
    "matched-string" : "läkare",
    "annotation-id" : 10
  }, {
    "preferred-label" : "Skåne län",
    "type" : "region",
    "start-position" : 1797,
    "end-position" : 1802,
    "concept-id" : "CaRE_1nn_cSU",
    "matched-string" : "Skåne",
    "annotation-id" : 41
  }, {
    "preferred-label" : "Biomedicinska analytiker m.fl.",
    "type" : "ssyk-level-4",
    "start-position" : 1876,
    "end-position" : 1900,
    "concept-id" : "wNrt_Ysj_WuT",
    "matched-string" : "biomedicinska analytiker",
    "annotation-id" : 42
  }, {
    "preferred-label" : "Biomedicinare",
    "sentiment" : "MUST_HAVE",
    "type" : "occupation-name",
    "start-position" : 1951,
    "end-position" : 1964,
    "concept-id" : "mQAY_wtA_7G2",
    "matched-string" : "biomedicinare",
    "annotation-id" : 11
  }, {
    "preferred-label" : "Undersköterskor",
    "sentiment" : "MUST_HAVE",
    "type" : "ssyk-level-3",
    "start-position" : 1983,
    "end-position" : 1998,
    "concept-id" : "3EJj_WLs_kgD",
    "matched-string" : "undersköterskor",
    "annotation-id" : 12
  }, {
    "preferred-label" : "Sjuksköterskor",
    "sentiment" : "MUST_HAVE",
    "type" : "ssyk-level-3",
    "start-position" : 2003,
    "end-position" : 2017,
    "concept-id" : "jzaN_Vqk_TP1",
    "matched-string" : "sjuksköterskor",
    "annotation-id" : 13
  }, {
    "preferred-label" : "Kristianstad",
    "type" : "municipality",
    "start-position" : 2166,
    "end-position" : 2178,
    "concept-id" : "vrvW_sr8_1en",
    "matched-string" : "Kristianstad",
    "annotation-id" : 43
  }, {
    "preferred-label" : "Biomedicinsk analytiker/BMA",
    "sentiment" : "MUST_HAVE",
    "type" : "occupation-name",
    "start-position" : 2331,
    "end-position" : 2354,
    "concept-id" : "Pj8T_bST_f7D",
    "matched-string" : "biomedicinsk analytiker",
    "annotation-id" : 14
  }, {
    "preferred-label" : "Klinisk kemi",
    "type" : "skill",
    "start-position" : 2390,
    "end-position" : 2406,
    "concept-id" : "BjwN_gCH_doC",
    "matched-string" : "kliniskt kemiskt",
    "annotation-id" : 44
  }, {
    "preferred-label" : "klinisk kemi",
    "sentiment" : "MUST_HAVE",
    "type" : "esco-skill",
    "start-position" : 2572,
    "end-position" : 2584,
    "concept-id" : "t9By_k6F_Hav",
    "matched-string" : "klinisk kemi",
    "annotation-id" : 15
  }, {
    "preferred-label" : "Kristianstad",
    "type" : "municipality",
    "start-position" : 2594,
    "end-position" : 2606,
    "concept-id" : "vrvW_sr8_1en",
    "matched-string" : "Kristianstad",
    "annotation-id" : 45
  }, {
    "preferred-label" : "Transfusionsmedicin",
    "sentiment" : "MUST_HAVE",
    "type" : "skill",
    "start-position" : 2657,
    "end-position" : 2676,
    "concept-id" : "W6Au_KRK_f6e",
    "matched-string" : "transfusionsmedicin",
    "annotation-id" : 16
  }, {
    "preferred-label" : "Mikrobiologi",
    "sentiment" : "MUST_HAVE",
    "type" : "skill",
    "start-position" : 2681,
    "end-position" : 2693,
    "concept-id" : "6de1_7CM_XL6",
    "matched-string" : "mikrobiologi",
    "annotation-id" : 17
  }, {
    "preferred-label" : "Kristianstad",
    "type" : "municipality",
    "start-position" : 3060,
    "end-position" : 3072,
    "concept-id" : "vrvW_sr8_1en",
    "matched-string" : "Kristianstad",
    "annotation-id" : 46
  }, {
    "preferred-label" : "Hässleholm",
    "type" : "municipality",
    "start-position" : 3092,
    "end-position" : 3102,
    "concept-id" : "bP5q_53x_aqJ",
    "matched-string" : "Hässleholm",
    "annotation-id" : 47
  }, {
    "preferred-label" : "Biomedicinsk analytiker/BMA",
    "sentiment" : "MUST_HAVE",
    "type" : "occupation-name",
    "start-position" : 3165,
    "end-position" : 3188,
    "concept-id" : "Pj8T_bST_f7D",
    "matched-string" : "biomedicinsk analytiker",
    "annotation-id" : 18
  }, {
    "preferred-label" : "Svenska",
    "sentiment" : "MUST_HAVE",
    "type" : "language",
    "start-position" : 3251,
    "end-position" : 3258,
    "concept-id" : "zSLA_vw2_FXN",
    "matched-string" : "svenska",
    "annotation-id" : 19
  }, {
    "preferred-label" : "Transfusionsmedicin",
    "sentiment" : "MUST_HAVE",
    "type" : "skill",
    "start-position" : 3473,
    "end-position" : 3492,
    "concept-id" : "W6Au_KRK_f6e",
    "matched-string" : "transfusionsmedicin",
    "annotation-id" : 20
  }, {
    "preferred-label" : "klinisk kemi",
    "sentiment" : "MUST_HAVE",
    "type" : "esco-skill",
    "start-position" : 3503,
    "end-position" : 3515,
    "concept-id" : "t9By_k6F_Hav",
    "matched-string" : "klinisk kemi",
    "annotation-id" : 21
  }, {
    "preferred-label" : "visa ansvarstagande",
    "type" : "esco-skill",
    "start-position" : 3613,
    "end-position" : 3627,
    "concept-id" : "bcRp_hxV_f5G",
    "matched-string" : "ansvarstagande",
    "annotation-id" : 48
  }, {
    "preferred-label" : "arbeta självständigt",
    "type" : "esco-skill",
    "start-position" : 3661,
    "end-position" : 3667,
    "concept-id" : "NyFu_HHd_zhz",
    "matched-string" : "arbeta",
    "annotation-id" : 50
  }, {
    "preferred-label" : "arbeta självständigt",
    "type" : "esco-skill",
    "start-position" : 3674,
    "end-position" : 3687,
    "concept-id" : "NyFu_HHd_zhz",
    "matched-string" : "självständigt",
    "annotation-id" : 49
  }, {
    "preferred-label" : "noggrannhet",
    "type" : "esco-skill",
    "start-position" : 3729,
    "end-position" : 3737,
    "concept-id" : "mrsW_EkL_KRD",
    "matched-string" : "noggrann",
    "annotation-id" : 51
  }, {
    "preferred-label" : "Skåne län",
    "type" : "region",
    "start-position" : 4385,
    "end-position" : 4397,
    "concept-id" : "CaRE_1nn_cSU",
    "matched-string" : "Region Skåne",
    "annotation-id" : 52
  }, {
    "preferred-label" : "Skåne län",
    "type" : "region",
    "start-position" : 4432,
    "end-position" : 4437,
    "concept-id" : "CaRE_1nn_cSU",
    "matched-string" : "Skåne",
    "annotation-id" : 53
  }, {
    "preferred-label" : "Kollektivtrafik",
    "sentiment" : "MUST_HAVE",
    "type" : "sni-level-4",
    "start-position" : 4583,
    "end-position" : 4598,
    "concept-id" : "XVG5_tVe_RFd",
    "matched-string" : "kollektivtrafik",
    "annotation-id" : 22
  }, {
    "preferred-label" : "Hälso- och sjukvård",
    "type" : "occupation-field",
    "start-position" : 4611,
    "end-position" : 4630,
    "concept-id" : "NYW6_mP6_vwf",
    "matched-string" : "hälso- och sjukvård",
    "annotation-id" : 57
  }, {
    "preferred-label" : "Skåne län",
    "type" : "region",
    "start-position" : 4634,
    "end-position" : 4639,
    "concept-id" : "CaRE_1nn_cSU",
    "matched-string" : "Skåne",
    "annotation-id" : 58
  }, {
    "preferred-label" : "Skåne län",
    "type" : "region",
    "start-position" : 4709,
    "end-position" : 4722,
    "concept-id" : "CaRE_1nn_cSU",
    "matched-string" : "Region Skånes",
    "annotation-id" : 54
  }, {
    "preferred-label" : "Ambulanssjukvård",
    "sentiment" : "MUST_HAVE",
    "type" : "skill",
    "start-position" : 4817,
    "end-position" : 4833,
    "concept-id" : "eiAk_5vQ_2NY",
    "matched-string" : "ambulanssjukvård",
    "annotation-id" : 25
  }, {
    "preferred-label" : "medicinsk bildteknik",
    "type" : "esco-skill",
    "start-position" : 4835,
    "end-position" : 4839,
    "concept-id" : "vJSD_WWT_EqH",
    "matched-string" : "bild",
    "annotation-id" : 56
  }, {
    "preferred-label" : "Laboratorieteknik",
    "sentiment" : "MUST_HAVE",
    "type" : "sun-education-field-4",
    "start-position" : 4845,
    "end-position" : 4862,
    "concept-id" : "fZB2_F9H_uy3",
    "matched-string" : "laboratorieteknik",
    "annotation-id" : 26
  }, {
    "preferred-label" : "Arbets- och miljömedicin",
    "sentiment" : "MUST_HAVE",
    "type" : "skill",
    "start-position" : 4982,
    "end-position" : 5006,
    "concept-id" : "1CWs_vdp_qX5",
    "matched-string" : "arbets- och miljömedicin",
    "annotation-id" : 28
  }, {
    "preferred-label" : "genetik",
    "sentiment" : "MUST_HAVE",
    "type" : "esco-skill",
    "start-position" : 5017,
    "end-position" : 5024,
    "concept-id" : "ZEXj_Lop_9Mi",
    "matched-string" : "genetik",
    "annotation-id" : 29
  }, {
    "preferred-label" : "immunologi",
    "sentiment" : "MUST_HAVE",
    "type" : "esco-skill",
    "start-position" : 5026,
    "end-position" : 5036,
    "concept-id" : "ZFDz_fmH_yV7",
    "matched-string" : "immunologi",
    "annotation-id" : 30
  }, {
    "preferred-label" : "Transfusionsmedicin",
    "sentiment" : "MUST_HAVE",
    "type" : "skill",
    "start-position" : 5041,
    "end-position" : 5060,
    "concept-id" : "W6Au_KRK_f6e",
    "matched-string" : "transfusionsmedicin",
    "annotation-id" : 31
  }, {
    "preferred-label" : "Kemi",
    "sentiment" : "MUST_HAVE",
    "type" : "sun-education-field-3",
    "start-position" : 5062,
    "end-position" : 5066,
    "concept-id" : "vpZY_6iv_NPL",
    "matched-string" : "kemi",
    "annotation-id" : 32
  }, {
    "preferred-label" : "Farmakologi",
    "sentiment" : "MUST_HAVE",
    "type" : "skill",
    "start-position" : 5068,
    "end-position" : 5079,
    "concept-id" : "xxeG_XxB_sqG",
    "matched-string" : "farmakologi",
    "annotation-id" : 33
  }, {
    "preferred-label" : "Mikrobiologi",
    "sentiment" : "MUST_HAVE",
    "type" : "skill",
    "start-position" : 5081,
    "end-position" : 5093,
    "concept-id" : "6de1_7CM_XL6",
    "matched-string" : "mikrobiologi",
    "annotation-id" : 34
  }, {
    "preferred-label" : "patologi",
    "type" : "esco-skill",
    "start-position" : 5099,
    "end-position" : 5107,
    "concept-id" : "xLP8_EZG_6Bq",
    "matched-string" : "patologi",
    "annotation-id" : 59
  }, {
    "preferred-label" : "Skåne län",
    "type" : "region",
    "start-position" : 5249,
    "end-position" : 5262,
    "concept-id" : "CaRE_1nn_cSU",
    "matched-string" : "Region Skånes",
    "annotation-id" : 55
  } ],
  "text" : "Biomedicinsk analytiker till Laboratoriemedicin Bas i Kristianstad\nGör skillnad. Varje dag.\n\nÄr du en biomedicinsk analytiker som söker efter en ny utmaning? Vill du ha ett ansvarsfullt, utvecklande och självständigt arbete i en härlig arbetsmiljö? Då kan detta vara rätt tjänst för dig!\n\nMedicinsk service ger stöd och service till den skånska hälso- och sjukvården. Våra tjänster omfattar alltifrån laboratoriemedicin och medicinsk teknik till uppdrag inom prehospital sjukvård och forskning. Vi är cirka 2 100 medarbetare inom förvaltningen. \n\nLaboratoriemedicin Bas är ett specialitetsoberoende och växande verksamhetsområde i förvaltningen. Vi förser vården med diagnostik till stöd för vård och behandling samt bedriver en bred och högteknologisk verksamhet inom specialiteterna; klinisk kemi, klinisk mikrobiologi, klinisk immunologi och transfusionsmedicin samt provtagning och funktionsundersökningar. Vår verksamhet kommer under de närmsta åren att expandera ytterligare för att anpassa diagnostikutbudet för den framtida vården.\n\nVerksamhetens uppdrag omfattar förutom diagnostik även konsultverksamhet för sjukvården, utbildning av bland annat läkare och biomedicinska analytiker samt samarbete med universitet kring aktuella forsknings- och utvecklingsprojekt. I vår verksamhet ingår även område bild- och laboratorieteknik som ansvarar för den medicintekniska säkerheten.\n\nFör att upprätthålla kvalitet och kompetens samverkar vi kontinuerligt med övriga verksamhetsområden inom förvaltningen och har nära samarbete med både chefer, processledare och läkare inom dessa specialiteter. Tillsammans arbetar vi aktivt med att utveckla och förbättra metoder, flöden och processer för att skapa konkurrenskraft anpassad till sjukvårdens framtida behov\n\nVerksamheten bedrivs på tio orter i Skåne och består av drygt 500 medarbetare där den största personalkategorin är biomedicinska analytiker. Vi har även andra yrkeskategorier hos oss så som biomedicinare, administratörer, undersköterskor och sjuksköterskor. \n\nTillsammans skickar vi årligen ut cirka 17 miljoner provsvar.\r\n\r\nARBETSUPPGIFTER\nNu har du chansen att bli en av oss på Laboratoriemedicin Bas i Kristianstad. Hos erbjuds du ett varierande arbete med goda möjligheter att påverka. Vi välkomnar dig som vill vara med i vår verksamhets fortsatta utveckling.\n\nSom biomedicinsk analytiker är din ansvarsområden inriktade på kliniskt kemiskt analysarbete, inklusive ven- och kapillärprovtagning på såväl vuxna som barn. Vidare har du även ansvar för funktionsundersökningar. De flesta av analysområden inom klinisk kemi utförs i Kristianstad, men kommer du även ägna dig åt analysarbete inom transfusionsmedicin och mikrobiologi. Utöver det kommer du också vara aktiv i verksamhetsområdets kvalitetsarbete på vårt laboratorium med ansvar för upplärning och utbildning av nya medarbetare och studenter. \n\nSom ny medarbetare hos oss får du genomgå ett internt upplärningsprogram som sker på dagtid. Därefter kan din arbetstid omfatta dag-, kvälls-, helg- och nattjänstgöring. Din placeringsort är Kristianstad, men även arbete i Hässleholm kan förekomma.\r\n\r\nKVALIFIKATIONER\nDu som söker är legitimerad biomedicinsk analytiker med behörighet att verka inom svensk sjukvård. Språkkunskap i svenska motsvarande lägst nivå C1 enligt Europarådets nivåskala är ett krav. Om du har kunskap i övriga språk ses det som meriterande för tjänsten. För tjänsten är det fördelaktigt om du ha erfarenhet av analysarbete inom transfusionsmedicin och/eller klinisk kemi samt kunskap och erfarenhet av ven- och kapillärprovtagning på vuxna och barn.\n\nSom person är du ansvarstagande och empatisk med god förmåga att arbeta såväl självständigt som i grupp. Du är kvalitetsmedveten och noggrann i ditt arbete och har ett strukturerat förhållningssätt. Vidare är du professionell i ditt bemötande och kan kommunicera med både interna och externa kontakter. Vid intensiva perioder kräver ditt arbete att du kan prioritera om och anpassa dig vid ändrade omständigheter samt att du har förmågan att anpassa dig till ändrad planering.\n\nVid tillsättning av tjänsterna kommer vi lägga stor vikt på de personliga egenskaperna som måste harmonisera med Region Skånes värderingar. Stor vikt kommer läggas vid personlig lämplighet.\n\nI denna process tillämpas löpande urval. Varmt välkommen med din ansökan, vi ser fram emot att lära känna dig!\r\n\nÖVRIGT\nRegion Skåne finns till för att alla som bor i Skåne ska må bra och känna framtidstro. Genom gränslösa samarbeten och omtanke skapas de bästa förutsättningar för ett hälsosamt liv  inom näringsliv, kollektivtrafik, kultur och hälso- och sjukvård  i Skåne. Tillsammans gör vi livet mera möjligt. \n\nMedicinsk service är en av Region Skånes sex hälso- och sjukvårdsförvaltningar, med cirka 2 000 medarbetare. Vi möter vårdens behov av ambulanssjukvård, bild- och laboratorieteknik, klinisk träning, laboratoriemedicin och sjukvårdsrådgivning. Den laboratoriemedicinska verksamheten omfattar områdena arbets- och miljömedicin, biobank, genetik, immunologi och transfusionsmedicin, kemi, farmakologi, mikrobiologi samt patologi. Förvaltningen bedriver även forskning och utveckling inom sina områden.\n\nPå http://www.skane.se/rekryteringsstatus kan du se i vilket skede Region Skånes rekryteringar befinner sig och hur många som har sökt tjänsterna. \n\nTill bemannings- och rekryteringsföretag och till dig som är försäljare: Vi undanber oss vänligen men bestämt direktkontakt med bemannings- och rekryteringsföretag samt försäljare av ytterligare jobbannonser."
}