{
  "meta" : {
    "jobad" : {
      "description" : {
        "requirements" : null,
        "needs" : null,
        "company_information" : null,
        "text_formatted" : "<p>Gardinia Salong AB...</p><p><br></p><p>Jag söker en driven, glad och motiverad frisör med gesällbrev som skulle vilja ha anställning Du skall kunna jobba med både dam &amp; herr.  Behöver jag någon som skall ta hand om salongen och kunderna. Vi har yngre kundkrets och vi önskar att du följer nya trender.</p><p id=\"oppenforalla\">Öppen för alla\nVi fokuserar på din kompetens, inte dina övriga förutsättningar. Vi är öppna för att anpassa rollen eller arbetsplatsen efter dina behov.</p>",
        "conditions" : null,
        "text" : "Gardinia Salong AB...\n\n\nJag söker en driven, glad och motiverad frisör med gesällbrev som skulle vilja ha anställning Du skall kunna jobba med både dam & herr.  Behöver jag någon som skall ta hand om salongen och kunderna. Vi har yngre kundkrets och vi önskar att du följer nya trender.\nÖppen för alla\nVi fokuserar på din kompetens, inte dina övriga förutsättningar. Vi är öppna för att anpassa rollen eller arbetsplatsen efter dina behov."
      },
      "headline" : "Frisör ",
      "driving_license" : null,
      "employer" : {
        "email" : null,
        "phone_number" : null,
        "organization_number" : "5569813578",
        "name" : "Gardinia Salong AB",
        "url" : null,
        "workplace" : "Gardinia Salong AB"
      },
      "removed_date" : null,
      "logo_url" : null,
      "last_publication_date" : "2022-08-13T23:59:59",
      "number_of_vacancies" : 1,
      "occupation" : {
        "concept_id" : "tuoE_9Nj_fAS",
        "label" : "Frisör",
        "legacy_ams_taxonomy_id" : "5491"
      },
      "occupation_group" : {
        "concept_id" : "LyBp_bY6_bZK",
        "label" : "Frisörer",
        "legacy_ams_taxonomy_id" : "5141"
      },
      "employment_type" : {
        "concept_id" : "PFZr_Syz_cUq",
        "label" : "Vanlig anställning",
        "legacy_ams_taxonomy_id" : "1"
      },
      "webpage_url" : "https://arbetsformedlingen.se/platsbanken/annonser/26045410",
      "driving_license_required" : false,
      "application_contacts" : [ ],
      "duration" : {
        "concept_id" : "a7uU_j21_mkL",
        "label" : "Tills vidare",
        "legacy_ams_taxonomy_id" : "1"
      },
      "nice_to_have" : {
        "education_level" : [ ],
        "work_experiences" : [ {
          "concept_id" : "tuoE_9Nj_fAS",
          "weight" : 5,
          "label" : "Frisör",
          "legacy_ams_taxonomy_id" : "5491"
        } ],
        "skills" : [ ],
        "education" : [ ],
        "languages" : [ ]
      },
      "application_details" : {
        "via_af" : false,
        "email" : "Rami89ab@gmail.com",
        "other" : null,
        "reference" : null,
        "url" : null,
        "information" : null
      },
      "source_type" : "VIA_ANNONSERA",
      "application_deadline" : "2022-08-13T23:59:59",
      "external_id" : null,
      "workplace_address" : {
        "coordinates" : [ 12.050457027237394, 57.79714588767012 ],
        "city" : "Angered",
        "postcode" : "42465",
        "municipality" : "Göteborg",
        "region_concept_id" : "zdoY_6u5_Krt",
        "region" : "Västra Götalands län",
        "country_code" : "199",
        "region_code" : "14",
        "municipality_concept_id" : "PVZL_BQT_XtL",
        "country_concept_id" : "i46j_HmG_v64",
        "municipality_code" : "1480",
        "street_address" : "Kultivatorgatan 6",
        "country" : "Sverige"
      },
      "id" : "26045410",
      "experience_required" : true,
      "working_hours_type" : {
        "concept_id" : "6YE1_gAC_R2G",
        "label" : "Heltid",
        "legacy_ams_taxonomy_id" : "1"
      },
      "access" : null,
      "timestamp" : 1657814740292,
      "must_have" : {
        "education_level" : [ ],
        "work_experiences" : [ ],
        "skills" : [ ],
        "education" : [ ],
        "languages" : [ ]
      },
      "occupation_field" : {
        "concept_id" : "Uuf1_GMh_Uvw",
        "label" : "Kropps- och skönhetsvård",
        "legacy_ams_taxonomy_id" : "4"
      },
      "scope_of_work" : {
        "min" : 0,
        "max" : 100
      },
      "salary_type" : {
        "concept_id" : "oG8G_9cW_nRf",
        "label" : "Fast månads- vecko- eller timlön",
        "legacy_ams_taxonomy_id" : "1"
      },
      "removed" : false,
      "salary_description" : null,
      "access_to_own_car" : false,
      "publication_date" : "2022-07-14T18:03:30"
    },
    "name" : "Frisör ",
    "user" : "kristof.fischer"
  },
  "sha1" : "aec1292c62245041ae1ed5b30e7b84ed9e7a1b80",
  "annotations" : [ {
    "preferred-label" : "Frisör",
    "sentiment" : "MUST_HAVE",
    "type" : "occupation-name",
    "start-position" : 0,
    "end-position" : 6,
    "concept-id" : "tuoE_9Nj_fAS",
    "matched-string" : "frisör",
    "annotation-id" : 0
  }, {
    "preferred-label" : "Frisör",
    "sentiment" : "MUST_HAVE",
    "type" : "occupation-name",
    "start-position" : 72,
    "end-position" : 78,
    "concept-id" : "tuoE_9Nj_fAS",
    "matched-string" : "frisör",
    "annotation-id" : 1
  }, {
    "preferred-label" : "Gesällbrev, frisör",
    "sentiment" : "MUST_HAVE",
    "type" : "skill",
    "start-position" : 83,
    "end-position" : 93,
    "concept-id" : "YcrR_5QB_3XL",
    "matched-string" : "gesällbrev",
    "annotation-id" : 2
  } ],
  "text" : "Frisör \nGardinia Salong AB...\n\n\nJag söker en driven, glad och motiverad frisör med gesällbrev som skulle vilja ha anställning Du skall kunna jobba med både dam & herr.  Behöver jag någon som skall ta hand om salongen och kunderna. Vi har yngre kundkrets och vi önskar att du följer nya trender.\nÖppen för alla\nVi fokuserar på din kompetens, inte dina övriga förutsättningar. Vi är öppna för att anpassa rollen eller arbetsplatsen efter dina behov."
}