{
  "meta" : {
    "jobad" : {
      "description" : {
        "requirements" : null,
        "needs" : null,
        "company_information" : null,
        "text_formatted" : "<em>Arbetar du inom vården som läkare och vill kunna styra din egna arbetssituation? Hör av dig till oss på Svea Work så hjälper vi dig med detta. </em><br><br>På kunds räkning blir du anställd som konsult på Svea Work. Till detta uppdrag söker vi nu en specialistläkare inom allmänmedicin till en vårdcentral i Motala.<br><br><strong>Tidsperiod:</strong> 2022-10-01-2023-03-31<br><strong>Omfattning:</strong> 100%<br><strong>Arbetstider:</strong> dagtid, måndag-fredag<br><br><strong>Arbetsuppgifter</strong><br>Du kommer arbeta med sedvanliga arbetsuppgifter som läkare på en vårdcentral. Det innebär arbete såsom mottagningsarbete, både planerade och akuta, samt konsultläkare till vårdboende och även vägledning till dina kollegor. <br><br><strong>Svea Works erbjuder dig</strong><br>Konkurrenskraftig lön<br>Kollektivavtal<br>Semesterersättning<br>Tjänstepension enligt ITP-planen<br>Engagerad och lyhörd konsultchef<br>Boende och reseersättning utanför hemort<br><br><strong>Kvalifikationer</strong><br>Vi söker dig som är utbildad och legitimerad specialistläkare inom allmänmedicin med 2 års yrkeserfarenhet. Detta uppdrag passar perfekt för dig som är trygg, lugn och pedagogisk i din yrkesroll där du känner att ditt arbete uppskattas. Du behöver ha goda kunskaper i det svenska språket, detta gäller både i tal och skrift då det sker dokumentation i olika journalsystem. Meriterande om du har erfarenhet i journalsystem Cosmic. Det är även meriterande att du har erfarenhet av arbete på vårdcentral sedan tidigare.<br><br><strong>Personliga egenskaper</strong><br>Vi söker dig som har en hög social kompetens och har ett gott bemötande gentemot dina patienter och kollegor. Du ska även ha vana av att arbeta med specifika uppdrag som har varierande arbetsuppgifter. Du har även ett gediget intresse om att göra en personlig resa och utveckling, inte bara som person utan utveckla din kompetens inom vården.<br><br><strong>Sista ansökningsdag</strong><br>Ansökningar behandlas löpande. Söker du efter en ny arbetsgivare med kompetensmöjligheter kan detta vara något för dig. Varmt välkommen in med din ansökan!<br><br><strong>Företagsinformation: </strong>Svea Work är en del av Svea Partners koncernen och är ett rekryterings-och bemanningsföretag som arbetar tillsammans med våra uppdragsgivare och medarbetare för att hitta rätt person för rätt uppdrag. För oss på Svea Work är det betydelsefullt att göra skillnad och bidra med samhällsnytta. En del av resultat skänker Svea Work till Svea Foundation som i sin tur hjälper ensamstående föräldrar och barn.<br> ",
        "conditions" : null,
        "text" : "Arbetar du inom vården som läkare och vill kunna styra din egna arbetssituation? Hör av dig till oss på Svea Work så hjälper vi dig med detta. \n\nPå kunds räkning blir du anställd som konsult på Svea Work. Till detta uppdrag söker vi nu en specialistläkare inom allmänmedicin till en vårdcentral i Motala.\n\nTidsperiod: 2022-10-01-2023-03-31\nOmfattning: 100%\nArbetstider: dagtid, måndag-fredag\n\nArbetsuppgifter\nDu kommer arbeta med sedvanliga arbetsuppgifter som läkare på en vårdcentral. Det innebär arbete såsom mottagningsarbete, både planerade och akuta, samt konsultläkare till vårdboende och även vägledning till dina kollegor. \n\nSvea Works erbjuder dig\nKonkurrenskraftig lön\nKollektivavtal\nSemesterersättning\nTjänstepension enligt ITP-planen\nEngagerad och lyhörd konsultchef\nBoende och reseersättning utanför hemort\n\nKvalifikationer\nVi söker dig som är utbildad och legitimerad specialistläkare inom allmänmedicin med 2 års yrkeserfarenhet. Detta uppdrag passar perfekt för dig som är trygg, lugn och pedagogisk i din yrkesroll där du känner att ditt arbete uppskattas. Du behöver ha goda kunskaper i det svenska språket, detta gäller både i tal och skrift då det sker dokumentation i olika journalsystem. Meriterande om du har erfarenhet i journalsystem Cosmic. Det är även meriterande att du har erfarenhet av arbete på vårdcentral sedan tidigare.\n\nPersonliga egenskaper\nVi söker dig som har en hög social kompetens och har ett gott bemötande gentemot dina patienter och kollegor. Du ska även ha vana av att arbeta med specifika uppdrag som har varierande arbetsuppgifter. Du har även ett gediget intresse om att göra en personlig resa och utveckling, inte bara som person utan utveckla din kompetens inom vården.\n\nSista ansökningsdag\nAnsökningar behandlas löpande. Söker du efter en ny arbetsgivare med kompetensmöjligheter kan detta vara något för dig. Varmt välkommen in med din ansökan!\n\nFöretagsinformation: Svea Work är en del av Svea Partners koncernen och är ett rekryterings-och bemanningsföretag som arbetar tillsammans med våra uppdragsgivare och medarbetare för att hitta rätt person för rätt uppdrag. För oss på Svea Work är det betydelsefullt att göra skillnad och bidra med samhällsnytta. En del av resultat skänker Svea Work till Svea Foundation som i sin tur hjälper ensamstående föräldrar och barn."
      },
      "headline" : "Specialistläkare inom allmänmedicin till en vårdcentral i Motala",
      "driving_license" : null,
      "employer" : {
        "email" : null,
        "phone_number" : null,
        "organization_number" : "5590839980",
        "name" : "Svea Work AB",
        "url" : "www.sveawork.se",
        "workplace" : "Svea Work"
      },
      "removed_date" : null,
      "logo_url" : "https://www.arbetsformedlingen.se/rest/arbetsgivare/rest/af/v3/organisation/5590839980/logotyper/logo.png",
      "last_publication_date" : "2022-09-13T23:59:59",
      "number_of_vacancies" : 1,
      "occupation" : {
        "concept_id" : "bXNH_MNX_dUR",
        "label" : "Sjuksköterska, grundutbildad",
        "legacy_ams_taxonomy_id" : "7296"
      },
      "occupation_group" : {
        "concept_id" : "Z8ci_bBE_tmx",
        "label" : "Grundutbildade sjuksköterskor",
        "legacy_ams_taxonomy_id" : "2221"
      },
      "employment_type" : {
        "concept_id" : "PFZr_Syz_cUq",
        "label" : "Vanlig anställning",
        "legacy_ams_taxonomy_id" : "1"
      },
      "webpage_url" : "https://arbetsformedlingen.se/platsbanken/annonser/26370454",
      "driving_license_required" : false,
      "application_contacts" : [ {
        "description" : "Linnea Kvarnberg",
        "email" : "linnea.kvarnberg@sveawork.se",
        "telephone" : null,
        "name" : null,
        "contact_type" : null
      } ],
      "duration" : {
        "concept_id" : "a7uU_j21_mkL",
        "label" : "Tills vidare",
        "legacy_ams_taxonomy_id" : "1"
      },
      "nice_to_have" : {
        "education_level" : [ ],
        "work_experiences" : [ ],
        "skills" : [ ],
        "education" : [ ],
        "languages" : [ ]
      },
      "application_details" : {
        "via_af" : false,
        "email" : null,
        "other" : null,
        "reference" : null,
        "url" : "https://apply.recman.no/job_post.php?id=286814&path=ams&sub_id=672",
        "information" : null
      },
      "source_type" : "VIA_PLATSBANKEN_DXA",
      "application_deadline" : "2022-09-13T23:59:59",
      "external_id" : "46-559083-9980-28681462e8d5d532032",
      "workplace_address" : {
        "coordinates" : [ 15.047093, 58.538033 ],
        "city" : null,
        "postcode" : null,
        "municipality" : "Motala",
        "region_concept_id" : "oLT3_Q9p_3nn",
        "region" : "Östergötlands län",
        "country_code" : "199",
        "region_code" : "05",
        "municipality_concept_id" : "E1MC_1uG_phm",
        "country_concept_id" : "i46j_HmG_v64",
        "municipality_code" : "0583",
        "street_address" : null,
        "country" : "Sverige"
      },
      "id" : "26370454",
      "experience_required" : true,
      "working_hours_type" : {
        "concept_id" : "6YE1_gAC_R2G",
        "label" : "Heltid",
        "legacy_ams_taxonomy_id" : "1"
      },
      "access" : null,
      "timestamp" : 1659426263641,
      "must_have" : {
        "education_level" : [ ],
        "work_experiences" : [ {
          "concept_id" : "bXNH_MNX_dUR",
          "weight" : 10,
          "label" : "Sjuksköterska, grundutbildad",
          "legacy_ams_taxonomy_id" : "7296"
        } ],
        "skills" : [ ],
        "education" : [ ],
        "languages" : [ ]
      },
      "occupation_field" : {
        "concept_id" : "NYW6_mP6_vwf",
        "label" : "Hälso- och sjukvård",
        "legacy_ams_taxonomy_id" : "8"
      },
      "scope_of_work" : {
        "min" : 100,
        "max" : 100
      },
      "salary_type" : {
        "concept_id" : "oG8G_9cW_nRf",
        "label" : "Fast månads- vecko- eller timlön",
        "legacy_ams_taxonomy_id" : "1"
      },
      "removed" : false,
      "salary_description" : null,
      "access_to_own_car" : false,
      "publication_date" : "2022-08-02T09:44:23"
    },
    "name" : "Specialistläkare inom allmänmedicin till en vårdcentral i Motala",
    "user" : "hannes"
  },
  "sha1" : "3cb8b0f4b255ed6c8f5983075f29a794760805b9",
  "annotations" : [ {
    "preferred-label" : "Specialistläkare",
    "sentiment" : "MUST_HAVE",
    "type" : "ssyk-level-4",
    "start-position" : 0,
    "end-position" : 16,
    "concept-id" : "nu7c_QuB_KVQ",
    "matched-string" : "specialistläkare",
    "annotation-id" : 0
  }, {
    "preferred-label" : "Allmänmedicin",
    "sentiment" : "MUST_HAVE",
    "type" : "skill",
    "start-position" : 22,
    "end-position" : 35,
    "concept-id" : "tCDB_MjS_nqc",
    "matched-string" : "allmänmedicin",
    "annotation-id" : 1
  }, {
    "preferred-label" : "Vårdcentral",
    "sentiment" : "MUST_HAVE",
    "type" : "skill",
    "start-position" : 44,
    "end-position" : 55,
    "concept-id" : "FJjr_4pF_LEY",
    "matched-string" : "vårdcentral",
    "annotation-id" : 2
  }, {
    "preferred-label" : "Motala",
    "type" : "municipality",
    "start-position" : 58,
    "end-position" : 64,
    "concept-id" : "E1MC_1uG_phm",
    "matched-string" : "Motala",
    "annotation-id" : 23
  }, {
    "preferred-label" : "Läkare",
    "sentiment" : "MUST_HAVE",
    "type" : "ssyk-level-3",
    "start-position" : 92,
    "end-position" : 98,
    "concept-id" : "AfZy_9gj_XCb",
    "matched-string" : "läkare",
    "annotation-id" : 3
  }, {
    "preferred-label" : "Specialistläkare",
    "sentiment" : "MUST_HAVE",
    "type" : "ssyk-level-4",
    "start-position" : 304,
    "end-position" : 320,
    "concept-id" : "nu7c_QuB_KVQ",
    "matched-string" : "specialistläkare",
    "annotation-id" : 6
  }, {
    "preferred-label" : "Allmänmedicin",
    "sentiment" : "MUST_HAVE",
    "type" : "skill",
    "start-position" : 326,
    "end-position" : 339,
    "concept-id" : "tCDB_MjS_nqc",
    "matched-string" : "allmänmedicin",
    "annotation-id" : 7
  }, {
    "preferred-label" : "Vårdcentral",
    "sentiment" : "MUST_HAVE",
    "type" : "skill",
    "start-position" : 348,
    "end-position" : 359,
    "concept-id" : "FJjr_4pF_LEY",
    "matched-string" : "vårdcentral",
    "annotation-id" : 8
  }, {
    "preferred-label" : "Motala",
    "type" : "municipality",
    "start-position" : 362,
    "end-position" : 368,
    "concept-id" : "E1MC_1uG_phm",
    "matched-string" : "Motala",
    "annotation-id" : 24
  }, {
    "preferred-label" : "Heltid",
    "type" : "worktime-extent",
    "start-position" : 417,
    "end-position" : 421,
    "concept-id" : "6YE1_gAC_R2G",
    "matched-string" : "100%",
    "annotation-id" : 25
  }, {
    "preferred-label" : "Läkare",
    "sentiment" : "MUST_HAVE",
    "type" : "ssyk-level-3",
    "start-position" : 526,
    "end-position" : 532,
    "concept-id" : "AfZy_9gj_XCb",
    "matched-string" : "läkare",
    "annotation-id" : 9
  }, {
    "preferred-label" : "Vårdcentral",
    "sentiment" : "MUST_HAVE",
    "type" : "skill",
    "start-position" : 539,
    "end-position" : 550,
    "concept-id" : "FJjr_4pF_LEY",
    "matched-string" : "vårdcentral",
    "annotation-id" : 10
  }, {
    "preferred-label" : "Kollektivavtal",
    "sentiment" : "MUST_HAVE",
    "type" : "skill",
    "start-position" : 745,
    "end-position" : 759,
    "concept-id" : "z7wE_9xb_3jX",
    "matched-string" : "kollektivavtal",
    "annotation-id" : 12
  }, {
    "preferred-label" : "Specialistläkare",
    "sentiment" : "MUST_HAVE",
    "type" : "ssyk-level-4",
    "start-position" : 948,
    "end-position" : 964,
    "concept-id" : "nu7c_QuB_KVQ",
    "matched-string" : "specialistläkare",
    "annotation-id" : 13
  }, {
    "preferred-label" : "Allmänmedicin",
    "sentiment" : "MUST_HAVE",
    "type" : "skill",
    "start-position" : 970,
    "end-position" : 983,
    "concept-id" : "tCDB_MjS_nqc",
    "matched-string" : "allmänmedicin",
    "annotation-id" : 14
  }, {
    "preferred-label" : "2-4 års erfarenhet",
    "type" : "occupation-experience-year",
    "start-position" : 988,
    "end-position" : 1010,
    "concept-id" : "RWA2_uu6_udD",
    "matched-string" : "2 års yrkeserfarenhet.",
    "annotation-id" : 26
  }, {
    "preferred-label" : "Svenska språket",
    "sentiment" : "MUST_HAVE",
    "type" : "keyword",
    "start-position" : 1175,
    "end-position" : 1190,
    "concept-id" : "BiGm_58D_SSn",
    "matched-string" : "svenska språket",
    "annotation-id" : 15
  }, {
    "preferred-label" : "Dokumentation",
    "sentiment" : "MUST_HAVE",
    "type" : "keyword",
    "start-position" : 1239,
    "end-position" : 1252,
    "concept-id" : "jodz_kWf_iKx",
    "matched-string" : "dokumentation",
    "annotation-id" : 16
  }, {
    "preferred-label" : "Vårdcentral",
    "sentiment" : "MUST_HAVE",
    "type" : "skill",
    "start-position" : 1392,
    "end-position" : 1403,
    "concept-id" : "FJjr_4pF_LEY",
    "matched-string" : "vårdcentral",
    "annotation-id" : 17
  } ],
  "text" : "Specialistläkare inom allmänmedicin till en vårdcentral i Motala\nArbetar du inom vården som läkare och vill kunna styra din egna arbetssituation? Hör av dig till oss på Svea Work så hjälper vi dig med detta. \n\nPå kunds räkning blir du anställd som konsult på Svea Work. Till detta uppdrag söker vi nu en specialistläkare inom allmänmedicin till en vårdcentral i Motala.\n\nTidsperiod: 2022-10-01-2023-03-31\nOmfattning: 100%\nArbetstider: dagtid, måndag-fredag\n\nArbetsuppgifter\nDu kommer arbeta med sedvanliga arbetsuppgifter som läkare på en vårdcentral. Det innebär arbete såsom mottagningsarbete, både planerade och akuta, samt konsultläkare till vårdboende och även vägledning till dina kollegor. \n\nSvea Works erbjuder dig\nKonkurrenskraftig lön\nKollektivavtal\nSemesterersättning\nTjänstepension enligt ITP-planen\nEngagerad och lyhörd konsultchef\nBoende och reseersättning utanför hemort\n\nKvalifikationer\nVi söker dig som är utbildad och legitimerad specialistläkare inom allmänmedicin med 2 års yrkeserfarenhet. Detta uppdrag passar perfekt för dig som är trygg, lugn och pedagogisk i din yrkesroll där du känner att ditt arbete uppskattas. Du behöver ha goda kunskaper i det svenska språket, detta gäller både i tal och skrift då det sker dokumentation i olika journalsystem. Meriterande om du har erfarenhet i journalsystem Cosmic. Det är även meriterande att du har erfarenhet av arbete på vårdcentral sedan tidigare.\n\nPersonliga egenskaper\nVi söker dig som har en hög social kompetens och har ett gott bemötande gentemot dina patienter och kollegor. Du ska även ha vana av att arbeta med specifika uppdrag som har varierande arbetsuppgifter. Du har även ett gediget intresse om att göra en personlig resa och utveckling, inte bara som person utan utveckla din kompetens inom vården.\n\nSista ansökningsdag\nAnsökningar behandlas löpande. Söker du efter en ny arbetsgivare med kompetensmöjligheter kan detta vara något för dig. Varmt välkommen in med din ansökan!\n\nFöretagsinformation: Svea Work är en del av Svea Partners koncernen och är ett rekryterings-och bemanningsföretag som arbetar tillsammans med våra uppdragsgivare och medarbetare för att hitta rätt person för rätt uppdrag. För oss på Svea Work är det betydelsefullt att göra skillnad och bidra med samhällsnytta. En del av resultat skänker Svea Work till Svea Foundation som i sin tur hjälper ensamstående föräldrar och barn."
}