{
  "meta" : {
    "jobad" : {
      "description" : {
        "requirements" : null,
        "needs" : null,
        "company_information" : null,
        "text_formatted" : "<p><em>Vill du arbeta på en flexibel arbetsplats som tar hänsyn till individens behov – både medarbetarnas och patienternas? Drivs du av att göra ett högkvalitativt arbete? Vill du ha fria arbetstider, tydliga mål och möjlighet till bonus? Då kan Modigo vara arbetsplatsen för dig.</em></p><p><strong>Nu utökar vi vårt team i Lund med en psykolog som ska arbeta med neuropsykiatriska utredningar. Vi söker dig som är trygg i din yrkesroll, har ett genuint intresse för neuropsykiatri och vill ha ett viktigt och utvecklande arbete tillsammans med engagerade och skickliga kollegor.</strong></p><p><strong>Om Modigo</strong></p><p>Modigo är en väletablerad vårdgivare och arbetsplats för psykologer, läkare och administrativa medarbetare på fyra orter i Sverige. Vi är specialister inom neuropsykiatri och arbetar inom psykiatrisk öppenvård, med utredningar, behandling, rådgivning och föräldrastöd. Våra sju mottagningar finns i Stockholm, Göteborg, Lund och Sundsvall. Vi har avtal och gott samarbete med ett flertal regioner.</p><p><strong>Om tjänsten</strong></p><p>Då vår verksamhet växer söker vi nu ytterligare psykologer till mottagningen i Lund. Arbetet består i att självständigt genomföra gedigna neuropsykiatriska utredningar av barn och/eller vuxna, baserade på evidensbaserade metoder. På Modigo lägger vi stor vikt vid noggrannhet i samtliga steg i utredningen och genomför alltid breda neuropsykiatriska utredningar. I utredningsarbetet samarbetar du med psykiatriker och tillsammans tar ni ställning till om patienten uppfyller kriterierna för diagnos.</p><p>Tjänsten är placerad i fina lokaler i centrala Lund. Du kan välja att arbeta hemifrån när du inte har patientbesök. Du kan välja om du vill arbeta hel- eller deltid.</p><p><strong>Varför jobba på Modigo?</strong></p><p>På Modigo arbetar du i en verksamhet med god struktur och rutiner kring det kliniska arbetet och kollektivavtal, bra pensionslösningar och friskvårdsbidrag för dig som anställd. Här är några anledningar som våra anställda ofta framhåller med Modigo som arbetsgivare:</p><p>·      <strong>Fokus på kvalitet och kompetens.</strong> På Modigo är det patientnära arbetet i fokus. Cheferna är psykologer med klinisk bakgrund och deras uppgift är att skapa bra förutsättningar för dig som medarbetare. Du är omgiven av kompetenta kollegor och erbjuds kontinuerligt kompetenshöjande insatser och utbildningar.</p><p>·      <strong>Flexibilitet för individuella behov.</strong> På Modigo utformar du ditt eget arbete och styr din tid. Det kan handla om att själv planera in när på dagen du har patientbesök – för att få livspusslet att gå ihop – och att arbeta hemifrån när du inte träffar patienter. En annan viktig aspekt är att Modigo tar hänsyn till patienternas behov och önskemål, exempelvis genom möjligheten att genomföra utredningar under en kortare, koncentrerad period.</p><p>·      <strong>Framåtanda och högt i tak.</strong> Modigo är en prestigelös organisation som hela tiden utvecklas för patienternas och medarbetarnas bästa. Har du idéer som kan göra verksamheten bättre – prata med din chef. Chansen är stor att de snart blir verklighet. </p><p><strong>Om dig</strong></p><p>Vi söker dig som har svensk legitimation som psykolog samt goda kunskaper i svenska i både tal och skrift, ytterligare språk är meriterande. Erfarenhet av neuropsykiatriska utredningar i minst 2 år är ett krav. Vi vet att mångfald berikar oss och ser gärna sökande med olika bakgrunder och erfarenheter.</p><p>För att trivas hos oss är det viktigt att du är:</p><p> <strong>- Självständig och strukturerad. </strong>Du lägger själv upp en plan för ditt arbete, ser till att få jobbet gjort samtidigt som du tar hand om dig själv, till exempel genom tillräckligt med pauser. </p><p>- <strong>Trygg i din yrkesroll och kompetens. </strong>Du står på egna ben i det kliniska arbetet, samtidigt som du drar nytta av den struktur och kompetens som finns till ditt förfogande på Modigo.</p><p>- <strong>Flexibel och nyfiken.</strong> Du vill arbeta i en agil verksamhet som ständigt utvecklas. Du är lösningsorienterad och vill, utifrån den givna strukturen, hitta individuella anpassningar för att hjälpa varje patient så bra som möjligt.</p><p><strong>Frågor</strong></p><p>Har du frågor kring tjänsten är du varmt välkommen att kontakta vår enhetschef för Lund, Jenny Edbladh, via  jenny.edbladh@modigo.se. Får du inget svar semesterperioden så var lugn, Jenny återkommer så fort hon har möjlighet.</p><p><strong>Så ansöker du</strong></p><p>Maila ditt CV till jobb@modigo.se. Skriv ”Psykolog Lund” i ämnesraden i mailet. Urval sker löpande så skicka in din ansökan så snart som möjligt, dock senast den 14 augusti.</p>",
        "conditions" : null,
        "text" : "Vill du arbeta på en flexibel arbetsplats som tar hänsyn till individens behov – både medarbetarnas och patienternas? Drivs du av att göra ett högkvalitativt arbete? Vill du ha fria arbetstider, tydliga mål och möjlighet till bonus? Då kan Modigo vara arbetsplatsen för dig.\nNu utökar vi vårt team i Lund med en psykolog som ska arbeta med neuropsykiatriska utredningar. Vi söker dig som är trygg i din yrkesroll, har ett genuint intresse för neuropsykiatri och vill ha ett viktigt och utvecklande arbete tillsammans med engagerade och skickliga kollegor.\nOm Modigo\nModigo är en väletablerad vårdgivare och arbetsplats för psykologer, läkare och administrativa medarbetare på fyra orter i Sverige. Vi är specialister inom neuropsykiatri och arbetar inom psykiatrisk öppenvård, med utredningar, behandling, rådgivning och föräldrastöd. Våra sju mottagningar finns i Stockholm, Göteborg, Lund och Sundsvall. Vi har avtal och gott samarbete med ett flertal regioner.\nOm tjänsten\nDå vår verksamhet växer söker vi nu ytterligare psykologer till mottagningen i Lund. Arbetet består i att självständigt genomföra gedigna neuropsykiatriska utredningar av barn och/eller vuxna, baserade på evidensbaserade metoder. På Modigo lägger vi stor vikt vid noggrannhet i samtliga steg i utredningen och genomför alltid breda neuropsykiatriska utredningar. I utredningsarbetet samarbetar du med psykiatriker och tillsammans tar ni ställning till om patienten uppfyller kriterierna för diagnos.\nTjänsten är placerad i fina lokaler i centrala Lund. Du kan välja att arbeta hemifrån när du inte har patientbesök. Du kan välja om du vill arbeta hel- eller deltid.\nVarför jobba på Modigo?\nPå Modigo arbetar du i en verksamhet med god struktur och rutiner kring det kliniska arbetet och kollektivavtal, bra pensionslösningar och friskvårdsbidrag för dig som anställd. Här är några anledningar som våra anställda ofta framhåller med Modigo som arbetsgivare:\n·      Fokus på kvalitet och kompetens. På Modigo är det patientnära arbetet i fokus. Cheferna är psykologer med klinisk bakgrund och deras uppgift är att skapa bra förutsättningar för dig som medarbetare. Du är omgiven av kompetenta kollegor och erbjuds kontinuerligt kompetenshöjande insatser och utbildningar.\n·      Flexibilitet för individuella behov. På Modigo utformar du ditt eget arbete och styr din tid. Det kan handla om att själv planera in när på dagen du har patientbesök – för att få livspusslet att gå ihop – och att arbeta hemifrån när du inte träffar patienter. En annan viktig aspekt är att Modigo tar hänsyn till patienternas behov och önskemål, exempelvis genom möjligheten att genomföra utredningar under en kortare, koncentrerad period.\n·      Framåtanda och högt i tak. Modigo är en prestigelös organisation som hela tiden utvecklas för patienternas och medarbetarnas bästa. Har du idéer som kan göra verksamheten bättre – prata med din chef. Chansen är stor att de snart blir verklighet. \nOm dig\nVi söker dig som har svensk legitimation som psykolog samt goda kunskaper i svenska i både tal och skrift, ytterligare språk är meriterande. Erfarenhet av neuropsykiatriska utredningar i minst 2 år är ett krav. Vi vet att mångfald berikar oss och ser gärna sökande med olika bakgrunder och erfarenheter.\nFör att trivas hos oss är det viktigt att du är:\n - Självständig och strukturerad. Du lägger själv upp en plan för ditt arbete, ser till att få jobbet gjort samtidigt som du tar hand om dig själv, till exempel genom tillräckligt med pauser. \n- Trygg i din yrkesroll och kompetens. Du står på egna ben i det kliniska arbetet, samtidigt som du drar nytta av den struktur och kompetens som finns till ditt förfogande på Modigo.\n- Flexibel och nyfiken. Du vill arbeta i en agil verksamhet som ständigt utvecklas. Du är lösningsorienterad och vill, utifrån den givna strukturen, hitta individuella anpassningar för att hjälpa varje patient så bra som möjligt.\nFrågor\nHar du frågor kring tjänsten är du varmt välkommen att kontakta vår enhetschef för Lund, Jenny Edbladh, via  jenny.edbladh@modigo.se. Får du inget svar semesterperioden så var lugn, Jenny återkommer så fort hon har möjlighet.\nSå ansöker du\nMaila ditt CV till jobb@modigo.se. Skriv ”Psykolog Lund” i ämnesraden i mailet. Urval sker löpande så skicka in din ansökan så snart som möjligt, dock senast den 14 augusti."
      },
      "headline" : "Psykolog för NP-utredningar till växande verksamhet i Lund",
      "driving_license" : null,
      "employer" : {
        "email" : null,
        "phone_number" : null,
        "organization_number" : "5569209561",
        "name" : "Modigo AB",
        "url" : "www.modigo.se",
        "workplace" : "Modigo Lund"
      },
      "removed_date" : null,
      "logo_url" : "https://www.arbetsformedlingen.se/rest/arbetsgivare/rest/af/v3/arbetsplatser/86928664/logotyper/logo.png",
      "last_publication_date" : "2022-08-14T23:59:59",
      "number_of_vacancies" : 1,
      "occupation" : {
        "concept_id" : "xBo9_V9m_bfg",
        "label" : "Psykolog",
        "legacy_ams_taxonomy_id" : "5709"
      },
      "occupation_group" : {
        "concept_id" : "VYeq_GDF_a2g",
        "label" : "Psykologer",
        "legacy_ams_taxonomy_id" : "2241"
      },
      "employment_type" : {
        "concept_id" : "PFZr_Syz_cUq",
        "label" : "Vanlig anställning",
        "legacy_ams_taxonomy_id" : "1"
      },
      "webpage_url" : "https://arbetsformedlingen.se/platsbanken/annonser/26295464",
      "driving_license_required" : false,
      "application_contacts" : [ ],
      "duration" : {
        "concept_id" : "a7uU_j21_mkL",
        "label" : "Tills vidare",
        "legacy_ams_taxonomy_id" : "1"
      },
      "nice_to_have" : {
        "education_level" : [ ],
        "work_experiences" : [ ],
        "skills" : [ ],
        "education" : [ ],
        "languages" : [ ]
      },
      "application_details" : {
        "via_af" : false,
        "email" : "jobb@modigo.se",
        "other" : null,
        "reference" : "Psykolog Lund",
        "url" : null,
        "information" : null
      },
      "source_type" : "VIA_ANNONSERA",
      "application_deadline" : "2022-08-14T23:59:59",
      "external_id" : null,
      "workplace_address" : {
        "coordinates" : [ 13.189809832166523, 55.703443058880595 ],
        "city" : "Lund",
        "postcode" : "22222",
        "municipality" : "Lund",
        "region_concept_id" : "CaRE_1nn_cSU",
        "region" : "Skåne län",
        "country_code" : "199",
        "region_code" : "12",
        "municipality_concept_id" : "muSY_tsR_vDZ",
        "country_concept_id" : "i46j_HmG_v64",
        "municipality_code" : "1281",
        "street_address" : "Lilla Fiskaregatan 12",
        "country" : "Sverige"
      },
      "id" : "26295464",
      "experience_required" : true,
      "working_hours_type" : {
        "concept_id" : "947z_JGS_Uk2",
        "label" : "Deltid",
        "legacy_ams_taxonomy_id" : "2"
      },
      "access" : null,
      "timestamp" : 1657022240294,
      "must_have" : {
        "education_level" : [ ],
        "work_experiences" : [ {
          "concept_id" : "xBo9_V9m_bfg",
          "weight" : 10,
          "label" : "Psykolog",
          "legacy_ams_taxonomy_id" : "5709"
        } ],
        "skills" : [ {
          "concept_id" : "Azca_cCi_Y21",
          "weight" : 10,
          "label" : "Legitimation som psykolog",
          "legacy_ams_taxonomy_id" : "3427"
        } ],
        "education" : [ ],
        "languages" : [ ]
      },
      "occupation_field" : {
        "concept_id" : "NYW6_mP6_vwf",
        "label" : "Hälso- och sjukvård",
        "legacy_ams_taxonomy_id" : "8"
      },
      "scope_of_work" : {
        "min" : 0,
        "max" : 100
      },
      "salary_type" : {
        "concept_id" : "oG8G_9cW_nRf",
        "label" : "Fast månads- vecko- eller timlön",
        "legacy_ams_taxonomy_id" : "1"
      },
      "removed" : false,
      "salary_description" : null,
      "access_to_own_car" : false,
      "publication_date" : "2022-07-05T13:57:20"
    },
    "name" : "Psykolog för NP-utredningar till växande verksamhet i Lund",
    "user" : "kristof.fischer"
  },
  "sha1" : "1a2b111c8f18bad2ab3a78626f7991174165723f",
  "annotations" : [ {
    "preferred-label" : "Psykolog",
    "sentiment" : "MUST_HAVE",
    "type" : "occupation-name",
    "start-position" : 0,
    "end-position" : 8,
    "concept-id" : "xBo9_V9m_bfg",
    "matched-string" : "psykolog",
    "annotation-id" : 0
  }, {
    "preferred-label" : "neuropsykiatri",
    "sentiment" : "MUST_HAVE",
    "type" : "esco-skill",
    "start-position" : 13,
    "end-position" : 27,
    "concept-id" : "hVTC_kQL_qY1",
    "matched-string" : "NP-utredningar",
    "annotation-id" : 11
  }, {
    "preferred-label" : "Lund",
    "type" : "municipality",
    "start-position" : 359,
    "end-position" : 363,
    "concept-id" : "muSY_tsR_vDZ",
    "matched-string" : "Lund",
    "annotation-id" : 12
  }, {
    "preferred-label" : "Psykolog",
    "sentiment" : "MUST_HAVE",
    "type" : "occupation-name",
    "start-position" : 371,
    "end-position" : 379,
    "concept-id" : "xBo9_V9m_bfg",
    "matched-string" : "psykolog",
    "annotation-id" : 1
  }, {
    "preferred-label" : "neuropsykiatri",
    "sentiment" : "MUST_HAVE",
    "type" : "esco-skill",
    "start-position" : 399,
    "end-position" : 428,
    "concept-id" : "hVTC_kQL_qY1",
    "matched-string" : "neuropsykiatriska utredningar",
    "annotation-id" : 13
  }, {
    "preferred-label" : "neuropsykiatri",
    "sentiment" : "MUST_HAVE",
    "type" : "esco-skill",
    "start-position" : 502,
    "end-position" : 516,
    "concept-id" : "hVTC_kQL_qY1",
    "matched-string" : "neuropsykiatri",
    "annotation-id" : 14
  }, {
    "preferred-label" : "Psykolog",
    "sentiment" : "MUST_HAVE",
    "type" : "occupation-name",
    "start-position" : 682,
    "end-position" : 692,
    "concept-id" : "xBo9_V9m_bfg",
    "matched-string" : "psykologer",
    "annotation-id" : 2
  }, {
    "preferred-label" : "Läkare",
    "sentiment" : "MUST_HAVE",
    "type" : "occupation-name",
    "start-position" : 694,
    "end-position" : 700,
    "concept-id" : "9K3i_XD4_Kyy",
    "matched-string" : "läkare",
    "annotation-id" : 3
  }, {
    "preferred-label" : "Administrativa assistenter",
    "type" : "isco-level-4",
    "start-position" : 705,
    "end-position" : 731,
    "concept-id" : "qQt2_8Qw_vMC",
    "matched-string" : "administrativa medarbetare",
    "annotation-id" : 15
  }, {
    "preferred-label" : "Stockholm",
    "type" : "municipality",
    "start-position" : 924,
    "end-position" : 933,
    "concept-id" : "AvNB_uwa_6n6",
    "matched-string" : "Stockholm",
    "annotation-id" : 16
  }, {
    "preferred-label" : "Göteborg",
    "type" : "municipality",
    "start-position" : 935,
    "end-position" : 943,
    "concept-id" : "PVZL_BQT_XtL",
    "matched-string" : "Göteborg",
    "annotation-id" : 17
  }, {
    "preferred-label" : "Lund",
    "type" : "municipality",
    "start-position" : 945,
    "end-position" : 949,
    "concept-id" : "muSY_tsR_vDZ",
    "matched-string" : "Lund",
    "annotation-id" : 18
  }, {
    "preferred-label" : "Sundsvall",
    "type" : "municipality",
    "start-position" : 954,
    "end-position" : 963,
    "concept-id" : "dJbx_FWY_tK6",
    "matched-string" : "Sundsvall",
    "annotation-id" : 19
  }, {
    "preferred-label" : "Psykolog",
    "sentiment" : "MUST_HAVE",
    "type" : "occupation-name",
    "start-position" : 1083,
    "end-position" : 1093,
    "concept-id" : "xBo9_V9m_bfg",
    "matched-string" : "psykologer",
    "annotation-id" : 5
  }, {
    "preferred-label" : "Lund",
    "type" : "municipality",
    "start-position" : 1114,
    "end-position" : 1118,
    "concept-id" : "muSY_tsR_vDZ",
    "matched-string" : "Lund",
    "annotation-id" : 20
  }, {
    "preferred-label" : "arbeta självständigt",
    "sentiment" : "MUST_HAVE",
    "type" : "esco-skill",
    "start-position" : 1141,
    "end-position" : 1154,
    "concept-id" : "NyFu_HHd_zhz",
    "matched-string" : "självständigt",
    "annotation-id" : 21
  }, {
    "preferred-label" : "utföra neuropsykologisk testning",
    "sentiment" : "MUST_HAVE",
    "type" : "esco-skill",
    "start-position" : 1173,
    "end-position" : 1202,
    "concept-id" : "6Euu_6g9_g4p",
    "matched-string" : "neuropsykiatriska utredningar",
    "annotation-id" : 22
  }, {
    "preferred-label" : "noggrannhet",
    "sentiment" : "MUST_HAVE",
    "type" : "esco-skill",
    "start-position" : 1299,
    "end-position" : 1310,
    "concept-id" : "mrsW_EkL_KRD",
    "matched-string" : "noggrannhet",
    "annotation-id" : 23
  }, {
    "preferred-label" : null,
    "type" : "occupation-name",
    "start-position" : 1436,
    "end-position" : 1448,
    "concept-id" : null,
    "matched-string" : "psykiatriker",
    "annotation-id" : 24
  }, {
    "preferred-label" : "Lund",
    "type" : "municipality",
    "start-position" : 1582,
    "end-position" : 1586,
    "concept-id" : "muSY_tsR_vDZ",
    "matched-string" : "Lund",
    "annotation-id" : 25
  }, {
    "preferred-label" : "Distansarbete",
    "sentiment" : "OFFERED",
    "type" : "work-place-environment",
    "start-position" : 1605,
    "end-position" : 1620,
    "concept-id" : "uwzb_xcR_vxS",
    "matched-string" : "arbeta hemifrån",
    "annotation-id" : 26
  }, {
    "preferred-label" : "Heltid/Deltid",
    "type" : "worktime-extent",
    "start-position" : 1682,
    "end-position" : 1699,
    "concept-id" : "hGCt_6Ni_XPz",
    "matched-string" : "hel- eller deltid",
    "annotation-id" : 27
  }, {
    "preferred-label" : "Psykolog",
    "sentiment" : "MUST_HAVE",
    "type" : "occupation-name",
    "start-position" : 2090,
    "end-position" : 2100,
    "concept-id" : "xBo9_V9m_bfg",
    "matched-string" : "psykologer",
    "annotation-id" : 7
  }, {
    "preferred-label" : "Legitimation som psykolog",
    "sentiment" : "MUST_HAVE",
    "type" : "skill",
    "start-position" : 3041,
    "end-position" : 3066,
    "concept-id" : "Azca_cCi_Y21",
    "matched-string" : "legitimation som psykolog",
    "annotation-id" : 8
  }, {
    "preferred-label" : "Svenska",
    "sentiment" : "MUST_HAVE",
    "type" : "language",
    "start-position" : 3089,
    "end-position" : 3096,
    "concept-id" : "zSLA_vw2_FXN",
    "matched-string" : "svenska",
    "annotation-id" : 9
  }, {
    "preferred-label" : "Diverse språk",
    "sentiment" : "NICE_TO_HAVE",
    "type" : "language",
    "start-position" : 3120,
    "end-position" : 3137,
    "concept-id" : "8GQ1_Avf_vdR",
    "matched-string" : "ytterligare språk",
    "annotation-id" : 28
  }, {
    "preferred-label" : "neuropsykiatri",
    "sentiment" : "MUST_HAVE",
    "type" : "esco-skill",
    "start-position" : 3154,
    "end-position" : 3197,
    "concept-id" : "hVTC_kQL_qY1",
    "matched-string" : "Erfarenhet av neuropsykiatriska utredningar",
    "annotation-id" : 29
  }, {
    "preferred-label" : "2-4 års erfarenhet",
    "sentiment" : "MUST_HAVE",
    "type" : "occupation-experience-year",
    "start-position" : 3200,
    "end-position" : 3210,
    "concept-id" : "RWA2_uu6_udD",
    "matched-string" : "minst 2 år",
    "annotation-id" : 30
  }, {
    "preferred-label" : "arbeta självständigt",
    "sentiment" : "MUST_HAVE",
    "type" : "esco-skill",
    "start-position" : 3369,
    "end-position" : 3381,
    "concept-id" : "NyFu_HHd_zhz",
    "matched-string" : "Självständig",
    "annotation-id" : 31
  }, {
    "preferred-label" : "Lösningsfokuserat arbetssätt",
    "sentiment" : "MUST_HAVE",
    "type" : "skill",
    "start-position" : 3832,
    "end-position" : 3850,
    "concept-id" : "94uF_bkH_QF5",
    "matched-string" : "lösningsorienterad",
    "annotation-id" : 32
  } ],
  "text" : "Psykolog för NP-utredningar till växande verksamhet i Lund\nVill du arbeta på en flexibel arbetsplats som tar hänsyn till individens behov – både medarbetarnas och patienternas? Drivs du av att göra ett högkvalitativt arbete? Vill du ha fria arbetstider, tydliga mål och möjlighet till bonus? Då kan Modigo vara arbetsplatsen för dig.\nNu utökar vi vårt team i Lund med en psykolog som ska arbeta med neuropsykiatriska utredningar. Vi söker dig som är trygg i din yrkesroll, har ett genuint intresse för neuropsykiatri och vill ha ett viktigt och utvecklande arbete tillsammans med engagerade och skickliga kollegor.\nOm Modigo\nModigo är en väletablerad vårdgivare och arbetsplats för psykologer, läkare och administrativa medarbetare på fyra orter i Sverige. Vi är specialister inom neuropsykiatri och arbetar inom psykiatrisk öppenvård, med utredningar, behandling, rådgivning och föräldrastöd. Våra sju mottagningar finns i Stockholm, Göteborg, Lund och Sundsvall. Vi har avtal och gott samarbete med ett flertal regioner.\nOm tjänsten\nDå vår verksamhet växer söker vi nu ytterligare psykologer till mottagningen i Lund. Arbetet består i att självständigt genomföra gedigna neuropsykiatriska utredningar av barn och/eller vuxna, baserade på evidensbaserade metoder. På Modigo lägger vi stor vikt vid noggrannhet i samtliga steg i utredningen och genomför alltid breda neuropsykiatriska utredningar. I utredningsarbetet samarbetar du med psykiatriker och tillsammans tar ni ställning till om patienten uppfyller kriterierna för diagnos.\nTjänsten är placerad i fina lokaler i centrala Lund. Du kan välja att arbeta hemifrån när du inte har patientbesök. Du kan välja om du vill arbeta hel- eller deltid.\nVarför jobba på Modigo?\nPå Modigo arbetar du i en verksamhet med god struktur och rutiner kring det kliniska arbetet och kollektivavtal, bra pensionslösningar och friskvårdsbidrag för dig som anställd. Här är några anledningar som våra anställda ofta framhåller med Modigo som arbetsgivare:\n·      Fokus på kvalitet och kompetens. På Modigo är det patientnära arbetet i fokus. Cheferna är psykologer med klinisk bakgrund och deras uppgift är att skapa bra förutsättningar för dig som medarbetare. Du är omgiven av kompetenta kollegor och erbjuds kontinuerligt kompetenshöjande insatser och utbildningar.\n·      Flexibilitet för individuella behov. På Modigo utformar du ditt eget arbete och styr din tid. Det kan handla om att själv planera in när på dagen du har patientbesök – för att få livspusslet att gå ihop – och att arbeta hemifrån när du inte träffar patienter. En annan viktig aspekt är att Modigo tar hänsyn till patienternas behov och önskemål, exempelvis genom möjligheten att genomföra utredningar under en kortare, koncentrerad period.\n·      Framåtanda och högt i tak. Modigo är en prestigelös organisation som hela tiden utvecklas för patienternas och medarbetarnas bästa. Har du idéer som kan göra verksamheten bättre – prata med din chef. Chansen är stor att de snart blir verklighet. \nOm dig\nVi söker dig som har svensk legitimation som psykolog samt goda kunskaper i svenska i både tal och skrift, ytterligare språk är meriterande. Erfarenhet av neuropsykiatriska utredningar i minst 2 år är ett krav. Vi vet att mångfald berikar oss och ser gärna sökande med olika bakgrunder och erfarenheter.\nFör att trivas hos oss är det viktigt att du är:\n - Självständig och strukturerad. Du lägger själv upp en plan för ditt arbete, ser till att få jobbet gjort samtidigt som du tar hand om dig själv, till exempel genom tillräckligt med pauser. \n- Trygg i din yrkesroll och kompetens. Du står på egna ben i det kliniska arbetet, samtidigt som du drar nytta av den struktur och kompetens som finns till ditt förfogande på Modigo.\n- Flexibel och nyfiken. Du vill arbeta i en agil verksamhet som ständigt utvecklas. Du är lösningsorienterad och vill, utifrån den givna strukturen, hitta individuella anpassningar för att hjälpa varje patient så bra som möjligt.\nFrågor\nHar du frågor kring tjänsten är du varmt välkommen att kontakta vår enhetschef för Lund, Jenny Edbladh, via  jenny.edbladh@modigo.se. Får du inget svar semesterperioden så var lugn, Jenny återkommer så fort hon har möjlighet.\nSå ansöker du\nMaila ditt CV till jobb@modigo.se. Skriv ”Psykolog Lund” i ämnesraden i mailet. Urval sker löpande så skicka in din ansökan så snart som möjligt, dock senast den 14 augusti."
}