{
  "meta" : {
    "jobad" : {
      "description" : {
        "requirements" : null,
        "needs" : null,
        "company_information" : null,
        "text_formatted" : "Hej du som söker nya tekniska utmaningar! Här erbjuds du en roll med inslag av projektledning, avancerad teknik och installation av en världsledande produkt på plats hos våra kunder i Asien, USA och Europa. Låter det spännande? Läs mer om den här tjänsten på Shapeline i Linköping!\n\nOm företaget\nShapeline AB är en Linköpingsbaserad tillverkare av laserbaserade system för planhetsmätning inom den globala stål- och metallindustrin. Vi utvecklar, marknadsför och installerar mätsystem för beröringsfri planhetsmätning till våra kunder. Tekniken i systemen, som idag är världsledande, bygger på lasertriangulering och avancerad bildbehandling i realtid för att uppnå optimal prestanda.\n\nShapeline är i nuläget ett relativt litet företag med tydliga tillväxtambitioner. Vi är i dagsläget 11 anställda. Det innebär att varje medarbetare är en viktig pusselbit och kan påverka företagets framtid i hög grad.\n\nDina arbetsuppgifter\nI grova drag kommer du, självständigt eller i team, arbeta med tillverkning, slutmontage och test till färdig installation och integration av vår produkt. Systemen i sig innefattar mekanik, optik, elektronik och mjukvara och du arbetar med samtliga delar med stöd från dina kollegor i produktionen samt våra mjukvaruutvecklare. \nDu kan även förvänta dig att;\n- Vara supportfunktion till befintliga kunder\n- Utbilda våra kunders användare av Shapeline’s produkt\n\nTjänsten innefattar kontakter med kunder världen över, både via mejl och telefon samt direkt på plats hos kund. Du får ett stort eget ansvar och måste kunna arbeta både enskilt och i team. Tjänsten innebär resande, ca 60–80 dagar, främst internationellt där Asien, USA och Europa är våra största marknader.\n\nDin profil\nFör att lyckas i rollen tror vi att du har en utbildningsgrund som gymnasieingenjör med några års erfarenhet av ”brett tekniskt arbete”. Det är viktigt att du har ett eget driv, tar ansvar och arbetar strukturerat och systematiskt för att säkerställa kvalitet i alla led mot kund. Du har även förmågan att hantera flera parallella projekt. Du är tekniskt intresserad, gärna inom ett eller fler av dessa områden; mekanik, elektronik, mjukvara samt är införstådd i mekanik- och elritningar. Viktigast för oss är dock att du tycker det är stimulerande att lära dig nya saker. Vi ser det som självklart att du har datavana och du kommunicerar obehindrat på svenska och engelska i både tal och skrift. B-körkort är ett krav.\n\nVad erbjuder vi dig? En stimulerande och ansvarsfull roll med stor möjlighet att påverka i ett företag med en världsledande produkt. Du kommer till ett företag som levererat och fortsätter leverera produkter till branschledande kunder, med högt fokus på service och kvalitet. Företagskulturen är öppen och hjälpsam. Chef och övriga kollegor står redo för att ge dig de verktyg du behöver för att lyckas och trivas i rollen.\n\nAnsökningsförfarande\nI denna rekrytering samarbetar Shapeline med Skill. Vid frågor kontakta gärna ansvarig rekryteringskonsult Rasmus Rosander, rasmus.rosander@skill.se. Du ansöker genom att logga in eller registrera CV och personligt brev på www.skill.se. Registrering i vår databas innebär ett enklare rekryteringsförfarande för dig och för oss. Intervjuer och urval sker löpande så tjänsten kan komma att tillsättas innan sista datum. Passa därför på att skicka in din ansökan redan idag! Välkommen med din ansökan!",
        "conditions" : "Heltid\r\nTillsvidare",
        "text" : "Hej du som söker nya tekniska utmaningar! Här erbjuds du en roll med inslag av projektledning, avancerad teknik och installation av en världsledande produkt på plats hos våra kunder i Asien, USA och Europa. Låter det spännande? Läs mer om den här tjänsten på Shapeline i Linköping!\n\nOm företaget\nShapeline AB är en Linköpingsbaserad tillverkare av laserbaserade system för planhetsmätning inom den globala stål- och metallindustrin. Vi utvecklar, marknadsför och installerar mätsystem för beröringsfri planhetsmätning till våra kunder. Tekniken i systemen, som idag är världsledande, bygger på lasertriangulering och avancerad bildbehandling i realtid för att uppnå optimal prestanda.\n\nShapeline är i nuläget ett relativt litet företag med tydliga tillväxtambitioner. Vi är i dagsläget 11 anställda. Det innebär att varje medarbetare är en viktig pusselbit och kan påverka företagets framtid i hög grad.\n\nDina arbetsuppgifter\nI grova drag kommer du, självständigt eller i team, arbeta med tillverkning, slutmontage och test till färdig installation och integration av vår produkt. Systemen i sig innefattar mekanik, optik, elektronik och mjukvara och du arbetar med samtliga delar med stöd från dina kollegor i produktionen samt våra mjukvaruutvecklare. \nDu kan även förvänta dig att;\n- Vara supportfunktion till befintliga kunder\n- Utbilda våra kunders användare av Shapeline’s produkt\n\nTjänsten innefattar kontakter med kunder världen över, både via mejl och telefon samt direkt på plats hos kund. Du får ett stort eget ansvar och måste kunna arbeta både enskilt och i team. Tjänsten innebär resande, ca 60–80 dagar, främst internationellt där Asien, USA och Europa är våra största marknader.\n\nDin profil\nFör att lyckas i rollen tror vi att du har en utbildningsgrund som gymnasieingenjör med några års erfarenhet av ”brett tekniskt arbete”. Det är viktigt att du har ett eget driv, tar ansvar och arbetar strukturerat och systematiskt för att säkerställa kvalitet i alla led mot kund. Du har även förmågan att hantera flera parallella projekt. Du är tekniskt intresserad, gärna inom ett eller fler av dessa områden; mekanik, elektronik, mjukvara samt är införstådd i mekanik- och elritningar. Viktigast för oss är dock att du tycker det är stimulerande att lära dig nya saker. Vi ser det som självklart att du har datavana och du kommunicerar obehindrat på svenska och engelska i både tal och skrift. B-körkort är ett krav.\n\nVad erbjuder vi dig? En stimulerande och ansvarsfull roll med stor möjlighet att påverka i ett företag med en världsledande produkt. Du kommer till ett företag som levererat och fortsätter leverera produkter till branschledande kunder, med högt fokus på service och kvalitet. Företagskulturen är öppen och hjälpsam. Chef och övriga kollegor står redo för att ge dig de verktyg du behöver för att lyckas och trivas i rollen.\n\nAnsökningsförfarande\nI denna rekrytering samarbetar Shapeline med Skill. Vid frågor kontakta gärna ansvarig rekryteringskonsult Rasmus Rosander, rasmus.rosander@skill.se. Du ansöker genom att logga in eller registrera CV och personligt brev på www.skill.se. Registrering i vår databas innebär ett enklare rekryteringsförfarande för dig och för oss. Intervjuer och urval sker löpande så tjänsten kan komma att tillsättas innan sista datum. Passa därför på att skicka in din ansökan redan idag! Välkommen med din ansökan!"
      },
      "headline" : "Tekniker till Shapeline i Linköping",
      "driving_license" : [ {
        "concept_id" : "VTK8_WRx_GcM",
        "label" : "B",
        "legacy_ams_taxonomy_id" : "3"
      } ],
      "employer" : {
        "email" : null,
        "phone_number" : null,
        "organization_number" : "5566858618",
        "name" : "Skill Rekrytering & Bemanning AB",
        "url" : "https://skill.se/",
        "workplace" : "Skill Rekrytering & Bemanning AB"
      },
      "removed_date" : null,
      "logo_url" : "https://www.arbetsformedlingen.se/rest/arbetsgivare/rest/af/v3/organisation/5566858618/logotyper/logo.png",
      "last_publication_date" : "2022-08-28T23:59:59",
      "number_of_vacancies" : 1,
      "occupation" : {
        "concept_id" : "1ciU_tMj_Toc",
        "label" : "Verkstadsmekaniker/Verkstadstekniker",
        "legacy_ams_taxonomy_id" : "2930"
      },
      "occupation_group" : {
        "concept_id" : "vaEp_iBS_c5h",
        "label" : "Maskinställare och maskinoperatörer, metallarbete",
        "legacy_ams_taxonomy_id" : "7223"
      },
      "employment_type" : {
        "concept_id" : "PFZr_Syz_cUq",
        "label" : "Vanlig anställning",
        "legacy_ams_taxonomy_id" : "1"
      },
      "webpage_url" : "https://arbetsformedlingen.se/platsbanken/annonser/26364885",
      "driving_license_required" : true,
      "application_contacts" : [ {
        "description" : "Rasmus Rosander",
        "email" : "Rasmus.rosander@skill.se",
        "telephone" : null,
        "name" : null,
        "contact_type" : null
      } ],
      "duration" : {
        "concept_id" : "a7uU_j21_mkL",
        "label" : "Tills vidare",
        "legacy_ams_taxonomy_id" : "1"
      },
      "nice_to_have" : {
        "education_level" : [ ],
        "work_experiences" : [ ],
        "skills" : [ ],
        "education" : [ ],
        "languages" : [ ]
      },
      "application_details" : {
        "via_af" : false,
        "email" : null,
        "other" : null,
        "reference" : "7191",
        "url" : "http://www.skill.se/ga-till-jobb/?jaid=7191",
        "information" : null
      },
      "source_type" : "VIA_PLATSBANKEN_DXA",
      "application_deadline" : "2022-08-28T23:59:59",
      "external_id" : "46-556685-8618-7191",
      "workplace_address" : {
        "coordinates" : [ 15.621373, 58.41081 ],
        "city" : null,
        "postcode" : null,
        "municipality" : "Linköping",
        "region_concept_id" : "oLT3_Q9p_3nn",
        "region" : "Östergötlands län",
        "country_code" : "199",
        "region_code" : "05",
        "municipality_concept_id" : "bm2x_1mr_Qhx",
        "country_concept_id" : "i46j_HmG_v64",
        "municipality_code" : "0580",
        "street_address" : null,
        "country" : "Sverige"
      },
      "id" : "26364885",
      "experience_required" : true,
      "working_hours_type" : {
        "concept_id" : "6YE1_gAC_R2G",
        "label" : "Heltid",
        "legacy_ams_taxonomy_id" : "1"
      },
      "access" : null,
      "timestamp" : 1659264954208,
      "must_have" : {
        "education_level" : [ ],
        "work_experiences" : [ {
          "concept_id" : "1ciU_tMj_Toc",
          "weight" : 10,
          "label" : "Verkstadsmekaniker/Verkstadstekniker",
          "legacy_ams_taxonomy_id" : "2930"
        } ],
        "skills" : [ ],
        "education" : [ ],
        "languages" : [ ]
      },
      "occupation_field" : {
        "concept_id" : "wTEr_CBC_bqh",
        "label" : "Industriell tillverkning",
        "legacy_ams_taxonomy_id" : "9"
      },
      "scope_of_work" : {
        "min" : 100,
        "max" : 100
      },
      "salary_type" : {
        "concept_id" : "oG8G_9cW_nRf",
        "label" : "Fast månads- vecko- eller timlön",
        "legacy_ams_taxonomy_id" : "1"
      },
      "removed" : false,
      "salary_description" : "Fast lön",
      "access_to_own_car" : false,
      "publication_date" : "2022-08-03T00:00:00"
    },
    "name" : "Tekniker till Shapeline i Linköping",
    "user" : "hannes"
  },
  "sha1" : "67ac666636aea0185ec64a48384dd8b51c22b095",
  "annotations" : [ {
    "preferred-label" : "Linköping",
    "type" : "municipality",
    "start-position" : 26,
    "end-position" : 35,
    "concept-id" : "bm2x_1mr_Qhx",
    "matched-string" : "Linköping",
    "annotation-id" : 10
  }, {
    "preferred-label" : "projektledning",
    "type" : "esco-skill",
    "start-position" : 115,
    "end-position" : 129,
    "concept-id" : "PPNS_ZLX_YsQ",
    "matched-string" : "projektledning",
    "annotation-id" : 11
  }, {
    "preferred-label" : "Linköping",
    "type" : "municipality",
    "start-position" : 307,
    "end-position" : 316,
    "concept-id" : "bm2x_1mr_Qhx",
    "matched-string" : "Linköping",
    "annotation-id" : 12
  }, {
    "preferred-label" : "Linköping",
    "type" : "municipality",
    "start-position" : 351,
    "end-position" : 368,
    "concept-id" : "bm2x_1mr_Qhx",
    "matched-string" : "Linköpingsbaserad",
    "annotation-id" : 13
  }, {
    "preferred-label" : "arbeta självständigt",
    "type" : "esco-skill",
    "start-position" : 986,
    "end-position" : 999,
    "concept-id" : "NyFu_HHd_zhz",
    "matched-string" : "självständigt",
    "annotation-id" : 14
  }, {
    "preferred-label" : "Tillverkning",
    "sentiment" : "MUST_HAVE",
    "type" : "sni-level-1",
    "start-position" : 1025,
    "end-position" : 1037,
    "concept-id" : "trPt_iHy_oFP",
    "matched-string" : "tillverkning",
    "annotation-id" : 0
  }, {
    "preferred-label" : "Mekanik",
    "sentiment" : "MUST_HAVE",
    "type" : "skill",
    "start-position" : 1143,
    "end-position" : 1150,
    "concept-id" : "ygEQ_Pwp_ozn",
    "matched-string" : "mekanik",
    "annotation-id" : 1
  }, {
    "preferred-label" : "optik",
    "type" : "esco-skill",
    "start-position" : 1152,
    "end-position" : 1157,
    "concept-id" : "aR94_6EA_fqH",
    "matched-string" : "optik",
    "annotation-id" : 15
  }, {
    "preferred-label" : "elektronik",
    "type" : "esco-skill",
    "start-position" : 1159,
    "end-position" : 1169,
    "concept-id" : "S9Th_73n_Fpu",
    "matched-string" : "elektronik",
    "annotation-id" : 16
  }, {
    "preferred-label" : "Mjukvaruutvecklare",
    "sentiment" : "MUST_HAVE",
    "type" : "occupation-name",
    "start-position" : 1270,
    "end-position" : 1288,
    "concept-id" : "rQds_YGd_quU",
    "matched-string" : "mjukvaruutvecklare",
    "annotation-id" : 2
  }, {
    "preferred-label" : "Supportfunktion",
    "sentiment" : "MUST_HAVE",
    "type" : "keyword",
    "start-position" : 1328,
    "end-position" : 1343,
    "concept-id" : "3ejN_ycL_sdm",
    "matched-string" : "supportfunktion",
    "annotation-id" : 3
  }, {
    "preferred-label" : "Resor i arbetet förekommer",
    "type" : "work-place-environment",
    "start-position" : 1613,
    "end-position" : 1637,
    "concept-id" : "oaM2_JTK_muh",
    "matched-string" : "Tjänsten innebär resande",
    "annotation-id" : 17
  }, {
    "preferred-label" : "Gymnasieingenjörsutbildning, inriktning produktionsteknik (T4)",
    "type" : "keyword",
    "start-position" : 1810,
    "end-position" : 1826,
    "concept-id" : "4Zza_Ceq_LKH",
    "matched-string" : "gymnasieingenjör",
    "annotation-id" : 18
  }, {
    "preferred-label" : "Mekanik",
    "sentiment" : "MUST_HAVE",
    "type" : "skill",
    "start-position" : 2155,
    "end-position" : 2162,
    "concept-id" : "ygEQ_Pwp_ozn",
    "matched-string" : "mekanik",
    "annotation-id" : 4
  }, {
    "preferred-label" : "elektronik",
    "type" : "esco-skill",
    "start-position" : 2164,
    "end-position" : 2174,
    "concept-id" : "S9Th_73n_Fpu",
    "matched-string" : "elektronik",
    "annotation-id" : 19
  }, {
    "preferred-label" : "Mekanik",
    "sentiment" : "MUST_HAVE",
    "type" : "skill",
    "start-position" : 2206,
    "end-position" : 2213,
    "concept-id" : "ygEQ_Pwp_ozn",
    "matched-string" : "mekanik",
    "annotation-id" : 5
  }, {
    "preferred-label" : "Svenska",
    "sentiment" : "MUST_HAVE",
    "type" : "language",
    "start-position" : 2396,
    "end-position" : 2403,
    "concept-id" : "zSLA_vw2_FXN",
    "matched-string" : "svenska",
    "annotation-id" : 6
  }, {
    "preferred-label" : "Engelska",
    "sentiment" : "MUST_HAVE",
    "type" : "language",
    "start-position" : 2408,
    "end-position" : 2416,
    "concept-id" : "NVxJ_hLg_TYS",
    "matched-string" : "engelska",
    "annotation-id" : 7
  }, {
    "preferred-label" : "B",
    "type" : "driving-licence",
    "start-position" : 2440,
    "end-position" : 2449,
    "concept-id" : "VTK8_WRx_GcM",
    "matched-string" : "B-körkort",
    "annotation-id" : 20
  }, {
    "preferred-label" : "Verktyg",
    "sentiment" : "MUST_HAVE",
    "type" : "skill",
    "start-position" : 2833,
    "end-position" : 2840,
    "concept-id" : "KG9j_WxP_ym2",
    "matched-string" : "verktyg",
    "annotation-id" : 8
  }, {
    "preferred-label" : "rekryteringskonsult",
    "sentiment" : "MUST_HAVE",
    "type" : "esco-occupation",
    "start-position" : 2997,
    "end-position" : 3016,
    "concept-id" : "tGyt_via_HNb",
    "matched-string" : "rekryteringskonsult",
    "annotation-id" : 9
  } ],
  "text" : "Tekniker till Shapeline i Linköping\nHej du som söker nya tekniska utmaningar! Här erbjuds du en roll med inslag av projektledning, avancerad teknik och installation av en världsledande produkt på plats hos våra kunder i Asien, USA och Europa. Låter det spännande? Läs mer om den här tjänsten på Shapeline i Linköping!\n\nOm företaget\nShapeline AB är en Linköpingsbaserad tillverkare av laserbaserade system för planhetsmätning inom den globala stål- och metallindustrin. Vi utvecklar, marknadsför och installerar mätsystem för beröringsfri planhetsmätning till våra kunder. Tekniken i systemen, som idag är världsledande, bygger på lasertriangulering och avancerad bildbehandling i realtid för att uppnå optimal prestanda.\n\nShapeline är i nuläget ett relativt litet företag med tydliga tillväxtambitioner. Vi är i dagsläget 11 anställda. Det innebär att varje medarbetare är en viktig pusselbit och kan påverka företagets framtid i hög grad.\n\nDina arbetsuppgifter\nI grova drag kommer du, självständigt eller i team, arbeta med tillverkning, slutmontage och test till färdig installation och integration av vår produkt. Systemen i sig innefattar mekanik, optik, elektronik och mjukvara och du arbetar med samtliga delar med stöd från dina kollegor i produktionen samt våra mjukvaruutvecklare. \nDu kan även förvänta dig att;\n- Vara supportfunktion till befintliga kunder\n- Utbilda våra kunders användare av Shapeline’s produkt\n\nTjänsten innefattar kontakter med kunder världen över, både via mejl och telefon samt direkt på plats hos kund. Du får ett stort eget ansvar och måste kunna arbeta både enskilt och i team. Tjänsten innebär resande, ca 60–80 dagar, främst internationellt där Asien, USA och Europa är våra största marknader.\n\nDin profil\nFör att lyckas i rollen tror vi att du har en utbildningsgrund som gymnasieingenjör med några års erfarenhet av ”brett tekniskt arbete”. Det är viktigt att du har ett eget driv, tar ansvar och arbetar strukturerat och systematiskt för att säkerställa kvalitet i alla led mot kund. Du har även förmågan att hantera flera parallella projekt. Du är tekniskt intresserad, gärna inom ett eller fler av dessa områden; mekanik, elektronik, mjukvara samt är införstådd i mekanik- och elritningar. Viktigast för oss är dock att du tycker det är stimulerande att lära dig nya saker. Vi ser det som självklart att du har datavana och du kommunicerar obehindrat på svenska och engelska i både tal och skrift. B-körkort är ett krav.\n\nVad erbjuder vi dig? En stimulerande och ansvarsfull roll med stor möjlighet att påverka i ett företag med en världsledande produkt. Du kommer till ett företag som levererat och fortsätter leverera produkter till branschledande kunder, med högt fokus på service och kvalitet. Företagskulturen är öppen och hjälpsam. Chef och övriga kollegor står redo för att ge dig de verktyg du behöver för att lyckas och trivas i rollen.\n\nAnsökningsförfarande\nI denna rekrytering samarbetar Shapeline med Skill. Vid frågor kontakta gärna ansvarig rekryteringskonsult Rasmus Rosander, rasmus.rosander@skill.se. Du ansöker genom att logga in eller registrera CV och personligt brev på www.skill.se. Registrering i vår databas innebär ett enklare rekryteringsförfarande för dig och för oss. Intervjuer och urval sker löpande så tjänsten kan komma att tillsättas innan sista datum. Passa därför på att skicka in din ansökan redan idag! Välkommen med din ansökan!"
}