{
  "meta" : {
    "jobad" : {
      "description" : {
        "requirements" : null,
        "needs" : null,
        "company_information" : null,
        "text_formatted" : "<p><strong>Vilka är vi?</strong></p><p>Lyckåhem Hotell &amp; Studiolägenheter är ett bekvämt och flexibelt hotell med uthyrning av både hotell- och vandrarhemsrum samt mindre studiolägenheter. Hotellet har under de senaste åren genomgått en omfattande renovering, vilket gör att vi kan erbjuda fräscha och moderna rum. Våra gäster utgörs av alltifrån semesterfirare som bor här ett par dagar, till studenter och företagskunder som stannar längre perioder. Här bor våra gäster omgivna av hagar med betande hästar och många uppskattar under sommaren att koppla av i vår stora trädgård. </p><p><strong>Vem är du?</strong></p><p>Inför sommarens högsäsong och ordinarie personals semestrar söker vi omgående dig som vill ha ett trevligt och fartfyllt extraarbete inom både städ och reception.</p><p>Vi söker dig som är glad, positiv och har lätt för att samarbeta. Då arbetet innebär mycket kontakt med våra gäster både på plats och i telefon lägger vi stor vikt vid att du har god social kompetens och att du behärskar både svenska och engelska väl. Har du tidigare vana av kassaarbete samt erfarenhet av arbete med bokningssystem är det ett plus men inget krav. Du ska trivas med att arbeta aktivt och stundvis i ett högt tempo då sommaren är vår mest fartfyllda period. </p><p><strong>Dina arbetsuppgifter:</strong> </p><p>·        Städning av hotellrummen och de gemensamma utrymmena</p><p>·        Bemanning av vår reception </p><p>·        Tvätt och mangling</p><p>·        Beredning av frukostbuffé</p><p>Tjänsten är inledningsvis en behovsanställning under sommarmånaderna, med möjlighet till förlängning för rätt person. Tillträde omgående. </p><p>Maila din ansökan till: <strong>info@lyckahem.se</strong></p>",
        "conditions" : null,
        "text" : "Vilka är vi?\nLyckåhem Hotell & Studiolägenheter är ett bekvämt och flexibelt hotell med uthyrning av både hotell- och vandrarhemsrum samt mindre studiolägenheter. Hotellet har under de senaste åren genomgått en omfattande renovering, vilket gör att vi kan erbjuda fräscha och moderna rum. Våra gäster utgörs av alltifrån semesterfirare som bor här ett par dagar, till studenter och företagskunder som stannar längre perioder. Här bor våra gäster omgivna av hagar med betande hästar och många uppskattar under sommaren att koppla av i vår stora trädgård. \nVem är du?\nInför sommarens högsäsong och ordinarie personals semestrar söker vi omgående dig som vill ha ett trevligt och fartfyllt extraarbete inom både städ och reception.\nVi söker dig som är glad, positiv och har lätt för att samarbeta. Då arbetet innebär mycket kontakt med våra gäster både på plats och i telefon lägger vi stor vikt vid att du har god social kompetens och att du behärskar både svenska och engelska väl. Har du tidigare vana av kassaarbete samt erfarenhet av arbete med bokningssystem är det ett plus men inget krav. Du ska trivas med att arbeta aktivt och stundvis i ett högt tempo då sommaren är vår mest fartfyllda period. \nDina arbetsuppgifter: \n·        Städning av hotellrummen och de gemensamma utrymmena\n·        Bemanning av vår reception \n·        Tvätt och mangling\n·        Beredning av frukostbuffé\nTjänsten är inledningsvis en behovsanställning under sommarmånaderna, med möjlighet till förlängning för rätt person. Tillträde omgående. \nMaila din ansökan till: info@lyckahem.se"
      },
      "headline" : "Lokalvårdare/Receptionist",
      "driving_license" : [ {
        "concept_id" : "VTK8_WRx_GcM",
        "label" : "B",
        "legacy_ams_taxonomy_id" : "3"
      } ],
      "employer" : {
        "email" : null,
        "phone_number" : null,
        "organization_number" : "5590799945",
        "name" : "Lyckåhem Hotell & Studiolägenheter AB",
        "url" : "lyckahem.se",
        "workplace" : "Lyckåhem Hotell & Studiolägenheter AB"
      },
      "removed_date" : null,
      "logo_url" : null,
      "last_publication_date" : "2022-08-20T23:59:59",
      "number_of_vacancies" : 2,
      "occupation" : {
        "concept_id" : "dYo1_D8c_87U",
        "label" : "Städare/Lokalvårdare",
        "legacy_ams_taxonomy_id" : "464"
      },
      "occupation_group" : {
        "concept_id" : "Z6TY_xDf_Yup",
        "label" : "Städare",
        "legacy_ams_taxonomy_id" : "9111"
      },
      "employment_type" : {
        "concept_id" : "PFZr_Syz_cUq",
        "label" : "Vanlig anställning",
        "legacy_ams_taxonomy_id" : "1"
      },
      "webpage_url" : "https://arbetsformedlingen.se/platsbanken/annonser/26343189",
      "driving_license_required" : true,
      "application_contacts" : [ ],
      "duration" : {
        "concept_id" : "Sy9J_aRd_ALx",
        "label" : "11 dagar - upp till 3 månader",
        "legacy_ams_taxonomy_id" : "7"
      },
      "nice_to_have" : {
        "education_level" : [ ],
        "work_experiences" : [ {
          "concept_id" : "dYo1_D8c_87U",
          "weight" : 5,
          "label" : "Städare/Lokalvårdare",
          "legacy_ams_taxonomy_id" : "464"
        } ],
        "skills" : [ ],
        "education" : [ ],
        "languages" : [ ]
      },
      "application_details" : {
        "via_af" : false,
        "email" : "info@lyckahem.se",
        "other" : null,
        "reference" : null,
        "url" : null,
        "information" : null
      },
      "source_type" : "VIA_ANNONSERA",
      "application_deadline" : "2022-08-20T23:59:59",
      "external_id" : null,
      "workplace_address" : {
        "coordinates" : [ 15.648366421110033, 56.20558160234367 ],
        "city" : "Lyckeby",
        "postcode" : "37163",
        "municipality" : "Karlskrona",
        "region_concept_id" : "DQZd_uYs_oKb",
        "region" : "Blekinge län",
        "country_code" : "199",
        "region_code" : "10",
        "municipality_concept_id" : "YSt4_bAa_ccs",
        "country_concept_id" : "i46j_HmG_v64",
        "municipality_code" : "1080",
        "street_address" : "Afvelsgärdevägen 31",
        "country" : "Sverige"
      },
      "id" : "26343189",
      "experience_required" : true,
      "working_hours_type" : {
        "concept_id" : "6YE1_gAC_R2G",
        "label" : "Heltid",
        "legacy_ams_taxonomy_id" : "1"
      },
      "access" : null,
      "timestamp" : 1658377290278,
      "must_have" : {
        "education_level" : [ ],
        "work_experiences" : [ ],
        "skills" : [ ],
        "education" : [ ],
        "languages" : [ {
          "concept_id" : "zSLA_vw2_FXN",
          "weight" : 10,
          "label" : "Svenska",
          "legacy_ams_taxonomy_id" : "502"
        }, {
          "concept_id" : "NVxJ_hLg_TYS",
          "weight" : 10,
          "label" : "Engelska",
          "legacy_ams_taxonomy_id" : "283"
        } ]
      },
      "occupation_field" : {
        "concept_id" : "whao_Q6A_ScE",
        "label" : "Sanering och renhållning",
        "legacy_ams_taxonomy_id" : "12"
      },
      "scope_of_work" : {
        "min" : 0,
        "max" : 100
      },
      "salary_type" : {
        "concept_id" : "oG8G_9cW_nRf",
        "label" : "Fast månads- vecko- eller timlön",
        "legacy_ams_taxonomy_id" : "1"
      },
      "removed" : false,
      "salary_description" : null,
      "access_to_own_car" : false,
      "publication_date" : "2022-07-21T06:21:30"
    },
    "name" : "Lokalvårdare/Receptionist",
    "user" : "kristof.fischer"
  },
  "sha1" : "1e407579d99e8b4fb31a37132bbe5dd8b442185f",
  "annotations" : [ {
    "preferred-label" : "Städare/Lokalvårdare",
    "sentiment" : "MUST_HAVE",
    "type" : "occupation-name",
    "start-position" : 0,
    "end-position" : 12,
    "concept-id" : "dYo1_D8c_87U",
    "matched-string" : "lokalvårdare",
    "annotation-id" : 0
  }, {
    "preferred-label" : "receptionist",
    "sentiment" : "MUST_HAVE",
    "type" : "esco-occupation",
    "start-position" : 13,
    "end-position" : 25,
    "concept-id" : "CuKc_tvM_gzc",
    "matched-string" : "receptionist",
    "annotation-id" : 1
  }, {
    "preferred-label" : "samarbeta med kolleger",
    "sentiment" : "MUST_HAVE",
    "type" : "esco-skill",
    "start-position" : 797,
    "end-position" : 819,
    "concept-id" : "X15R_797_q62",
    "matched-string" : "lätt för att samarbeta",
    "annotation-id" : 13
  }, {
    "preferred-label" : null,
    "sentiment" : "MUST_HAVE",
    "type" : "skill",
    "start-position" : 934,
    "end-position" : 954,
    "concept-id" : null,
    "matched-string" : "god social kompetens",
    "annotation-id" : 14
  }, {
    "preferred-label" : "Svenska",
    "sentiment" : "MUST_HAVE",
    "type" : "language",
    "start-position" : 981,
    "end-position" : 988,
    "concept-id" : "zSLA_vw2_FXN",
    "matched-string" : "svenska",
    "annotation-id" : 7
  }, {
    "preferred-label" : "Engelska",
    "sentiment" : "MUST_HAVE",
    "type" : "language",
    "start-position" : 993,
    "end-position" : 1001,
    "concept-id" : "NVxJ_hLg_TYS",
    "matched-string" : "engelska",
    "annotation-id" : 8
  }, {
    "preferred-label" : "Kassavana",
    "sentiment" : "NICE_TO_HAVE",
    "type" : "skill",
    "start-position" : 1023,
    "end-position" : 1042,
    "concept-id" : "hYpk_RYx_y3V",
    "matched-string" : "vana av kassaarbete",
    "annotation-id" : 15
  }, {
    "preferred-label" : "Bokningssystem",
    "sentiment" : "NICE_TO_HAVE",
    "type" : "skill-headline",
    "start-position" : 1073,
    "end-position" : 1087,
    "concept-id" : "kRoQ_fPR_8oK",
    "matched-string" : "bokningssystem",
    "annotation-id" : 9
  }, {
    "preferred-label" : "Städvana, hotell",
    "sentiment" : "MUST_HAVE",
    "type" : "skill",
    "start-position" : 1262,
    "end-position" : 1314,
    "concept-id" : "6XRu_MQm_4NK",
    "matched-string" : "Städning av hotellrummen och de gemensamma utrymmena",
    "annotation-id" : 16
  }, {
    "preferred-label" : "sköta reception",
    "sentiment" : "MUST_HAVE",
    "type" : "esco-skill",
    "start-position" : 1324,
    "end-position" : 1350,
    "concept-id" : "K6XL_6aL_AQ6",
    "matched-string" : "Bemanning av vår reception",
    "annotation-id" : 18
  }, {
    "preferred-label" : "använda tvättmaskin",
    "sentiment" : "MUST_HAVE",
    "type" : "esco-skill",
    "start-position" : 1361,
    "end-position" : 1366,
    "concept-id" : "qf5n_zc6_Bda",
    "matched-string" : "Tvätt",
    "annotation-id" : 17
  }, {
    "preferred-label" : "Mangling",
    "sentiment" : "MUST_HAVE",
    "type" : "skill",
    "start-position" : 1371,
    "end-position" : 1379,
    "concept-id" : "kA7s_yHL_nJ2",
    "matched-string" : "mangling",
    "annotation-id" : 11
  }, {
    "preferred-label" : "Frukostbuffé",
    "sentiment" : "MUST_HAVE",
    "type" : "skill",
    "start-position" : 1402,
    "end-position" : 1414,
    "concept-id" : "sqd6_4Kk_b4w",
    "matched-string" : "frukostbuffé",
    "annotation-id" : 12
  }, {
    "preferred-label" : "Behovsanställning",
    "type" : "employment-type",
    "start-position" : 1444,
    "end-position" : 1461,
    "concept-id" : "1paU_aCR_nGn",
    "matched-string" : "behovsanställning",
    "annotation-id" : 19
  } ],
  "text" : "Lokalvårdare/Receptionist\nVilka är vi?\nLyckåhem Hotell & Studiolägenheter är ett bekvämt och flexibelt hotell med uthyrning av både hotell- och vandrarhemsrum samt mindre studiolägenheter. Hotellet har under de senaste åren genomgått en omfattande renovering, vilket gör att vi kan erbjuda fräscha och moderna rum. Våra gäster utgörs av alltifrån semesterfirare som bor här ett par dagar, till studenter och företagskunder som stannar längre perioder. Här bor våra gäster omgivna av hagar med betande hästar och många uppskattar under sommaren att koppla av i vår stora trädgård. \nVem är du?\nInför sommarens högsäsong och ordinarie personals semestrar söker vi omgående dig som vill ha ett trevligt och fartfyllt extraarbete inom både städ och reception.\nVi söker dig som är glad, positiv och har lätt för att samarbeta. Då arbetet innebär mycket kontakt med våra gäster både på plats och i telefon lägger vi stor vikt vid att du har god social kompetens och att du behärskar både svenska och engelska väl. Har du tidigare vana av kassaarbete samt erfarenhet av arbete med bokningssystem är det ett plus men inget krav. Du ska trivas med att arbeta aktivt och stundvis i ett högt tempo då sommaren är vår mest fartfyllda period. \nDina arbetsuppgifter: \n·        Städning av hotellrummen och de gemensamma utrymmena\n·        Bemanning av vår reception \n·        Tvätt och mangling\n·        Beredning av frukostbuffé\nTjänsten är inledningsvis en behovsanställning under sommarmånaderna, med möjlighet till förlängning för rätt person. Tillträde omgående. \nMaila din ansökan till: info@lyckahem.se"
}