{
  "meta" : {
    "jobad" : {
      "description" : {
        "requirements" : null,
        "needs" : null,
        "company_information" : null,
        "text_formatted" : "<p>Vi söker en noggrann och sympatisk snickare som vill vara med och utveckla vår verksamhet.</p><p>Trädgårdstjänst i Löddeköpinge AB driver verksamheten Finsnickaren i Löddeköpinge där vi utöver specialsnickerier utför allehanda byggnadssnickerier. Denna tid på året innebär det mycket utemiljöer.</p><p>Vi letar efter en vass , noggrann och pålitligt snickare som gillar mångsidighet och är  strukturerad. Som person är du ödmjuk, lösningsorienterad och mycket tekniskt lagd. Vår arbetsplats präglas av positiv anda och respekt för medarbetare. Din förmåga att samarbeta med andra är därför viktig. </p><p>Alla våra projekt registreras digitalt i vårt projekthanteringssystem varför god datorvana är ett krav.</p><p>Arbetet hos oss är variationsrikt och blir till stor del vad du gör av det. Det finns stora möjligheter att påverka och utveckla tjänsten. Vi förväntar oss att du kan arbeta självständigt och tidvis ta ansvar för att arbetet flyter på.</p><p>Arbetsplatsen är förlagd till våra lokaler i CenterSyd-området i Löddeköpinge. För frågor om tjänsten, kontakta företagets VD Wille Warnander på 072-1927257. Ansökan skickas till info@loddetradgard.se</p><p id=\"oppenforalla\">Öppen för alla\nVi fokuserar på din kompetens, inte dina övriga förutsättningar. Vi är öppna för att anpassa rollen eller arbetsplatsen efter dina behov.</p>",
        "conditions" : null,
        "text" : "Vi söker en noggrann och sympatisk snickare som vill vara med och utveckla vår verksamhet.\nTrädgårdstjänst i Löddeköpinge AB driver verksamheten Finsnickaren i Löddeköpinge där vi utöver specialsnickerier utför allehanda byggnadssnickerier. Denna tid på året innebär det mycket utemiljöer.\nVi letar efter en vass , noggrann och pålitligt snickare som gillar mångsidighet och är  strukturerad. Som person är du ödmjuk, lösningsorienterad och mycket tekniskt lagd. Vår arbetsplats präglas av positiv anda och respekt för medarbetare. Din förmåga att samarbeta med andra är därför viktig. \nAlla våra projekt registreras digitalt i vårt projekthanteringssystem varför god datorvana är ett krav.\nArbetet hos oss är variationsrikt och blir till stor del vad du gör av det. Det finns stora möjligheter att påverka och utveckla tjänsten. Vi förväntar oss att du kan arbeta självständigt och tidvis ta ansvar för att arbetet flyter på.\nArbetsplatsen är förlagd till våra lokaler i CenterSyd-området i Löddeköpinge. För frågor om tjänsten, kontakta företagets VD Wille Warnander på 072-1927257. Ansökan skickas till info@loddetradgard.se\nÖppen för alla\nVi fokuserar på din kompetens, inte dina övriga förutsättningar. Vi är öppna för att anpassa rollen eller arbetsplatsen efter dina behov."
      },
      "headline" : "Snickare ",
      "driving_license" : [ {
        "concept_id" : "VTK8_WRx_GcM",
        "label" : "B",
        "legacy_ams_taxonomy_id" : "3"
      } ],
      "employer" : {
        "email" : null,
        "phone_number" : null,
        "organization_number" : "5569844367",
        "name" : "Spray & Stay AB",
        "url" : "www.loddetradgard.se",
        "workplace" : "Trädgårdstjänst i Löddeköpinge AB"
      },
      "removed_date" : null,
      "logo_url" : "https://www.arbetsformedlingen.se/rest/arbetsgivare/rest/af/v3/arbetsplatser/87950044/logotyper/logo.png",
      "last_publication_date" : "2022-08-02T23:59:59",
      "number_of_vacancies" : 1,
      "occupation" : {
        "concept_id" : "4Z7F_oBG_vMG",
        "label" : "Träarbetare/Snickare",
        "legacy_ams_taxonomy_id" : "6581"
      },
      "occupation_group" : {
        "concept_id" : "9mJN_VwW_Xjg",
        "label" : "Träarbetare, snickare m.fl.",
        "legacy_ams_taxonomy_id" : "7111"
      },
      "employment_type" : {
        "concept_id" : "PFZr_Syz_cUq",
        "label" : "Vanlig anställning",
        "legacy_ams_taxonomy_id" : "1"
      },
      "webpage_url" : "https://arbetsformedlingen.se/platsbanken/annonser/26286684",
      "driving_license_required" : true,
      "application_contacts" : [ {
        "description" : null,
        "email" : "info@loddetradgard.se",
        "telephone" : "0721927257",
        "name" : "Wille Warnander",
        "contact_type" : "VD"
      } ],
      "duration" : {
        "concept_id" : "a7uU_j21_mkL",
        "label" : "Tills vidare",
        "legacy_ams_taxonomy_id" : "1"
      },
      "nice_to_have" : {
        "education_level" : [ {
          "concept_id" : "DeBt_ahh_bkx",
          "weight" : 5,
          "label" : "Gymnasial utbildning",
          "legacy_ams_taxonomy_id" : "4"
        } ],
        "work_experiences" : [ ],
        "skills" : [ {
          "concept_id" : "n5sy_8pT_crR",
          "weight" : 5,
          "label" : "Underhållsarbete, snickeri",
          "legacy_ams_taxonomy_id" : "603744"
        } ],
        "education" : [ {
          "concept_id" : "qryY_rKa_as3",
          "weight" : 5,
          "label" : "Material och tillverkning",
          "legacy_ams_taxonomy_id" : "16"
        } ],
        "languages" : [ ]
      },
      "application_details" : {
        "via_af" : false,
        "email" : "info@loddetradgard.se",
        "other" : null,
        "reference" : null,
        "url" : null,
        "information" : null
      },
      "source_type" : "VIA_ANNONSERA",
      "application_deadline" : "2022-08-02T23:59:59",
      "external_id" : null,
      "workplace_address" : {
        "coordinates" : [ 13.001357611701602, 55.77155209303874 ],
        "city" : "Löddeköpinge",
        "postcode" : "24643",
        "municipality" : "Kävlinge",
        "region_concept_id" : "CaRE_1nn_cSU",
        "region" : "Skåne län",
        "country_code" : "199",
        "region_code" : "12",
        "municipality_concept_id" : "5ohg_WJU_Ktn",
        "country_concept_id" : "i46j_HmG_v64",
        "municipality_code" : "1261",
        "street_address" : "Produktvägen 12D",
        "country" : "Sverige"
      },
      "id" : "26286684",
      "experience_required" : true,
      "working_hours_type" : {
        "concept_id" : "6YE1_gAC_R2G",
        "label" : "Heltid",
        "legacy_ams_taxonomy_id" : "1"
      },
      "access" : null,
      "timestamp" : 1656839010799,
      "must_have" : {
        "education_level" : [ ],
        "work_experiences" : [ {
          "concept_id" : "4Z7F_oBG_vMG",
          "weight" : 10,
          "label" : "Träarbetare/Snickare",
          "legacy_ams_taxonomy_id" : "6581"
        } ],
        "skills" : [ ],
        "education" : [ ],
        "languages" : [ {
          "concept_id" : "zSLA_vw2_FXN",
          "weight" : 10,
          "label" : "Svenska",
          "legacy_ams_taxonomy_id" : "502"
        } ]
      },
      "occupation_field" : {
        "concept_id" : "j7Cq_ZJe_GkT",
        "label" : "Bygg och anläggning",
        "legacy_ams_taxonomy_id" : "2"
      },
      "scope_of_work" : {
        "min" : 0,
        "max" : 100
      },
      "salary_type" : {
        "concept_id" : "oG8G_9cW_nRf",
        "label" : "Fast månads- vecko- eller timlön",
        "legacy_ams_taxonomy_id" : "1"
      },
      "removed" : false,
      "salary_description" : null,
      "access_to_own_car" : true,
      "publication_date" : "2022-07-03T11:03:30"
    },
    "name" : "Snickare ",
    "user" : "hannes"
  },
  "sha1" : "eaded6f2831309ed0c5dff9fea7757b3324d1431",
  "annotations" : [ {
    "preferred-label" : "snickare",
    "sentiment" : "MUST_HAVE",
    "type" : "esco-occupation",
    "start-position" : 0,
    "end-position" : 8,
    "concept-id" : "qhAJ_Euo_tNx",
    "matched-string" : "snickare",
    "annotation-id" : 0
  }, {
    "preferred-label" : "noggrannhet",
    "type" : "esco-skill",
    "start-position" : 22,
    "end-position" : 30,
    "concept-id" : "mrsW_EkL_KRD",
    "matched-string" : "noggrann",
    "annotation-id" : 3
  }, {
    "preferred-label" : "snickare",
    "sentiment" : "MUST_HAVE",
    "type" : "esco-occupation",
    "start-position" : 45,
    "end-position" : 53,
    "concept-id" : "qhAJ_Euo_tNx",
    "matched-string" : "snickare",
    "annotation-id" : 1
  }, {
    "preferred-label" : "Specialsnickare",
    "type" : "keyword",
    "start-position" : 197,
    "end-position" : 214,
    "concept-id" : "tWSa_yPQ_KTR",
    "matched-string" : "specialsnickerier",
    "annotation-id" : 4
  }, {
    "preferred-label" : "byggnadssnickeri",
    "type" : "esco-skill",
    "start-position" : 231,
    "end-position" : 249,
    "concept-id" : "hnwx_8oE_omR",
    "matched-string" : "byggnadssnickerier",
    "annotation-id" : 5
  }, {
    "preferred-label" : "noggrannhet",
    "type" : "esco-skill",
    "start-position" : 325,
    "end-position" : 333,
    "concept-id" : "mrsW_EkL_KRD",
    "matched-string" : "noggrann",
    "annotation-id" : 6
  }, {
    "preferred-label" : "snickare",
    "sentiment" : "MUST_HAVE",
    "type" : "esco-occupation",
    "start-position" : 348,
    "end-position" : 356,
    "concept-id" : "qhAJ_Euo_tNx",
    "matched-string" : "snickare",
    "annotation-id" : 2
  }, {
    "preferred-label" : "samarbeta med kolleger",
    "type" : "esco-skill",
    "start-position" : 558,
    "end-position" : 577,
    "concept-id" : "X15R_797_q62",
    "matched-string" : "samarbeta med andra",
    "annotation-id" : 7
  }, {
    "preferred-label" : "arbeta självständigt",
    "type" : "esco-skill",
    "start-position" : 868,
    "end-position" : 888,
    "concept-id" : "NyFu_HHd_zhz",
    "matched-string" : "arbeta självständigt",
    "annotation-id" : 8
  } ],
  "text" : "Snickare \nVi söker en noggrann och sympatisk snickare som vill vara med och utveckla vår verksamhet.\nTrädgårdstjänst i Löddeköpinge AB driver verksamheten Finsnickaren i Löddeköpinge där vi utöver specialsnickerier utför allehanda byggnadssnickerier. Denna tid på året innebär det mycket utemiljöer.\nVi letar efter en vass , noggrann och pålitligt snickare som gillar mångsidighet och är  strukturerad. Som person är du ödmjuk, lösningsorienterad och mycket tekniskt lagd. Vår arbetsplats präglas av positiv anda och respekt för medarbetare. Din förmåga att samarbeta med andra är därför viktig. \nAlla våra projekt registreras digitalt i vårt projekthanteringssystem varför god datorvana är ett krav.\nArbetet hos oss är variationsrikt och blir till stor del vad du gör av det. Det finns stora möjligheter att påverka och utveckla tjänsten. Vi förväntar oss att du kan arbeta självständigt och tidvis ta ansvar för att arbetet flyter på.\nArbetsplatsen är förlagd till våra lokaler i CenterSyd-området i Löddeköpinge. För frågor om tjänsten, kontakta företagets VD Wille Warnander på 072-1927257. Ansökan skickas till info@loddetradgard.se\nÖppen för alla\nVi fokuserar på din kompetens, inte dina övriga förutsättningar. Vi är öppna för att anpassa rollen eller arbetsplatsen efter dina behov."
}