{
  "meta" : {
    "jobad" : {
      "description" : {
        "requirements" : null,
        "needs" : null,
        "company_information" : null,
        "text_formatted" : "I Äldre samt vård- och omsorgsförvaltningen gör vi insatser som leder till goda möten med dem vi är till för och med varandra. Med en kultur, förhållningssätt och styrning- och ledning i ständig utveckling skapar vi de bästa förutsättningarna.\n\nVi är ca 9 000 medarbetare som jobbar i hela staden och som gemensamt driver verksamheten varje dag. Vi har över 50 vård- och omsorgsboenden, 200 korttidsplatser, 30 öppna träffpunkter, hemtjänst till över 8 000 personer och hälso- och sjukvård till 15 000 personer varje år.\n\nVill du också jobba för en mer meningsfull vardag och service av högsta kvalitet för invånarna i Göteborg? Välkommen till en arbetsplats där vi bryr oss om varandra, arbetar tillsammans och tänker nytt. Vi är Göteborg.\r\n\r\nARBETSUPPGIFTER\nNu söker vi en arkivarie med placering på kanslienheten under avdelning Stab och kommunikation på äldre samt vård- och omsorgsförvaltningen. Medarbetarna på enheten arbetar som ett team med kompetens inom områdena ärendehantering, nämnd- och utskottsadministration, arkiv, registratur och juridik. Arbetsplatsen finns på Opaltorget i ett nybyggt kontor, där vi arbetar aktivitetsbaserat.\n\nSom arkivarie säkerställer du tillsammans med förvaltningens övriga arkivarier förvaltningens efterlevnad av de lagar och bestämmelser som finns inom arkivområdet. Du har en serviceinriktad roll och är ett stöd till förvaltningens verksamheter i frågor som rör arkiv och informationshantering. \n\nArbetsuppgifterna är varierade och består bland annat av att utreda behovet av bevarande och gallring av allmänna handlingar, samt att ta fram och revidera dokumenthanteringsplan, rutiner och andra styrdokument. I uppdraget ingår att ge stöd till förvaltningens arkivredogörare och arkivassistenter och säkerställa att det finns fungerande processer och rutiner för arkivering av handlingar i förvaltningens olika arkivlokaler. \n\nI ditt uppdrag ingår även att samordna leveranser, skriva gallringsframställningar och vara förvaltningens kontaktperson gentemot Regionarkivet. Vidare ingår att förvalta och utveckla förvaltningens arkivorganisation och delta i olika nätverk tillsammans med stadens övriga arkivarier.\n\nExempel på arbetsuppgifter som förekommer i tjänsten:\n-\tTa fram och revidera dokumenthanteringsplan, arkivbeskrivning och rutiner\n-\tGenomföra gallringsutredning genom att tillämpa arkivlag, tryckfrihetsförordning, offentlighets- och sekretesslag, samt annan relevant lagstiftning som påverkar området\n-\tSkriva gallringframställningar till Regionarkivet\n-\tSamordna leveranser av handlingar till Regionarkivet och internt inom förvaltningen\n-\tGe råd och stöd till medarbetare i förvaltningen rörande arkiv- och dokumenthanteringsfrågor\n-\tStötta förvaltningens olika arkivredogörare och arkivassistenter\n-\tVid behov ordna och förteckna handlingar\n\nFörvaltningen är i startgroparna med att bygga en ny arkivlokal med placering i förvaltningens huvudkontor på Zirkongatan. Du kommer att vara en viktig del i att planera hur det nya arkivet ska utformas och säkerställa rutiner för inleveranser av handlingar från förvaltningens olika närarkiv runtom i staden.\r\n\r\nKVALIFIKATIONER\nVi söker dig som har högskoleutbildning inom arkiv- och informationsvetenskap med minst 60 hp. Du har kunskaper inom relevant lagstiftning och föreskrifter som styr arkiv- och informationshantering i offentlig verksamhet, så som arkivlag, tryckfrihetsförordningen och offentlighets- och sekretesslag. Det är meriterande om du har tidigare erfarenhet från arbete som arkivarie inom kommunal eller statlig sektor.\n\nDu är en ansvarsfull person som tar ansvar för dina och de gemensamma arbetsuppgifterna med verksamhetens bästa i fokus. Du är mån om att slutföra det du påbörjat och ser till att arbetet blir utfört på rätt sätt. Du agerar på egen hand utifrån vad situationen kräver utan att behöva stöd av andra och har förmåga att ta självständiga beslut inom ramen för ditt uppdrag. \n\nDu har intresse, vilja och förmåga att hjälpa andra och du anstränger dig för att framföra lösningar. Du är mån om att ta reda på vilka förväntningar som finns hos uppdragsgivare och andra intressenter samt följer upp att dessa införlivas. \n\nDu har förmåga att delge information och idéer, såväl muntligt som skriftligt. Du anpassar din kommunikation efter mottagare, målgrupp och situation och har förmåga att förklara problem och information för olika mottagare och ur olika perspektiv. \r\n\nÖVRIGT\nGöteborgs Stad är en av Sveriges största arbetsgivare. Vi arbetar aktivt för att främja lika rättigheter och möjligheter samt att motverka diskriminering. Som medarbetare i äldre samt vård- och omsorgsförvaltningen erbjuder vi dig:\n• Trygg anställning med goda anställningsvillkor\n• Karriärmöjligheter \n• Internutbildningar\n• Spännande och meningsfulla arbetsuppgifter\n• Introduktion vid nyanställning\n• Heltid med möjlighet till deltid\n• Friskvårdsbidrag, cykelbidrag samt andra rabatter och erbjudanden\n\nNär du söker jobb hos oss tar vi endast emot ansökningar via vårt rekryteringssystem i enlighet med GDPR.\n\nTill dig som företräder bemannings- och rekryteringsföretag: \nInför denna rekrytering har vi tagit ställning till rekryteringskanaler och därför undanber vi oss ytterligare erbjudanden om kompetensförmedling, annonserings- och rekryteringshjälp.",
        "conditions" : "Heltid. \r\nTillsvidareanställning, tillträde: Tillträde efter överenskommelse.",
        "text" : "I Äldre samt vård- och omsorgsförvaltningen gör vi insatser som leder till goda möten med dem vi är till för och med varandra. Med en kultur, förhållningssätt och styrning- och ledning i ständig utveckling skapar vi de bästa förutsättningarna.\n\nVi är ca 9 000 medarbetare som jobbar i hela staden och som gemensamt driver verksamheten varje dag. Vi har över 50 vård- och omsorgsboenden, 200 korttidsplatser, 30 öppna träffpunkter, hemtjänst till över 8 000 personer och hälso- och sjukvård till 15 000 personer varje år.\n\nVill du också jobba för en mer meningsfull vardag och service av högsta kvalitet för invånarna i Göteborg? Välkommen till en arbetsplats där vi bryr oss om varandra, arbetar tillsammans och tänker nytt. Vi är Göteborg.\r\n\r\nARBETSUPPGIFTER\nNu söker vi en arkivarie med placering på kanslienheten under avdelning Stab och kommunikation på äldre samt vård- och omsorgsförvaltningen. Medarbetarna på enheten arbetar som ett team med kompetens inom områdena ärendehantering, nämnd- och utskottsadministration, arkiv, registratur och juridik. Arbetsplatsen finns på Opaltorget i ett nybyggt kontor, där vi arbetar aktivitetsbaserat.\n\nSom arkivarie säkerställer du tillsammans med förvaltningens övriga arkivarier förvaltningens efterlevnad av de lagar och bestämmelser som finns inom arkivområdet. Du har en serviceinriktad roll och är ett stöd till förvaltningens verksamheter i frågor som rör arkiv och informationshantering. \n\nArbetsuppgifterna är varierade och består bland annat av att utreda behovet av bevarande och gallring av allmänna handlingar, samt att ta fram och revidera dokumenthanteringsplan, rutiner och andra styrdokument. I uppdraget ingår att ge stöd till förvaltningens arkivredogörare och arkivassistenter och säkerställa att det finns fungerande processer och rutiner för arkivering av handlingar i förvaltningens olika arkivlokaler. \n\nI ditt uppdrag ingår även att samordna leveranser, skriva gallringsframställningar och vara förvaltningens kontaktperson gentemot Regionarkivet. Vidare ingår att förvalta och utveckla förvaltningens arkivorganisation och delta i olika nätverk tillsammans med stadens övriga arkivarier.\n\nExempel på arbetsuppgifter som förekommer i tjänsten:\n-\tTa fram och revidera dokumenthanteringsplan, arkivbeskrivning och rutiner\n-\tGenomföra gallringsutredning genom att tillämpa arkivlag, tryckfrihetsförordning, offentlighets- och sekretesslag, samt annan relevant lagstiftning som påverkar området\n-\tSkriva gallringframställningar till Regionarkivet\n-\tSamordna leveranser av handlingar till Regionarkivet och internt inom förvaltningen\n-\tGe råd och stöd till medarbetare i förvaltningen rörande arkiv- och dokumenthanteringsfrågor\n-\tStötta förvaltningens olika arkivredogörare och arkivassistenter\n-\tVid behov ordna och förteckna handlingar\n\nFörvaltningen är i startgroparna med att bygga en ny arkivlokal med placering i förvaltningens huvudkontor på Zirkongatan. Du kommer att vara en viktig del i att planera hur det nya arkivet ska utformas och säkerställa rutiner för inleveranser av handlingar från förvaltningens olika närarkiv runtom i staden.\r\n\r\nKVALIFIKATIONER\nVi söker dig som har högskoleutbildning inom arkiv- och informationsvetenskap med minst 60 hp. Du har kunskaper inom relevant lagstiftning och föreskrifter som styr arkiv- och informationshantering i offentlig verksamhet, så som arkivlag, tryckfrihetsförordningen och offentlighets- och sekretesslag. Det är meriterande om du har tidigare erfarenhet från arbete som arkivarie inom kommunal eller statlig sektor.\n\nDu är en ansvarsfull person som tar ansvar för dina och de gemensamma arbetsuppgifterna med verksamhetens bästa i fokus. Du är mån om att slutföra det du påbörjat och ser till att arbetet blir utfört på rätt sätt. Du agerar på egen hand utifrån vad situationen kräver utan att behöva stöd av andra och har förmåga att ta självständiga beslut inom ramen för ditt uppdrag. \n\nDu har intresse, vilja och förmåga att hjälpa andra och du anstränger dig för att framföra lösningar. Du är mån om att ta reda på vilka förväntningar som finns hos uppdragsgivare och andra intressenter samt följer upp att dessa införlivas. \n\nDu har förmåga att delge information och idéer, såväl muntligt som skriftligt. Du anpassar din kommunikation efter mottagare, målgrupp och situation och har förmåga att förklara problem och information för olika mottagare och ur olika perspektiv. \r\n\nÖVRIGT\nGöteborgs Stad är en av Sveriges största arbetsgivare. Vi arbetar aktivt för att främja lika rättigheter och möjligheter samt att motverka diskriminering. Som medarbetare i äldre samt vård- och omsorgsförvaltningen erbjuder vi dig:\n• Trygg anställning med goda anställningsvillkor\n• Karriärmöjligheter \n• Internutbildningar\n• Spännande och meningsfulla arbetsuppgifter\n• Introduktion vid nyanställning\n• Heltid med möjlighet till deltid\n• Friskvårdsbidrag, cykelbidrag samt andra rabatter och erbjudanden\n\nNär du söker jobb hos oss tar vi endast emot ansökningar via vårt rekryteringssystem i enlighet med GDPR.\n\nTill dig som företräder bemannings- och rekryteringsföretag: \nInför denna rekrytering har vi tagit ställning till rekryteringskanaler och därför undanber vi oss ytterligare erbjudanden om kompetensförmedling, annonserings- och rekryteringshjälp."
      },
      "headline" : "Arkivarie",
      "driving_license" : null,
      "employer" : {
        "email" : null,
        "phone_number" : null,
        "organization_number" : "2120001355",
        "name" : "GÖTEBORGS KOMMUN",
        "url" : null,
        "workplace" : "Göteborgs Stad , Äldre samt vård- och omsorgsförvaltningen"
      },
      "removed_date" : null,
      "logo_url" : "https://www.arbetsformedlingen.se/rest/arbetsgivare/rest/af/v3/organisation/2120001355/logotyper/logo.png",
      "last_publication_date" : "2022-08-14T23:59:59",
      "number_of_vacancies" : 1,
      "occupation" : {
        "concept_id" : "E7nX_ux2_hF9",
        "label" : "Arkivarie",
        "legacy_ams_taxonomy_id" : "5898"
      },
      "occupation_group" : {
        "concept_id" : "wVfo_Njx_1rB",
        "label" : "Bibliotekarier och arkivarier",
        "legacy_ams_taxonomy_id" : "2622"
      },
      "employment_type" : {
        "concept_id" : "PFZr_Syz_cUq",
        "label" : "Vanlig anställning",
        "legacy_ams_taxonomy_id" : "1"
      },
      "webpage_url" : "https://arbetsformedlingen.se/platsbanken/annonser/26297965",
      "driving_license_required" : false,
      "application_contacts" : [ {
        "description" : "Ulrika Stridvall Dahlén",
        "email" : "ulrika.stridvall.dahlen@aldrevardomsorg.goteborg.se",
        "telephone" : null,
        "name" : null,
        "contact_type" : "Avdelningschef Stab och Kommunikation"
      } ],
      "duration" : {
        "concept_id" : "a7uU_j21_mkL",
        "label" : "Tills vidare",
        "legacy_ams_taxonomy_id" : "1"
      },
      "nice_to_have" : {
        "education_level" : [ ],
        "work_experiences" : [ ],
        "skills" : [ ],
        "education" : [ ],
        "languages" : [ ]
      },
      "application_details" : {
        "via_af" : false,
        "email" : null,
        "other" : null,
        "reference" : "C95589",
        "url" : "https://recruit.visma.com/Public/Apply.aspx?guidAssignment=4cb17242-cf4f-4ac4-8513-a721ffa3b4f5&publishCode=AMS&TK=c92f1639-6964-4893-821d-2a11ead119bd",
        "information" : null
      },
      "source_type" : "VIA_PLATSBANKEN_DXA",
      "application_deadline" : "2022-08-14T23:59:59",
      "external_id" : "46-212000-1355-4CB17242CF4F4AC48513A721FFA3B4F5",
      "workplace_address" : {
        "coordinates" : [ 11.97456, 57.70887 ],
        "city" : null,
        "postcode" : null,
        "municipality" : "Göteborg",
        "region_concept_id" : "zdoY_6u5_Krt",
        "region" : "Västra Götalands län",
        "country_code" : "199",
        "region_code" : "14",
        "municipality_concept_id" : "PVZL_BQT_XtL",
        "country_concept_id" : "i46j_HmG_v64",
        "municipality_code" : "1480",
        "street_address" : null,
        "country" : "Sverige"
      },
      "id" : "26297965",
      "experience_required" : true,
      "working_hours_type" : {
        "concept_id" : "6YE1_gAC_R2G",
        "label" : "Heltid",
        "legacy_ams_taxonomy_id" : "1"
      },
      "access" : null,
      "timestamp" : 1657092008274,
      "must_have" : {
        "education_level" : [ ],
        "work_experiences" : [ {
          "concept_id" : "E7nX_ux2_hF9",
          "weight" : 10,
          "label" : "Arkivarie",
          "legacy_ams_taxonomy_id" : "5898"
        } ],
        "skills" : [ ],
        "education" : [ ],
        "languages" : [ ]
      },
      "occupation_field" : {
        "concept_id" : "9puE_nYg_crq",
        "label" : "Kultur, media, design",
        "legacy_ams_taxonomy_id" : "11"
      },
      "scope_of_work" : {
        "min" : 100,
        "max" : 100
      },
      "salary_type" : {
        "concept_id" : "oG8G_9cW_nRf",
        "label" : "Fast månads- vecko- eller timlön",
        "legacy_ams_taxonomy_id" : "1"
      },
      "removed" : false,
      "salary_description" : "Enligt avtal.",
      "access_to_own_car" : false,
      "publication_date" : "2022-07-06T09:20:08"
    },
    "name" : "Arkivarie",
    "user" : "kristof.fischer"
  },
  "sha1" : "2f28adda00d630d8aeb9ea78ae76cec27c2d0019",
  "annotations" : [ {
    "preferred-label" : "Arkivarie",
    "sentiment" : "MUST_HAVE",
    "type" : "occupation-name",
    "start-position" : 0,
    "end-position" : 9,
    "concept-id" : "E7nX_ux2_hF9",
    "matched-string" : "arkivarie",
    "annotation-id" : 0
  }, {
    "preferred-label" : "Göteborg",
    "type" : "municipality",
    "start-position" : 629,
    "end-position" : 637,
    "concept-id" : "PVZL_BQT_XtL",
    "matched-string" : "Göteborg",
    "annotation-id" : 9
  }, {
    "preferred-label" : "Göteborg",
    "type" : "municipality",
    "start-position" : 741,
    "end-position" : 749,
    "concept-id" : "PVZL_BQT_XtL",
    "matched-string" : "Göteborg",
    "annotation-id" : 10
  }, {
    "preferred-label" : "Arkivarie",
    "sentiment" : "MUST_HAVE",
    "type" : "occupation-name",
    "start-position" : 785,
    "end-position" : 794,
    "concept-id" : "E7nX_ux2_hF9",
    "matched-string" : "arkivarie",
    "annotation-id" : 3
  }, {
    "preferred-label" : "Arkivarie",
    "sentiment" : "MUST_HAVE",
    "type" : "occupation-name",
    "start-position" : 1163,
    "end-position" : 1172,
    "concept-id" : "E7nX_ux2_hF9",
    "matched-string" : "arkivarie",
    "annotation-id" : 6
  }, {
    "preferred-label" : "Universitets- eller högskoleutbildning",
    "sentiment" : "MUST_HAVE",
    "type" : "sni-level-4",
    "start-position" : 3167,
    "end-position" : 3185,
    "concept-id" : "m1vC_Ssq_5Y7",
    "matched-string" : "högskoleutbildning",
    "annotation-id" : 11
  }, {
    "preferred-label" : "Dokumentations- och informationsvetenskap",
    "sentiment" : "MUST_HAVE",
    "type" : "sun-education-field-4",
    "start-position" : 3191,
    "end-position" : 3223,
    "concept-id" : "eaWv_6EA_ZG2",
    "matched-string" : "arkiv- och informationsvetenskap",
    "annotation-id" : 12
  }, {
    "preferred-label" : "Arkivvetenskap",
    "sentiment" : "MUST_HAVE",
    "type" : "skill",
    "start-position" : 3375,
    "end-position" : 3383,
    "concept-id" : "8gKx_WD2_7SM",
    "matched-string" : "arkivlag",
    "annotation-id" : 13
  }, {
    "preferred-label" : "Tryckfrihetslagstiftningen",
    "sentiment" : "MUST_HAVE",
    "type" : "skill",
    "start-position" : 3385,
    "end-position" : 3409,
    "concept-id" : "1U6i_pFi_GcN",
    "matched-string" : "tryckfrihetsförordningen",
    "annotation-id" : 14
  }, {
    "preferred-label" : "dataskydd",
    "sentiment" : "MUST_HAVE",
    "type" : "esco-skill",
    "start-position" : 3414,
    "end-position" : 3445,
    "concept-id" : "J7Xa_3VE_VTe",
    "matched-string" : "offentlighets- och sekretesslag",
    "annotation-id" : 15
  }, {
    "preferred-label" : "Arkivarie",
    "sentiment" : "NICE_TO_HAVE",
    "type" : "occupation-name",
    "start-position" : 3512,
    "end-position" : 3521,
    "concept-id" : "E7nX_ux2_hF9",
    "matched-string" : "arkivarie",
    "annotation-id" : 8
  }, {
    "preferred-label" : "visa ansvarstagande",
    "sentiment" : "MUST_HAVE",
    "type" : "esco-skill",
    "start-position" : 3568,
    "end-position" : 3579,
    "concept-id" : "bcRp_hxV_f5G",
    "matched-string" : "ansvarsfull",
    "annotation-id" : 16
  }, {
    "preferred-label" : "fatta beslut",
    "sentiment" : "MUST_HAVE",
    "type" : "esco-skill",
    "start-position" : 3877,
    "end-position" : 3900,
    "concept-id" : "7akt_v7j_ggK",
    "matched-string" : "ta självständiga beslut",
    "annotation-id" : 17
  }, {
    "preferred-label" : "hitta lösningar på problem",
    "sentiment" : "MUST_HAVE",
    "type" : "esco-skill",
    "start-position" : 4014,
    "end-position" : 4032,
    "concept-id" : "WFSY_Bwt_QWE",
    "matched-string" : "framföra lösningar",
    "annotation-id" : 18
  }, {
    "preferred-label" : "anpassa kommunikationsstilen efter mottagaren",
    "sentiment" : "MUST_HAVE",
    "type" : "esco-skill",
    "start-position" : 4256,
    "end-position" : 4298,
    "concept-id" : "BUjh_kV6_mhd",
    "matched-string" : "anpassar din kommunikation efter mottagare",
    "annotation-id" : 19
  }, {
    "preferred-label" : "kommunikation",
    "sentiment" : "MUST_HAVE",
    "type" : "esco-skill",
    "start-position" : 4343,
    "end-position" : 4359,
    "concept-id" : "ahPU_HgE_Jeb",
    "matched-string" : "förklara problem",
    "annotation-id" : 20
  } ],
  "text" : "Arkivarie\nI Äldre samt vård- och omsorgsförvaltningen gör vi insatser som leder till goda möten med dem vi är till för och med varandra. Med en kultur, förhållningssätt och styrning- och ledning i ständig utveckling skapar vi de bästa förutsättningarna.\n\nVi är ca 9 000 medarbetare som jobbar i hela staden och som gemensamt driver verksamheten varje dag. Vi har över 50 vård- och omsorgsboenden, 200 korttidsplatser, 30 öppna träffpunkter, hemtjänst till över 8 000 personer och hälso- och sjukvård till 15 000 personer varje år.\n\nVill du också jobba för en mer meningsfull vardag och service av högsta kvalitet för invånarna i Göteborg? Välkommen till en arbetsplats där vi bryr oss om varandra, arbetar tillsammans och tänker nytt. Vi är Göteborg.\r\n\r\nARBETSUPPGIFTER\nNu söker vi en arkivarie med placering på kanslienheten under avdelning Stab och kommunikation på äldre samt vård- och omsorgsförvaltningen. Medarbetarna på enheten arbetar som ett team med kompetens inom områdena ärendehantering, nämnd- och utskottsadministration, arkiv, registratur och juridik. Arbetsplatsen finns på Opaltorget i ett nybyggt kontor, där vi arbetar aktivitetsbaserat.\n\nSom arkivarie säkerställer du tillsammans med förvaltningens övriga arkivarier förvaltningens efterlevnad av de lagar och bestämmelser som finns inom arkivområdet. Du har en serviceinriktad roll och är ett stöd till förvaltningens verksamheter i frågor som rör arkiv och informationshantering. \n\nArbetsuppgifterna är varierade och består bland annat av att utreda behovet av bevarande och gallring av allmänna handlingar, samt att ta fram och revidera dokumenthanteringsplan, rutiner och andra styrdokument. I uppdraget ingår att ge stöd till förvaltningens arkivredogörare och arkivassistenter och säkerställa att det finns fungerande processer och rutiner för arkivering av handlingar i förvaltningens olika arkivlokaler. \n\nI ditt uppdrag ingår även att samordna leveranser, skriva gallringsframställningar och vara förvaltningens kontaktperson gentemot Regionarkivet. Vidare ingår att förvalta och utveckla förvaltningens arkivorganisation och delta i olika nätverk tillsammans med stadens övriga arkivarier.\n\nExempel på arbetsuppgifter som förekommer i tjänsten:\n-\tTa fram och revidera dokumenthanteringsplan, arkivbeskrivning och rutiner\n-\tGenomföra gallringsutredning genom att tillämpa arkivlag, tryckfrihetsförordning, offentlighets- och sekretesslag, samt annan relevant lagstiftning som påverkar området\n-\tSkriva gallringframställningar till Regionarkivet\n-\tSamordna leveranser av handlingar till Regionarkivet och internt inom förvaltningen\n-\tGe råd och stöd till medarbetare i förvaltningen rörande arkiv- och dokumenthanteringsfrågor\n-\tStötta förvaltningens olika arkivredogörare och arkivassistenter\n-\tVid behov ordna och förteckna handlingar\n\nFörvaltningen är i startgroparna med att bygga en ny arkivlokal med placering i förvaltningens huvudkontor på Zirkongatan. Du kommer att vara en viktig del i att planera hur det nya arkivet ska utformas och säkerställa rutiner för inleveranser av handlingar från förvaltningens olika närarkiv runtom i staden.\r\n\r\nKVALIFIKATIONER\nVi söker dig som har högskoleutbildning inom arkiv- och informationsvetenskap med minst 60 hp. Du har kunskaper inom relevant lagstiftning och föreskrifter som styr arkiv- och informationshantering i offentlig verksamhet, så som arkivlag, tryckfrihetsförordningen och offentlighets- och sekretesslag. Det är meriterande om du har tidigare erfarenhet från arbete som arkivarie inom kommunal eller statlig sektor.\n\nDu är en ansvarsfull person som tar ansvar för dina och de gemensamma arbetsuppgifterna med verksamhetens bästa i fokus. Du är mån om att slutföra det du påbörjat och ser till att arbetet blir utfört på rätt sätt. Du agerar på egen hand utifrån vad situationen kräver utan att behöva stöd av andra och har förmåga att ta självständiga beslut inom ramen för ditt uppdrag. \n\nDu har intresse, vilja och förmåga att hjälpa andra och du anstränger dig för att framföra lösningar. Du är mån om att ta reda på vilka förväntningar som finns hos uppdragsgivare och andra intressenter samt följer upp att dessa införlivas. \n\nDu har förmåga att delge information och idéer, såväl muntligt som skriftligt. Du anpassar din kommunikation efter mottagare, målgrupp och situation och har förmåga att förklara problem och information för olika mottagare och ur olika perspektiv. \r\n\nÖVRIGT\nGöteborgs Stad är en av Sveriges största arbetsgivare. Vi arbetar aktivt för att främja lika rättigheter och möjligheter samt att motverka diskriminering. Som medarbetare i äldre samt vård- och omsorgsförvaltningen erbjuder vi dig:\n• Trygg anställning med goda anställningsvillkor\n• Karriärmöjligheter \n• Internutbildningar\n• Spännande och meningsfulla arbetsuppgifter\n• Introduktion vid nyanställning\n• Heltid med möjlighet till deltid\n• Friskvårdsbidrag, cykelbidrag samt andra rabatter och erbjudanden\n\nNär du söker jobb hos oss tar vi endast emot ansökningar via vårt rekryteringssystem i enlighet med GDPR.\n\nTill dig som företräder bemannings- och rekryteringsföretag: \nInför denna rekrytering har vi tagit ställning till rekryteringskanaler och därför undanber vi oss ytterligare erbjudanden om kompetensförmedling, annonserings- och rekryteringshjälp."
}