{
  "meta" : {
    "jobad" : {
      "description" : {
        "requirements" : null,
        "needs" : null,
        "company_information" : null,
        "text_formatted" : "First Camp är Skandinaviens ledande campingkoncern med totalt 61 destinationer i Sverige, Danmark och Norge. Vi är inne i en spännande tillväxtfas och har genom organisk tillväxt och ett stort antal förvärv gått från drygt 100 MSEK i omsättning 2016 till nu över 1 000 MSEK ett normalår. Detta är en unik möjlighet att driva utvecklingen i en bransch med enormt mycket potential. Vi är ett stort team med över 1500 medarbetare som brinner för våra gästers upplevelser och som strävar mot att bygga världens ledande campingkedja. Läs gärna mer om oss och vad vi gör på www.firstcamp.se. \n\n\n \n\n\nUtanför Mönsterås ligger First Camp på skärgårdsidyllen Oknö. I den lugna och sköna naturen hittar du en arbetsplats där gemenskap och glädje sprider sig bland såväl campinggäster som kollegorna i receptionen, butiken och städet. Tillsammans arbetar vi för att våra gäster ska få en så enkel och behaglig vistelse som möjligt.\n\n\r\n\r\nBeskrivning\nVi vill bli världens ledande campingkedja genom att fokusera på innovation, hållbarhet och datadrivna gästinsikter.\r\n\r\nDärför vill vi att alla våra anställda ska drivas av att skapa mervärde, inte bara för våra gäster men även för varandra. De personer som ytterst ansvarar för mervärdet vi skapar på våra destinationer är våra Destinationschefer – och här vill vi nu fylla på med en ny kollega. \n\nArbetsuppgifter\nSom Destinationschef ansvarar du för hela driften, försäljningen och resultatet på din destination. Du har även personansvar för all personal på destinationen, vilket innefattar rekryteringsansvar, arbetsmiljöansvar och arbetsledning. \n\nI arbetsuppgifterna ingår arbetsledning och schemaläggning samt uppföljning och vidareutveckling av rutiner för bistro, reception, butik, vaktmästeri och städ. Rollen innefattar även löpande administration, budgetarbete, uppsökande företagsförsäljning samt ansvar för års-, månads- och veckoplanering.  \n\nI linje med att skapa mervärde för varandra och våra kunder, ska alla som arbetar på destinationerna kunna hugga i där det behövs, vilket innebär att du som Destinationschef kan komma att stötta upp med alla förekommande arbetsuppgifter som finns på arbetsplatsen.   \n\nUnder perioden oktober - mars håller First Camp Oknö vinterstängt. Du utgår då ifrån granndestinationen på First Camp Gunnarsö i Oskarshamn, där du tillsammans med Destinationschefen på Gunnarsö sköter den dagliga driften där.\n\nDet ingår ett delat ansvar för beredskap i tjänsten samt arbete på kvällar och helger.  \n\nKvalifikationer\nFör att passa in i rollen som Destinationschef krävs det att du har ett stort eget driv, ett lösningsfokuserat arbetssätt och en hög samarbetsförmåga. Du vill vara en del av något större, en kedja, där du som ledare vill vara med och skapa samhörighet över hela bolaget. Vi ser dig som en idérik genomförare som inte är rädd att kavla upp ärmarna när det behövs och som tycker om att arbeta med ett coachande ledarskap. Du måste dock också tycka om att leverera bra resultat och ha ett tydligt målfokus.  \n\nFör att vara aktuell för tjänsten behöver du ha haft personalansvar tidigare och en vidareutbildning inom turism, handel eller service. Du måste även kunna kommunicera mycket väl i både tal och skrift på svenska och engelska samt ha höga allmänna IT-kunskaper där du är van vid att använda olika system för att hantera ditt arbete. Det är meriterande om du har erfarenhet från camping och receptionsarbete sedan innan, har arbetat med B2B-försäljning samt har haft ansvar för upprättande av nya rutiner. Vi ser det även som mycket positivt om du har haft rekryterings- och budgetansvar samt varit arbetsledare för visstidsanställd personal under säsongsarbete.  \n\nVad erbjuder vi dig?   \nPå First Camp rekryterar vi förmågor och utvecklar dem. Hos oss ska du få möjlighet att växa och lära dig nytt samtidigt som du har riktigt roligt. \nVåra gemensamma värderingar styr vår vardag och hur vi är mot varandra:  \n\nWe Care:  Vi bryr oss om varandra, våra gäster och naturen \n\nWe Have Fun: Vi har kul på jobbet och har glimten i ögat både internt och med våra gäster \n\nWe Simplify:  Vi ska alltid försöka förenkla hur vi jobbar med varann och våra gäster \n\nWe Deliver Results: Allt vi gör ska ge resultat för oss, våra ägare och våra gäster \n\nSom Destinationschef kommer du att få delta i vårt ledarskapsprogram där du kommer att få utvecklas mer inom alla delar din tjänst omfattar, från rekrytering till budgetarbete och försäljning.  Vi erbjuder dig en bred tjänst med mycket ansvar, där du får möjlighet att växa inom en bransch på uppgång och där du har nära till kollegor när du behöver stöd. Kollegor som gärna bjuder på både erfarenhet och goda skratt. Vi är ett starkt team och vill fortsätta växa med fler teamorienterade kollegor som vill vara med och bygga på vår framgångssaga. Känner du dig träffad?  \n\nVillkor \nTjänsten är på heltid och innefattas av kollektivavtal. Lön och villkor enligt överenskommelse.  \n\nAnsökan\nUrval och intervjuer sker löpande, så skicka in din ansökan omgående. Vi arbetar kompetensbaserat i våra rekryteringar och söker aktivt efter de medarbetare som bäst matchar den kravprofil vi har satt upp för tjänsten. Som ett första steg i vår urvalsprocess kommer de personer som möter våra kvalifikationer att få genomföra två rekryteringstester där du matchas mot vår kravprofil. Mer information om detta får du vid genomförd ansökan.",
        "conditions" : "100%. Tillträde: Oktober 2022\r\nTillsvidareanställning",
        "text" : "First Camp är Skandinaviens ledande campingkoncern med totalt 61 destinationer i Sverige, Danmark och Norge. Vi är inne i en spännande tillväxtfas och har genom organisk tillväxt och ett stort antal förvärv gått från drygt 100 MSEK i omsättning 2016 till nu över 1 000 MSEK ett normalår. Detta är en unik möjlighet att driva utvecklingen i en bransch med enormt mycket potential. Vi är ett stort team med över 1500 medarbetare som brinner för våra gästers upplevelser och som strävar mot att bygga världens ledande campingkedja. Läs gärna mer om oss och vad vi gör på www.firstcamp.se. \n\n\n \n\n\nUtanför Mönsterås ligger First Camp på skärgårdsidyllen Oknö. I den lugna och sköna naturen hittar du en arbetsplats där gemenskap och glädje sprider sig bland såväl campinggäster som kollegorna i receptionen, butiken och städet. Tillsammans arbetar vi för att våra gäster ska få en så enkel och behaglig vistelse som möjligt.\n\n\r\n\r\nBeskrivning\nVi vill bli världens ledande campingkedja genom att fokusera på innovation, hållbarhet och datadrivna gästinsikter.\r\n\r\nDärför vill vi att alla våra anställda ska drivas av att skapa mervärde, inte bara för våra gäster men även för varandra. De personer som ytterst ansvarar för mervärdet vi skapar på våra destinationer är våra Destinationschefer – och här vill vi nu fylla på med en ny kollega. \n\nArbetsuppgifter\nSom Destinationschef ansvarar du för hela driften, försäljningen och resultatet på din destination. Du har även personansvar för all personal på destinationen, vilket innefattar rekryteringsansvar, arbetsmiljöansvar och arbetsledning. \n\nI arbetsuppgifterna ingår arbetsledning och schemaläggning samt uppföljning och vidareutveckling av rutiner för bistro, reception, butik, vaktmästeri och städ. Rollen innefattar även löpande administration, budgetarbete, uppsökande företagsförsäljning samt ansvar för års-, månads- och veckoplanering.  \n\nI linje med att skapa mervärde för varandra och våra kunder, ska alla som arbetar på destinationerna kunna hugga i där det behövs, vilket innebär att du som Destinationschef kan komma att stötta upp med alla förekommande arbetsuppgifter som finns på arbetsplatsen.   \n\nUnder perioden oktober - mars håller First Camp Oknö vinterstängt. Du utgår då ifrån granndestinationen på First Camp Gunnarsö i Oskarshamn, där du tillsammans med Destinationschefen på Gunnarsö sköter den dagliga driften där.\n\nDet ingår ett delat ansvar för beredskap i tjänsten samt arbete på kvällar och helger.  \n\nKvalifikationer\nFör att passa in i rollen som Destinationschef krävs det att du har ett stort eget driv, ett lösningsfokuserat arbetssätt och en hög samarbetsförmåga. Du vill vara en del av något större, en kedja, där du som ledare vill vara med och skapa samhörighet över hela bolaget. Vi ser dig som en idérik genomförare som inte är rädd att kavla upp ärmarna när det behövs och som tycker om att arbeta med ett coachande ledarskap. Du måste dock också tycka om att leverera bra resultat och ha ett tydligt målfokus.  \n\nFör att vara aktuell för tjänsten behöver du ha haft personalansvar tidigare och en vidareutbildning inom turism, handel eller service. Du måste även kunna kommunicera mycket väl i både tal och skrift på svenska och engelska samt ha höga allmänna IT-kunskaper där du är van vid att använda olika system för att hantera ditt arbete. Det är meriterande om du har erfarenhet från camping och receptionsarbete sedan innan, har arbetat med B2B-försäljning samt har haft ansvar för upprättande av nya rutiner. Vi ser det även som mycket positivt om du har haft rekryterings- och budgetansvar samt varit arbetsledare för visstidsanställd personal under säsongsarbete.  \n\nVad erbjuder vi dig?   \nPå First Camp rekryterar vi förmågor och utvecklar dem. Hos oss ska du få möjlighet att växa och lära dig nytt samtidigt som du har riktigt roligt. \nVåra gemensamma värderingar styr vår vardag och hur vi är mot varandra:  \n\nWe Care:  Vi bryr oss om varandra, våra gäster och naturen \n\nWe Have Fun: Vi har kul på jobbet och har glimten i ögat både internt och med våra gäster \n\nWe Simplify:  Vi ska alltid försöka förenkla hur vi jobbar med varann och våra gäster \n\nWe Deliver Results: Allt vi gör ska ge resultat för oss, våra ägare och våra gäster \n\nSom Destinationschef kommer du att få delta i vårt ledarskapsprogram där du kommer att få utvecklas mer inom alla delar din tjänst omfattar, från rekrytering till budgetarbete och försäljning.  Vi erbjuder dig en bred tjänst med mycket ansvar, där du får möjlighet att växa inom en bransch på uppgång och där du har nära till kollegor när du behöver stöd. Kollegor som gärna bjuder på både erfarenhet och goda skratt. Vi är ett starkt team och vill fortsätta växa med fler teamorienterade kollegor som vill vara med och bygga på vår framgångssaga. Känner du dig träffad?  \n\nVillkor \nTjänsten är på heltid och innefattas av kollektivavtal. Lön och villkor enligt överenskommelse.  \n\nAnsökan\nUrval och intervjuer sker löpande, så skicka in din ansökan omgående. Vi arbetar kompetensbaserat i våra rekryteringar och söker aktivt efter de medarbetare som bäst matchar den kravprofil vi har satt upp för tjänsten. Som ett första steg i vår urvalsprocess kommer de personer som möter våra kvalifikationer att få genomföra två rekryteringstester där du matchas mot vår kravprofil. Mer information om detta får du vid genomförd ansökan."
      },
      "headline" : "Destinationschef",
      "driving_license" : [ {
        "concept_id" : "VTK8_WRx_GcM",
        "label" : "B",
        "legacy_ams_taxonomy_id" : "3"
      } ],
      "employer" : {
        "email" : null,
        "phone_number" : null,
        "organization_number" : "5566189873",
        "name" : "First Camp Sverige AB",
        "url" : null,
        "workplace" : "First Camp Oknö - Mönsterås"
      },
      "removed_date" : null,
      "logo_url" : "https://www.arbetsformedlingen.se/rest/arbetsgivare/rest/af/v3/organisation/5566189873/logotyper/logo.png",
      "last_publication_date" : "2022-09-11T23:59:59",
      "number_of_vacancies" : 1,
      "occupation" : {
        "concept_id" : "p299_kkg_67z",
        "label" : "Campingplatsföreståndare",
        "legacy_ams_taxonomy_id" : "4929"
      },
      "occupation_group" : {
        "concept_id" : "bYde_Frc_xcB",
        "label" : "Hotellreceptionister m.fl.",
        "legacy_ams_taxonomy_id" : "4224"
      },
      "employment_type" : {
        "concept_id" : "PFZr_Syz_cUq",
        "label" : "Vanlig anställning",
        "legacy_ams_taxonomy_id" : "1"
      },
      "webpage_url" : "https://arbetsformedlingen.se/platsbanken/annonser/26390675",
      "driving_license_required" : true,
      "application_contacts" : [ ],
      "duration" : {
        "concept_id" : "a7uU_j21_mkL",
        "label" : "Tills vidare",
        "legacy_ams_taxonomy_id" : "1"
      },
      "nice_to_have" : {
        "education_level" : [ ],
        "work_experiences" : [ ],
        "skills" : [ ],
        "education" : [ ],
        "languages" : [ ]
      },
      "application_details" : {
        "via_af" : false,
        "email" : null,
        "other" : null,
        "reference" : "2022/439",
        "url" : "https://firstcamp.varbi.com/what:job/jobID:533878/type:job/where:1/apply:1",
        "information" : null
      },
      "source_type" : "VIA_PLATSBANKEN_DXA",
      "application_deadline" : "2022-09-11T23:59:59",
      "external_id" : "46-556618-9873-533878",
      "workplace_address" : {
        "coordinates" : [ 16.44312, 57.04158 ],
        "city" : null,
        "postcode" : null,
        "municipality" : "Mönsterås",
        "region_concept_id" : "9QUH_2bb_6Np",
        "region" : "Kalmar län",
        "country_code" : "199",
        "region_code" : "08",
        "municipality_concept_id" : "8eEp_iz4_cNN",
        "country_concept_id" : "i46j_HmG_v64",
        "municipality_code" : "0861",
        "street_address" : null,
        "country" : "Sverige"
      },
      "id" : "26390675",
      "experience_required" : true,
      "working_hours_type" : {
        "concept_id" : "6YE1_gAC_R2G",
        "label" : "Heltid",
        "legacy_ams_taxonomy_id" : "1"
      },
      "access" : null,
      "timestamp" : 1660035994985,
      "must_have" : {
        "education_level" : [ ],
        "work_experiences" : [ {
          "concept_id" : "p299_kkg_67z",
          "weight" : 10,
          "label" : "Campingplatsföreståndare",
          "legacy_ams_taxonomy_id" : "4929"
        } ],
        "skills" : [ ],
        "education" : [ ],
        "languages" : [ ]
      },
      "occupation_field" : {
        "concept_id" : "ScKy_FHB_7wT",
        "label" : "Hotell, restaurang, storhushåll",
        "legacy_ams_taxonomy_id" : "7"
      },
      "scope_of_work" : {
        "min" : 100,
        "max" : 100
      },
      "salary_type" : {
        "concept_id" : "oG8G_9cW_nRf",
        "label" : "Fast månads- vecko- eller timlön",
        "legacy_ams_taxonomy_id" : "1"
      },
      "removed" : false,
      "salary_description" : "Fast månadslön",
      "access_to_own_car" : false,
      "publication_date" : "2022-08-09T11:06:34"
    },
    "name" : "Destinationschef",
    "user" : "hannes"
  },
  "sha1" : "d1ab36e7e0ea03de5c1d164f4ee2d8ad4e322f14",
  "annotations" : [ {
    "preferred-label" : "Destinationschef",
    "sentiment" : "MUST_HAVE",
    "type" : "keyword",
    "start-position" : 0,
    "end-position" : 16,
    "concept-id" : "ntCc_cy4_k5h",
    "matched-string" : "destinationschef",
    "annotation-id" : 0
  }, {
    "preferred-label" : "Destinationschef",
    "type" : "keyword",
    "start-position" : 1282,
    "end-position" : 1300,
    "concept-id" : "ntCc_cy4_k5h",
    "matched-string" : "Destinationschefer",
    "annotation-id" : 18
  }, {
    "preferred-label" : "Destinationschef",
    "sentiment" : "MUST_HAVE",
    "type" : "keyword",
    "start-position" : 1372,
    "end-position" : 1388,
    "concept-id" : "ntCc_cy4_k5h",
    "matched-string" : "destinationschef",
    "annotation-id" : 1
  }, {
    "preferred-label" : "Personal",
    "sentiment" : "MUST_HAVE",
    "type" : "keyword",
    "start-position" : 1501,
    "end-position" : 1509,
    "concept-id" : "HVxM_6MS_y1c",
    "matched-string" : "personal",
    "annotation-id" : 2
  }, {
    "preferred-label" : "Reception",
    "sentiment" : "MUST_HAVE",
    "type" : "keyword",
    "start-position" : 1725,
    "end-position" : 1734,
    "concept-id" : "zRKv_kwY_uw4",
    "matched-string" : "reception",
    "annotation-id" : 3
  }, {
    "preferred-label" : "Butik",
    "sentiment" : "MUST_HAVE",
    "type" : "keyword",
    "start-position" : 1736,
    "end-position" : 1741,
    "concept-id" : "xLsd_zjY_5wr",
    "matched-string" : "butik",
    "annotation-id" : 4
  }, {
    "preferred-label" : "sköta administration",
    "type" : "esco-skill",
    "start-position" : 1796,
    "end-position" : 1810,
    "concept-id" : "NEWh_NMX_RCZ",
    "matched-string" : "administration",
    "annotation-id" : 19
  }, {
    "preferred-label" : "Budgetansvar",
    "type" : "skill",
    "start-position" : 1812,
    "end-position" : 1824,
    "concept-id" : "Gt5f_wdi_FSJ",
    "matched-string" : "budgetarbete",
    "annotation-id" : 20
  }, {
    "preferred-label" : "Destinationschef",
    "sentiment" : "MUST_HAVE",
    "type" : "keyword",
    "start-position" : 2067,
    "end-position" : 2083,
    "concept-id" : "ntCc_cy4_k5h",
    "matched-string" : "destinationschef",
    "annotation-id" : 5
  }, {
    "preferred-label" : "Destinationschef",
    "sentiment" : "MUST_HAVE",
    "type" : "keyword",
    "start-position" : 2543,
    "end-position" : 2559,
    "concept-id" : "ntCc_cy4_k5h",
    "matched-string" : "destinationschef",
    "annotation-id" : 6
  }, {
    "preferred-label" : "Lösningsfokuserat arbetssätt",
    "sentiment" : "MUST_HAVE",
    "type" : "skill",
    "start-position" : 2606,
    "end-position" : 2634,
    "concept-id" : "94uF_bkH_QF5",
    "matched-string" : "lösningsfokuserat arbetssätt",
    "annotation-id" : 7
  }, {
    "preferred-label" : "Personalansvar",
    "sentiment" : "MUST_HAVE",
    "type" : "skill",
    "start-position" : 3073,
    "end-position" : 3087,
    "concept-id" : "ZzN5_m7B_5CY",
    "matched-string" : "personalansvar",
    "annotation-id" : 8
  }, {
    "preferred-label" : "Turism",
    "sentiment" : "MUST_HAVE",
    "type" : "keyword",
    "start-position" : 3126,
    "end-position" : 3132,
    "concept-id" : "7goz_uuv_JWu",
    "matched-string" : "turism",
    "annotation-id" : 9
  }, {
    "preferred-label" : "Handel",
    "sentiment" : "MUST_HAVE",
    "type" : "keyword",
    "start-position" : 3134,
    "end-position" : 3140,
    "concept-id" : "qPyg_Zo8_EEd",
    "matched-string" : "handel",
    "annotation-id" : 10
  }, {
    "preferred-label" : "Svenska",
    "sentiment" : "MUST_HAVE",
    "type" : "language",
    "start-position" : 3224,
    "end-position" : 3231,
    "concept-id" : "zSLA_vw2_FXN",
    "matched-string" : "svenska",
    "annotation-id" : 11
  }, {
    "preferred-label" : "Engelska",
    "sentiment" : "MUST_HAVE",
    "type" : "language",
    "start-position" : 3236,
    "end-position" : 3244,
    "concept-id" : "NVxJ_hLg_TYS",
    "matched-string" : "engelska",
    "annotation-id" : 12
  }, {
    "preferred-label" : "Data/IT",
    "sentiment" : "MUST_HAVE",
    "type" : "occupation-field",
    "start-position" : 3267,
    "end-position" : 3269,
    "concept-id" : "apaJ_2ja_LuF",
    "matched-string" : "it",
    "annotation-id" : 13
  }, {
    "preferred-label" : "B2B-säljare",
    "type" : "keyword",
    "start-position" : 3455,
    "end-position" : 3470,
    "concept-id" : "gyej_EdX_JSE",
    "matched-string" : "B2B-försäljning",
    "annotation-id" : 21
  }, {
    "preferred-label" : "Budgetansvar",
    "sentiment" : "MUST_HAVE",
    "type" : "skill",
    "start-position" : 3593,
    "end-position" : 3605,
    "concept-id" : "Gt5f_wdi_FSJ",
    "matched-string" : "budgetansvar",
    "annotation-id" : 14
  }, {
    "preferred-label" : "Allmän visstidsanställning",
    "type" : "keyword",
    "start-position" : 3634,
    "end-position" : 3650,
    "concept-id" : "hxfz_ayC_9Vd",
    "matched-string" : "visstidsanställd",
    "annotation-id" : 22
  }, {
    "preferred-label" : "Personal",
    "sentiment" : "MUST_HAVE",
    "type" : "keyword",
    "start-position" : 3651,
    "end-position" : 3659,
    "concept-id" : "HVxM_6MS_y1c",
    "matched-string" : "personal",
    "annotation-id" : 15
  }, {
    "preferred-label" : "Säsongsanställning",
    "type" : "employment-type",
    "start-position" : 3666,
    "end-position" : 3679,
    "concept-id" : "EBhX_Qm2_8eX",
    "matched-string" : "säsongsarbete",
    "annotation-id" : 23
  }, {
    "preferred-label" : "Destinationschef",
    "sentiment" : "MUST_HAVE",
    "type" : "keyword",
    "start-position" : 4263,
    "end-position" : 4279,
    "concept-id" : "ntCc_cy4_k5h",
    "matched-string" : "destinationschef",
    "annotation-id" : 16
  }, {
    "preferred-label" : "Heltid",
    "type" : "worktime-extent",
    "start-position" : 4857,
    "end-position" : 4863,
    "concept-id" : "6YE1_gAC_R2G",
    "matched-string" : "heltid",
    "annotation-id" : 24
  }, {
    "preferred-label" : "Kollektivavtal",
    "sentiment" : "MUST_HAVE",
    "type" : "skill",
    "start-position" : 4882,
    "end-position" : 4896,
    "concept-id" : "z7wE_9xb_3jX",
    "matched-string" : "kollektivavtal",
    "annotation-id" : 17
  } ],
  "text" : "Destinationschef\nFirst Camp är Skandinaviens ledande campingkoncern med totalt 61 destinationer i Sverige, Danmark och Norge. Vi är inne i en spännande tillväxtfas och har genom organisk tillväxt och ett stort antal förvärv gått från drygt 100 MSEK i omsättning 2016 till nu över 1 000 MSEK ett normalår. Detta är en unik möjlighet att driva utvecklingen i en bransch med enormt mycket potential. Vi är ett stort team med över 1500 medarbetare som brinner för våra gästers upplevelser och som strävar mot att bygga världens ledande campingkedja. Läs gärna mer om oss och vad vi gör på www.firstcamp.se. \n\n\n \n\n\nUtanför Mönsterås ligger First Camp på skärgårdsidyllen Oknö. I den lugna och sköna naturen hittar du en arbetsplats där gemenskap och glädje sprider sig bland såväl campinggäster som kollegorna i receptionen, butiken och städet. Tillsammans arbetar vi för att våra gäster ska få en så enkel och behaglig vistelse som möjligt.\n\n\r\n\r\nBeskrivning\nVi vill bli världens ledande campingkedja genom att fokusera på innovation, hållbarhet och datadrivna gästinsikter.\r\n\r\nDärför vill vi att alla våra anställda ska drivas av att skapa mervärde, inte bara för våra gäster men även för varandra. De personer som ytterst ansvarar för mervärdet vi skapar på våra destinationer är våra Destinationschefer – och här vill vi nu fylla på med en ny kollega. \n\nArbetsuppgifter\nSom Destinationschef ansvarar du för hela driften, försäljningen och resultatet på din destination. Du har även personansvar för all personal på destinationen, vilket innefattar rekryteringsansvar, arbetsmiljöansvar och arbetsledning. \n\nI arbetsuppgifterna ingår arbetsledning och schemaläggning samt uppföljning och vidareutveckling av rutiner för bistro, reception, butik, vaktmästeri och städ. Rollen innefattar även löpande administration, budgetarbete, uppsökande företagsförsäljning samt ansvar för års-, månads- och veckoplanering.  \n\nI linje med att skapa mervärde för varandra och våra kunder, ska alla som arbetar på destinationerna kunna hugga i där det behövs, vilket innebär att du som Destinationschef kan komma att stötta upp med alla förekommande arbetsuppgifter som finns på arbetsplatsen.   \n\nUnder perioden oktober - mars håller First Camp Oknö vinterstängt. Du utgår då ifrån granndestinationen på First Camp Gunnarsö i Oskarshamn, där du tillsammans med Destinationschefen på Gunnarsö sköter den dagliga driften där.\n\nDet ingår ett delat ansvar för beredskap i tjänsten samt arbete på kvällar och helger.  \n\nKvalifikationer\nFör att passa in i rollen som Destinationschef krävs det att du har ett stort eget driv, ett lösningsfokuserat arbetssätt och en hög samarbetsförmåga. Du vill vara en del av något större, en kedja, där du som ledare vill vara med och skapa samhörighet över hela bolaget. Vi ser dig som en idérik genomförare som inte är rädd att kavla upp ärmarna när det behövs och som tycker om att arbeta med ett coachande ledarskap. Du måste dock också tycka om att leverera bra resultat och ha ett tydligt målfokus.  \n\nFör att vara aktuell för tjänsten behöver du ha haft personalansvar tidigare och en vidareutbildning inom turism, handel eller service. Du måste även kunna kommunicera mycket väl i både tal och skrift på svenska och engelska samt ha höga allmänna IT-kunskaper där du är van vid att använda olika system för att hantera ditt arbete. Det är meriterande om du har erfarenhet från camping och receptionsarbete sedan innan, har arbetat med B2B-försäljning samt har haft ansvar för upprättande av nya rutiner. Vi ser det även som mycket positivt om du har haft rekryterings- och budgetansvar samt varit arbetsledare för visstidsanställd personal under säsongsarbete.  \n\nVad erbjuder vi dig?   \nPå First Camp rekryterar vi förmågor och utvecklar dem. Hos oss ska du få möjlighet att växa och lära dig nytt samtidigt som du har riktigt roligt. \nVåra gemensamma värderingar styr vår vardag och hur vi är mot varandra:  \n\nWe Care:  Vi bryr oss om varandra, våra gäster och naturen \n\nWe Have Fun: Vi har kul på jobbet och har glimten i ögat både internt och med våra gäster \n\nWe Simplify:  Vi ska alltid försöka förenkla hur vi jobbar med varann och våra gäster \n\nWe Deliver Results: Allt vi gör ska ge resultat för oss, våra ägare och våra gäster \n\nSom Destinationschef kommer du att få delta i vårt ledarskapsprogram där du kommer att få utvecklas mer inom alla delar din tjänst omfattar, från rekrytering till budgetarbete och försäljning.  Vi erbjuder dig en bred tjänst med mycket ansvar, där du får möjlighet att växa inom en bransch på uppgång och där du har nära till kollegor när du behöver stöd. Kollegor som gärna bjuder på både erfarenhet och goda skratt. Vi är ett starkt team och vill fortsätta växa med fler teamorienterade kollegor som vill vara med och bygga på vår framgångssaga. Känner du dig träffad?  \n\nVillkor \nTjänsten är på heltid och innefattas av kollektivavtal. Lön och villkor enligt överenskommelse.  \n\nAnsökan\nUrval och intervjuer sker löpande, så skicka in din ansökan omgående. Vi arbetar kompetensbaserat i våra rekryteringar och söker aktivt efter de medarbetare som bäst matchar den kravprofil vi har satt upp för tjänsten. Som ett första steg i vår urvalsprocess kommer de personer som möter våra kvalifikationer att få genomföra två rekryteringstester där du matchas mot vår kravprofil. Mer information om detta får du vid genomförd ansökan."
}