{
  "meta" : {
    "jobad" : {
      "description" : {
        "requirements" : null,
        "needs" : null,
        "company_information" : null,
        "text_formatted" : "GasiQ är ett litet familjärt bolag där personalomsättningen är låg, nu finns den unika möjligheten att bli en del av deras team. Är du en driven och noggrann CNC-operatör med några års erfarenhet från branschen? Då är det dig vi söker!\n\nDina arbetsuppgifter\nGasiQs maskinpark är modern, ljus och välvårdad. De har en toppmodern maskin som är unik i sitt slag då det bara existerar två av de i Sverige idag. \nTjänsten som CNC-operatör innebär varierande och stimulerande arbetsuppgifter för dig som trivs i en verkstadsmiljö.\nSom CNC-operatör förekommer arbetsuppgifter som:\n\tSvarvning och fräsning i CNC-styrda maskiner\n\tVerktygsbyten, ställ och programmering\n\tKvalitetskontroller och avsyning\n\n\nDin profil\nSom person är du duktig på att samarbeta, ta initiativ och bidrar med en härlig energi. Du som söker har med fördel någon form av utbildning eller praktisk erfarenhet inom CNC, meriterande om du jobbat med siemens. Du har god förståelse och kunskap vid att läsa ritningar, är kvalitetsmedveten i allt du gör samt trivs med att arbeta i en självständig roll.\nKrav: \n\tGod förståelse av ritningsläsning\n\tErfarenhet/utbildning inom CNC\n\n\nÖvrig information\n\tPlaceringsort: Stenkullen\n\tStart: Efter överenskommelse\n\tVaraktighet: Tillsvidare\n\tArbetstid: Dagtid\n\tLön: Efter överenskommelse\n\n\nGasiQ har valt att samarbeta med Maxkompetens i denna rekryteringsprocess.\n\nHar du frågor angående tjänsten så kontakta gärna ansvarig rekryterare på Maxkompetens, Emmi Persson på telefon 073 407 33 75.\n\nUrval och intervjuer kommer ske löpande i denna process så ansök gärna på www.maxkompetens.se redan idag!\n\nAnsökningar via e-post mottages ej på grund av GDPR.\n\n\nOm Maxkompetens\nMaxkompetens är ett av Sveriges ledande rekrytering och bemanningsbolag sedan 2003. Vi har kunduppdrag i hela landet och kontor i; Stockholm, Växjö, Kristianstad, Halmstad, Borås &amp; Göteborg. Varje år tillsätter vi över 1200 jobb och har 250 anställda. Våra kompetensområden är HR &amp; Lön, Ekonomi &amp; Finans, Kundtjänst &amp; Administration, Marknad &amp; Försäljning, It &amp; Teknik, Inköp &amp; Logistik, Industri. \n \nVarje människa har en fantastisk potential. Det är viktigt att ta vara på alla människors kompetens och erbjuda dem möjligheten att uppnå sina drömmar. Genom omsorgsfullhet, väl fungerande rekryteringsprocesser och hög kompetens hjälper vi människor och företag att mötas och lyckas tillsammans. En bättre värld helt enkelt! Vi är ett auktoriserat bemanningsföretag med kollektivavtal, försäkringar, friskvård och tjänstepension.\n\n\nOm kunden\nGasiQ är en helsvensk tillverkare av produkter för gassvetsning, lödning, skärning samt reglerutrustning.\nVåra produkter säljs genom grossister och specialister i Norden, Europa samt i många andra delar av världen.Företaget tog över verksamheten i februari 2007 från ELGA AB (ITW) som har tillverkat gasutrustning i över 70 år till den krävande industrin. GasIQ har även en omfattande Legotillverkning bland annat till VVS industrin. \nVi är certifierade enligt ISO 9001:2015 och ISO 14001:2015 av Lloyd's Register of Quality Assurance.\n\nVi finns i Stenkullen strax utanför Göteborg i Lerums Kommun.",
        "conditions" : "Heltid\r\nTillsvidare",
        "text" : "GasiQ är ett litet familjärt bolag där personalomsättningen är låg, nu finns den unika möjligheten att bli en del av deras team. Är du en driven och noggrann CNC-operatör med några års erfarenhet från branschen? Då är det dig vi söker!\n\nDina arbetsuppgifter\nGasiQs maskinpark är modern, ljus och välvårdad. De har en toppmodern maskin som är unik i sitt slag då det bara existerar två av de i Sverige idag. \nTjänsten som CNC-operatör innebär varierande och stimulerande arbetsuppgifter för dig som trivs i en verkstadsmiljö.\nSom CNC-operatör förekommer arbetsuppgifter som:\n\tSvarvning och fräsning i CNC-styrda maskiner\n\tVerktygsbyten, ställ och programmering\n\tKvalitetskontroller och avsyning\n\n\nDin profil\nSom person är du duktig på att samarbeta, ta initiativ och bidrar med en härlig energi. Du som söker har med fördel någon form av utbildning eller praktisk erfarenhet inom CNC, meriterande om du jobbat med siemens. Du har god förståelse och kunskap vid att läsa ritningar, är kvalitetsmedveten i allt du gör samt trivs med att arbeta i en självständig roll.\nKrav: \n\tGod förståelse av ritningsläsning\n\tErfarenhet/utbildning inom CNC\n\n\nÖvrig information\n\tPlaceringsort: Stenkullen\n\tStart: Efter överenskommelse\n\tVaraktighet: Tillsvidare\n\tArbetstid: Dagtid\n\tLön: Efter överenskommelse\n\n\nGasiQ har valt att samarbeta med Maxkompetens i denna rekryteringsprocess.\n\nHar du frågor angående tjänsten så kontakta gärna ansvarig rekryterare på Maxkompetens, Emmi Persson på telefon 073 407 33 75.\n\nUrval och intervjuer kommer ske löpande i denna process så ansök gärna på www.maxkompetens.se redan idag!\n\nAnsökningar via e-post mottages ej på grund av GDPR.\n\n\nOm Maxkompetens\nMaxkompetens är ett av Sveriges ledande rekrytering och bemanningsbolag sedan 2003. Vi har kunduppdrag i hela landet och kontor i; Stockholm, Växjö, Kristianstad, Halmstad, Borås & Göteborg. Varje år tillsätter vi över 1200 jobb och har 250 anställda. Våra kompetensområden är HR & Lön, Ekonomi & Finans, Kundtjänst & Administration, Marknad & Försäljning, It & Teknik, Inköp & Logistik, Industri. \n \nVarje människa har en fantastisk potential. Det är viktigt att ta vara på alla människors kompetens och erbjuda dem möjligheten att uppnå sina drömmar. Genom omsorgsfullhet, väl fungerande rekryteringsprocesser och hög kompetens hjälper vi människor och företag att mötas och lyckas tillsammans. En bättre värld helt enkelt! Vi är ett auktoriserat bemanningsföretag med kollektivavtal, försäkringar, friskvård och tjänstepension.\n\n\nOm kunden\nGasiQ är en helsvensk tillverkare av produkter för gassvetsning, lödning, skärning samt reglerutrustning.\nVåra produkter säljs genom grossister och specialister i Norden, Europa samt i många andra delar av världen.Företaget tog över verksamheten i februari 2007 från ELGA AB (ITW) som har tillverkat gasutrustning i över 70 år till den krävande industrin. GasIQ har även en omfattande Legotillverkning bland annat till VVS industrin. \nVi är certifierade enligt ISO 9001:2015 och ISO 14001:2015 av Lloyd's Register of Quality Assurance.\n\nVi finns i Stenkullen strax utanför Göteborg i Lerums Kommun."
      },
      "headline" : "CNC-operatör till GasiQ",
      "driving_license" : null,
      "employer" : {
        "email" : null,
        "phone_number" : null,
        "organization_number" : "5566476957",
        "name" : "Maxkompetens Sverige AB",
        "url" : "http://www.maxkompetens.se",
        "workplace" : "Maxkompetens Sverige AB"
      },
      "removed_date" : null,
      "logo_url" : "https://www.arbetsformedlingen.se/rest/arbetsgivare/rest/af/v3/organisation/5566476957/logotyper/logo.png",
      "last_publication_date" : "2022-09-04T23:59:59",
      "number_of_vacancies" : 1,
      "occupation" : {
        "concept_id" : "EvmU_s9w_euP",
        "label" : "CNC-operatör/FMS-operatör",
        "legacy_ams_taxonomy_id" : "6004"
      },
      "occupation_group" : {
        "concept_id" : "vaEp_iBS_c5h",
        "label" : "Maskinställare och maskinoperatörer, metallarbete",
        "legacy_ams_taxonomy_id" : "7223"
      },
      "employment_type" : {
        "concept_id" : "PFZr_Syz_cUq",
        "label" : "Vanlig anställning",
        "legacy_ams_taxonomy_id" : "1"
      },
      "webpage_url" : "https://arbetsformedlingen.se/platsbanken/annonser/26361668",
      "driving_license_required" : false,
      "application_contacts" : [ {
        "description" : "Emmi Persson",
        "email" : "emmi.persson@maxkompetens.se",
        "telephone" : "0734073375",
        "name" : null,
        "contact_type" : null
      } ],
      "duration" : {
        "concept_id" : "a7uU_j21_mkL",
        "label" : "Tills vidare",
        "legacy_ams_taxonomy_id" : "1"
      },
      "nice_to_have" : {
        "education_level" : [ ],
        "work_experiences" : [ ],
        "skills" : [ ],
        "education" : [ ],
        "languages" : [ ]
      },
      "application_details" : {
        "via_af" : false,
        "email" : null,
        "other" : null,
        "reference" : "8377",
        "url" : "https://ledigajobb.maxkompetens.se/jobb/8377/ansokan",
        "information" : null
      },
      "source_type" : "VIA_PLATSBANKEN_DXA",
      "application_deadline" : "2022-09-04T23:59:59",
      "external_id" : "46-556647-6957-8377",
      "workplace_address" : {
        "coordinates" : [ 11.97456, 57.70887 ],
        "city" : null,
        "postcode" : null,
        "municipality" : "Göteborg",
        "region_concept_id" : "zdoY_6u5_Krt",
        "region" : "Västra Götalands län",
        "country_code" : "199",
        "region_code" : "14",
        "municipality_concept_id" : "PVZL_BQT_XtL",
        "country_concept_id" : "i46j_HmG_v64",
        "municipality_code" : "1480",
        "street_address" : null,
        "country" : "Sverige"
      },
      "id" : "26361668",
      "experience_required" : true,
      "working_hours_type" : {
        "concept_id" : "6YE1_gAC_R2G",
        "label" : "Heltid",
        "legacy_ams_taxonomy_id" : "1"
      },
      "access" : null,
      "timestamp" : 1659074183733,
      "must_have" : {
        "education_level" : [ ],
        "work_experiences" : [ {
          "concept_id" : "EvmU_s9w_euP",
          "weight" : 10,
          "label" : "CNC-operatör/FMS-operatör",
          "legacy_ams_taxonomy_id" : "6004"
        } ],
        "skills" : [ ],
        "education" : [ ],
        "languages" : [ ]
      },
      "occupation_field" : {
        "concept_id" : "wTEr_CBC_bqh",
        "label" : "Industriell tillverkning",
        "legacy_ams_taxonomy_id" : "9"
      },
      "scope_of_work" : {
        "min" : 100,
        "max" : 100
      },
      "salary_type" : {
        "concept_id" : "oG8G_9cW_nRf",
        "label" : "Fast månads- vecko- eller timlön",
        "legacy_ams_taxonomy_id" : "1"
      },
      "removed" : false,
      "salary_description" : "Fast lön",
      "access_to_own_car" : false,
      "publication_date" : "2022-07-29T07:56:23"
    },
    "name" : "CNC-operatör till GasiQ",
    "user" : "kristof.fischer"
  },
  "sha1" : "562ac00d3f5f1b9549207dfcb5e47a5136b6543e",
  "annotations" : [ {
    "preferred-label" : "CNC-operatör",
    "sentiment" : "MUST_HAVE",
    "type" : "esco-occupation",
    "start-position" : 0,
    "end-position" : 12,
    "concept-id" : "ezxx_3Jf_Li6",
    "matched-string" : "cnc-operatör",
    "annotation-id" : 0
  }, {
    "preferred-label" : "noggrannhet",
    "sentiment" : "MUST_HAVE",
    "type" : "esco-skill",
    "start-position" : 173,
    "end-position" : 181,
    "concept-id" : "mrsW_EkL_KRD",
    "matched-string" : "noggrann",
    "annotation-id" : 16
  }, {
    "preferred-label" : "CNC-operatör",
    "sentiment" : "MUST_HAVE",
    "type" : "esco-occupation",
    "start-position" : 182,
    "end-position" : 194,
    "concept-id" : "ezxx_3Jf_Li6",
    "matched-string" : "cnc-operatör",
    "annotation-id" : 1
  }, {
    "preferred-label" : "Sverige",
    "type" : "country",
    "start-position" : 417,
    "end-position" : 424,
    "concept-id" : "i46j_HmG_v64",
    "matched-string" : "Sverige",
    "annotation-id" : 17
  }, {
    "preferred-label" : "CNC-operatör",
    "sentiment" : "MUST_HAVE",
    "type" : "esco-occupation",
    "start-position" : 445,
    "end-position" : 457,
    "concept-id" : "ezxx_3Jf_Li6",
    "matched-string" : "cnc-operatör",
    "annotation-id" : 2
  }, {
    "preferred-label" : "CNC-operatör",
    "sentiment" : "MUST_HAVE",
    "type" : "esco-occupation",
    "start-position" : 553,
    "end-position" : 565,
    "concept-id" : "ezxx_3Jf_Li6",
    "matched-string" : "cnc-operatör",
    "annotation-id" : 3
  }, {
    "preferred-label" : "Svarvning, CNC",
    "sentiment" : "MUST_HAVE",
    "type" : "skill",
    "start-position" : 599,
    "end-position" : 608,
    "concept-id" : "d2yX_cZM_fSy",
    "matched-string" : "Svarvning",
    "annotation-id" : 18
  }, {
    "preferred-label" : "Fräsning, CNC",
    "sentiment" : "MUST_HAVE",
    "type" : "skill",
    "start-position" : 613,
    "end-position" : 621,
    "concept-id" : "wpVJ_UXf_uSb",
    "matched-string" : "fräsning",
    "annotation-id" : 19
  }, {
    "preferred-label" : "Programmering",
    "sentiment" : "MUST_HAVE",
    "type" : "skill",
    "start-position" : 670,
    "end-position" : 683,
    "concept-id" : "iUew_moc_BRk",
    "matched-string" : "programmering",
    "annotation-id" : 4
  }, {
    "preferred-label" : "Avsyning",
    "sentiment" : "MUST_HAVE",
    "type" : "skill",
    "start-position" : 709,
    "end-position" : 717,
    "concept-id" : "X4EU_ZC7_QmK",
    "matched-string" : "avsyning",
    "annotation-id" : 5
  }, {
    "preferred-label" : "samarbeta med kolleger",
    "sentiment" : "MUST_HAVE",
    "type" : "esco-skill",
    "start-position" : 762,
    "end-position" : 771,
    "concept-id" : "X15R_797_q62",
    "matched-string" : "samarbeta",
    "annotation-id" : 20
  }, {
    "preferred-label" : null,
    "sentiment" : "MUST_HAVE",
    "type" : "skill",
    "start-position" : 903,
    "end-position" : 906,
    "concept-id" : null,
    "matched-string" : "CNC",
    "annotation-id" : 22
  }, {
    "preferred-label" : "CNC-programmering, Siemens",
    "sentiment" : "NICE_TO_HAVE",
    "type" : "skill",
    "start-position" : 937,
    "end-position" : 944,
    "concept-id" : "B8dd_RVE_soo",
    "matched-string" : "siemens",
    "annotation-id" : 21
  }, {
    "preferred-label" : "Ritningsläsning",
    "sentiment" : "MUST_HAVE",
    "type" : "skill",
    "start-position" : 988,
    "end-position" : 1002,
    "concept-id" : "aHCV_VsV_LiD",
    "matched-string" : "läsa ritningar",
    "annotation-id" : 23
  }, {
    "preferred-label" : "Ritningsläsning",
    "sentiment" : "MUST_HAVE",
    "type" : "skill",
    "start-position" : 1115,
    "end-position" : 1130,
    "concept-id" : "aHCV_VsV_LiD",
    "matched-string" : "ritningsläsning",
    "annotation-id" : 6
  }, {
    "preferred-label" : null,
    "sentiment" : "MUST_HAVE",
    "type" : "skill",
    "start-position" : 1159,
    "end-position" : 1162,
    "concept-id" : null,
    "matched-string" : "CNC",
    "annotation-id" : 24
  }, {
    "preferred-label" : "Tillsvidareanställning (inkl. eventuell provanställning)",
    "type" : "employment-type",
    "start-position" : 1254,
    "end-position" : 1265,
    "concept-id" : "kpPX_CNN_gDU",
    "matched-string" : "Tillsvidare",
    "annotation-id" : 25
  } ],
  "text" : "CNC-operatör till GasiQ\nGasiQ är ett litet familjärt bolag där personalomsättningen är låg, nu finns den unika möjligheten att bli en del av deras team. Är du en driven och noggrann CNC-operatör med några års erfarenhet från branschen? Då är det dig vi söker!\n\nDina arbetsuppgifter\nGasiQs maskinpark är modern, ljus och välvårdad. De har en toppmodern maskin som är unik i sitt slag då det bara existerar två av de i Sverige idag. \nTjänsten som CNC-operatör innebär varierande och stimulerande arbetsuppgifter för dig som trivs i en verkstadsmiljö.\nSom CNC-operatör förekommer arbetsuppgifter som:\n\tSvarvning och fräsning i CNC-styrda maskiner\n\tVerktygsbyten, ställ och programmering\n\tKvalitetskontroller och avsyning\n\n\nDin profil\nSom person är du duktig på att samarbeta, ta initiativ och bidrar med en härlig energi. Du som söker har med fördel någon form av utbildning eller praktisk erfarenhet inom CNC, meriterande om du jobbat med siemens. Du har god förståelse och kunskap vid att läsa ritningar, är kvalitetsmedveten i allt du gör samt trivs med att arbeta i en självständig roll.\nKrav: \n\tGod förståelse av ritningsläsning\n\tErfarenhet/utbildning inom CNC\n\n\nÖvrig information\n\tPlaceringsort: Stenkullen\n\tStart: Efter överenskommelse\n\tVaraktighet: Tillsvidare\n\tArbetstid: Dagtid\n\tLön: Efter överenskommelse\n\n\nGasiQ har valt att samarbeta med Maxkompetens i denna rekryteringsprocess.\n\nHar du frågor angående tjänsten så kontakta gärna ansvarig rekryterare på Maxkompetens, Emmi Persson på telefon 073 407 33 75.\n\nUrval och intervjuer kommer ske löpande i denna process så ansök gärna på www.maxkompetens.se redan idag!\n\nAnsökningar via e-post mottages ej på grund av GDPR.\n\n\nOm Maxkompetens\nMaxkompetens är ett av Sveriges ledande rekrytering och bemanningsbolag sedan 2003. Vi har kunduppdrag i hela landet och kontor i; Stockholm, Växjö, Kristianstad, Halmstad, Borås & Göteborg. Varje år tillsätter vi över 1200 jobb och har 250 anställda. Våra kompetensområden är HR & Lön, Ekonomi & Finans, Kundtjänst & Administration, Marknad & Försäljning, It & Teknik, Inköp & Logistik, Industri. \n \nVarje människa har en fantastisk potential. Det är viktigt att ta vara på alla människors kompetens och erbjuda dem möjligheten att uppnå sina drömmar. Genom omsorgsfullhet, väl fungerande rekryteringsprocesser och hög kompetens hjälper vi människor och företag att mötas och lyckas tillsammans. En bättre värld helt enkelt! Vi är ett auktoriserat bemanningsföretag med kollektivavtal, försäkringar, friskvård och tjänstepension.\n\n\nOm kunden\nGasiQ är en helsvensk tillverkare av produkter för gassvetsning, lödning, skärning samt reglerutrustning.\nVåra produkter säljs genom grossister och specialister i Norden, Europa samt i många andra delar av världen.Företaget tog över verksamheten i februari 2007 från ELGA AB (ITW) som har tillverkat gasutrustning i över 70 år till den krävande industrin. GasIQ har även en omfattande Legotillverkning bland annat till VVS industrin. \nVi är certifierade enligt ISO 9001:2015 och ISO 14001:2015 av Lloyd's Register of Quality Assurance.\n\nVi finns i Stenkullen strax utanför Göteborg i Lerums Kommun."
}