2;Sjöman;5370;1:e Fartygsingenjör/1:e Maskinist
51;Fartyg;5370;1:e Fartygsingenjör/1:e Maskinist
2;Sjöman;5371;2:e Fartygsingenjör/2:e Maskinist
51;Fartyg;5371;2:e Fartygsingenjör/2:e Maskinist
2;Sjöman;5369;2:e Styrman
51;Fartyg;5369;2:e Styrman
53;Skeppare;5369;2:e Styrman
54;Sjökapten;5369;2:e Styrman
3;3D;7439;3D-grafiker
4;Säljare;2315;Abonnemangsförsäljare
139;Kundservicemedarbetare;2315;Abonnemangsförsäljare
140;Kundcentermedarbetare;2315;Abonnemangsförsäljare
142;Callcentermedarbetare;2315;Abonnemangsförsäljare
4;Säljare;6728;Account manager
5;Redovisningscontroller;6534;Accounting controller
22;Verksamhetscontroller;6534;Accounting controller
6;Jurist;6032;Advokat
7;Juridik;6032;Advokat
6;Jurist;4421;Advokatfiskal
7;Juridik;4421;Advokatfiskal
7;Juridik;2799;Advokatsekreterare
6;Jurist;4004;Affärsjurist
7;Juridik;4004;Affärsjurist
4;Säljare;683;Affärsresesäljare
8;Sjuksyster;5758;Akutsjuksköterska/Sjuksköterska, akutmottagning
6;Jurist;3143;Allmän åklagare
7;Juridik;3143;Allmän åklagare
8;Sjuksyster;1811;Ambulanssjuksköterska
238;Ambulans;1811;Ambulanssjuksköterska
9;Ambulansförare;5708;Ambulanssjukvårdare
238;Ambulans;5708;Ambulanssjukvårdare
10;Life science;1836;Analytisk kemist
8;Sjuksyster;1812;Anestesisjuksköterska
11;Narkossjuksköterska;1812;Anestesisjuksköterska
295;Arbetsförmedlingen;6653;Arbetsförmedlare
12;Psykologi;1467;Arbetspsykolog
6;Jurist;6254;Arbetsrättsjurist
7;Juridik;6254;Arbetsrättsjurist
218;Sanerare;4079;Asbestsanerare
6;Jurist;3118;Assessor
7;Juridik;3118;Assessor
13;Kyrkan;1780;Assistent i församlingsarbete
21;Församling;1780;Assistent i församlingsarbete
6;Jurist;3144;Assistentåklagare
7;Juridik;3144;Assistentåklagare
153;Underläkare;7236;AT-läkare
14;Avlopp;2883;Avloppstekniker
52;Avloppsteknik;2883;Avloppstekniker
247;Vaktmästare;7371;Badvaktmästare
264;Livsmedel;5504;Bagare/Konditor
10;Life science;4742;Bakteriolog
15;Tåg;6650;Bangårdsoperatör
16;Järnväg;6650;Bangårdsoperatör
6;Jurist;6178;Bankjurist
7;Juridik;6178;Bankjurist
13;Kyrkan;2122;Baptistpastor
305;Religion;2122;Baptistpastor
17;Kaffe;6762;Barista/Kaffebartender
270;Turism;6762;Barista/Kaffebartender
291;Besöksnäring;6762;Barista/Kaffebartender
286;Restauran;6763;Barmästare
300;Restaurang;6763;Barmästare
18;Nanny;438;Barnflicka/Barnvakt
19;BVC;5701;Barnmorska
19;BVC;1434;Barnmorska, öppen vård/mödravård
12;Psykologi;1468;Barnpsykolog
19;BVC;1468;Barnpsykolog
8;Sjuksyster;5759;Barnsjuksköterska
19;BVC;5759;Barnsjuksköterska
8;Sjuksyster;7273;Barnsjuksköterska, akutmottagning
8;Sjuksyster;1820;Barnsjuksköterska, mottagning/vårdcentral
19;BVC;1820;Barnsjuksköterska, mottagning/vårdcentral
8;Sjuksyster;1821;Barnsjuksköterska, vårdavdelning
1;Dagisfröken;5716;Barnskötare
50;Dagis;5716;Barnskötare
101;Förskola;5716;Barnskötare
12;Psykologi;1475;Barnterapeut
13;Kyrkan;1777;Barntimmeledare
20;Barnkonsulent, församling;1777;Barntimmeledare
21;Församling;1777;Barntimmeledare
270;Turism;5488;Bartender
272;Hotell;5488;Bartender
286;Restauran;5488;Bartender
291;Besöksnäring;5488;Bartender
300;Restaurang;5488;Bartender
51;Fartyg;7648;Befaren maskinpersonal, sjöfart
2;Sjöman;5368;Befälhavare
51;Fartyg;5368;Befälhavare
53;Skeppare;5368;Befälhavare
54;Sjökapten;5368;Befälhavare
47;Beteendevetare;5711;Behandlingsassistent/Socialpedagog
48;Beteendevetenskap;5711;Behandlingsassistent/Socialpedagog
97;Kriminalvård;5711;Behandlingsassistent/Socialpedagog
137;Kriminalvården;5711;Behandlingsassistent/Socialpedagog
45;Asfalt;2325;Beläggningsarbetare
46;Asfaltarbete;2325;Beläggningsarbetare
45;Asfalt;7169;Beläggningsarbetare, utan yrkesbevis
46;Asfaltarbete;7169;Beläggningsarbetare, utan yrkesbevis
237;Statoil;5852;Bensinstationsbiträde/Servicebiträde
237;Statoil;7161;Bensinstationsföreståndare/Stationschef
43;Bilbesiktare;625;Besiktningsingenjör, bilprovning
44;Bilbesiktare, bilprovningen;625;Besiktningsingenjör, bilprovning
43;Bilbesiktare;624;Besiktningstekniker, bilprovning
44;Bilbesiktare, bilprovningen;624;Besiktningstekniker, bilprovning
287;Bil;624;Besiktningstekniker, bilprovning
42;Måltidsbiträde;470;Bespisningsbiträde/Skolmåltidsbiträde
287;Bil;5673;Bilbärgare
115;Demonterare;2959;Bildemontör
4;Säljare;5854;Bilförsäljare
40;Bilsäljare;5854;Bilförsäljare
41;Sälj;5854;Bilförsäljare
287;Bil;5854;Bilförsäljare
230;Plåtslagare;5973;Bilplåtslagare/Bilskade- och karosserireparatör
287;Bil;5973;Bilplåtslagare/Bilskade- och karosserireparatör
39;Bilrekondare;396;Bilrekonditionerare
287;Bil;396;Bilrekonditionerare
287;Bil;4348;Biltapetserare
287;Bil;2306;Biluthyrare
39;Bilrekondare;397;Bilvårdare/Garagearbetare
247;Vaktmästare;4126;Biografvaktmästare
10;Life science;1837;Biokemist
10;Life science;6305;Biolog
6;Jurist;5399;Biträdande jurist
7;Juridik;5399;Biträdande jurist
82;Blommor;4548;Blomsterodlare
33;Lastbilschaffis;6686;Bohags- och flyttbilsförare
34;Långtradarchaufför;6686;Bohags- och flyttbilsförare
35;Långtradarchaffis;6686;Bohags- och flyttbilsförare
36;Lastbilsförare;6686;Bohags- och flyttbilsförare
38;Lastbil;6686;Bohags- och flyttbilsförare
122;C-chaufför;6686;Bohags- och flyttbilsförare
6;Jurist;6181;Bolagsjurist
7;Juridik;6181;Bolagsjurist
7;Juridik;2791;Boupptecknare
7;Juridik;5964;Boutredare
7;Juridik;2792;Boutredningsman
32;Brandmästare;5905;Brandbefäl/Räddningsledare/Insatsledare
28;Rökdykare;5904;Brandman
29;Kemdykare;5904;Brandman
30;Räddningsdykare;5904;Brandman
31;Vattendykare;5904;Brandman
218;Sanerare;4080;Brandskadesanerare
26;Postiljon;5830;Brevbärare
27;Posten;5830;Brevbärare
6;Jurist;3156;Brottmålsadvokat
7;Juridik;3156;Brottmålsadvokat
24;Budbilschaufför;4332;Budbilsförare
25;B-chaufför;4332;Budbilsförare
37;Chaufför;4332;Budbilsförare
121;Chaffis;4332;Budbilsförare
239;Bud;4332;Budbilsförare
287;Bil;4332;Budbilsförare
305;Religion;6841;Buddhistpräst
285;Ekonomiansvarig;5069;Budgetchef
22;Verksamhetscontroller;6533;Business controller
23;Busschaffis;5561;Bussförare/Busschaufför
270;Turism;698;Bussguide
291;Besöksnäring;698;Bussguide
240;Butik;2289;Butiksdemonstratör
240;Butik;4171;Butiksinspektör
240;Butik;7211;Butikskommunikatör/Visual merchandiser
55;Butiksdekoratör;7211;Butikskommunikatör/Visual merchandiser
56;HM;7211;Butikskommunikatör/Visual merchandiser
93;H&M;7211;Butikskommunikatör/Visual merchandiser
240;Butik;5950;Butikskonsulent
57;Securitas;2475;Butikskontrollant
240;Butik;2475;Butikskontrollant
4;Säljare;5357;Butikssäljare, fackhandel
41;Sälj;5357;Butikssäljare, fackhandel
56;HM;5357;Butikssäljare, fackhandel
58;Butiksbiträde;5357;Butikssäljare, fackhandel
59;Affärsbiträde;5357;Butikssäljare, fackhandel
60;Butiksäljare;5357;Butikssäljare, fackhandel
301;Emporia;5357;Butikssäljare, fackhandel
62;Systembolaget;5357;Butikssäljare, fackhandel
63;Bauhaus;5357;Butikssäljare, fackhandel
93;H&M;5357;Butikssäljare, fackhandel
124;Zoo;5357;Butikssäljare, fackhandel
236;Kosmetik;5357;Butikssäljare, fackhandel
240;Butik;5357;Butikssäljare, fackhandel
4;Säljare;2284;Butikssäljare/Medarbetare, dagligvaror
58;Butiksbiträde;2284;Butikssäljare/Medarbetare, dagligvaror
59;Affärsbiträde;2284;Butikssäljare/Medarbetare, dagligvaror
69;Willy's;2284;Butikssäljare/Medarbetare, dagligvaror
240;Butik;2284;Butikssäljare/Medarbetare, dagligvaror
264;Livsmedel;2284;Butikssäljare/Medarbetare, dagligvaror
308;Pressbyrån;2284;Butikssäljare/Medarbetare, dagligvaror
60;Butiksäljare;2284;Butikssäljare/Medarbetare, dagligvaror
61;Butiksmedarbetare;2284;Butikssäljare/Medarbetare, dagligvaror
65;ICA;2284;Butikssäljare/Medarbetare, dagligvaror
66;Coop;2284;Butikssäljare/Medarbetare, dagligvaror
67;Lidl;2284;Butikssäljare/Medarbetare, dagligvaror
68;Willys;2284;Butikssäljare/Medarbetare, dagligvaror
33;Lastbilschaffis;6687;Bygg- och anläggningsförare
36;Lastbilsförare;6687;Bygg- och anläggningsförare
38;Lastbil;6687;Bygg- och anläggningsförare
70;Byggingenjör;4179;Byggnadsingenjör
70;Byggingenjör;6645;Byggnadskonstruktör
230;Plåtslagare;5972;Byggnadsplåtslagare
71;Byggsmed;2615;Byggnadssmed
72;Städa;449;Byggstädare
4;Säljare;2282;Båtförsäljare
41;Sälj;2282;Båtförsäljare
73;Båtsäljare;2282;Båtförsäljare
51;Fartyg;4047;Båtman, Sjöfartsverket
53;Skeppare;4047;Båtman, Sjöfartsverket
54;Sjökapten;4047;Båtman, Sjöfartsverket
2;Sjöman;4086;Båtsman/Bås
51;Fartyg;4086;Båtsman/Bås
51;Fartyg;786;Båtvärdinna
198;Verktygsarbetare;2629;Bänkarbetare
51;Fartyg;463;Cabin stewardess/Hyttvärdinna
72;Städa;463;Cabin stewardess/Hyttvärdinna
203;Städerska;463;Cabin stewardess/Hyttvärdinna
4;Säljare;2285;Charkuteriarbetare, butik
58;Butiksbiträde;2285;Charkuteriarbetare, butik
59;Affärsbiträde;2285;Charkuteriarbetare, butik
60;Butiksäljare;2285;Charkuteriarbetare, butik
61;Butiksmedarbetare;2285;Charkuteriarbetare, butik
264;Livsmedel;2285;Charkuteriarbetare, butik
65;ICA;2285;Charkuteriarbetare, butik
66;Coop;2285;Charkuteriarbetare, butik
67;Lidl;2285;Charkuteriarbetare, butik
68;Willys;2285;Charkuteriarbetare, butik
69;Willy's;2285;Charkuteriarbetare, butik
240;Butik;2285;Charkuteriarbetare, butik
264;Livsmedel;7592;Charkuteriarbetare, slakteri
264;Livsmedel;5502;Charkuterist
4;Säljare;688;Charterresesäljare
270;Turism;688;Charterresesäljare
254;Kock;217;Chefskock
8;Sjuksyster;1451;Chefssjuksköterska
6;Jurist;3145;Chefsåklagare
7;Juridik;3145;Chefsåklagare
74;IT chef;5425;CIO, Chief Information Officer/IT-chef
75;Kursledare;6106;Cirkelledare/Studiecirkelledare
260;Studieförbund;6106;Cirkelledare/Studiecirkelledare
261;ABF;6106;Cirkelledare/Studiecirkelledare
10;Life science;7106;Civilingenjör, bioteknik
70;Byggingenjör;6494;Civilingenjör, byggnadskonstruktion
10;Life science;6804;Civilingenjör, forskning/utveckling, kemi
16;Järnväg;7268;Civilingenjör, järnväg
10;Life science;6894;Civilingenjör, kemi
76;Lantmäteri;6502;Civilingenjör, lantmäteri
268;Verksamhetsutvecklare;4720;Civilingenjör, organisationsutveckling
251;CNC;7614;CNC-operatör, trä
199;Verktygsoperatör;6004;CNC-operatör/FMS-operatör
251;CNC;6004;CNC-operatör/FMS-operatör
5;Redovisningscontroller;6318;Controller
22;Verksamhetscontroller;6318;Controller
239;Bud;3470;Cykelbud
96;Frissa;240;Damfrisör
229;Damfrisörska;240;Damfrisör
228;Danslärare;6099;Danspedagog
112;Inredare;6152;Dekoratör
113;Inredning;6152;Dekoratör
299;Dekoratör, inredning;6152;Dekoratör
263;Teater;3853;Dekormålare
232;Inkasso;5890;Delgivningsman
115;Demonterare;2351;Demonteringsarbetare/Rivningsarbetare
114;Sopstationsarbetare;6006;Demontör/Återvinningsarbetare
115;Demonterare;6006;Demontör/Återvinningsarbetare
116;Avfall;6006;Demontör/Återvinningsarbetare
275;Statsvetenskap;1890;Departementssekreterare
114;Sopstationsarbetare;6723;Deponiarbetare
115;Demonterare;6723;Deponiarbetare
116;Avfall;6723;Deponiarbetare
15;Tåg;733;Depåförare, spårburen trafik
245;Lager;5284;Depåman/Depåtekniker
292;Mode;7630;Designassistent
235;Möbler;3305;Designer
292;Mode;3305;Designer
13;Kyrkan;5808;Diakon
117;Diakonissa;5808;Diakon
305;Religion;5808;Diakon
119;Nutrition;1955;Dietetiker
88;Folkhälsa;5769;Dietist
94;Hälsoinspiratör;5769;Dietist
118;Kostrådgivare;5769;Dietist
119;Nutrition;5769;Dietist
267;Hälsa;5769;Dietist
274;Friskvård;5769;Dietist
281;Kost;5769;Dietist
283;Folkhälso;5769;Dietist
290;Hälso;5769;Dietist
254;Kock;218;Dietkock/Dietkokerska
175;Dessinatör;4386;Direktris/Garment technician/Mönsterkonstruktör
292;Mode;4386;Direktris/Garment technician/Mönsterkonstruktör
120;DJ;6792;Discjockey
272;Hotell;5556;Diskare
286;Restauran;5556;Diskare
300;Restaurang;5556;Diskare
33;Lastbilschaffis;534;Distributionsförare
36;Lastbilsförare;534;Distributionsförare
37;Chaufför;534;Distributionsförare
38;Lastbil;534;Distributionsförare
121;Chaffis;534;Distributionsförare
122;C-chaufför;534;Distributionsförare
262;Training;3485;Distriktsinstruktör/Distriktstränare
273;Träning;3485;Distriktsinstruktör/Distriktstränare
75;Kursledare;3647;Distriktsstudieledare
6;Jurist;3146;Distriktsåklagare
7;Juridik;3146;Distriktsåklagare
246;Djur;1848;Djurhälsoveterinär
123;Djursjukvårdare;5768;Djursjukskötare
246;Djur;5768;Djursjukskötare
246;Djur;1914;Djurskyddsinspektör
124;Zoo;6285;Djurskötare, djurpark
246;Djur;6285;Djurskötare, djurpark
246;Djur;6279;Djurskötare, djuruppfödning
246;Djur;6282;Djurskötare, fjäderfä
246;Djur;6433;Djurskötare, får
246;Djur;6427;Djurskötare, gris
125;Häst;6281;Djurskötare, häst
246;Djur;6281;Djurskötare, häst
246;Djur;7460;Djurskötare, mjölk
33;Lastbilschaffis;6694;Djurtransportförare
36;Lastbilsförare;6694;Djurtransportförare
38;Lastbil;6694;Djurtransportförare
246;Djur;6694;Djurtransportförare
246;Djur;7580;Djurvårdare
6;Jurist;6030;Domare
7;Juridik;6030;Domare
305;Religion;2112;Domprost
6;Jurist;3120;Domstolsjurist
7;Juridik;3120;Domstolsjurist
7;Juridik;7401;Domstolssekreterare
74;IT chef;5434;Driftchef, data
277;Ekonomi;6024;Ekonomiassistent
51;Fartyg;237;Ekonomibiträde, fartyg
126;CFO;6367;Ekonomichef
127;Chief financial officer;6367;Ekonomichef
285;Ekonomiansvarig;6367;Ekonomichef
126;CFO;5071;Ekonomidirektör/Finanschef
127;Chief financial officer;5071;Ekonomidirektör/Finanschef
285;Ekonomiansvarig;5071;Ekonomidirektör/Finanschef
277;Ekonomi;4721;Ekonomikonsult
277;Ekonomi;3072;Ekonomikontorist
218;Sanerare;6724;Elektroniksanerare
128;Särskola;5718;Elevassistent
2;Sjöman;5365;Elingenjör, fartyg/Fartygseltekniker
51;Fartyg;5365;Elingenjör, fartyg/Fartygseltekniker
16;Järnväg;7564;Eltekniker, järnväg/Kontaktledningsmontör
2;Sjöman;4048;Endestyrman
51;Fartyg;4048;Endestyrman
53;Skeppare;4048;Endestyrman
54;Sjökapten;4048;Endestyrman
110;Samhällsvetare;7504;EU-handläggare
275;Statsvetenskap;7504;EU-handläggare
297;Samhällsvetenskap;7504;EU-handläggare
13;Kyrkan;2123;Evangelist, resepastor
305;Religion;2123;Evangelist, resepastor
4;Säljare;7535;Eventsäljare/Eventförsäljare
57;Securitas;4131;Expeditionsvakt
76;Lantmäteri;181;Exploateringsingenjör
6;Jurist;6251;Familjerättsjurist
7;Juridik;6251;Familjerättsjurist
10;Life science;1597;Farmaceut/Apotekare
77;Sjukhusapotekare;1597;Farmaceut/Apotekare
78;Farmacevt;1597;Farmaceut/Apotekare
78;Farmacevt;6437;Farmaceut/Receptarie
2;Sjöman;6194;Fartygsbefäl
51;Fartyg;6194;Fartygsbefäl
53;Skeppare;6194;Fartygsbefäl
54;Sjökapten;6194;Fartygsbefäl
51;Fartyg;5618;Fartygselektriker
51;Fartyg;5591;Fartygsinspektör
51;Fartyg;207;Fartygsintendent
51;Fartyg;2758;Fartygsklarerare
51;Fartyg;132;Fartygskonstruktör
51;Fartyg;2837;Fartygsplåtslagare
230;Plåtslagare;2837;Fartygsplåtslagare
51;Fartyg;4095;Fartygsreparatör
51;Fartyg;451;Fartygsstädare
72;Städa;451;Fartygsstädare
203;Städerska;451;Fartygsstädare
277;Ekonomi;419;Fastighetsekonom
285;Ekonomiansvarig;419;Fastighetsekonom
6;Jurist;4005;Fastighetsjurist
7;Juridik;4005;Fastighetsjurist
79;Mäklarassistent;7000;Fastighetsmäklarassistent
72;Städa;452;Fastighetsstädare
203;Städerska;452;Fastighetsstädare
22;Verksamhetscontroller;6532;Financial controller
277;Ekonomi;5669;Finansekonom
285;Ekonomiansvarig;5669;Finansekonom
6;Jurist;3121;Fiskal
270;Turism;699;Fiskeguide
291;Besöksnäring;699;Fiskeguide
53;Skeppare;2380;Fiskeskeppare
33;Lastbilschaffis;6704;Fjärrbilsförare
34;Långtradarchaufför;6704;Fjärrbilsförare
35;Långtradarchaffis;6704;Fjärrbilsförare
36;Lastbilsförare;6704;Fjärrbilsförare
38;Lastbil;6704;Fjärrbilsförare
15;Tåg;7013;Fjärrtågklarerare
16;Järnväg;7013;Fjärrtågklarerare
81;Blomsterbindare;5863;Florist
82;Blommor;5863;Florist
83;Rampmedarbetare;5277;Flygplanslastare
302;Menzies;5277;Flygplanslastare
230;Plåtslagare;7559;Flygplansplåtslagare
83;Rampmedarbetare;6587;Flygplatsman/Ramppersonal
302;Menzies;6587;Flygplatsman/Ramppersonal
84;Cabin attendant;782;Flygvärd/Flygvärdinna/Flygsteward
85;Cabin crew;782;Flygvärd/Flygvärdinna/Flygsteward
86;Kabinpersonal;782;Flygvärd/Flygvärdinna/Flygsteward
280;Ensamkommande;7120;Flyktingassistent
298;Migrationsverket;7120;Flyktingassistent
306;Flykting;7120;Flyktingassistent
280;Ensamkommande;2059;Flyktingsamordnare/Flyktingkonsulent
298;Migrationsverket;2059;Flyktingsamordnare/Flyktingkonsulent
306;Flykting;2059;Flyktingsamordnare/Flyktingkonsulent
87;Flyttkille;5278;Flyttkarl/Stadsbud
88;Folkhälsa;6681;Folkhälsoplanerare
267;Hälsa;6681;Folkhälsoplanerare
283;Folkhälso;6681;Folkhälsoplanerare
290;Hälso;6681;Folkhälsoplanerare
88;Folkhälsa;6796;Folkhälsosekreterare
267;Hälsa;6796;Folkhälsosekreterare
283;Folkhälso;6796;Folkhälsosekreterare
290;Hälso;6796;Folkhälsosekreterare
88;Folkhälsa;6682;Folkhälsoutvecklare
267;Hälsa;6682;Folkhälsoutvecklare
283;Folkhälso;6682;Folkhälsoutvecklare
290;Hälso;6682;Folkhälsoutvecklare
89;Folkhögskola;6184;Folkhögskolelärare
90;Teacher;6184;Folkhögskolelärare
162;Lärare svenska;6184;Folkhögskolelärare
164;Lärare historia;6184;Folkhögskolelärare
91;Billackerare;5316;Fordonslackerare
287;Bil;5316;Fordonslackerare
287;Bil;5508;Fordonsmontör
287;Bil;600;Fordonstekniker/Bilmekaniker/Personbilsmekaniker
10;Life science;7407;Forskningsingenjör, kemi
10;Life science;319;Forskningslaborant, kemi
92;Fotvårdare;253;Fotterapeut/Fotvårdsspecialist
94;Hälsoinspiratör;5726;Friskvårdskonsult
95;Friskvårdskonsulent;5726;Friskvårdskonsult
267;Hälsa;5726;Friskvårdskonsult
274;Friskvård;5726;Friskvårdskonsult
290;Hälso;5726;Friskvårdskonsult
307;Fitness;5726;Friskvårdskonsult
94;Hälsoinspiratör;1584;Friskvårdsledare
267;Hälsa;1584;Friskvårdsledare
274;Friskvård;1584;Friskvårdsledare
290;Hälso;1584;Friskvårdsledare
307;Fitness;1584;Friskvårdsledare
96;Frissa;5491;Frisör
96;Frissa;7574;Frisöraspirant
13;Kyrkan;1779;Fritidsledare/Ungdomsledare, församling
97;Kriminalvård;1972;Frivårdshandläggare
137;Kriminalvården;1972;Frivårdshandläggare
97;Kriminalvård;5789;Frivårdsinspektör
137;Kriminalvården;5789;Frivårdsinspektör
272;Hotell;474;Frukostvärd/Frukostvärdinna
264;Livsmedel;1008;Färdigmatlagare
98;Färdtjänstbusschaufför;530;Färdtjänstbussförare
99;Färdtjänstchaufför;531;Färdtjänstförare
6;Jurist;4431;Förbundsjurist
7;Juridik;4431;Förbundsjurist
262;Training;3490;Förbundstränare
273;Träning;3490;Förbundstränare
6;Jurist;7424;Föredragande/Beredningsjurist
7;Juridik;7424;Föredragande/Beredningsjurist
6;Jurist;4006;Företagsjurist
7;Juridik;4006;Företagsjurist
100;Personalvetare;4722;Företagskonsulent
47;Beteendevetare;4723;Företagskonsult
48;Beteendevetenskap;4723;Företagskonsult
100;Personalvetare;4723;Företagskonsult
12;Psykologi;1469;Företagspsykolog
8;Sjuksyster;7277;Företagssjuksköterska/Företagssköterska
130;Skribent;6158;Författare
13;Kyrkan;6747;Församlingsdiakon
117;Diakonissa;6747;Församlingsdiakon
305;Religion;6747;Församlingsdiakon
13;Kyrkan;2125;Församlingsföreståndare, frikyrka
13;Kyrkan;5753;Församlingspedagog
13;Kyrkan;6798;Församlingspräst med specialuppgifter
305;Religion;6798;Församlingspräst med specialuppgifter
265;Försäkringskassan;5570;Försäkringshandläggare, försäkringskassa
6;Jurist;3990;Försäkringsjurist
7;Juridik;3990;Försäkringsjurist
4;Säljare;2555;Försäkringsrådgivare/Försäkringssäljare
110;Samhällsvetare;578;Försäkringsutredare, försäkringskassa
265;Försäkringskassan;578;Försäkringsutredare, försäkringskassa
297;Samhällsvetenskap;578;Försäkringsutredare, försäkringskassa
246;Djur;6343;Försöksdjurskötare/Försöksdjurstekniker
277;Ekonomi;422;Förvaltningsekonom
285;Ekonomiansvarig;422;Förvaltningsekonom
6;Jurist;6179;Förvaltningsjurist
7;Juridik;6179;Förvaltningsjurist
102;Tamburvaktmästare;6012;Garderobiär/Garderobvaktmästare
247;Vaktmästare;6012;Garderobiär/Garderobvaktmästare
242;Svetsare;2727;Gassvetsare
252;Svets;2727;Gassvetsare
76;Lantmäteri;5477;Geodet
245;Lager;2223;Godsmottagare
288;Golf;4570;Golfbanearbetare
288;Golf;387;Golfbaneföreståndare
288;Golf;7643;Golfinstruktör/Golftränare
288;Golf;4571;Greenkeeper
82;Blommor;4572;Griftegårdsarbetare/Kyrkogårdsarbetare
254;Kock;225;Grillkock, snabbmat
115;Demonterare;5874;Grovarbetare, bygg och anläggning
230;Plåtslagare;5976;Grovplåtslagare
12;Psykologi;1477;Gruppterapeut
103;Grävmaskinist;7216;Grävlastarförare, anläggning
103;Grävmaskinist;507;Grävmaskinförare
103;Grävmaskinist;6963;Grävmaskinförare, skogsbruk
270;Turism;5594;Guide
291;Besöksnäring;5594;Guide
297;Samhällsvetenskap;5776;Handläggare/Utredare, offentlig förvaltning
110;Samhällsvetare;5776;Handläggare/Utredare, offentlig förvaltning
275;Statsvetenskap;5776;Handläggare/Utredare, offentlig förvaltning
295;Arbetsförmedlingen;5776;Handläggare/Utredare, offentlig förvaltning
4;Säljare;3727;Hemförsäljare
72;Städa;443;Hemhjälp
104;Hemtjänst;1457;Hemsjukvårdare
104;Hemtjänst;1494;Hemterapeut
104;Hemtjänst;5713;Hemtjänstassistent
104;Hemtjänst;5799;Hemvårdare
104;Hemtjänst;1509;Hemvårdsassistent
96;Frissa;241;Herrfrisör
105;Herrfrisörska;241;Herrfrisör
231;Hjullastare;7646;Hjullastarförare, godshantering
272;Hotell;213;Hotellhusfru
291;Besöksnäring;213;Hotellhusfru
243;Receptionist;5596;Hotellreceptionist
257;Reception;5596;Hotellreceptionist
270;Turism;5596;Hotellreceptionist
272;Hotell;5596;Hotellreceptionist
291;Besöksnäring;5596;Hotellreceptionist
72;Städa;455;Hotellstädare
80;Lokalvård;455;Hotellstädare
203;Städerska;455;Hotellstädare
270;Turism;455;Hotellstädare
272;Hotell;455;Hotellstädare
291;Besöksnäring;455;Hotellstädare
247;Vaktmästare;4133;Hotellvaktmästare/Piccolo
270;Turism;4133;Hotellvaktmästare/Piccolo
272;Hotell;4133;Hotellvaktmästare/Piccolo
291;Besöksnäring;4133;Hotellvaktmästare/Piccolo
272;Hotell;710;Hotellvärd/Hotellvärdinna
291;Besöksnäring;710;Hotellvärd/Hotellvärdinna
216;Matsalspersonal;5486;Hovmästare
286;Restauran;5486;Hovmästare
300;Restaurang;5486;Hovmästare
6;Jurist;3124;Hovrättsassessor
7;Juridik;3124;Hovrättsassessor
6;Jurist;3126;Hovrättslagman
7;Juridik;3126;Hovrättslagman
6;Jurist;4945;Hovrättspresident
7;Juridik;4945;Hovrättspresident
6;Jurist;6519;Hovrättsråd
7;Juridik;6519;Hovrättsråd
125;Häst;5928;Hovslagare
249;HR;7095;HR-assistent
294;Personal;7095;HR-assistent
47;Beteendevetare;6872;HR-konsult/PA-konsult
48;Beteendevetenskap;6872;HR-konsult/PA-konsult
100;Personalvetare;6872;HR-konsult/PA-konsult
249;HR;6872;HR-konsult/PA-konsult
294;Personal;6872;HR-konsult/PA-konsult
47;Beteendevetare;6873;HR-specialist/HR-adviser
48;Beteendevetenskap;6873;HR-specialist/HR-adviser
100;Personalvetare;6873;HR-specialist/HR-adviser
249;HR;6873;HR-specialist/HR-adviser
294;Personal;6873;HR-specialist/HR-adviser
106;Kosmetolog;5494;Hudterapeut
107;Hudvård;5494;Hudterapeut
207;Spaterapeut;5494;Hudterapeut
208;Spa;5494;Hudterapeut
244;Hund;4619;Hunddressör
246;Djur;4619;Hunddressör
57;Securitas;6765;Hundförare
244;Hund;6765;Hundförare
246;Djur;6765;Hundförare
244;Hund;4620;Hundgårdsförman
246;Djur;4620;Hundgårdsförman
244;Hund;1860;Hundpsykolog
246;Djur;1860;Hundpsykolog
108;Hunddagis;6286;Hundskötare/Hundvårdare
244;Hund;6286;Hundskötare/Hundvårdare
246;Djur;6286;Hundskötare/Hundvårdare
244;Hund;4621;Hundtrimmare
246;Djur;4621;Hundtrimmare
244;Hund;4622;Hunduppfödare
246;Djur;4622;Hunduppfödare
246;Djur;4495;Husdjursrådgivare/Husdjurskonsulent
109;Seminör;6283;Husdjurstekniker
246;Djur;6283;Husdjurstekniker
4;Säljare;2283;Husvagnsförsäljare
41;Sälj;2283;Husvagnsförsäljare
16;Järnväg;7480;Huvudtillsyningsman, järnväg
8;Sjuksyster;7344;Hygiensjuksköterska
277;Ekonomi;423;Hälsoekonom
94;Hälsoinspiratör;6699;Hälsoinformatör
267;Hälsa;6699;Hälsoinformatör
274;Friskvård;6699;Hälsoinformatör
290;Hälso;6699;Hälsoinformatör
94;Hälsoinspiratör;6700;Hälsopedagog
267;Hälsa;6700;Hälsopedagog
274;Friskvård;6700;Hälsopedagog
290;Hälso;6700;Hälsopedagog
250;Idrott;6667;Idrottsdomare
271;Sport;6667;Idrottsdomare
88;Folkhälsa;3494;Idrottsinstruktör/Idrottstränare
94;Hälsoinspiratör;3494;Idrottsinstruktör/Idrottstränare
227;Gym;3494;Idrottsinstruktör/Idrottstränare
233;Hockey;3494;Idrottsinstruktör/Idrottstränare
250;Idrott;3494;Idrottsinstruktör/Idrottstränare
262;Training;3494;Idrottsinstruktör/Idrottstränare
267;Hälsa;3494;Idrottsinstruktör/Idrottstränare
271;Sport;3494;Idrottsinstruktör/Idrottstränare
273;Träning;3494;Idrottsinstruktör/Idrottstränare
274;Friskvård;3494;Idrottsinstruktör/Idrottstränare
283;Folkhälso;3494;Idrottsinstruktör/Idrottstränare
290;Hälso;3494;Idrottsinstruktör/Idrottstränare
250;Idrott;6083;Idrottskonsulent
271;Sport;6083;Idrottskonsulent
250;Idrott;3496;Idrottspedagog
271;Sport;3496;Idrottspedagog
247;Vaktmästare;6294;Idrottsplatsvaktmästare/Idrottsplatsarbetare
305;Religion;2134;Imam
6;Jurist;6180;Immaterialrättsjurist
7;Juridik;6180;Immaterialrättsjurist
12;Psykologi;1478;Individualterapeut
230;Plåtslagare;5971;Industriplåtslagare
218;Sanerare;6725;Industrisanerare
72;Städa;458;Industristädare
110;Samhällsvetare;3883;Informationskonsult
297;Samhällsvetenskap;3883;Informationskonsult
110;Samhällsvetare;3885;Informationssekreterare
297;Samhällsvetenskap;3885;Informationssekreterare
110;Samhällsvetare;6846;Informationsspecialist
297;Samhällsvetenskap;6846;Informationsspecialist
110;Samhällsvetare;6159;Informatör/Kommunikatör
275;Statsvetenskap;6159;Informatör/Kommunikatör
297;Samhällsvetenskap;6159;Informatör/Kommunikatör
232;Inkasso;2402;Inkasserare
232;Inkasso;5891;Inkassohandläggare
111;Upphandling;5915;Inköpare
111;Upphandling;4909;Inköpsassistent
111;Upphandling;4910;Inköpskontorist
111;Upphandling;2546;Inköpsledare
111;Upphandling;4911;Inköpssekreterare
111;Upphandling;2548;Inköpstekniker
4;Säljare;2603;Innesäljare
112;Inredare;5449;Inredningsarkitekt
113;Inredning;5449;Inredningsarkitekt
112;Inredare;25;Inredningsdesigner
113;Inredning;25;Inredningsdesigner
113;Inredning;5812;Inredningssnickare/Specialsnickare
136;Polisen;3465;Inspektör, Polisen
15;Tåg;431;Instruktionsförare
16;Järnväg;431;Instruktionsförare
233;Hockey;7596;Instruktör/Tränare inom specialidrott
250;Idrott;7596;Instruktör/Tränare inom specialidrott
51;Fartyg;6527;Intendenturpersonal, sjöfart
8;Sjuksyster;1813;Intensivvårdssjuksköterska
4;Säljare;2598;Internationell säljare
129;Exportsäljare;2598;Internationell säljare
230;Plåtslagare;7264;Isoleringsplåtslagare
6;Jurist;4423;IT-jurist
7;Juridik;4423;IT-jurist
125;Häst;3916;Jockey
130;Skribent;6056;Journalist/Reporter
2;Sjöman;4088;Jungman
51;Fartyg;4088;Jungman
7;Juridik;4424;Juridisk ombudsman
6;Jurist;6520;Jurist, allmän domstol
7;Juridik;6520;Jurist, allmän domstol
6;Jurist;3129;Jurist, förvaltningsdomstol
7;Juridik;3129;Jurist, förvaltningsdomstol
6;Jurist;3130;Jurist, specialdomstol
7;Juridik;3130;Jurist, specialdomstol
7;Juridik;7463;Juristassistent/Paralegal
16;Järnväg;7488;Järnvägsingenjör
85;Cabin crew;783;Kabinchef/Purser
86;Kabinpersonal;783;Kabinchef/Purser
17;Kaffe;5850;Kaféföreståndare
286;Restauran;5485;Kallskänka
300;Restaurang;5485;Kallskänka
51;Fartyg;230;Kallskänka, fartyg
6;Jurist;3132;Kammarrättsassessor
7;Juridik;3132;Kammarrättsassessor
6;Jurist;3133;Kammarrättsfiskal
7;Juridik;3133;Kammarrättsfiskal
6;Jurist;3134;Kammarrättslagman
7;Juridik;3134;Kammarrättslagman
6;Jurist;4950;Kammarrättspresident
7;Juridik;4950;Kammarrättspresident
6;Jurist;3135;Kammarrättsråd
7;Juridik;3135;Kammarrättsråd
6;Jurist;3148;Kammaråklagare
7;Juridik;3148;Kammaråklagare
6;Jurist;5168;Kanslijurist
7;Juridik;5168;Kanslijurist
13;Kyrkan;3362;Kantor
247;Vaktmästare;259;Kapellvaktmästare
305;Religion;2130;Kaplan
65;ICA;6658;Kassaledare, butik
66;Coop;6658;Kassaledare, butik
67;Lidl;6658;Kassaledare, butik
68;Willys;6658;Kassaledare, butik
69;Willy's;6658;Kassaledare, butik
61;Butiksmedarbetare;2155;Kassapersonal
65;ICA;2155;Kassapersonal
66;Coop;2155;Kassapersonal
67;Lidl;2155;Kassapersonal
68;Willys;2155;Kassapersonal
69;Willy's;2155;Kassapersonal
240;Butik;2155;Kassapersonal
301;Emporia;2155;Kassapersonal
308;Pressbyrån;2155;Kassapersonal
10;Life science;5764;Kemist
4;Säljare;6729;Key account manager
77;Sjukhusapotekare;6874;Klinikapotekare
10;Life science;6968;Klinisk farmakolog
12;Psykologi;1473;Klinisk psykolog
131;KBT;1473;Klinisk psykolog
218;Sanerare;4081;Klottersanerare
254;Kock;7663;Kock, à la carte
266;Sushi;7663;Kock, à la carte
270;Turism;7663;Kock, à la carte
272;Hotell;7663;Kock, à la carte
286;Restauran;7663;Kock, à la carte
291;Besöksnäring;7663;Kock, à la carte
300;Restaurang;7663;Kock, à la carte
51;Fartyg;5359;Kock, fartyg
254;Kock;5359;Kock, fartyg
254;Kock;7664;Kock, storhushåll
258;Sodexo;7664;Kock, storhushåll
254;Kock;5484;Kocksteward
305;Religion;2113;Komminister
136;Polisen;3466;Kommissarie, Polisen
110;Samhällsvetare;1892;Kommunhandläggare
297;Samhällsvetenskap;1892;Kommunhandläggare
275;Statsvetenskap;7626;Kommunikationsstrateg
6;Jurist;3994;Kommunjurist
7;Juridik;3994;Kommunjurist
275;Statsvetenskap;1893;Kommunsekreterare
22;Verksamhetscontroller;4851;Koncerncontroller
17;Kaffe;2276;Konditoribiträde
132;Cafebiträde;2276;Konditoribiträde
133;Kafébiträde;2276;Konditoribiträde
134;Café;2276;Konditoribiträde
143;Kursgårdschef;708;Konferenschef
272;Hotell;4134;Konferenstekniker
201;Översättning;3194;Konferenstolk
272;Hotell;712;Konferensvärd/Konferensvärdinna
269;Museum;7030;Konservator
135;Krokimodell;4856;Konstnärsmodell
13;Kyrkan;1782;Konsulent på stifts-/nationell nivå
243;Receptionist;721;Kontorsreceptionist
257;Reception;721;Kontorsreceptionist
72;Städa;459;Kontorsstädare
80;Lokalvård;459;Kontorsstädare
203;Städerska;459;Kontorsstädare
247;Vaktmästare;4136;Kontorsvaktmästare
13;Kyrkan;7515;Kontraktsadjunkt
305;Religion;7515;Kontraktsadjunkt
235;Möbler;2404;Korgmöbelmakare
281;Kost;6813;Kostekonom
281;Kost;1865;Kostkonsulent
263;Teater;3911;Kostymassistent
263;Teater;6169;Kostymmästare
292;Mode;6151;Kostymtecknare
263;Teater;3912;Kostymör
33;Lastbilschaffis;6688;Kranbilsförare
36;Lastbilsförare;6688;Kranbilsförare
38;Lastbil;6688;Kranbilsförare
224;Banktjänsteman;2738;Kreditberedare
279;Bank;2738;Kreditberedare
224;Banktjänsteman;2739;Kreditbevakare
279;Bank;2739;Kreditbevakare
285;Ekonomiansvarig;2740;Kreditchef
224;Banktjänsteman;5948;Kredithandläggare
279;Bank;5948;Kredithandläggare
224;Banktjänsteman;2741;Kreditman
279;Bank;2741;Kreditman
224;Banktjänsteman;2742;Kreditrådgivare
279;Bank;2742;Kreditrådgivare
247;Vaktmästare;263;Krematorievaktmästare
97;Kriminalvård;2503;Kriminalvårdare
137;Kriminalvården;2503;Kriminalvårdare
232;Inkasso;2399;Kronoassistent
6;Jurist;6072;Kronofogde
7;Juridik;6072;Kronofogde
232;Inkasso;6072;Kronofogde
232;Inkasso;5889;Kronoinspektör
138;Servicerådgivare;5572;Kundmottagare/Verkmästare, bilverkstad
139;Kundservicemedarbetare;5918;Kundtjänsteman, försäkring
140;Kundcentermedarbetare;5918;Kundtjänsteman, försäkring
142;Callcentermedarbetare;5918;Kundtjänsteman, försäkring
139;Kundservicemedarbetare;2291;Kundtjänstmedarbetare
140;Kundcentermedarbetare;2291;Kundtjänstmedarbetare
141;Kundkommunikatör;2291;Kundtjänstmedarbetare
142;Callcentermedarbetare;2291;Kundtjänstmedarbetare
234;Kundservice;2291;Kundtjänstmedarbetare
143;Kursgårdschef;212;Kursgårdsföreståndare
264;Livsmedel;5537;Kvalitetsbedömare, livsmedel
10;Life science;4292;Kvalitetsingenjör/-tekniker, kemiteknik
13;Kyrkan;2393;Kyrkvaktmästare
247;Vaktmästare;2393;Kyrkvaktmästare
144;Food & Beverage Manager;395;Källarmästare
145;Food and Beverage Manager;395;Källarmästare
218;Sanerare;6726;Kärnkraftsanerare
42;Måltidsbiträde;483;Köksbiträde
258;Sodexo;483;Köksbiträde
286;Restauran;483;Köksbiträde
10;Life science;7644;Laborant, biologi
10;Life science;322;Laborant, kemi
10;Life science;5515;Laboratorieingenjör, kemi
182;Tandvård;3723;Laboratorietandtekniker
183;Dental;3723;Laboratorietandtekniker
146;Lagerpersonal;5842;Lagerarbetare
147;Lagermedarbetare;5842;Lagerarbetare
245;Lager;5842;Lagerarbetare
276;Truck;5842;Lagerarbetare
146;Lagerpersonal;2200;Lagerkontorist
147;Lagermedarbetare;2200;Lagerkontorist
245;Lager;2200;Lagerkontorist
146;Lagerpersonal;2243;Lagerplanerare
147;Lagermedarbetare;2243;Lagerplanerare
245;Lager;2243;Lagerplanerare
6;Jurist;3136;Lagman
6;Jurist;3995;Landstingsjurist
7;Juridik;3995;Landstingsjurist
26;Postiljon;2138;Lantbrevbärare
27;Posten;2138;Lantbrevbärare
148;Bonde;6287;Lantbrukare, blandad drift
148;Bonde;6277;Lantbrukare, djuruppfödning
246;Djur;6277;Lantbrukare, djuruppfödning
148;Bonde;6271;Lantbrukare, växtodling
277;Ekonomi;7354;Lantbruksekonom
76;Lantmäteri;5472;Lantmätare/Förrättningslantmätare
76;Lantmäteri;4477;Lantmäteridirektör
76;Lantmäteri;341;Lantmäteriingenjör
57;Securitas;5614;Larminstallatör/Larmtekniker
259;Brandlarm;5614;Larminstallatör/Larmtekniker
57;Securitas;6116;Larmoperatör
259;Brandlarm;6116;Larmoperatör
38;Lastbil;5578;Lastbilsmekaniker
149;Fältmekaniker;5578;Lastbilsmekaniker
150;Lastvagnsmekaniker;5578;Lastbilsmekaniker
4;Säljare;6751;Lastbilssäljare
38;Lastbil;6751;Lastbilssäljare
41;Sälj;6751;Lastbilssäljare
245;Lager;2201;Leveransbevakare
33;Lastbilschaffis;6690;Liftdumper- och lastväxlarförare
36;Lastbilsförare;6690;Liftdumper- och lastväxlarförare
38;Lastbil;6690;Liftdumper- och lastväxlarförare
25;B-chaufför;4339;Limousineförare
37;Chaufför;4339;Limousineförare
121;Chaffis;4339;Limousineförare
151;Limousinechaufför;4339;Limousineförare
287;Bil;4339;Limousineförare
264;Livsmedel;5442;Livsmedelsarbetare, mejeri
264;Livsmedel;4323;Livsmedelsingenjör
264;Livsmedel;6819;Livsmedelsinspektör
264;Livsmedel;6239;Livsmedelstekniker
263;Teater;6085;Ljudtekniker
263;Teater;6086;Ljussättare
263;Teater;6189;Ljustekniker
278;Språkpedagog;5721;Logoped
270;Turism;702;Lokalguide
291;Besöksnäring;702;Lokalguide
15;Tåg;5550;Lokförare/Förare av tåg
16;Järnväg;5550;Lokförare/Förare av tåg
152;Tågförare;5550;Lokförare/Förare av tåg
16;Järnväg;5620;Lokreparatör
2;Sjöman;5569;Lots, fartyg
51;Fartyg;5569;Lots, fartyg
53;Skeppare;5569;Lots, fartyg
54;Sjökapten;5569;Lots, fartyg
153;Underläkare;7239;Läkare
154;Vårdadministrativ sekreterare;5967;Läkarsekreterare/Vårdadmin/Medicinsk sekreterare
4;Säljare;2606;Läkemedelskonsulent
6;Jurist;5169;Länsassessor
7;Juridik;5169;Länsassessor
6;Jurist;7595;Länsjurist
7;Juridik;7595;Länsjurist
6;Jurist;5171;Länsrättsassessor
7;Juridik;5171;Länsrättsassessor
6;Jurist;3137;Länsrättsfiskal
6;Jurist;3138;Länsrättsnotarie
7;Juridik;3138;Länsrättsnotarie
6;Jurist;4953;Länsåklagare
7;Juridik;4953;Länsåklagare
1;Dagisfröken;5714;Lärare i förskola/Förskollärare
50;Dagis;5714;Lärare i förskola/Förskollärare
101;Förskola;5714;Lärare i förskola/Förskollärare
155;Förskolelärare;5714;Lärare i förskola/Förskollärare
282;Montessori;5714;Lärare i förskola/Förskollärare
1;Dagisfröken;7295;Lärare i förskoleklass
50;Dagis;7295;Lärare i förskoleklass
101;Förskola;7295;Lärare i förskoleklass
155;Förskolelärare;7295;Lärare i förskoleklass
282;Montessori;7295;Lärare i förskoleklass
90;Teacher;7652;Lärare i grundskolan, årskurs 1-3
165;Bildlärare;7652;Lärare i grundskolan, årskurs 1-3
282;Montessori;7652;Lärare i grundskolan, årskurs 1-3
289;Idrott och hälsa;7652;Lärare i grundskolan, årskurs 1-3
305;Religion;7652;Lärare i grundskolan, årskurs 1-3
159;Lärare i idrott;7652;Lärare i grundskolan, årskurs 1-3
160;Idrottslärare;7652;Lärare i grundskolan, årskurs 1-3
161;Idrott lärare;7652;Lärare i grundskolan, årskurs 1-3
162;Lärare svenska;7652;Lärare i grundskolan, årskurs 1-3
163;Idrott hälsa;7652;Lärare i grundskolan, årskurs 1-3
164;Lärare historia;7652;Lärare i grundskolan, årskurs 1-3
90;Teacher;7653;Lärare i grundskolan, årskurs 4-6
159;Lärare i idrott;7653;Lärare i grundskolan, årskurs 4-6
160;Idrottslärare;7653;Lärare i grundskolan, årskurs 4-6
161;Idrott lärare;7653;Lärare i grundskolan, årskurs 4-6
305;Religion;7653;Lärare i grundskolan, årskurs 4-6
162;Lärare svenska;7653;Lärare i grundskolan, årskurs 4-6
163;Idrott hälsa;7653;Lärare i grundskolan, årskurs 4-6
164;Lärare historia;7653;Lärare i grundskolan, årskurs 4-6
165;Bildlärare;7653;Lärare i grundskolan, årskurs 4-6
282;Montessori;7653;Lärare i grundskolan, årskurs 4-6
289;Idrott och hälsa;7653;Lärare i grundskolan, årskurs 4-6
305;Religion;7654;Lärare i grundskolan, årskurs 7-9
162;Lärare svenska;7654;Lärare i grundskolan, årskurs 7-9
163;Idrott hälsa;7654;Lärare i grundskolan, årskurs 7-9
164;Lärare historia;7654;Lärare i grundskolan, årskurs 7-9
165;Bildlärare;7654;Lärare i grundskolan, årskurs 7-9
282;Montessori;7654;Lärare i grundskolan, årskurs 7-9
289;Idrott och hälsa;7654;Lärare i grundskolan, årskurs 7-9
90;Teacher;7654;Lärare i grundskolan, årskurs 7-9
159;Lärare i idrott;7654;Lärare i grundskolan, årskurs 7-9
160;Idrottslärare;7654;Lärare i grundskolan, årskurs 7-9
161;Idrott lärare;7654;Lärare i grundskolan, årskurs 7-9
90;Teacher;7127;Lärare i gymnasiet
159;Lärare i idrott;7127;Lärare i gymnasiet
160;Idrottslärare;7127;Lärare i gymnasiet
161;Idrott lärare;7127;Lärare i gymnasiet
162;Lärare svenska;7127;Lärare i gymnasiet
163;Idrott hälsa;7127;Lärare i gymnasiet
164;Lärare historia;7127;Lärare i gymnasiet
165;Bildlärare;7127;Lärare i gymnasiet
166;Lärare ekonomi;7127;Lärare i gymnasiet
282;Montessori;7127;Lärare i gymnasiet
289;Idrott och hälsa;7127;Lärare i gymnasiet
305;Religion;7127;Lärare i gymnasiet
90;Teacher;7128;Lärare i gymnasiet - yrkesämnen
162;Lärare svenska;7128;Lärare i gymnasiet - yrkesämnen
167;Frisörlärare;7128;Lärare i gymnasiet - yrkesämnen
168;Yrkeslärare;7128;Lärare i gymnasiet - yrkesämnen
284;Lärare media;7128;Lärare i gymnasiet - yrkesämnen
90;Teacher;7164;Lärare i prakt./estet och annat ämne
159;Lärare i idrott;7164;Lärare i prakt./estet och annat ämne
160;Idrottslärare;7164;Lärare i prakt./estet och annat ämne
161;Idrott lärare;7164;Lärare i prakt./estet och annat ämne
163;Idrott hälsa;7164;Lärare i prakt./estet och annat ämne
164;Lärare historia;7164;Lärare i prakt./estet och annat ämne
165;Bildlärare;7164;Lärare i prakt./estet och annat ämne
166;Lärare ekonomi;7164;Lärare i prakt./estet och annat ämne
289;Idrott och hälsa;7164;Lärare i prakt./estet och annat ämne
305;Religion;7164;Lärare i prakt./estet och annat ämne
90;Teacher;7126;Lärare i praktiska och estetiska ämnen
165;Bildlärare;7126;Lärare i praktiska och estetiska ämnen
230;Plåtslagare;6923;Lärling, byggnadsplåtslagare
230;Plåtslagare;7266;Lärling, isoleringsplåtslagare
230;Plåtslagare;6924;Lärling, ventilationsplåtslagare
2;Sjöman;4089;Lättmatros
51;Fartyg;4089;Lättmatros
156;Makeupartist;7312;Make-up artist
157;Makeup;7312;Make-up artist
236;Kosmetik;7312;Make-up artist
110;Samhällsvetare;6758;Makroanalytiker
297;Samhällsvetenskap;6758;Makroanalytiker
177;Nagelspecialist;249;Manikyrist/Manikurist
292;Mode;2360;Mannekäng
76;Lantmäteri;183;Markförhandlare
110;Samhällsvetare;5548;Marknadsanalytiker
275;Statsvetenskap;5548;Marknadsanalytiker
297;Samhällsvetenskap;5548;Marknadsanalytiker
110;Samhällsvetare;5547;Marknadsförare
297;Samhällsvetenskap;5547;Marknadsförare
110;Samhällsvetare;406;Marknadskommunikatör
297;Samhällsvetenskap;406;Marknadskommunikatör
110;Samhällsvetare;407;Marknadskonsult
297;Samhällsvetenskap;407;Marknadskonsult
110;Samhällsvetare;408;Marknadskoordinator
297;Samhällsvetenskap;408;Marknadskoordinator
8;Sjuksyster;7274;MAS, medicinskt ansvarig sjuksköterska
2;Sjöman;5590;Maskinbefäl, fartyg
51;Fartyg;5590;Maskinbefäl, fartyg
158;Partibokbindare;6300;Maskinbokbindare/Bokbinderiarbetare
149;Fältmekaniker;6863;Maskinmekaniker/Skogsmaskinmekaniker
199;Verktygsoperatör;5305;Maskinoperatör, mekanisk verkstad
4;Säljare;6752;Maskinsäljare, entreprenad
41;Sälj;6752;Maskinsäljare, entreprenad
157;Makeup;5493;Maskör/Sminkör
236;Kosmetik;5493;Maskör/Sminkör
263;Teater;5493;Maskör/Sminkör
169;Massös;6308;Massör/Massageterapeut
2;Sjöman;6198;Matros
51;Fartyg;6198;Matros
2;Sjöman;7422;Matros, inre fart
51;Fartyg;7422;Matros, inre fart
4;Säljare;2607;Mediasäljare
141;Kundkommunikatör;7328;Medlemsvärvare, intresseorg./Telefonkommunikatör
142;Callcentermedarbetare;7328;Medlemsvärvare, intresseorg./Telefonkommunikatör
13;Kyrkan;2126;Metodistpastor
305;Religion;2126;Metodistpastor
10;Life science;4754;Mikrobiolog
116;Avfall;5986;Miljöarbetare/Renhållningsarbetare
170;Sopåkare;5986;Miljöarbetare/Renhållningsarbetare
172;Sopkörare;5986;Miljöarbetare/Renhållningsarbetare
173;Renhållning;5986;Miljöarbetare/Renhållningsarbetare
277;Ekonomi;427;Miljöekonom
6;Jurist;6182;Miljöjurist
7;Juridik;6182;Miljöjurist
10;Life science;6514;Miljökemist
292;Mode;6320;Modell
198;Verktygsarbetare;2631;Modellmakare, metall
90;Teacher;7314;Modersmålslärare i grundskolan
174;Hemspråkslärare;7314;Modersmålslärare i grundskolan
90;Teacher;7313;Modersmålslärare i gymnasiet
174;Hemspråkslärare;7313;Modersmålslärare i gymnasiet
90;Teacher;7163;Modersmålslärare/Modersmålspedagog
174;Hemspråkslärare;7163;Modersmålslärare/Modersmålspedagog
10;Life science;4755;Molekylärbiolog
88;Folkhälsa;3500;Motionskonsulent
267;Hälsa;3500;Motionskonsulent
274;Friskvård;3500;Motionskonsulent
283;Folkhälso;3500;Motionskonsulent
290;Hälso;3500;Motionskonsulent
239;Bud;3473;Motorcykelbud
2;Sjöman;4098;Motorelev, fartyg
51;Fartyg;4098;Motorelev, fartyg
2;Sjöman;6199;Motorman, fartyg
51;Fartyg;6199;Motorman, fartyg
269;Museum;6200;Museiassistent
269;Museum;2459;Museiintendent
269;Museum;3623;Museilektor
269;Museum;6101;Museipedagog/Museilärare
269;Museum;7567;Museitekniker
253;Piano;7083;Musiker, folkmusik
253;Piano;7202;Musiker, klassisk musik
253;Piano;6110;Musiker, populärmusik
253;Piano;3617;Musikpedagog/Musiklärare
51;Fartyg;5489;Mässman, fartyg
235;Möbler;2165;Möbellackerare
235;Möbler;303;Möbelmontör/Inredningsmontör
235;Möbler;4866;Möbelrenoverare/Möbelrestauratör
235;Möbler;6322;Möbelsnickare
175;Dessinatör;7499;Mönsterkonstruktionsassistent
292;Mode;7499;Mönsterkonstruktionsassistent
175;Dessinatör;4387;Mönsterritare, tyger
176;Nagelskulptör;5439;Nagelterapeut/Nagelteknolog
177;Nagelspecialist;5439;Nagelterapeut/Nagelteknolog
277;Ekonomi;6040;Nationalekonom
243;Receptionist;716;Nattreceptionist/Nattportier
257;Reception;716;Nattreceptionist/Nattportier
12;Psykologi;6851;Neuropsykolog
224;Banktjänsteman;2967;Notariatchef, bank
224;Banktjänsteman;2968;Notariattjänsteman, bank
279;Bank;2968;Notariattjänsteman, bank
118;Kostrådgivare;5785;Nutritionist/Näringsfysiolog
119;Nutrition;5785;Nutritionist/Näringsfysiolog
281;Kost;5785;Nutritionist/Näringsfysiolog
119;Nutrition;1956;Näringsforskare
119;Nutrition;1866;Näringskonsulent
119;Nutrition;7608;Näringsterapeut
178;Militär;5541;Officer
179;Yrkesmilitär;5541;Officer
180;Försvarsmakten;5541;Officer
218;Sanerare;4082;Oljesanerare
15;Tåg;5605;Ombordansvarig, tåg
16;Järnväg;5605;Ombordansvarig, tåg
192;Ombordservicepersonal;5605;Ombordansvarig, tåg
193;Ombordpersonal;5605;Ombordansvarig, tåg
110;Samhällsvetare;5775;Ombudsman
297;Samhällsvetenskap;5775;Ombudsman
8;Sjuksyster;7351;Onkologisjuksköterska
181;Sjuksköterska inom cancervård;7351;Onkologisjuksköterska
8;Sjuksyster;5781;Operationssjuksköterska
310;Implantat;5781;Operationssjuksköterska
57;Securitas;2482;Ordningsvakt
6;Jurist;5172;Organisationsjurist
7;Juridik;5172;Organisationsjurist
47;Beteendevetare;4731;Organisationskonsult
48;Beteendevetenskap;4731;Organisationskonsult
100;Personalvetare;4731;Organisationskonsult
110;Samhällsvetare;4731;Organisationskonsult
268;Verksamhetsutvecklare;4731;Organisationskonsult
297;Samhällsvetenskap;4731;Organisationskonsult
47;Beteendevetare;6302;Organisationsutvecklare
48;Beteendevetenskap;6302;Organisationsutvecklare
100;Personalvetare;6302;Organisationsutvecklare
110;Samhällsvetare;6302;Organisationsutvecklare
268;Verksamhetsutvecklare;6302;Organisationsutvecklare
297;Samhällsvetenskap;6302;Organisationsutvecklare
10;Life science;1840;Organisk kemist
13;Kyrkan;7516;Organist
182;Tandvård;7299;Ortodontiassistent
183;Dental;7299;Ortodontiassistent
8;Sjuksyster;7386;Ortoptist
25;B-chaufför;5418;Paketbilsförare
287;Bil;5418;Paketbilsförare
230;Plåtslagare;2843;Pannplåtslagare
82;Blommor;6717;Parkarbetare/Utemiljöarbetare/Miljövärd
13;Kyrkan;5824;Pastor, frikyrkoförsamling
305;Religion;5824;Pastor, frikyrkoförsamling
13;Kyrkan;2117;Pastorsadjunkt
305;Religion;2117;Pastorsadjunkt
6;Jurist;4002;Patentjurist
7;Juridik;4002;Patentjurist
92;Fotvårdare;254;Pedikyrist/Pedikurist
15;Tåg;5417;Pendeltågsförare/Motorvagnsförare
16;Järnväg;5417;Pendeltågsförare/Motorvagnsförare
152;Tågförare;5417;Pendeltågsförare/Motorvagnsförare
249;HR;5546;Personaladministratör/Personalassistent
294;Personal;5546;Personaladministratör/Personalassistent
100;Personalvetare;401;Personalansvarig
294;Personal;401;Personalansvarig
100;Personalvetare;6327;Personalchef/HR-chef
249;HR;6327;Personalchef/HR-chef
100;Personalvetare;4892;Personaldirektör
100;Personalvetare;4894;Personalintendent
249;HR;4894;Personalintendent
249;HR;2207;Personalkontorist
294;Personal;2207;Personalkontorist
249;HR;2208;Personalredogörare
294;Personal;2208;Personalredogörare
100;Personalvetare;6820;Personalsekreterare
249;HR;6820;Personalsekreterare
294;Personal;6820;Personalsekreterare
100;Personalvetare;6102;Personalutbildare
249;HR;6102;Personalutbildare
294;Personal;6102;Personalutbildare
100;Personalvetare;7680;Personalutvecklare
249;HR;7680;Personalutvecklare
294;Personal;7680;Personalutvecklare
287;Bil;6241;Personbilsförare, persontransporter
265;Försäkringskassan;582;Personlig handläggare, försäkringskassa
88;Folkhälsa;7283;Personlig tränare/PT
94;Hälsoinspiratör;7283;Personlig tränare/PT
283;Folkhälso;7283;Personlig tränare/PT
290;Hälso;7283;Personlig tränare/PT
303;SATS;7283;Personlig tränare/PT
307;Fitness;7283;Personlig tränare/PT
118;Kostrådgivare;7283;Personlig tränare/PT
227;Gym;7283;Personlig tränare/PT
262;Training;7283;Personlig tränare/PT
267;Hälsa;7283;Personlig tränare/PT
273;Träning;7283;Personlig tränare/PT
274;Friskvård;7283;Personlig tränare/PT
253;Piano;957;Pianobyggare
253;Piano;958;Pianostämmare
253;Piano;5635;Pianotekniker
226;Pizza bagare;5505;Pizzabagare
256;Pizza;5505;Pizzabagare
225;Stadsarkitekt;5;Planeringsarkitekt/Fysisk planerare
242;Svetsare;983;Plastsvetsare
252;Svets;983;Plastsvetsare
265;Försäkringskassan;5129;Platschef/Områdeschef, försäkringskassa
92;Fotvårdare;7430;Podiater/Podiatriker
136;Polisen;7639;Polisaspirant
136;Polisen;3464;Polisassistent
27;Posten;2141;Postterminalarbetare
146;Lagerpersonal;2141;Postterminalarbetare
147;Lagermedarbetare;2141;Postterminalarbetare
245;Lager;2141;Postterminalarbetare
223;Privatrådgivare;428;Privatekonom
224;Banktjänsteman;428;Privatekonom
277;Ekonomi;428;Privatekonom
279;Bank;428;Privatekonom
223;Privatrådgivare;6008;Privatekonomisk rådgivare
224;Banktjänsteman;6008;Privatekonomisk rådgivare
277;Ekonomi;6008;Privatekonomisk rådgivare
279;Bank;6008;Privatekonomisk rådgivare
110;Samhällsvetare;411;PR-konsult
297;Samhällsvetenskap;411;PR-konsult
10;Life science;1841;Processkemist
27;Posten;7551;Produktionsledare, Posten
233;Hockey;6170;Professionell idrottsutövare
250;Idrott;6170;Professionell idrottsutövare
271;Sport;6170;Professionell idrottsutövare
198;Verktygsarbetare;7679;Prototyptillverkare, metall
82;Blommor;6777;Prydnadsväxtodlare
305;Religion;5829;Präst, annat trossamfund
13;Kyrkan;5827;Präst, grekisk-ortodox kyrka
305;Religion;5827;Präst, grekisk-ortodox kyrka
13;Kyrkan;5826;Präst, romersk-katolsk kyrka
305;Religion;5826;Präst, romersk-katolsk kyrka
12;Psykologi;1479;Psykoanalytiker
131;KBT;1479;Psykoanalytiker
12;Psykologi;5709;Psykolog
19;BVC;5709;Psykolog
131;KBT;5709;Psykolog
12;Psykologi;5710;Psykoterapeut
131;KBT;5710;Psykoterapeut
12;Psykologi;7292;PTP-psykolog
131;KBT;7292;PTP-psykolog
255;PTP;7292;PTP-psykolog
242;Svetsare;2695;Punktsvetsare
252;Svets;2695;Punktsvetsare
246;Djur;6342;Pälsdjursskötare
246;Djur;4971;Pälsdjursuppfödare
305;Religion;5828;Rabbin
15;Tåg;7603;Radiolokförare
16;Järnväg;7603;Radiolokförare
152;Tågförare;7603;Radiolokförare
15;Tåg;7571;Radioloksoperatör
16;Järnväg;7571;Radioloksoperatör
243;Receptionist;5597;Receptionist, telefonist
257;Reception;5597;Receptionist, telefonist
285;Ekonomiansvarig;5078;Redovisningschef
277;Ekonomi;5989;Redovisningsekonom
263;Teater;6067;Regissör
47;Beteendevetare;1496;Rehabiliteringsassistent
48;Beteendevetenskap;1496;Rehabiliteringsassistent
222;Reklamare;4043;Reklamdesigner
309;Direktreklam;2675;Reklamdistributör/Reklamutdelare
222;Reklamare;414;Reklamkonsulent
222;Reklamare;415;Reklamman
100;Personalvetare;5404;Rekryterare/Rekryteringskonsult
33;Lastbilschaffis;6691;Renhållningsförare
36;Lastbilsförare;6691;Renhållningsförare
38;Lastbil;6691;Renhållningsförare
116;Avfall;6691;Renhållningsförare
122;C-chaufför;6691;Renhållningsförare
170;Sopåkare;6691;Renhållningsförare
171;Sopbilsförare;6691;Renhållningsförare
172;Sopkörare;6691;Renhållningsförare
173;Renhållning;6691;Renhållningsförare
173;Renhållning;524;Renhållningsmaskinförare
287;Bil;2280;Reservdelsspecialist/Bildelsspecialist
4;Säljare;5314;Resesäljare/Reseförsäljare/Resekonsulent
270;Turism;5314;Resesäljare/Reseförsäljare/Resekonsulent
42;Måltidsbiträde;5555;Restaurangbiträde
220;McDonalds;5555;Restaurangbiträde
221;McDonald's;5555;Restaurangbiträde
258;Sodexo;5555;Restaurangbiträde
286;Restauran;5555;Restaurangbiträde
300;Restaurang;5555;Restaurangbiträde
304;SUBWAY;5555;Restaurangbiträde
286;Restauran;5544;Restaurangchef
300;Restaurang;5544;Restaurangchef
219;Junior revisor;5988;Revisorsassistent
125;Häst;7642;Ridinstruktör/Ridlärare
6;Jurist;4957;Riksåklagare
7;Juridik;4957;Riksåklagare
242;Svetsare;2697;Robotsvetsare
252;Svets;2697;Robotsvetsare
270;Turism;703;Rundtursguide
291;Besöksnäring;703;Rundtursguide
6;Jurist;3139;Rådman
201;Översättning;3197;Rättstolk
8;Sjuksyster;5784;Röntgensjuksköterska
110;Samhällsvetare;3212;Samhällsekonom
277;Ekonomi;3212;Samhällsekonom
297;Samhällsvetenskap;3212;Samhällsekonom
110;Samhällsvetare;1905;Samhällsplanerare
297;Samhällsvetenskap;1905;Samhällsplanerare
4;Säljare;7536;Samplingspersonal
218;Sanerare;6197;Saneringsarbetare
263;Teater;6166;Scenmästare
263;Teater;6258;Scenograf
263;Teater;3903;Scentekniker
15;Tåg;7544;Servicetekniker, tåg
16;Järnväg;7544;Servicetekniker, tåg
215;Serveringspersonal;5487;Servitör/Servitris
216;Matsalspersonal;5487;Servitör/Servitris
217;Kypare;5487;Servitör/Servitris
270;Turism;5487;Servitör/Servitris
272;Hotell;5487;Servitör/Servitris
286;Restauran;5487;Servitör/Servitris
300;Restaurang;5487;Servitör/Servitris
51;Fartyg;235;Servitör/Servitris, fartyg
215;Serveringspersonal;235;Servitör/Servitris, fartyg
217;Kypare;235;Servitör/Servitris, fartyg
17;Kaffe;5490;Servitör/Servitris, kafé och konditori
132;Cafebiträde;5490;Servitör/Servitris, kafé och konditori
133;Kafébiträde;5490;Servitör/Servitris, kafé och konditori
134;Café;5490;Servitör/Servitris, kafé och konditori
215;Serveringspersonal;5490;Servitör/Servitris, kafé och konditori
90;Teacher;7382;SFI-lärare
13;Kyrkan;6748;Sjukhusdiakon
117;Diakonissa;6748;Sjukhusdiakon
305;Religion;6748;Sjukhusdiakon
13;Kyrkan;2118;Sjukhuspräst
305;Religion;2118;Sjukhuspräst
72;Städa;462;Sjukhusstädare
80;Lokalvård;462;Sjukhusstädare
203;Städerska;462;Sjukhusstädare
182;Tandvård;3724;Sjukhustandtekniker
183;Dental;3724;Sjukhustandtekniker
247;Vaktmästare;6766;Sjukhusvaktmästare
8;Sjuksyster;1823;Sjuksköterska, barnavårdscentral
19;BVC;1823;Sjuksköterska, barnavårdscentral
8;Sjuksyster;1954;Sjuksköterska, diagnostisk radiologi
8;Sjuksyster;7352;Sjuksköterska, geriatrisk vård
8;Sjuksyster;7296;Sjuksköterska, grundutbildad
8;Sjuksyster;5780;Sjuksköterska, medicin och kirurgi
8;Sjuksyster;5783;Sjuksköterska, psykiatrisk vård
8;Sjuksyster;7244;Sjuksköterska, äldreomsorg och -vård/geriatrik
9;Ambulansförare;1462;Sjuktransportör
238;Ambulans;1462;Sjuktransportör
201;Översättning;3198;Sjukvårdstolk
246;Djur;7562;Skadedjurstekniker
6;Jurist;6029;Skattejurist
7;Juridik;6029;Skattejurist
33;Lastbilschaffis;6693;Skogstransportförare
36;Lastbilsförare;6693;Skogstransportförare
38;Lastbil;6693;Skogstransportförare
212;Virkesbilsförare;6693;Skogstransportförare
213;Timmerbilsförare;6693;Skogstransportförare
214;Timmerbilschaufför;6693;Skogstransportförare
211;Skoladministratör;5840;Skolassistent
12;Psykologi;1474;Skolpsykolog
247;Vaktmästare;5886;Skolvaktmästare
263;Teater;6051;Skådespelare
210;Mentalskötare;7298;Skötare
124;Zoo;5046;Smådjursskötare
246;Djur;5046;Smådjursskötare
8;Sjuksyster;1874;Smärtsjuksköterska
47;Beteendevetare;5757;Socialsekreterare
48;Beteendevetenskap;5757;Socialsekreterare
97;Kriminalvård;7502;Socionom
137;Kriminalvården;7502;Socionom
97;Kriminalvård;1790;Socioterapeut
137;Kriminalvården;1790;Socioterapeut
2;Sjöman;7525;Soldat/Sjöman
178;Militär;7525;Soldat/Sjöman
179;Yrkesmilitär;7525;Soldat/Sjöman
180;Försvarsmakten;7525;Soldat/Sjöman
209;Vinkypare;236;Sommelier
216;Matsalspersonal;236;Sommelier
259;Brandlarm;5393;SOS-operatör
286;Restauran;224;Souschef
300;Restaurang;224;Souschef
106;Kosmetolog;6535;Spa- och kurterapeut
107;Hudvård;6535;Spa- och kurterapeut
207;Spaterapeut;6535;Spa- och kurterapeut
208;Spa;6535;Spa- och kurterapeut
19;BVC;7238;Specialistläkare
206;Överläkare;7238;Specialistläkare
178;Militär;7526;Specialistofficer
179;Yrkesmilitär;7526;Specialistofficer
180;Försvarsmakten;7526;Specialistofficer
182;Tandvård;1573;Specialisttandläkare
183;Dental;1573;Specialisttandläkare
310;Implantat;1573;Specialisttandläkare
254;Kock;5483;Specialkock
128;Särskola;7403;Speciallärare
282;Montessori;7403;Speciallärare
282;Montessori;6656;Specialpedagog
33;Lastbilschaffis;6689;Specialtransportförare
34;Långtradarchaufför;6689;Specialtransportförare
35;Långtradarchaffis;6689;Specialtransportförare
36;Lastbilsförare;6689;Specialtransportförare
38;Lastbil;6689;Specialtransportförare
247;Vaktmästare;4650;Sporthallsvaktmästare
242;Svetsare;2730;Spårsvetsare
252;Svets;2730;Spårsvetsare
6;Jurist;3996;Stadsadvokat
7;Juridik;3996;Stadsadvokat
6;Jurist;3997;Stadsjurist
7;Juridik;3997;Stadsjurist
6;Jurist;3999;Stadsombudsman
7;Juridik;4000;Stadssekreterare
114;Sopstationsarbetare;2888;Stationsarbetare
115;Demonterare;2888;Stationsarbetare
116;Avfall;2888;Stationsarbetare
57;Securitas;6574;Stationär väktare/Receptionsväktare
243;Receptionist;6574;Stationär väktare/Receptionsväktare
257;Reception;6574;Stationär väktare/Receptionsväktare
6;Jurist;3153;Statsåklagare
7;Juridik;3153;Statsåklagare
13;Kyrkan;2120;Stiftsadjunkt
305;Religion;2120;Stiftsadjunkt
13;Kyrkan;2070;Stiftsdiakon
117;Diakonissa;2070;Stiftsdiakon
305;Religion;2070;Stiftsdiakon
8;Sjuksyster;7346;Stomiterapeut
182;Tandvård;7300;ST-tandläkare
183;Dental;7300;ST-tandläkare
296;ST tandläkare;7300;ST-tandläkare
310;Implantat;7300;ST-tandläkare
204;SYO-konsulent;1253;Studie- och yrkesvägledare
205;SYO;1253;Studie- och yrkesvägledare
293;Studie och yrkesvägledare;1253;Studie- och yrkesvägledare
75;Kursledare;3651;Studieledare
204;SYO-konsulent;5675;Studievägledare
205;SYO;5675;Studievägledare
293;Studie och yrkesvägledare;5675;Studievägledare
157;Makeup;252;Stylist
236;Kosmetik;252;Stylist
72;Städa;464;Städare/Lokalvårdare
80;Lokalvård;464;Städare/Lokalvårdare
203;Städerska;464;Städare/Lokalvårdare
232;Inkasso;6551;Stämningsman
263;Teater;6259;Sufflör
38;Lastbil;6692;Sug- och spolbilsförare
173;Renhållning;6692;Sug- och spolbilsförare
14;Avlopp;6692;Sug- och spolbilsförare
33;Lastbilschaffis;6692;Sug- och spolbilsförare
36;Lastbilsförare;6692;Sug- och spolbilsförare
242;Svetsare;5945;Svetsare, manuell
252;Svets;5945;Svetsare, manuell
252;Svets;139;Svetsingenjör
242;Svetsare;2698;Svetsoperatör/Automatsvetsare
252;Svets;2698;Svetsoperatör/Automatsvetsare
4;Säljare;2601;Systemsäljare
194;Fältsäljare;2601;Systemsäljare
202;Teknisk säljare;2601;Systemsäljare
248;Sång;7201;Sångare, folkmusik
248;Sång;3346;Sångare, klassisk musik
248;Sång;6109;Sångare, populärmusik
248;Sång;6572;Sångpedagog
4;Säljare;2609;Säljkonsulent
235;Möbler;7620;Sömmerska, möbeltillverkning
278;Språkpedagog;7509;Talpedagog
182;Tandvård;5723;Tandhygienist
183;Dental;5723;Tandhygienist
182;Tandvård;5724;Tandläkare
183;Dental;5724;Tandläkare
310;Implantat;5724;Tandläkare
182;Tandvård;5722;Tandsköterska
183;Dental;5722;Tandsköterska
310;Implantat;5722;Tandsköterska
182;Tandvård;6121;Tandtekniker
183;Dental;6121;Tandtekniker
310;Implantat;6121;Tandtekniker
182;Tandvård;6360;Tandvårdsassistent
183;Dental;6360;Tandvårdsassistent
182;Tandvård;5058;Tandvårdsbiträde
183;Dental;5058;Tandvårdsbiträde
33;Lastbilschaffis;541;Tank- och bulkbilsförare
36;Lastbilsförare;541;Tank- och bulkbilsförare
38;Lastbil;541;Tank- och bulkbilsförare
37;Chaufför;6242;Taxiförare/Taxichaufför
99;Färdtjänstchaufför;6242;Taxiförare/Taxichaufför
121;Chaffis;6242;Taxiförare/Taxichaufför
184;Taxichaffis;6242;Taxiförare/Taxichaufför
185;Taxi;6242;Taxiförare/Taxichaufför
185;Taxi;704;Taxiguide
270;Turism;704;Taxiguide
291;Besöksnäring;704;Taxiguide
185;Taxi;886;Taxitelefonist
241;Teckenspråk;5184;Teckenspråkslärare
241;Teckenspråk;3199;Teckenspråkstolk/Dövblindtolk
2;Sjöman;5372;Teknisk chef/Maskinchef, fartyg
51;Fartyg;5372;Teknisk chef/Maskinchef, fartyg
4;Säljare;7468;Telefonförsäljare
276;Truck;7249;Teleskoptruckförare
146;Lagerpersonal;2233;Terminalarbetare
147;Lagermedarbetare;2233;Terminalarbetare
245;Lager;2233;Terminalarbetare
276;Truck;2233;Terminalarbetare
186;Tidningsutdelare;2673;Tidningsbud/Tidningsdistributör
309;Direktreklam;2673;Tidningsbud/Tidningsdistributör
235;Möbler;7618;Tillskärare, möbeltillverkning
6;Jurist;3140;Tingsfiskal
6;Jurist;3141;Tingsnotarie/Notarie
7;Juridik;3141;Tingsnotarie/Notarie
201;Översättning;6037;Tolk
4;Säljare;7160;Torgförsäljare/Marknadsförsäljare
187;Vägtrafikledare;5003;Trafikledare, vägtrafik
185;Taxi;2496;Trafikvärd/Taxivärd
72;Städa;466;Trappstädare
80;Lokalvård;466;Trappstädare
203;Städerska;466;Trappstädare
125;Häst;3917;Travkusk
276;Truck;5687;Truckförare
276;Truck;621;Truckreparatör
82;Blommor;6274;Trädgårdsarbetare/Plantskolearbetare, trädgård
82;Blommor;4568;Trädgårdsmästare, anläggning
82;Blommor;6273;Trädgårdsmästare, odling
189;Tullverket;2178;Tulldeklarant
189;Tullverket;1338;Tulltaxerare
188;Tullman;5665;Tulltjänsteman
189;Tullverket;5665;Tulltjänsteman
15;Tåg;5551;Tunneltågförare
190;Tunnelbaneförare;5551;Tunneltågförare
191;Tunnelbanaförare;5551;Tunneltågförare
230;Plåtslagare;6754;Tunnplåtslagare
270;Turism;727;Turistassistent
291;Besöksnäring;727;Turistassistent
270;Turism;5598;Turistbyråtjänsteman
291;Besöksnäring;5598;Turistbyråtjänsteman
270;Turism;728;Turistinformatör
291;Besöksnäring;728;Turistinformatör
270;Turism;5241;Turistintendent
291;Besöksnäring;5241;Turistintendent
270;Turism;730;Turistvärd/Turistvärdinna
291;Besöksnäring;730;Turistvärd/Turistvärdinna
6;Jurist;3158;Tvistemålsadvokat
7;Juridik;3158;Tvistemålsadvokat
15;Tåg;7012;Tågklarerare
16;Järnväg;7012;Tågklarerare
15;Tåg;7358;Tågledare
16;Järnväg;7358;Tågledare
15;Tåg;795;Tågvärd/Tågvärdinna
16;Järnväg;795;Tågvärd/Tågvärdinna
192;Ombordservicepersonal;795;Tågvärd/Tågvärdinna
193;Ombordpersonal;795;Tågvärd/Tågvärdinna
14;Avlopp;5507;Underhållstekniker, vattenrening
52;Avloppsteknik;5507;Underhållstekniker, vattenrening
104;Hemtjänst;7586;Undersköterska, hemtjänst och äldreboende
262;Training;3512;Ungdomsinstruktör/Ungdomstränare
273;Träning;3512;Ungdomsinstruktör/Ungdomstränare
47;Beteendevetare;1809;Ungdomssekreterare, socialtjänst
48;Beteendevetenskap;1809;Ungdomssekreterare, socialtjänst
111;Upphandling;7503;Upphandlare
6;Jurist;4003;Upphovsrättsjurist
7;Juridik;4003;Upphovsrättsjurist
111;Upphandling;2549;Uppköpare
8;Sjuksyster;7345;Uroterapeut
211;Skoladministratör;2785;Utbildningsassistent
75;Kursledare;3630;Utbildningsledare
287;Bil;3646;Utbildningsledare, trafikskola
4;Säljare;7117;Utesäljare
194;Fältsäljare;7117;Utesäljare
33;Lastbilschaffis;6705;Utlandsförare
34;Långtradarchaufför;6705;Utlandsförare
35;Långtradarchaffis;6705;Utlandsförare
36;Lastbilsförare;6705;Utlandsförare
38;Lastbil;6705;Utlandsförare
57;Securitas;6893;Utryckningsväktare
195;Pinnpojke;2350;Utsättarbiträde
10;Life science;7414;Utvecklingsingenjör, kemi
16;Järnväg;872;Vagnreparatör, järnväg
72;Städa;468;Vagnsstädare
203;Städerska;468;Vagnsstädare
51;Fartyg;7647;Vaktgående maskinpersonal, sjöfart
4;Säljare;5302;Valutaförsäljare
196;Valutaväxlare;5302;Valutaförsäljare
197;Forex;5302;Valutaförsäljare
6;Jurist;6559;Varumärkesjurist
7;Juridik;6559;Varumärkesjurist
49;Webbmästare;2525;Webmaster
230;Plåtslagare;5991;Ventilationsplåtslagare
218;Sanerare;4084;Ventilationssanerare
110;Samhällsvetare;7538;Verksamhetsanalytiker
268;Verksamhetsutvecklare;7538;Verksamhetsanalytiker
297;Samhällsvetenskap;7538;Verksamhetsanalytiker
47;Beteendevetare;7538;Verksamhetsanalytiker
48;Beteendevetenskap;7538;Verksamhetsanalytiker
100;Personalvetare;7538;Verksamhetsanalytiker
47;Beteendevetare;7537;Verksamhetsarkitekt
48;Beteendevetenskap;7537;Verksamhetsarkitekt
47;Beteendevetare;4732;Verksamhetskonsult
48;Beteendevetenskap;4732;Verksamhetskonsult
100;Personalvetare;4732;Verksamhetskonsult
268;Verksamhetsutvecklare;4732;Verksamhetskonsult
6;Jurist;6558;Verksjurist
7;Juridik;6558;Verksjurist
198;Verktygsarbetare;5929;Verktygsmakare
199;Verktygsoperatör;2645;Verktygsställare
199;Verktygsoperatör;5931;Verktygsuppsättare
270;Turism;705;Vildmarksguide
291;Besöksnäring;705;Vildmarksguide
111;Upphandling;7399;Virkesköpare/Virkesinköpare
104;Hemtjänst;5797;Vårdbiträde
57;Securitas;5906;Väktare
200;Nattvakt;5906;Väktare
57;Securitas;5332;Värdetransportör
6;Jurist;3154;Åklagarassistent
7;Juridik;3154;Åklagarassistent
6;Jurist;6031;Åklagare
7;Juridik;6031;Åklagare
8;Sjuksyster;7349;Ögonsjuksköterska/Oftamologassistent
2;Sjöman;4061;Överstyrman
51;Fartyg;4061;Överstyrman
53;Skeppare;4061;Överstyrman
54;Sjökapten;4061;Överstyrman
201;Översättning;3203;Översättare
6;Jurist;3155;Överåklagare
7;Juridik;3155;Överåklagare