"old_id","old_term","new_id","new_term","modificationDate"
57,"Projekteringsingenjör, elkraft",59,"Utvecklingsingenjör, elkraft",2020-10-21 10:31:56.660
389,Simhallsföreståndare,386,Badföreståndare/Simhallsföreståndare,2019-11-19 12:41:57.110
5545,Garagearbetare,397,Bilvårdare/Garagearbetare,2013-08-27 16:14:53.913
213,Hotellhusfru,444,"Arbetsledare, städ/Husfru/Städledare",2019-11-19 15:19:50.043
6668,Konduktör,795,Tågvärd/Tågvärdinna,2019-05-07 14:49:20.023
5628,Ammunitionsarbetare,929,"Maskinoperatör, sprängämnen och pyroteknik",2012-09-04 16:41:32.090
927,Fyrverkeriarbetare,929,"Maskinoperatör, sprängämnen och pyroteknik",2012-09-04 16:43:23.620
930,Pyroteknisk arbetare,929,"Maskinoperatör, sprängämnen och pyroteknik",2012-09-04 16:43:47.677
966,Formspruttekniker,968,"Formmaskinskötare, plast",2012-09-04 16:37:39.793
969,"Formsprutare, plast",968,"Formmaskinskötare, plast",2012-09-04 16:37:09.890
982,Plastsprutare,968,"Formmaskinskötare, plast",2012-09-04 16:38:06.620
5639,Formsprutställare,968,"Formmaskinskötare, plast",2012-09-04 16:37:25.537
979,Plastpressare,973,"Laminerare, plast",2012-09-04 16:38:32.907
5444,"Skrovbyggare, plast",974,Plastbåtbyggare,2012-09-04 16:39:18.480
1443,Befolkningsstatistiker,1445,Demograf,2019-06-25 10:33:32.813
1970,Familjepedagog,1795,Familjebehandlare/Familjepedagog,2019-12-03 13:25:04.697
1810,Vårdnadsutredare,1798,Familjerättssekreterare,2019-12-03 11:01:58.780
1925,Miljövårdsingenjör,1920,Miljöingenjör/Miljövårdsingenjör,2020-03-05 14:22:01.090
2041,Vårdcentralchef,2032,"Verksamhetschef, hälso- och sjukvård",2015-01-09 11:23:18.497
5705,"Avdelningschef, vårdavd. mottagn./Vårdenhetschef",2032,"Verksamhetschef, hälso- och sjukvård",2015-01-09 11:15:29.973
5248,Primärvårdschef,2032,"Verksamhetschef, hälso- och sjukvård",2015-01-09 11:20:42.137
2040,Tandvårdschef,2033,"Klinikchef, tandvård/Verksamhetschef, tandvård",2015-01-09 11:22:28.790
2062,Invandrarsekreterare,2061,Invandrarkonsulent,2019-12-03 11:07:40.927
2130,Kaplan,2113,Komminister,2019-11-25 16:47:44.120
4896,Abonnemangskontorist,2315,Abonnemangsförsäljare,2017-04-24 09:04:00.463
5907,Parkeringsvakt,2497,Parkeringsvakt/Trafikövervakare,2019-11-19 11:12:24.670
5917,Försäkringssäljare,2555,Försäkringsrådgivare/Försäkringssäljare,2013-08-27 09:37:30.880
5953,Skeppsklarerare/Waterclerk,2758,Fartygsagent/Fartygsklarerare,2019-01-21 10:51:45.040
2776,Rederiagent,2775,Linjeagent/Rederiagent,2019-01-21 10:46:33.997
2184,Kanslist,2787,Administratör/Administrativ assistent,2020-04-15 15:08:37.730
1968,Sjukhuskurator,2787,Administratör/Administrativ assistent,2019-05-24 14:54:08.460
2211,Skeppningsassistent,2787,Administratör/Administrativ assistent,2019-01-21 11:11:01.510
2212,Skeppningskontorist,2787,Administratör/Administrativ assistent,2019-01-21 11:11:19.607
2852,Liftbyggare,2853,"Liftbyggare/Liftmontör/Montageledare, liftar",2013-02-07 16:22:00.783
3047,Dykarskötare,2855,Anläggningsdykare,2016-02-18 17:15:10.380
6019,Dykledare,2855,Anläggningsdykare,2016-02-18 17:11:15.187
6015,Artistförmedlare,2994,Artistagent/Artistbokare/Artistförmedlare,2019-11-19 11:04:43.973
2995,Artistbokare,2994,Artistagent/Artistbokare/Artistförmedlare,2019-11-19 11:04:21.973
3081,Avlöningskontorist,3083,Löneadministratör/Lönekonsult,2020-09-08 13:53:05.873
3084,Löneassistent/Lönekontorist,3083,Löneadministratör/Lönekonsult,2020-09-08 13:56:00.473
5169,Länsassessor,3118,Assessor,2019-06-25 14:07:19.173
5410,Konstvävare,3277,Textilkonstnär,2014-08-26 16:27:47.377
3333,Taltidningsredaktör,3328,Redaktör,2019-04-09 13:45:13.533
5407,"Repetitör, dans",3359,Repetitör,2015-02-16 12:42:27.723
6073,Skolledare,3423,Skolchef/Skoldirektör/Skolledare,2019-06-25 10:26:58.360
3424,Skoldirektör,3423,Skolchef/Skoldirektör/Skolledare,2019-06-25 10:26:20.537
3459,Kriminalassistent,3464,Polisassistent,2013-11-04 15:40:42.200
4174,Jaktpolis,3464,Polisassistent,2013-11-04 14:25:22.217
3460,Kriminalinspektör,3465,"Inspektör, Polisen",2013-11-04 13:59:28.140
3461,Kriminalkommissarie,3466,"Kommissarie, Polisen",2013-11-04 14:02:10.677
3487,Distriktstränare,3485,Distriktsinstruktör/Distriktstränare,2012-09-11 11:26:41.890
3488,Dykinstruktör,3494,Idrottsinstruktör/Idrottstränare,2012-09-11 11:58:33.120
3489,Fotbollstränare,3494,Idrottsinstruktör/Idrottstränare,2012-09-11 11:59:00.130
3492,Galopptränare,3494,Idrottsinstruktör/Idrottstränare,2012-09-13 11:32:27.903
3493,Golfinstruktör/Golftränare,3494,Idrottsinstruktör/Idrottstränare,2012-09-11 11:59:27.877
3497,Idrottstränare,3494,Idrottsinstruktör/Idrottstränare,2012-09-11 11:53:51.943
3499,Ishockeytränare,3494,Idrottsinstruktör/Idrottstränare,2012-09-11 12:00:28.460
3502,Ridlärare/Ridinstruktör,3494,Idrottsinstruktör/Idrottstränare,2012-09-11 12:00:52.413
3503,Simlärare,3494,Idrottsinstruktör/Idrottstränare,2012-09-11 12:01:16.087
3505,Skidinstruktör/Skidlärare,3494,Idrottsinstruktör/Idrottstränare,2012-09-11 12:01:39.760
3510,Tennistränare,3494,Idrottsinstruktör/Idrottstränare,2012-09-11 12:02:02.657
3511,Travtränare,3494,Idrottsinstruktör/Idrottstränare,2012-09-13 11:32:46.350
3513,Workoutinstruktör,3494,Idrottsinstruktör/Idrottstränare,2012-09-13 11:33:07.007
3484,Baskettränare,3494,Idrottsinstruktör/Idrottstränare,2012-09-11 11:55:24.713
3894,"Produktionsplanerare, TV",3888,"Produktionsplanerare: kultur, media, film",2014-08-26 12:20:25.813
3994,Kommunjurist,3997,Stadsjurist/Kommunjurist/Stadsadvokat,2019-06-26 12:39:19.373
3996,Stadsadvokat,3997,Stadsjurist/Kommunjurist/Stadsadvokat,2019-06-26 12:40:08.310
3712,Driftkopplingstekniker,4032,"Elektriker, film/Elektriker, TV",2019-04-04 12:37:49.337
4052,Linfärjförare,4088,Jungman,2014-06-24 13:32:41.120
4328,Bössmakare,4330,Vapentekniker,2020-11-26 15:56:26.617
6240,Vapenmekaniker,4330,Vapentekniker,2020-04-15 14:01:24.163
2025,"Förhandlingschef, organisation",4473,Förhandlingschef,2019-06-24 13:58:24.033
6399,Kyrkogårdsföreståndare,4565,Kyrkogårdsförman,2015-02-20 15:18:34.343
4728,Kvalitetskoordinator,4730,Kvalitetssamordnare/Kvalitetskoordinator,2019-06-25 13:31:01.623
4811,TV-fotograf,4790,Fotograf,2014-08-26 15:57:22.697
6312,Filmfotograf,4790,Fotograf,2014-08-26 15:56:49.290
2802,Reklamsekreterare,4816,Reklamassistent/Reklamsekreterare,2019-02-06 10:13:18.573
4867,Möbelrestauratör,4866,Möbelrenoverare/Möbelrestauratör,2014-08-26 16:28:58.240
6324,Företagsledare,4887,Verkställande direktör/VD,2019-06-24 14:25:16.907
4901,Annonssekreterare,4898,Annonsassistent/Annonssekreterare,2019-02-06 10:08:03.230
5969,Traffic,4900,Annonsmottagare,2019-02-06 10:04:56.990
2808,Trafficman,4900,Annonsmottagare,2019-02-06 10:05:34.477
4907,Försäljningssekreterare,4906,Försäljningsassistent/Försäljningssekreterare,2019-02-06 10:10:33.493
4918,Säljassistent,4906,Försäljningsassistent/Försäljningssekreterare,2019-02-06 10:11:58.050
4919,Säljsekreterare,4906,Försäljningsassistent/Försäljningssekreterare,2019-02-06 10:12:16.683
4909,Inköpsassistent,4911,Inköpsassistent/Inköpskontorist/Inköpssekreterare,2017-04-24 09:13:30.713
4910,Inköpskontorist,4911,Inköpsassistent/Inköpskontorist/Inköpssekreterare,2017-04-24 09:13:15.130
4903,Beställningskontorist,4911,Inköpsassistent/Inköpskontorist/Inköpssekreterare,2020-11-16 10:23:05.760
5004,"Trafikmästare, vägtrafik",5003,"Trafikledare, vägtrafik",2013-10-10 08:28:40.710
6369,Byggmästare,5055,"Platschef, bygg",2020-11-24 08:34:11.320
5235,Socialdirektör,5234,Socialchef/Socialdirektör,2019-06-24 14:36:39.340
5237,Stadsbyggnadsdirektör,5236,Stadsbyggnadschef/Stadsbyggnadsdirektör,2019-06-25 10:56:08.917
5239,"Teknisk direktör, kommun",5238,"Teknisk chef, kommun",2019-02-06 10:35:31.533
209,Köksföreståndare,5478,Ekonomiföreståndare/Kursgårdsföreståndare/Storhushållsföreståndare,2020-12-09 14:33:42.460
210,Storhushållsföreståndare,5478,Ekonomiföreståndare/Kursgårdsföreståndare/Storhushållsföreståndare,2020-12-09 14:42:31.793
212,Kursgårdsföreståndare,5478,Ekonomiföreståndare/Kursgårdsföreståndare/Storhushållsföreståndare,2020-12-09 14:44:23.407
5480,Internatföreståndare,5479,Internatföreståndare/Skolmåltidsföreståndare,2020-12-09 15:00:38.623
5990,Badvakt,5496,Badmästare/Badbevakare/Badvakt/Simhallsvakt/Strandvakt,2019-11-19 12:34:41.477
2901,Badbevakare,5496,Badmästare/Badbevakare/Badvakt/Simhallsvakt/Strandvakt,2019-11-19 12:34:17.747
2902,Simhallsvakt,5496,Badmästare/Badbevakare/Badvakt/Simhallsvakt/Strandvakt,2019-11-19 12:35:14.180
2903,Strandvakt,5496,Badmästare/Badbevakare/Badvakt/Simhallsvakt/Strandvakt,2019-11-19 12:35:44.097
268,Korvmästare,5502,Charkuterist,2012-09-04 15:45:48.613
299,Plastmontör,5510,"Montör, gummi- och plastprodukter",2019-12-17 11:14:21.470
5542,"Officer, flygvapnet",5541,Officer,2013-02-15 10:18:22.163
5543,"Officer, marinen",5541,Officer,2013-02-15 10:18:37.627
2209,Planeringskontorist,5546,Personaladministratör,2020-04-15 15:13:03.090
582,"Personlig handläggare, försäkringskassa",5570,"Försäkringshandläggare, försäkringskassa",2020-01-10 13:33:13.920
1239,Internrevisor,5670,Revisor,2020-09-02 13:24:42.663
2897,Kamrer,5670,Revisor,2020-09-02 14:10:07.963
4848,Förbundskassör,5670,Revisor,2020-09-02 13:22:01.880
5398,IT-revisor,5670,Revisor,2020-09-02 13:35:35.937
6621,Kommunrevisor/Landstingsrevisor,5670,Revisor,2020-09-02 14:12:01.033
6614,Landstingsrevisor,5670,Revisor,2020-09-02 14:12:01.033
7388,Fysioterapeut,5727,Fysioterapeut/Sjukgymnast,2014-04-03 10:37:09.423
1859,Stadsveterinär,5767,Veterinär,2019-02-06 10:19:52.337
1866,Näringskonsulent,5769,Dietist,2019-06-24 15:21:04.100
1955,Dietetiker,5769,Dietist,2019-06-24 15:22:38.963
4424,Juridisk ombudsman,5775,Ombudsman,2019-06-24 13:27:31.723
3999,Stadsombudsman,5775,Ombudsman,2019-06-24 13:26:45.213
4947,Justitieombudsman,5775,Ombudsman,2019-06-24 13:29:58.587
4949,Diskrimineringsombudsman,5775,Ombudsman,2019-06-24 13:26:44.540
4951,Konsumentombudsman,5775,Ombudsman,2019-06-24 13:27:45.497
4954,Näringsfrihetsombudsman,5775,Ombudsman,2019-06-24 13:27:20.137
6473,Barnombudsman,5775,Ombudsman,2019-06-24 13:25:08.937
1957,Näringsfysiolog,5785,Nutritionist/Näringsfysiolog,2013-08-27 10:36:42.440
1960,"Laboratoriebiträde, fys.lab.",5786,Laboratoriebiträde,2019-11-21 15:19:21.053
1961,"Laboratoriebiträde, kem.lab.",5786,Laboratoriebiträde,2019-11-21 15:19:37.860
1962,"Laboratoriebiträde, sjukhus",5786,Laboratoriebiträde,2019-11-21 15:19:53.437
1966,Omsorgskurator,5787,Kurator,2019-05-24 14:53:00.687
1967,Primärvårdskurator,5787,Kurator,2019-05-24 14:53:41.160
2422,Databastekniker,5896,Databasadministratör,2019-06-26 12:24:40.770
2570,"Skadebesiktningsman, försäkring",5920,"Besiktningsman, försäkring/Skadeinspektör, försäkring",2013-08-27 09:54:51.630
2572,"Skadeinspektör, försäkring",5920,"Besiktningsman, försäkring/Skadeinspektör, försäkring",2013-08-27 09:52:06.040
2779,Kursadministratör,5959,Utbildningsadministratör/Utbildningssekreterare/Kursadministratör,2020-03-23 17:26:07.157
2782,Studiekonsulent,5959,Utbildningsadministratör/Utbildningssekreterare/Kursadministratör,2020-03-23 18:09:36.553
2784,Studiesekreterare,5959,Utbildningsadministratör/Utbildningssekreterare/Kursadministratör,2020-03-23 18:53:03.360
2786,Utbildningssekreterare,5959,Utbildningsadministratör/Utbildningssekreterare/Kursadministratör,2015-09-28 10:43:28.127
2893,Revisionsbiträde,5988,Revisorsassistent,2020-09-02 14:54:03.987
3210,Ekonometriker,6040,Nationalekonom,2019-10-28 16:16:39.013
3232,Konsthantverkare,6044,Konsthantverkare,2015-01-13 12:23:36.297
3233,"Konsthantverkare, textil",6044,Konsthantverkare,2015-01-13 12:23:36.297
6045,"Konsthantverkare, textil, läder",6044,Konsthantverkare,2015-01-13 12:23:36.297
6383,"Dansare, show",6050,Dansare,2019-04-04 18:10:25.620
3496,Idrottspedagog,6083,Idrottskonsulent,2019-10-29 10:24:42.857
3591,Sjukhusingenjör,6096,Medicinteknisk ingenjör,2019-10-28 08:30:17.000
3592,Sjukhustekniker,6096,Medicinteknisk ingenjör,2019-10-28 08:29:56.817
3645,Trafikpedagog,6105,Trafiklärare,2019-11-19 16:26:00.977
3346,"Sångare, klassisk musik",6109,Sångare,2019-01-09 15:34:11.163
7201,"Sångare, folkmusik",6109,Sångare,2019-01-09 15:33:37.830
7202,"Musiker, klassisk musik",6110,Musiker,2019-01-09 15:32:46.633
7083,"Musiker, folkmusik",6110,Musiker,2019-01-09 15:31:49.663
3723,Laboratorietandtekniker,6121,Tandtekniker,2019-10-23 10:49:08.640
4665,Originalmontör,6149,Originalare/Final Art,2020-03-03 09:34:01.000
3968,"Tegelbrännare, ugnsskötare",6176,Tegelbruksarbetare,2012-09-04 16:20:00.290
3969,Tegelformare,6176,Tegelbruksarbetare,2012-09-04 16:20:28.257
3970,Tegelpressare,6176,Tegelbruksarbetare,2012-09-04 16:20:44.793
3972,Tegeltorkskötare,6176,Tegelbruksarbetare,2012-09-04 16:21:41.867
3973,Tegelvaruarbetare,6176,Tegelbruksarbetare,2012-09-04 16:21:22.013
3975,"Ugnsuppsättare, tegelbruk",6176,Tegelbruksarbetare,2012-09-04 16:22:04.193
4448,Teaterinspicient,6260,Inspicient,2019-04-04 16:41:21.427
4449,TV-inspicient,6260,Inspicient,2019-04-04 16:41:39.110
4814,TV-redigerare,6313,"Redigerare, rörlig bild",2019-09-26 16:00:47.083
4815,Videoredigerare,6313,"Redigerare, rörlig bild",2019-09-26 16:01:46.967
4888,"Assistent, bostadsförmedling",6325,Bostadsförmedlare,2020-04-15 14:22:32.287
4892,Personaldirektör,6327,HR-chef,2019-05-09 15:58:29.327
4894,Personalintendent,6327,HR-chef,2019-06-24 14:32:57.440
6575,Stadsdirektör,6362,Kommunchef/Kommundirektör/Stadsdirektör,2019-06-24 13:43:43.510
6818,Kommundirektör,6362,Kommunchef/Kommundirektör/Stadsdirektör,2019-06-24 13:44:28.787
5066,Fastighetsdirektör,6366,Fastighetschef/Fastighetsdirektör,2019-06-25 10:05:19.177
5072,Ekonomiledare,6367,Ekonomichef,2019-06-24 14:21:40.870
6468,"Civilingenjör, konstruktion, elkraft",6506,"Civilingenjör, elkraft",2020-10-21 10:25:13.387
6472,"Civilingenjör, anläggning, elkraft",6506,"Civilingenjör, elkraft",2020-10-21 10:14:24.380
6463,"Civilingenjör, produktion, elkraft",6506,"Civilingenjör, elkraft",2020-10-21 10:28:19.090
347,"Forskningsingenjör, elkraft",6506,"Civilingenjör, elkraft",2020-10-21 10:28:45.773
69,"Processingenjör, elkraft",6506,"Civilingenjör, elkraft",2020-10-21 10:30:36.087
76,"Standardiseringsingenjör, elkraft",6506,"Civilingenjör, elkraft",2020-10-21 10:32:34.510
4375,Träindustriarbetare,6606,"Maskinsnickare, trävaruindustri/Operatör, trävaruindustri",2013-02-13 14:49:42.037
4376,Trämaskinskötare,6606,"Maskinsnickare, trävaruindustri/Operatör, trävaruindustri",2013-02-13 14:50:13.453
4377,Trämaskinställare,6606,"Maskinsnickare, trävaruindustri/Operatör, trävaruindustri",2013-02-13 14:49:59.473
4379,Tändsticksfabriksarbetare,6606,"Maskinsnickare, trävaruindustri/Operatör, trävaruindustri",2013-02-13 14:50:50.870
2027,"Kanslichef, organisation",6623,Kanslichef,2019-06-24 14:22:59.983
6624,"Kanslichef, kommun",6623,Kanslichef,2019-06-24 14:22:13.243
7518,"Kanslichef/verksamhetschef, församling",6623,Kanslichef,2019-06-24 14:22:37.773
4886,Varuhuschef,6646,Butikschef,2017-04-24 08:50:18.203
736,Rangerare/Växlare,6650,Bangårdsoperatör,2013-10-10 08:19:38.727
737,Rangerledare,6650,Bangårdsoperatör,2013-10-10 08:19:21.410
1833,Försäkringsaktuarie,6655,Aktuarie/Försäkringsaktuarie/Försäkringsmatematiker,2019-06-25 10:39:29.647
1834,Försäkringsmatematiker,6655,Aktuarie/Försäkringsaktuarie/Försäkringsmatematiker,2019-06-25 10:40:02.843
2899,Maskinbokförare,6854,Redovisningskonsult,2020-09-02 14:48:59.623
2900,Redovisningsman,6854,Redovisningskonsult,2020-09-02 14:52:16.133
2891,"Granskare, revision",6854,Redovisningskonsult,2020-09-02 14:31:29.460
2892,Granskningsman,6854,Redovisningskonsult,2020-09-02 14:33:46.867
4653,Bild- och reprografiker,6857,Prepressoperatör,2020-02-21 11:06:35.157
4656,Desktopoperatör,6857,Prepressoperatör,2020-03-03 09:56:52.083
2553,Försäkringsmäklare,6876,Försäkringsförmedlare/Försäkringsmäklare,2013-08-27 09:39:10.123
826,PC-tekniker,7020,Helpdesktekniker/Supporttekniker,2013-01-31 14:58:10.277
3638,Dispatcher,7020,Helpdesktekniker/Supporttekniker,2020-04-15 14:09:07.013
3235,Textilkonservator,7030,Konservator,2014-08-26 16:25:26.577
3220,Möbelkonservator,7030,Konservator,2014-08-26 16:23:54.433
3225,Djurkonservator,7030,Konservator,2014-08-26 16:25:00.703
3230,"Konservator, naturhistoria",7030,Konservator,2014-08-26 16:25:57.077
3440,"Konservator, metall",7030,Konservator,2014-08-26 16:23:10.197
3441,"Konservator, sten",7030,Konservator,2014-08-26 16:23:39.600
3442,"Konservator, måleri",7030,Konservator,2014-08-26 16:23:25.253
3443,Skulpturkonservator,7030,Konservator,2014-08-26 16:24:09.920
3444,Tavelkonservator,7030,Konservator,2014-08-26 16:24:25.267
6075,"Konservator, konst",7030,Konservator,2014-08-26 16:22:35.790
7026,"Konservator, papper",7030,Konservator,2014-08-26 16:26:26.190
7027,"Konservator, foto",7030,Konservator,2014-08-26 16:22:07.847
7028,"Konservator, brons",7030,Konservator,2014-08-26 16:21:54.100
7029,"Konservator, gips",7030,Konservator,2014-08-26 16:22:21.223
7048,Utställningsproducent,7047,"Producent: kultur, media, film, dataspel",2019-01-09 15:56:16.100
7049,Talboksproducent,7047,"Producent: kultur, media, film, dataspel",2019-01-09 15:57:45.690
7050,Linjeproducent,7047,"Producent: kultur, media, film, dataspel",2014-08-26 12:14:49.627
7063,Bearbetningsproducent,7047,"Producent: kultur, media, film, dataspel",2014-08-26 12:12:33.787
6883,Turnéproducent för utställningar,7047,"Producent: kultur, media, film, dataspel",2019-01-09 15:58:16.863
7151,Kulturproducent,7047,"Producent: kultur, media, film, dataspel",2014-08-26 12:14:23.590
7153,Eventproducent,7047,"Producent: kultur, media, film, dataspel",2019-01-09 15:55:52.347
7200,Musikproducent,7047,"Producent: kultur, media, film, dataspel",2019-01-09 15:57:21.423
6161,Radioproducent,7047,"Producent: kultur, media, film, dataspel",2014-08-26 12:16:09.893
6162,TV-producent,7047,"Producent: kultur, media, film, dataspel",2014-08-26 12:17:42.153
6163,Multimediaproducent,7047,"Producent: kultur, media, film, dataspel",2014-08-26 12:15:33.190
5411,Dansproducent,7047,"Producent: kultur, media, film, dataspel",2014-08-26 12:13:18.857
6351,Teaterproducent,7047,"Producent: kultur, media, film, dataspel",2014-08-26 12:16:42.347
5015,Filmproducent,7047,"Producent: kultur, media, film, dataspel",2014-08-26 12:13:56.283
3897,Videoproducent,7047,"Producent: kultur, media, film, dataspel",2014-08-26 12:18:15.050
6257,Bildingenjör,7074,"Bildingenjör/BING, film/BING, TV",2019-11-11 10:21:28.933
3686,Entertainer,7086,Showartist,2019-04-04 18:17:50.003
2207,Personalkontorist,7095,HR-assistent,2020-09-08 14:08:42.617
2208,Personalredogörare,7095,HR-assistent,2020-09-08 14:10:53.483
6820,Personalsekreterare,7095,HR-assistent,2020-09-08 14:14:30.737
7115,"Lärling, drift- och vägunderhållsarbetare",7114,Drift- och vägunderhållsarbetare,2016-02-18 16:53:36.003
7166,Lärare i gymnasiet - kärnämne och yrkesämne,7128,Lärare i gymnasieskolan - yrkesämnen,2014-09-02 15:05:03.993
7167,Lärare i gymnasiet - yrkesämne och kärnämne,7128,Lärare i gymnasieskolan - yrkesämnen,2014-09-02 15:05:22.713
6152,Dekoratör,7211,Butikskommunikatör/Visual merchandiser,2019-10-28 11:07:11.450
3854,Reklamdekoratör,7211,Butikskommunikatör/Visual merchandiser,2019-10-28 11:07:11.450
7352,"Sjuksköterska, geriatrisk vård",7244,"Sjuksköterska, geriatrik/Sjuksköterska, äldreomsorg och äldrevård",2019-12-17 08:38:23.940
7561,"Chef, biomedicinsk analytiker",7305,"Enhetschef, hälso- och sjukvård",2015-01-09 11:18:21.593
7361,Flygledarassistent,7362,Flight Data Operator/FDO/Flygledarassistent,2020-03-05 09:03:11.710
7523,"Soldat, armén",7525,Soldat/Sjöman,2013-02-15 10:21:57.480
7524,"Soldat, flygvapnet",7525,Soldat/Sjöman,2013-02-15 10:22:08.990
7527,"Specialistofficer, flygvapnet",7526,Specialistofficer,2013-02-15 10:20:21.753
7528,"Specialistofficer, marinen",7526,Specialistofficer,2013-02-15 10:20:39.940
6528,Användbarhetsdesigner,7575,Interaktionsdesigner,2017-05-18 16:07:41.840
6529,Användbarhetsexpert,7575,Interaktionsdesigner,2017-05-18 16:08:31.573
5965,Dataregistrerare,7694,Dataregistrerare/Registrerare,2017-08-25 10:38:22.733
3204,Språkforskare,7727,"Forskare, språk",2019-02-06 11:27:16.663
4509,Trädgårdsforskare,7730,"Forskare, trädgårdsvetenskap",2019-02-06 11:29:48.893
4497,Jordbruksforskare,7735,"Forskare, jordbruk",2019-02-06 11:28:53.693
7777,KMA-samordnare,7769,HSEQ Manager/KMA-samordnare,2019-02-06 10:39:58.750
7232,Produktionskoordinator,7776,"Koordinator: kultur, media, film, dataspel",2019-01-09 15:46:43.610
7233,Platskoordinator,7776,"Koordinator: kultur, media, film, dataspel",2019-01-09 15:45:47.083
7155,Inspelningskoordinator,7776,"Koordinator: kultur, media, film, dataspel",2019-01-09 15:44:50.343
7025,Utställningskoordinator,7776,"Koordinator: kultur, media, film, dataspel",2019-01-09 15:47:16.077
395,Källarmästare,7788,F&B Manager/Food and beverage manager,2018-12-12 09:49:46.747
4808,"Kameraman, TV",7804,TV-fotograf,2019-04-04 17:47:42.320
7066,Undertextare,7825,Mediatextare,2019-06-25 14:32:30.620
7067,Nyhetstextare,7825,Mediatextare,2019-06-25 14:31:50.790
7070,Svensktextare,7825,Mediatextare,2019-06-25 14:32:16.963
6644,Civilförsvarschef,7867,Beredskapsdirektör,2020-06-23 15:25:17.243
6466,"Civilingenjör, kvalitet, elkraft",7877,"Elkvalitetsanalytiker, elkraft",2020-10-21 10:27:32.567
6470,"Civilingenjör, drift och underhåll, elkraft",7879,"Underhållsanalytiker, elkraft",2020-10-21 10:19:16.147
6467,"Civilingenjör, kontroll, elkraft",7881,"Kontrollanläggningsingenjör, elkraft",2020-10-21 10:26:38.453
6592,"Produktionsingenjör, elkraft",7882,Elkraftingenjör,2020-10-23 14:15:16.940
6620,"Konstruktör, elkraft",7882,Elkraftingenjör,2020-10-23 13:48:07.210
7284,"Automationsingenjör, elkraft",7882,Elkraftingenjör,2020-10-23 13:36:00.983
4221,"Anläggningsingenjör, elkraft",7882,Elkraftingenjör,2020-10-21 14:30:04.630
4222,"Beräkningsingenjör, elkraft",7882,Elkraftingenjör,2020-10-23 13:37:59.917
4243,"Besiktningsingenjör, elkraft",7882,Elkraftingenjör,2020-10-23 13:39:37.510
4246,"Kvalitetsingenjör, elkraft/Kvalitetstekniker, elkraft",7884,Kontrollanläggningstekniker,2020-10-23 14:12:23.533
6219,"Kontrollingenjör, elkraft",7884,Kontrollanläggningstekniker,2020-10-23 13:50:03.210
