id,label,iso,iso-uri,glottolog-url,q-id
hB5i_2eY_Kur,Minangkabau,MIN,https://iso639-3.sil.org/code/min,https://glottolog.org/resource/languoid/id/mina1268,http://www.wikidata.org/entity/Q13324
YJcD_PeA_u4M,Akinesiska,ACE,https://iso639-3.sil.org/code/ace,https://glottolog.org/resource/languoid/id/achi1257,http://www.wikidata.org/entity/Q27683
fwrn_bpj_4vM,Awadhi,AWA,https://iso639-3.sil.org/code/awa,https://glottolog.org/resource/languoid/id/awad1243,http://www.wikidata.org/entity/Q29579
9ig9_ypn_cVw,Lesgiska,LEZ,https://iso639-3.sil.org/code/lez,https://glottolog.org/resource/languoid/id/lezg1247,http://www.wikidata.org/entity/Q31746
GcJV_gXD_7YU,Balinesiska,BAN,https://iso639-3.sil.org/code/ban,https://glottolog.org/resource/languoid/id/bali1278,http://www.wikidata.org/entity/Q33070
becB_LRA_kuX,Buginesiska,BUG,https://iso639-3.sil.org/code/bug,https://glottolog.org/resource/languoid/id/bugi1244,http://www.wikidata.org/entity/Q33190
y89C_Uia_Y5j,Cebuano,CEB,https://iso639-3.sil.org/code/ceb,https://glottolog.org/resource/languoid/id/cebu1242,http://www.wikidata.org/entity/Q33239
NaRV_tAk_xx2,Cheyenne,CHY,https://iso639-3.sil.org/code/chy,https://glottolog.org/resource/languoid/id/chey1247,http://www.wikidata.org/entity/Q33265
czZH_fp8_mbz,Bodjpuri,BHO,https://iso639-3.sil.org/code/bho,https://glottolog.org/resource/languoid/id/bhoj1244,http://www.wikidata.org/entity/Q33268
p8af_zMR_sbN,Cherokee,CHR,https://iso639-3.sil.org/code/chr,https://glottolog.org/resource/languoid/id/cher1273,http://www.wikidata.org/entity/Q33388
LHyw_YUi_539,Friuliska,FUR,https://iso639-3.sil.org/code/fur,https://glottolog.org/resource/languoid/id/friu1240,http://www.wikidata.org/entity/Q33441
brZn_27W_A9K,Karakalpak,KAA,https://iso639-3.sil.org/code/kaa,https://glottolog.org/resource/languoid/id/kara1467,http://www.wikidata.org/entity/Q33541
Xfhf_EwK_2ej,Hawaiiska,HAW,https://iso639-3.sil.org/code/haw,https://glottolog.org/resource/languoid/id/hawa1245,http://www.wikidata.org/entity/Q33569
QWLc_9BV_8RS,Papiamento,PAP,https://iso639-3.sil.org/code/pap,https://glottolog.org/resource/languoid/id/papi1253,http://www.wikidata.org/entity/Q33856
4xVc_tVS_85F,Manipuriska,MNI,https://iso639-3.sil.org/code/mni,https://glottolog.org/resource/languoid/id/mani1292,http://www.wikidata.org/entity/Q33868
yymy_7L8_LDE,Pangasinan,PAG,https://iso639-3.sil.org/code/pag,https://glottolog.org/resource/languoid/id/pang1290,http://www.wikidata.org/entity/Q33879
HgMp_vQ1_7ed,Nordsotho,NSO,https://iso639-3.sil.org/code/nso,https://glottolog.org/resource/languoid/id/pedi1238,http://www.wikidata.org/entity/Q33890
dS3F_4gn_htW,Newari,NEW,https://iso639-3.sil.org/code/new,https://glottolog.org/resource/languoid/id/newa1246,http://www.wikidata.org/entity/Q33979
j4JW_5P4_BGA,Kabyliska,KAB,https://iso639-3.sil.org/code/kab,https://glottolog.org/resource/languoid/id/kaby1243,http://www.wikidata.org/entity/Q35853
yBCa_NHj_TcN,Iloko,ILO,https://iso639-3.sil.org/code/ilo,https://glottolog.org/resource/languoid/id/ilok1237,http://www.wikidata.org/entity/Q35936
AzXn_4ic_B5Y,Maithili,MAI,https://iso639-3.sil.org/code/mai,https://glottolog.org/resource/languoid/id/mait1250,http://www.wikidata.org/entity/Q36109
wAEM_WR9_cmv,Pampanggo,PAM,https://iso639-3.sil.org/code/pam,https://glottolog.org/resource/languoid/id/pamp1243,http://www.wikidata.org/entity/Q36121
B9id_Ecv_qji,Ladino,LAD,https://iso639-3.sil.org/code/lad,https://glottolog.org/resource/languoid/id/ladi1251,http://www.wikidata.org/entity/Q36196
49Hh_qTx_aj5,Sorani,CKB,https://iso639-3.sil.org/code/ckb,https://glottolog.org/resource/languoid/id/cent1972,http://www.wikidata.org/entity/Q36811
ov2k_GtY_wDw,Dinka,DIN,https://iso639-3.sil.org/code/din,https://glottolog.org/resource/languoid/id/dink1262,http://www.wikidata.org/entity/Q56466
vNJX_dvg_1aq,Nias,NIA,https://iso639-3.sil.org/code/nia,https://glottolog.org/resource/languoid/id/nias1242,http://www.wikidata.org/entity/Q2407831
WvNj_WvF_CMS,Gorontalo,GOR,https://iso639-3.sil.org/code/gor,https://glottolog.org/resource/languoid/id/goro1259,http://www.wikidata.org/entity/Q2501174
Hk93_QrC_QXX,Arameiska,ARC,https://iso639-3.sil.org/code/arc,https://glottolog.org/resource/languoid/id/impe1235,http://www.wikidata.org/entity/Q7079491
NVxJ_hLg_TYS,Engelska,ENG,https://iso639-3.sil.org/code/eng,https://glottolog.org/resource/languoid/id/stan1293,http://www.wikidata.org/entity/Q1860
W1EH_yKC_wMJ,Portugisiska,POR,https://iso639-3.sil.org/code/por,https://glottolog.org/resource/languoid/id/port1283,http://www.wikidata.org/entity/Q5146
pW4U_gcW_VGv,Bulgariska,BUL,https://iso639-3.sil.org/code/bul,https://glottolog.org/resource/languoid/id/bulg1262,http://www.wikidata.org/entity/Q7918
i2wN_KYK_kRT,Vitryska,BEL,https://iso639-3.sil.org/code/bel,https://glottolog.org/resource/languoid/id/bela1254,http://www.wikidata.org/entity/Q9091
M3e1_w6W_iLW,Kantonesiska,YUE,https://iso639-3.sil.org/code/yue,https://glottolog.org/resource/languoid/id/yuec1235,http://www.wikidata.org/entity/Q9186
HFys_DBy_E5b,Turkmenska,TUK,https://iso639-3.sil.org/code/tuk,https://glottolog.org/resource/languoid/id/turk1304,http://www.wikidata.org/entity/Q9267
ySYP_i3K_WZ2,Galiciska,GLG,https://iso639-3.sil.org/code/glg,https://glottolog.org/resource/languoid/id/gali1258,http://www.wikidata.org/entity/Q9307
F6dn_vX1_Qnm,Somaliska,SOM,https://iso639-3.sil.org/code/som,https://glottolog.org/resource/languoid/id/soma1255,http://www.wikidata.org/entity/Q13275
jvFH_zK8_KhS,Nauru,NAU,https://iso639-3.sil.org/code/nau,https://glottolog.org/resource/languoid/id/naur1243,http://www.wikidata.org/entity/Q13307
ujrF_MeF_LSB,Meänkieli/Tornedalsfinska,FIT,https://iso639-3.sil.org/code/fit,https://glottolog.org/resource/languoid/id/torn1244,http://www.wikidata.org/entity/Q13357
rcVk_VU4_zay,Skotska,SCO,https://iso639-3.sil.org/code/sco,https://glottolog.org/resource/languoid/id/scot1243,http://www.wikidata.org/entity/Q14549
XXq9_Nq8_55j,Frisiska,FRY,https://iso639-3.sil.org/code/fry,https://glottolog.org/resource/languoid/id/west2354,http://www.wikidata.org/entity/Q27175
7xZB_9BJ_eLa,Akan,AKA,https://iso639-3.sil.org/code/aka,https://glottolog.org/resource/languoid/id/akan1250,http://www.wikidata.org/entity/Q28026
xLXn_NYc_2Zv,Santali,SAT,https://iso639-3.sil.org/code/sat,https://glottolog.org/resource/languoid/id/sant1410,http://www.wikidata.org/entity/Q33965
jE6j_5nL_t9U,Tuvinska,TYV,https://iso639-3.sil.org/code/tyv,https://glottolog.org/resource/languoid/id/tuvi1240,http://www.wikidata.org/entity/Q34119
JGyZ_VXD_V8b,Tetum,TET,https://iso639-3.sil.org/code/tet,https://glottolog.org/resource/languoid/id/tetu1245,http://www.wikidata.org/entity/Q34125
VPVt_rxK_6JP,Tumbuka,TUM,https://iso639-3.sil.org/code/tum,https://glottolog.org/resource/languoid/id/tumb1250,http://www.wikidata.org/entity/Q34138
wL3C_poK_fbi,Tok Pisin,TPI,https://iso639-3.sil.org/code/tpi,https://glottolog.org/resource/languoid/id/tokp1240,http://www.wikidata.org/entity/Q34159
vm4L_9sD_6Dd,Waray,WAR,https://iso639-3.sil.org/code/war,https://glottolog.org/resource/languoid/id/wara1300,http://www.wikidata.org/entity/Q34279
PsHc_32K_PEz,Jakutiska,SAH,https://iso639-3.sil.org/code/sah,https://glottolog.org/resource/languoid/id/yaku1245,http://www.wikidata.org/entity/Q34299
XdkL_b18_aE3,Braj,BRA,https://iso639-3.sil.org/code/bra,https://glottolog.org/resource/languoid/id/braj1242,http://www.wikidata.org/entity/Q35243
VEPz_1v9_Rvu,Rapanui,RAP,https://iso639-3.sil.org/code/rap,https://glottolog.org/resource/languoid/id/rapa1244,http://www.wikidata.org/entity/Q36746
ZRA5_7p5_vY7,Shan,SHN,https://iso639-3.sil.org/code/shn,https://glottolog.org/resource/languoid/id/shan1277,http://www.wikidata.org/entity/Q56482
zASV_5vH_5Yr,Pohnpei,PON,https://iso639-3.sil.org/code/pon,https://glottolog.org/resource/languoid/id/pohn1238,http://www.wikidata.org/entity/Q28422
qTKS_snK_ezT,Kurukh,KRU,https://iso639-3.sil.org/code/kru,https://glottolog.org/resource/languoid/id/kuru1301,http://www.wikidata.org/entity/Q33492
tVYE_xuR_B75,Swazi/Swati,SSW,https://iso639-3.sil.org/code/ssw,https://glottolog.org/resource/languoid/id/swat1243,http://www.wikidata.org/entity/Q34014
qeKC_PXn_cHU,Lushai,LUS,https://iso639-3.sil.org/code/lus,https://glottolog.org/resource/languoid/id/lush1249,http://www.wikidata.org/entity/Q36147
NBKm_cvX_fGo,Lingala,LIN,https://iso639-3.sil.org/code/lin,https://glottolog.org/resource/languoid/id/ling1263,http://www.wikidata.org/entity/Q36217
JxfJ_kyR_CQZ,Kurdiska,KUR,https://iso639-3.sil.org/code/kur,https://glottolog.org/resource/languoid/id/kurd1259,http://www.wikidata.org/entity/Q36368
CM6d_taZ_vVL,Fönikiska,PHN,https://iso639-3.sil.org/code/phn,https://glottolog.org/resource/languoid/id/phoe1239,http://www.wikidata.org/entity/Q36734
anUm_Nr6_gpN,Rarotonga,RAR,https://iso639-3.sil.org/code/rar,https://glottolog.org/resource/languoid/id/raro1241,http://www.wikidata.org/entity/Q36745
XadF_xEF_Hvb,Marathi,MAR,https://iso639-3.sil.org/code/mar,https://glottolog.org/resource/languoid/id/mara1378,http://www.wikidata.org/entity/Q1571
cZpA_5RH_23F,Araukiska,ARN,https://iso639-3.sil.org/code/arn,https://glottolog.org/resource/languoid/id/mapu1245,http://www.wikidata.org/entity/Q33730
zunG_TL8_koW,Tuvalu,TVL,https://iso639-3.sil.org/code/tvl,https://glottolog.org/resource/languoid/id/tuva1244,http://www.wikidata.org/entity/Q34055
GF87_h5U_r6r,Wolof,WOL,https://iso639-3.sil.org/code/wol,https://glottolog.org/resource/languoid/id/nucl1347,http://www.wikidata.org/entity/Q34257
YQs2_RvS_UjV,Timne,TEM,https://iso639-3.sil.org/code/tem,https://glottolog.org/resource/languoid/id/timn1235,http://www.wikidata.org/entity/Q36613
k3AV_Asg_TWU,Twi,TWI,https://iso639-3.sil.org/code/twi,https://glottolog.org/resource/languoid/id/twii1234,http://www.wikidata.org/entity/Q36850
rEi5_NuN_9xC,Luiseno,LUI,https://iso639-3.sil.org/code/lui,https://glottolog.org/resource/languoid/id/luis1253,http://www.wikidata.org/entity/Q56236
Z19f_uKB_oTc,Arapaho,ARP,https://iso639-3.sil.org/code/arp,https://glottolog.org/resource/languoid/id/arap1274,http://www.wikidata.org/entity/Q56417
tKF5_Dm1_PL5,Chipewyan,CHP,https://iso639-3.sil.org/code/chp,https://glottolog.org/resource/languoid/id/chip1261,http://www.wikidata.org/entity/Q27692
SRr4_baB_iSZ,Basa,BAS,https://iso639-3.sil.org/code/bas,https://glottolog.org/resource/languoid/id/basa1284,http://www.wikidata.org/entity/Q33093
ZMHx_hup_v34,Fidjianska,FIJ,https://iso639-3.sil.org/code/fij,https://glottolog.org/resource/languoid/id/fiji1243,http://www.wikidata.org/entity/Q33295
ZsK2_s92_xaW,Kachin,KAC,https://iso639-3.sil.org/code/kac,https://glottolog.org/resource/languoid/id/kach1280,http://www.wikidata.org/entity/Q33332
heWF_H1y_48o,Tjuvasjiska,CHV,https://iso639-3.sil.org/code/chv,https://glottolog.org/resource/languoid/id/chuv1255,http://www.wikidata.org/entity/Q33348
T5kG_Krh_ZBZ,Kanaresiska,KAN,https://iso639-3.sil.org/code/kan,https://glottolog.org/resource/languoid/id/nucl1305,http://www.wikidata.org/entity/Q33673
uhGZ_Xif_8jX,Ekajuk,EKA,https://iso639-3.sil.org/code/eka,https://glottolog.org/resource/languoid/id/ekaj1238,http://www.wikidata.org/entity/Q35250
WTZi_v28_Unh,Fanti,FAT,https://iso639-3.sil.org/code/fat,https://glottolog.org/resource/languoid/id/fant1241,http://www.wikidata.org/entity/Q35570
ww2N_GEd_Pc7,Medelengelska,ENM,https://iso639-3.sil.org/code/enm,https://glottolog.org/resource/languoid/id/midd1317,http://www.wikidata.org/entity/Q36395
YPKq_LRQ_CHT,Katalanska,CAT,https://iso639-3.sil.org/code/cat,https://glottolog.org/resource/languoid/id/stan1289,http://www.wikidata.org/entity/Q7026
4N2S_MYT_nt7,Telugu,TEL,https://iso639-3.sil.org/code/tel,https://glottolog.org/resource/languoid/id/telu1262,http://www.wikidata.org/entity/Q8097
14pF_wSZ_fnK,Litauiska,LIT,https://iso639-3.sil.org/code/lit,https://glottolog.org/resource/languoid/id/lith1251,http://www.wikidata.org/entity/Q9083
gsoZ_3LM_C79,Kosraeiska,KOS,https://iso639-3.sil.org/code/kos,https://glottolog.org/resource/languoid/id/kosr1238,http://www.wikidata.org/entity/Q33464
En9t_Siu_7yx,Mongo,LOL,https://iso639-3.sil.org/code/lol,https://glottolog.org/resource/languoid/id/mong1338,http://www.wikidata.org/entity/Q112893
7a3p_ktX_vgP,Medelnederländska,DUM,https://iso639-3.sil.org/code/dum,https://glottolog.org/resource/languoid/id/midd1321,http://www.wikidata.org/entity/Q178806
Sta6_5fE_6YC,Gondi,GON,https://iso639-3.sil.org/code/gon,https://glottolog.org/resource/languoid/id/nort3258,http://www.wikidata.org/entity/Q1775361
UaRX_FvG_rKF,Turkiska,TUR,https://iso639-3.sil.org/code/tur,https://glottolog.org/resource/languoid/id/nucl1301,http://www.wikidata.org/entity/Q256
DFr5_o1T_Bop,Herero,HER,https://iso639-3.sil.org/code/her,https://glottolog.org/resource/languoid/id/here1253,http://www.wikidata.org/entity/Q33315
3ofn_Vft_AFK,Palauiska,PAU,https://iso639-3.sil.org/code/pau,https://glottolog.org/resource/languoid/id/pala1344,http://www.wikidata.org/entity/Q33776
niMN_h39_tm3,Nauriska,NAV,https://iso639-3.sil.org/code/nav,https://glottolog.org/resource/languoid/id/nava1243,http://www.wikidata.org/entity/Q13310
rJah_bYL_qdW,Magahi,MAG,https://iso639-3.sil.org/code/mag,https://glottolog.org/resource/languoid/id/maga1260,http://www.wikidata.org/entity/Q33728
1V1A_8LC_9FL,Grebo,GRB,https://iso639-3.sil.org/code/grb,https://glottolog.org/resource/languoid/id/greb1256,http://www.wikidata.org/entity/Q35257
Xajo_j9B_XWW,Serer,SRR,https://iso639-3.sil.org/code/srr,https://glottolog.org/resource/languoid/id/sere1260,http://www.wikidata.org/entity/Q36284
FNQx_3PN_eiT,Lao,LAO,https://iso639-3.sil.org/code/lao,https://glottolog.org/resource/languoid/id/laoo1244,http://www.wikidata.org/entity/Q9211
e44f_RYG_BZd,Niuea,NIU,https://iso639-3.sil.org/code/niu,https://glottolog.org/resource/languoid/id/niue1239,http://www.wikidata.org/entity/Q33790
t2Tr_maJ_cp4,Turoyo,TRU,https://iso639-3.sil.org/code/tru,https://glottolog.org/resource/languoid/id/turo1239,http://www.wikidata.org/entity/Q34040
mHSV_SUD_wXF,Ryska,RUS,https://iso639-3.sil.org/code/rus,https://glottolog.org/resource/languoid/id/russ1263,http://www.wikidata.org/entity/Q7737
WmiH_iwb_S95,Tatariska,TAT,https://iso639-3.sil.org/code/tat,https://glottolog.org/resource/languoid/id/tata1255,http://www.wikidata.org/entity/Q25285
qLfm_7QZ_37r,Sundanesiska,SUN,https://iso639-3.sil.org/code/sun,https://glottolog.org/resource/languoid/id/sund1252,http://www.wikidata.org/entity/Q34002
G8e4_Sid_vFd,Sidamo,SID,https://iso639-3.sil.org/code/sid,https://glottolog.org/resource/languoid/id/sida1246,http://www.wikidata.org/entity/Q33786
Lwot_W1k_dFW,Nepalesiska,NEP,https://iso639-3.sil.org/code/nep,https://glottolog.org/resource/languoid/id/east1436,http://www.wikidata.org/entity/Q33823
gnmK_CdW_viG,Koptiska,COP,https://iso639-3.sil.org/code/cop,https://glottolog.org/resource/languoid/id/copt1239,http://www.wikidata.org/entity/Q36155
Lg2z_RbL_A8S,Aymara,AYM,https://iso639-3.sil.org/code/aym,https://glottolog.org/resource/languoid/id/nucl1667,http://www.wikidata.org/entity/Q4627
QsrB_4Kx_K7y,Malayalam,MAL,https://iso639-3.sil.org/code/mal,https://glottolog.org/resource/languoid/id/mala1464,http://www.wikidata.org/entity/Q36236
PKJu_KCn_zAV,Singalesiska/Sinhala,SIN,https://iso639-3.sil.org/code/sin,https://glottolog.org/resource/languoid/id/sinh1246,http://www.wikidata.org/entity/Q13267
j4rH_cw8_s7g,Färöiska,FAO,https://iso639-3.sil.org/code/fao,https://glottolog.org/resource/languoid/id/faro1244,http://www.wikidata.org/entity/Q25258
PWs8_ctN_ewk,Yapese,YAP,https://iso639-3.sil.org/code/yap,https://glottolog.org/resource/languoid/id/yape1248,http://www.wikidata.org/entity/Q34029
ViTs_TnK_DzW,Hausa,HAU,https://iso639-3.sil.org/code/hau,https://glottolog.org/resource/languoid/id/haus1257,http://www.wikidata.org/entity/Q56475
so8d_dR6_E8j,Punjabi/Panjabo,PAN,https://iso639-3.sil.org/code/pan,https://glottolog.org/resource/languoid/id/panj1256,http://www.wikidata.org/entity/Q58635
wREW_gh2_Bxu,Korsikanska,COS,https://iso639-3.sil.org/code/cos,https://glottolog.org/resource/languoid/id/cors1241,http://www.wikidata.org/entity/Q33111
w7am_ASn_5uK,Lamba,LAM,https://iso639-3.sil.org/code/lam,https://glottolog.org/resource/languoid/id/lamb1271,http://www.wikidata.org/entity/Q36098
hP5c_JJk_riU,Ugaritiska,UGA,https://iso639-3.sil.org/code/uga,https://glottolog.org/resource/languoid/id/ugar1238,http://www.wikidata.org/entity/Q36928
FzWY_WsG_LUy,Muskogee,MUS,https://iso639-3.sil.org/code/mus,https://glottolog.org/resource/languoid/id/cree1270,http://www.wikidata.org/entity/Q523014
i9Hd_bVm_Z3c,Spanska,SPA,https://iso639-3.sil.org/code/spa,https://glottolog.org/resource/languoid/id/stan1288,http://www.wikidata.org/entity/Q1321
GBG3_87R_ux1,Bengaliska,BEN,https://iso639-3.sil.org/code/ben,https://glottolog.org/resource/languoid/id/beng1280,http://www.wikidata.org/entity/Q9610
sggr_4ba_xWP,Iban,IBA,https://iso639-3.sil.org/code/iba,https://glottolog.org/resource/languoid/id/iban1264,http://www.wikidata.org/entity/Q33424
vQHk_Y7j_NVM,Gammelfranska,FRO,https://iso639-3.sil.org/code/fro,https://glottolog.org/resource/languoid/id/oldf1239,http://www.wikidata.org/entity/Q35222
QZv8_dXK_dw8,Bini,BIN,https://iso639-3.sil.org/code/bin,https://glottolog.org/resource/languoid/id/bini1246,http://www.wikidata.org/entity/Q35375
sMa9_mkN_w7L,Gammalgrekiska,GRC,https://iso639-3.sil.org/code/grc,https://glottolog.org/resource/languoid/id/anci1242,http://www.wikidata.org/entity/Q35497
BHDa_r1G_5Sv,Masai,MAS,https://iso639-3.sil.org/code/mas,https://glottolog.org/resource/languoid/id/masa1300,http://www.wikidata.org/entity/Q35787
QFad_Hdf_EqL,Karibiska,CAR,https://iso639-3.sil.org/code/car,https://glottolog.org/resource/languoid/id/gali1262,http://www.wikidata.org/entity/Q56611
k9XX_SU3_PiE,Medelfranska,FRM,https://iso639-3.sil.org/code/frm,https://glottolog.org/resource/languoid/id/midd1316,http://www.wikidata.org/entity/Q1473289
EgN8_Usb_2f6,Romani,ROM,https://iso639-3.sil.org/code/rom,https://glottolog.org/resource/languoid/id/roma1329,http://www.wikidata.org/entity/Q13201
95r9_3rM_KWz,Kikuyu,KIK,https://iso639-3.sil.org/code/kik,https://glottolog.org/resource/languoid/id/kiku1240,http://www.wikidata.org/entity/Q33587
97Zk_gEu_4XD,Sindhi,SND,https://iso639-3.sil.org/code/snd,https://glottolog.org/resource/languoid/id/sind1272,http://www.wikidata.org/entity/Q33997
duKn_okc_J3Q,Shona,SNA,https://iso639-3.sil.org/code/sna,https://glottolog.org/resource/languoid/id/shon1251,http://www.wikidata.org/entity/Q34004
Wj1F_2BF_vtm,Koreanska,KOR,https://iso639-3.sil.org/code/kor,https://glottolog.org/resource/languoid/id/kore1280,http://www.wikidata.org/entity/Q9176
Ev2g_L1i_D62,Osage,OSA,https://iso639-3.sil.org/code/osa,https://glottolog.org/resource/languoid/id/osag1243,http://www.wikidata.org/entity/Q2600085
Ji47_WT1_NKN,Ossetiska,OSS,https://iso639-3.sil.org/code/oss,https://glottolog.org/resource/languoid/id/iron1242,http://www.wikidata.org/entity/Q33968
anHt_dxL_Yvo,Sasak,SAS,https://iso639-3.sil.org/code/sas,https://glottolog.org/resource/languoid/id/sasa1249,http://www.wikidata.org/entity/Q1294047
B9Dx_jN8_QZg,Zuni,ZUN,https://iso639-3.sil.org/code/zun,https://glottolog.org/resource/languoid/id/zuni1245,http://www.wikidata.org/entity/Q10188
hWuY_56Y_gEA,Yoruba,YOR,https://iso639-3.sil.org/code/yor,https://glottolog.org/resource/languoid/id/yoru1245,http://www.wikidata.org/entity/Q34311
Nojx_VyS_nLf,Indonesiska,IND,https://iso639-3.sil.org/code/ind,https://glottolog.org/resource/languoid/id/indo1316,http://www.wikidata.org/entity/Q9240
Utfp_DGP_qCS,Chuukesiska,CHK,https://iso639-3.sil.org/code/chk,https://glottolog.org/resource/languoid/id/chuu1238,http://www.wikidata.org/entity/Q33161
T3kB_EuD_ReH,Mossi,MOS,https://iso639-3.sil.org/code/mos,https://glottolog.org/resource/languoid/id/moss1236,http://www.wikidata.org/entity/Q36096
kQvM_k1N_nne,Samaritansk aramaiska,SAM,https://iso639-3.sil.org/code/sam,https://glottolog.org/resource/languoid/id/sama1314,http://www.wikidata.org/entity/Q56612
7nWL_Bzc_RFQ,Latin,LAT,https://iso639-3.sil.org/code/lat,https://glottolog.org/resource/languoid/id/lati1261,http://www.wikidata.org/entity/Q397
kBKA_GoN_CrX,Montenegrinska,CNR,https://iso639-3.sil.org/code/cnr,https://glottolog.org/resource/languoid/id/mont1282,http://www.wikidata.org/entity/Q8821
YiQE_ERm_7kh,Lettiska,LAV,https://iso639-3.sil.org/code/lav,https://glottolog.org/resource/languoid/id/latv1249,http://www.wikidata.org/entity/Q9078
yXoA_zAJ_RoN,Iriska,GLE,https://iso639-3.sil.org/code/gle,https://glottolog.org/resource/languoid/id/iris1253,http://www.wikidata.org/entity/Q9142
J6dh_R8z_Ja4,Mongolska,MON,https://iso639-3.sil.org/code/mon,https://glottolog.org/resource/languoid/id/mong1331,http://www.wikidata.org/entity/Q9246
H3Mn_eaX_XbQ,Kirgisiska,KIR,https://iso639-3.sil.org/code/kir,https://glottolog.org/resource/languoid/id/kirg1245,http://www.wikidata.org/entity/Q9255
s6ka_gDZ_Ycb,Mohawk,MOH,https://iso639-3.sil.org/code/moh,https://glottolog.org/resource/languoid/id/moha1258,http://www.wikidata.org/entity/Q13339
pnjj_2JX_Fub,Norska,NOR,https://iso639-3.sil.org/code/nor,https://glottolog.org/resource/languoid/id/norw1258,http://www.wikidata.org/entity/Q9043
KPgw_t5P_759,Fon,FON,https://iso639-3.sil.org/code/fon,https://glottolog.org/resource/languoid/id/fonn1241,http://www.wikidata.org/entity/Q33291
u4QL_MM1_3zA,Tamil/Tamilska,TAM,https://iso639-3.sil.org/code/tam,https://glottolog.org/resource/languoid/id/tami1289,http://www.wikidata.org/entity/Q5885
3ueP_nhZ_1em,Micmac,MIC,https://iso639-3.sil.org/code/mic,https://glottolog.org/resource/languoid/id/mikm1235,http://www.wikidata.org/entity/Q13321
XDyM_jnY_2XB,Gayo,GAY,https://iso639-3.sil.org/code/gay,https://glottolog.org/resource/languoid/id/gayo1244,http://www.wikidata.org/entity/Q33286
mxQt_Uiv_X9B,Chibcha,CHB,https://iso639-3.sil.org/code/chb,https://glottolog.org/resource/languoid/id/chib1270,http://www.wikidata.org/entity/Q2356431
WV6s_E7d_hBp,Sanskrit,SAN,https://iso639-3.sil.org/code/san,https://glottolog.org/resource/languoid/id/sans1269,http://www.wikidata.org/entity/Q11059
f3zb_p1z_JDE,Ganda,LUG,https://iso639-3.sil.org/code/lug,https://glottolog.org/resource/languoid/id/gand1255,http://www.wikidata.org/entity/Q33368
hYDU_LrU_QCt,Hiri Motu,HMO,https://iso639-3.sil.org/code/hmo,https://glottolog.org/resource/languoid/id/hiri1237,http://www.wikidata.org/entity/Q33617
MzzG_eb7_ojB,Occitanska,OCI,https://iso639-3.sil.org/code/oci,https://glottolog.org/resource/languoid/id/occi1239,http://www.wikidata.org/entity/Q14185
zkF9_QE5_3sL,Nyöstsyriska,AII,https://iso639-3.sil.org/code/aii,https://glottolog.org/resource/languoid/id/assy1241,http://www.wikidata.org/entity/Q29440
br9N_CBK_BCz,Gilbertesiska,GIL,https://iso639-3.sil.org/code/gil,https://glottolog.org/resource/languoid/id/gilb1244,http://www.wikidata.org/entity/Q30898
HnUQ_rah_Akr,Duala,DUA,https://iso639-3.sil.org/code/dua,https://glottolog.org/resource/languoid/id/dual1243,http://www.wikidata.org/entity/Q33013
TKMX_Mgp_roJ,Kinyarwanda,KIN,https://iso639-3.sil.org/code/kin,https://glottolog.org/resource/languoid/id/kiny1244,http://www.wikidata.org/entity/Q33573
QHQc_Thx_KyY,Votiska,VOT,https://iso639-3.sil.org/code/vot,https://glottolog.org/resource/languoid/id/voti1245,http://www.wikidata.org/entity/Q32858
qhwA_Zhw_XLy,Samoanska,SMO,https://iso639-3.sil.org/code/smo,https://glottolog.org/resource/languoid/id/samo1305,http://www.wikidata.org/entity/Q34011
Zrmd_kmh_AtN,Tereno,TER,https://iso639-3.sil.org/code/ter,https://glottolog.org/resource/languoid/id/tere1279,http://www.wikidata.org/entity/Q3314742
pKgd_UJA_ahC,Walamo,WAL,https://iso639-3.sil.org/code/wal,https://glottolog.org/resource/languoid/id/wola1242,http://www.wikidata.org/entity/Q36943
Qgzp_mLJ_4tr,Mariska,CHM,https://iso639-3.sil.org/code/chm,https://glottolog.org/resource/languoid/id/mari1278,http://www.wikidata.org/entity/Q973685
8DQh_CaG_Jsk,Kamba,KAM,https://iso639-3.sil.org/code/kam,https://glottolog.org/resource/languoid/id/kamb1297,http://www.wikidata.org/entity/Q2574767
ChZf_oUX_fKG,Tadjikiska,TGK,https://iso639-3.sil.org/code/tgk,https://glottolog.org/resource/languoid/id/taji1245,http://www.wikidata.org/entity/Q9260
cMMJ_usJ_o6P,Lunda,LUN,https://iso639-3.sil.org/code/lun,https://glottolog.org/resource/languoid/id/lund1266,http://www.wikidata.org/entity/Q33607
AGKq_3n1_4sm,Bosniska,BOS,https://iso639-3.sil.org/code/bos,https://glottolog.org/resource/languoid/id/bosn1245,http://www.wikidata.org/entity/Q9303
popv_w4d_5uB,Susu,SUS,https://iso639-3.sil.org/code/sus,https://glottolog.org/resource/languoid/id/susu1250,http://www.wikidata.org/entity/Q33990
YAw2_WRr_SAZ,Tahitiska,TAH,https://iso639-3.sil.org/code/tah,https://glottolog.org/resource/languoid/id/tahi1242,http://www.wikidata.org/entity/Q34128
4Qvn_5N7_AVk,Tigre,TIG,https://iso639-3.sil.org/code/tig,https://glottolog.org/resource/languoid/id/tigr1270,http://www.wikidata.org/entity/Q34129
yTWE_vfZ_HNB,Tiv,TIV,https://iso639-3.sil.org/code/tiv,https://glottolog.org/resource/languoid/id/tivv1240,http://www.wikidata.org/entity/Q34131
yA84_KQv_pKJ,Luba-Lulua,LUA,https://iso639-3.sil.org/code/lua,https://glottolog.org/resource/languoid/id/luba1249,http://www.wikidata.org/entity/Q34173
ZLh2_Qtx_GQm,Washo,WAS,https://iso639-3.sil.org/code/was,https://glottolog.org/resource/languoid/id/wash1253,http://www.wikidata.org/entity/Q34198
WA3P_FfD_nmy,Gammelpersiska,PEO,https://iso639-3.sil.org/code/peo,https://glottolog.org/resource/languoid/id/oldp1254,http://www.wikidata.org/entity/Q35225
QhX2_SiT_PYf,Luba-Katanga,LUB,https://iso639-3.sil.org/code/lub,https://glottolog.org/resource/languoid/id/luba1250,http://www.wikidata.org/entity/Q36157
rYw9_SHt_yWk,Yao,YAO,https://iso639-3.sil.org/code/yao,https://glottolog.org/resource/languoid/id/yaoo1241,http://www.wikidata.org/entity/Q36902
vk8M_mQD_JtZ,Korniska,COR,https://iso639-3.sil.org/code/cor,https://glottolog.org/resource/languoid/id/corn1251,http://www.wikidata.org/entity/Q25289
6vC5_KFf_rKT,Ga,GAA,https://iso639-3.sil.org/code/gaa,https://glottolog.org/resource/languoid/id/gaaa1244,http://www.wikidata.org/entity/Q33287
Y3nz_qvd_DBW,Cree,CRE,https://iso639-3.sil.org/code/cre,https://glottolog.org/resource/languoid/id/cree1272,http://www.wikidata.org/entity/Q33390
wspL_wxs_ud5,Sango,SAG,https://iso639-3.sil.org/code/sag,https://glottolog.org/resource/languoid/id/sang1328,http://www.wikidata.org/entity/Q33954
Vfz9_yba_MkG,Efik,EFI,https://iso639-3.sil.org/code/efi,https://glottolog.org/resource/languoid/id/efik1245,http://www.wikidata.org/entity/Q35377
9RmN_zLz_k9H,Pahlavi,PAL,https://iso639-3.sil.org/code/pal,https://glottolog.org/resource/languoid/id/pahl1241,http://www.wikidata.org/entity/Q32063
MXbX_9Du_nkp,Dakota,DAK,https://iso639-3.sil.org/code/dak,https://glottolog.org/resource/languoid/id/dako1258,http://www.wikidata.org/entity/Q530384
Agwy_4Hu_NTY,Nzima,NZI,https://iso639-3.sil.org/code/nzi,https://glottolog.org/resource/languoid/id/nzim1238,http://www.wikidata.org/entity/Q36337
w9hf_iyH_FCH,Saho,SSY,https://iso639-3.sil.org/code/ssy,https://glottolog.org/resource/languoid/id/saho1246,http://www.wikidata.org/entity/Q36353
TWvN_hko_Uk5,Umbundu,UMB,https://iso639-3.sil.org/code/umb,https://glottolog.org/resource/languoid/id/umbu1257,http://www.wikidata.org/entity/Q36983
T3Yk_ZEt_kLQ,Bambara,BAM,https://iso639-3.sil.org/code/bam,https://glottolog.org/resource/languoid/id/bamb1269,http://www.wikidata.org/entity/Q33243
u9Rr_v5c_iT2,Slaviska (Athapascaniska),DEN,https://iso639-3.sil.org/code/den,https://glottolog.org/resource/languoid/id/slav1253,http://www.wikidata.org/entity/Q13272
WzGi_zgx_pbJ,Avariska,AVA,https://iso639-3.sil.org/code/ava,https://glottolog.org/resource/languoid/id/avar1256,http://www.wikidata.org/entity/Q29561
wfdT_62G_T49,Tjetjenska,CHE,https://iso639-3.sil.org/code/che,https://glottolog.org/resource/languoid/id/chec1245,http://www.wikidata.org/entity/Q33350
nc4p_BwA_2HH,Bemba,BEM,https://iso639-3.sil.org/code/bem,https://glottolog.org/resource/languoid/id/bemb1257,http://www.wikidata.org/entity/Q33052
sVLN_wnV_MxS,Tonga (Nyasa),TOG,https://iso639-3.sil.org/code/tog,https://glottolog.org/resource/languoid/id/tong1321,http://www.wikidata.org/entity/Q3847648
A5So_xQX_T59,Caddo,CAD,https://iso639-3.sil.org/code/cad,https://glottolog.org/resource/languoid/id/cadd1256,http://www.wikidata.org/entity/Q56756
gXVC_bNa_VdA,Inupiak,IPK,https://iso639-3.sil.org/code/ipk,https://glottolog.org/resource/languoid/id/inup1234,http://www.wikidata.org/entity/Q27183
KVSQ_4pu_RSs,Komi,KOM,https://iso639-3.sil.org/code/kom,https://glottolog.org/resource/languoid/id/komi1267,http://www.wikidata.org/entity/Q36126
ttMr_bG7_Go7,Dogri,DOI,https://iso639-3.sil.org/code/doi,https://glottolog.org/resource/languoid/id/indo1311,http://www.wikidata.org/entity/Q5583349
4tXr_2NX_SSy,Abkhasiska,ABK,https://iso639-3.sil.org/code/abk,https://glottolog.org/resource/languoid/id/abkh1244,http://www.wikidata.org/entity/Q5111
yGZ2_39H_oPN,Danska,DAN,https://iso639-3.sil.org/code/dan,https://glottolog.org/resource/languoid/id/dani1285,http://www.wikidata.org/entity/Q9035
Cs9j_jSN_wNH,Ungerska,HUN,https://iso639-3.sil.org/code/hun,https://glottolog.org/resource/languoid/id/hung1274,http://www.wikidata.org/entity/Q9067
CFaA_CXW_ZLx,Choctaw,CHO,https://iso639-3.sil.org/code/cho,https://glottolog.org/resource/languoid/id/choc1276,http://www.wikidata.org/entity/Q32979
43Dr_HRx_rRx,Adangme,ADA,https://iso639-3.sil.org/code/ada,https://glottolog.org/resource/languoid/id/adan1247,http://www.wikidata.org/entity/Q35141
tfxQ_bTn_jVT,Tsjinuksjargong,CHN,https://iso639-3.sil.org/code/chn,https://glottolog.org/resource/languoid/id/chin1272,http://www.wikidata.org/entity/Q35173
1zy3_huH_ic1,Gammelprovecanska,PRO,https://iso639-3.sil.org/code/pro,https://glottolog.org/resource/languoid/id/oldp1253,http://www.wikidata.org/entity/Q2779185
4Vfp_k1i_j59,Luo (Kenya och Tanzania),LUO,https://iso639-3.sil.org/code/luo,https://glottolog.org/resource/languoid/id/luok1236,http://www.wikidata.org/entity/Q5414796
ocLM_QVf_661,Retoromanska,ROH,https://iso639-3.sil.org/code/roh,https://glottolog.org/resource/languoid/id/roma1326,http://www.wikidata.org/entity/Q13199
yPxq_rk8_QqY,Basjkiriska,BAK,https://iso639-3.sil.org/code/bak,https://glottolog.org/resource/languoid/id/bash1264,http://www.wikidata.org/entity/Q13389
nUfQ_bem_j5n,Fulfulde,FUL,https://iso639-3.sil.org/code/ful,https://glottolog.org/resource/languoid/id/fula1264,http://www.wikidata.org/entity/Q33454
i2A1_KpM_osQ,Kirundi,RUN,https://iso639-3.sil.org/code/run,https://glottolog.org/resource/languoid/id/rund1242,http://www.wikidata.org/entity/Q33583
sXAB_vhU_zN8,Kuanyama,KUA,https://iso639-3.sil.org/code/kua,https://glottolog.org/resource/languoid/id/kuan1247,http://www.wikidata.org/entity/Q1405077
b9cE_KXy_Yxv,Italienska,ITA,https://iso639-3.sil.org/code/ita,https://glottolog.org/resource/languoid/id/ital1282,http://www.wikidata.org/entity/Q652
obg3_pig_x58,Jiddisch,YID,https://iso639-3.sil.org/code/yid,https://glottolog.org/resource/languoid/id/yidd1255,http://www.wikidata.org/entity/Q8641
H9bz_4TN_vL5,Slovenska,SLV,https://iso639-3.sil.org/code/slv,https://glottolog.org/resource/languoid/id/slov1268,http://www.wikidata.org/entity/Q9063
KBWH_gdK_uVB,Zapotekiska,ZAP,https://iso639-3.sil.org/code/zap,https://glottolog.org/resource/languoid/id/zapo1437,http://www.wikidata.org/entity/Q13214
RD8Y_xdr_zdh,Zhuang,ZHA,https://iso639-3.sil.org/code/zha,https://glottolog.org/resource/languoid/id/nort3180,http://www.wikidata.org/entity/Q13216
5vWL_41L_udS,Afar,AAR,https://iso639-3.sil.org/code/aar,https://glottolog.org/resource/languoid/id/afar1241,http://www.wikidata.org/entity/Q27811
5G9f_Xs6_R9R,Hupa,HUP,https://iso639-3.sil.org/code/hup,https://glottolog.org/resource/languoid/id/hupa1239,http://www.wikidata.org/entity/Q28058
XFGV_NHd_eaf,Divehi,DIV,https://iso639-3.sil.org/code/div,https://glottolog.org/resource/languoid/id/dhiv1236,http://www.wikidata.org/entity/Q32656
DJfZ_4fk_kwb,Siksika,BLA,https://iso639-3.sil.org/code/bla,https://glottolog.org/resource/languoid/id/siks1238,http://www.wikidata.org/entity/Q33060
kNtt_ZNR_N23,Igbo,IBO,https://iso639-3.sil.org/code/ibo,https://glottolog.org/resource/languoid/id/nucl1417,http://www.wikidata.org/entity/Q33578
eW8E_sSU_sbS,Lozi,LOZ,https://iso639-3.sil.org/code/loz,https://glottolog.org/resource/languoid/id/lozi1239,http://www.wikidata.org/entity/Q33628
ER1i_tUG_y4e,Makassar,MAK,https://iso639-3.sil.org/code/mak,https://glottolog.org/resource/languoid/id/maka1311,http://www.wikidata.org/entity/Q33643
qmex_uW7_kJw,Japanska,JPN,https://iso639-3.sil.org/code/jpn,https://glottolog.org/resource/languoid/id/nucl1643,http://www.wikidata.org/entity/Q5287
zkfD_Qwv_kTk,Ukrainska,UKR,https://iso639-3.sil.org/code/ukr,https://glottolog.org/resource/languoid/id/ukra1253,http://www.wikidata.org/entity/Q8798
a1wy_pzH_aQv,Grönländska,KAL,https://iso639-3.sil.org/code/kal,https://glottolog.org/resource/languoid/id/kala1399,http://www.wikidata.org/entity/Q25355
PZH4_EGP_Dz3,Kimbundu,KMB,https://iso639-3.sil.org/code/kmb,https://glottolog.org/resource/languoid/id/kimb1241,http://www.wikidata.org/entity/Q35891
cxiY_CBR_1Ve,Mandarin,MDR,https://iso639-3.sil.org/code/mdr,https://glottolog.org/resource/languoid/id/mand1442,http://www.wikidata.org/entity/Q35995
xYJh_6Ez_4Md,Assyriska,ALL,https://iso639-3.sil.org/code/all,https://glottolog.org/resource/languoid/id/alla1247,http://www.wikidata.org/entity/Q3393634
Gp9q_gTW_XAw,Polska,POL,https://iso639-3.sil.org/code/pol,https://glottolog.org/resource/languoid/id/poli1260,http://www.wikidata.org/entity/Q809
PZa9_wAR_1BZ,Luxemburgiska,LTZ,https://iso639-3.sil.org/code/ltz,https://glottolog.org/resource/languoid/id/luxe1241,http://www.wikidata.org/entity/Q9051
mdWX_4PC_wY7,Kazakiska,KAZ,https://iso639-3.sil.org/code/kaz,https://glottolog.org/resource/languoid/id/kaza1248,http://www.wikidata.org/entity/Q9252
uWA3_QLq_nu3,Hebreiska,HEB,https://iso639-3.sil.org/code/heb,https://glottolog.org/resource/languoid/id/hebr1245,http://www.wikidata.org/entity/Q9288
69WT_Knh_hLs,Gaeliska (Skotsk),GLA,https://iso639-3.sil.org/code/gla,https://glottolog.org/resource/languoid/id/scot1245,http://www.wikidata.org/entity/Q9314
c2mi_duS_MDX,Aleutiska,ALE,https://iso639-3.sil.org/code/ale,https://glottolog.org/resource/languoid/id/aleu1260,http://www.wikidata.org/entity/Q27210
FyZY_BJZ_yz6,Chamorro,CHA,https://iso639-3.sil.org/code/cha,https://glottolog.org/resource/languoid/id/cham1312,http://www.wikidata.org/entity/Q33262
Jw1X_vyk_SbY,Urdu,URD,https://iso639-3.sil.org/code/urd,https://glottolog.org/resource/languoid/id/urdu1245,http://www.wikidata.org/entity/Q1617
pLK6_YGd_bDZ,Gwich'in,GWI,https://iso639-3.sil.org/code/gwi,https://glottolog.org/resource/languoid/id/gwic1235,http://www.wikidata.org/entity/Q21057
EMhG_wnR_hYP,Amhariska,AMH,https://iso639-3.sil.org/code/amh,https://glottolog.org/resource/languoid/id/amha1245,http://www.wikidata.org/entity/Q28244
DKjf_DVV_vxC,Acoli,ACH,https://iso639-3.sil.org/code/ach,https://glottolog.org/resource/languoid/id/acol1236,http://www.wikidata.org/entity/Q34926
MZ9f_S5d_6Wo,Kumykiska,KUM,https://iso639-3.sil.org/code/kum,https://glottolog.org/resource/languoid/id/kumy1244,http://www.wikidata.org/entity/Q36209
aRMQ_MKY_kwp,Éwondo,EWO,https://iso639-3.sil.org/code/ewo,https://glottolog.org/resource/languoid/id/ewon1239,http://www.wikidata.org/entity/Q35459
3rPm_Muj_kJT,Ndebele Nord,NDE,https://iso639-3.sil.org/code/nde,https://glottolog.org/resource/languoid/id/nort2795,http://www.wikidata.org/entity/Q35613
JDk9_Yia_DPQ,Marshalliska,MAH,https://iso639-3.sil.org/code/mah,https://glottolog.org/resource/languoid/id/mars1254,http://www.wikidata.org/entity/Q36280
J4aC_yPX_Sgt,Arawak,ARW,https://iso639-3.sil.org/code/arw,https://glottolog.org/resource/languoid/id/araw1276,http://www.wikidata.org/entity/Q2655664
Kpju_m4q_31i,Delaware,DEL,https://iso639-3.sil.org/code/del,https://glottolog.org/resource/languoid/id/comm1246,http://www.wikidata.org/entity/Q2665761
6VZ8_y2a_ViA,Burjatiska,BUA,https://iso639-3.sil.org/code/bua,https://glottolog.org/resource/languoid/id/buri1258,http://www.wikidata.org/entity/Q33120
7EYg_JZj_aU8,Tagalog,TGL,https://iso639-3.sil.org/code/tgl,https://glottolog.org/resource/languoid/id/taga1270,http://www.wikidata.org/entity/Q34057
PwxQ_XQT_MnB,Hindi,HIN,https://iso639-3.sil.org/code/hin,https://glottolog.org/resource/languoid/id/hind1269,http://www.wikidata.org/entity/Q1568
FCsC_s5t_dU2,Sandawe,SAD,https://iso639-3.sil.org/code/sad,https://glottolog.org/resource/languoid/id/sand1273,http://www.wikidata.org/entity/Q34016
V5kR_n15_m1D,Avestiska,AVE,https://iso639-3.sil.org/code/ave,https://glottolog.org/resource/languoid/id/aves1237,http://www.wikidata.org/entity/Q29572
5FUu_wLF_tTf,Ewe,EWE,https://iso639-3.sil.org/code/ewe,https://glottolog.org/resource/languoid/id/ewee1241,http://www.wikidata.org/entity/Q30005
ufzT_NXJ_Gbx,Haida,HAI,https://iso639-3.sil.org/code/hai,https://glottolog.org/resource/languoid/id/haid1248,http://www.wikidata.org/entity/Q33303
EwW1_aQH_EXu,Nyoro,NYO,https://iso639-3.sil.org/code/nyo,https://glottolog.org/resource/languoid/id/nyor1246,http://www.wikidata.org/entity/Q33794
ECrL_6pW_Zuz,Sesotho/Sesuto/Sotho,SOT,https://iso639-3.sil.org/code/sot,https://glottolog.org/resource/languoid/id/sout2807,http://www.wikidata.org/entity/Q34340
Gi82_GNa_Uvu,Soninke,SNK,https://iso639-3.sil.org/code/snk,https://glottolog.org/resource/languoid/id/soni1259,http://www.wikidata.org/entity/Q36660
uVrS_Lx3_7N2,Pali,PLI,https://iso639-3.sil.org/code/pli,https://glottolog.org/resource/languoid/id/pali1273,http://www.wikidata.org/entity/Q36727
h3RJ_dgP_MxH,Vai,VAI,https://iso639-3.sil.org/code/vai,https://glottolog.org/resource/languoid/id/vaii1241,http://www.wikidata.org/entity/Q36939
LaYc_2hR_4i1,Zenaga,ZEN,https://iso639-3.sil.org/code/zen,https://glottolog.org/resource/languoid/id/zena1248,http://www.wikidata.org/entity/Q37005
zYgB_czd_R1x,Assamesiska,ASM,https://iso639-3.sil.org/code/asm,https://glottolog.org/resource/languoid/id/assa1263,http://www.wikidata.org/entity/Q29401
Lozg_qhA_r3y,Dari,PRS,https://iso639-3.sil.org/code/prs,https://glottolog.org/resource/languoid/id/dari1249,http://www.wikidata.org/entity/Q178440
kMxH_v1Y_jcW,Medelhögtyska,GMH,https://iso639-3.sil.org/code/gmh,https://glottolog.org/resource/languoid/id/midd1343,http://www.wikidata.org/entity/Q837985
8ZiC_PNc_hkY,Ndebele Syd,NBL,https://iso639-3.sil.org/code/nbl,https://glottolog.org/resource/languoid/id/sout3270,http://www.wikidata.org/entity/Q36785
nX5K_BFZ_CGM,Geez,GEZ,https://iso639-3.sil.org/code/gez,https://glottolog.org/resource/languoid/id/geez1241,http://www.wikidata.org/entity/Q35667
sGCA_SoQ_VDz,Venda,VEN,https://iso639-3.sil.org/code/ven,https://glottolog.org/resource/languoid/id/vend1245,http://www.wikidata.org/entity/Q32704
nPzh_1oc_EKz,Tigrinja/Tigrinska,TIR,https://iso639-3.sil.org/code/tir,https://glottolog.org/resource/languoid/id/tigr1271,http://www.wikidata.org/entity/Q34124
Swhq_4Fg_qfm,Finska,FIN,https://iso639-3.sil.org/code/fin,https://glottolog.org/resource/languoid/id/finn1318,http://www.wikidata.org/entity/Q1412
D91H_7iz_Qbn,Gujarati,GUJ,https://iso639-3.sil.org/code/guj,https://glottolog.org/resource/languoid/id/guja1252,http://www.wikidata.org/entity/Q5137
RqHU_aEE_tJA,Vietnamesiska,VIE,https://iso639-3.sil.org/code/vie,https://glottolog.org/resource/languoid/id/viet1252,http://www.wikidata.org/entity/Q9199
txVD_z3R_P4q,Bretonska,BRE,https://iso639-3.sil.org/code/bre,https://glottolog.org/resource/languoid/id/bret1244,http://www.wikidata.org/entity/Q12107
1bwY_BGf_CH7,Dyula,DYU,https://iso639-3.sil.org/code/dyu,https://glottolog.org/resource/languoid/id/dyul1238,http://www.wikidata.org/entity/Q32706
8VkC_Gwt_jHy,Kaldeiska,CLD,https://iso639-3.sil.org/code/cld,https://glottolog.org/resource/languoid/id/chal1275,http://www.wikidata.org/entity/Q33236
Ur91_w7s_dP1,Bislama,BIS,https://iso639-3.sil.org/code/bis,https://glottolog.org/resource/languoid/id/bisl1239,http://www.wikidata.org/entity/Q35452
F6YW_uCL_xCN,Mende,MEN,https://iso639-3.sil.org/code/men,https://glottolog.org/resource/languoid/id/mend1266,http://www.wikidata.org/entity/Q1478672
3Xxo_J8v_rez,Uzbekiska,UZB,https://iso639-3.sil.org/code/uzb,https://glottolog.org/resource/languoid/id/uzbe1247,http://www.wikidata.org/entity/Q9264
vitY_dty_VbD,Afrikaans,AFR,https://iso639-3.sil.org/code/afr,https://glottolog.org/resource/languoid/id/afri1274,http://www.wikidata.org/entity/Q14196
NNHs_R1H_ESq,Javanesiska,JAV,https://iso639-3.sil.org/code/jav,https://glottolog.org/resource/languoid/id/java1254,http://www.wikidata.org/entity/Q33549
2s87_4M9_mF8,Gammalhögtyska,GOH,https://iso639-3.sil.org/code/goh,https://glottolog.org/resource/languoid/id/oldh1241,http://www.wikidata.org/entity/Q35218
kdXZ_zHa_KTB,Sogdiska,SOG,https://iso639-3.sil.org/code/sog,https://glottolog.org/resource/languoid/id/sogd1245,http://www.wikidata.org/entity/Q205979
qzy8_5NW_TDP,Tsimshian,TSI,https://iso639-3.sil.org/code/tsi,https://glottolog.org/resource/languoid/id/nucl1649,http://www.wikidata.org/entity/Q20085721
Xgng_L5L_T89,Gammalnorska,NOB,https://iso639-3.sil.org/code/nob,https://glottolog.org/resource/languoid/id/norw1259,http://www.wikidata.org/entity/Q25167
Lcsi_xHg_8UW,Nyanja,NYA,https://iso639-3.sil.org/code/nya,https://glottolog.org/resource/languoid/id/nyan1308,http://www.wikidata.org/entity/Q33273
fLPj_PDh_SQJ,Kutenai,KUT,https://iso639-3.sil.org/code/kut,https://glottolog.org/resource/languoid/id/kute1249,http://www.wikidata.org/entity/Q33434
e84R_V8f_fXS,Khasi,KHA,https://iso639-3.sil.org/code/kha,https://glottolog.org/resource/languoid/id/khas1269,http://www.wikidata.org/entity/Q33584
zAgM_Myz_xeD,Ndonga,NDO,https://iso639-3.sil.org/code/ndo,https://glottolog.org/resource/languoid/id/ndon1254,http://www.wikidata.org/entity/Q33900
b7BB_6HR_vNr,Tswana,TSN,https://iso639-3.sil.org/code/tsn,https://glottolog.org/resource/languoid/id/tswa1253,http://www.wikidata.org/entity/Q34137
2tws_aRJ_FC8,Tsonga,TSO,https://iso639-3.sil.org/code/tso,https://glottolog.org/resource/languoid/id/tson1249,http://www.wikidata.org/entity/Q34327
Ygzd_HiY_Ksk,Nyamwezi,NYM,https://iso639-3.sil.org/code/nym,https://glottolog.org/resource/languoid/id/nyam1276,http://www.wikidata.org/entity/Q4121131
oJMr_g3f_9Z9,Maltesiska,MLT,https://iso639-3.sil.org/code/mlt,https://glottolog.org/resource/languoid/id/malt1254,http://www.wikidata.org/entity/Q9166
LrSS_yQQ_w6c,Khmer,KHM,https://iso639-3.sil.org/code/khm,https://glottolog.org/resource/languoid/id/cent1989,http://www.wikidata.org/entity/Q9205
ECih_Cev_hwd,Thailändska,THA,https://iso639-3.sil.org/code/tha,https://glottolog.org/resource/languoid/id/thai1261,http://www.wikidata.org/entity/Q9217
32J8_SCe_3gR,Manx,GLV,https://iso639-3.sil.org/code/glv,https://glottolog.org/resource/languoid/id/manx1243,http://www.wikidata.org/entity/Q12175
ZExV_tjM_Nbo,Xhosa/Isixhosa,XHO,https://iso639-3.sil.org/code/xho,https://glottolog.org/resource/languoid/id/xhos1239,http://www.wikidata.org/entity/Q13218
8RMF_7gP_NaH,Bhutanesiska,DZO,https://iso639-3.sil.org/code/dzo,https://glottolog.org/resource/languoid/id/dzon1239,http://www.wikidata.org/entity/Q33081
g6Up_z8D_oAY,Pashto,PUS,https://iso639-3.sil.org/code/pus,https://glottolog.org/resource/languoid/id/nucl1276,http://www.wikidata.org/entity/Q58680
agM1_4uk_nHZ,Selkupiska,SEL,https://iso639-3.sil.org/code/sel,https://glottolog.org/resource/languoid/id/selk1253,http://www.wikidata.org/entity/Q34008
mZVe_5Ug_ncD,Tlingit,TLI,https://iso639-3.sil.org/code/tli,https://glottolog.org/resource/languoid/id/tlin1245,http://www.wikidata.org/entity/Q27792
HJSu_QbW_htd,Sukuma,SUK,https://iso639-3.sil.org/code/suk,https://glottolog.org/resource/languoid/id/suku1261,http://www.wikidata.org/entity/Q2638144
zSLA_vw2_FXN,Svenska,SWE,https://iso639-3.sil.org/code/swe,https://glottolog.org/resource/languoid/id/swed1254,http://www.wikidata.org/entity/Q9027
Mhbn_hgq_sa6,Zulu,ZUL,https://iso639-3.sil.org/code/zul,https://glottolog.org/resource/languoid/id/zulu1248,http://www.wikidata.org/entity/Q10179
tAM8_qNg_sW5,Uiguriska,UIG,https://iso639-3.sil.org/code/uig,https://glottolog.org/resource/languoid/id/uigh1240,http://www.wikidata.org/entity/Q13263
utaN_9Tq_yM3,Dogrib,DGR,https://iso639-3.sil.org/code/dgr,https://glottolog.org/resource/languoid/id/dogr1252,http://www.wikidata.org/entity/Q20979
Tzjp_quT_tX2,Bedja,BEJ,https://iso639-3.sil.org/code/bej,https://glottolog.org/resource/languoid/id/beja1238,http://www.wikidata.org/entity/Q33025
W5rh_1Ec_sox,Judeo-persiska,JPR,https://iso639-3.sil.org/code/jpr,https://glottolog.org/resource/languoid/id/jude1257,http://www.wikidata.org/entity/Q33367
kpf7_mGV_EWk,Kasmiriska,KAS,https://iso639-3.sil.org/code/kas,https://glottolog.org/resource/languoid/id/kash1277,http://www.wikidata.org/entity/Q33552
cnGc_92Q_oex,Tokelau,TKL,https://iso639-3.sil.org/code/tkl,https://glottolog.org/resource/languoid/id/toke1240,http://www.wikidata.org/entity/Q34097
H2Le_YR5_AnM,Hiligaynon,HIL,https://iso639-3.sil.org/code/hil,https://glottolog.org/resource/languoid/id/hili1240,http://www.wikidata.org/entity/Q35978
yh9H_efB_UFJ,Nyankole,NYN,https://iso639-3.sil.org/code/nyn,https://glottolog.org/resource/languoid/id/nyan1307,http://www.wikidata.org/entity/Q13207
nTYu_SG6_CNa,Kurmanji,KMR,https://iso639-3.sil.org/code/kmr,https://glottolog.org/resource/languoid/id/nort2641,http://www.wikidata.org/entity/Q36163
aF96_PaA_VAs,Khotanesiska,KHO,https://iso639-3.sil.org/code/kho,https://glottolog.org/resource/languoid/id/khot1251,http://www.wikidata.org/entity/Q6583551
uDkg_vvB_DsN,Afrihili,AFH,https://iso639-3.sil.org/code/afh,https://glottolog.org/resource/languoid/id/afri1275,
pYrC_AU4_73N,Akkadiska,AKK,https://iso639-3.sil.org/code/akk,https://glottolog.org/resource/languoid/id/akka1240,
FnFC_4cc_heD,Chagatai,CHG,https://iso639-3.sil.org/code/chg,https://glottolog.org/resource/languoid/id/chag1247,
WfH2_RjG_CyW,Kyrkslaviska,CHU,https://iso639-3.sil.org/code/chu,https://glottolog.org/resource/languoid/id/chur1257,
bJXz_kjT_LfC,Egyptiska,EGY,https://iso639-3.sil.org/code/egy,https://glottolog.org/resource/languoid/id/egyp1246,
NCju_o5B_Qhv,Elamitiska,ELX,https://iso639-3.sil.org/code/elx,https://glottolog.org/resource/languoid/id/elam1244,
aqBv_yoE_YVf,Esperanto,EPO,https://iso639-3.sil.org/code/epo,https://glottolog.org/resource/languoid/id/espe1235,
L4AS_T9o_VwB,Fang,FAN,https://iso639-3.sil.org/code/fan,https://glottolog.org/resource/languoid/id/fang1246,
GB2g_Bhp_zh7,Gotiska,GOT,https://iso639-3.sil.org/code/got,https://glottolog.org/resource/languoid/id/goth1244,
D8L1_GrU_UEk,Hettittiska,HIT,https://iso639-3.sil.org/code/hit,https://glottolog.org/resource/languoid/id/hitt1242,
dWU4_ed7_jX6,Interlingua,ILE,https://iso639-3.sil.org/code/ile,https://glottolog.org/resource/languoid/id/inte1260,
DuPf_Z28_3Jv,Kawi,KAW,https://iso639-3.sil.org/code/kaw,https://glottolog.org/resource/languoid/id/kawi1241,
8G95_iDg_rtV,Medelirisk,MGA,https://iso639-3.sil.org/code/mga,https://glottolog.org/resource/languoid/id/midd1360,
vWfd_Xrt_hPJ,Moldaviska,MOL,https://iso639-3.sil.org/code/mol,https://glottolog.org/resource/languoid/id/mold1248,
518r_2Eg_WKo,Maduresiska,MAD,https://iso639-3.sil.org/code/mad,https://glottolog.org/resource/languoid/id/nucl1460,
hUGZ_TrC_T7v,Gammelengelska,ANG,https://iso639-3.sil.org/code/ang,https://glottolog.org/resource/languoid/id/olde1238,
8VDp_XA9_dBF,Gammaliriska,SGA,https://iso639-3.sil.org/code/sga,https://glottolog.org/resource/languoid/id/oldi1245,
4eqr_GrX_XM6,Ottomanturkiska,OTA,https://iso639-3.sil.org/code/ota,https://glottolog.org/resource/languoid/id/otto1234,
s6D9_CAD_eMB,Sumeriska,SUX,https://iso639-3.sil.org/code/sux,https://glottolog.org/resource/languoid/id/sume1241,
RUJ6_xGA_eUN,Tonganska,TON,https://iso639-3.sil.org/code/ton,https://glottolog.org/resource/languoid/id/tong1325,
BWtj_uTy_nUS,Tamashek,TMH,https://iso639-3.sil.org/code/tmh,https://glottolog.org/resource/languoid/id/tuar1240,
SMdj_4DK_D7D,Volapük,VOL,https://iso639-3.sil.org/code/vol,https://glottolog.org/resource/languoid/id/vola1234,
