Section,Requirement,Strength,Do we satisfy it? (Y/n/?),Comment
Code in the open,All source code for any software in use (unless used for fraud detection) MUST be published and publicly accessible.,MUST,Y,
,All source code for any policy in use (unless used for fraud detection) MUST be published and publicly accessible.,MUST,Y,
,"The codebase MUST NOT contain sensitive information regarding users, their organization or third parties.",MUST,Y,
,"Any source code not currently in use (such as new versions, proposals or older versions) SHOULD be published.",SHOULD,Y,
,Documenting which source code or policy underpins any specific interaction the general public may have with an organization is OPTIONAL.,OPTIONAL,?,
Bundle policy and source code,The codebase MUST include the policy that the source code is based on.,MUST,?,Do we have a policy?s
,"If a policy is based on source code, that source code MUST be included in the codebase, unless used for fraud detection.",MUST,?,
,Policy SHOULD be provided in machine-readable and unambiguous formats.,SHOULD,?,
,Continuous integration tests SHOULD validate that the source code and the policy are executed coherently.,SHOULD,?,
Make the codebase reusable and portable,The codebase MUST be developed to be reusable in different contexts.,MUST,Y,
,"The codebase MUST be independent from any secret, undisclosed, proprietary or non-open licensed software or services for execution and understanding.",MUST,n,"Datomic is proprietary. We need to adopt an alternative, e.g. Datahike."
,The codebase SHOULD be in use by multiple parties.,SHOULD,?,
,The roadmap SHOULD be influenced by the needs of multiple parties.,SHOULD,?,
,The development of the codebase SHOULD be a collaboration between multiple parties.,SHOULD,Y,
,Configuration SHOULD be used to make source code adapt to context specific needs.,SHOULD,Y,
,The codebase SHOULD be localizable.,SHOULD,Y,
,Source code and its documentation SHOULD NOT contain situation-specific information.,SHOULD,Y,
,Codebase modules SHOULD be documented in such a way as to enable reuse in codebases in other contexts.,SHOULD,n,
,The software SHOULD NOT require services or platforms available from only a single vendor.,SHOULD,Y,
Welcome contributors,The codebase MUST allow anyone to submit suggestions for changes to the codebase.,MUST,Y,
,"The codebase MUST include contribution guidelines explaining what kinds of contributions are welcome and how contributors can get involved, for example in a CONTRIBUTING file.",MUST,?,
,"The codebase MUST document the governance of the codebase, contributions and its community, for example in a GOVERNANCE file.",MUST,?,
,The contribution guidelines SHOULD document who is expected to cover the costs of reviewing contributions.,SHOULD,n,
,The codebase SHOULD advertise the committed engagement of involved organizations in the development and maintenance.,SHOULD,n,
,The codebase SHOULD have a publicly available roadmap.,SHOULD,n,
,The codebase SHOULD publish codebase activity statistics.,SHOULD,Y,
,Including a code of conduct for contributors in the codebase is OPTIONAL.,OPTIONAL,n,
Make contributing easy,The codebase MUST have a public issue tracker that accepts suggestions from anyone.,MUST,Y,
,"The documentation MUST link to both the public issue tracker and submitted codebase changes, for example in a README file.",MUST,?,
,"The codebase MUST have communication channels for users and developers, for example email lists.",MUST,?,"There is JobTech forum and taxonomy-dev on Mattermost, but do we advertise them?"
,There MUST be a way to report security issues for responsible disclosure over a closed channel.,MUST,?,
,The documentation MUST include instructions for how to report potentially security sensitive issues.,MUST,?,
Maintain version control,All files in the codebase MUST be version controlled.,MUST,Y,
,All decisions MUST be documented in commit messages.,MUST,n,"This is not the case with current commits, but we can do it for future commits.s"
,Every commit message MUST link to discussions and issues wherever possible.,MUST,n,"This is not the case with current commits, but we can do it for future commits.s"
,The codebase SHOULD be maintained in a distributed version control system.,SHOULD,Y,
,Contribution guidelines SHOULD require contributors to group relevant changes in commits.,SHOULD,?,
,"Maintainers SHOULD mark released versions of the codebase, for example using revision tags or textual labels.",SHOULD,?,
,Contribution guidelines SHOULD encourage file formats where the changes within the files can be easily viewed and understood in the version control system.,SHOULD,n,
,"It is OPTIONAL for contributors to sign their commits and provide an email address, so that future contributors are able to contact past contributors with questions about their work.",OPTIONAL,Y,
Require review of contributions,All contributions that are accepted or committed to release versions of the codebase MUST be reviewed by another contributor.,MUST,Y,
,"Reviews MUST include source, policy, tests and documentation.",MUST,n,
,Reviewers MUST provide feedback on all decisions to not accept a contribution.,MUST,Y,
,"The review process SHOULD confirm that a contribution conforms to the standards, architecture and decisions set out in the codebase in order to pass review.",SHOULD,n,
,Reviews SHOULD include running both the software and the tests of the codebase.,SHOULD,n,
,Contributions SHOULD be reviewed by someone in a different context than the contributor.,SHOULD,n,
,Version control systems SHOULD NOT accept non-reviewed contributions in release versions.,SHOULD,?,Is it possible to push directly to main?
,Reviews SHOULD happen within two business days.,SHOULD,n,
,Performing reviews by multiple reviewers is OPTIONAL.,OPTIONAL,Y,
Document codebase objectives,"The codebase MUST contain documentation of its objectives, like a mission and goal statement, that is understandable by developers and designers so that they can use or contribute to the codebase.",MUST,n,
,Codebase documentation SHOULD clearly describe the connections between policy objectives and codebase objectives.,SHOULD,n,
,Documenting the objectives of the codebase for the general public is OPTIONAL.,OPTIONAL,Y,
Document the code,"All of the functionality of the codebase, policy as well as source code, MUST be described in language clearly understandable for those that understand the purpose of the codebase.",MUST,Y,
,The documentation of the codebase MUST contain a description of how to install and run the software.,MUST,Y,
,The documentation of the codebase MUST contain examples demonstrating the key functionality.,MUST,Y,
,"The documentation of the codebase SHOULD contain a high level description that is clearly understandable for a wide audience of stakeholders, like the general public and journalists.",SHOULD,Y,
,"The documentation of the codebase SHOULD contain a section describing how to install and run a standalone version of the source code, including, if necessary, a test dataset.",SHOULD,Y,
,The documentation of the codebase SHOULD contain examples for all functionality.,SHOULD,?,
,"The documentation SHOULD describe the key components or modules of the codebase and their relationships, for example as a high level architectural diagram.",SHOULD,Y,
,There SHOULD be continuous integration tests for the quality of the documentation.,SHOULD,?,How do we test the quality of documentation in CI?s
,Including examples that make users want to immediately start using the codebase in the documentation of the codebase is OPTIONAL.,OPTIONAL,?,
Use plain English,The set of authoritative languages for codebase documentation MUST be documented.,MUST,n,
,English MUST be one of the authoritative languages.,MUST,Y,
,All codebase documentation MUST be up to date in all authoritative languages.,MUST,Y,
,"All source code MUST be in English, except where policy is machine interpreted as code.",MUST,Y,
,"All bundled policy MUST be available, or have a summary, in all authoritative languages.",MUST,n,
,"There SHOULD be no acronyms, abbreviations, puns or legal/language/domain specific terms in the codebase without an explanation preceding it or a link to an explanation.",SHOULD,?,
,"Documentation SHOULD aim for a lower secondary education reading level, as recommended by the Web Content Accessibility Guidelines 2.",SHOULD,Y,
,"Providing additional courtesy translations of any code, documentation or tests is OPTIONAL.",OPTIONAL,Y,
Use open standards,For features of the codebase that facilitate the exchange of data the codebase MUST use an open standard that meets the Open Source Initiative Open Standard Requirements.,MUST,Y,
,Any non-open standards used MUST be recorded clearly as such in the documentation.,MUST,Y,
,Any standard chosen for use within the codebase MUST be listed in the documentation with a link to where it is available.,MUST,Y,
,Any non-open standards chosen for use within the codebase MUST NOT hinder collaboration and reuse.,MUST,Y,
,"If no existing open standard is available, effort SHOULD be put into developing one.",SHOULD,Y,
,Open standards that are machine testable SHOULD be preferred over open standards that are not.,SHOULD,?,
,Non-open standards that are machine testable SHOULD be preferred over non-open standards that are not.,SHOULD,?,
Use continuous integration,All functionality in the source code MUST have automated tests.,MUST,Y,Almost all functionality.
,Contributions MUST pass all automated tests before they are admitted into the codebase.,MUST,Y,
,The codebase MUST have guidelines explaining how to structure contributions.,MUST,?,
,The codebase MUST have active contributors who can review contributions.,MUST,Y,
,Automated test results for contributions SHOULD be public.,SHOULD,Y,
,The codebase guidelines SHOULD state that each contribution should focus on a single issue.,SHOULD,n,
,Source code test and documentation coverage SHOULD be monitored.,SHOULD,Y,"Currently: Source code yes, documentation no."
,Testing policy and documentation for consistency with the source and vice versa is OPTIONAL.,OPTIONAL,n,
,Testing policy and documentation for style and broken links is OPTIONAL.,OPTIONAL,n,
,Testing the software by using examples in the documentation is OPTIONAL.,OPTIONAL,n,
Publish with an open license,"All source code and documentation MUST be licensed such that it may be freely reusable, changeable and redistributable.",MUST,Y,
,Software source code MUST be licensed under an OSI-approved or FSF Free/Libre license.,MUST,Y,
,All source code MUST be published with a license file.,MUST,?,
,Contributors MUST NOT be required to transfer copyright of their contributions to the codebase.,MUST,?,
,All source code files in the codebase SHOULD include a copyright notice and a license header that are machine-readable.,SHOULD,n,
,Having multiple licenses for different types of source code and documentation is OPTIONAL.,OPTIONAL,Y,
Make the codebase findable,"The name of the codebase SHOULD be descriptive and free from acronyms, abbreviations, puns or organizational branding.",SHOULD,n,The codebase name contains ”jobtech” and we are probably not going to rename it.
,The codebase SHOULD have a short description that helps someone understand what the codebase is for or what it does.,SHOULD,Y,
,Maintainers SHOULD submit the codebase to relevant software catalogs.,SHOULD,n,
,"The codebase SHOULD have a website which describes the problem the codebase solves using the preferred jargon of different potential users of the codebase (including technologists, policy experts and managers).",SHOULD,?,At least the README at the root of the repo is a website. But not sure about jargon.
,The codebase SHOULD be findable using a search engine by codebase name.,SHOULD,Y,It can be found using Google.
,The codebase SHOULD be findable using a search engine by describing the problem it solves in natural language.,SHOULD,?,Probably using Google?
,"The codebase SHOULD have a unique and persistent identifier where the entry mentions the major contributors, repository location and website.",SHOULD,?,What is a ”persistent entry”?
,"The codebase SHOULD include a machine-readable metadata description, for example in a publiccode.yml file.",SHOULD,n,
,A dedicated domain name for the codebase is OPTIONAL.,OPTIONAL,n,
,Regular presentations at conferences by the community are OPTIONAL.,OPTIONAL,n,
Use a coherent style,"The codebase MUST use a coding or writing style guide, either the codebase community’s own or an existing one referred to in the codebase.",MUST,n,Easiest to adopt an existing one?
,Contributions SHOULD pass automated tests on style.,SHOULD,?,
,The style guide SHOULD include expectations for inline comments and documentation for non-trivial sections.,SHOULD,n,
,Including expectations for understandable English in the style guide is OPTIONAL.,OPTIONAL,n,
Document codebase maturity,The codebase MUST be versioned.,MUST,Y,
,The codebase MUST prominently document whether or not there are versions of the codebase that are ready to use.,MUST,n,
,Codebase versions that are ready to use MUST only depend on versions of other codebases that are also ready to use.,MUST,Y,
,"The codebase SHOULD contain a log of changes from version to version, for example in the CHANGELOG.",SHOULD,n,Nothing more than commit history at the moment.
,The method for assigning version identifiers SHOULD be documented.,SHOULD,n,
,It is OPTIONAL to use semantic versioning.,OPTIONAL,n,
