{
  "$schema": "https://docs.renovatebot.com/renovate-schema.json",
  "extends": [
    "config:recommended"
  ],
  "baseBranches": ["main"],
  "labels": ["Team Individdata", "Bot"],
  "automerge": false,
  "autoApprove": false,
  "automergeType": "pr",
  "automergeComment": "ci: auto merge"
}
