DateTime,Occurrences
2016-02-29,9
2016-03-31,5
2016-04-30,1
2016-05-31,16
2016-06-30,3
2016-07-31,4
2016-08-31,3
2016-09-30,5
2016-10-31,9
2016-11-30,13
2016-12-31,4
2017-01-31,6
2017-02-28,12
2017-03-31,7
2017-04-30,7
2017-05-31,4
2017-06-30,3
2017-07-31,6
2017-08-31,7
2017-09-30,6
2017-10-31,10
2017-11-30,10
2017-12-31,17
2018-01-31,18
2018-02-28,14
2018-03-31,29
2018-04-30,8
2018-05-31,16
2018-06-30,66
2018-07-31,17
2018-08-31,42
2018-09-30,16
2018-10-31,16
2018-11-30,17
2018-12-31,75
2019-01-31,39
2019-02-28,24
2019-03-31,16
2019-04-30,28
2019-05-31,35
2019-06-30,91
2019-07-31,26
2019-08-31,25
2019-09-30,25
2019-10-31,19
2019-11-30,76
2019-12-31,26
2020-01-31,14
2020-02-29,67
2020-03-31,26
2020-04-30,14
2020-05-31,19
2020-06-30,18
2020-07-31,62
2020-08-31,21
2020-09-30,20
2020-10-31,14
2020-11-30,83
2020-12-31,22
2021-01-31,24
2021-02-28,85
2021-03-31,29
2021-04-30,32
2021-05-31,28
2021-06-30,21
2021-07-31,25
2021-08-31,21
2021-09-30,40
2021-10-31,36
2021-11-30,41
2021-12-31,56
2022-01-31,23
2022-02-28,90
2022-03-31,28
2022-04-30,28
2022-05-31,111
2022-06-30,25
2022-07-31,24
2022-08-31,30
2022-09-30,17
2022-10-31,17
2022-11-30,57
2022-12-31,37
2023-01-31,28
2023-02-28,129
2023-03-31,37
2023-04-30,19
2023-05-31,27
2023-06-30,21
2023-07-31,19
2023-08-31,32
2023-09-30,23
